year,from,to,hospitalizations
1998,"{'latlong': [-35.45993547543438, -8.237977282077168], 'name': 'Metropolitana'}","{'latlong': [-35.45993547543438, -8.237977282077168], 'name': 'Metropolitana'}",13836
1998,"{'latlong': [-35.45993547543438, -8.237977282077168], 'name': 'Metropolitana'}","{'latlong': [-36.44705331304556, -8.597091004271139], 'name': 'Agreste'}",85
1998,"{'latlong': [-35.45993547543438, -8.237977282077168], 'name': 'Metropolitana'}","{'latlong': [-37.865288937823316, -8.306290795258281], 'name': 'Sertão'}",4
1998,"{'latlong': [-35.45993547543438, -8.237977282077168], 'name': 'Metropolitana'}","{'latlong': [-39.95936095628068, -8.364764974735124], 'name': 'Vale do S.Francisco e Araripe'}",6
1998,"{'latlong': [-36.44705331304556, -8.597091004271139], 'name': 'Agreste'}","{'latlong': [-35.45993547543438, -8.237977282077168], 'name': 'Metropolitana'}",784
1998,"{'latlong': [-36.44705331304556, -8.597091004271139], 'name': 'Agreste'}","{'latlong': [-36.44705331304556, -8.597091004271139], 'name': 'Agreste'}",2563
1998,"{'latlong': [-36.44705331304556, -8.597091004271139], 'name': 'Agreste'}","{'latlong': [-37.865288937823316, -8.306290795258281], 'name': 'Sertão'}",122
1998,"{'latlong': [-36.44705331304556, -8.597091004271139], 'name': 'Agreste'}","{'latlong': [-39.95936095628068, -8.364764974735124], 'name': 'Vale do S.Francisco e Araripe'}",5
1998,"{'latlong': [-37.865288937823316, -8.306290795258281], 'name': 'Sertão'}","{'latlong': [-35.45993547543438, -8.237977282077168], 'name': 'Metropolitana'}",221
1998,"{'latlong': [-37.865288937823316, -8.306290795258281], 'name': 'Sertão'}","{'latlong': [-36.44705331304556, -8.597091004271139], 'name': 'Agreste'}",88
1998,"{'latlong': [-37.865288937823316, -8.306290795258281], 'name': 'Sertão'}","{'latlong': [-37.865288937823316, -8.306290795258281], 'name': 'Sertão'}",1681
1998,"{'latlong': [-37.865288937823316, -8.306290795258281], 'name': 'Sertão'}","{'latlong': [-39.95936095628068, -8.364764974735124], 'name': 'Vale do S.Francisco e Araripe'}",17
1998,"{'latlong': [-39.95936095628068, -8.364764974735124], 'name': 'Vale do S.Francisco e Araripe'}","{'latlong': [-35.45993547543438, -8.237977282077168], 'name': 'Metropolitana'}",114
1998,"{'latlong': [-39.95936095628068, -8.364764974735124], 'name': 'Vale do S.Francisco e Araripe'}","{'latlong': [-36.44705331304556, -8.597091004271139], 'name': 'Agreste'}",11
1998,"{'latlong': [-39.95936095628068, -8.364764974735124], 'name': 'Vale do S.Francisco e Araripe'}","{'latlong': [-37.865288937823316, -8.306290795258281], 'name': 'Sertão'}",36
1998,"{'latlong': [-39.95936095628068, -8.364764974735124], 'name': 'Vale do S.Francisco e Araripe'}","{'latlong': [-39.95936095628068, -8.364764974735124], 'name': 'Vale do S.Francisco e Araripe'}",1971
1999,"{'latlong': [-35.45993547543438, -8.237977282077168], 'name': 'Metropolitana'}","{'latlong': [-35.45993547543438, -8.237977282077168], 'name': 'Metropolitana'}",17411
1999,"{'latlong': [-35.45993547543438, -8.237977282077168], 'name': 'Metropolitana'}","{'latlong': [-36.44705331304556, -8.597091004271139], 'name': 'Agreste'}",74
1999,"{'latlong': [-35.45993547543438, -8.237977282077168], 'name': 'Metropolitana'}","{'latlong': [-37.865288937823316, -8.306290795258281], 'name': 'Sertão'}",2
1999,"{'latlong': [-35.45993547543438, -8.237977282077168], 'name': 'Metropolitana'}","{'latlong': [-39.95936095628068, -8.364764974735124], 'name': 'Vale do S.Francisco e Araripe'}",4
1999,"{'latlong': [-36.44705331304556, -8.597091004271139], 'name': 'Agreste'}","{'latlong': [-35.45993547543438, -8.237977282077168], 'name': 'Metropolitana'}",899
1999,"{'latlong': [-36.44705331304556, -8.597091004271139], 'name': 'Agreste'}","{'latlong': [-36.44705331304556, -8.597091004271139], 'name': 'Agreste'}",2776
1999,"{'latlong': [-36.44705331304556, -8.597091004271139], 'name': 'Agreste'}","{'latlong': [-37.865288937823316, -8.306290795258281], 'name': 'Sertão'}",134
1999,"{'latlong': [-36.44705331304556, -8.597091004271139], 'name': 'Agreste'}","{'latlong': [-39.95936095628068, -8.364764974735124], 'name': 'Vale do S.Francisco e Araripe'}",3
1999,"{'latlong': [-37.865288937823316, -8.306290795258281], 'name': 'Sertão'}","{'latlong': [-35.45993547543438, -8.237977282077168], 'name': 'Metropolitana'}",316
1999,"{'latlong': [-37.865288937823316, -8.306290795258281], 'name': 'Sertão'}","{'latlong': [-36.44705331304556, -8.597091004271139], 'name': 'Agreste'}",103
1999,"{'latlong': [-37.865288937823316, -8.306290795258281], 'name': 'Sertão'}","{'latlong': [-37.865288937823316, -8.306290795258281], 'name': 'Sertão'}",1913
1999,"{'latlong': [-37.865288937823316, -8.306290795258281], 'name': 'Sertão'}","{'latlong': [-39.95936095628068, -8.364764974735124], 'name': 'Vale do S.Francisco e Araripe'}",10
1999,"{'latlong': [-39.95936095628068, -8.364764974735124], 'name': 'Vale do S.Francisco e Araripe'}","{'latlong': [-35.45993547543438, -8.237977282077168], 'name': 'Metropolitana'}",120
1999,"{'latlong': [-39.95936095628068, -8.364764974735124], 'name': 'Vale do S.Francisco e Araripe'}","{'latlong': [-36.44705331304556, -8.597091004271139], 'name': 'Agreste'}",26
1999,"{'latlong': [-39.95936095628068, -8.364764974735124], 'name': 'Vale do S.Francisco e Araripe'}","{'latlong': [-37.865288937823316, -8.306290795258281], 'name': 'Sertão'}",52
1999,"{'latlong': [-39.95936095628068, -8.364764974735124], 'name': 'Vale do S.Francisco e Araripe'}","{'latlong': [-39.95936095628068, -8.364764974735124], 'name': 'Vale do S.Francisco e Araripe'}",2018
2000,"{'latlong': [-35.45993547543438, -8.237977282077168], 'name': 'Metropolitana'}","{'latlong': [-35.45993547543438, -8.237977282077168], 'name': 'Metropolitana'}",15251
2000,"{'latlong': [-35.45993547543438, -8.237977282077168], 'name': 'Metropolitana'}","{'latlong': [-36.44705331304556, -8.597091004271139], 'name': 'Agreste'}",97
2000,"{'latlong': [-35.45993547543438, -8.237977282077168], 'name': 'Metropolitana'}","{'latlong': [-37.865288937823316, -8.306290795258281], 'name': 'Sertão'}",1
2000,"{'latlong': [-35.45993547543438, -8.237977282077168], 'name': 'Metropolitana'}","{'latlong': [-39.95936095628068, -8.364764974735124], 'name': 'Vale do S.Francisco e Araripe'}",2
2000,"{'latlong': [-36.44705331304556, -8.597091004271139], 'name': 'Agreste'}","{'latlong': [-35.45993547543438, -8.237977282077168], 'name': 'Metropolitana'}",837
2000,"{'latlong': [-36.44705331304556, -8.597091004271139], 'name': 'Agreste'}","{'latlong': [-36.44705331304556, -8.597091004271139], 'name': 'Agreste'}",3016
2000,"{'latlong': [-36.44705331304556, -8.597091004271139], 'name': 'Agreste'}","{'latlong': [-37.865288937823316, -8.306290795258281], 'name': 'Sertão'}",140
2000,"{'latlong': [-36.44705331304556, -8.597091004271139], 'name': 'Agreste'}","{'latlong': [-39.95936095628068, -8.364764974735124], 'name': 'Vale do S.Francisco e Araripe'}",3
2000,"{'latlong': [-37.865288937823316, -8.306290795258281], 'name': 'Sertão'}","{'latlong': [-35.45993547543438, -8.237977282077168], 'name': 'Metropolitana'}",343
2000,"{'latlong': [-37.865288937823316, -8.306290795258281], 'name': 'Sertão'}","{'latlong': [-36.44705331304556, -8.597091004271139], 'name': 'Agreste'}",143
2000,"{'latlong': [-37.865288937823316, -8.306290795258281], 'name': 'Sertão'}","{'latlong': [-37.865288937823316, -8.306290795258281], 'name': 'Sertão'}",1806
2000,"{'latlong': [-37.865288937823316, -8.306290795258281], 'name': 'Sertão'}","{'latlong': [-39.95936095628068, -8.364764974735124], 'name': 'Vale do S.Francisco e Araripe'}",19
2000,"{'latlong': [-39.95936095628068, -8.364764974735124], 'name': 'Vale do S.Francisco e Araripe'}","{'latlong': [-35.45993547543438, -8.237977282077168], 'name': 'Metropolitana'}",128
2000,"{'latlong': [-39.95936095628068, -8.364764974735124], 'name': 'Vale do S.Francisco e Araripe'}","{'latlong': [-36.44705331304556, -8.597091004271139], 'name': 'Agreste'}",30
2000,"{'latlong': [-39.95936095628068, -8.364764974735124], 'name': 'Vale do S.Francisco e Araripe'}","{'latlong': [-37.865288937823316, -8.306290795258281], 'name': 'Sertão'}",75
2000,"{'latlong': [-39.95936095628068, -8.364764974735124], 'name': 'Vale do S.Francisco e Araripe'}","{'latlong': [-39.95936095628068, -8.364764974735124], 'name': 'Vale do S.Francisco e Araripe'}",1805
2001,"{'latlong': [-35.45993547543438, -8.237977282077168], 'name': 'Metropolitana'}","{'latlong': [-35.45993547543438, -8.237977282077168], 'name': 'Metropolitana'}",16675
2001,"{'latlong': [-35.45993547543438, -8.237977282077168], 'name': 'Metropolitana'}","{'latlong': [-36.44705331304556, -8.597091004271139], 'name': 'Agreste'}",135
2001,"{'latlong': [-35.45993547543438, -8.237977282077168], 'name': 'Metropolitana'}","{'latlong': [-37.865288937823316, -8.306290795258281], 'name': 'Sertão'}",2
2001,"{'latlong': [-35.45993547543438, -8.237977282077168], 'name': 'Metropolitana'}","{'latlong': [-39.95936095628068, -8.364764974735124], 'name': 'Vale do S.Francisco e Araripe'}",5
2001,"{'latlong': [-36.44705331304556, -8.597091004271139], 'name': 'Agreste'}","{'latlong': [-35.45993547543438, -8.237977282077168], 'name': 'Metropolitana'}",950
2001,"{'latlong': [-36.44705331304556, -8.597091004271139], 'name': 'Agreste'}","{'latlong': [-36.44705331304556, -8.597091004271139], 'name': 'Agreste'}",3090
2001,"{'latlong': [-36.44705331304556, -8.597091004271139], 'name': 'Agreste'}","{'latlong': [-37.865288937823316, -8.306290795258281], 'name': 'Sertão'}",91
2001,"{'latlong': [-36.44705331304556, -8.597091004271139], 'name': 'Agreste'}","{'latlong': [-39.95936095628068, -8.364764974735124], 'name': 'Vale do S.Francisco e Araripe'}",2
2001,"{'latlong': [-37.865288937823316, -8.306290795258281], 'name': 'Sertão'}","{'latlong': [-35.45993547543438, -8.237977282077168], 'name': 'Metropolitana'}",367
2001,"{'latlong': [-37.865288937823316, -8.306290795258281], 'name': 'Sertão'}","{'latlong': [-36.44705331304556, -8.597091004271139], 'name': 'Agreste'}",127
2001,"{'latlong': [-37.865288937823316, -8.306290795258281], 'name': 'Sertão'}","{'latlong': [-37.865288937823316, -8.306290795258281], 'name': 'Sertão'}",1615
2001,"{'latlong': [-37.865288937823316, -8.306290795258281], 'name': 'Sertão'}","{'latlong': [-39.95936095628068, -8.364764974735124], 'name': 'Vale do S.Francisco e Araripe'}",10
2001,"{'latlong': [-39.95936095628068, -8.364764974735124], 'name': 'Vale do S.Francisco e Araripe'}","{'latlong': [-35.45993547543438, -8.237977282077168], 'name': 'Metropolitana'}",121
2001,"{'latlong': [-39.95936095628068, -8.364764974735124], 'name': 'Vale do S.Francisco e Araripe'}","{'latlong': [-36.44705331304556, -8.597091004271139], 'name': 'Agreste'}",74
2001,"{'latlong': [-39.95936095628068, -8.364764974735124], 'name': 'Vale do S.Francisco e Araripe'}","{'latlong': [-37.865288937823316, -8.306290795258281], 'name': 'Sertão'}",54
2001,"{'latlong': [-39.95936095628068, -8.364764974735124], 'name': 'Vale do S.Francisco e Araripe'}","{'latlong': [-39.95936095628068, -8.364764974735124], 'name': 'Vale do S.Francisco e Araripe'}",1987
2002,"{'latlong': [-35.45993547543438, -8.237977282077168], 'name': 'Metropolitana'}","{'latlong': [-35.45993547543438, -8.237977282077168], 'name': 'Metropolitana'}",17688
2002,"{'latlong': [-35.45993547543438, -8.237977282077168], 'name': 'Metropolitana'}","{'latlong': [-36.44705331304556, -8.597091004271139], 'name': 'Agreste'}",89
2002,"{'latlong': [-35.45993547543438, -8.237977282077168], 'name': 'Metropolitana'}","{'latlong': [-37.865288937823316, -8.306290795258281], 'name': 'Sertão'}",6
2002,"{'latlong': [-35.45993547543438, -8.237977282077168], 'name': 'Metropolitana'}","{'latlong': [-39.95936095628068, -8.364764974735124], 'name': 'Vale do S.Francisco e Araripe'}",4
2002,"{'latlong': [-36.44705331304556, -8.597091004271139], 'name': 'Agreste'}","{'latlong': [-35.45993547543438, -8.237977282077168], 'name': 'Metropolitana'}",1106
2002,"{'latlong': [-36.44705331304556, -8.597091004271139], 'name': 'Agreste'}","{'latlong': [-36.44705331304556, -8.597091004271139], 'name': 'Agreste'}",2939
2002,"{'latlong': [-36.44705331304556, -8.597091004271139], 'name': 'Agreste'}","{'latlong': [-37.865288937823316, -8.306290795258281], 'name': 'Sertão'}",136
2002,"{'latlong': [-36.44705331304556, -8.597091004271139], 'name': 'Agreste'}","{'latlong': [-39.95936095628068, -8.364764974735124], 'name': 'Vale do S.Francisco e Araripe'}",1
2002,"{'latlong': [-37.865288937823316, -8.306290795258281], 'name': 'Sertão'}","{'latlong': [-35.45993547543438, -8.237977282077168], 'name': 'Metropolitana'}",422
2002,"{'latlong': [-37.865288937823316, -8.306290795258281], 'name': 'Sertão'}","{'latlong': [-36.44705331304556, -8.597091004271139], 'name': 'Agreste'}",118
2002,"{'latlong': [-37.865288937823316, -8.306290795258281], 'name': 'Sertão'}","{'latlong': [-37.865288937823316, -8.306290795258281], 'name': 'Sertão'}",1491
2002,"{'latlong': [-37.865288937823316, -8.306290795258281], 'name': 'Sertão'}","{'latlong': [-39.95936095628068, -8.364764974735124], 'name': 'Vale do S.Francisco e Araripe'}",14
2002,"{'latlong': [-39.95936095628068, -8.364764974735124], 'name': 'Vale do S.Francisco e Araripe'}","{'latlong': [-35.45993547543438, -8.237977282077168], 'name': 'Metropolitana'}",153
2002,"{'latlong': [-39.95936095628068, -8.364764974735124], 'name': 'Vale do S.Francisco e Araripe'}","{'latlong': [-36.44705331304556, -8.597091004271139], 'name': 'Agreste'}",55
2002,"{'latlong': [-39.95936095628068, -8.364764974735124], 'name': 'Vale do S.Francisco e Araripe'}","{'latlong': [-37.865288937823316, -8.306290795258281], 'name': 'Sertão'}",71
2002,"{'latlong': [-39.95936095628068, -8.364764974735124], 'name': 'Vale do S.Francisco e Araripe'}","{'latlong': [-39.95936095628068, -8.364764974735124], 'name': 'Vale do S.Francisco e Araripe'}",1742
2003,"{'latlong': [-35.45993547543438, -8.237977282077168], 'name': 'Metropolitana'}","{'latlong': [-35.45993547543438, -8.237977282077168], 'name': 'Metropolitana'}",18847
2003,"{'latlong': [-35.45993547543438, -8.237977282077168], 'name': 'Metropolitana'}","{'latlong': [-36.44705331304556, -8.597091004271139], 'name': 'Agreste'}",118
2003,"{'latlong': [-35.45993547543438, -8.237977282077168], 'name': 'Metropolitana'}","{'latlong': [-37.865288937823316, -8.306290795258281], 'name': 'Sertão'}",1
2003,"{'latlong': [-36.44705331304556, -8.597091004271139], 'name': 'Agreste'}","{'latlong': [-35.45993547543438, -8.237977282077168], 'name': 'Metropolitana'}",1220
2003,"{'latlong': [-36.44705331304556, -8.597091004271139], 'name': 'Agreste'}","{'latlong': [-36.44705331304556, -8.597091004271139], 'name': 'Agreste'}",3013
2003,"{'latlong': [-36.44705331304556, -8.597091004271139], 'name': 'Agreste'}","{'latlong': [-37.865288937823316, -8.306290795258281], 'name': 'Sertão'}",152
2003,"{'latlong': [-36.44705331304556, -8.597091004271139], 'name': 'Agreste'}","{'latlong': [-39.95936095628068, -8.364764974735124], 'name': 'Vale do S.Francisco e Araripe'}",2
2003,"{'latlong': [-37.865288937823316, -8.306290795258281], 'name': 'Sertão'}","{'latlong': [-35.45993547543438, -8.237977282077168], 'name': 'Metropolitana'}",428
2003,"{'latlong': [-37.865288937823316, -8.306290795258281], 'name': 'Sertão'}","{'latlong': [-36.44705331304556, -8.597091004271139], 'name': 'Agreste'}",83
2003,"{'latlong': [-37.865288937823316, -8.306290795258281], 'name': 'Sertão'}","{'latlong': [-37.865288937823316, -8.306290795258281], 'name': 'Sertão'}",1481
2003,"{'latlong': [-37.865288937823316, -8.306290795258281], 'name': 'Sertão'}","{'latlong': [-39.95936095628068, -8.364764974735124], 'name': 'Vale do S.Francisco e Araripe'}",13
2003,"{'latlong': [-39.95936095628068, -8.364764974735124], 'name': 'Vale do S.Francisco e Araripe'}","{'latlong': [-35.45993547543438, -8.237977282077168], 'name': 'Metropolitana'}",170
2003,"{'latlong': [-39.95936095628068, -8.364764974735124], 'name': 'Vale do S.Francisco e Araripe'}","{'latlong': [-36.44705331304556, -8.597091004271139], 'name': 'Agreste'}",48
2003,"{'latlong': [-39.95936095628068, -8.364764974735124], 'name': 'Vale do S.Francisco e Araripe'}","{'latlong': [-37.865288937823316, -8.306290795258281], 'name': 'Sertão'}",174
2003,"{'latlong': [-39.95936095628068, -8.364764974735124], 'name': 'Vale do S.Francisco e Araripe'}","{'latlong': [-39.95936095628068, -8.364764974735124], 'name': 'Vale do S.Francisco e Araripe'}",1276
2004,"{'latlong': [-35.45993547543438, -8.237977282077168], 'name': 'Metropolitana'}","{'latlong': [-35.45993547543438, -8.237977282077168], 'name': 'Metropolitana'}",17552
2004,"{'latlong': [-35.45993547543438, -8.237977282077168], 'name': 'Metropolitana'}","{'latlong': [-36.44705331304556, -8.597091004271139], 'name': 'Agreste'}",151
2004,"{'latlong': [-35.45993547543438, -8.237977282077168], 'name': 'Metropolitana'}","{'latlong': [-37.865288937823316, -8.306290795258281], 'name': 'Sertão'}",5
2004,"{'latlong': [-35.45993547543438, -8.237977282077168], 'name': 'Metropolitana'}","{'latlong': [-39.95936095628068, -8.364764974735124], 'name': 'Vale do S.Francisco e Araripe'}",1
2004,"{'latlong': [-36.44705331304556, -8.597091004271139], 'name': 'Agreste'}","{'latlong': [-35.45993547543438, -8.237977282077168], 'name': 'Metropolitana'}",1076
2004,"{'latlong': [-36.44705331304556, -8.597091004271139], 'name': 'Agreste'}","{'latlong': [-36.44705331304556, -8.597091004271139], 'name': 'Agreste'}",2849
2004,"{'latlong': [-36.44705331304556, -8.597091004271139], 'name': 'Agreste'}","{'latlong': [-37.865288937823316, -8.306290795258281], 'name': 'Sertão'}",131
2004,"{'latlong': [-37.865288937823316, -8.306290795258281], 'name': 'Sertão'}","{'latlong': [-35.45993547543438, -8.237977282077168], 'name': 'Metropolitana'}",396
2004,"{'latlong': [-37.865288937823316, -8.306290795258281], 'name': 'Sertão'}","{'latlong': [-36.44705331304556, -8.597091004271139], 'name': 'Agreste'}",140
2004,"{'latlong': [-37.865288937823316, -8.306290795258281], 'name': 'Sertão'}","{'latlong': [-37.865288937823316, -8.306290795258281], 'name': 'Sertão'}",1420
2004,"{'latlong': [-37.865288937823316, -8.306290795258281], 'name': 'Sertão'}","{'latlong': [-39.95936095628068, -8.364764974735124], 'name': 'Vale do S.Francisco e Araripe'}",8
2004,"{'latlong': [-39.95936095628068, -8.364764974735124], 'name': 'Vale do S.Francisco e Araripe'}","{'latlong': [-35.45993547543438, -8.237977282077168], 'name': 'Metropolitana'}",123
2004,"{'latlong': [-39.95936095628068, -8.364764974735124], 'name': 'Vale do S.Francisco e Araripe'}","{'latlong': [-36.44705331304556, -8.597091004271139], 'name': 'Agreste'}",27
2004,"{'latlong': [-39.95936095628068, -8.364764974735124], 'name': 'Vale do S.Francisco e Araripe'}","{'latlong': [-37.865288937823316, -8.306290795258281], 'name': 'Sertão'}",88
2004,"{'latlong': [-39.95936095628068, -8.364764974735124], 'name': 'Vale do S.Francisco e Araripe'}","{'latlong': [-39.95936095628068, -8.364764974735124], 'name': 'Vale do S.Francisco e Araripe'}",1303
2005,"{'latlong': [-35.45993547543438, -8.237977282077168], 'name': 'Metropolitana'}","{'latlong': [-35.45993547543438, -8.237977282077168], 'name': 'Metropolitana'}",18782
2005,"{'latlong': [-35.45993547543438, -8.237977282077168], 'name': 'Metropolitana'}","{'latlong': [-36.44705331304556, -8.597091004271139], 'name': 'Agreste'}",161
2005,"{'latlong': [-35.45993547543438, -8.237977282077168], 'name': 'Metropolitana'}","{'latlong': [-37.865288937823316, -8.306290795258281], 'name': 'Sertão'}",3
2005,"{'latlong': [-35.45993547543438, -8.237977282077168], 'name': 'Metropolitana'}","{'latlong': [-39.95936095628068, -8.364764974735124], 'name': 'Vale do S.Francisco e Araripe'}",2
2005,"{'latlong': [-36.44705331304556, -8.597091004271139], 'name': 'Agreste'}","{'latlong': [-35.45993547543438, -8.237977282077168], 'name': 'Metropolitana'}",455
2005,"{'latlong': [-36.44705331304556, -8.597091004271139], 'name': 'Agreste'}","{'latlong': [-36.44705331304556, -8.597091004271139], 'name': 'Agreste'}",3113
2005,"{'latlong': [-36.44705331304556, -8.597091004271139], 'name': 'Agreste'}","{'latlong': [-37.865288937823316, -8.306290795258281], 'name': 'Sertão'}",87
2005,"{'latlong': [-37.865288937823316, -8.306290795258281], 'name': 'Sertão'}","{'latlong': [-35.45993547543438, -8.237977282077168], 'name': 'Metropolitana'}",174
2005,"{'latlong': [-37.865288937823316, -8.306290795258281], 'name': 'Sertão'}","{'latlong': [-36.44705331304556, -8.597091004271139], 'name': 'Agreste'}",197
2005,"{'latlong': [-37.865288937823316, -8.306290795258281], 'name': 'Sertão'}","{'latlong': [-37.865288937823316, -8.306290795258281], 'name': 'Sertão'}",1634
2005,"{'latlong': [-37.865288937823316, -8.306290795258281], 'name': 'Sertão'}","{'latlong': [-39.95936095628068, -8.364764974735124], 'name': 'Vale do S.Francisco e Araripe'}",15
2005,"{'latlong': [-39.95936095628068, -8.364764974735124], 'name': 'Vale do S.Francisco e Araripe'}","{'latlong': [-35.45993547543438, -8.237977282077168], 'name': 'Metropolitana'}",92
2005,"{'latlong': [-39.95936095628068, -8.364764974735124], 'name': 'Vale do S.Francisco e Araripe'}","{'latlong': [-36.44705331304556, -8.597091004271139], 'name': 'Agreste'}",23
2005,"{'latlong': [-39.95936095628068, -8.364764974735124], 'name': 'Vale do S.Francisco e Araripe'}","{'latlong': [-37.865288937823316, -8.306290795258281], 'name': 'Sertão'}",102
2005,"{'latlong': [-39.95936095628068, -8.364764974735124], 'name': 'Vale do S.Francisco e Araripe'}","{'latlong': [-39.95936095628068, -8.364764974735124], 'name': 'Vale do S.Francisco e Araripe'}",1554
2006,"{'latlong': [-35.45993547543438, -8.237977282077168], 'name': 'Metropolitana'}","{'latlong': [-35.45993547543438, -8.237977282077168], 'name': 'Metropolitana'}",21316
2006,"{'latlong': [-35.45993547543438, -8.237977282077168], 'name': 'Metropolitana'}","{'latlong': [-36.44705331304556, -8.597091004271139], 'name': 'Agreste'}",241
2006,"{'latlong': [-35.45993547543438, -8.237977282077168], 'name': 'Metropolitana'}","{'latlong': [-37.865288937823316, -8.306290795258281], 'name': 'Sertão'}",1
2006,"{'latlong': [-35.45993547543438, -8.237977282077168], 'name': 'Metropolitana'}","{'latlong': [-39.95936095628068, -8.364764974735124], 'name': 'Vale do S.Francisco e Araripe'}",3
2006,"{'latlong': [-36.44705331304556, -8.597091004271139], 'name': 'Agreste'}","{'latlong': [-35.45993547543438, -8.237977282077168], 'name': 'Metropolitana'}",603
2006,"{'latlong': [-36.44705331304556, -8.597091004271139], 'name': 'Agreste'}","{'latlong': [-36.44705331304556, -8.597091004271139], 'name': 'Agreste'}",3720
2006,"{'latlong': [-36.44705331304556, -8.597091004271139], 'name': 'Agreste'}","{'latlong': [-37.865288937823316, -8.306290795258281], 'name': 'Sertão'}",97
2006,"{'latlong': [-36.44705331304556, -8.597091004271139], 'name': 'Agreste'}","{'latlong': [-39.95936095628068, -8.364764974735124], 'name': 'Vale do S.Francisco e Araripe'}",1
2006,"{'latlong': [-37.865288937823316, -8.306290795258281], 'name': 'Sertão'}","{'latlong': [-35.45993547543438, -8.237977282077168], 'name': 'Metropolitana'}",235
2006,"{'latlong': [-37.865288937823316, -8.306290795258281], 'name': 'Sertão'}","{'latlong': [-36.44705331304556, -8.597091004271139], 'name': 'Agreste'}",382
2006,"{'latlong': [-37.865288937823316, -8.306290795258281], 'name': 'Sertão'}","{'latlong': [-37.865288937823316, -8.306290795258281], 'name': 'Sertão'}",1996
2006,"{'latlong': [-37.865288937823316, -8.306290795258281], 'name': 'Sertão'}","{'latlong': [-39.95936095628068, -8.364764974735124], 'name': 'Vale do S.Francisco e Araripe'}",19
2006,"{'latlong': [-39.95936095628068, -8.364764974735124], 'name': 'Vale do S.Francisco e Araripe'}","{'latlong': [-35.45993547543438, -8.237977282077168], 'name': 'Metropolitana'}",100
2006,"{'latlong': [-39.95936095628068, -8.364764974735124], 'name': 'Vale do S.Francisco e Araripe'}","{'latlong': [-36.44705331304556, -8.597091004271139], 'name': 'Agreste'}",37
2006,"{'latlong': [-39.95936095628068, -8.364764974735124], 'name': 'Vale do S.Francisco e Araripe'}","{'latlong': [-37.865288937823316, -8.306290795258281], 'name': 'Sertão'}",73
2006,"{'latlong': [-39.95936095628068, -8.364764974735124], 'name': 'Vale do S.Francisco e Araripe'}","{'latlong': [-39.95936095628068, -8.364764974735124], 'name': 'Vale do S.Francisco e Araripe'}",1604
2007,"{'latlong': [-35.45993547543438, -8.237977282077168], 'name': 'Metropolitana'}","{'latlong': [-35.45993547543438, -8.237977282077168], 'name': 'Metropolitana'}",22614
2007,"{'latlong': [-35.45993547543438, -8.237977282077168], 'name': 'Metropolitana'}","{'latlong': [-36.44705331304556, -8.597091004271139], 'name': 'Agreste'}",332
2007,"{'latlong': [-35.45993547543438, -8.237977282077168], 'name': 'Metropolitana'}","{'latlong': [-37.865288937823316, -8.306290795258281], 'name': 'Sertão'}",1
2007,"{'latlong': [-35.45993547543438, -8.237977282077168], 'name': 'Metropolitana'}","{'latlong': [-39.95936095628068, -8.364764974735124], 'name': 'Vale do S.Francisco e Araripe'}",1
2007,"{'latlong': [-36.44705331304556, -8.597091004271139], 'name': 'Agreste'}","{'latlong': [-35.45993547543438, -8.237977282077168], 'name': 'Metropolitana'}",1163
2007,"{'latlong': [-36.44705331304556, -8.597091004271139], 'name': 'Agreste'}","{'latlong': [-36.44705331304556, -8.597091004271139], 'name': 'Agreste'}",4261
2007,"{'latlong': [-36.44705331304556, -8.597091004271139], 'name': 'Agreste'}","{'latlong': [-37.865288937823316, -8.306290795258281], 'name': 'Sertão'}",56
2007,"{'latlong': [-37.865288937823316, -8.306290795258281], 'name': 'Sertão'}","{'latlong': [-35.45993547543438, -8.237977282077168], 'name': 'Metropolitana'}",410
2007,"{'latlong': [-37.865288937823316, -8.306290795258281], 'name': 'Sertão'}","{'latlong': [-36.44705331304556, -8.597091004271139], 'name': 'Agreste'}",380
2007,"{'latlong': [-37.865288937823316, -8.306290795258281], 'name': 'Sertão'}","{'latlong': [-37.865288937823316, -8.306290795258281], 'name': 'Sertão'}",1719
2007,"{'latlong': [-37.865288937823316, -8.306290795258281], 'name': 'Sertão'}","{'latlong': [-39.95936095628068, -8.364764974735124], 'name': 'Vale do S.Francisco e Araripe'}",36
2007,"{'latlong': [-39.95936095628068, -8.364764974735124], 'name': 'Vale do S.Francisco e Araripe'}","{'latlong': [-35.45993547543438, -8.237977282077168], 'name': 'Metropolitana'}",135
2007,"{'latlong': [-39.95936095628068, -8.364764974735124], 'name': 'Vale do S.Francisco e Araripe'}","{'latlong': [-36.44705331304556, -8.597091004271139], 'name': 'Agreste'}",78
2007,"{'latlong': [-39.95936095628068, -8.364764974735124], 'name': 'Vale do S.Francisco e Araripe'}","{'latlong': [-37.865288937823316, -8.306290795258281], 'name': 'Sertão'}",56
2007,"{'latlong': [-39.95936095628068, -8.364764974735124], 'name': 'Vale do S.Francisco e Araripe'}","{'latlong': [-39.95936095628068, -8.364764974735124], 'name': 'Vale do S.Francisco e Araripe'}",1458
2008,"{'latlong': [-35.45993547543438, -8.237977282077168], 'name': 'Metropolitana'}","{'latlong': [-35.45993547543438, -8.237977282077168], 'name': 'Metropolitana'}",20136
2008,"{'latlong': [-35.45993547543438, -8.237977282077168], 'name': 'Metropolitana'}","{'latlong': [-36.44705331304556, -8.597091004271139], 'name': 'Agreste'}",358
2008,"{'latlong': [-35.45993547543438, -8.237977282077168], 'name': 'Metropolitana'}","{'latlong': [-37.865288937823316, -8.306290795258281], 'name': 'Sertão'}",2
2008,"{'latlong': [-35.45993547543438, -8.237977282077168], 'name': 'Metropolitana'}","{'latlong': [-39.95936095628068, -8.364764974735124], 'name': 'Vale do S.Francisco e Araripe'}",5
2008,"{'latlong': [-36.44705331304556, -8.597091004271139], 'name': 'Agreste'}","{'latlong': [-35.45993547543438, -8.237977282077168], 'name': 'Metropolitana'}",1527
2008,"{'latlong': [-36.44705331304556, -8.597091004271139], 'name': 'Agreste'}","{'latlong': [-36.44705331304556, -8.597091004271139], 'name': 'Agreste'}",4117
2008,"{'latlong': [-36.44705331304556, -8.597091004271139], 'name': 'Agreste'}","{'latlong': [-37.865288937823316, -8.306290795258281], 'name': 'Sertão'}",36
2008,"{'latlong': [-37.865288937823316, -8.306290795258281], 'name': 'Sertão'}","{'latlong': [-35.45993547543438, -8.237977282077168], 'name': 'Metropolitana'}",448
2008,"{'latlong': [-37.865288937823316, -8.306290795258281], 'name': 'Sertão'}","{'latlong': [-36.44705331304556, -8.597091004271139], 'name': 'Agreste'}",413
2008,"{'latlong': [-37.865288937823316, -8.306290795258281], 'name': 'Sertão'}","{'latlong': [-37.865288937823316, -8.306290795258281], 'name': 'Sertão'}",1759
2008,"{'latlong': [-37.865288937823316, -8.306290795258281], 'name': 'Sertão'}","{'latlong': [-39.95936095628068, -8.364764974735124], 'name': 'Vale do S.Francisco e Araripe'}",38
2008,"{'latlong': [-39.95936095628068, -8.364764974735124], 'name': 'Vale do S.Francisco e Araripe'}","{'latlong': [-35.45993547543438, -8.237977282077168], 'name': 'Metropolitana'}",194
2008,"{'latlong': [-39.95936095628068, -8.364764974735124], 'name': 'Vale do S.Francisco e Araripe'}","{'latlong': [-36.44705331304556, -8.597091004271139], 'name': 'Agreste'}",64
2008,"{'latlong': [-39.95936095628068, -8.364764974735124], 'name': 'Vale do S.Francisco e Araripe'}","{'latlong': [-37.865288937823316, -8.306290795258281], 'name': 'Sertão'}",44
2008,"{'latlong': [-39.95936095628068, -8.364764974735124], 'name': 'Vale do S.Francisco e Araripe'}","{'latlong': [-39.95936095628068, -8.364764974735124], 'name': 'Vale do S.Francisco e Araripe'}",1385
2009,"{'latlong': [-35.45993547543438, -8.237977282077168], 'name': 'Metropolitana'}","{'latlong': [-35.45993547543438, -8.237977282077168], 'name': 'Metropolitana'}",19625
2009,"{'latlong': [-35.45993547543438, -8.237977282077168], 'name': 'Metropolitana'}","{'latlong': [-36.44705331304556, -8.597091004271139], 'name': 'Agreste'}",649
2009,"{'latlong': [-35.45993547543438, -8.237977282077168], 'name': 'Metropolitana'}","{'latlong': [-37.865288937823316, -8.306290795258281], 'name': 'Sertão'}",4
2009,"{'latlong': [-35.45993547543438, -8.237977282077168], 'name': 'Metropolitana'}","{'latlong': [-39.95936095628068, -8.364764974735124], 'name': 'Vale do S.Francisco e Araripe'}",1
2009,"{'latlong': [-36.44705331304556, -8.597091004271139], 'name': 'Agreste'}","{'latlong': [-35.45993547543438, -8.237977282077168], 'name': 'Metropolitana'}",1469
2009,"{'latlong': [-36.44705331304556, -8.597091004271139], 'name': 'Agreste'}","{'latlong': [-36.44705331304556, -8.597091004271139], 'name': 'Agreste'}",4560
2009,"{'latlong': [-36.44705331304556, -8.597091004271139], 'name': 'Agreste'}","{'latlong': [-37.865288937823316, -8.306290795258281], 'name': 'Sertão'}",20
2009,"{'latlong': [-36.44705331304556, -8.597091004271139], 'name': 'Agreste'}","{'latlong': [-39.95936095628068, -8.364764974735124], 'name': 'Vale do S.Francisco e Araripe'}",9
2009,"{'latlong': [-37.865288937823316, -8.306290795258281], 'name': 'Sertão'}","{'latlong': [-35.45993547543438, -8.237977282077168], 'name': 'Metropolitana'}",549
2009,"{'latlong': [-37.865288937823316, -8.306290795258281], 'name': 'Sertão'}","{'latlong': [-36.44705331304556, -8.597091004271139], 'name': 'Agreste'}",501
2009,"{'latlong': [-37.865288937823316, -8.306290795258281], 'name': 'Sertão'}","{'latlong': [-37.865288937823316, -8.306290795258281], 'name': 'Sertão'}",1539
2009,"{'latlong': [-37.865288937823316, -8.306290795258281], 'name': 'Sertão'}","{'latlong': [-39.95936095628068, -8.364764974735124], 'name': 'Vale do S.Francisco e Araripe'}",37
2009,"{'latlong': [-39.95936095628068, -8.364764974735124], 'name': 'Vale do S.Francisco e Araripe'}","{'latlong': [-35.45993547543438, -8.237977282077168], 'name': 'Metropolitana'}",209
2009,"{'latlong': [-39.95936095628068, -8.364764974735124], 'name': 'Vale do S.Francisco e Araripe'}","{'latlong': [-36.44705331304556, -8.597091004271139], 'name': 'Agreste'}",57
2009,"{'latlong': [-39.95936095628068, -8.364764974735124], 'name': 'Vale do S.Francisco e Araripe'}","{'latlong': [-37.865288937823316, -8.306290795258281], 'name': 'Sertão'}",43
2009,"{'latlong': [-39.95936095628068, -8.364764974735124], 'name': 'Vale do S.Francisco e Araripe'}","{'latlong': [-39.95936095628068, -8.364764974735124], 'name': 'Vale do S.Francisco e Araripe'}",3048
2010,"{'latlong': [-35.45993547543438, -8.237977282077168], 'name': 'Metropolitana'}","{'latlong': [-35.45993547543438, -8.237977282077168], 'name': 'Metropolitana'}",23629
2010,"{'latlong': [-35.45993547543438, -8.237977282077168], 'name': 'Metropolitana'}","{'latlong': [-36.44705331304556, -8.597091004271139], 'name': 'Agreste'}",568
2010,"{'latlong': [-35.45993547543438, -8.237977282077168], 'name': 'Metropolitana'}","{'latlong': [-37.865288937823316, -8.306290795258281], 'name': 'Sertão'}",7
2010,"{'latlong': [-35.45993547543438, -8.237977282077168], 'name': 'Metropolitana'}","{'latlong': [-39.95936095628068, -8.364764974735124], 'name': 'Vale do S.Francisco e Araripe'}",3
2010,"{'latlong': [-36.44705331304556, -8.597091004271139], 'name': 'Agreste'}","{'latlong': [-35.45993547543438, -8.237977282077168], 'name': 'Metropolitana'}",1829
2010,"{'latlong': [-36.44705331304556, -8.597091004271139], 'name': 'Agreste'}","{'latlong': [-36.44705331304556, -8.597091004271139], 'name': 'Agreste'}",4462
2010,"{'latlong': [-36.44705331304556, -8.597091004271139], 'name': 'Agreste'}","{'latlong': [-37.865288937823316, -8.306290795258281], 'name': 'Sertão'}",32
2010,"{'latlong': [-37.865288937823316, -8.306290795258281], 'name': 'Sertão'}","{'latlong': [-35.45993547543438, -8.237977282077168], 'name': 'Metropolitana'}",750
2010,"{'latlong': [-37.865288937823316, -8.306290795258281], 'name': 'Sertão'}","{'latlong': [-36.44705331304556, -8.597091004271139], 'name': 'Agreste'}",393
2010,"{'latlong': [-37.865288937823316, -8.306290795258281], 'name': 'Sertão'}","{'latlong': [-37.865288937823316, -8.306290795258281], 'name': 'Sertão'}",2175
2010,"{'latlong': [-37.865288937823316, -8.306290795258281], 'name': 'Sertão'}","{'latlong': [-39.95936095628068, -8.364764974735124], 'name': 'Vale do S.Francisco e Araripe'}",41
2010,"{'latlong': [-39.95936095628068, -8.364764974735124], 'name': 'Vale do S.Francisco e Araripe'}","{'latlong': [-35.45993547543438, -8.237977282077168], 'name': 'Metropolitana'}",320
2010,"{'latlong': [-39.95936095628068, -8.364764974735124], 'name': 'Vale do S.Francisco e Araripe'}","{'latlong': [-36.44705331304556, -8.597091004271139], 'name': 'Agreste'}",57
2010,"{'latlong': [-39.95936095628068, -8.364764974735124], 'name': 'Vale do S.Francisco e Araripe'}","{'latlong': [-37.865288937823316, -8.306290795258281], 'name': 'Sertão'}",67
2010,"{'latlong': [-39.95936095628068, -8.364764974735124], 'name': 'Vale do S.Francisco e Araripe'}","{'latlong': [-39.95936095628068, -8.364764974735124], 'name': 'Vale do S.Francisco e Araripe'}",3115
2011,"{'latlong': [-35.45993547543438, -8.237977282077168], 'name': 'Metropolitana'}","{'latlong': [-35.45993547543438, -8.237977282077168], 'name': 'Metropolitana'}",28124
2011,"{'latlong': [-35.45993547543438, -8.237977282077168], 'name': 'Metropolitana'}","{'latlong': [-36.44705331304556, -8.597091004271139], 'name': 'Agreste'}",478
2011,"{'latlong': [-35.45993547543438, -8.237977282077168], 'name': 'Metropolitana'}","{'latlong': [-37.865288937823316, -8.306290795258281], 'name': 'Sertão'}",2
2011,"{'latlong': [-35.45993547543438, -8.237977282077168], 'name': 'Metropolitana'}","{'latlong': [-39.95936095628068, -8.364764974735124], 'name': 'Vale do S.Francisco e Araripe'}",1
2011,"{'latlong': [-36.44705331304556, -8.597091004271139], 'name': 'Agreste'}","{'latlong': [-35.45993547543438, -8.237977282077168], 'name': 'Metropolitana'}",2532
2011,"{'latlong': [-36.44705331304556, -8.597091004271139], 'name': 'Agreste'}","{'latlong': [-36.44705331304556, -8.597091004271139], 'name': 'Agreste'}",4911
2011,"{'latlong': [-36.44705331304556, -8.597091004271139], 'name': 'Agreste'}","{'latlong': [-37.865288937823316, -8.306290795258281], 'name': 'Sertão'}",52
2011,"{'latlong': [-36.44705331304556, -8.597091004271139], 'name': 'Agreste'}","{'latlong': [-39.95936095628068, -8.364764974735124], 'name': 'Vale do S.Francisco e Araripe'}",14
2011,"{'latlong': [-37.865288937823316, -8.306290795258281], 'name': 'Sertão'}","{'latlong': [-35.45993547543438, -8.237977282077168], 'name': 'Metropolitana'}",886
2011,"{'latlong': [-37.865288937823316, -8.306290795258281], 'name': 'Sertão'}","{'latlong': [-36.44705331304556, -8.597091004271139], 'name': 'Agreste'}",442
2011,"{'latlong': [-37.865288937823316, -8.306290795258281], 'name': 'Sertão'}","{'latlong': [-37.865288937823316, -8.306290795258281], 'name': 'Sertão'}",1840
2011,"{'latlong': [-37.865288937823316, -8.306290795258281], 'name': 'Sertão'}","{'latlong': [-39.95936095628068, -8.364764974735124], 'name': 'Vale do S.Francisco e Araripe'}",45
2011,"{'latlong': [-39.95936095628068, -8.364764974735124], 'name': 'Vale do S.Francisco e Araripe'}","{'latlong': [-35.45993547543438, -8.237977282077168], 'name': 'Metropolitana'}",292
2011,"{'latlong': [-39.95936095628068, -8.364764974735124], 'name': 'Vale do S.Francisco e Araripe'}","{'latlong': [-36.44705331304556, -8.597091004271139], 'name': 'Agreste'}",60
2011,"{'latlong': [-39.95936095628068, -8.364764974735124], 'name': 'Vale do S.Francisco e Araripe'}","{'latlong': [-37.865288937823316, -8.306290795258281], 'name': 'Sertão'}",38
2011,"{'latlong': [-39.95936095628068, -8.364764974735124], 'name': 'Vale do S.Francisco e Araripe'}","{'latlong': [-39.95936095628068, -8.364764974735124], 'name': 'Vale do S.Francisco e Araripe'}",3800
2012,"{'latlong': [-35.45993547543438, -8.237977282077168], 'name': 'Metropolitana'}","{'latlong': [-35.45993547543438, -8.237977282077168], 'name': 'Metropolitana'}",29056
2012,"{'latlong': [-35.45993547543438, -8.237977282077168], 'name': 'Metropolitana'}","{'latlong': [-36.44705331304556, -8.597091004271139], 'name': 'Agreste'}",657
2012,"{'latlong': [-35.45993547543438, -8.237977282077168], 'name': 'Metropolitana'}","{'latlong': [-37.865288937823316, -8.306290795258281], 'name': 'Sertão'}",1
2012,"{'latlong': [-35.45993547543438, -8.237977282077168], 'name': 'Metropolitana'}","{'latlong': [-39.95936095628068, -8.364764974735124], 'name': 'Vale do S.Francisco e Araripe'}",6
2012,"{'latlong': [-36.44705331304556, -8.597091004271139], 'name': 'Agreste'}","{'latlong': [-35.45993547543438, -8.237977282077168], 'name': 'Metropolitana'}",3011
2012,"{'latlong': [-36.44705331304556, -8.597091004271139], 'name': 'Agreste'}","{'latlong': [-36.44705331304556, -8.597091004271139], 'name': 'Agreste'}",5133
2012,"{'latlong': [-36.44705331304556, -8.597091004271139], 'name': 'Agreste'}","{'latlong': [-37.865288937823316, -8.306290795258281], 'name': 'Sertão'}",21
2012,"{'latlong': [-36.44705331304556, -8.597091004271139], 'name': 'Agreste'}","{'latlong': [-39.95936095628068, -8.364764974735124], 'name': 'Vale do S.Francisco e Araripe'}",4
2012,"{'latlong': [-37.865288937823316, -8.306290795258281], 'name': 'Sertão'}","{'latlong': [-35.45993547543438, -8.237977282077168], 'name': 'Metropolitana'}",1021
2012,"{'latlong': [-37.865288937823316, -8.306290795258281], 'name': 'Sertão'}","{'latlong': [-36.44705331304556, -8.597091004271139], 'name': 'Agreste'}",609
2012,"{'latlong': [-37.865288937823316, -8.306290795258281], 'name': 'Sertão'}","{'latlong': [-37.865288937823316, -8.306290795258281], 'name': 'Sertão'}",1364
2012,"{'latlong': [-37.865288937823316, -8.306290795258281], 'name': 'Sertão'}","{'latlong': [-39.95936095628068, -8.364764974735124], 'name': 'Vale do S.Francisco e Araripe'}",72
2012,"{'latlong': [-39.95936095628068, -8.364764974735124], 'name': 'Vale do S.Francisco e Araripe'}","{'latlong': [-35.45993547543438, -8.237977282077168], 'name': 'Metropolitana'}",187
2012,"{'latlong': [-39.95936095628068, -8.364764974735124], 'name': 'Vale do S.Francisco e Araripe'}","{'latlong': [-36.44705331304556, -8.597091004271139], 'name': 'Agreste'}",17
2012,"{'latlong': [-39.95936095628068, -8.364764974735124], 'name': 'Vale do S.Francisco e Araripe'}","{'latlong': [-37.865288937823316, -8.306290795258281], 'name': 'Sertão'}",9
2012,"{'latlong': [-39.95936095628068, -8.364764974735124], 'name': 'Vale do S.Francisco e Araripe'}","{'latlong': [-39.95936095628068, -8.364764974735124], 'name': 'Vale do S.Francisco e Araripe'}",4065
2013,"{'latlong': [-35.45993547543438, -8.237977282077168], 'name': 'Metropolitana'}","{'latlong': [-35.45993547543438, -8.237977282077168], 'name': 'Metropolitana'}",32573
2013,"{'latlong': [-35.45993547543438, -8.237977282077168], 'name': 'Metropolitana'}","{'latlong': [-36.44705331304556, -8.597091004271139], 'name': 'Agreste'}",450
2013,"{'latlong': [-35.45993547543438, -8.237977282077168], 'name': 'Metropolitana'}","{'latlong': [-37.865288937823316, -8.306290795258281], 'name': 'Sertão'}",2
2013,"{'latlong': [-36.44705331304556, -8.597091004271139], 'name': 'Agreste'}","{'latlong': [-35.45993547543438, -8.237977282077168], 'name': 'Metropolitana'}",3517
2013,"{'latlong': [-36.44705331304556, -8.597091004271139], 'name': 'Agreste'}","{'latlong': [-36.44705331304556, -8.597091004271139], 'name': 'Agreste'}",3880
2013,"{'latlong': [-36.44705331304556, -8.597091004271139], 'name': 'Agreste'}","{'latlong': [-37.865288937823316, -8.306290795258281], 'name': 'Sertão'}",18
2013,"{'latlong': [-36.44705331304556, -8.597091004271139], 'name': 'Agreste'}","{'latlong': [-39.95936095628068, -8.364764974735124], 'name': 'Vale do S.Francisco e Araripe'}",2
2013,"{'latlong': [-37.865288937823316, -8.306290795258281], 'name': 'Sertão'}","{'latlong': [-35.45993547543438, -8.237977282077168], 'name': 'Metropolitana'}",1215
2013,"{'latlong': [-37.865288937823316, -8.306290795258281], 'name': 'Sertão'}","{'latlong': [-36.44705331304556, -8.597091004271139], 'name': 'Agreste'}",456
2013,"{'latlong': [-37.865288937823316, -8.306290795258281], 'name': 'Sertão'}","{'latlong': [-37.865288937823316, -8.306290795258281], 'name': 'Sertão'}",1637
2013,"{'latlong': [-37.865288937823316, -8.306290795258281], 'name': 'Sertão'}","{'latlong': [-39.95936095628068, -8.364764974735124], 'name': 'Vale do S.Francisco e Araripe'}",61
2013,"{'latlong': [-39.95936095628068, -8.364764974735124], 'name': 'Vale do S.Francisco e Araripe'}","{'latlong': [-35.45993547543438, -8.237977282077168], 'name': 'Metropolitana'}",175
2013,"{'latlong': [-39.95936095628068, -8.364764974735124], 'name': 'Vale do S.Francisco e Araripe'}","{'latlong': [-36.44705331304556, -8.597091004271139], 'name': 'Agreste'}",9
2013,"{'latlong': [-39.95936095628068, -8.364764974735124], 'name': 'Vale do S.Francisco e Araripe'}","{'latlong': [-37.865288937823316, -8.306290795258281], 'name': 'Sertão'}",6
2013,"{'latlong': [-39.95936095628068, -8.364764974735124], 'name': 'Vale do S.Francisco e Araripe'}","{'latlong': [-39.95936095628068, -8.364764974735124], 'name': 'Vale do S.Francisco e Araripe'}",4108
2014,"{'latlong': [-35.45993547543438, -8.237977282077168], 'name': 'Metropolitana'}","{'latlong': [-35.45993547543438, -8.237977282077168], 'name': 'Metropolitana'}",37590
2014,"{'latlong': [-35.45993547543438, -8.237977282077168], 'name': 'Metropolitana'}","{'latlong': [-36.44705331304556, -8.597091004271139], 'name': 'Agreste'}",328
2014,"{'latlong': [-35.45993547543438, -8.237977282077168], 'name': 'Metropolitana'}","{'latlong': [-37.865288937823316, -8.306290795258281], 'name': 'Sertão'}",3
2014,"{'latlong': [-35.45993547543438, -8.237977282077168], 'name': 'Metropolitana'}","{'latlong': [-39.95936095628068, -8.364764974735124], 'name': 'Vale do S.Francisco e Araripe'}",7
2014,"{'latlong': [-36.44705331304556, -8.597091004271139], 'name': 'Agreste'}","{'latlong': [-35.45993547543438, -8.237977282077168], 'name': 'Metropolitana'}",4840
2014,"{'latlong': [-36.44705331304556, -8.597091004271139], 'name': 'Agreste'}","{'latlong': [-36.44705331304556, -8.597091004271139], 'name': 'Agreste'}",4048
2014,"{'latlong': [-36.44705331304556, -8.597091004271139], 'name': 'Agreste'}","{'latlong': [-37.865288937823316, -8.306290795258281], 'name': 'Sertão'}",28
2014,"{'latlong': [-36.44705331304556, -8.597091004271139], 'name': 'Agreste'}","{'latlong': [-39.95936095628068, -8.364764974735124], 'name': 'Vale do S.Francisco e Araripe'}",3
2014,"{'latlong': [-37.865288937823316, -8.306290795258281], 'name': 'Sertão'}","{'latlong': [-35.45993547543438, -8.237977282077168], 'name': 'Metropolitana'}",1425
2014,"{'latlong': [-37.865288937823316, -8.306290795258281], 'name': 'Sertão'}","{'latlong': [-36.44705331304556, -8.597091004271139], 'name': 'Agreste'}",349
2014,"{'latlong': [-37.865288937823316, -8.306290795258281], 'name': 'Sertão'}","{'latlong': [-37.865288937823316, -8.306290795258281], 'name': 'Sertão'}",2725
2014,"{'latlong': [-37.865288937823316, -8.306290795258281], 'name': 'Sertão'}","{'latlong': [-39.95936095628068, -8.364764974735124], 'name': 'Vale do S.Francisco e Araripe'}",40
2014,"{'latlong': [-39.95936095628068, -8.364764974735124], 'name': 'Vale do S.Francisco e Araripe'}","{'latlong': [-35.45993547543438, -8.237977282077168], 'name': 'Metropolitana'}",154
2014,"{'latlong': [-39.95936095628068, -8.364764974735124], 'name': 'Vale do S.Francisco e Araripe'}","{'latlong': [-36.44705331304556, -8.597091004271139], 'name': 'Agreste'}",8
2014,"{'latlong': [-39.95936095628068, -8.364764974735124], 'name': 'Vale do S.Francisco e Araripe'}","{'latlong': [-37.865288937823316, -8.306290795258281], 'name': 'Sertão'}",25
2014,"{'latlong': [-39.95936095628068, -8.364764974735124], 'name': 'Vale do S.Francisco e Araripe'}","{'latlong': [-39.95936095628068, -8.364764974735124], 'name': 'Vale do S.Francisco e Araripe'}",4111
2015,"{'latlong': [-35.45993547543438, -8.237977282077168], 'name': 'Metropolitana'}","{'latlong': [-35.45993547543438, -8.237977282077168], 'name': 'Metropolitana'}",34658
2015,"{'latlong': [-35.45993547543438, -8.237977282077168], 'name': 'Metropolitana'}","{'latlong': [-36.44705331304556, -8.597091004271139], 'name': 'Agreste'}",604
2015,"{'latlong': [-35.45993547543438, -8.237977282077168], 'name': 'Metropolitana'}","{'latlong': [-37.865288937823316, -8.306290795258281], 'name': 'Sertão'}",12
2015,"{'latlong': [-35.45993547543438, -8.237977282077168], 'name': 'Metropolitana'}","{'latlong': [-39.95936095628068, -8.364764974735124], 'name': 'Vale do S.Francisco e Araripe'}",5
2015,"{'latlong': [-36.44705331304556, -8.597091004271139], 'name': 'Agreste'}","{'latlong': [-35.45993547543438, -8.237977282077168], 'name': 'Metropolitana'}",3355
2015,"{'latlong': [-36.44705331304556, -8.597091004271139], 'name': 'Agreste'}","{'latlong': [-36.44705331304556, -8.597091004271139], 'name': 'Agreste'}",5449
2015,"{'latlong': [-36.44705331304556, -8.597091004271139], 'name': 'Agreste'}","{'latlong': [-37.865288937823316, -8.306290795258281], 'name': 'Sertão'}",59
2015,"{'latlong': [-36.44705331304556, -8.597091004271139], 'name': 'Agreste'}","{'latlong': [-39.95936095628068, -8.364764974735124], 'name': 'Vale do S.Francisco e Araripe'}",1
2015,"{'latlong': [-37.865288937823316, -8.306290795258281], 'name': 'Sertão'}","{'latlong': [-35.45993547543438, -8.237977282077168], 'name': 'Metropolitana'}",1064
2015,"{'latlong': [-37.865288937823316, -8.306290795258281], 'name': 'Sertão'}","{'latlong': [-36.44705331304556, -8.597091004271139], 'name': 'Agreste'}",626
2015,"{'latlong': [-37.865288937823316, -8.306290795258281], 'name': 'Sertão'}","{'latlong': [-37.865288937823316, -8.306290795258281], 'name': 'Sertão'}",2579
2015,"{'latlong': [-37.865288937823316, -8.306290795258281], 'name': 'Sertão'}","{'latlong': [-39.95936095628068, -8.364764974735124], 'name': 'Vale do S.Francisco e Araripe'}",43
2015,"{'latlong': [-39.95936095628068, -8.364764974735124], 'name': 'Vale do S.Francisco e Araripe'}","{'latlong': [-35.45993547543438, -8.237977282077168], 'name': 'Metropolitana'}",175
2015,"{'latlong': [-39.95936095628068, -8.364764974735124], 'name': 'Vale do S.Francisco e Araripe'}","{'latlong': [-36.44705331304556, -8.597091004271139], 'name': 'Agreste'}",21
2015,"{'latlong': [-39.95936095628068, -8.364764974735124], 'name': 'Vale do S.Francisco e Araripe'}","{'latlong': [-37.865288937823316, -8.306290795258281], 'name': 'Sertão'}",18
2015,"{'latlong': [-39.95936095628068, -8.364764974735124], 'name': 'Vale do S.Francisco e Araripe'}","{'latlong': [-39.95936095628068, -8.364764974735124], 'name': 'Vale do S.Francisco e Araripe'}",3841
2016,"{'latlong': [-35.45993547543438, -8.237977282077168], 'name': 'Metropolitana'}","{'latlong': [-35.45993547543438, -8.237977282077168], 'name': 'Metropolitana'}",34816
2016,"{'latlong': [-35.45993547543438, -8.237977282077168], 'name': 'Metropolitana'}","{'latlong': [-36.44705331304556, -8.597091004271139], 'name': 'Agreste'}",555
2016,"{'latlong': [-35.45993547543438, -8.237977282077168], 'name': 'Metropolitana'}","{'latlong': [-37.865288937823316, -8.306290795258281], 'name': 'Sertão'}",3
2016,"{'latlong': [-35.45993547543438, -8.237977282077168], 'name': 'Metropolitana'}","{'latlong': [-39.95936095628068, -8.364764974735124], 'name': 'Vale do S.Francisco e Araripe'}",1
2016,"{'latlong': [-36.44705331304556, -8.597091004271139], 'name': 'Agreste'}","{'latlong': [-35.45993547543438, -8.237977282077168], 'name': 'Metropolitana'}",3389
2016,"{'latlong': [-36.44705331304556, -8.597091004271139], 'name': 'Agreste'}","{'latlong': [-36.44705331304556, -8.597091004271139], 'name': 'Agreste'}",5483
2016,"{'latlong': [-36.44705331304556, -8.597091004271139], 'name': 'Agreste'}","{'latlong': [-37.865288937823316, -8.306290795258281], 'name': 'Sertão'}",39
2016,"{'latlong': [-36.44705331304556, -8.597091004271139], 'name': 'Agreste'}","{'latlong': [-39.95936095628068, -8.364764974735124], 'name': 'Vale do S.Francisco e Araripe'}",2
2016,"{'latlong': [-37.865288937823316, -8.306290795258281], 'name': 'Sertão'}","{'latlong': [-35.45993547543438, -8.237977282077168], 'name': 'Metropolitana'}",1124
2016,"{'latlong': [-37.865288937823316, -8.306290795258281], 'name': 'Sertão'}","{'latlong': [-36.44705331304556, -8.597091004271139], 'name': 'Agreste'}",758
2016,"{'latlong': [-37.865288937823316, -8.306290795258281], 'name': 'Sertão'}","{'latlong': [-37.865288937823316, -8.306290795258281], 'name': 'Sertão'}",2432
2016,"{'latlong': [-37.865288937823316, -8.306290795258281], 'name': 'Sertão'}","{'latlong': [-39.95936095628068, -8.364764974735124], 'name': 'Vale do S.Francisco e Araripe'}",53
2016,"{'latlong': [-39.95936095628068, -8.364764974735124], 'name': 'Vale do S.Francisco e Araripe'}","{'latlong': [-35.45993547543438, -8.237977282077168], 'name': 'Metropolitana'}",168
2016,"{'latlong': [-39.95936095628068, -8.364764974735124], 'name': 'Vale do S.Francisco e Araripe'}","{'latlong': [-36.44705331304556, -8.597091004271139], 'name': 'Agreste'}",9
2016,"{'latlong': [-39.95936095628068, -8.364764974735124], 'name': 'Vale do S.Francisco e Araripe'}","{'latlong': [-37.865288937823316, -8.306290795258281], 'name': 'Sertão'}",21
2016,"{'latlong': [-39.95936095628068, -8.364764974735124], 'name': 'Vale do S.Francisco e Araripe'}","{'latlong': [-39.95936095628068, -8.364764974735124], 'name': 'Vale do S.Francisco e Araripe'}",4532
2017,"{'latlong': [-35.45993547543438, -8.237977282077168], 'name': 'Metropolitana'}","{'latlong': [-35.45993547543438, -8.237977282077168], 'name': 'Metropolitana'}",37185
2017,"{'latlong': [-35.45993547543438, -8.237977282077168], 'name': 'Metropolitana'}","{'latlong': [-36.44705331304556, -8.597091004271139], 'name': 'Agreste'}",570
2017,"{'latlong': [-35.45993547543438, -8.237977282077168], 'name': 'Metropolitana'}","{'latlong': [-37.865288937823316, -8.306290795258281], 'name': 'Sertão'}",14
2017,"{'latlong': [-35.45993547543438, -8.237977282077168], 'name': 'Metropolitana'}","{'latlong': [-39.95936095628068, -8.364764974735124], 'name': 'Vale do S.Francisco e Araripe'}",9
2017,"{'latlong': [-36.44705331304556, -8.597091004271139], 'name': 'Agreste'}","{'latlong': [-35.45993547543438, -8.237977282077168], 'name': 'Metropolitana'}",3437
2017,"{'latlong': [-36.44705331304556, -8.597091004271139], 'name': 'Agreste'}","{'latlong': [-36.44705331304556, -8.597091004271139], 'name': 'Agreste'}",6495
2017,"{'latlong': [-36.44705331304556, -8.597091004271139], 'name': 'Agreste'}","{'latlong': [-37.865288937823316, -8.306290795258281], 'name': 'Sertão'}",126
2017,"{'latlong': [-36.44705331304556, -8.597091004271139], 'name': 'Agreste'}","{'latlong': [-39.95936095628068, -8.364764974735124], 'name': 'Vale do S.Francisco e Araripe'}",5
2017,"{'latlong': [-37.865288937823316, -8.306290795258281], 'name': 'Sertão'}","{'latlong': [-35.45993547543438, -8.237977282077168], 'name': 'Metropolitana'}",1045
2017,"{'latlong': [-37.865288937823316, -8.306290795258281], 'name': 'Sertão'}","{'latlong': [-36.44705331304556, -8.597091004271139], 'name': 'Agreste'}",756
2017,"{'latlong': [-37.865288937823316, -8.306290795258281], 'name': 'Sertão'}","{'latlong': [-37.865288937823316, -8.306290795258281], 'name': 'Sertão'}",3268
2017,"{'latlong': [-37.865288937823316, -8.306290795258281], 'name': 'Sertão'}","{'latlong': [-39.95936095628068, -8.364764974735124], 'name': 'Vale do S.Francisco e Araripe'}",29
2017,"{'latlong': [-39.95936095628068, -8.364764974735124], 'name': 'Vale do S.Francisco e Araripe'}","{'latlong': [-35.45993547543438, -8.237977282077168], 'name': 'Metropolitana'}",144
2017,"{'latlong': [-39.95936095628068, -8.364764974735124], 'name': 'Vale do S.Francisco e Araripe'}","{'latlong': [-36.44705331304556, -8.597091004271139], 'name': 'Agreste'}",11
2017,"{'latlong': [-39.95936095628068, -8.364764974735124], 'name': 'Vale do S.Francisco e Araripe'}","{'latlong': [-37.865288937823316, -8.306290795258281], 'name': 'Sertão'}",14
2017,"{'latlong': [-39.95936095628068, -8.364764974735124], 'name': 'Vale do S.Francisco e Araripe'}","{'latlong': [-39.95936095628068, -8.364764974735124], 'name': 'Vale do S.Francisco e Araripe'}",5001
2018,"{'latlong': [-35.45993547543438, -8.237977282077168], 'name': 'Metropolitana'}","{'latlong': [-35.45993547543438, -8.237977282077168], 'name': 'Metropolitana'}",35516
2018,"{'latlong': [-35.45993547543438, -8.237977282077168], 'name': 'Metropolitana'}","{'latlong': [-36.44705331304556, -8.597091004271139], 'name': 'Agreste'}",454
2018,"{'latlong': [-35.45993547543438, -8.237977282077168], 'name': 'Metropolitana'}","{'latlong': [-37.865288937823316, -8.306290795258281], 'name': 'Sertão'}",7
2018,"{'latlong': [-35.45993547543438, -8.237977282077168], 'name': 'Metropolitana'}","{'latlong': [-39.95936095628068, -8.364764974735124], 'name': 'Vale do S.Francisco e Araripe'}",3
2018,"{'latlong': [-36.44705331304556, -8.597091004271139], 'name': 'Agreste'}","{'latlong': [-35.45993547543438, -8.237977282077168], 'name': 'Metropolitana'}",3505
2018,"{'latlong': [-36.44705331304556, -8.597091004271139], 'name': 'Agreste'}","{'latlong': [-36.44705331304556, -8.597091004271139], 'name': 'Agreste'}",5784
2018,"{'latlong': [-36.44705331304556, -8.597091004271139], 'name': 'Agreste'}","{'latlong': [-37.865288937823316, -8.306290795258281], 'name': 'Sertão'}",155
2018,"{'latlong': [-36.44705331304556, -8.597091004271139], 'name': 'Agreste'}","{'latlong': [-39.95936095628068, -8.364764974735124], 'name': 'Vale do S.Francisco e Araripe'}",9
2018,"{'latlong': [-37.865288937823316, -8.306290795258281], 'name': 'Sertão'}","{'latlong': [-35.45993547543438, -8.237977282077168], 'name': 'Metropolitana'}",1098
2018,"{'latlong': [-37.865288937823316, -8.306290795258281], 'name': 'Sertão'}","{'latlong': [-36.44705331304556, -8.597091004271139], 'name': 'Agreste'}",625
2018,"{'latlong': [-37.865288937823316, -8.306290795258281], 'name': 'Sertão'}","{'latlong': [-37.865288937823316, -8.306290795258281], 'name': 'Sertão'}",3171
2018,"{'latlong': [-37.865288937823316, -8.306290795258281], 'name': 'Sertão'}","{'latlong': [-39.95936095628068, -8.364764974735124], 'name': 'Vale do S.Francisco e Araripe'}",35
2018,"{'latlong': [-39.95936095628068, -8.364764974735124], 'name': 'Vale do S.Francisco e Araripe'}","{'latlong': [-35.45993547543438, -8.237977282077168], 'name': 'Metropolitana'}",174
2018,"{'latlong': [-39.95936095628068, -8.364764974735124], 'name': 'Vale do S.Francisco e Araripe'}","{'latlong': [-36.44705331304556, -8.597091004271139], 'name': 'Agreste'}",11
2018,"{'latlong': [-39.95936095628068, -8.364764974735124], 'name': 'Vale do S.Francisco e Araripe'}","{'latlong': [-37.865288937823316, -8.306290795258281], 'name': 'Sertão'}",31
2018,"{'latlong': [-39.95936095628068, -8.364764974735124], 'name': 'Vale do S.Francisco e Araripe'}","{'latlong': [-39.95936095628068, -8.364764974735124], 'name': 'Vale do S.Francisco e Araripe'}",4919
2019,"{'latlong': [-35.45993547543438, -8.237977282077168], 'name': 'Metropolitana'}","{'latlong': [-35.45993547543438, -8.237977282077168], 'name': 'Metropolitana'}",35918
2019,"{'latlong': [-35.45993547543438, -8.237977282077168], 'name': 'Metropolitana'}","{'latlong': [-36.44705331304556, -8.597091004271139], 'name': 'Agreste'}",474
2019,"{'latlong': [-35.45993547543438, -8.237977282077168], 'name': 'Metropolitana'}","{'latlong': [-37.865288937823316, -8.306290795258281], 'name': 'Sertão'}",10
2019,"{'latlong': [-35.45993547543438, -8.237977282077168], 'name': 'Metropolitana'}","{'latlong': [-39.95936095628068, -8.364764974735124], 'name': 'Vale do S.Francisco e Araripe'}",9
2019,"{'latlong': [-36.44705331304556, -8.597091004271139], 'name': 'Agreste'}","{'latlong': [-35.45993547543438, -8.237977282077168], 'name': 'Metropolitana'}",3515
2019,"{'latlong': [-36.44705331304556, -8.597091004271139], 'name': 'Agreste'}","{'latlong': [-36.44705331304556, -8.597091004271139], 'name': 'Agreste'}",6135
2019,"{'latlong': [-36.44705331304556, -8.597091004271139], 'name': 'Agreste'}","{'latlong': [-37.865288937823316, -8.306290795258281], 'name': 'Sertão'}",113
2019,"{'latlong': [-36.44705331304556, -8.597091004271139], 'name': 'Agreste'}","{'latlong': [-39.95936095628068, -8.364764974735124], 'name': 'Vale do S.Francisco e Araripe'}",2
2019,"{'latlong': [-37.865288937823316, -8.306290795258281], 'name': 'Sertão'}","{'latlong': [-35.45993547543438, -8.237977282077168], 'name': 'Metropolitana'}",1196
2019,"{'latlong': [-37.865288937823316, -8.306290795258281], 'name': 'Sertão'}","{'latlong': [-36.44705331304556, -8.597091004271139], 'name': 'Agreste'}",771
2019,"{'latlong': [-37.865288937823316, -8.306290795258281], 'name': 'Sertão'}","{'latlong': [-37.865288937823316, -8.306290795258281], 'name': 'Sertão'}",3499
2019,"{'latlong': [-37.865288937823316, -8.306290795258281], 'name': 'Sertão'}","{'latlong': [-39.95936095628068, -8.364764974735124], 'name': 'Vale do S.Francisco e Araripe'}",23
2019,"{'latlong': [-39.95936095628068, -8.364764974735124], 'name': 'Vale do S.Francisco e Araripe'}","{'latlong': [-35.45993547543438, -8.237977282077168], 'name': 'Metropolitana'}",218
2019,"{'latlong': [-39.95936095628068, -8.364764974735124], 'name': 'Vale do S.Francisco e Araripe'}","{'latlong': [-36.44705331304556, -8.597091004271139], 'name': 'Agreste'}",14
2019,"{'latlong': [-39.95936095628068, -8.364764974735124], 'name': 'Vale do S.Francisco e Araripe'}","{'latlong': [-37.865288937823316, -8.306290795258281], 'name': 'Sertão'}",62
2019,"{'latlong': [-39.95936095628068, -8.364764974735124], 'name': 'Vale do S.Francisco e Araripe'}","{'latlong': [-39.95936095628068, -8.364764974735124], 'name': 'Vale do S.Francisco e Araripe'}",5172
2020,"{'latlong': [-35.45993547543438, -8.237977282077168], 'name': 'Metropolitana'}","{'latlong': [-35.45993547543438, -8.237977282077168], 'name': 'Metropolitana'}",12823
2020,"{'latlong': [-35.45993547543438, -8.237977282077168], 'name': 'Metropolitana'}","{'latlong': [-36.44705331304556, -8.597091004271139], 'name': 'Agreste'}",191
2020,"{'latlong': [-35.45993547543438, -8.237977282077168], 'name': 'Metropolitana'}","{'latlong': [-37.865288937823316, -8.306290795258281], 'name': 'Sertão'}",2
2020,"{'latlong': [-35.45993547543438, -8.237977282077168], 'name': 'Metropolitana'}","{'latlong': [-39.95936095628068, -8.364764974735124], 'name': 'Vale do S.Francisco e Araripe'}",2
2020,"{'latlong': [-36.44705331304556, -8.597091004271139], 'name': 'Agreste'}","{'latlong': [-35.45993547543438, -8.237977282077168], 'name': 'Metropolitana'}",1392
2020,"{'latlong': [-36.44705331304556, -8.597091004271139], 'name': 'Agreste'}","{'latlong': [-36.44705331304556, -8.597091004271139], 'name': 'Agreste'}",2484
2020,"{'latlong': [-36.44705331304556, -8.597091004271139], 'name': 'Agreste'}","{'latlong': [-37.865288937823316, -8.306290795258281], 'name': 'Sertão'}",39
2020,"{'latlong': [-36.44705331304556, -8.597091004271139], 'name': 'Agreste'}","{'latlong': [-39.95936095628068, -8.364764974735124], 'name': 'Vale do S.Francisco e Araripe'}",1
2020,"{'latlong': [-37.865288937823316, -8.306290795258281], 'name': 'Sertão'}","{'latlong': [-35.45993547543438, -8.237977282077168], 'name': 'Metropolitana'}",424
2020,"{'latlong': [-37.865288937823316, -8.306290795258281], 'name': 'Sertão'}","{'latlong': [-36.44705331304556, -8.597091004271139], 'name': 'Agreste'}",327
2020,"{'latlong': [-37.865288937823316, -8.306290795258281], 'name': 'Sertão'}","{'latlong': [-37.865288937823316, -8.306290795258281], 'name': 'Sertão'}",1134
2020,"{'latlong': [-37.865288937823316, -8.306290795258281], 'name': 'Sertão'}","{'latlong': [-39.95936095628068, -8.364764974735124], 'name': 'Vale do S.Francisco e Araripe'}",11
2020,"{'latlong': [-39.95936095628068, -8.364764974735124], 'name': 'Vale do S.Francisco e Araripe'}","{'latlong': [-35.45993547543438, -8.237977282077168], 'name': 'Metropolitana'}",55
2020,"{'latlong': [-39.95936095628068, -8.364764974735124], 'name': 'Vale do S.Francisco e Araripe'}","{'latlong': [-36.44705331304556, -8.597091004271139], 'name': 'Agreste'}",12
2020,"{'latlong': [-39.95936095628068, -8.364764974735124], 'name': 'Vale do S.Francisco e Araripe'}","{'latlong': [-37.865288937823316, -8.306290795258281], 'name': 'Sertão'}",9
2020,"{'latlong': [-39.95936095628068, -8.364764974735124], 'name': 'Vale do S.Francisco e Araripe'}","{'latlong': [-39.95936095628068, -8.364764974735124], 'name': 'Vale do S.Francisco e Araripe'}",1295
