year,from,to,hospitalizations
1995,"{'latlong': [-42.78374566691811, -22.435006717319105], 'name': 'Macrorregião II'}","{'latlong': [-42.78374566691811, -22.435006717319105], 'name': 'Macrorregião II'}",2
1998,"{'latlong': [-41.74084505657541, -21.799306433880908], 'name': 'Macrorregião III'}","{'latlong': [-41.74084505657541, -21.799306433880908], 'name': 'Macrorregião III'}",1363
1998,"{'latlong': [-41.74084505657541, -21.799306433880908], 'name': 'Macrorregião III'}","{'latlong': [-42.78374566691811, -22.435006717319105], 'name': 'Macrorregião II'}",89
1998,"{'latlong': [-42.78374566691811, -22.435006717319105], 'name': 'Macrorregião II'}","{'latlong': [-41.74084505657541, -21.799306433880908], 'name': 'Macrorregião III'}",5
1998,"{'latlong': [-42.78374566691811, -22.435006717319105], 'name': 'Macrorregião II'}","{'latlong': [-42.78374566691811, -22.435006717319105], 'name': 'Macrorregião II'}",11531
1998,"{'latlong': [-42.78374566691811, -22.435006717319105], 'name': 'Macrorregião II'}","{'latlong': [-43.93088259914695, -22.50640773396086], 'name': 'Metropolitana I'}",29
1998,"{'latlong': [-43.93088259914695, -22.50640773396086], 'name': 'Metropolitana I'}","{'latlong': [-41.74084505657541, -21.799306433880908], 'name': 'Macrorregião III'}",1
1998,"{'latlong': [-43.93088259914695, -22.50640773396086], 'name': 'Metropolitana I'}","{'latlong': [-42.78374566691811, -22.435006717319105], 'name': 'Macrorregião II'}",149
1998,"{'latlong': [-43.93088259914695, -22.50640773396086], 'name': 'Metropolitana I'}","{'latlong': [-43.93088259914695, -22.50640773396086], 'name': 'Metropolitana I'}",1182
1999,"{'latlong': [-41.74084505657541, -21.799306433880908], 'name': 'Macrorregião III'}","{'latlong': [-41.74084505657541, -21.799306433880908], 'name': 'Macrorregião III'}",1669
1999,"{'latlong': [-41.74084505657541, -21.799306433880908], 'name': 'Macrorregião III'}","{'latlong': [-42.78374566691811, -22.435006717319105], 'name': 'Macrorregião II'}",115
1999,"{'latlong': [-42.78374566691811, -22.435006717319105], 'name': 'Macrorregião II'}","{'latlong': [-41.74084505657541, -21.799306433880908], 'name': 'Macrorregião III'}",18
1999,"{'latlong': [-42.78374566691811, -22.435006717319105], 'name': 'Macrorregião II'}","{'latlong': [-42.78374566691811, -22.435006717319105], 'name': 'Macrorregião II'}",14372
1999,"{'latlong': [-42.78374566691811, -22.435006717319105], 'name': 'Macrorregião II'}","{'latlong': [-43.93088259914695, -22.50640773396086], 'name': 'Metropolitana I'}",8
1999,"{'latlong': [-43.93088259914695, -22.50640773396086], 'name': 'Metropolitana I'}","{'latlong': [-42.78374566691811, -22.435006717319105], 'name': 'Macrorregião II'}",186
1999,"{'latlong': [-43.93088259914695, -22.50640773396086], 'name': 'Metropolitana I'}","{'latlong': [-43.93088259914695, -22.50640773396086], 'name': 'Metropolitana I'}",1170
2000,"{'latlong': [-41.74084505657541, -21.799306433880908], 'name': 'Macrorregião III'}","{'latlong': [-41.74084505657541, -21.799306433880908], 'name': 'Macrorregião III'}",1826
2000,"{'latlong': [-41.74084505657541, -21.799306433880908], 'name': 'Macrorregião III'}","{'latlong': [-42.78374566691811, -22.435006717319105], 'name': 'Macrorregião II'}",103
2000,"{'latlong': [-42.78374566691811, -22.435006717319105], 'name': 'Macrorregião II'}","{'latlong': [-41.74084505657541, -21.799306433880908], 'name': 'Macrorregião III'}",7
2000,"{'latlong': [-42.78374566691811, -22.435006717319105], 'name': 'Macrorregião II'}","{'latlong': [-42.78374566691811, -22.435006717319105], 'name': 'Macrorregião II'}",14594
2000,"{'latlong': [-42.78374566691811, -22.435006717319105], 'name': 'Macrorregião II'}","{'latlong': [-43.93088259914695, -22.50640773396086], 'name': 'Metropolitana I'}",17
2000,"{'latlong': [-43.93088259914695, -22.50640773396086], 'name': 'Metropolitana I'}","{'latlong': [-41.74084505657541, -21.799306433880908], 'name': 'Macrorregião III'}",1
2000,"{'latlong': [-43.93088259914695, -22.50640773396086], 'name': 'Metropolitana I'}","{'latlong': [-42.78374566691811, -22.435006717319105], 'name': 'Macrorregião II'}",168
2000,"{'latlong': [-43.93088259914695, -22.50640773396086], 'name': 'Metropolitana I'}","{'latlong': [-43.93088259914695, -22.50640773396086], 'name': 'Metropolitana I'}",1332
2001,"{'latlong': [-41.74084505657541, -21.799306433880908], 'name': 'Macrorregião III'}","{'latlong': [-41.74084505657541, -21.799306433880908], 'name': 'Macrorregião III'}",2182
2001,"{'latlong': [-41.74084505657541, -21.799306433880908], 'name': 'Macrorregião III'}","{'latlong': [-42.78374566691811, -22.435006717319105], 'name': 'Macrorregião II'}",160
2001,"{'latlong': [-42.78374566691811, -22.435006717319105], 'name': 'Macrorregião II'}","{'latlong': [-41.74084505657541, -21.799306433880908], 'name': 'Macrorregião III'}",11
2001,"{'latlong': [-42.78374566691811, -22.435006717319105], 'name': 'Macrorregião II'}","{'latlong': [-42.78374566691811, -22.435006717319105], 'name': 'Macrorregião II'}",14134
2001,"{'latlong': [-42.78374566691811, -22.435006717319105], 'name': 'Macrorregião II'}","{'latlong': [-43.93088259914695, -22.50640773396086], 'name': 'Metropolitana I'}",32
2001,"{'latlong': [-43.93088259914695, -22.50640773396086], 'name': 'Metropolitana I'}","{'latlong': [-42.78374566691811, -22.435006717319105], 'name': 'Macrorregião II'}",173
2001,"{'latlong': [-43.93088259914695, -22.50640773396086], 'name': 'Metropolitana I'}","{'latlong': [-43.93088259914695, -22.50640773396086], 'name': 'Metropolitana I'}",1741
2002,"{'latlong': [-41.74084505657541, -21.799306433880908], 'name': 'Macrorregião III'}","{'latlong': [-41.74084505657541, -21.799306433880908], 'name': 'Macrorregião III'}",1538
2002,"{'latlong': [-41.74084505657541, -21.799306433880908], 'name': 'Macrorregião III'}","{'latlong': [-42.78374566691811, -22.435006717319105], 'name': 'Macrorregião II'}",123
2002,"{'latlong': [-42.78374566691811, -22.435006717319105], 'name': 'Macrorregião II'}","{'latlong': [-41.74084505657541, -21.799306433880908], 'name': 'Macrorregião III'}",9
2002,"{'latlong': [-42.78374566691811, -22.435006717319105], 'name': 'Macrorregião II'}","{'latlong': [-42.78374566691811, -22.435006717319105], 'name': 'Macrorregião II'}",13038
2002,"{'latlong': [-42.78374566691811, -22.435006717319105], 'name': 'Macrorregião II'}","{'latlong': [-43.93088259914695, -22.50640773396086], 'name': 'Metropolitana I'}",38
2002,"{'latlong': [-43.93088259914695, -22.50640773396086], 'name': 'Metropolitana I'}","{'latlong': [-41.74084505657541, -21.799306433880908], 'name': 'Macrorregião III'}",6
2002,"{'latlong': [-43.93088259914695, -22.50640773396086], 'name': 'Metropolitana I'}","{'latlong': [-42.78374566691811, -22.435006717319105], 'name': 'Macrorregião II'}",186
2002,"{'latlong': [-43.93088259914695, -22.50640773396086], 'name': 'Metropolitana I'}","{'latlong': [-43.93088259914695, -22.50640773396086], 'name': 'Metropolitana I'}",1269
2003,"{'latlong': [-41.74084505657541, -21.799306433880908], 'name': 'Macrorregião III'}","{'latlong': [-41.74084505657541, -21.799306433880908], 'name': 'Macrorregião III'}",1778
2003,"{'latlong': [-41.74084505657541, -21.799306433880908], 'name': 'Macrorregião III'}","{'latlong': [-42.78374566691811, -22.435006717319105], 'name': 'Macrorregião II'}",152
2003,"{'latlong': [-42.78374566691811, -22.435006717319105], 'name': 'Macrorregião II'}","{'latlong': [-41.74084505657541, -21.799306433880908], 'name': 'Macrorregião III'}",3
2003,"{'latlong': [-42.78374566691811, -22.435006717319105], 'name': 'Macrorregião II'}","{'latlong': [-42.78374566691811, -22.435006717319105], 'name': 'Macrorregião II'}",12847
2003,"{'latlong': [-42.78374566691811, -22.435006717319105], 'name': 'Macrorregião II'}","{'latlong': [-43.93088259914695, -22.50640773396086], 'name': 'Metropolitana I'}",37
2003,"{'latlong': [-43.93088259914695, -22.50640773396086], 'name': 'Metropolitana I'}","{'latlong': [-41.74084505657541, -21.799306433880908], 'name': 'Macrorregião III'}",4
2003,"{'latlong': [-43.93088259914695, -22.50640773396086], 'name': 'Metropolitana I'}","{'latlong': [-42.78374566691811, -22.435006717319105], 'name': 'Macrorregião II'}",139
2003,"{'latlong': [-43.93088259914695, -22.50640773396086], 'name': 'Metropolitana I'}","{'latlong': [-43.93088259914695, -22.50640773396086], 'name': 'Metropolitana I'}",1194
2004,"{'latlong': [-41.74084505657541, -21.799306433880908], 'name': 'Macrorregião III'}","{'latlong': [-41.74084505657541, -21.799306433880908], 'name': 'Macrorregião III'}",2093
2004,"{'latlong': [-41.74084505657541, -21.799306433880908], 'name': 'Macrorregião III'}","{'latlong': [-42.78374566691811, -22.435006717319105], 'name': 'Macrorregião II'}",149
2004,"{'latlong': [-42.78374566691811, -22.435006717319105], 'name': 'Macrorregião II'}","{'latlong': [-41.74084505657541, -21.799306433880908], 'name': 'Macrorregião III'}",6
2004,"{'latlong': [-42.78374566691811, -22.435006717319105], 'name': 'Macrorregião II'}","{'latlong': [-42.78374566691811, -22.435006717319105], 'name': 'Macrorregião II'}",13261
2004,"{'latlong': [-42.78374566691811, -22.435006717319105], 'name': 'Macrorregião II'}","{'latlong': [-43.93088259914695, -22.50640773396086], 'name': 'Metropolitana I'}",33
2004,"{'latlong': [-43.93088259914695, -22.50640773396086], 'name': 'Metropolitana I'}","{'latlong': [-41.74084505657541, -21.799306433880908], 'name': 'Macrorregião III'}",4
2004,"{'latlong': [-43.93088259914695, -22.50640773396086], 'name': 'Metropolitana I'}","{'latlong': [-42.78374566691811, -22.435006717319105], 'name': 'Macrorregião II'}",163
2004,"{'latlong': [-43.93088259914695, -22.50640773396086], 'name': 'Metropolitana I'}","{'latlong': [-43.93088259914695, -22.50640773396086], 'name': 'Metropolitana I'}",1529
2005,"{'latlong': [-41.74084505657541, -21.799306433880908], 'name': 'Macrorregião III'}","{'latlong': [-41.74084505657541, -21.799306433880908], 'name': 'Macrorregião III'}",2207
2005,"{'latlong': [-41.74084505657541, -21.799306433880908], 'name': 'Macrorregião III'}","{'latlong': [-42.78374566691811, -22.435006717319105], 'name': 'Macrorregião II'}",146
2005,"{'latlong': [-42.78374566691811, -22.435006717319105], 'name': 'Macrorregião II'}","{'latlong': [-41.74084505657541, -21.799306433880908], 'name': 'Macrorregião III'}",10
2005,"{'latlong': [-42.78374566691811, -22.435006717319105], 'name': 'Macrorregião II'}","{'latlong': [-42.78374566691811, -22.435006717319105], 'name': 'Macrorregião II'}",13115
2005,"{'latlong': [-42.78374566691811, -22.435006717319105], 'name': 'Macrorregião II'}","{'latlong': [-43.93088259914695, -22.50640773396086], 'name': 'Metropolitana I'}",42
2005,"{'latlong': [-43.93088259914695, -22.50640773396086], 'name': 'Metropolitana I'}","{'latlong': [-41.74084505657541, -21.799306433880908], 'name': 'Macrorregião III'}",5
2005,"{'latlong': [-43.93088259914695, -22.50640773396086], 'name': 'Metropolitana I'}","{'latlong': [-42.78374566691811, -22.435006717319105], 'name': 'Macrorregião II'}",198
2005,"{'latlong': [-43.93088259914695, -22.50640773396086], 'name': 'Metropolitana I'}","{'latlong': [-43.93088259914695, -22.50640773396086], 'name': 'Metropolitana I'}",1425
2006,"{'latlong': [-41.74084505657541, -21.799306433880908], 'name': 'Macrorregião III'}","{'latlong': [-41.74084505657541, -21.799306433880908], 'name': 'Macrorregião III'}",2065
2006,"{'latlong': [-41.74084505657541, -21.799306433880908], 'name': 'Macrorregião III'}","{'latlong': [-42.78374566691811, -22.435006717319105], 'name': 'Macrorregião II'}",88
2006,"{'latlong': [-42.78374566691811, -22.435006717319105], 'name': 'Macrorregião II'}","{'latlong': [-41.74084505657541, -21.799306433880908], 'name': 'Macrorregião III'}",31
2006,"{'latlong': [-42.78374566691811, -22.435006717319105], 'name': 'Macrorregião II'}","{'latlong': [-42.78374566691811, -22.435006717319105], 'name': 'Macrorregião II'}",12875
2006,"{'latlong': [-42.78374566691811, -22.435006717319105], 'name': 'Macrorregião II'}","{'latlong': [-43.93088259914695, -22.50640773396086], 'name': 'Metropolitana I'}",47
2006,"{'latlong': [-43.93088259914695, -22.50640773396086], 'name': 'Metropolitana I'}","{'latlong': [-41.74084505657541, -21.799306433880908], 'name': 'Macrorregião III'}",8
2006,"{'latlong': [-43.93088259914695, -22.50640773396086], 'name': 'Metropolitana I'}","{'latlong': [-42.78374566691811, -22.435006717319105], 'name': 'Macrorregião II'}",146
2006,"{'latlong': [-43.93088259914695, -22.50640773396086], 'name': 'Metropolitana I'}","{'latlong': [-43.93088259914695, -22.50640773396086], 'name': 'Metropolitana I'}",1606
2007,"{'latlong': [-41.74084505657541, -21.799306433880908], 'name': 'Macrorregião III'}","{'latlong': [-41.74084505657541, -21.799306433880908], 'name': 'Macrorregião III'}",2126
2007,"{'latlong': [-41.74084505657541, -21.799306433880908], 'name': 'Macrorregião III'}","{'latlong': [-42.78374566691811, -22.435006717319105], 'name': 'Macrorregião II'}",115
2007,"{'latlong': [-41.74084505657541, -21.799306433880908], 'name': 'Macrorregião III'}","{'latlong': [-43.93088259914695, -22.50640773396086], 'name': 'Metropolitana I'}",1
2007,"{'latlong': [-42.78374566691811, -22.435006717319105], 'name': 'Macrorregião II'}","{'latlong': [-41.74084505657541, -21.799306433880908], 'name': 'Macrorregião III'}",64
2007,"{'latlong': [-42.78374566691811, -22.435006717319105], 'name': 'Macrorregião II'}","{'latlong': [-42.78374566691811, -22.435006717319105], 'name': 'Macrorregião II'}",14382
2007,"{'latlong': [-42.78374566691811, -22.435006717319105], 'name': 'Macrorregião II'}","{'latlong': [-43.93088259914695, -22.50640773396086], 'name': 'Metropolitana I'}",28
2007,"{'latlong': [-43.93088259914695, -22.50640773396086], 'name': 'Metropolitana I'}","{'latlong': [-41.74084505657541, -21.799306433880908], 'name': 'Macrorregião III'}",17
2007,"{'latlong': [-43.93088259914695, -22.50640773396086], 'name': 'Metropolitana I'}","{'latlong': [-42.78374566691811, -22.435006717319105], 'name': 'Macrorregião II'}",153
2007,"{'latlong': [-43.93088259914695, -22.50640773396086], 'name': 'Metropolitana I'}","{'latlong': [-43.93088259914695, -22.50640773396086], 'name': 'Metropolitana I'}",1461
2008,"{'latlong': [-41.74084505657541, -21.799306433880908], 'name': 'Macrorregião III'}","{'latlong': [-41.74084505657541, -21.799306433880908], 'name': 'Macrorregião III'}",2116
2008,"{'latlong': [-41.74084505657541, -21.799306433880908], 'name': 'Macrorregião III'}","{'latlong': [-42.78374566691811, -22.435006717319105], 'name': 'Macrorregião II'}",136
2008,"{'latlong': [-42.78374566691811, -22.435006717319105], 'name': 'Macrorregião II'}","{'latlong': [-41.74084505657541, -21.799306433880908], 'name': 'Macrorregião III'}",30
2008,"{'latlong': [-42.78374566691811, -22.435006717319105], 'name': 'Macrorregião II'}","{'latlong': [-42.78374566691811, -22.435006717319105], 'name': 'Macrorregião II'}",13333
2008,"{'latlong': [-42.78374566691811, -22.435006717319105], 'name': 'Macrorregião II'}","{'latlong': [-43.93088259914695, -22.50640773396086], 'name': 'Metropolitana I'}",11
2008,"{'latlong': [-43.93088259914695, -22.50640773396086], 'name': 'Metropolitana I'}","{'latlong': [-41.74084505657541, -21.799306433880908], 'name': 'Macrorregião III'}",8
2008,"{'latlong': [-43.93088259914695, -22.50640773396086], 'name': 'Metropolitana I'}","{'latlong': [-42.78374566691811, -22.435006717319105], 'name': 'Macrorregião II'}",177
2008,"{'latlong': [-43.93088259914695, -22.50640773396086], 'name': 'Metropolitana I'}","{'latlong': [-43.93088259914695, -22.50640773396086], 'name': 'Metropolitana I'}",1459
2009,"{'latlong': [-41.74084505657541, -21.799306433880908], 'name': 'Macrorregião III'}","{'latlong': [-41.74084505657541, -21.799306433880908], 'name': 'Macrorregião III'}",2465
2009,"{'latlong': [-41.74084505657541, -21.799306433880908], 'name': 'Macrorregião III'}","{'latlong': [-42.78374566691811, -22.435006717319105], 'name': 'Macrorregião II'}",136
2009,"{'latlong': [-42.78374566691811, -22.435006717319105], 'name': 'Macrorregião II'}","{'latlong': [-41.74084505657541, -21.799306433880908], 'name': 'Macrorregião III'}",59
2009,"{'latlong': [-42.78374566691811, -22.435006717319105], 'name': 'Macrorregião II'}","{'latlong': [-42.78374566691811, -22.435006717319105], 'name': 'Macrorregião II'}",13729
2009,"{'latlong': [-42.78374566691811, -22.435006717319105], 'name': 'Macrorregião II'}","{'latlong': [-43.93088259914695, -22.50640773396086], 'name': 'Metropolitana I'}",17
2009,"{'latlong': [-43.93088259914695, -22.50640773396086], 'name': 'Metropolitana I'}","{'latlong': [-41.74084505657541, -21.799306433880908], 'name': 'Macrorregião III'}",5
2009,"{'latlong': [-43.93088259914695, -22.50640773396086], 'name': 'Metropolitana I'}","{'latlong': [-42.78374566691811, -22.435006717319105], 'name': 'Macrorregião II'}",152
2009,"{'latlong': [-43.93088259914695, -22.50640773396086], 'name': 'Metropolitana I'}","{'latlong': [-43.93088259914695, -22.50640773396086], 'name': 'Metropolitana I'}",1534
2010,"{'latlong': [-41.74084505657541, -21.799306433880908], 'name': 'Macrorregião III'}","{'latlong': [-41.74084505657541, -21.799306433880908], 'name': 'Macrorregião III'}",3090
2010,"{'latlong': [-41.74084505657541, -21.799306433880908], 'name': 'Macrorregião III'}","{'latlong': [-42.78374566691811, -22.435006717319105], 'name': 'Macrorregião II'}",137
2010,"{'latlong': [-41.74084505657541, -21.799306433880908], 'name': 'Macrorregião III'}","{'latlong': [-43.93088259914695, -22.50640773396086], 'name': 'Metropolitana I'}",3
2010,"{'latlong': [-42.78374566691811, -22.435006717319105], 'name': 'Macrorregião II'}","{'latlong': [-41.74084505657541, -21.799306433880908], 'name': 'Macrorregião III'}",22
2010,"{'latlong': [-42.78374566691811, -22.435006717319105], 'name': 'Macrorregião II'}","{'latlong': [-42.78374566691811, -22.435006717319105], 'name': 'Macrorregião II'}",12575
2010,"{'latlong': [-42.78374566691811, -22.435006717319105], 'name': 'Macrorregião II'}","{'latlong': [-43.93088259914695, -22.50640773396086], 'name': 'Metropolitana I'}",24
2010,"{'latlong': [-43.93088259914695, -22.50640773396086], 'name': 'Metropolitana I'}","{'latlong': [-41.74084505657541, -21.799306433880908], 'name': 'Macrorregião III'}",2
2010,"{'latlong': [-43.93088259914695, -22.50640773396086], 'name': 'Metropolitana I'}","{'latlong': [-42.78374566691811, -22.435006717319105], 'name': 'Macrorregião II'}",166
2010,"{'latlong': [-43.93088259914695, -22.50640773396086], 'name': 'Metropolitana I'}","{'latlong': [-43.93088259914695, -22.50640773396086], 'name': 'Metropolitana I'}",1660
2011,"{'latlong': [-41.74084505657541, -21.799306433880908], 'name': 'Macrorregião III'}","{'latlong': [-41.74084505657541, -21.799306433880908], 'name': 'Macrorregião III'}",3506
2011,"{'latlong': [-41.74084505657541, -21.799306433880908], 'name': 'Macrorregião III'}","{'latlong': [-42.78374566691811, -22.435006717319105], 'name': 'Macrorregião II'}",115
2011,"{'latlong': [-41.74084505657541, -21.799306433880908], 'name': 'Macrorregião III'}","{'latlong': [-43.93088259914695, -22.50640773396086], 'name': 'Metropolitana I'}",9
2011,"{'latlong': [-42.78374566691811, -22.435006717319105], 'name': 'Macrorregião II'}","{'latlong': [-41.74084505657541, -21.799306433880908], 'name': 'Macrorregião III'}",40
2011,"{'latlong': [-42.78374566691811, -22.435006717319105], 'name': 'Macrorregião II'}","{'latlong': [-42.78374566691811, -22.435006717319105], 'name': 'Macrorregião II'}",11747
2011,"{'latlong': [-42.78374566691811, -22.435006717319105], 'name': 'Macrorregião II'}","{'latlong': [-43.93088259914695, -22.50640773396086], 'name': 'Metropolitana I'}",21
2011,"{'latlong': [-43.93088259914695, -22.50640773396086], 'name': 'Metropolitana I'}","{'latlong': [-41.74084505657541, -21.799306433880908], 'name': 'Macrorregião III'}",17
2011,"{'latlong': [-43.93088259914695, -22.50640773396086], 'name': 'Metropolitana I'}","{'latlong': [-42.78374566691811, -22.435006717319105], 'name': 'Macrorregião II'}",183
2011,"{'latlong': [-43.93088259914695, -22.50640773396086], 'name': 'Metropolitana I'}","{'latlong': [-43.93088259914695, -22.50640773396086], 'name': 'Metropolitana I'}",1841
2012,"{'latlong': [-41.74084505657541, -21.799306433880908], 'name': 'Macrorregião III'}","{'latlong': [-41.74084505657541, -21.799306433880908], 'name': 'Macrorregião III'}",3125
2012,"{'latlong': [-41.74084505657541, -21.799306433880908], 'name': 'Macrorregião III'}","{'latlong': [-42.78374566691811, -22.435006717319105], 'name': 'Macrorregião II'}",146
2012,"{'latlong': [-41.74084505657541, -21.799306433880908], 'name': 'Macrorregião III'}","{'latlong': [-43.93088259914695, -22.50640773396086], 'name': 'Metropolitana I'}",22
2012,"{'latlong': [-42.78374566691811, -22.435006717319105], 'name': 'Macrorregião II'}","{'latlong': [-41.74084505657541, -21.799306433880908], 'name': 'Macrorregião III'}",20
2012,"{'latlong': [-42.78374566691811, -22.435006717319105], 'name': 'Macrorregião II'}","{'latlong': [-42.78374566691811, -22.435006717319105], 'name': 'Macrorregião II'}",11001
2012,"{'latlong': [-42.78374566691811, -22.435006717319105], 'name': 'Macrorregião II'}","{'latlong': [-43.93088259914695, -22.50640773396086], 'name': 'Metropolitana I'}",42
2012,"{'latlong': [-43.93088259914695, -22.50640773396086], 'name': 'Metropolitana I'}","{'latlong': [-41.74084505657541, -21.799306433880908], 'name': 'Macrorregião III'}",19
2012,"{'latlong': [-43.93088259914695, -22.50640773396086], 'name': 'Metropolitana I'}","{'latlong': [-42.78374566691811, -22.435006717319105], 'name': 'Macrorregião II'}",163
2012,"{'latlong': [-43.93088259914695, -22.50640773396086], 'name': 'Metropolitana I'}","{'latlong': [-43.93088259914695, -22.50640773396086], 'name': 'Metropolitana I'}",1807
2013,"{'latlong': [-41.74084505657541, -21.799306433880908], 'name': 'Macrorregião III'}","{'latlong': [-41.74084505657541, -21.799306433880908], 'name': 'Macrorregião III'}",2931
2013,"{'latlong': [-41.74084505657541, -21.799306433880908], 'name': 'Macrorregião III'}","{'latlong': [-42.78374566691811, -22.435006717319105], 'name': 'Macrorregião II'}",139
2013,"{'latlong': [-41.74084505657541, -21.799306433880908], 'name': 'Macrorregião III'}","{'latlong': [-43.93088259914695, -22.50640773396086], 'name': 'Metropolitana I'}",25
2013,"{'latlong': [-42.78374566691811, -22.435006717319105], 'name': 'Macrorregião II'}","{'latlong': [-41.74084505657541, -21.799306433880908], 'name': 'Macrorregião III'}",19
2013,"{'latlong': [-42.78374566691811, -22.435006717319105], 'name': 'Macrorregião II'}","{'latlong': [-42.78374566691811, -22.435006717319105], 'name': 'Macrorregião II'}",10511
2013,"{'latlong': [-42.78374566691811, -22.435006717319105], 'name': 'Macrorregião II'}","{'latlong': [-43.93088259914695, -22.50640773396086], 'name': 'Metropolitana I'}",39
2013,"{'latlong': [-43.93088259914695, -22.50640773396086], 'name': 'Metropolitana I'}","{'latlong': [-41.74084505657541, -21.799306433880908], 'name': 'Macrorregião III'}",17
2013,"{'latlong': [-43.93088259914695, -22.50640773396086], 'name': 'Metropolitana I'}","{'latlong': [-42.78374566691811, -22.435006717319105], 'name': 'Macrorregião II'}",174
2013,"{'latlong': [-43.93088259914695, -22.50640773396086], 'name': 'Metropolitana I'}","{'latlong': [-43.93088259914695, -22.50640773396086], 'name': 'Metropolitana I'}",1681
2014,"{'latlong': [-41.74084505657541, -21.799306433880908], 'name': 'Macrorregião III'}","{'latlong': [-41.74084505657541, -21.799306433880908], 'name': 'Macrorregião III'}",3088
2014,"{'latlong': [-41.74084505657541, -21.799306433880908], 'name': 'Macrorregião III'}","{'latlong': [-42.78374566691811, -22.435006717319105], 'name': 'Macrorregião II'}",143
2014,"{'latlong': [-41.74084505657541, -21.799306433880908], 'name': 'Macrorregião III'}","{'latlong': [-43.93088259914695, -22.50640773396086], 'name': 'Metropolitana I'}",47
2014,"{'latlong': [-42.78374566691811, -22.435006717319105], 'name': 'Macrorregião II'}","{'latlong': [-41.74084505657541, -21.799306433880908], 'name': 'Macrorregião III'}",19
2014,"{'latlong': [-42.78374566691811, -22.435006717319105], 'name': 'Macrorregião II'}","{'latlong': [-42.78374566691811, -22.435006717319105], 'name': 'Macrorregião II'}",10533
2014,"{'latlong': [-42.78374566691811, -22.435006717319105], 'name': 'Macrorregião II'}","{'latlong': [-43.93088259914695, -22.50640773396086], 'name': 'Metropolitana I'}",56
2014,"{'latlong': [-43.93088259914695, -22.50640773396086], 'name': 'Metropolitana I'}","{'latlong': [-41.74084505657541, -21.799306433880908], 'name': 'Macrorregião III'}",13
2014,"{'latlong': [-43.93088259914695, -22.50640773396086], 'name': 'Metropolitana I'}","{'latlong': [-42.78374566691811, -22.435006717319105], 'name': 'Macrorregião II'}",169
2014,"{'latlong': [-43.93088259914695, -22.50640773396086], 'name': 'Metropolitana I'}","{'latlong': [-43.93088259914695, -22.50640773396086], 'name': 'Metropolitana I'}",1797
2015,"{'latlong': [-41.74084505657541, -21.799306433880908], 'name': 'Macrorregião III'}","{'latlong': [-41.74084505657541, -21.799306433880908], 'name': 'Macrorregião III'}",2985
2015,"{'latlong': [-41.74084505657541, -21.799306433880908], 'name': 'Macrorregião III'}","{'latlong': [-42.78374566691811, -22.435006717319105], 'name': 'Macrorregião II'}",220
2015,"{'latlong': [-41.74084505657541, -21.799306433880908], 'name': 'Macrorregião III'}","{'latlong': [-43.93088259914695, -22.50640773396086], 'name': 'Metropolitana I'}",37
2015,"{'latlong': [-42.78374566691811, -22.435006717319105], 'name': 'Macrorregião II'}","{'latlong': [-41.74084505657541, -21.799306433880908], 'name': 'Macrorregião III'}",19
2015,"{'latlong': [-42.78374566691811, -22.435006717319105], 'name': 'Macrorregião II'}","{'latlong': [-42.78374566691811, -22.435006717319105], 'name': 'Macrorregião II'}",11229
2015,"{'latlong': [-42.78374566691811, -22.435006717319105], 'name': 'Macrorregião II'}","{'latlong': [-43.93088259914695, -22.50640773396086], 'name': 'Metropolitana I'}",79
2015,"{'latlong': [-43.93088259914695, -22.50640773396086], 'name': 'Metropolitana I'}","{'latlong': [-41.74084505657541, -21.799306433880908], 'name': 'Macrorregião III'}",18
2015,"{'latlong': [-43.93088259914695, -22.50640773396086], 'name': 'Metropolitana I'}","{'latlong': [-42.78374566691811, -22.435006717319105], 'name': 'Macrorregião II'}",140
2015,"{'latlong': [-43.93088259914695, -22.50640773396086], 'name': 'Metropolitana I'}","{'latlong': [-43.93088259914695, -22.50640773396086], 'name': 'Metropolitana I'}",2103
2016,"{'latlong': [-41.74084505657541, -21.799306433880908], 'name': 'Macrorregião III'}","{'latlong': [-41.74084505657541, -21.799306433880908], 'name': 'Macrorregião III'}",2554
2016,"{'latlong': [-41.74084505657541, -21.799306433880908], 'name': 'Macrorregião III'}","{'latlong': [-42.78374566691811, -22.435006717319105], 'name': 'Macrorregião II'}",198
2016,"{'latlong': [-41.74084505657541, -21.799306433880908], 'name': 'Macrorregião III'}","{'latlong': [-43.93088259914695, -22.50640773396086], 'name': 'Metropolitana I'}",41
2016,"{'latlong': [-42.78374566691811, -22.435006717319105], 'name': 'Macrorregião II'}","{'latlong': [-41.74084505657541, -21.799306433880908], 'name': 'Macrorregião III'}",14
2016,"{'latlong': [-42.78374566691811, -22.435006717319105], 'name': 'Macrorregião II'}","{'latlong': [-42.78374566691811, -22.435006717319105], 'name': 'Macrorregião II'}",10659
2016,"{'latlong': [-42.78374566691811, -22.435006717319105], 'name': 'Macrorregião II'}","{'latlong': [-43.93088259914695, -22.50640773396086], 'name': 'Metropolitana I'}",69
2016,"{'latlong': [-43.93088259914695, -22.50640773396086], 'name': 'Metropolitana I'}","{'latlong': [-41.74084505657541, -21.799306433880908], 'name': 'Macrorregião III'}",8
2016,"{'latlong': [-43.93088259914695, -22.50640773396086], 'name': 'Metropolitana I'}","{'latlong': [-42.78374566691811, -22.435006717319105], 'name': 'Macrorregião II'}",158
2016,"{'latlong': [-43.93088259914695, -22.50640773396086], 'name': 'Metropolitana I'}","{'latlong': [-43.93088259914695, -22.50640773396086], 'name': 'Metropolitana I'}",2264
2017,"{'latlong': [-41.74084505657541, -21.799306433880908], 'name': 'Macrorregião III'}","{'latlong': [-41.74084505657541, -21.799306433880908], 'name': 'Macrorregião III'}",2476
2017,"{'latlong': [-41.74084505657541, -21.799306433880908], 'name': 'Macrorregião III'}","{'latlong': [-42.78374566691811, -22.435006717319105], 'name': 'Macrorregião II'}",219
2017,"{'latlong': [-41.74084505657541, -21.799306433880908], 'name': 'Macrorregião III'}","{'latlong': [-43.93088259914695, -22.50640773396086], 'name': 'Metropolitana I'}",64
2017,"{'latlong': [-42.78374566691811, -22.435006717319105], 'name': 'Macrorregião II'}","{'latlong': [-41.74084505657541, -21.799306433880908], 'name': 'Macrorregião III'}",29
2017,"{'latlong': [-42.78374566691811, -22.435006717319105], 'name': 'Macrorregião II'}","{'latlong': [-42.78374566691811, -22.435006717319105], 'name': 'Macrorregião II'}",9848
2017,"{'latlong': [-42.78374566691811, -22.435006717319105], 'name': 'Macrorregião II'}","{'latlong': [-43.93088259914695, -22.50640773396086], 'name': 'Metropolitana I'}",88
2017,"{'latlong': [-43.93088259914695, -22.50640773396086], 'name': 'Metropolitana I'}","{'latlong': [-41.74084505657541, -21.799306433880908], 'name': 'Macrorregião III'}",3
2017,"{'latlong': [-43.93088259914695, -22.50640773396086], 'name': 'Metropolitana I'}","{'latlong': [-42.78374566691811, -22.435006717319105], 'name': 'Macrorregião II'}",136
2017,"{'latlong': [-43.93088259914695, -22.50640773396086], 'name': 'Metropolitana I'}","{'latlong': [-43.93088259914695, -22.50640773396086], 'name': 'Metropolitana I'}",2651
2018,"{'latlong': [-41.74084505657541, -21.799306433880908], 'name': 'Macrorregião III'}","{'latlong': [-41.74084505657541, -21.799306433880908], 'name': 'Macrorregião III'}",2361
2018,"{'latlong': [-41.74084505657541, -21.799306433880908], 'name': 'Macrorregião III'}","{'latlong': [-42.78374566691811, -22.435006717319105], 'name': 'Macrorregião II'}",255
2018,"{'latlong': [-41.74084505657541, -21.799306433880908], 'name': 'Macrorregião III'}","{'latlong': [-43.93088259914695, -22.50640773396086], 'name': 'Metropolitana I'}",30
2018,"{'latlong': [-42.78374566691811, -22.435006717319105], 'name': 'Macrorregião II'}","{'latlong': [-41.74084505657541, -21.799306433880908], 'name': 'Macrorregião III'}",34
2018,"{'latlong': [-42.78374566691811, -22.435006717319105], 'name': 'Macrorregião II'}","{'latlong': [-42.78374566691811, -22.435006717319105], 'name': 'Macrorregião II'}",10400
2018,"{'latlong': [-42.78374566691811, -22.435006717319105], 'name': 'Macrorregião II'}","{'latlong': [-43.93088259914695, -22.50640773396086], 'name': 'Metropolitana I'}",119
2018,"{'latlong': [-43.93088259914695, -22.50640773396086], 'name': 'Metropolitana I'}","{'latlong': [-41.74084505657541, -21.799306433880908], 'name': 'Macrorregião III'}",1
2018,"{'latlong': [-43.93088259914695, -22.50640773396086], 'name': 'Metropolitana I'}","{'latlong': [-42.78374566691811, -22.435006717319105], 'name': 'Macrorregião II'}",194
2018,"{'latlong': [-43.93088259914695, -22.50640773396086], 'name': 'Metropolitana I'}","{'latlong': [-43.93088259914695, -22.50640773396086], 'name': 'Metropolitana I'}",2372
2019,"{'latlong': [-41.74084505657541, -21.799306433880908], 'name': 'Macrorregião III'}","{'latlong': [-41.74084505657541, -21.799306433880908], 'name': 'Macrorregião III'}",2584
2019,"{'latlong': [-41.74084505657541, -21.799306433880908], 'name': 'Macrorregião III'}","{'latlong': [-42.78374566691811, -22.435006717319105], 'name': 'Macrorregião II'}",297
2019,"{'latlong': [-41.74084505657541, -21.799306433880908], 'name': 'Macrorregião III'}","{'latlong': [-43.93088259914695, -22.50640773396086], 'name': 'Metropolitana I'}",29
2019,"{'latlong': [-42.78374566691811, -22.435006717319105], 'name': 'Macrorregião II'}","{'latlong': [-41.74084505657541, -21.799306433880908], 'name': 'Macrorregião III'}",33
2019,"{'latlong': [-42.78374566691811, -22.435006717319105], 'name': 'Macrorregião II'}","{'latlong': [-42.78374566691811, -22.435006717319105], 'name': 'Macrorregião II'}",9603
2019,"{'latlong': [-42.78374566691811, -22.435006717319105], 'name': 'Macrorregião II'}","{'latlong': [-43.93088259914695, -22.50640773396086], 'name': 'Metropolitana I'}",139
2019,"{'latlong': [-43.93088259914695, -22.50640773396086], 'name': 'Metropolitana I'}","{'latlong': [-41.74084505657541, -21.799306433880908], 'name': 'Macrorregião III'}",2
2019,"{'latlong': [-43.93088259914695, -22.50640773396086], 'name': 'Metropolitana I'}","{'latlong': [-42.78374566691811, -22.435006717319105], 'name': 'Macrorregião II'}",163
2019,"{'latlong': [-43.93088259914695, -22.50640773396086], 'name': 'Metropolitana I'}","{'latlong': [-43.93088259914695, -22.50640773396086], 'name': 'Metropolitana I'}",2327
2020,"{'latlong': [-41.74084505657541, -21.799306433880908], 'name': 'Macrorregião III'}","{'latlong': [-41.74084505657541, -21.799306433880908], 'name': 'Macrorregião III'}",830
2020,"{'latlong': [-41.74084505657541, -21.799306433880908], 'name': 'Macrorregião III'}","{'latlong': [-42.78374566691811, -22.435006717319105], 'name': 'Macrorregião II'}",86
2020,"{'latlong': [-41.74084505657541, -21.799306433880908], 'name': 'Macrorregião III'}","{'latlong': [-43.93088259914695, -22.50640773396086], 'name': 'Metropolitana I'}",10
2020,"{'latlong': [-42.78374566691811, -22.435006717319105], 'name': 'Macrorregião II'}","{'latlong': [-41.74084505657541, -21.799306433880908], 'name': 'Macrorregião III'}",20
2020,"{'latlong': [-42.78374566691811, -22.435006717319105], 'name': 'Macrorregião II'}","{'latlong': [-42.78374566691811, -22.435006717319105], 'name': 'Macrorregião II'}",2984
2020,"{'latlong': [-42.78374566691811, -22.435006717319105], 'name': 'Macrorregião II'}","{'latlong': [-43.93088259914695, -22.50640773396086], 'name': 'Metropolitana I'}",41
2020,"{'latlong': [-43.93088259914695, -22.50640773396086], 'name': 'Metropolitana I'}","{'latlong': [-41.74084505657541, -21.799306433880908], 'name': 'Macrorregião III'}",2
2020,"{'latlong': [-43.93088259914695, -22.50640773396086], 'name': 'Metropolitana I'}","{'latlong': [-42.78374566691811, -22.435006717319105], 'name': 'Macrorregião II'}",50
2020,"{'latlong': [-43.93088259914695, -22.50640773396086], 'name': 'Metropolitana I'}","{'latlong': [-43.93088259914695, -22.50640773396086], 'name': 'Metropolitana I'}",741
