year,from,to,hospitalizations,distance
1998,"{'latlong': [-38.26279503575439, -5.2411729332342185], 'name': '5ª Macro - Litoral Leste/Jaguaribe'}","{'latlong': [-38.26279503575439, -5.2411729332342185], 'name': '5ª Macro - Litoral Leste/Jaguaribe'}",228,0.0
1998,"{'latlong': [-38.26279503575439, -5.2411729332342185], 'name': '5ª Macro - Litoral Leste/Jaguaribe'}","{'latlong': [-39.04198570967633, -3.972272374155126], 'name': '1ª Macro - Fortaleza'}",115,140.29094146329456
1998,"{'latlong': [-38.26279503575439, -5.2411729332342185], 'name': '5ª Macro - Litoral Leste/Jaguaribe'}","{'latlong': [-39.4424043736871, -6.6823328399832285], 'name': '3ª Macro - Cariri'}",1,181.09845882673415
1998,"{'latlong': [-38.26279503575439, -5.2411729332342185], 'name': '5ª Macro - Litoral Leste/Jaguaribe'}","{'latlong': [-39.5970436535868, -5.3600126499898675], 'name': '4ª Macro - Sertão Central'}",1,148.47845738572832
1998,"{'latlong': [-38.26279503575439, -5.2411729332342185], 'name': '5ª Macro - Litoral Leste/Jaguaribe'}","{'latlong': [-40.49827164718406, -4.270228494122716], 'name': '2ª Macro - Sobral'}",1,261.9034991383947
1998,"{'latlong': [-39.04198570967633, -3.972272374155126], 'name': '1ª Macro - Fortaleza'}","{'latlong': [-38.26279503575439, -5.2411729332342185], 'name': '5ª Macro - Litoral Leste/Jaguaribe'}",4,140.29094146329456
1998,"{'latlong': [-39.04198570967633, -3.972272374155126], 'name': '1ª Macro - Fortaleza'}","{'latlong': [-39.04198570967633, -3.972272374155126], 'name': '1ª Macro - Fortaleza'}",3756,0.0
1998,"{'latlong': [-39.04198570967633, -3.972272374155126], 'name': '1ª Macro - Fortaleza'}","{'latlong': [-39.4424043736871, -6.6823328399832285], 'name': '3ª Macro - Cariri'}",1,238.1362922408207
1998,"{'latlong': [-39.04198570967633, -3.972272374155126], 'name': '1ª Macro - Fortaleza'}","{'latlong': [-39.5970436535868, -5.3600126499898675], 'name': '4ª Macro - Sertão Central'}",2,134.60427573279884
1998,"{'latlong': [-39.04198570967633, -3.972272374155126], 'name': '1ª Macro - Fortaleza'}","{'latlong': [-40.49827164718406, -4.270228494122716], 'name': '2ª Macro - Sobral'}",1,163.69432955223883
1998,"{'latlong': [-39.4424043736871, -6.6823328399832285], 'name': '3ª Macro - Cariri'}","{'latlong': [-39.04198570967633, -3.972272374155126], 'name': '1ª Macro - Fortaleza'}",83,238.1362922408207
1998,"{'latlong': [-39.4424043736871, -6.6823328399832285], 'name': '3ª Macro - Cariri'}","{'latlong': [-39.4424043736871, -6.6823328399832285], 'name': '3ª Macro - Cariri'}",1021,0.0
1998,"{'latlong': [-39.5970436535868, -5.3600126499898675], 'name': '4ª Macro - Sertão Central'}","{'latlong': [-38.26279503575439, -5.2411729332342185], 'name': '5ª Macro - Litoral Leste/Jaguaribe'}",1,148.47845738572832
1998,"{'latlong': [-39.5970436535868, -5.3600126499898675], 'name': '4ª Macro - Sertão Central'}","{'latlong': [-39.04198570967633, -3.972272374155126], 'name': '1ª Macro - Fortaleza'}",102,134.60427573279884
1998,"{'latlong': [-39.5970436535868, -5.3600126499898675], 'name': '4ª Macro - Sertão Central'}","{'latlong': [-39.4424043736871, -6.6823328399832285], 'name': '3ª Macro - Cariri'}",3,114.99291452469504
1998,"{'latlong': [-39.5970436535868, -5.3600126499898675], 'name': '4ª Macro - Sertão Central'}","{'latlong': [-39.5970436535868, -5.3600126499898675], 'name': '4ª Macro - Sertão Central'}",454,0.0
1998,"{'latlong': [-39.5970436535868, -5.3600126499898675], 'name': '4ª Macro - Sertão Central'}","{'latlong': [-40.49827164718406, -4.270228494122716], 'name': '2ª Macro - Sobral'}",4,136.6063403884904
1998,"{'latlong': [-40.49827164718406, -4.270228494122716], 'name': '2ª Macro - Sobral'}","{'latlong': [-39.04198570967633, -3.972272374155126], 'name': '1ª Macro - Fortaleza'}",90,163.69432955223883
1998,"{'latlong': [-40.49827164718406, -4.270228494122716], 'name': '2ª Macro - Sobral'}","{'latlong': [-40.49827164718406, -4.270228494122716], 'name': '2ª Macro - Sobral'}",1063,0.0
1999,"{'latlong': [-38.26279503575439, -5.2411729332342185], 'name': '5ª Macro - Litoral Leste/Jaguaribe'}","{'latlong': [-38.26279503575439, -5.2411729332342185], 'name': '5ª Macro - Litoral Leste/Jaguaribe'}",328,0.0
1999,"{'latlong': [-38.26279503575439, -5.2411729332342185], 'name': '5ª Macro - Litoral Leste/Jaguaribe'}","{'latlong': [-39.04198570967633, -3.972272374155126], 'name': '1ª Macro - Fortaleza'}",129,140.29094146329456
1999,"{'latlong': [-38.26279503575439, -5.2411729332342185], 'name': '5ª Macro - Litoral Leste/Jaguaribe'}","{'latlong': [-39.5970436535868, -5.3600126499898675], 'name': '4ª Macro - Sertão Central'}",1,148.47845738572832
1999,"{'latlong': [-39.04198570967633, -3.972272374155126], 'name': '1ª Macro - Fortaleza'}","{'latlong': [-38.26279503575439, -5.2411729332342185], 'name': '5ª Macro - Litoral Leste/Jaguaribe'}",1,140.29094146329456
1999,"{'latlong': [-39.04198570967633, -3.972272374155126], 'name': '1ª Macro - Fortaleza'}","{'latlong': [-39.04198570967633, -3.972272374155126], 'name': '1ª Macro - Fortaleza'}",4002,0.0
1999,"{'latlong': [-39.04198570967633, -3.972272374155126], 'name': '1ª Macro - Fortaleza'}","{'latlong': [-40.49827164718406, -4.270228494122716], 'name': '2ª Macro - Sobral'}",4,163.69432955223883
1999,"{'latlong': [-39.4424043736871, -6.6823328399832285], 'name': '3ª Macro - Cariri'}","{'latlong': [-39.04198570967633, -3.972272374155126], 'name': '1ª Macro - Fortaleza'}",78,238.1362922408207
1999,"{'latlong': [-39.4424043736871, -6.6823328399832285], 'name': '3ª Macro - Cariri'}","{'latlong': [-39.4424043736871, -6.6823328399832285], 'name': '3ª Macro - Cariri'}",1123,0.0
1999,"{'latlong': [-39.5970436535868, -5.3600126499898675], 'name': '4ª Macro - Sertão Central'}","{'latlong': [-38.26279503575439, -5.2411729332342185], 'name': '5ª Macro - Litoral Leste/Jaguaribe'}",3,148.47845738572832
1999,"{'latlong': [-39.5970436535868, -5.3600126499898675], 'name': '4ª Macro - Sertão Central'}","{'latlong': [-39.04198570967633, -3.972272374155126], 'name': '1ª Macro - Fortaleza'}",140,134.60427573279884
1999,"{'latlong': [-39.5970436535868, -5.3600126499898675], 'name': '4ª Macro - Sertão Central'}","{'latlong': [-39.4424043736871, -6.6823328399832285], 'name': '3ª Macro - Cariri'}",8,114.99291452469504
1999,"{'latlong': [-39.5970436535868, -5.3600126499898675], 'name': '4ª Macro - Sertão Central'}","{'latlong': [-39.5970436535868, -5.3600126499898675], 'name': '4ª Macro - Sertão Central'}",383,0.0
1999,"{'latlong': [-39.5970436535868, -5.3600126499898675], 'name': '4ª Macro - Sertão Central'}","{'latlong': [-40.49827164718406, -4.270228494122716], 'name': '2ª Macro - Sobral'}",7,136.6063403884904
1999,"{'latlong': [-40.49827164718406, -4.270228494122716], 'name': '2ª Macro - Sobral'}","{'latlong': [-39.04198570967633, -3.972272374155126], 'name': '1ª Macro - Fortaleza'}",75,163.69432955223883
1999,"{'latlong': [-40.49827164718406, -4.270228494122716], 'name': '2ª Macro - Sobral'}","{'latlong': [-40.49827164718406, -4.270228494122716], 'name': '2ª Macro - Sobral'}",1017,0.0
2000,"{'latlong': [-38.26279503575439, -5.2411729332342185], 'name': '5ª Macro - Litoral Leste/Jaguaribe'}","{'latlong': [-38.26279503575439, -5.2411729332342185], 'name': '5ª Macro - Litoral Leste/Jaguaribe'}",289,0.0
2000,"{'latlong': [-38.26279503575439, -5.2411729332342185], 'name': '5ª Macro - Litoral Leste/Jaguaribe'}","{'latlong': [-39.04198570967633, -3.972272374155126], 'name': '1ª Macro - Fortaleza'}",160,140.29094146329456
2000,"{'latlong': [-39.04198570967633, -3.972272374155126], 'name': '1ª Macro - Fortaleza'}","{'latlong': [-39.04198570967633, -3.972272374155126], 'name': '1ª Macro - Fortaleza'}",4716,0.0
2000,"{'latlong': [-39.04198570967633, -3.972272374155126], 'name': '1ª Macro - Fortaleza'}","{'latlong': [-39.4424043736871, -6.6823328399832285], 'name': '3ª Macro - Cariri'}",2,238.1362922408207
2000,"{'latlong': [-39.4424043736871, -6.6823328399832285], 'name': '3ª Macro - Cariri'}","{'latlong': [-39.04198570967633, -3.972272374155126], 'name': '1ª Macro - Fortaleza'}",98,238.1362922408207
2000,"{'latlong': [-39.4424043736871, -6.6823328399832285], 'name': '3ª Macro - Cariri'}","{'latlong': [-39.4424043736871, -6.6823328399832285], 'name': '3ª Macro - Cariri'}",1299,0.0
2000,"{'latlong': [-39.5970436535868, -5.3600126499898675], 'name': '4ª Macro - Sertão Central'}","{'latlong': [-38.26279503575439, -5.2411729332342185], 'name': '5ª Macro - Litoral Leste/Jaguaribe'}",9,148.47845738572832
2000,"{'latlong': [-39.5970436535868, -5.3600126499898675], 'name': '4ª Macro - Sertão Central'}","{'latlong': [-39.04198570967633, -3.972272374155126], 'name': '1ª Macro - Fortaleza'}",157,134.60427573279884
2000,"{'latlong': [-39.5970436535868, -5.3600126499898675], 'name': '4ª Macro - Sertão Central'}","{'latlong': [-39.4424043736871, -6.6823328399832285], 'name': '3ª Macro - Cariri'}",2,114.99291452469504
2000,"{'latlong': [-39.5970436535868, -5.3600126499898675], 'name': '4ª Macro - Sertão Central'}","{'latlong': [-39.5970436535868, -5.3600126499898675], 'name': '4ª Macro - Sertão Central'}",339,0.0
2000,"{'latlong': [-39.5970436535868, -5.3600126499898675], 'name': '4ª Macro - Sertão Central'}","{'latlong': [-40.49827164718406, -4.270228494122716], 'name': '2ª Macro - Sobral'}",1,136.6063403884904
2000,"{'latlong': [-40.49827164718406, -4.270228494122716], 'name': '2ª Macro - Sobral'}","{'latlong': [-39.04198570967633, -3.972272374155126], 'name': '1ª Macro - Fortaleza'}",148,163.69432955223883
2000,"{'latlong': [-40.49827164718406, -4.270228494122716], 'name': '2ª Macro - Sobral'}","{'latlong': [-40.49827164718406, -4.270228494122716], 'name': '2ª Macro - Sobral'}",960,0.0
2001,"{'latlong': [-38.26279503575439, -5.2411729332342185], 'name': '5ª Macro - Litoral Leste/Jaguaribe'}","{'latlong': [-38.26279503575439, -5.2411729332342185], 'name': '5ª Macro - Litoral Leste/Jaguaribe'}",385,0.0
2001,"{'latlong': [-38.26279503575439, -5.2411729332342185], 'name': '5ª Macro - Litoral Leste/Jaguaribe'}","{'latlong': [-39.04198570967633, -3.972272374155126], 'name': '1ª Macro - Fortaleza'}",168,140.29094146329456
2001,"{'latlong': [-39.04198570967633, -3.972272374155126], 'name': '1ª Macro - Fortaleza'}","{'latlong': [-38.26279503575439, -5.2411729332342185], 'name': '5ª Macro - Litoral Leste/Jaguaribe'}",3,140.29094146329456
2001,"{'latlong': [-39.04198570967633, -3.972272374155126], 'name': '1ª Macro - Fortaleza'}","{'latlong': [-39.04198570967633, -3.972272374155126], 'name': '1ª Macro - Fortaleza'}",4837,0.0
2001,"{'latlong': [-39.04198570967633, -3.972272374155126], 'name': '1ª Macro - Fortaleza'}","{'latlong': [-39.4424043736871, -6.6823328399832285], 'name': '3ª Macro - Cariri'}",1,238.1362922408207
2001,"{'latlong': [-39.04198570967633, -3.972272374155126], 'name': '1ª Macro - Fortaleza'}","{'latlong': [-39.5970436535868, -5.3600126499898675], 'name': '4ª Macro - Sertão Central'}",1,134.60427573279884
2001,"{'latlong': [-39.04198570967633, -3.972272374155126], 'name': '1ª Macro - Fortaleza'}","{'latlong': [-40.49827164718406, -4.270228494122716], 'name': '2ª Macro - Sobral'}",1,163.69432955223883
2001,"{'latlong': [-39.4424043736871, -6.6823328399832285], 'name': '3ª Macro - Cariri'}","{'latlong': [-39.04198570967633, -3.972272374155126], 'name': '1ª Macro - Fortaleza'}",103,238.1362922408207
2001,"{'latlong': [-39.4424043736871, -6.6823328399832285], 'name': '3ª Macro - Cariri'}","{'latlong': [-39.4424043736871, -6.6823328399832285], 'name': '3ª Macro - Cariri'}",1329,0.0
2001,"{'latlong': [-39.5970436535868, -5.3600126499898675], 'name': '4ª Macro - Sertão Central'}","{'latlong': [-38.26279503575439, -5.2411729332342185], 'name': '5ª Macro - Litoral Leste/Jaguaribe'}",8,148.47845738572832
2001,"{'latlong': [-39.5970436535868, -5.3600126499898675], 'name': '4ª Macro - Sertão Central'}","{'latlong': [-39.04198570967633, -3.972272374155126], 'name': '1ª Macro - Fortaleza'}",163,134.60427573279884
2001,"{'latlong': [-39.5970436535868, -5.3600126499898675], 'name': '4ª Macro - Sertão Central'}","{'latlong': [-39.4424043736871, -6.6823328399832285], 'name': '3ª Macro - Cariri'}",4,114.99291452469504
2001,"{'latlong': [-39.5970436535868, -5.3600126499898675], 'name': '4ª Macro - Sertão Central'}","{'latlong': [-39.5970436535868, -5.3600126499898675], 'name': '4ª Macro - Sertão Central'}",386,0.0
2001,"{'latlong': [-39.5970436535868, -5.3600126499898675], 'name': '4ª Macro - Sertão Central'}","{'latlong': [-40.49827164718406, -4.270228494122716], 'name': '2ª Macro - Sobral'}",1,136.6063403884904
2001,"{'latlong': [-40.49827164718406, -4.270228494122716], 'name': '2ª Macro - Sobral'}","{'latlong': [-38.26279503575439, -5.2411729332342185], 'name': '5ª Macro - Litoral Leste/Jaguaribe'}",1,261.9034991383947
2001,"{'latlong': [-40.49827164718406, -4.270228494122716], 'name': '2ª Macro - Sobral'}","{'latlong': [-39.04198570967633, -3.972272374155126], 'name': '1ª Macro - Fortaleza'}",164,163.69432955223883
2001,"{'latlong': [-40.49827164718406, -4.270228494122716], 'name': '2ª Macro - Sobral'}","{'latlong': [-40.49827164718406, -4.270228494122716], 'name': '2ª Macro - Sobral'}",1064,0.0
2002,"{'latlong': [-38.26279503575439, -5.2411729332342185], 'name': '5ª Macro - Litoral Leste/Jaguaribe'}","{'latlong': [-38.26279503575439, -5.2411729332342185], 'name': '5ª Macro - Litoral Leste/Jaguaribe'}",445,0.0
2002,"{'latlong': [-38.26279503575439, -5.2411729332342185], 'name': '5ª Macro - Litoral Leste/Jaguaribe'}","{'latlong': [-39.04198570967633, -3.972272374155126], 'name': '1ª Macro - Fortaleza'}",217,140.29094146329456
2002,"{'latlong': [-38.26279503575439, -5.2411729332342185], 'name': '5ª Macro - Litoral Leste/Jaguaribe'}","{'latlong': [-39.4424043736871, -6.6823328399832285], 'name': '3ª Macro - Cariri'}",1,181.09845882673415
2002,"{'latlong': [-39.04198570967633, -3.972272374155126], 'name': '1ª Macro - Fortaleza'}","{'latlong': [-38.26279503575439, -5.2411729332342185], 'name': '5ª Macro - Litoral Leste/Jaguaribe'}",3,140.29094146329456
2002,"{'latlong': [-39.04198570967633, -3.972272374155126], 'name': '1ª Macro - Fortaleza'}","{'latlong': [-39.04198570967633, -3.972272374155126], 'name': '1ª Macro - Fortaleza'}",5642,0.0
2002,"{'latlong': [-39.04198570967633, -3.972272374155126], 'name': '1ª Macro - Fortaleza'}","{'latlong': [-39.4424043736871, -6.6823328399832285], 'name': '3ª Macro - Cariri'}",1,238.1362922408207
2002,"{'latlong': [-39.04198570967633, -3.972272374155126], 'name': '1ª Macro - Fortaleza'}","{'latlong': [-39.5970436535868, -5.3600126499898675], 'name': '4ª Macro - Sertão Central'}",2,134.60427573279884
2002,"{'latlong': [-39.4424043736871, -6.6823328399832285], 'name': '3ª Macro - Cariri'}","{'latlong': [-39.04198570967633, -3.972272374155126], 'name': '1ª Macro - Fortaleza'}",143,238.1362922408207
2002,"{'latlong': [-39.4424043736871, -6.6823328399832285], 'name': '3ª Macro - Cariri'}","{'latlong': [-39.4424043736871, -6.6823328399832285], 'name': '3ª Macro - Cariri'}",1828,0.0
2002,"{'latlong': [-39.5970436535868, -5.3600126499898675], 'name': '4ª Macro - Sertão Central'}","{'latlong': [-38.26279503575439, -5.2411729332342185], 'name': '5ª Macro - Litoral Leste/Jaguaribe'}",10,148.47845738572832
2002,"{'latlong': [-39.5970436535868, -5.3600126499898675], 'name': '4ª Macro - Sertão Central'}","{'latlong': [-39.04198570967633, -3.972272374155126], 'name': '1ª Macro - Fortaleza'}",168,134.60427573279884
2002,"{'latlong': [-39.5970436535868, -5.3600126499898675], 'name': '4ª Macro - Sertão Central'}","{'latlong': [-39.4424043736871, -6.6823328399832285], 'name': '3ª Macro - Cariri'}",3,114.99291452469504
2002,"{'latlong': [-39.5970436535868, -5.3600126499898675], 'name': '4ª Macro - Sertão Central'}","{'latlong': [-39.5970436535868, -5.3600126499898675], 'name': '4ª Macro - Sertão Central'}",583,0.0
2002,"{'latlong': [-40.49827164718406, -4.270228494122716], 'name': '2ª Macro - Sobral'}","{'latlong': [-39.04198570967633, -3.972272374155126], 'name': '1ª Macro - Fortaleza'}",204,163.69432955223883
2002,"{'latlong': [-40.49827164718406, -4.270228494122716], 'name': '2ª Macro - Sobral'}","{'latlong': [-39.5970436535868, -5.3600126499898675], 'name': '4ª Macro - Sertão Central'}",1,136.6063403884904
2002,"{'latlong': [-40.49827164718406, -4.270228494122716], 'name': '2ª Macro - Sobral'}","{'latlong': [-40.49827164718406, -4.270228494122716], 'name': '2ª Macro - Sobral'}",1454,0.0
2003,"{'latlong': [-38.26279503575439, -5.2411729332342185], 'name': '5ª Macro - Litoral Leste/Jaguaribe'}","{'latlong': [-38.26279503575439, -5.2411729332342185], 'name': '5ª Macro - Litoral Leste/Jaguaribe'}",386,0.0
2003,"{'latlong': [-38.26279503575439, -5.2411729332342185], 'name': '5ª Macro - Litoral Leste/Jaguaribe'}","{'latlong': [-39.04198570967633, -3.972272374155126], 'name': '1ª Macro - Fortaleza'}",180,140.29094146329456
2003,"{'latlong': [-38.26279503575439, -5.2411729332342185], 'name': '5ª Macro - Litoral Leste/Jaguaribe'}","{'latlong': [-39.4424043736871, -6.6823328399832285], 'name': '3ª Macro - Cariri'}",1,181.09845882673415
2003,"{'latlong': [-38.26279503575439, -5.2411729332342185], 'name': '5ª Macro - Litoral Leste/Jaguaribe'}","{'latlong': [-39.5970436535868, -5.3600126499898675], 'name': '4ª Macro - Sertão Central'}",1,148.47845738572832
2003,"{'latlong': [-39.04198570967633, -3.972272374155126], 'name': '1ª Macro - Fortaleza'}","{'latlong': [-38.26279503575439, -5.2411729332342185], 'name': '5ª Macro - Litoral Leste/Jaguaribe'}",1,140.29094146329456
2003,"{'latlong': [-39.04198570967633, -3.972272374155126], 'name': '1ª Macro - Fortaleza'}","{'latlong': [-39.04198570967633, -3.972272374155126], 'name': '1ª Macro - Fortaleza'}",5112,0.0
2003,"{'latlong': [-39.04198570967633, -3.972272374155126], 'name': '1ª Macro - Fortaleza'}","{'latlong': [-39.5970436535868, -5.3600126499898675], 'name': '4ª Macro - Sertão Central'}",1,134.60427573279884
2003,"{'latlong': [-39.04198570967633, -3.972272374155126], 'name': '1ª Macro - Fortaleza'}","{'latlong': [-40.49827164718406, -4.270228494122716], 'name': '2ª Macro - Sobral'}",3,163.69432955223883
2003,"{'latlong': [-39.4424043736871, -6.6823328399832285], 'name': '3ª Macro - Cariri'}","{'latlong': [-39.04198570967633, -3.972272374155126], 'name': '1ª Macro - Fortaleza'}",125,238.1362922408207
2003,"{'latlong': [-39.4424043736871, -6.6823328399832285], 'name': '3ª Macro - Cariri'}","{'latlong': [-39.4424043736871, -6.6823328399832285], 'name': '3ª Macro - Cariri'}",1733,0.0
2003,"{'latlong': [-39.5970436535868, -5.3600126499898675], 'name': '4ª Macro - Sertão Central'}","{'latlong': [-38.26279503575439, -5.2411729332342185], 'name': '5ª Macro - Litoral Leste/Jaguaribe'}",5,148.47845738572832
2003,"{'latlong': [-39.5970436535868, -5.3600126499898675], 'name': '4ª Macro - Sertão Central'}","{'latlong': [-39.04198570967633, -3.972272374155126], 'name': '1ª Macro - Fortaleza'}",166,134.60427573279884
2003,"{'latlong': [-39.5970436535868, -5.3600126499898675], 'name': '4ª Macro - Sertão Central'}","{'latlong': [-39.5970436535868, -5.3600126499898675], 'name': '4ª Macro - Sertão Central'}",512,0.0
2003,"{'latlong': [-40.49827164718406, -4.270228494122716], 'name': '2ª Macro - Sobral'}","{'latlong': [-39.04198570967633, -3.972272374155126], 'name': '1ª Macro - Fortaleza'}",243,163.69432955223883
2003,"{'latlong': [-40.49827164718406, -4.270228494122716], 'name': '2ª Macro - Sobral'}","{'latlong': [-39.5970436535868, -5.3600126499898675], 'name': '4ª Macro - Sertão Central'}",1,136.6063403884904
2003,"{'latlong': [-40.49827164718406, -4.270228494122716], 'name': '2ª Macro - Sobral'}","{'latlong': [-40.49827164718406, -4.270228494122716], 'name': '2ª Macro - Sobral'}",1362,0.0
2004,"{'latlong': [-38.26279503575439, -5.2411729332342185], 'name': '5ª Macro - Litoral Leste/Jaguaribe'}","{'latlong': [-38.26279503575439, -5.2411729332342185], 'name': '5ª Macro - Litoral Leste/Jaguaribe'}",431,0.0
2004,"{'latlong': [-38.26279503575439, -5.2411729332342185], 'name': '5ª Macro - Litoral Leste/Jaguaribe'}","{'latlong': [-39.04198570967633, -3.972272374155126], 'name': '1ª Macro - Fortaleza'}",155,140.29094146329456
2004,"{'latlong': [-39.04198570967633, -3.972272374155126], 'name': '1ª Macro - Fortaleza'}","{'latlong': [-38.26279503575439, -5.2411729332342185], 'name': '5ª Macro - Litoral Leste/Jaguaribe'}",3,140.29094146329456
2004,"{'latlong': [-39.04198570967633, -3.972272374155126], 'name': '1ª Macro - Fortaleza'}","{'latlong': [-39.04198570967633, -3.972272374155126], 'name': '1ª Macro - Fortaleza'}",5488,0.0
2004,"{'latlong': [-39.04198570967633, -3.972272374155126], 'name': '1ª Macro - Fortaleza'}","{'latlong': [-39.5970436535868, -5.3600126499898675], 'name': '4ª Macro - Sertão Central'}",2,134.60427573279884
2004,"{'latlong': [-39.04198570967633, -3.972272374155126], 'name': '1ª Macro - Fortaleza'}","{'latlong': [-40.49827164718406, -4.270228494122716], 'name': '2ª Macro - Sobral'}",1,163.69432955223883
2004,"{'latlong': [-39.4424043736871, -6.6823328399832285], 'name': '3ª Macro - Cariri'}","{'latlong': [-39.04198570967633, -3.972272374155126], 'name': '1ª Macro - Fortaleza'}",106,238.1362922408207
2004,"{'latlong': [-39.4424043736871, -6.6823328399832285], 'name': '3ª Macro - Cariri'}","{'latlong': [-39.4424043736871, -6.6823328399832285], 'name': '3ª Macro - Cariri'}",1704,0.0
2004,"{'latlong': [-39.5970436535868, -5.3600126499898675], 'name': '4ª Macro - Sertão Central'}","{'latlong': [-38.26279503575439, -5.2411729332342185], 'name': '5ª Macro - Litoral Leste/Jaguaribe'}",2,148.47845738572832
2004,"{'latlong': [-39.5970436535868, -5.3600126499898675], 'name': '4ª Macro - Sertão Central'}","{'latlong': [-39.04198570967633, -3.972272374155126], 'name': '1ª Macro - Fortaleza'}",178,134.60427573279884
2004,"{'latlong': [-39.5970436535868, -5.3600126499898675], 'name': '4ª Macro - Sertão Central'}","{'latlong': [-39.4424043736871, -6.6823328399832285], 'name': '3ª Macro - Cariri'}",2,114.99291452469504
2004,"{'latlong': [-39.5970436535868, -5.3600126499898675], 'name': '4ª Macro - Sertão Central'}","{'latlong': [-39.5970436535868, -5.3600126499898675], 'name': '4ª Macro - Sertão Central'}",437,0.0
2004,"{'latlong': [-40.49827164718406, -4.270228494122716], 'name': '2ª Macro - Sobral'}","{'latlong': [-39.04198570967633, -3.972272374155126], 'name': '1ª Macro - Fortaleza'}",203,163.69432955223883
2004,"{'latlong': [-40.49827164718406, -4.270228494122716], 'name': '2ª Macro - Sobral'}","{'latlong': [-39.5970436535868, -5.3600126499898675], 'name': '4ª Macro - Sertão Central'}",3,136.6063403884904
2004,"{'latlong': [-40.49827164718406, -4.270228494122716], 'name': '2ª Macro - Sobral'}","{'latlong': [-40.49827164718406, -4.270228494122716], 'name': '2ª Macro - Sobral'}",1479,0.0
2005,"{'latlong': [-38.26279503575439, -5.2411729332342185], 'name': '5ª Macro - Litoral Leste/Jaguaribe'}","{'latlong': [-38.26279503575439, -5.2411729332342185], 'name': '5ª Macro - Litoral Leste/Jaguaribe'}",424,0.0
2005,"{'latlong': [-38.26279503575439, -5.2411729332342185], 'name': '5ª Macro - Litoral Leste/Jaguaribe'}","{'latlong': [-39.04198570967633, -3.972272374155126], 'name': '1ª Macro - Fortaleza'}",163,140.29094146329456
2005,"{'latlong': [-38.26279503575439, -5.2411729332342185], 'name': '5ª Macro - Litoral Leste/Jaguaribe'}","{'latlong': [-39.4424043736871, -6.6823328399832285], 'name': '3ª Macro - Cariri'}",1,181.09845882673415
2005,"{'latlong': [-39.04198570967633, -3.972272374155126], 'name': '1ª Macro - Fortaleza'}","{'latlong': [-38.26279503575439, -5.2411729332342185], 'name': '5ª Macro - Litoral Leste/Jaguaribe'}",4,140.29094146329456
2005,"{'latlong': [-39.04198570967633, -3.972272374155126], 'name': '1ª Macro - Fortaleza'}","{'latlong': [-39.04198570967633, -3.972272374155126], 'name': '1ª Macro - Fortaleza'}",5219,0.0
2005,"{'latlong': [-39.04198570967633, -3.972272374155126], 'name': '1ª Macro - Fortaleza'}","{'latlong': [-40.49827164718406, -4.270228494122716], 'name': '2ª Macro - Sobral'}",1,163.69432955223883
2005,"{'latlong': [-39.4424043736871, -6.6823328399832285], 'name': '3ª Macro - Cariri'}","{'latlong': [-39.04198570967633, -3.972272374155126], 'name': '1ª Macro - Fortaleza'}",118,238.1362922408207
2005,"{'latlong': [-39.4424043736871, -6.6823328399832285], 'name': '3ª Macro - Cariri'}","{'latlong': [-39.4424043736871, -6.6823328399832285], 'name': '3ª Macro - Cariri'}",1744,0.0
2005,"{'latlong': [-39.4424043736871, -6.6823328399832285], 'name': '3ª Macro - Cariri'}","{'latlong': [-39.5970436535868, -5.3600126499898675], 'name': '4ª Macro - Sertão Central'}",1,114.99291452469504
2005,"{'latlong': [-39.5970436535868, -5.3600126499898675], 'name': '4ª Macro - Sertão Central'}","{'latlong': [-38.26279503575439, -5.2411729332342185], 'name': '5ª Macro - Litoral Leste/Jaguaribe'}",3,148.47845738572832
2005,"{'latlong': [-39.5970436535868, -5.3600126499898675], 'name': '4ª Macro - Sertão Central'}","{'latlong': [-39.04198570967633, -3.972272374155126], 'name': '1ª Macro - Fortaleza'}",130,134.60427573279884
2005,"{'latlong': [-39.5970436535868, -5.3600126499898675], 'name': '4ª Macro - Sertão Central'}","{'latlong': [-39.4424043736871, -6.6823328399832285], 'name': '3ª Macro - Cariri'}",1,114.99291452469504
2005,"{'latlong': [-39.5970436535868, -5.3600126499898675], 'name': '4ª Macro - Sertão Central'}","{'latlong': [-39.5970436535868, -5.3600126499898675], 'name': '4ª Macro - Sertão Central'}",435,0.0
2005,"{'latlong': [-39.5970436535868, -5.3600126499898675], 'name': '4ª Macro - Sertão Central'}","{'latlong': [-40.49827164718406, -4.270228494122716], 'name': '2ª Macro - Sobral'}",1,136.6063403884904
2005,"{'latlong': [-40.49827164718406, -4.270228494122716], 'name': '2ª Macro - Sobral'}","{'latlong': [-39.04198570967633, -3.972272374155126], 'name': '1ª Macro - Fortaleza'}",208,163.69432955223883
2005,"{'latlong': [-40.49827164718406, -4.270228494122716], 'name': '2ª Macro - Sobral'}","{'latlong': [-39.5970436535868, -5.3600126499898675], 'name': '4ª Macro - Sertão Central'}",1,136.6063403884904
2005,"{'latlong': [-40.49827164718406, -4.270228494122716], 'name': '2ª Macro - Sobral'}","{'latlong': [-40.49827164718406, -4.270228494122716], 'name': '2ª Macro - Sobral'}",1657,0.0
2006,"{'latlong': [-38.26279503575439, -5.2411729332342185], 'name': '5ª Macro - Litoral Leste/Jaguaribe'}","{'latlong': [-38.26279503575439, -5.2411729332342185], 'name': '5ª Macro - Litoral Leste/Jaguaribe'}",385,0.0
2006,"{'latlong': [-38.26279503575439, -5.2411729332342185], 'name': '5ª Macro - Litoral Leste/Jaguaribe'}","{'latlong': [-39.04198570967633, -3.972272374155126], 'name': '1ª Macro - Fortaleza'}",134,140.29094146329456
2006,"{'latlong': [-38.26279503575439, -5.2411729332342185], 'name': '5ª Macro - Litoral Leste/Jaguaribe'}","{'latlong': [-39.4424043736871, -6.6823328399832285], 'name': '3ª Macro - Cariri'}",2,181.09845882673415
2006,"{'latlong': [-38.26279503575439, -5.2411729332342185], 'name': '5ª Macro - Litoral Leste/Jaguaribe'}","{'latlong': [-40.49827164718406, -4.270228494122716], 'name': '2ª Macro - Sobral'}",1,261.9034991383947
2006,"{'latlong': [-39.04198570967633, -3.972272374155126], 'name': '1ª Macro - Fortaleza'}","{'latlong': [-38.26279503575439, -5.2411729332342185], 'name': '5ª Macro - Litoral Leste/Jaguaribe'}",4,140.29094146329456
2006,"{'latlong': [-39.04198570967633, -3.972272374155126], 'name': '1ª Macro - Fortaleza'}","{'latlong': [-39.04198570967633, -3.972272374155126], 'name': '1ª Macro - Fortaleza'}",4912,0.0
2006,"{'latlong': [-39.04198570967633, -3.972272374155126], 'name': '1ª Macro - Fortaleza'}","{'latlong': [-40.49827164718406, -4.270228494122716], 'name': '2ª Macro - Sobral'}",1,163.69432955223883
2006,"{'latlong': [-39.4424043736871, -6.6823328399832285], 'name': '3ª Macro - Cariri'}","{'latlong': [-39.04198570967633, -3.972272374155126], 'name': '1ª Macro - Fortaleza'}",116,238.1362922408207
2006,"{'latlong': [-39.4424043736871, -6.6823328399832285], 'name': '3ª Macro - Cariri'}","{'latlong': [-39.4424043736871, -6.6823328399832285], 'name': '3ª Macro - Cariri'}",1996,0.0
2006,"{'latlong': [-39.5970436535868, -5.3600126499898675], 'name': '4ª Macro - Sertão Central'}","{'latlong': [-38.26279503575439, -5.2411729332342185], 'name': '5ª Macro - Litoral Leste/Jaguaribe'}",4,148.47845738572832
2006,"{'latlong': [-39.5970436535868, -5.3600126499898675], 'name': '4ª Macro - Sertão Central'}","{'latlong': [-39.04198570967633, -3.972272374155126], 'name': '1ª Macro - Fortaleza'}",129,134.60427573279884
2006,"{'latlong': [-39.5970436535868, -5.3600126499898675], 'name': '4ª Macro - Sertão Central'}","{'latlong': [-39.4424043736871, -6.6823328399832285], 'name': '3ª Macro - Cariri'}",1,114.99291452469504
2006,"{'latlong': [-39.5970436535868, -5.3600126499898675], 'name': '4ª Macro - Sertão Central'}","{'latlong': [-39.5970436535868, -5.3600126499898675], 'name': '4ª Macro - Sertão Central'}",382,0.0
2006,"{'latlong': [-40.49827164718406, -4.270228494122716], 'name': '2ª Macro - Sobral'}","{'latlong': [-39.04198570967633, -3.972272374155126], 'name': '1ª Macro - Fortaleza'}",177,163.69432955223883
2006,"{'latlong': [-40.49827164718406, -4.270228494122716], 'name': '2ª Macro - Sobral'}","{'latlong': [-39.4424043736871, -6.6823328399832285], 'name': '3ª Macro - Cariri'}",1,237.07015549816794
2006,"{'latlong': [-40.49827164718406, -4.270228494122716], 'name': '2ª Macro - Sobral'}","{'latlong': [-39.5970436535868, -5.3600126499898675], 'name': '4ª Macro - Sertão Central'}",1,136.6063403884904
2006,"{'latlong': [-40.49827164718406, -4.270228494122716], 'name': '2ª Macro - Sobral'}","{'latlong': [-40.49827164718406, -4.270228494122716], 'name': '2ª Macro - Sobral'}",1536,0.0
2007,"{'latlong': [-38.26279503575439, -5.2411729332342185], 'name': '5ª Macro - Litoral Leste/Jaguaribe'}","{'latlong': [-38.26279503575439, -5.2411729332342185], 'name': '5ª Macro - Litoral Leste/Jaguaribe'}",378,0.0
2007,"{'latlong': [-38.26279503575439, -5.2411729332342185], 'name': '5ª Macro - Litoral Leste/Jaguaribe'}","{'latlong': [-39.04198570967633, -3.972272374155126], 'name': '1ª Macro - Fortaleza'}",139,140.29094146329456
2007,"{'latlong': [-39.04198570967633, -3.972272374155126], 'name': '1ª Macro - Fortaleza'}","{'latlong': [-38.26279503575439, -5.2411729332342185], 'name': '5ª Macro - Litoral Leste/Jaguaribe'}",2,140.29094146329456
2007,"{'latlong': [-39.04198570967633, -3.972272374155126], 'name': '1ª Macro - Fortaleza'}","{'latlong': [-39.04198570967633, -3.972272374155126], 'name': '1ª Macro - Fortaleza'}",5193,0.0
2007,"{'latlong': [-39.04198570967633, -3.972272374155126], 'name': '1ª Macro - Fortaleza'}","{'latlong': [-39.5970436535868, -5.3600126499898675], 'name': '4ª Macro - Sertão Central'}",1,134.60427573279884
2007,"{'latlong': [-39.4424043736871, -6.6823328399832285], 'name': '3ª Macro - Cariri'}","{'latlong': [-39.04198570967633, -3.972272374155126], 'name': '1ª Macro - Fortaleza'}",112,238.1362922408207
2007,"{'latlong': [-39.4424043736871, -6.6823328399832285], 'name': '3ª Macro - Cariri'}","{'latlong': [-39.4424043736871, -6.6823328399832285], 'name': '3ª Macro - Cariri'}",1920,0.0
2007,"{'latlong': [-39.4424043736871, -6.6823328399832285], 'name': '3ª Macro - Cariri'}","{'latlong': [-40.49827164718406, -4.270228494122716], 'name': '2ª Macro - Sobral'}",1,237.07015549816794
2007,"{'latlong': [-39.5970436535868, -5.3600126499898675], 'name': '4ª Macro - Sertão Central'}","{'latlong': [-38.26279503575439, -5.2411729332342185], 'name': '5ª Macro - Litoral Leste/Jaguaribe'}",1,148.47845738572832
2007,"{'latlong': [-39.5970436535868, -5.3600126499898675], 'name': '4ª Macro - Sertão Central'}","{'latlong': [-39.04198570967633, -3.972272374155126], 'name': '1ª Macro - Fortaleza'}",158,134.60427573279884
2007,"{'latlong': [-39.5970436535868, -5.3600126499898675], 'name': '4ª Macro - Sertão Central'}","{'latlong': [-39.5970436535868, -5.3600126499898675], 'name': '4ª Macro - Sertão Central'}",375,0.0
2007,"{'latlong': [-39.5970436535868, -5.3600126499898675], 'name': '4ª Macro - Sertão Central'}","{'latlong': [-40.49827164718406, -4.270228494122716], 'name': '2ª Macro - Sobral'}",2,136.6063403884904
2007,"{'latlong': [-40.49827164718406, -4.270228494122716], 'name': '2ª Macro - Sobral'}","{'latlong': [-39.04198570967633, -3.972272374155126], 'name': '1ª Macro - Fortaleza'}",160,163.69432955223883
2007,"{'latlong': [-40.49827164718406, -4.270228494122716], 'name': '2ª Macro - Sobral'}","{'latlong': [-39.5970436535868, -5.3600126499898675], 'name': '4ª Macro - Sertão Central'}",5,136.6063403884904
2007,"{'latlong': [-40.49827164718406, -4.270228494122716], 'name': '2ª Macro - Sobral'}","{'latlong': [-40.49827164718406, -4.270228494122716], 'name': '2ª Macro - Sobral'}",1610,0.0
2008,"{'latlong': [-38.26279503575439, -5.2411729332342185], 'name': '5ª Macro - Litoral Leste/Jaguaribe'}","{'latlong': [-38.26279503575439, -5.2411729332342185], 'name': '5ª Macro - Litoral Leste/Jaguaribe'}",318,0.0
2008,"{'latlong': [-38.26279503575439, -5.2411729332342185], 'name': '5ª Macro - Litoral Leste/Jaguaribe'}","{'latlong': [-39.04198570967633, -3.972272374155126], 'name': '1ª Macro - Fortaleza'}",142,140.29094146329456
2008,"{'latlong': [-39.04198570967633, -3.972272374155126], 'name': '1ª Macro - Fortaleza'}","{'latlong': [-38.26279503575439, -5.2411729332342185], 'name': '5ª Macro - Litoral Leste/Jaguaribe'}",6,140.29094146329456
2008,"{'latlong': [-39.04198570967633, -3.972272374155126], 'name': '1ª Macro - Fortaleza'}","{'latlong': [-39.04198570967633, -3.972272374155126], 'name': '1ª Macro - Fortaleza'}",4929,0.0
2008,"{'latlong': [-39.04198570967633, -3.972272374155126], 'name': '1ª Macro - Fortaleza'}","{'latlong': [-39.4424043736871, -6.6823328399832285], 'name': '3ª Macro - Cariri'}",1,238.1362922408207
2008,"{'latlong': [-39.04198570967633, -3.972272374155126], 'name': '1ª Macro - Fortaleza'}","{'latlong': [-39.5970436535868, -5.3600126499898675], 'name': '4ª Macro - Sertão Central'}",2,134.60427573279884
2008,"{'latlong': [-39.04198570967633, -3.972272374155126], 'name': '1ª Macro - Fortaleza'}","{'latlong': [-40.49827164718406, -4.270228494122716], 'name': '2ª Macro - Sobral'}",1,163.69432955223883
2008,"{'latlong': [-39.4424043736871, -6.6823328399832285], 'name': '3ª Macro - Cariri'}","{'latlong': [-39.04198570967633, -3.972272374155126], 'name': '1ª Macro - Fortaleza'}",113,238.1362922408207
2008,"{'latlong': [-39.4424043736871, -6.6823328399832285], 'name': '3ª Macro - Cariri'}","{'latlong': [-39.4424043736871, -6.6823328399832285], 'name': '3ª Macro - Cariri'}",1376,0.0
2008,"{'latlong': [-39.4424043736871, -6.6823328399832285], 'name': '3ª Macro - Cariri'}","{'latlong': [-39.5970436535868, -5.3600126499898675], 'name': '4ª Macro - Sertão Central'}",1,114.99291452469504
2008,"{'latlong': [-39.5970436535868, -5.3600126499898675], 'name': '4ª Macro - Sertão Central'}","{'latlong': [-39.04198570967633, -3.972272374155126], 'name': '1ª Macro - Fortaleza'}",152,134.60427573279884
2008,"{'latlong': [-39.5970436535868, -5.3600126499898675], 'name': '4ª Macro - Sertão Central'}","{'latlong': [-39.4424043736871, -6.6823328399832285], 'name': '3ª Macro - Cariri'}",1,114.99291452469504
2008,"{'latlong': [-39.5970436535868, -5.3600126499898675], 'name': '4ª Macro - Sertão Central'}","{'latlong': [-39.5970436535868, -5.3600126499898675], 'name': '4ª Macro - Sertão Central'}",355,0.0
2008,"{'latlong': [-40.49827164718406, -4.270228494122716], 'name': '2ª Macro - Sobral'}","{'latlong': [-39.04198570967633, -3.972272374155126], 'name': '1ª Macro - Fortaleza'}",137,163.69432955223883
2008,"{'latlong': [-40.49827164718406, -4.270228494122716], 'name': '2ª Macro - Sobral'}","{'latlong': [-39.5970436535868, -5.3600126499898675], 'name': '4ª Macro - Sertão Central'}",2,136.6063403884904
2008,"{'latlong': [-40.49827164718406, -4.270228494122716], 'name': '2ª Macro - Sobral'}","{'latlong': [-40.49827164718406, -4.270228494122716], 'name': '2ª Macro - Sobral'}",1191,0.0
2009,"{'latlong': [-38.26279503575439, -5.2411729332342185], 'name': '5ª Macro - Litoral Leste/Jaguaribe'}","{'latlong': [-38.26279503575439, -5.2411729332342185], 'name': '5ª Macro - Litoral Leste/Jaguaribe'}",319,0.0
2009,"{'latlong': [-38.26279503575439, -5.2411729332342185], 'name': '5ª Macro - Litoral Leste/Jaguaribe'}","{'latlong': [-39.04198570967633, -3.972272374155126], 'name': '1ª Macro - Fortaleza'}",109,140.29094146329456
2009,"{'latlong': [-38.26279503575439, -5.2411729332342185], 'name': '5ª Macro - Litoral Leste/Jaguaribe'}","{'latlong': [-40.49827164718406, -4.270228494122716], 'name': '2ª Macro - Sobral'}",1,261.9034991383947
2009,"{'latlong': [-39.04198570967633, -3.972272374155126], 'name': '1ª Macro - Fortaleza'}","{'latlong': [-38.26279503575439, -5.2411729332342185], 'name': '5ª Macro - Litoral Leste/Jaguaribe'}",3,140.29094146329456
2009,"{'latlong': [-39.04198570967633, -3.972272374155126], 'name': '1ª Macro - Fortaleza'}","{'latlong': [-39.04198570967633, -3.972272374155126], 'name': '1ª Macro - Fortaleza'}",3666,0.0
2009,"{'latlong': [-39.04198570967633, -3.972272374155126], 'name': '1ª Macro - Fortaleza'}","{'latlong': [-39.5970436535868, -5.3600126499898675], 'name': '4ª Macro - Sertão Central'}",1,134.60427573279884
2009,"{'latlong': [-39.04198570967633, -3.972272374155126], 'name': '1ª Macro - Fortaleza'}","{'latlong': [-40.49827164718406, -4.270228494122716], 'name': '2ª Macro - Sobral'}",3,163.69432955223883
2009,"{'latlong': [-39.4424043736871, -6.6823328399832285], 'name': '3ª Macro - Cariri'}","{'latlong': [-39.04198570967633, -3.972272374155126], 'name': '1ª Macro - Fortaleza'}",91,238.1362922408207
2009,"{'latlong': [-39.4424043736871, -6.6823328399832285], 'name': '3ª Macro - Cariri'}","{'latlong': [-39.4424043736871, -6.6823328399832285], 'name': '3ª Macro - Cariri'}",701,0.0
2009,"{'latlong': [-39.4424043736871, -6.6823328399832285], 'name': '3ª Macro - Cariri'}","{'latlong': [-39.5970436535868, -5.3600126499898675], 'name': '4ª Macro - Sertão Central'}",1,114.99291452469504
2009,"{'latlong': [-39.5970436535868, -5.3600126499898675], 'name': '4ª Macro - Sertão Central'}","{'latlong': [-39.04198570967633, -3.972272374155126], 'name': '1ª Macro - Fortaleza'}",144,134.60427573279884
2009,"{'latlong': [-39.5970436535868, -5.3600126499898675], 'name': '4ª Macro - Sertão Central'}","{'latlong': [-39.5970436535868, -5.3600126499898675], 'name': '4ª Macro - Sertão Central'}",369,0.0
2009,"{'latlong': [-40.49827164718406, -4.270228494122716], 'name': '2ª Macro - Sobral'}","{'latlong': [-39.04198570967633, -3.972272374155126], 'name': '1ª Macro - Fortaleza'}",99,163.69432955223883
2009,"{'latlong': [-40.49827164718406, -4.270228494122716], 'name': '2ª Macro - Sobral'}","{'latlong': [-39.5970436535868, -5.3600126499898675], 'name': '4ª Macro - Sertão Central'}",1,136.6063403884904
2009,"{'latlong': [-40.49827164718406, -4.270228494122716], 'name': '2ª Macro - Sobral'}","{'latlong': [-40.49827164718406, -4.270228494122716], 'name': '2ª Macro - Sobral'}",738,0.0
2010,"{'latlong': [-38.26279503575439, -5.2411729332342185], 'name': '5ª Macro - Litoral Leste/Jaguaribe'}","{'latlong': [-38.26279503575439, -5.2411729332342185], 'name': '5ª Macro - Litoral Leste/Jaguaribe'}",326,0.0
2010,"{'latlong': [-38.26279503575439, -5.2411729332342185], 'name': '5ª Macro - Litoral Leste/Jaguaribe'}","{'latlong': [-39.04198570967633, -3.972272374155126], 'name': '1ª Macro - Fortaleza'}",169,140.29094146329456
2010,"{'latlong': [-39.04198570967633, -3.972272374155126], 'name': '1ª Macro - Fortaleza'}","{'latlong': [-38.26279503575439, -5.2411729332342185], 'name': '5ª Macro - Litoral Leste/Jaguaribe'}",2,140.29094146329456
2010,"{'latlong': [-39.04198570967633, -3.972272374155126], 'name': '1ª Macro - Fortaleza'}","{'latlong': [-39.04198570967633, -3.972272374155126], 'name': '1ª Macro - Fortaleza'}",3816,0.0
2010,"{'latlong': [-39.04198570967633, -3.972272374155126], 'name': '1ª Macro - Fortaleza'}","{'latlong': [-39.5970436535868, -5.3600126499898675], 'name': '4ª Macro - Sertão Central'}",1,134.60427573279884
2010,"{'latlong': [-39.04198570967633, -3.972272374155126], 'name': '1ª Macro - Fortaleza'}","{'latlong': [-40.49827164718406, -4.270228494122716], 'name': '2ª Macro - Sobral'}",1,163.69432955223883
2010,"{'latlong': [-39.4424043736871, -6.6823328399832285], 'name': '3ª Macro - Cariri'}","{'latlong': [-39.04198570967633, -3.972272374155126], 'name': '1ª Macro - Fortaleza'}",107,238.1362922408207
2010,"{'latlong': [-39.4424043736871, -6.6823328399832285], 'name': '3ª Macro - Cariri'}","{'latlong': [-39.4424043736871, -6.6823328399832285], 'name': '3ª Macro - Cariri'}",814,0.0
2010,"{'latlong': [-39.5970436535868, -5.3600126499898675], 'name': '4ª Macro - Sertão Central'}","{'latlong': [-38.26279503575439, -5.2411729332342185], 'name': '5ª Macro - Litoral Leste/Jaguaribe'}",1,148.47845738572832
2010,"{'latlong': [-39.5970436535868, -5.3600126499898675], 'name': '4ª Macro - Sertão Central'}","{'latlong': [-39.04198570967633, -3.972272374155126], 'name': '1ª Macro - Fortaleza'}",125,134.60427573279884
2010,"{'latlong': [-39.5970436535868, -5.3600126499898675], 'name': '4ª Macro - Sertão Central'}","{'latlong': [-39.4424043736871, -6.6823328399832285], 'name': '3ª Macro - Cariri'}",1,114.99291452469504
2010,"{'latlong': [-39.5970436535868, -5.3600126499898675], 'name': '4ª Macro - Sertão Central'}","{'latlong': [-39.5970436535868, -5.3600126499898675], 'name': '4ª Macro - Sertão Central'}",325,0.0
2010,"{'latlong': [-40.49827164718406, -4.270228494122716], 'name': '2ª Macro - Sobral'}","{'latlong': [-39.04198570967633, -3.972272374155126], 'name': '1ª Macro - Fortaleza'}",131,163.69432955223883
2010,"{'latlong': [-40.49827164718406, -4.270228494122716], 'name': '2ª Macro - Sobral'}","{'latlong': [-39.5970436535868, -5.3600126499898675], 'name': '4ª Macro - Sertão Central'}",2,136.6063403884904
2010,"{'latlong': [-40.49827164718406, -4.270228494122716], 'name': '2ª Macro - Sobral'}","{'latlong': [-40.49827164718406, -4.270228494122716], 'name': '2ª Macro - Sobral'}",585,0.0
2011,"{'latlong': [-38.26279503575439, -5.2411729332342185], 'name': '5ª Macro - Litoral Leste/Jaguaribe'}","{'latlong': [-38.26279503575439, -5.2411729332342185], 'name': '5ª Macro - Litoral Leste/Jaguaribe'}",245,0.0
2011,"{'latlong': [-38.26279503575439, -5.2411729332342185], 'name': '5ª Macro - Litoral Leste/Jaguaribe'}","{'latlong': [-39.04198570967633, -3.972272374155126], 'name': '1ª Macro - Fortaleza'}",144,140.29094146329456
2011,"{'latlong': [-38.26279503575439, -5.2411729332342185], 'name': '5ª Macro - Litoral Leste/Jaguaribe'}","{'latlong': [-39.5970436535868, -5.3600126499898675], 'name': '4ª Macro - Sertão Central'}",1,148.47845738572832
2011,"{'latlong': [-39.04198570967633, -3.972272374155126], 'name': '1ª Macro - Fortaleza'}","{'latlong': [-38.26279503575439, -5.2411729332342185], 'name': '5ª Macro - Litoral Leste/Jaguaribe'}",1,140.29094146329456
2011,"{'latlong': [-39.04198570967633, -3.972272374155126], 'name': '1ª Macro - Fortaleza'}","{'latlong': [-39.04198570967633, -3.972272374155126], 'name': '1ª Macro - Fortaleza'}",3510,0.0
2011,"{'latlong': [-39.04198570967633, -3.972272374155126], 'name': '1ª Macro - Fortaleza'}","{'latlong': [-39.5970436535868, -5.3600126499898675], 'name': '4ª Macro - Sertão Central'}",1,134.60427573279884
2011,"{'latlong': [-39.04198570967633, -3.972272374155126], 'name': '1ª Macro - Fortaleza'}","{'latlong': [-40.49827164718406, -4.270228494122716], 'name': '2ª Macro - Sobral'}",2,163.69432955223883
2011,"{'latlong': [-39.4424043736871, -6.6823328399832285], 'name': '3ª Macro - Cariri'}","{'latlong': [-39.04198570967633, -3.972272374155126], 'name': '1ª Macro - Fortaleza'}",98,238.1362922408207
2011,"{'latlong': [-39.4424043736871, -6.6823328399832285], 'name': '3ª Macro - Cariri'}","{'latlong': [-39.4424043736871, -6.6823328399832285], 'name': '3ª Macro - Cariri'}",721,0.0
2011,"{'latlong': [-39.5970436535868, -5.3600126499898675], 'name': '4ª Macro - Sertão Central'}","{'latlong': [-38.26279503575439, -5.2411729332342185], 'name': '5ª Macro - Litoral Leste/Jaguaribe'}",2,148.47845738572832
2011,"{'latlong': [-39.5970436535868, -5.3600126499898675], 'name': '4ª Macro - Sertão Central'}","{'latlong': [-39.04198570967633, -3.972272374155126], 'name': '1ª Macro - Fortaleza'}",132,134.60427573279884
2011,"{'latlong': [-39.5970436535868, -5.3600126499898675], 'name': '4ª Macro - Sertão Central'}","{'latlong': [-39.5970436535868, -5.3600126499898675], 'name': '4ª Macro - Sertão Central'}",297,0.0
2011,"{'latlong': [-40.49827164718406, -4.270228494122716], 'name': '2ª Macro - Sobral'}","{'latlong': [-39.04198570967633, -3.972272374155126], 'name': '1ª Macro - Fortaleza'}",115,163.69432955223883
2011,"{'latlong': [-40.49827164718406, -4.270228494122716], 'name': '2ª Macro - Sobral'}","{'latlong': [-39.5970436535868, -5.3600126499898675], 'name': '4ª Macro - Sertão Central'}",4,136.6063403884904
2011,"{'latlong': [-40.49827164718406, -4.270228494122716], 'name': '2ª Macro - Sobral'}","{'latlong': [-40.49827164718406, -4.270228494122716], 'name': '2ª Macro - Sobral'}",640,0.0
2012,"{'latlong': [-38.26279503575439, -5.2411729332342185], 'name': '5ª Macro - Litoral Leste/Jaguaribe'}","{'latlong': [-38.26279503575439, -5.2411729332342185], 'name': '5ª Macro - Litoral Leste/Jaguaribe'}",242,0.0
2012,"{'latlong': [-38.26279503575439, -5.2411729332342185], 'name': '5ª Macro - Litoral Leste/Jaguaribe'}","{'latlong': [-39.04198570967633, -3.972272374155126], 'name': '1ª Macro - Fortaleza'}",156,140.29094146329456
2012,"{'latlong': [-38.26279503575439, -5.2411729332342185], 'name': '5ª Macro - Litoral Leste/Jaguaribe'}","{'latlong': [-39.5970436535868, -5.3600126499898675], 'name': '4ª Macro - Sertão Central'}",1,148.47845738572832
2012,"{'latlong': [-39.04198570967633, -3.972272374155126], 'name': '1ª Macro - Fortaleza'}","{'latlong': [-38.26279503575439, -5.2411729332342185], 'name': '5ª Macro - Litoral Leste/Jaguaribe'}",3,140.29094146329456
2012,"{'latlong': [-39.04198570967633, -3.972272374155126], 'name': '1ª Macro - Fortaleza'}","{'latlong': [-39.04198570967633, -3.972272374155126], 'name': '1ª Macro - Fortaleza'}",3132,0.0
2012,"{'latlong': [-39.04198570967633, -3.972272374155126], 'name': '1ª Macro - Fortaleza'}","{'latlong': [-40.49827164718406, -4.270228494122716], 'name': '2ª Macro - Sobral'}",1,163.69432955223883
2012,"{'latlong': [-39.4424043736871, -6.6823328399832285], 'name': '3ª Macro - Cariri'}","{'latlong': [-39.04198570967633, -3.972272374155126], 'name': '1ª Macro - Fortaleza'}",108,238.1362922408207
2012,"{'latlong': [-39.4424043736871, -6.6823328399832285], 'name': '3ª Macro - Cariri'}","{'latlong': [-39.4424043736871, -6.6823328399832285], 'name': '3ª Macro - Cariri'}",719,0.0
2012,"{'latlong': [-39.5970436535868, -5.3600126499898675], 'name': '4ª Macro - Sertão Central'}","{'latlong': [-39.04198570967633, -3.972272374155126], 'name': '1ª Macro - Fortaleza'}",173,134.60427573279884
2012,"{'latlong': [-39.5970436535868, -5.3600126499898675], 'name': '4ª Macro - Sertão Central'}","{'latlong': [-39.5970436535868, -5.3600126499898675], 'name': '4ª Macro - Sertão Central'}",316,0.0
2012,"{'latlong': [-40.49827164718406, -4.270228494122716], 'name': '2ª Macro - Sobral'}","{'latlong': [-39.04198570967633, -3.972272374155126], 'name': '1ª Macro - Fortaleza'}",132,163.69432955223883
2012,"{'latlong': [-40.49827164718406, -4.270228494122716], 'name': '2ª Macro - Sobral'}","{'latlong': [-40.49827164718406, -4.270228494122716], 'name': '2ª Macro - Sobral'}",584,0.0
2013,"{'latlong': [-38.26279503575439, -5.2411729332342185], 'name': '5ª Macro - Litoral Leste/Jaguaribe'}","{'latlong': [-38.26279503575439, -5.2411729332342185], 'name': '5ª Macro - Litoral Leste/Jaguaribe'}",233,0.0
2013,"{'latlong': [-38.26279503575439, -5.2411729332342185], 'name': '5ª Macro - Litoral Leste/Jaguaribe'}","{'latlong': [-39.04198570967633, -3.972272374155126], 'name': '1ª Macro - Fortaleza'}",183,140.29094146329456
2013,"{'latlong': [-38.26279503575439, -5.2411729332342185], 'name': '5ª Macro - Litoral Leste/Jaguaribe'}","{'latlong': [-39.5970436535868, -5.3600126499898675], 'name': '4ª Macro - Sertão Central'}",1,148.47845738572832
2013,"{'latlong': [-39.04198570967633, -3.972272374155126], 'name': '1ª Macro - Fortaleza'}","{'latlong': [-38.26279503575439, -5.2411729332342185], 'name': '5ª Macro - Litoral Leste/Jaguaribe'}",2,140.29094146329456
2013,"{'latlong': [-39.04198570967633, -3.972272374155126], 'name': '1ª Macro - Fortaleza'}","{'latlong': [-39.04198570967633, -3.972272374155126], 'name': '1ª Macro - Fortaleza'}",3515,0.0
2013,"{'latlong': [-39.04198570967633, -3.972272374155126], 'name': '1ª Macro - Fortaleza'}","{'latlong': [-40.49827164718406, -4.270228494122716], 'name': '2ª Macro - Sobral'}",4,163.69432955223883
2013,"{'latlong': [-39.4424043736871, -6.6823328399832285], 'name': '3ª Macro - Cariri'}","{'latlong': [-39.04198570967633, -3.972272374155126], 'name': '1ª Macro - Fortaleza'}",134,238.1362922408207
2013,"{'latlong': [-39.4424043736871, -6.6823328399832285], 'name': '3ª Macro - Cariri'}","{'latlong': [-39.4424043736871, -6.6823328399832285], 'name': '3ª Macro - Cariri'}",831,0.0
2013,"{'latlong': [-39.5970436535868, -5.3600126499898675], 'name': '4ª Macro - Sertão Central'}","{'latlong': [-39.04198570967633, -3.972272374155126], 'name': '1ª Macro - Fortaleza'}",205,134.60427573279884
2013,"{'latlong': [-39.5970436535868, -5.3600126499898675], 'name': '4ª Macro - Sertão Central'}","{'latlong': [-39.4424043736871, -6.6823328399832285], 'name': '3ª Macro - Cariri'}",1,114.99291452469504
2013,"{'latlong': [-39.5970436535868, -5.3600126499898675], 'name': '4ª Macro - Sertão Central'}","{'latlong': [-39.5970436535868, -5.3600126499898675], 'name': '4ª Macro - Sertão Central'}",312,0.0
2013,"{'latlong': [-40.49827164718406, -4.270228494122716], 'name': '2ª Macro - Sobral'}","{'latlong': [-39.04198570967633, -3.972272374155126], 'name': '1ª Macro - Fortaleza'}",115,163.69432955223883
2013,"{'latlong': [-40.49827164718406, -4.270228494122716], 'name': '2ª Macro - Sobral'}","{'latlong': [-39.5970436535868, -5.3600126499898675], 'name': '4ª Macro - Sertão Central'}",3,136.6063403884904
2013,"{'latlong': [-40.49827164718406, -4.270228494122716], 'name': '2ª Macro - Sobral'}","{'latlong': [-40.49827164718406, -4.270228494122716], 'name': '2ª Macro - Sobral'}",573,0.0
2014,"{'latlong': [-38.26279503575439, -5.2411729332342185], 'name': '5ª Macro - Litoral Leste/Jaguaribe'}","{'latlong': [-38.26279503575439, -5.2411729332342185], 'name': '5ª Macro - Litoral Leste/Jaguaribe'}",280,0.0
2014,"{'latlong': [-38.26279503575439, -5.2411729332342185], 'name': '5ª Macro - Litoral Leste/Jaguaribe'}","{'latlong': [-39.04198570967633, -3.972272374155126], 'name': '1ª Macro - Fortaleza'}",204,140.29094146329456
2014,"{'latlong': [-38.26279503575439, -5.2411729332342185], 'name': '5ª Macro - Litoral Leste/Jaguaribe'}","{'latlong': [-40.49827164718406, -4.270228494122716], 'name': '2ª Macro - Sobral'}",2,261.9034991383947
2014,"{'latlong': [-39.04198570967633, -3.972272374155126], 'name': '1ª Macro - Fortaleza'}","{'latlong': [-38.26279503575439, -5.2411729332342185], 'name': '5ª Macro - Litoral Leste/Jaguaribe'}",6,140.29094146329456
2014,"{'latlong': [-39.04198570967633, -3.972272374155126], 'name': '1ª Macro - Fortaleza'}","{'latlong': [-39.04198570967633, -3.972272374155126], 'name': '1ª Macro - Fortaleza'}",3284,0.0
2014,"{'latlong': [-39.04198570967633, -3.972272374155126], 'name': '1ª Macro - Fortaleza'}","{'latlong': [-40.49827164718406, -4.270228494122716], 'name': '2ª Macro - Sobral'}",37,163.69432955223883
2014,"{'latlong': [-39.4424043736871, -6.6823328399832285], 'name': '3ª Macro - Cariri'}","{'latlong': [-39.04198570967633, -3.972272374155126], 'name': '1ª Macro - Fortaleza'}",141,238.1362922408207
2014,"{'latlong': [-39.4424043736871, -6.6823328399832285], 'name': '3ª Macro - Cariri'}","{'latlong': [-39.4424043736871, -6.6823328399832285], 'name': '3ª Macro - Cariri'}",1152,0.0
2014,"{'latlong': [-39.4424043736871, -6.6823328399832285], 'name': '3ª Macro - Cariri'}","{'latlong': [-40.49827164718406, -4.270228494122716], 'name': '2ª Macro - Sobral'}",4,237.07015549816794
2014,"{'latlong': [-39.5970436535868, -5.3600126499898675], 'name': '4ª Macro - Sertão Central'}","{'latlong': [-39.04198570967633, -3.972272374155126], 'name': '1ª Macro - Fortaleza'}",213,134.60427573279884
2014,"{'latlong': [-39.5970436535868, -5.3600126499898675], 'name': '4ª Macro - Sertão Central'}","{'latlong': [-39.4424043736871, -6.6823328399832285], 'name': '3ª Macro - Cariri'}",1,114.99291452469504
2014,"{'latlong': [-39.5970436535868, -5.3600126499898675], 'name': '4ª Macro - Sertão Central'}","{'latlong': [-39.5970436535868, -5.3600126499898675], 'name': '4ª Macro - Sertão Central'}",198,0.0
2014,"{'latlong': [-39.5970436535868, -5.3600126499898675], 'name': '4ª Macro - Sertão Central'}","{'latlong': [-40.49827164718406, -4.270228494122716], 'name': '2ª Macro - Sobral'}",4,136.6063403884904
2014,"{'latlong': [-40.49827164718406, -4.270228494122716], 'name': '2ª Macro - Sobral'}","{'latlong': [-39.04198570967633, -3.972272374155126], 'name': '1ª Macro - Fortaleza'}",135,163.69432955223883
2014,"{'latlong': [-40.49827164718406, -4.270228494122716], 'name': '2ª Macro - Sobral'}","{'latlong': [-39.4424043736871, -6.6823328399832285], 'name': '3ª Macro - Cariri'}",1,237.07015549816794
2014,"{'latlong': [-40.49827164718406, -4.270228494122716], 'name': '2ª Macro - Sobral'}","{'latlong': [-39.5970436535868, -5.3600126499898675], 'name': '4ª Macro - Sertão Central'}",1,136.6063403884904
2014,"{'latlong': [-40.49827164718406, -4.270228494122716], 'name': '2ª Macro - Sobral'}","{'latlong': [-40.49827164718406, -4.270228494122716], 'name': '2ª Macro - Sobral'}",977,0.0
2015,"{'latlong': [-38.26279503575439, -5.2411729332342185], 'name': '5ª Macro - Litoral Leste/Jaguaribe'}","{'latlong': [-38.26279503575439, -5.2411729332342185], 'name': '5ª Macro - Litoral Leste/Jaguaribe'}",201,0.0
2015,"{'latlong': [-38.26279503575439, -5.2411729332342185], 'name': '5ª Macro - Litoral Leste/Jaguaribe'}","{'latlong': [-39.04198570967633, -3.972272374155126], 'name': '1ª Macro - Fortaleza'}",228,140.29094146329456
2015,"{'latlong': [-38.26279503575439, -5.2411729332342185], 'name': '5ª Macro - Litoral Leste/Jaguaribe'}","{'latlong': [-40.49827164718406, -4.270228494122716], 'name': '2ª Macro - Sobral'}",2,261.9034991383947
2015,"{'latlong': [-39.04198570967633, -3.972272374155126], 'name': '1ª Macro - Fortaleza'}","{'latlong': [-38.26279503575439, -5.2411729332342185], 'name': '5ª Macro - Litoral Leste/Jaguaribe'}",2,140.29094146329456
2015,"{'latlong': [-39.04198570967633, -3.972272374155126], 'name': '1ª Macro - Fortaleza'}","{'latlong': [-39.04198570967633, -3.972272374155126], 'name': '1ª Macro - Fortaleza'}",3521,0.0
2015,"{'latlong': [-39.04198570967633, -3.972272374155126], 'name': '1ª Macro - Fortaleza'}","{'latlong': [-39.4424043736871, -6.6823328399832285], 'name': '3ª Macro - Cariri'}",2,238.1362922408207
2015,"{'latlong': [-39.04198570967633, -3.972272374155126], 'name': '1ª Macro - Fortaleza'}","{'latlong': [-39.5970436535868, -5.3600126499898675], 'name': '4ª Macro - Sertão Central'}",1,134.60427573279884
2015,"{'latlong': [-39.04198570967633, -3.972272374155126], 'name': '1ª Macro - Fortaleza'}","{'latlong': [-40.49827164718406, -4.270228494122716], 'name': '2ª Macro - Sobral'}",7,163.69432955223883
2015,"{'latlong': [-39.4424043736871, -6.6823328399832285], 'name': '3ª Macro - Cariri'}","{'latlong': [-39.04198570967633, -3.972272374155126], 'name': '1ª Macro - Fortaleza'}",127,238.1362922408207
2015,"{'latlong': [-39.4424043736871, -6.6823328399832285], 'name': '3ª Macro - Cariri'}","{'latlong': [-39.4424043736871, -6.6823328399832285], 'name': '3ª Macro - Cariri'}",926,0.0
2015,"{'latlong': [-39.4424043736871, -6.6823328399832285], 'name': '3ª Macro - Cariri'}","{'latlong': [-39.5970436535868, -5.3600126499898675], 'name': '4ª Macro - Sertão Central'}",1,114.99291452469504
2015,"{'latlong': [-39.5970436535868, -5.3600126499898675], 'name': '4ª Macro - Sertão Central'}","{'latlong': [-39.04198570967633, -3.972272374155126], 'name': '1ª Macro - Fortaleza'}",225,134.60427573279884
2015,"{'latlong': [-39.5970436535868, -5.3600126499898675], 'name': '4ª Macro - Sertão Central'}","{'latlong': [-39.5970436535868, -5.3600126499898675], 'name': '4ª Macro - Sertão Central'}",201,0.0
2015,"{'latlong': [-40.49827164718406, -4.270228494122716], 'name': '2ª Macro - Sobral'}","{'latlong': [-39.04198570967633, -3.972272374155126], 'name': '1ª Macro - Fortaleza'}",159,163.69432955223883
2015,"{'latlong': [-40.49827164718406, -4.270228494122716], 'name': '2ª Macro - Sobral'}","{'latlong': [-40.49827164718406, -4.270228494122716], 'name': '2ª Macro - Sobral'}",659,0.0
2016,"{'latlong': [-38.26279503575439, -5.2411729332342185], 'name': '5ª Macro - Litoral Leste/Jaguaribe'}","{'latlong': [-38.26279503575439, -5.2411729332342185], 'name': '5ª Macro - Litoral Leste/Jaguaribe'}",158,0.0
2016,"{'latlong': [-38.26279503575439, -5.2411729332342185], 'name': '5ª Macro - Litoral Leste/Jaguaribe'}","{'latlong': [-39.04198570967633, -3.972272374155126], 'name': '1ª Macro - Fortaleza'}",192,140.29094146329456
2016,"{'latlong': [-38.26279503575439, -5.2411729332342185], 'name': '5ª Macro - Litoral Leste/Jaguaribe'}","{'latlong': [-39.4424043736871, -6.6823328399832285], 'name': '3ª Macro - Cariri'}",2,181.09845882673415
2016,"{'latlong': [-39.04198570967633, -3.972272374155126], 'name': '1ª Macro - Fortaleza'}","{'latlong': [-39.04198570967633, -3.972272374155126], 'name': '1ª Macro - Fortaleza'}",3844,0.0
2016,"{'latlong': [-39.04198570967633, -3.972272374155126], 'name': '1ª Macro - Fortaleza'}","{'latlong': [-39.4424043736871, -6.6823328399832285], 'name': '3ª Macro - Cariri'}",1,238.1362922408207
2016,"{'latlong': [-39.04198570967633, -3.972272374155126], 'name': '1ª Macro - Fortaleza'}","{'latlong': [-39.5970436535868, -5.3600126499898675], 'name': '4ª Macro - Sertão Central'}",1,134.60427573279884
2016,"{'latlong': [-39.04198570967633, -3.972272374155126], 'name': '1ª Macro - Fortaleza'}","{'latlong': [-40.49827164718406, -4.270228494122716], 'name': '2ª Macro - Sobral'}",13,163.69432955223883
2016,"{'latlong': [-39.4424043736871, -6.6823328399832285], 'name': '3ª Macro - Cariri'}","{'latlong': [-39.04198570967633, -3.972272374155126], 'name': '1ª Macro - Fortaleza'}",100,238.1362922408207
2016,"{'latlong': [-39.4424043736871, -6.6823328399832285], 'name': '3ª Macro - Cariri'}","{'latlong': [-39.4424043736871, -6.6823328399832285], 'name': '3ª Macro - Cariri'}",1066,0.0
2016,"{'latlong': [-39.4424043736871, -6.6823328399832285], 'name': '3ª Macro - Cariri'}","{'latlong': [-39.5970436535868, -5.3600126499898675], 'name': '4ª Macro - Sertão Central'}",1,114.99291452469504
2016,"{'latlong': [-39.5970436535868, -5.3600126499898675], 'name': '4ª Macro - Sertão Central'}","{'latlong': [-39.04198570967633, -3.972272374155126], 'name': '1ª Macro - Fortaleza'}",206,134.60427573279884
2016,"{'latlong': [-39.5970436535868, -5.3600126499898675], 'name': '4ª Macro - Sertão Central'}","{'latlong': [-39.4424043736871, -6.6823328399832285], 'name': '3ª Macro - Cariri'}",1,114.99291452469504
2016,"{'latlong': [-39.5970436535868, -5.3600126499898675], 'name': '4ª Macro - Sertão Central'}","{'latlong': [-39.5970436535868, -5.3600126499898675], 'name': '4ª Macro - Sertão Central'}",220,0.0
2016,"{'latlong': [-40.49827164718406, -4.270228494122716], 'name': '2ª Macro - Sobral'}","{'latlong': [-39.04198570967633, -3.972272374155126], 'name': '1ª Macro - Fortaleza'}",155,163.69432955223883
2016,"{'latlong': [-40.49827164718406, -4.270228494122716], 'name': '2ª Macro - Sobral'}","{'latlong': [-40.49827164718406, -4.270228494122716], 'name': '2ª Macro - Sobral'}",611,0.0
2017,"{'latlong': [-38.26279503575439, -5.2411729332342185], 'name': '5ª Macro - Litoral Leste/Jaguaribe'}","{'latlong': [-38.26279503575439, -5.2411729332342185], 'name': '5ª Macro - Litoral Leste/Jaguaribe'}",122,0.0
2017,"{'latlong': [-38.26279503575439, -5.2411729332342185], 'name': '5ª Macro - Litoral Leste/Jaguaribe'}","{'latlong': [-39.04198570967633, -3.972272374155126], 'name': '1ª Macro - Fortaleza'}",155,140.29094146329456
2017,"{'latlong': [-38.26279503575439, -5.2411729332342185], 'name': '5ª Macro - Litoral Leste/Jaguaribe'}","{'latlong': [-39.5970436535868, -5.3600126499898675], 'name': '4ª Macro - Sertão Central'}",1,148.47845738572832
2017,"{'latlong': [-39.04198570967633, -3.972272374155126], 'name': '1ª Macro - Fortaleza'}","{'latlong': [-38.26279503575439, -5.2411729332342185], 'name': '5ª Macro - Litoral Leste/Jaguaribe'}",5,140.29094146329456
2017,"{'latlong': [-39.04198570967633, -3.972272374155126], 'name': '1ª Macro - Fortaleza'}","{'latlong': [-39.04198570967633, -3.972272374155126], 'name': '1ª Macro - Fortaleza'}",3489,0.0
2017,"{'latlong': [-39.04198570967633, -3.972272374155126], 'name': '1ª Macro - Fortaleza'}","{'latlong': [-39.4424043736871, -6.6823328399832285], 'name': '3ª Macro - Cariri'}",2,238.1362922408207
2017,"{'latlong': [-39.04198570967633, -3.972272374155126], 'name': '1ª Macro - Fortaleza'}","{'latlong': [-40.49827164718406, -4.270228494122716], 'name': '2ª Macro - Sobral'}",10,163.69432955223883
2017,"{'latlong': [-39.4424043736871, -6.6823328399832285], 'name': '3ª Macro - Cariri'}","{'latlong': [-39.04198570967633, -3.972272374155126], 'name': '1ª Macro - Fortaleza'}",80,238.1362922408207
2017,"{'latlong': [-39.4424043736871, -6.6823328399832285], 'name': '3ª Macro - Cariri'}","{'latlong': [-39.4424043736871, -6.6823328399832285], 'name': '3ª Macro - Cariri'}",802,0.0
2017,"{'latlong': [-39.4424043736871, -6.6823328399832285], 'name': '3ª Macro - Cariri'}","{'latlong': [-39.5970436535868, -5.3600126499898675], 'name': '4ª Macro - Sertão Central'}",3,114.99291452469504
2017,"{'latlong': [-39.5970436535868, -5.3600126499898675], 'name': '4ª Macro - Sertão Central'}","{'latlong': [-39.04198570967633, -3.972272374155126], 'name': '1ª Macro - Fortaleza'}",165,134.60427573279884
2017,"{'latlong': [-39.5970436535868, -5.3600126499898675], 'name': '4ª Macro - Sertão Central'}","{'latlong': [-39.4424043736871, -6.6823328399832285], 'name': '3ª Macro - Cariri'}",2,114.99291452469504
2017,"{'latlong': [-39.5970436535868, -5.3600126499898675], 'name': '4ª Macro - Sertão Central'}","{'latlong': [-39.5970436535868, -5.3600126499898675], 'name': '4ª Macro - Sertão Central'}",197,0.0
2017,"{'latlong': [-40.49827164718406, -4.270228494122716], 'name': '2ª Macro - Sobral'}","{'latlong': [-39.04198570967633, -3.972272374155126], 'name': '1ª Macro - Fortaleza'}",137,163.69432955223883
2017,"{'latlong': [-40.49827164718406, -4.270228494122716], 'name': '2ª Macro - Sobral'}","{'latlong': [-40.49827164718406, -4.270228494122716], 'name': '2ª Macro - Sobral'}",593,0.0
2018,"{'latlong': [-38.26279503575439, -5.2411729332342185], 'name': '5ª Macro - Litoral Leste/Jaguaribe'}","{'latlong': [-38.26279503575439, -5.2411729332342185], 'name': '5ª Macro - Litoral Leste/Jaguaribe'}",196,0.0
2018,"{'latlong': [-38.26279503575439, -5.2411729332342185], 'name': '5ª Macro - Litoral Leste/Jaguaribe'}","{'latlong': [-39.04198570967633, -3.972272374155126], 'name': '1ª Macro - Fortaleza'}",178,140.29094146329456
2018,"{'latlong': [-38.26279503575439, -5.2411729332342185], 'name': '5ª Macro - Litoral Leste/Jaguaribe'}","{'latlong': [-39.4424043736871, -6.6823328399832285], 'name': '3ª Macro - Cariri'}",3,181.09845882673415
2018,"{'latlong': [-38.26279503575439, -5.2411729332342185], 'name': '5ª Macro - Litoral Leste/Jaguaribe'}","{'latlong': [-39.5970436535868, -5.3600126499898675], 'name': '4ª Macro - Sertão Central'}",7,148.47845738572832
2018,"{'latlong': [-39.04198570967633, -3.972272374155126], 'name': '1ª Macro - Fortaleza'}","{'latlong': [-38.26279503575439, -5.2411729332342185], 'name': '5ª Macro - Litoral Leste/Jaguaribe'}",5,140.29094146329456
2018,"{'latlong': [-39.04198570967633, -3.972272374155126], 'name': '1ª Macro - Fortaleza'}","{'latlong': [-39.04198570967633, -3.972272374155126], 'name': '1ª Macro - Fortaleza'}",3454,0.0
2018,"{'latlong': [-39.04198570967633, -3.972272374155126], 'name': '1ª Macro - Fortaleza'}","{'latlong': [-39.5970436535868, -5.3600126499898675], 'name': '4ª Macro - Sertão Central'}",5,134.60427573279884
2018,"{'latlong': [-39.04198570967633, -3.972272374155126], 'name': '1ª Macro - Fortaleza'}","{'latlong': [-40.49827164718406, -4.270228494122716], 'name': '2ª Macro - Sobral'}",3,163.69432955223883
2018,"{'latlong': [-39.4424043736871, -6.6823328399832285], 'name': '3ª Macro - Cariri'}","{'latlong': [-39.04198570967633, -3.972272374155126], 'name': '1ª Macro - Fortaleza'}",100,238.1362922408207
2018,"{'latlong': [-39.4424043736871, -6.6823328399832285], 'name': '3ª Macro - Cariri'}","{'latlong': [-39.4424043736871, -6.6823328399832285], 'name': '3ª Macro - Cariri'}",1067,0.0
2018,"{'latlong': [-39.4424043736871, -6.6823328399832285], 'name': '3ª Macro - Cariri'}","{'latlong': [-39.5970436535868, -5.3600126499898675], 'name': '4ª Macro - Sertão Central'}",7,114.99291452469504
2018,"{'latlong': [-39.5970436535868, -5.3600126499898675], 'name': '4ª Macro - Sertão Central'}","{'latlong': [-38.26279503575439, -5.2411729332342185], 'name': '5ª Macro - Litoral Leste/Jaguaribe'}",1,148.47845738572832
2018,"{'latlong': [-39.5970436535868, -5.3600126499898675], 'name': '4ª Macro - Sertão Central'}","{'latlong': [-39.04198570967633, -3.972272374155126], 'name': '1ª Macro - Fortaleza'}",228,134.60427573279884
2018,"{'latlong': [-39.5970436535868, -5.3600126499898675], 'name': '4ª Macro - Sertão Central'}","{'latlong': [-39.4424043736871, -6.6823328399832285], 'name': '3ª Macro - Cariri'}",2,114.99291452469504
2018,"{'latlong': [-39.5970436535868, -5.3600126499898675], 'name': '4ª Macro - Sertão Central'}","{'latlong': [-39.5970436535868, -5.3600126499898675], 'name': '4ª Macro - Sertão Central'}",423,0.0
2018,"{'latlong': [-39.5970436535868, -5.3600126499898675], 'name': '4ª Macro - Sertão Central'}","{'latlong': [-40.49827164718406, -4.270228494122716], 'name': '2ª Macro - Sobral'}",7,136.6063403884904
2018,"{'latlong': [-40.49827164718406, -4.270228494122716], 'name': '2ª Macro - Sobral'}","{'latlong': [-39.04198570967633, -3.972272374155126], 'name': '1ª Macro - Fortaleza'}",160,163.69432955223883
2018,"{'latlong': [-40.49827164718406, -4.270228494122716], 'name': '2ª Macro - Sobral'}","{'latlong': [-39.4424043736871, -6.6823328399832285], 'name': '3ª Macro - Cariri'}",5,237.07015549816794
2018,"{'latlong': [-40.49827164718406, -4.270228494122716], 'name': '2ª Macro - Sobral'}","{'latlong': [-39.5970436535868, -5.3600126499898675], 'name': '4ª Macro - Sertão Central'}",8,136.6063403884904
2018,"{'latlong': [-40.49827164718406, -4.270228494122716], 'name': '2ª Macro - Sobral'}","{'latlong': [-40.49827164718406, -4.270228494122716], 'name': '2ª Macro - Sobral'}",711,0.0
2019,"{'latlong': [-38.26279503575439, -5.2411729332342185], 'name': '5ª Macro - Litoral Leste/Jaguaribe'}","{'latlong': [-38.26279503575439, -5.2411729332342185], 'name': '5ª Macro - Litoral Leste/Jaguaribe'}",149,0.0
2019,"{'latlong': [-38.26279503575439, -5.2411729332342185], 'name': '5ª Macro - Litoral Leste/Jaguaribe'}","{'latlong': [-39.04198570967633, -3.972272374155126], 'name': '1ª Macro - Fortaleza'}",213,140.29094146329456
2019,"{'latlong': [-38.26279503575439, -5.2411729332342185], 'name': '5ª Macro - Litoral Leste/Jaguaribe'}","{'latlong': [-39.5970436535868, -5.3600126499898675], 'name': '4ª Macro - Sertão Central'}",11,148.47845738572832
2019,"{'latlong': [-39.04198570967633, -3.972272374155126], 'name': '1ª Macro - Fortaleza'}","{'latlong': [-38.26279503575439, -5.2411729332342185], 'name': '5ª Macro - Litoral Leste/Jaguaribe'}",5,140.29094146329456
2019,"{'latlong': [-39.04198570967633, -3.972272374155126], 'name': '1ª Macro - Fortaleza'}","{'latlong': [-39.04198570967633, -3.972272374155126], 'name': '1ª Macro - Fortaleza'}",3958,0.0
2019,"{'latlong': [-39.04198570967633, -3.972272374155126], 'name': '1ª Macro - Fortaleza'}","{'latlong': [-39.5970436535868, -5.3600126499898675], 'name': '4ª Macro - Sertão Central'}",11,134.60427573279884
2019,"{'latlong': [-39.04198570967633, -3.972272374155126], 'name': '1ª Macro - Fortaleza'}","{'latlong': [-40.49827164718406, -4.270228494122716], 'name': '2ª Macro - Sobral'}",9,163.69432955223883
2019,"{'latlong': [-39.4424043736871, -6.6823328399832285], 'name': '3ª Macro - Cariri'}","{'latlong': [-39.04198570967633, -3.972272374155126], 'name': '1ª Macro - Fortaleza'}",96,238.1362922408207
2019,"{'latlong': [-39.4424043736871, -6.6823328399832285], 'name': '3ª Macro - Cariri'}","{'latlong': [-39.4424043736871, -6.6823328399832285], 'name': '3ª Macro - Cariri'}",972,0.0
2019,"{'latlong': [-39.4424043736871, -6.6823328399832285], 'name': '3ª Macro - Cariri'}","{'latlong': [-39.5970436535868, -5.3600126499898675], 'name': '4ª Macro - Sertão Central'}",3,114.99291452469504
2019,"{'latlong': [-39.5970436535868, -5.3600126499898675], 'name': '4ª Macro - Sertão Central'}","{'latlong': [-39.04198570967633, -3.972272374155126], 'name': '1ª Macro - Fortaleza'}",231,134.60427573279884
2019,"{'latlong': [-39.5970436535868, -5.3600126499898675], 'name': '4ª Macro - Sertão Central'}","{'latlong': [-39.4424043736871, -6.6823328399832285], 'name': '3ª Macro - Cariri'}",2,114.99291452469504
2019,"{'latlong': [-39.5970436535868, -5.3600126499898675], 'name': '4ª Macro - Sertão Central'}","{'latlong': [-39.5970436535868, -5.3600126499898675], 'name': '4ª Macro - Sertão Central'}",593,0.0
2019,"{'latlong': [-39.5970436535868, -5.3600126499898675], 'name': '4ª Macro - Sertão Central'}","{'latlong': [-40.49827164718406, -4.270228494122716], 'name': '2ª Macro - Sobral'}",2,136.6063403884904
2019,"{'latlong': [-40.49827164718406, -4.270228494122716], 'name': '2ª Macro - Sobral'}","{'latlong': [-39.04198570967633, -3.972272374155126], 'name': '1ª Macro - Fortaleza'}",175,163.69432955223883
2019,"{'latlong': [-40.49827164718406, -4.270228494122716], 'name': '2ª Macro - Sobral'}","{'latlong': [-39.5970436535868, -5.3600126499898675], 'name': '4ª Macro - Sertão Central'}",8,136.6063403884904
2019,"{'latlong': [-40.49827164718406, -4.270228494122716], 'name': '2ª Macro - Sobral'}","{'latlong': [-40.49827164718406, -4.270228494122716], 'name': '2ª Macro - Sobral'}",819,0.0
2020,"{'latlong': [-38.26279503575439, -5.2411729332342185], 'name': '5ª Macro - Litoral Leste/Jaguaribe'}","{'latlong': [-38.26279503575439, -5.2411729332342185], 'name': '5ª Macro - Litoral Leste/Jaguaribe'}",61,0.0
2020,"{'latlong': [-38.26279503575439, -5.2411729332342185], 'name': '5ª Macro - Litoral Leste/Jaguaribe'}","{'latlong': [-39.04198570967633, -3.972272374155126], 'name': '1ª Macro - Fortaleza'}",64,140.29094146329456
2020,"{'latlong': [-38.26279503575439, -5.2411729332342185], 'name': '5ª Macro - Litoral Leste/Jaguaribe'}","{'latlong': [-39.5970436535868, -5.3600126499898675], 'name': '4ª Macro - Sertão Central'}",5,148.47845738572832
2020,"{'latlong': [-39.04198570967633, -3.972272374155126], 'name': '1ª Macro - Fortaleza'}","{'latlong': [-39.04198570967633, -3.972272374155126], 'name': '1ª Macro - Fortaleza'}",1311,0.0
2020,"{'latlong': [-39.04198570967633, -3.972272374155126], 'name': '1ª Macro - Fortaleza'}","{'latlong': [-39.5970436535868, -5.3600126499898675], 'name': '4ª Macro - Sertão Central'}",4,134.60427573279884
2020,"{'latlong': [-39.04198570967633, -3.972272374155126], 'name': '1ª Macro - Fortaleza'}","{'latlong': [-40.49827164718406, -4.270228494122716], 'name': '2ª Macro - Sobral'}",2,163.69432955223883
2020,"{'latlong': [-39.4424043736871, -6.6823328399832285], 'name': '3ª Macro - Cariri'}","{'latlong': [-39.04198570967633, -3.972272374155126], 'name': '1ª Macro - Fortaleza'}",35,238.1362922408207
2020,"{'latlong': [-39.4424043736871, -6.6823328399832285], 'name': '3ª Macro - Cariri'}","{'latlong': [-39.4424043736871, -6.6823328399832285], 'name': '3ª Macro - Cariri'}",379,0.0
2020,"{'latlong': [-39.5970436535868, -5.3600126499898675], 'name': '4ª Macro - Sertão Central'}","{'latlong': [-39.04198570967633, -3.972272374155126], 'name': '1ª Macro - Fortaleza'}",62,134.60427573279884
2020,"{'latlong': [-39.5970436535868, -5.3600126499898675], 'name': '4ª Macro - Sertão Central'}","{'latlong': [-39.4424043736871, -6.6823328399832285], 'name': '3ª Macro - Cariri'}",1,114.99291452469504
2020,"{'latlong': [-39.5970436535868, -5.3600126499898675], 'name': '4ª Macro - Sertão Central'}","{'latlong': [-39.5970436535868, -5.3600126499898675], 'name': '4ª Macro - Sertão Central'}",130,0.0
2020,"{'latlong': [-40.49827164718406, -4.270228494122716], 'name': '2ª Macro - Sobral'}","{'latlong': [-39.04198570967633, -3.972272374155126], 'name': '1ª Macro - Fortaleza'}",55,163.69432955223883
2020,"{'latlong': [-40.49827164718406, -4.270228494122716], 'name': '2ª Macro - Sobral'}","{'latlong': [-39.5970436535868, -5.3600126499898675], 'name': '4ª Macro - Sertão Central'}",1,136.6063403884904
2020,"{'latlong': [-40.49827164718406, -4.270228494122716], 'name': '2ª Macro - Sobral'}","{'latlong': [-40.49827164718406, -4.270228494122716], 'name': '2ª Macro - Sobral'}",225,0.0
