year,from,to,hospitalizations
1994,"{'latlong': [-35.45993547543438, -8.237977282077168], 'name': 'Metropolitana'}","{'latlong': [-35.45993547543438, -8.237977282077168], 'name': 'Metropolitana'}",266
1994,"{'latlong': [-36.44705331304556, -8.597091004271139], 'name': 'Agreste'}","{'latlong': [-35.45993547543438, -8.237977282077168], 'name': 'Metropolitana'}",4
1994,"{'latlong': [-36.44705331304556, -8.597091004271139], 'name': 'Agreste'}","{'latlong': [-36.44705331304556, -8.597091004271139], 'name': 'Agreste'}",21
1994,"{'latlong': [-37.865288937823316, -8.306290795258281], 'name': 'Sertão'}","{'latlong': [-37.865288937823316, -8.306290795258281], 'name': 'Sertão'}",26
1994,"{'latlong': [-39.95936095628068, -8.364764974735124], 'name': 'Vale do S.Francisco e Araripe'}","{'latlong': [-37.865288937823316, -8.306290795258281], 'name': 'Sertão'}",2
1994,"{'latlong': [-39.95936095628068, -8.364764974735124], 'name': 'Vale do S.Francisco e Araripe'}","{'latlong': [-39.95936095628068, -8.364764974735124], 'name': 'Vale do S.Francisco e Araripe'}",20
1995,"{'latlong': [-35.45993547543438, -8.237977282077168], 'name': 'Metropolitana'}","{'latlong': [-35.45993547543438, -8.237977282077168], 'name': 'Metropolitana'}",1758
1995,"{'latlong': [-35.45993547543438, -8.237977282077168], 'name': 'Metropolitana'}","{'latlong': [-36.44705331304556, -8.597091004271139], 'name': 'Agreste'}",5
1995,"{'latlong': [-36.44705331304556, -8.597091004271139], 'name': 'Agreste'}","{'latlong': [-35.45993547543438, -8.237977282077168], 'name': 'Metropolitana'}",24
1995,"{'latlong': [-36.44705331304556, -8.597091004271139], 'name': 'Agreste'}","{'latlong': [-36.44705331304556, -8.597091004271139], 'name': 'Agreste'}",182
1995,"{'latlong': [-36.44705331304556, -8.597091004271139], 'name': 'Agreste'}","{'latlong': [-37.865288937823316, -8.306290795258281], 'name': 'Sertão'}",4
1995,"{'latlong': [-37.865288937823316, -8.306290795258281], 'name': 'Sertão'}","{'latlong': [-35.45993547543438, -8.237977282077168], 'name': 'Metropolitana'}",8
1995,"{'latlong': [-37.865288937823316, -8.306290795258281], 'name': 'Sertão'}","{'latlong': [-36.44705331304556, -8.597091004271139], 'name': 'Agreste'}",1
1995,"{'latlong': [-37.865288937823316, -8.306290795258281], 'name': 'Sertão'}","{'latlong': [-37.865288937823316, -8.306290795258281], 'name': 'Sertão'}",217
1995,"{'latlong': [-37.865288937823316, -8.306290795258281], 'name': 'Sertão'}","{'latlong': [-39.95936095628068, -8.364764974735124], 'name': 'Vale do S.Francisco e Araripe'}",4
1995,"{'latlong': [-39.95936095628068, -8.364764974735124], 'name': 'Vale do S.Francisco e Araripe'}","{'latlong': [-35.45993547543438, -8.237977282077168], 'name': 'Metropolitana'}",4
1995,"{'latlong': [-39.95936095628068, -8.364764974735124], 'name': 'Vale do S.Francisco e Araripe'}","{'latlong': [-39.95936095628068, -8.364764974735124], 'name': 'Vale do S.Francisco e Araripe'}",188
1996,"{'latlong': [-35.45993547543438, -8.237977282077168], 'name': 'Metropolitana'}","{'latlong': [-35.45993547543438, -8.237977282077168], 'name': 'Metropolitana'}",1104
1996,"{'latlong': [-35.45993547543438, -8.237977282077168], 'name': 'Metropolitana'}","{'latlong': [-36.44705331304556, -8.597091004271139], 'name': 'Agreste'}",6
1996,"{'latlong': [-35.45993547543438, -8.237977282077168], 'name': 'Metropolitana'}","{'latlong': [-37.865288937823316, -8.306290795258281], 'name': 'Sertão'}",1
1996,"{'latlong': [-36.44705331304556, -8.597091004271139], 'name': 'Agreste'}","{'latlong': [-35.45993547543438, -8.237977282077168], 'name': 'Metropolitana'}",21
1996,"{'latlong': [-36.44705331304556, -8.597091004271139], 'name': 'Agreste'}","{'latlong': [-36.44705331304556, -8.597091004271139], 'name': 'Agreste'}",146
1996,"{'latlong': [-36.44705331304556, -8.597091004271139], 'name': 'Agreste'}","{'latlong': [-37.865288937823316, -8.306290795258281], 'name': 'Sertão'}",9
1996,"{'latlong': [-36.44705331304556, -8.597091004271139], 'name': 'Agreste'}","{'latlong': [-39.95936095628068, -8.364764974735124], 'name': 'Vale do S.Francisco e Araripe'}",1
1996,"{'latlong': [-37.865288937823316, -8.306290795258281], 'name': 'Sertão'}","{'latlong': [-35.45993547543438, -8.237977282077168], 'name': 'Metropolitana'}",6
1996,"{'latlong': [-37.865288937823316, -8.306290795258281], 'name': 'Sertão'}","{'latlong': [-36.44705331304556, -8.597091004271139], 'name': 'Agreste'}",5
1996,"{'latlong': [-37.865288937823316, -8.306290795258281], 'name': 'Sertão'}","{'latlong': [-37.865288937823316, -8.306290795258281], 'name': 'Sertão'}",168
1996,"{'latlong': [-37.865288937823316, -8.306290795258281], 'name': 'Sertão'}","{'latlong': [-39.95936095628068, -8.364764974735124], 'name': 'Vale do S.Francisco e Araripe'}",2
1996,"{'latlong': [-39.95936095628068, -8.364764974735124], 'name': 'Vale do S.Francisco e Araripe'}","{'latlong': [-35.45993547543438, -8.237977282077168], 'name': 'Metropolitana'}",3
1996,"{'latlong': [-39.95936095628068, -8.364764974735124], 'name': 'Vale do S.Francisco e Araripe'}","{'latlong': [-37.865288937823316, -8.306290795258281], 'name': 'Sertão'}",1
1996,"{'latlong': [-39.95936095628068, -8.364764974735124], 'name': 'Vale do S.Francisco e Araripe'}","{'latlong': [-39.95936095628068, -8.364764974735124], 'name': 'Vale do S.Francisco e Araripe'}",141
1997,"{'latlong': [-35.45993547543438, -8.237977282077168], 'name': 'Metropolitana'}","{'latlong': [-35.45993547543438, -8.237977282077168], 'name': 'Metropolitana'}",876
1997,"{'latlong': [-35.45993547543438, -8.237977282077168], 'name': 'Metropolitana'}","{'latlong': [-36.44705331304556, -8.597091004271139], 'name': 'Agreste'}",1
1997,"{'latlong': [-36.44705331304556, -8.597091004271139], 'name': 'Agreste'}","{'latlong': [-35.45993547543438, -8.237977282077168], 'name': 'Metropolitana'}",36
1997,"{'latlong': [-36.44705331304556, -8.597091004271139], 'name': 'Agreste'}","{'latlong': [-36.44705331304556, -8.597091004271139], 'name': 'Agreste'}",93
1997,"{'latlong': [-36.44705331304556, -8.597091004271139], 'name': 'Agreste'}","{'latlong': [-37.865288937823316, -8.306290795258281], 'name': 'Sertão'}",10
1997,"{'latlong': [-36.44705331304556, -8.597091004271139], 'name': 'Agreste'}","{'latlong': [-39.95936095628068, -8.364764974735124], 'name': 'Vale do S.Francisco e Araripe'}",1
1997,"{'latlong': [-37.865288937823316, -8.306290795258281], 'name': 'Sertão'}","{'latlong': [-35.45993547543438, -8.237977282077168], 'name': 'Metropolitana'}",9
1997,"{'latlong': [-37.865288937823316, -8.306290795258281], 'name': 'Sertão'}","{'latlong': [-36.44705331304556, -8.597091004271139], 'name': 'Agreste'}",2
1997,"{'latlong': [-37.865288937823316, -8.306290795258281], 'name': 'Sertão'}","{'latlong': [-37.865288937823316, -8.306290795258281], 'name': 'Sertão'}",124
1997,"{'latlong': [-37.865288937823316, -8.306290795258281], 'name': 'Sertão'}","{'latlong': [-39.95936095628068, -8.364764974735124], 'name': 'Vale do S.Francisco e Araripe'}",1
1997,"{'latlong': [-39.95936095628068, -8.364764974735124], 'name': 'Vale do S.Francisco e Araripe'}","{'latlong': [-35.45993547543438, -8.237977282077168], 'name': 'Metropolitana'}",5
1997,"{'latlong': [-39.95936095628068, -8.364764974735124], 'name': 'Vale do S.Francisco e Araripe'}","{'latlong': [-39.95936095628068, -8.364764974735124], 'name': 'Vale do S.Francisco e Araripe'}",108
1998,"{'latlong': [-35.45993547543438, -8.237977282077168], 'name': 'Metropolitana'}","{'latlong': [-35.45993547543438, -8.237977282077168], 'name': 'Metropolitana'}",7494
1998,"{'latlong': [-35.45993547543438, -8.237977282077168], 'name': 'Metropolitana'}","{'latlong': [-36.44705331304556, -8.597091004271139], 'name': 'Agreste'}",9
1998,"{'latlong': [-36.44705331304556, -8.597091004271139], 'name': 'Agreste'}","{'latlong': [-35.45993547543438, -8.237977282077168], 'name': 'Metropolitana'}",1269
1998,"{'latlong': [-36.44705331304556, -8.597091004271139], 'name': 'Agreste'}","{'latlong': [-36.44705331304556, -8.597091004271139], 'name': 'Agreste'}",539
1998,"{'latlong': [-36.44705331304556, -8.597091004271139], 'name': 'Agreste'}","{'latlong': [-37.865288937823316, -8.306290795258281], 'name': 'Sertão'}",1
1998,"{'latlong': [-36.44705331304556, -8.597091004271139], 'name': 'Agreste'}","{'latlong': [-39.95936095628068, -8.364764974735124], 'name': 'Vale do S.Francisco e Araripe'}",1
1998,"{'latlong': [-37.865288937823316, -8.306290795258281], 'name': 'Sertão'}","{'latlong': [-35.45993547543438, -8.237977282077168], 'name': 'Metropolitana'}",458
1998,"{'latlong': [-37.865288937823316, -8.306290795258281], 'name': 'Sertão'}","{'latlong': [-36.44705331304556, -8.597091004271139], 'name': 'Agreste'}",3
1998,"{'latlong': [-37.865288937823316, -8.306290795258281], 'name': 'Sertão'}","{'latlong': [-37.865288937823316, -8.306290795258281], 'name': 'Sertão'}",214
1998,"{'latlong': [-39.95936095628068, -8.364764974735124], 'name': 'Vale do S.Francisco e Araripe'}","{'latlong': [-35.45993547543438, -8.237977282077168], 'name': 'Metropolitana'}",330
1998,"{'latlong': [-39.95936095628068, -8.364764974735124], 'name': 'Vale do S.Francisco e Araripe'}","{'latlong': [-36.44705331304556, -8.597091004271139], 'name': 'Agreste'}",1
1998,"{'latlong': [-39.95936095628068, -8.364764974735124], 'name': 'Vale do S.Francisco e Araripe'}","{'latlong': [-37.865288937823316, -8.306290795258281], 'name': 'Sertão'}",3
1998,"{'latlong': [-39.95936095628068, -8.364764974735124], 'name': 'Vale do S.Francisco e Araripe'}","{'latlong': [-39.95936095628068, -8.364764974735124], 'name': 'Vale do S.Francisco e Araripe'}",235
1999,"{'latlong': [-35.45993547543438, -8.237977282077168], 'name': 'Metropolitana'}","{'latlong': [-35.45993547543438, -8.237977282077168], 'name': 'Metropolitana'}",7134
1999,"{'latlong': [-35.45993547543438, -8.237977282077168], 'name': 'Metropolitana'}","{'latlong': [-36.44705331304556, -8.597091004271139], 'name': 'Agreste'}",12
1999,"{'latlong': [-35.45993547543438, -8.237977282077168], 'name': 'Metropolitana'}","{'latlong': [-37.865288937823316, -8.306290795258281], 'name': 'Sertão'}",1
1999,"{'latlong': [-35.45993547543438, -8.237977282077168], 'name': 'Metropolitana'}","{'latlong': [-39.95936095628068, -8.364764974735124], 'name': 'Vale do S.Francisco e Araripe'}",1
1999,"{'latlong': [-36.44705331304556, -8.597091004271139], 'name': 'Agreste'}","{'latlong': [-35.45993547543438, -8.237977282077168], 'name': 'Metropolitana'}",1082
1999,"{'latlong': [-36.44705331304556, -8.597091004271139], 'name': 'Agreste'}","{'latlong': [-36.44705331304556, -8.597091004271139], 'name': 'Agreste'}",379
1999,"{'latlong': [-36.44705331304556, -8.597091004271139], 'name': 'Agreste'}","{'latlong': [-37.865288937823316, -8.306290795258281], 'name': 'Sertão'}",2
1999,"{'latlong': [-37.865288937823316, -8.306290795258281], 'name': 'Sertão'}","{'latlong': [-35.45993547543438, -8.237977282077168], 'name': 'Metropolitana'}",489
1999,"{'latlong': [-37.865288937823316, -8.306290795258281], 'name': 'Sertão'}","{'latlong': [-36.44705331304556, -8.597091004271139], 'name': 'Agreste'}",2
1999,"{'latlong': [-37.865288937823316, -8.306290795258281], 'name': 'Sertão'}","{'latlong': [-37.865288937823316, -8.306290795258281], 'name': 'Sertão'}",260
1999,"{'latlong': [-39.95936095628068, -8.364764974735124], 'name': 'Vale do S.Francisco e Araripe'}","{'latlong': [-35.45993547543438, -8.237977282077168], 'name': 'Metropolitana'}",334
1999,"{'latlong': [-39.95936095628068, -8.364764974735124], 'name': 'Vale do S.Francisco e Araripe'}","{'latlong': [-37.865288937823316, -8.306290795258281], 'name': 'Sertão'}",7
1999,"{'latlong': [-39.95936095628068, -8.364764974735124], 'name': 'Vale do S.Francisco e Araripe'}","{'latlong': [-39.95936095628068, -8.364764974735124], 'name': 'Vale do S.Francisco e Araripe'}",181
2000,"{'latlong': [-35.45993547543438, -8.237977282077168], 'name': 'Metropolitana'}","{'latlong': [-35.45993547543438, -8.237977282077168], 'name': 'Metropolitana'}",7584
2000,"{'latlong': [-35.45993547543438, -8.237977282077168], 'name': 'Metropolitana'}","{'latlong': [-36.44705331304556, -8.597091004271139], 'name': 'Agreste'}",4
2000,"{'latlong': [-35.45993547543438, -8.237977282077168], 'name': 'Metropolitana'}","{'latlong': [-37.865288937823316, -8.306290795258281], 'name': 'Sertão'}",1
2000,"{'latlong': [-36.44705331304556, -8.597091004271139], 'name': 'Agreste'}","{'latlong': [-35.45993547543438, -8.237977282077168], 'name': 'Metropolitana'}",1126
2000,"{'latlong': [-36.44705331304556, -8.597091004271139], 'name': 'Agreste'}","{'latlong': [-36.44705331304556, -8.597091004271139], 'name': 'Agreste'}",380
2000,"{'latlong': [-37.865288937823316, -8.306290795258281], 'name': 'Sertão'}","{'latlong': [-35.45993547543438, -8.237977282077168], 'name': 'Metropolitana'}",484
2000,"{'latlong': [-37.865288937823316, -8.306290795258281], 'name': 'Sertão'}","{'latlong': [-36.44705331304556, -8.597091004271139], 'name': 'Agreste'}",3
2000,"{'latlong': [-37.865288937823316, -8.306290795258281], 'name': 'Sertão'}","{'latlong': [-37.865288937823316, -8.306290795258281], 'name': 'Sertão'}",236
2000,"{'latlong': [-37.865288937823316, -8.306290795258281], 'name': 'Sertão'}","{'latlong': [-39.95936095628068, -8.364764974735124], 'name': 'Vale do S.Francisco e Araripe'}",2
2000,"{'latlong': [-39.95936095628068, -8.364764974735124], 'name': 'Vale do S.Francisco e Araripe'}","{'latlong': [-35.45993547543438, -8.237977282077168], 'name': 'Metropolitana'}",363
2000,"{'latlong': [-39.95936095628068, -8.364764974735124], 'name': 'Vale do S.Francisco e Araripe'}","{'latlong': [-37.865288937823316, -8.306290795258281], 'name': 'Sertão'}",6
2000,"{'latlong': [-39.95936095628068, -8.364764974735124], 'name': 'Vale do S.Francisco e Araripe'}","{'latlong': [-39.95936095628068, -8.364764974735124], 'name': 'Vale do S.Francisco e Araripe'}",202
2001,"{'latlong': [-35.45993547543438, -8.237977282077168], 'name': 'Metropolitana'}","{'latlong': [-35.45993547543438, -8.237977282077168], 'name': 'Metropolitana'}",8096
2001,"{'latlong': [-35.45993547543438, -8.237977282077168], 'name': 'Metropolitana'}","{'latlong': [-36.44705331304556, -8.597091004271139], 'name': 'Agreste'}",5
2001,"{'latlong': [-35.45993547543438, -8.237977282077168], 'name': 'Metropolitana'}","{'latlong': [-39.95936095628068, -8.364764974735124], 'name': 'Vale do S.Francisco e Araripe'}",1
2001,"{'latlong': [-36.44705331304556, -8.597091004271139], 'name': 'Agreste'}","{'latlong': [-35.45993547543438, -8.237977282077168], 'name': 'Metropolitana'}",1036
2001,"{'latlong': [-36.44705331304556, -8.597091004271139], 'name': 'Agreste'}","{'latlong': [-36.44705331304556, -8.597091004271139], 'name': 'Agreste'}",436
2001,"{'latlong': [-36.44705331304556, -8.597091004271139], 'name': 'Agreste'}","{'latlong': [-37.865288937823316, -8.306290795258281], 'name': 'Sertão'}",1
2001,"{'latlong': [-37.865288937823316, -8.306290795258281], 'name': 'Sertão'}","{'latlong': [-35.45993547543438, -8.237977282077168], 'name': 'Metropolitana'}",473
2001,"{'latlong': [-37.865288937823316, -8.306290795258281], 'name': 'Sertão'}","{'latlong': [-36.44705331304556, -8.597091004271139], 'name': 'Agreste'}",5
2001,"{'latlong': [-37.865288937823316, -8.306290795258281], 'name': 'Sertão'}","{'latlong': [-37.865288937823316, -8.306290795258281], 'name': 'Sertão'}",203
2001,"{'latlong': [-39.95936095628068, -8.364764974735124], 'name': 'Vale do S.Francisco e Araripe'}","{'latlong': [-35.45993547543438, -8.237977282077168], 'name': 'Metropolitana'}",316
2001,"{'latlong': [-39.95936095628068, -8.364764974735124], 'name': 'Vale do S.Francisco e Araripe'}","{'latlong': [-36.44705331304556, -8.597091004271139], 'name': 'Agreste'}",2
2001,"{'latlong': [-39.95936095628068, -8.364764974735124], 'name': 'Vale do S.Francisco e Araripe'}","{'latlong': [-37.865288937823316, -8.306290795258281], 'name': 'Sertão'}",8
2001,"{'latlong': [-39.95936095628068, -8.364764974735124], 'name': 'Vale do S.Francisco e Araripe'}","{'latlong': [-39.95936095628068, -8.364764974735124], 'name': 'Vale do S.Francisco e Araripe'}",242
2002,"{'latlong': [-35.45993547543438, -8.237977282077168], 'name': 'Metropolitana'}","{'latlong': [-35.45993547543438, -8.237977282077168], 'name': 'Metropolitana'}",12234
2002,"{'latlong': [-35.45993547543438, -8.237977282077168], 'name': 'Metropolitana'}","{'latlong': [-36.44705331304556, -8.597091004271139], 'name': 'Agreste'}",8
2002,"{'latlong': [-36.44705331304556, -8.597091004271139], 'name': 'Agreste'}","{'latlong': [-35.45993547543438, -8.237977282077168], 'name': 'Metropolitana'}",1497
2002,"{'latlong': [-36.44705331304556, -8.597091004271139], 'name': 'Agreste'}","{'latlong': [-36.44705331304556, -8.597091004271139], 'name': 'Agreste'}",668
2002,"{'latlong': [-36.44705331304556, -8.597091004271139], 'name': 'Agreste'}","{'latlong': [-37.865288937823316, -8.306290795258281], 'name': 'Sertão'}",6
2002,"{'latlong': [-36.44705331304556, -8.597091004271139], 'name': 'Agreste'}","{'latlong': [-39.95936095628068, -8.364764974735124], 'name': 'Vale do S.Francisco e Araripe'}",2
2002,"{'latlong': [-37.865288937823316, -8.306290795258281], 'name': 'Sertão'}","{'latlong': [-35.45993547543438, -8.237977282077168], 'name': 'Metropolitana'}",627
2002,"{'latlong': [-37.865288937823316, -8.306290795258281], 'name': 'Sertão'}","{'latlong': [-36.44705331304556, -8.597091004271139], 'name': 'Agreste'}",4
2002,"{'latlong': [-37.865288937823316, -8.306290795258281], 'name': 'Sertão'}","{'latlong': [-37.865288937823316, -8.306290795258281], 'name': 'Sertão'}",333
2002,"{'latlong': [-37.865288937823316, -8.306290795258281], 'name': 'Sertão'}","{'latlong': [-39.95936095628068, -8.364764974735124], 'name': 'Vale do S.Francisco e Araripe'}",4
2002,"{'latlong': [-39.95936095628068, -8.364764974735124], 'name': 'Vale do S.Francisco e Araripe'}","{'latlong': [-35.45993547543438, -8.237977282077168], 'name': 'Metropolitana'}",493
2002,"{'latlong': [-39.95936095628068, -8.364764974735124], 'name': 'Vale do S.Francisco e Araripe'}","{'latlong': [-36.44705331304556, -8.597091004271139], 'name': 'Agreste'}",6
2002,"{'latlong': [-39.95936095628068, -8.364764974735124], 'name': 'Vale do S.Francisco e Araripe'}","{'latlong': [-37.865288937823316, -8.306290795258281], 'name': 'Sertão'}",15
2002,"{'latlong': [-39.95936095628068, -8.364764974735124], 'name': 'Vale do S.Francisco e Araripe'}","{'latlong': [-39.95936095628068, -8.364764974735124], 'name': 'Vale do S.Francisco e Araripe'}",356
2003,"{'latlong': [-35.45993547543438, -8.237977282077168], 'name': 'Metropolitana'}","{'latlong': [-35.45993547543438, -8.237977282077168], 'name': 'Metropolitana'}",14495
2003,"{'latlong': [-35.45993547543438, -8.237977282077168], 'name': 'Metropolitana'}","{'latlong': [-36.44705331304556, -8.597091004271139], 'name': 'Agreste'}",12
2003,"{'latlong': [-36.44705331304556, -8.597091004271139], 'name': 'Agreste'}","{'latlong': [-35.45993547543438, -8.237977282077168], 'name': 'Metropolitana'}",1694
2003,"{'latlong': [-36.44705331304556, -8.597091004271139], 'name': 'Agreste'}","{'latlong': [-36.44705331304556, -8.597091004271139], 'name': 'Agreste'}",884
2003,"{'latlong': [-36.44705331304556, -8.597091004271139], 'name': 'Agreste'}","{'latlong': [-37.865288937823316, -8.306290795258281], 'name': 'Sertão'}",15
2003,"{'latlong': [-36.44705331304556, -8.597091004271139], 'name': 'Agreste'}","{'latlong': [-39.95936095628068, -8.364764974735124], 'name': 'Vale do S.Francisco e Araripe'}",2
2003,"{'latlong': [-37.865288937823316, -8.306290795258281], 'name': 'Sertão'}","{'latlong': [-35.45993547543438, -8.237977282077168], 'name': 'Metropolitana'}",779
2003,"{'latlong': [-37.865288937823316, -8.306290795258281], 'name': 'Sertão'}","{'latlong': [-36.44705331304556, -8.597091004271139], 'name': 'Agreste'}",4
2003,"{'latlong': [-37.865288937823316, -8.306290795258281], 'name': 'Sertão'}","{'latlong': [-37.865288937823316, -8.306290795258281], 'name': 'Sertão'}",336
2003,"{'latlong': [-37.865288937823316, -8.306290795258281], 'name': 'Sertão'}","{'latlong': [-39.95936095628068, -8.364764974735124], 'name': 'Vale do S.Francisco e Araripe'}",4
2003,"{'latlong': [-39.95936095628068, -8.364764974735124], 'name': 'Vale do S.Francisco e Araripe'}","{'latlong': [-35.45993547543438, -8.237977282077168], 'name': 'Metropolitana'}",657
2003,"{'latlong': [-39.95936095628068, -8.364764974735124], 'name': 'Vale do S.Francisco e Araripe'}","{'latlong': [-36.44705331304556, -8.597091004271139], 'name': 'Agreste'}",2
2003,"{'latlong': [-39.95936095628068, -8.364764974735124], 'name': 'Vale do S.Francisco e Araripe'}","{'latlong': [-37.865288937823316, -8.306290795258281], 'name': 'Sertão'}",15
2003,"{'latlong': [-39.95936095628068, -8.364764974735124], 'name': 'Vale do S.Francisco e Araripe'}","{'latlong': [-39.95936095628068, -8.364764974735124], 'name': 'Vale do S.Francisco e Araripe'}",269
2004,"{'latlong': [-35.45993547543438, -8.237977282077168], 'name': 'Metropolitana'}","{'latlong': [-35.45993547543438, -8.237977282077168], 'name': 'Metropolitana'}",14607
2004,"{'latlong': [-35.45993547543438, -8.237977282077168], 'name': 'Metropolitana'}","{'latlong': [-36.44705331304556, -8.597091004271139], 'name': 'Agreste'}",18
2004,"{'latlong': [-35.45993547543438, -8.237977282077168], 'name': 'Metropolitana'}","{'latlong': [-37.865288937823316, -8.306290795258281], 'name': 'Sertão'}",1
2004,"{'latlong': [-36.44705331304556, -8.597091004271139], 'name': 'Agreste'}","{'latlong': [-35.45993547543438, -8.237977282077168], 'name': 'Metropolitana'}",1871
2004,"{'latlong': [-36.44705331304556, -8.597091004271139], 'name': 'Agreste'}","{'latlong': [-36.44705331304556, -8.597091004271139], 'name': 'Agreste'}",1155
2004,"{'latlong': [-36.44705331304556, -8.597091004271139], 'name': 'Agreste'}","{'latlong': [-37.865288937823316, -8.306290795258281], 'name': 'Sertão'}",5
2004,"{'latlong': [-37.865288937823316, -8.306290795258281], 'name': 'Sertão'}","{'latlong': [-35.45993547543438, -8.237977282077168], 'name': 'Metropolitana'}",919
2004,"{'latlong': [-37.865288937823316, -8.306290795258281], 'name': 'Sertão'}","{'latlong': [-36.44705331304556, -8.597091004271139], 'name': 'Agreste'}",8
2004,"{'latlong': [-37.865288937823316, -8.306290795258281], 'name': 'Sertão'}","{'latlong': [-37.865288937823316, -8.306290795258281], 'name': 'Sertão'}",290
2004,"{'latlong': [-37.865288937823316, -8.306290795258281], 'name': 'Sertão'}","{'latlong': [-39.95936095628068, -8.364764974735124], 'name': 'Vale do S.Francisco e Araripe'}",1
2004,"{'latlong': [-39.95936095628068, -8.364764974735124], 'name': 'Vale do S.Francisco e Araripe'}","{'latlong': [-35.45993547543438, -8.237977282077168], 'name': 'Metropolitana'}",638
2004,"{'latlong': [-39.95936095628068, -8.364764974735124], 'name': 'Vale do S.Francisco e Araripe'}","{'latlong': [-36.44705331304556, -8.597091004271139], 'name': 'Agreste'}",2
2004,"{'latlong': [-39.95936095628068, -8.364764974735124], 'name': 'Vale do S.Francisco e Araripe'}","{'latlong': [-37.865288937823316, -8.306290795258281], 'name': 'Sertão'}",12
2004,"{'latlong': [-39.95936095628068, -8.364764974735124], 'name': 'Vale do S.Francisco e Araripe'}","{'latlong': [-39.95936095628068, -8.364764974735124], 'name': 'Vale do S.Francisco e Araripe'}",273
2005,"{'latlong': [-35.45993547543438, -8.237977282077168], 'name': 'Metropolitana'}","{'latlong': [-35.45993547543438, -8.237977282077168], 'name': 'Metropolitana'}",14175
2005,"{'latlong': [-35.45993547543438, -8.237977282077168], 'name': 'Metropolitana'}","{'latlong': [-36.44705331304556, -8.597091004271139], 'name': 'Agreste'}",17
2005,"{'latlong': [-35.45993547543438, -8.237977282077168], 'name': 'Metropolitana'}","{'latlong': [-39.95936095628068, -8.364764974735124], 'name': 'Vale do S.Francisco e Araripe'}",1
2005,"{'latlong': [-36.44705331304556, -8.597091004271139], 'name': 'Agreste'}","{'latlong': [-35.45993547543438, -8.237977282077168], 'name': 'Metropolitana'}",1688
2005,"{'latlong': [-36.44705331304556, -8.597091004271139], 'name': 'Agreste'}","{'latlong': [-36.44705331304556, -8.597091004271139], 'name': 'Agreste'}",1254
2005,"{'latlong': [-36.44705331304556, -8.597091004271139], 'name': 'Agreste'}","{'latlong': [-37.865288937823316, -8.306290795258281], 'name': 'Sertão'}",6
2005,"{'latlong': [-37.865288937823316, -8.306290795258281], 'name': 'Sertão'}","{'latlong': [-35.45993547543438, -8.237977282077168], 'name': 'Metropolitana'}",903
2005,"{'latlong': [-37.865288937823316, -8.306290795258281], 'name': 'Sertão'}","{'latlong': [-36.44705331304556, -8.597091004271139], 'name': 'Agreste'}",10
2005,"{'latlong': [-37.865288937823316, -8.306290795258281], 'name': 'Sertão'}","{'latlong': [-37.865288937823316, -8.306290795258281], 'name': 'Sertão'}",330
2005,"{'latlong': [-37.865288937823316, -8.306290795258281], 'name': 'Sertão'}","{'latlong': [-39.95936095628068, -8.364764974735124], 'name': 'Vale do S.Francisco e Araripe'}",1
2005,"{'latlong': [-39.95936095628068, -8.364764974735124], 'name': 'Vale do S.Francisco e Araripe'}","{'latlong': [-35.45993547543438, -8.237977282077168], 'name': 'Metropolitana'}",700
2005,"{'latlong': [-39.95936095628068, -8.364764974735124], 'name': 'Vale do S.Francisco e Araripe'}","{'latlong': [-37.865288937823316, -8.306290795258281], 'name': 'Sertão'}",18
2005,"{'latlong': [-39.95936095628068, -8.364764974735124], 'name': 'Vale do S.Francisco e Araripe'}","{'latlong': [-39.95936095628068, -8.364764974735124], 'name': 'Vale do S.Francisco e Araripe'}",429
2006,"{'latlong': [-35.45993547543438, -8.237977282077168], 'name': 'Metropolitana'}","{'latlong': [-35.45993547543438, -8.237977282077168], 'name': 'Metropolitana'}",15024
2006,"{'latlong': [-35.45993547543438, -8.237977282077168], 'name': 'Metropolitana'}","{'latlong': [-36.44705331304556, -8.597091004271139], 'name': 'Agreste'}",19
2006,"{'latlong': [-36.44705331304556, -8.597091004271139], 'name': 'Agreste'}","{'latlong': [-35.45993547543438, -8.237977282077168], 'name': 'Metropolitana'}",1785
2006,"{'latlong': [-36.44705331304556, -8.597091004271139], 'name': 'Agreste'}","{'latlong': [-36.44705331304556, -8.597091004271139], 'name': 'Agreste'}",1488
2006,"{'latlong': [-36.44705331304556, -8.597091004271139], 'name': 'Agreste'}","{'latlong': [-37.865288937823316, -8.306290795258281], 'name': 'Sertão'}",16
2006,"{'latlong': [-37.865288937823316, -8.306290795258281], 'name': 'Sertão'}","{'latlong': [-35.45993547543438, -8.237977282077168], 'name': 'Metropolitana'}",873
2006,"{'latlong': [-37.865288937823316, -8.306290795258281], 'name': 'Sertão'}","{'latlong': [-36.44705331304556, -8.597091004271139], 'name': 'Agreste'}",19
2006,"{'latlong': [-37.865288937823316, -8.306290795258281], 'name': 'Sertão'}","{'latlong': [-37.865288937823316, -8.306290795258281], 'name': 'Sertão'}",633
2006,"{'latlong': [-37.865288937823316, -8.306290795258281], 'name': 'Sertão'}","{'latlong': [-39.95936095628068, -8.364764974735124], 'name': 'Vale do S.Francisco e Araripe'}",2
2006,"{'latlong': [-39.95936095628068, -8.364764974735124], 'name': 'Vale do S.Francisco e Araripe'}","{'latlong': [-35.45993547543438, -8.237977282077168], 'name': 'Metropolitana'}",659
2006,"{'latlong': [-39.95936095628068, -8.364764974735124], 'name': 'Vale do S.Francisco e Araripe'}","{'latlong': [-36.44705331304556, -8.597091004271139], 'name': 'Agreste'}",3
2006,"{'latlong': [-39.95936095628068, -8.364764974735124], 'name': 'Vale do S.Francisco e Araripe'}","{'latlong': [-37.865288937823316, -8.306290795258281], 'name': 'Sertão'}",13
2006,"{'latlong': [-39.95936095628068, -8.364764974735124], 'name': 'Vale do S.Francisco e Araripe'}","{'latlong': [-39.95936095628068, -8.364764974735124], 'name': 'Vale do S.Francisco e Araripe'}",584
2007,"{'latlong': [-35.45993547543438, -8.237977282077168], 'name': 'Metropolitana'}","{'latlong': [-35.45993547543438, -8.237977282077168], 'name': 'Metropolitana'}",17262
2007,"{'latlong': [-35.45993547543438, -8.237977282077168], 'name': 'Metropolitana'}","{'latlong': [-36.44705331304556, -8.597091004271139], 'name': 'Agreste'}",24
2007,"{'latlong': [-35.45993547543438, -8.237977282077168], 'name': 'Metropolitana'}","{'latlong': [-37.865288937823316, -8.306290795258281], 'name': 'Sertão'}",2
2007,"{'latlong': [-35.45993547543438, -8.237977282077168], 'name': 'Metropolitana'}","{'latlong': [-39.95936095628068, -8.364764974735124], 'name': 'Vale do S.Francisco e Araripe'}",1
2007,"{'latlong': [-36.44705331304556, -8.597091004271139], 'name': 'Agreste'}","{'latlong': [-35.45993547543438, -8.237977282077168], 'name': 'Metropolitana'}",1968
2007,"{'latlong': [-36.44705331304556, -8.597091004271139], 'name': 'Agreste'}","{'latlong': [-36.44705331304556, -8.597091004271139], 'name': 'Agreste'}",1527
2007,"{'latlong': [-36.44705331304556, -8.597091004271139], 'name': 'Agreste'}","{'latlong': [-37.865288937823316, -8.306290795258281], 'name': 'Sertão'}",11
2007,"{'latlong': [-37.865288937823316, -8.306290795258281], 'name': 'Sertão'}","{'latlong': [-35.45993547543438, -8.237977282077168], 'name': 'Metropolitana'}",1079
2007,"{'latlong': [-37.865288937823316, -8.306290795258281], 'name': 'Sertão'}","{'latlong': [-36.44705331304556, -8.597091004271139], 'name': 'Agreste'}",23
2007,"{'latlong': [-37.865288937823316, -8.306290795258281], 'name': 'Sertão'}","{'latlong': [-37.865288937823316, -8.306290795258281], 'name': 'Sertão'}",653
2007,"{'latlong': [-37.865288937823316, -8.306290795258281], 'name': 'Sertão'}","{'latlong': [-39.95936095628068, -8.364764974735124], 'name': 'Vale do S.Francisco e Araripe'}",5
2007,"{'latlong': [-39.95936095628068, -8.364764974735124], 'name': 'Vale do S.Francisco e Araripe'}","{'latlong': [-35.45993547543438, -8.237977282077168], 'name': 'Metropolitana'}",688
2007,"{'latlong': [-39.95936095628068, -8.364764974735124], 'name': 'Vale do S.Francisco e Araripe'}","{'latlong': [-36.44705331304556, -8.597091004271139], 'name': 'Agreste'}",6
2007,"{'latlong': [-39.95936095628068, -8.364764974735124], 'name': 'Vale do S.Francisco e Araripe'}","{'latlong': [-37.865288937823316, -8.306290795258281], 'name': 'Sertão'}",19
2007,"{'latlong': [-39.95936095628068, -8.364764974735124], 'name': 'Vale do S.Francisco e Araripe'}","{'latlong': [-39.95936095628068, -8.364764974735124], 'name': 'Vale do S.Francisco e Araripe'}",837
2008,"{'latlong': [-35.45993547543438, -8.237977282077168], 'name': 'Metropolitana'}","{'latlong': [-35.45993547543438, -8.237977282077168], 'name': 'Metropolitana'}",19176
2008,"{'latlong': [-35.45993547543438, -8.237977282077168], 'name': 'Metropolitana'}","{'latlong': [-36.44705331304556, -8.597091004271139], 'name': 'Agreste'}",47
2008,"{'latlong': [-35.45993547543438, -8.237977282077168], 'name': 'Metropolitana'}","{'latlong': [-37.865288937823316, -8.306290795258281], 'name': 'Sertão'}",4
2008,"{'latlong': [-36.44705331304556, -8.597091004271139], 'name': 'Agreste'}","{'latlong': [-35.45993547543438, -8.237977282077168], 'name': 'Metropolitana'}",2332
2008,"{'latlong': [-36.44705331304556, -8.597091004271139], 'name': 'Agreste'}","{'latlong': [-36.44705331304556, -8.597091004271139], 'name': 'Agreste'}",2004
2008,"{'latlong': [-36.44705331304556, -8.597091004271139], 'name': 'Agreste'}","{'latlong': [-37.865288937823316, -8.306290795258281], 'name': 'Sertão'}",30
2008,"{'latlong': [-37.865288937823316, -8.306290795258281], 'name': 'Sertão'}","{'latlong': [-35.45993547543438, -8.237977282077168], 'name': 'Metropolitana'}",1192
2008,"{'latlong': [-37.865288937823316, -8.306290795258281], 'name': 'Sertão'}","{'latlong': [-36.44705331304556, -8.597091004271139], 'name': 'Agreste'}",32
2008,"{'latlong': [-37.865288937823316, -8.306290795258281], 'name': 'Sertão'}","{'latlong': [-37.865288937823316, -8.306290795258281], 'name': 'Sertão'}",701
2008,"{'latlong': [-37.865288937823316, -8.306290795258281], 'name': 'Sertão'}","{'latlong': [-39.95936095628068, -8.364764974735124], 'name': 'Vale do S.Francisco e Araripe'}",3
2008,"{'latlong': [-39.95936095628068, -8.364764974735124], 'name': 'Vale do S.Francisco e Araripe'}","{'latlong': [-35.45993547543438, -8.237977282077168], 'name': 'Metropolitana'}",973
2008,"{'latlong': [-39.95936095628068, -8.364764974735124], 'name': 'Vale do S.Francisco e Araripe'}","{'latlong': [-36.44705331304556, -8.597091004271139], 'name': 'Agreste'}",13
2008,"{'latlong': [-39.95936095628068, -8.364764974735124], 'name': 'Vale do S.Francisco e Araripe'}","{'latlong': [-37.865288937823316, -8.306290795258281], 'name': 'Sertão'}",31
2008,"{'latlong': [-39.95936095628068, -8.364764974735124], 'name': 'Vale do S.Francisco e Araripe'}","{'latlong': [-39.95936095628068, -8.364764974735124], 'name': 'Vale do S.Francisco e Araripe'}",564
2009,"{'latlong': [-35.45993547543438, -8.237977282077168], 'name': 'Metropolitana'}","{'latlong': [-35.45993547543438, -8.237977282077168], 'name': 'Metropolitana'}",19977
2009,"{'latlong': [-35.45993547543438, -8.237977282077168], 'name': 'Metropolitana'}","{'latlong': [-36.44705331304556, -8.597091004271139], 'name': 'Agreste'}",87
2009,"{'latlong': [-35.45993547543438, -8.237977282077168], 'name': 'Metropolitana'}","{'latlong': [-39.95936095628068, -8.364764974735124], 'name': 'Vale do S.Francisco e Araripe'}",2
2009,"{'latlong': [-36.44705331304556, -8.597091004271139], 'name': 'Agreste'}","{'latlong': [-35.45993547543438, -8.237977282077168], 'name': 'Metropolitana'}",2428
2009,"{'latlong': [-36.44705331304556, -8.597091004271139], 'name': 'Agreste'}","{'latlong': [-36.44705331304556, -8.597091004271139], 'name': 'Agreste'}",1615
2009,"{'latlong': [-36.44705331304556, -8.597091004271139], 'name': 'Agreste'}","{'latlong': [-37.865288937823316, -8.306290795258281], 'name': 'Sertão'}",15
2009,"{'latlong': [-37.865288937823316, -8.306290795258281], 'name': 'Sertão'}","{'latlong': [-35.45993547543438, -8.237977282077168], 'name': 'Metropolitana'}",1130
2009,"{'latlong': [-37.865288937823316, -8.306290795258281], 'name': 'Sertão'}","{'latlong': [-36.44705331304556, -8.597091004271139], 'name': 'Agreste'}",43
2009,"{'latlong': [-37.865288937823316, -8.306290795258281], 'name': 'Sertão'}","{'latlong': [-37.865288937823316, -8.306290795258281], 'name': 'Sertão'}",601
2009,"{'latlong': [-37.865288937823316, -8.306290795258281], 'name': 'Sertão'}","{'latlong': [-39.95936095628068, -8.364764974735124], 'name': 'Vale do S.Francisco e Araripe'}",6
2009,"{'latlong': [-39.95936095628068, -8.364764974735124], 'name': 'Vale do S.Francisco e Araripe'}","{'latlong': [-35.45993547543438, -8.237977282077168], 'name': 'Metropolitana'}",1110
2009,"{'latlong': [-39.95936095628068, -8.364764974735124], 'name': 'Vale do S.Francisco e Araripe'}","{'latlong': [-36.44705331304556, -8.597091004271139], 'name': 'Agreste'}",5
2009,"{'latlong': [-39.95936095628068, -8.364764974735124], 'name': 'Vale do S.Francisco e Araripe'}","{'latlong': [-37.865288937823316, -8.306290795258281], 'name': 'Sertão'}",17
2009,"{'latlong': [-39.95936095628068, -8.364764974735124], 'name': 'Vale do S.Francisco e Araripe'}","{'latlong': [-39.95936095628068, -8.364764974735124], 'name': 'Vale do S.Francisco e Araripe'}",604
2010,"{'latlong': [-35.45993547543438, -8.237977282077168], 'name': 'Metropolitana'}","{'latlong': [-35.45993547543438, -8.237977282077168], 'name': 'Metropolitana'}",21538
2010,"{'latlong': [-35.45993547543438, -8.237977282077168], 'name': 'Metropolitana'}","{'latlong': [-36.44705331304556, -8.597091004271139], 'name': 'Agreste'}",29
2010,"{'latlong': [-36.44705331304556, -8.597091004271139], 'name': 'Agreste'}","{'latlong': [-35.45993547543438, -8.237977282077168], 'name': 'Metropolitana'}",2498
2010,"{'latlong': [-36.44705331304556, -8.597091004271139], 'name': 'Agreste'}","{'latlong': [-36.44705331304556, -8.597091004271139], 'name': 'Agreste'}",1863
2010,"{'latlong': [-36.44705331304556, -8.597091004271139], 'name': 'Agreste'}","{'latlong': [-37.865288937823316, -8.306290795258281], 'name': 'Sertão'}",12
2010,"{'latlong': [-37.865288937823316, -8.306290795258281], 'name': 'Sertão'}","{'latlong': [-35.45993547543438, -8.237977282077168], 'name': 'Metropolitana'}",1242
2010,"{'latlong': [-37.865288937823316, -8.306290795258281], 'name': 'Sertão'}","{'latlong': [-36.44705331304556, -8.597091004271139], 'name': 'Agreste'}",32
2010,"{'latlong': [-37.865288937823316, -8.306290795258281], 'name': 'Sertão'}","{'latlong': [-37.865288937823316, -8.306290795258281], 'name': 'Sertão'}",653
2010,"{'latlong': [-37.865288937823316, -8.306290795258281], 'name': 'Sertão'}","{'latlong': [-39.95936095628068, -8.364764974735124], 'name': 'Vale do S.Francisco e Araripe'}",4
2010,"{'latlong': [-39.95936095628068, -8.364764974735124], 'name': 'Vale do S.Francisco e Araripe'}","{'latlong': [-35.45993547543438, -8.237977282077168], 'name': 'Metropolitana'}",1120
2010,"{'latlong': [-39.95936095628068, -8.364764974735124], 'name': 'Vale do S.Francisco e Araripe'}","{'latlong': [-36.44705331304556, -8.597091004271139], 'name': 'Agreste'}",3
2010,"{'latlong': [-39.95936095628068, -8.364764974735124], 'name': 'Vale do S.Francisco e Araripe'}","{'latlong': [-37.865288937823316, -8.306290795258281], 'name': 'Sertão'}",7
2010,"{'latlong': [-39.95936095628068, -8.364764974735124], 'name': 'Vale do S.Francisco e Araripe'}","{'latlong': [-39.95936095628068, -8.364764974735124], 'name': 'Vale do S.Francisco e Araripe'}",793
2011,"{'latlong': [-35.45993547543438, -8.237977282077168], 'name': 'Metropolitana'}","{'latlong': [-35.45993547543438, -8.237977282077168], 'name': 'Metropolitana'}",23942
2011,"{'latlong': [-35.45993547543438, -8.237977282077168], 'name': 'Metropolitana'}","{'latlong': [-36.44705331304556, -8.597091004271139], 'name': 'Agreste'}",33
2011,"{'latlong': [-35.45993547543438, -8.237977282077168], 'name': 'Metropolitana'}","{'latlong': [-39.95936095628068, -8.364764974735124], 'name': 'Vale do S.Francisco e Araripe'}",1
2011,"{'latlong': [-36.44705331304556, -8.597091004271139], 'name': 'Agreste'}","{'latlong': [-35.45993547543438, -8.237977282077168], 'name': 'Metropolitana'}",3055
2011,"{'latlong': [-36.44705331304556, -8.597091004271139], 'name': 'Agreste'}","{'latlong': [-36.44705331304556, -8.597091004271139], 'name': 'Agreste'}",1658
2011,"{'latlong': [-36.44705331304556, -8.597091004271139], 'name': 'Agreste'}","{'latlong': [-37.865288937823316, -8.306290795258281], 'name': 'Sertão'}",6
2011,"{'latlong': [-36.44705331304556, -8.597091004271139], 'name': 'Agreste'}","{'latlong': [-39.95936095628068, -8.364764974735124], 'name': 'Vale do S.Francisco e Araripe'}",2
2011,"{'latlong': [-37.865288937823316, -8.306290795258281], 'name': 'Sertão'}","{'latlong': [-35.45993547543438, -8.237977282077168], 'name': 'Metropolitana'}",1459
2011,"{'latlong': [-37.865288937823316, -8.306290795258281], 'name': 'Sertão'}","{'latlong': [-36.44705331304556, -8.597091004271139], 'name': 'Agreste'}",24
2011,"{'latlong': [-37.865288937823316, -8.306290795258281], 'name': 'Sertão'}","{'latlong': [-37.865288937823316, -8.306290795258281], 'name': 'Sertão'}",707
2011,"{'latlong': [-37.865288937823316, -8.306290795258281], 'name': 'Sertão'}","{'latlong': [-39.95936095628068, -8.364764974735124], 'name': 'Vale do S.Francisco e Araripe'}",6
2011,"{'latlong': [-39.95936095628068, -8.364764974735124], 'name': 'Vale do S.Francisco e Araripe'}","{'latlong': [-35.45993547543438, -8.237977282077168], 'name': 'Metropolitana'}",1106
2011,"{'latlong': [-39.95936095628068, -8.364764974735124], 'name': 'Vale do S.Francisco e Araripe'}","{'latlong': [-36.44705331304556, -8.597091004271139], 'name': 'Agreste'}",3
2011,"{'latlong': [-39.95936095628068, -8.364764974735124], 'name': 'Vale do S.Francisco e Araripe'}","{'latlong': [-37.865288937823316, -8.306290795258281], 'name': 'Sertão'}",21
2011,"{'latlong': [-39.95936095628068, -8.364764974735124], 'name': 'Vale do S.Francisco e Araripe'}","{'latlong': [-39.95936095628068, -8.364764974735124], 'name': 'Vale do S.Francisco e Araripe'}",1027
2012,"{'latlong': [-35.45993547543438, -8.237977282077168], 'name': 'Metropolitana'}","{'latlong': [-35.45993547543438, -8.237977282077168], 'name': 'Metropolitana'}",24340
2012,"{'latlong': [-35.45993547543438, -8.237977282077168], 'name': 'Metropolitana'}","{'latlong': [-36.44705331304556, -8.597091004271139], 'name': 'Agreste'}",51
2012,"{'latlong': [-36.44705331304556, -8.597091004271139], 'name': 'Agreste'}","{'latlong': [-35.45993547543438, -8.237977282077168], 'name': 'Metropolitana'}",3163
2012,"{'latlong': [-36.44705331304556, -8.597091004271139], 'name': 'Agreste'}","{'latlong': [-36.44705331304556, -8.597091004271139], 'name': 'Agreste'}",1994
2012,"{'latlong': [-36.44705331304556, -8.597091004271139], 'name': 'Agreste'}","{'latlong': [-37.865288937823316, -8.306290795258281], 'name': 'Sertão'}",3
2012,"{'latlong': [-37.865288937823316, -8.306290795258281], 'name': 'Sertão'}","{'latlong': [-35.45993547543438, -8.237977282077168], 'name': 'Metropolitana'}",1657
2012,"{'latlong': [-37.865288937823316, -8.306290795258281], 'name': 'Sertão'}","{'latlong': [-36.44705331304556, -8.597091004271139], 'name': 'Agreste'}",38
2012,"{'latlong': [-37.865288937823316, -8.306290795258281], 'name': 'Sertão'}","{'latlong': [-37.865288937823316, -8.306290795258281], 'name': 'Sertão'}",585
2012,"{'latlong': [-37.865288937823316, -8.306290795258281], 'name': 'Sertão'}","{'latlong': [-39.95936095628068, -8.364764974735124], 'name': 'Vale do S.Francisco e Araripe'}",2
2012,"{'latlong': [-39.95936095628068, -8.364764974735124], 'name': 'Vale do S.Francisco e Araripe'}","{'latlong': [-35.45993547543438, -8.237977282077168], 'name': 'Metropolitana'}",1166
2012,"{'latlong': [-39.95936095628068, -8.364764974735124], 'name': 'Vale do S.Francisco e Araripe'}","{'latlong': [-36.44705331304556, -8.597091004271139], 'name': 'Agreste'}",6
2012,"{'latlong': [-39.95936095628068, -8.364764974735124], 'name': 'Vale do S.Francisco e Araripe'}","{'latlong': [-37.865288937823316, -8.306290795258281], 'name': 'Sertão'}",27
2012,"{'latlong': [-39.95936095628068, -8.364764974735124], 'name': 'Vale do S.Francisco e Araripe'}","{'latlong': [-39.95936095628068, -8.364764974735124], 'name': 'Vale do S.Francisco e Araripe'}",1144
2013,"{'latlong': [-35.45993547543438, -8.237977282077168], 'name': 'Metropolitana'}","{'latlong': [-35.45993547543438, -8.237977282077168], 'name': 'Metropolitana'}",27022
2013,"{'latlong': [-35.45993547543438, -8.237977282077168], 'name': 'Metropolitana'}","{'latlong': [-36.44705331304556, -8.597091004271139], 'name': 'Agreste'}",66
2013,"{'latlong': [-36.44705331304556, -8.597091004271139], 'name': 'Agreste'}","{'latlong': [-35.45993547543438, -8.237977282077168], 'name': 'Metropolitana'}",3780
2013,"{'latlong': [-36.44705331304556, -8.597091004271139], 'name': 'Agreste'}","{'latlong': [-36.44705331304556, -8.597091004271139], 'name': 'Agreste'}",1892
2013,"{'latlong': [-36.44705331304556, -8.597091004271139], 'name': 'Agreste'}","{'latlong': [-37.865288937823316, -8.306290795258281], 'name': 'Sertão'}",8
2013,"{'latlong': [-37.865288937823316, -8.306290795258281], 'name': 'Sertão'}","{'latlong': [-35.45993547543438, -8.237977282077168], 'name': 'Metropolitana'}",1875
2013,"{'latlong': [-37.865288937823316, -8.306290795258281], 'name': 'Sertão'}","{'latlong': [-36.44705331304556, -8.597091004271139], 'name': 'Agreste'}",52
2013,"{'latlong': [-37.865288937823316, -8.306290795258281], 'name': 'Sertão'}","{'latlong': [-37.865288937823316, -8.306290795258281], 'name': 'Sertão'}",569
2013,"{'latlong': [-37.865288937823316, -8.306290795258281], 'name': 'Sertão'}","{'latlong': [-39.95936095628068, -8.364764974735124], 'name': 'Vale do S.Francisco e Araripe'}",1
2013,"{'latlong': [-39.95936095628068, -8.364764974735124], 'name': 'Vale do S.Francisco e Araripe'}","{'latlong': [-35.45993547543438, -8.237977282077168], 'name': 'Metropolitana'}",1095
2013,"{'latlong': [-39.95936095628068, -8.364764974735124], 'name': 'Vale do S.Francisco e Araripe'}","{'latlong': [-36.44705331304556, -8.597091004271139], 'name': 'Agreste'}",1
2013,"{'latlong': [-39.95936095628068, -8.364764974735124], 'name': 'Vale do S.Francisco e Araripe'}","{'latlong': [-37.865288937823316, -8.306290795258281], 'name': 'Sertão'}",3
2013,"{'latlong': [-39.95936095628068, -8.364764974735124], 'name': 'Vale do S.Francisco e Araripe'}","{'latlong': [-39.95936095628068, -8.364764974735124], 'name': 'Vale do S.Francisco e Araripe'}",1171
2014,"{'latlong': [-35.45993547543438, -8.237977282077168], 'name': 'Metropolitana'}","{'latlong': [-35.45993547543438, -8.237977282077168], 'name': 'Metropolitana'}",25826
2014,"{'latlong': [-35.45993547543438, -8.237977282077168], 'name': 'Metropolitana'}","{'latlong': [-36.44705331304556, -8.597091004271139], 'name': 'Agreste'}",35
2014,"{'latlong': [-35.45993547543438, -8.237977282077168], 'name': 'Metropolitana'}","{'latlong': [-37.865288937823316, -8.306290795258281], 'name': 'Sertão'}",3
2014,"{'latlong': [-36.44705331304556, -8.597091004271139], 'name': 'Agreste'}","{'latlong': [-35.45993547543438, -8.237977282077168], 'name': 'Metropolitana'}",3989
2014,"{'latlong': [-36.44705331304556, -8.597091004271139], 'name': 'Agreste'}","{'latlong': [-36.44705331304556, -8.597091004271139], 'name': 'Agreste'}",1618
2014,"{'latlong': [-36.44705331304556, -8.597091004271139], 'name': 'Agreste'}","{'latlong': [-37.865288937823316, -8.306290795258281], 'name': 'Sertão'}",6
2014,"{'latlong': [-37.865288937823316, -8.306290795258281], 'name': 'Sertão'}","{'latlong': [-35.45993547543438, -8.237977282077168], 'name': 'Metropolitana'}",1928
2014,"{'latlong': [-37.865288937823316, -8.306290795258281], 'name': 'Sertão'}","{'latlong': [-36.44705331304556, -8.597091004271139], 'name': 'Agreste'}",22
2014,"{'latlong': [-37.865288937823316, -8.306290795258281], 'name': 'Sertão'}","{'latlong': [-37.865288937823316, -8.306290795258281], 'name': 'Sertão'}",652
2014,"{'latlong': [-37.865288937823316, -8.306290795258281], 'name': 'Sertão'}","{'latlong': [-39.95936095628068, -8.364764974735124], 'name': 'Vale do S.Francisco e Araripe'}",1
2014,"{'latlong': [-39.95936095628068, -8.364764974735124], 'name': 'Vale do S.Francisco e Araripe'}","{'latlong': [-35.45993547543438, -8.237977282077168], 'name': 'Metropolitana'}",1173
2014,"{'latlong': [-39.95936095628068, -8.364764974735124], 'name': 'Vale do S.Francisco e Araripe'}","{'latlong': [-37.865288937823316, -8.306290795258281], 'name': 'Sertão'}",26
2014,"{'latlong': [-39.95936095628068, -8.364764974735124], 'name': 'Vale do S.Francisco e Araripe'}","{'latlong': [-39.95936095628068, -8.364764974735124], 'name': 'Vale do S.Francisco e Araripe'}",1258
2015,"{'latlong': [-35.45993547543438, -8.237977282077168], 'name': 'Metropolitana'}","{'latlong': [-35.45993547543438, -8.237977282077168], 'name': 'Metropolitana'}",26665
2015,"{'latlong': [-35.45993547543438, -8.237977282077168], 'name': 'Metropolitana'}","{'latlong': [-36.44705331304556, -8.597091004271139], 'name': 'Agreste'}",49
2015,"{'latlong': [-35.45993547543438, -8.237977282077168], 'name': 'Metropolitana'}","{'latlong': [-37.865288937823316, -8.306290795258281], 'name': 'Sertão'}",1
2015,"{'latlong': [-36.44705331304556, -8.597091004271139], 'name': 'Agreste'}","{'latlong': [-35.45993547543438, -8.237977282077168], 'name': 'Metropolitana'}",4103
2015,"{'latlong': [-36.44705331304556, -8.597091004271139], 'name': 'Agreste'}","{'latlong': [-36.44705331304556, -8.597091004271139], 'name': 'Agreste'}",1863
2015,"{'latlong': [-36.44705331304556, -8.597091004271139], 'name': 'Agreste'}","{'latlong': [-37.865288937823316, -8.306290795258281], 'name': 'Sertão'}",8
2015,"{'latlong': [-37.865288937823316, -8.306290795258281], 'name': 'Sertão'}","{'latlong': [-35.45993547543438, -8.237977282077168], 'name': 'Metropolitana'}",1992
2015,"{'latlong': [-37.865288937823316, -8.306290795258281], 'name': 'Sertão'}","{'latlong': [-36.44705331304556, -8.597091004271139], 'name': 'Agreste'}",50
2015,"{'latlong': [-37.865288937823316, -8.306290795258281], 'name': 'Sertão'}","{'latlong': [-37.865288937823316, -8.306290795258281], 'name': 'Sertão'}",692
2015,"{'latlong': [-37.865288937823316, -8.306290795258281], 'name': 'Sertão'}","{'latlong': [-39.95936095628068, -8.364764974735124], 'name': 'Vale do S.Francisco e Araripe'}",5
2015,"{'latlong': [-39.95936095628068, -8.364764974735124], 'name': 'Vale do S.Francisco e Araripe'}","{'latlong': [-35.45993547543438, -8.237977282077168], 'name': 'Metropolitana'}",1257
2015,"{'latlong': [-39.95936095628068, -8.364764974735124], 'name': 'Vale do S.Francisco e Araripe'}","{'latlong': [-36.44705331304556, -8.597091004271139], 'name': 'Agreste'}",2
2015,"{'latlong': [-39.95936095628068, -8.364764974735124], 'name': 'Vale do S.Francisco e Araripe'}","{'latlong': [-37.865288937823316, -8.306290795258281], 'name': 'Sertão'}",90
2015,"{'latlong': [-39.95936095628068, -8.364764974735124], 'name': 'Vale do S.Francisco e Araripe'}","{'latlong': [-39.95936095628068, -8.364764974735124], 'name': 'Vale do S.Francisco e Araripe'}",937
2016,"{'latlong': [-35.45993547543438, -8.237977282077168], 'name': 'Metropolitana'}","{'latlong': [-35.45993547543438, -8.237977282077168], 'name': 'Metropolitana'}",28694
2016,"{'latlong': [-35.45993547543438, -8.237977282077168], 'name': 'Metropolitana'}","{'latlong': [-36.44705331304556, -8.597091004271139], 'name': 'Agreste'}",46
2016,"{'latlong': [-36.44705331304556, -8.597091004271139], 'name': 'Agreste'}","{'latlong': [-35.45993547543438, -8.237977282077168], 'name': 'Metropolitana'}",4715
2016,"{'latlong': [-36.44705331304556, -8.597091004271139], 'name': 'Agreste'}","{'latlong': [-36.44705331304556, -8.597091004271139], 'name': 'Agreste'}",1436
2016,"{'latlong': [-36.44705331304556, -8.597091004271139], 'name': 'Agreste'}","{'latlong': [-37.865288937823316, -8.306290795258281], 'name': 'Sertão'}",13
2016,"{'latlong': [-37.865288937823316, -8.306290795258281], 'name': 'Sertão'}","{'latlong': [-35.45993547543438, -8.237977282077168], 'name': 'Metropolitana'}",2188
2016,"{'latlong': [-37.865288937823316, -8.306290795258281], 'name': 'Sertão'}","{'latlong': [-36.44705331304556, -8.597091004271139], 'name': 'Agreste'}",53
2016,"{'latlong': [-37.865288937823316, -8.306290795258281], 'name': 'Sertão'}","{'latlong': [-37.865288937823316, -8.306290795258281], 'name': 'Sertão'}",425
2016,"{'latlong': [-37.865288937823316, -8.306290795258281], 'name': 'Sertão'}","{'latlong': [-39.95936095628068, -8.364764974735124], 'name': 'Vale do S.Francisco e Araripe'}",3
2016,"{'latlong': [-39.95936095628068, -8.364764974735124], 'name': 'Vale do S.Francisco e Araripe'}","{'latlong': [-35.45993547543438, -8.237977282077168], 'name': 'Metropolitana'}",1320
2016,"{'latlong': [-39.95936095628068, -8.364764974735124], 'name': 'Vale do S.Francisco e Araripe'}","{'latlong': [-36.44705331304556, -8.597091004271139], 'name': 'Agreste'}",1
2016,"{'latlong': [-39.95936095628068, -8.364764974735124], 'name': 'Vale do S.Francisco e Araripe'}","{'latlong': [-37.865288937823316, -8.306290795258281], 'name': 'Sertão'}",37
2016,"{'latlong': [-39.95936095628068, -8.364764974735124], 'name': 'Vale do S.Francisco e Araripe'}","{'latlong': [-39.95936095628068, -8.364764974735124], 'name': 'Vale do S.Francisco e Araripe'}",955
2017,"{'latlong': [-35.45993547543438, -8.237977282077168], 'name': 'Metropolitana'}","{'latlong': [-35.45993547543438, -8.237977282077168], 'name': 'Metropolitana'}",29729
2017,"{'latlong': [-35.45993547543438, -8.237977282077168], 'name': 'Metropolitana'}","{'latlong': [-36.44705331304556, -8.597091004271139], 'name': 'Agreste'}",43
2017,"{'latlong': [-35.45993547543438, -8.237977282077168], 'name': 'Metropolitana'}","{'latlong': [-37.865288937823316, -8.306290795258281], 'name': 'Sertão'}",1
2017,"{'latlong': [-36.44705331304556, -8.597091004271139], 'name': 'Agreste'}","{'latlong': [-35.45993547543438, -8.237977282077168], 'name': 'Metropolitana'}",4794
2017,"{'latlong': [-36.44705331304556, -8.597091004271139], 'name': 'Agreste'}","{'latlong': [-36.44705331304556, -8.597091004271139], 'name': 'Agreste'}",1808
2017,"{'latlong': [-36.44705331304556, -8.597091004271139], 'name': 'Agreste'}","{'latlong': [-37.865288937823316, -8.306290795258281], 'name': 'Sertão'}",6
2017,"{'latlong': [-37.865288937823316, -8.306290795258281], 'name': 'Sertão'}","{'latlong': [-35.45993547543438, -8.237977282077168], 'name': 'Metropolitana'}",2202
2017,"{'latlong': [-37.865288937823316, -8.306290795258281], 'name': 'Sertão'}","{'latlong': [-36.44705331304556, -8.597091004271139], 'name': 'Agreste'}",79
2017,"{'latlong': [-37.865288937823316, -8.306290795258281], 'name': 'Sertão'}","{'latlong': [-37.865288937823316, -8.306290795258281], 'name': 'Sertão'}",477
2017,"{'latlong': [-37.865288937823316, -8.306290795258281], 'name': 'Sertão'}","{'latlong': [-39.95936095628068, -8.364764974735124], 'name': 'Vale do S.Francisco e Araripe'}",3
2017,"{'latlong': [-39.95936095628068, -8.364764974735124], 'name': 'Vale do S.Francisco e Araripe'}","{'latlong': [-35.45993547543438, -8.237977282077168], 'name': 'Metropolitana'}",1545
2017,"{'latlong': [-39.95936095628068, -8.364764974735124], 'name': 'Vale do S.Francisco e Araripe'}","{'latlong': [-36.44705331304556, -8.597091004271139], 'name': 'Agreste'}",2
2017,"{'latlong': [-39.95936095628068, -8.364764974735124], 'name': 'Vale do S.Francisco e Araripe'}","{'latlong': [-39.95936095628068, -8.364764974735124], 'name': 'Vale do S.Francisco e Araripe'}",1383
2018,"{'latlong': [-35.45993547543438, -8.237977282077168], 'name': 'Metropolitana'}","{'latlong': [-35.45993547543438, -8.237977282077168], 'name': 'Metropolitana'}",29598
2018,"{'latlong': [-35.45993547543438, -8.237977282077168], 'name': 'Metropolitana'}","{'latlong': [-36.44705331304556, -8.597091004271139], 'name': 'Agreste'}",59
2018,"{'latlong': [-35.45993547543438, -8.237977282077168], 'name': 'Metropolitana'}","{'latlong': [-37.865288937823316, -8.306290795258281], 'name': 'Sertão'}",12
2018,"{'latlong': [-35.45993547543438, -8.237977282077168], 'name': 'Metropolitana'}","{'latlong': [-39.95936095628068, -8.364764974735124], 'name': 'Vale do S.Francisco e Araripe'}",1
2018,"{'latlong': [-36.44705331304556, -8.597091004271139], 'name': 'Agreste'}","{'latlong': [-35.45993547543438, -8.237977282077168], 'name': 'Metropolitana'}",4833
2018,"{'latlong': [-36.44705331304556, -8.597091004271139], 'name': 'Agreste'}","{'latlong': [-36.44705331304556, -8.597091004271139], 'name': 'Agreste'}",1775
2018,"{'latlong': [-36.44705331304556, -8.597091004271139], 'name': 'Agreste'}","{'latlong': [-37.865288937823316, -8.306290795258281], 'name': 'Sertão'}",13
2018,"{'latlong': [-37.865288937823316, -8.306290795258281], 'name': 'Sertão'}","{'latlong': [-35.45993547543438, -8.237977282077168], 'name': 'Metropolitana'}",2343
2018,"{'latlong': [-37.865288937823316, -8.306290795258281], 'name': 'Sertão'}","{'latlong': [-36.44705331304556, -8.597091004271139], 'name': 'Agreste'}",49
2018,"{'latlong': [-37.865288937823316, -8.306290795258281], 'name': 'Sertão'}","{'latlong': [-37.865288937823316, -8.306290795258281], 'name': 'Sertão'}",841
2018,"{'latlong': [-37.865288937823316, -8.306290795258281], 'name': 'Sertão'}","{'latlong': [-39.95936095628068, -8.364764974735124], 'name': 'Vale do S.Francisco e Araripe'}",6
2018,"{'latlong': [-39.95936095628068, -8.364764974735124], 'name': 'Vale do S.Francisco e Araripe'}","{'latlong': [-35.45993547543438, -8.237977282077168], 'name': 'Metropolitana'}",1298
2018,"{'latlong': [-39.95936095628068, -8.364764974735124], 'name': 'Vale do S.Francisco e Araripe'}","{'latlong': [-36.44705331304556, -8.597091004271139], 'name': 'Agreste'}",2
2018,"{'latlong': [-39.95936095628068, -8.364764974735124], 'name': 'Vale do S.Francisco e Araripe'}","{'latlong': [-37.865288937823316, -8.306290795258281], 'name': 'Sertão'}",28
2018,"{'latlong': [-39.95936095628068, -8.364764974735124], 'name': 'Vale do S.Francisco e Araripe'}","{'latlong': [-39.95936095628068, -8.364764974735124], 'name': 'Vale do S.Francisco e Araripe'}",1475
2019,"{'latlong': [-35.45993547543438, -8.237977282077168], 'name': 'Metropolitana'}","{'latlong': [-35.45993547543438, -8.237977282077168], 'name': 'Metropolitana'}",32216
2019,"{'latlong': [-35.45993547543438, -8.237977282077168], 'name': 'Metropolitana'}","{'latlong': [-36.44705331304556, -8.597091004271139], 'name': 'Agreste'}",49
2019,"{'latlong': [-35.45993547543438, -8.237977282077168], 'name': 'Metropolitana'}","{'latlong': [-37.865288937823316, -8.306290795258281], 'name': 'Sertão'}",15
2019,"{'latlong': [-35.45993547543438, -8.237977282077168], 'name': 'Metropolitana'}","{'latlong': [-39.95936095628068, -8.364764974735124], 'name': 'Vale do S.Francisco e Araripe'}",1
2019,"{'latlong': [-36.44705331304556, -8.597091004271139], 'name': 'Agreste'}","{'latlong': [-35.45993547543438, -8.237977282077168], 'name': 'Metropolitana'}",4948
2019,"{'latlong': [-36.44705331304556, -8.597091004271139], 'name': 'Agreste'}","{'latlong': [-36.44705331304556, -8.597091004271139], 'name': 'Agreste'}",1761
2019,"{'latlong': [-36.44705331304556, -8.597091004271139], 'name': 'Agreste'}","{'latlong': [-37.865288937823316, -8.306290795258281], 'name': 'Sertão'}",30
2019,"{'latlong': [-37.865288937823316, -8.306290795258281], 'name': 'Sertão'}","{'latlong': [-35.45993547543438, -8.237977282077168], 'name': 'Metropolitana'}",2400
2019,"{'latlong': [-37.865288937823316, -8.306290795258281], 'name': 'Sertão'}","{'latlong': [-36.44705331304556, -8.597091004271139], 'name': 'Agreste'}",52
2019,"{'latlong': [-37.865288937823316, -8.306290795258281], 'name': 'Sertão'}","{'latlong': [-37.865288937823316, -8.306290795258281], 'name': 'Sertão'}",1121
2019,"{'latlong': [-37.865288937823316, -8.306290795258281], 'name': 'Sertão'}","{'latlong': [-39.95936095628068, -8.364764974735124], 'name': 'Vale do S.Francisco e Araripe'}",6
2019,"{'latlong': [-39.95936095628068, -8.364764974735124], 'name': 'Vale do S.Francisco e Araripe'}","{'latlong': [-35.45993547543438, -8.237977282077168], 'name': 'Metropolitana'}",1651
2019,"{'latlong': [-39.95936095628068, -8.364764974735124], 'name': 'Vale do S.Francisco e Araripe'}","{'latlong': [-36.44705331304556, -8.597091004271139], 'name': 'Agreste'}",1
2019,"{'latlong': [-39.95936095628068, -8.364764974735124], 'name': 'Vale do S.Francisco e Araripe'}","{'latlong': [-37.865288937823316, -8.306290795258281], 'name': 'Sertão'}",106
2019,"{'latlong': [-39.95936095628068, -8.364764974735124], 'name': 'Vale do S.Francisco e Araripe'}","{'latlong': [-39.95936095628068, -8.364764974735124], 'name': 'Vale do S.Francisco e Araripe'}",1457
2020,"{'latlong': [-35.45993547543438, -8.237977282077168], 'name': 'Metropolitana'}","{'latlong': [-35.45993547543438, -8.237977282077168], 'name': 'Metropolitana'}",11314
2020,"{'latlong': [-35.45993547543438, -8.237977282077168], 'name': 'Metropolitana'}","{'latlong': [-36.44705331304556, -8.597091004271139], 'name': 'Agreste'}",15
2020,"{'latlong': [-35.45993547543438, -8.237977282077168], 'name': 'Metropolitana'}","{'latlong': [-37.865288937823316, -8.306290795258281], 'name': 'Sertão'}",2
2020,"{'latlong': [-36.44705331304556, -8.597091004271139], 'name': 'Agreste'}","{'latlong': [-35.45993547543438, -8.237977282077168], 'name': 'Metropolitana'}",1791
2020,"{'latlong': [-36.44705331304556, -8.597091004271139], 'name': 'Agreste'}","{'latlong': [-36.44705331304556, -8.597091004271139], 'name': 'Agreste'}",591
2020,"{'latlong': [-36.44705331304556, -8.597091004271139], 'name': 'Agreste'}","{'latlong': [-37.865288937823316, -8.306290795258281], 'name': 'Sertão'}",9
2020,"{'latlong': [-37.865288937823316, -8.306290795258281], 'name': 'Sertão'}","{'latlong': [-35.45993547543438, -8.237977282077168], 'name': 'Metropolitana'}",810
2020,"{'latlong': [-37.865288937823316, -8.306290795258281], 'name': 'Sertão'}","{'latlong': [-36.44705331304556, -8.597091004271139], 'name': 'Agreste'}",19
2020,"{'latlong': [-37.865288937823316, -8.306290795258281], 'name': 'Sertão'}","{'latlong': [-37.865288937823316, -8.306290795258281], 'name': 'Sertão'}",407
2020,"{'latlong': [-37.865288937823316, -8.306290795258281], 'name': 'Sertão'}","{'latlong': [-39.95936095628068, -8.364764974735124], 'name': 'Vale do S.Francisco e Araripe'}",2
2020,"{'latlong': [-39.95936095628068, -8.364764974735124], 'name': 'Vale do S.Francisco e Araripe'}","{'latlong': [-35.45993547543438, -8.237977282077168], 'name': 'Metropolitana'}",488
2020,"{'latlong': [-39.95936095628068, -8.364764974735124], 'name': 'Vale do S.Francisco e Araripe'}","{'latlong': [-36.44705331304556, -8.597091004271139], 'name': 'Agreste'}",1
2020,"{'latlong': [-39.95936095628068, -8.364764974735124], 'name': 'Vale do S.Francisco e Araripe'}","{'latlong': [-37.865288937823316, -8.306290795258281], 'name': 'Sertão'}",34
2020,"{'latlong': [-39.95936095628068, -8.364764974735124], 'name': 'Vale do S.Francisco e Araripe'}","{'latlong': [-39.95936095628068, -8.364764974735124], 'name': 'Vale do S.Francisco e Araripe'}",551
