year,all
1994,47.18914845516202
1995,48.049034870434134
1996,49.552646751083685
1997,56.578530117934854
1998,66.96837363729605
1999,62.86400625421982
2000,67.83011352320256
2001,61.41962907645968
2002,65.69540210428116
2003,61.27569528415962
2004,60.04481330278947
2005,62.46606674971006
2006,57.83670320601374
2007,63.23907803359001
2008,61.57567875142254
2009,77.00859540445964
2010,86.94051095663141
2011,77.7227091515907
2012,81.79251108351315
2013,79.27134434195844
2014,86.74497226409056
2015,87.87886403619
2016,81.87490493578933
2017,76.6086231530079
2018,85.38657274518626
2019,88.84609534510113
2020,
