year,from,to,hospitalizations,distance
1995,"{'latlong': [-40.49827164718406, -4.270228494122716], 'name': '2ª Macro - Sobral'}","{'latlong': [-39.04198570967633, -3.972272374155126], 'name': '1ª Macro - Fortaleza'}",2,163.69432955223883
1998,"{'latlong': [-38.26279503575439, -5.2411729332342185], 'name': '5ª Macro - Litoral Leste/Jaguaribe'}","{'latlong': [-38.26279503575439, -5.2411729332342185], 'name': '5ª Macro - Litoral Leste/Jaguaribe'}",1315,0.0
1998,"{'latlong': [-38.26279503575439, -5.2411729332342185], 'name': '5ª Macro - Litoral Leste/Jaguaribe'}","{'latlong': [-39.04198570967633, -3.972272374155126], 'name': '1ª Macro - Fortaleza'}",385,140.29094146329456
1998,"{'latlong': [-38.26279503575439, -5.2411729332342185], 'name': '5ª Macro - Litoral Leste/Jaguaribe'}","{'latlong': [-39.4424043736871, -6.6823328399832285], 'name': '3ª Macro - Cariri'}",9,181.09845882673415
1998,"{'latlong': [-38.26279503575439, -5.2411729332342185], 'name': '5ª Macro - Litoral Leste/Jaguaribe'}","{'latlong': [-39.5970436535868, -5.3600126499898675], 'name': '4ª Macro - Sertão Central'}",1,148.47845738572832
1998,"{'latlong': [-38.26279503575439, -5.2411729332342185], 'name': '5ª Macro - Litoral Leste/Jaguaribe'}","{'latlong': [-40.49827164718406, -4.270228494122716], 'name': '2ª Macro - Sobral'}",4,261.9034991383947
1998,"{'latlong': [-39.04198570967633, -3.972272374155126], 'name': '1ª Macro - Fortaleza'}","{'latlong': [-38.26279503575439, -5.2411729332342185], 'name': '5ª Macro - Litoral Leste/Jaguaribe'}",10,140.29094146329456
1998,"{'latlong': [-39.04198570967633, -3.972272374155126], 'name': '1ª Macro - Fortaleza'}","{'latlong': [-39.04198570967633, -3.972272374155126], 'name': '1ª Macro - Fortaleza'}",12664,0.0
1998,"{'latlong': [-39.04198570967633, -3.972272374155126], 'name': '1ª Macro - Fortaleza'}","{'latlong': [-39.4424043736871, -6.6823328399832285], 'name': '3ª Macro - Cariri'}",1,238.1362922408207
1998,"{'latlong': [-39.04198570967633, -3.972272374155126], 'name': '1ª Macro - Fortaleza'}","{'latlong': [-39.5970436535868, -5.3600126499898675], 'name': '4ª Macro - Sertão Central'}",3,134.60427573279884
1998,"{'latlong': [-39.04198570967633, -3.972272374155126], 'name': '1ª Macro - Fortaleza'}","{'latlong': [-40.49827164718406, -4.270228494122716], 'name': '2ª Macro - Sobral'}",21,163.69432955223883
1998,"{'latlong': [-39.4424043736871, -6.6823328399832285], 'name': '3ª Macro - Cariri'}","{'latlong': [-39.04198570967633, -3.972272374155126], 'name': '1ª Macro - Fortaleza'}",281,238.1362922408207
1998,"{'latlong': [-39.4424043736871, -6.6823328399832285], 'name': '3ª Macro - Cariri'}","{'latlong': [-39.4424043736871, -6.6823328399832285], 'name': '3ª Macro - Cariri'}",7805,0.0
1998,"{'latlong': [-39.4424043736871, -6.6823328399832285], 'name': '3ª Macro - Cariri'}","{'latlong': [-39.5970436535868, -5.3600126499898675], 'name': '4ª Macro - Sertão Central'}",5,114.99291452469504
1998,"{'latlong': [-39.4424043736871, -6.6823328399832285], 'name': '3ª Macro - Cariri'}","{'latlong': [-40.49827164718406, -4.270228494122716], 'name': '2ª Macro - Sobral'}",3,237.07015549816794
1998,"{'latlong': [-39.5970436535868, -5.3600126499898675], 'name': '4ª Macro - Sertão Central'}","{'latlong': [-38.26279503575439, -5.2411729332342185], 'name': '5ª Macro - Litoral Leste/Jaguaribe'}",6,148.47845738572832
1998,"{'latlong': [-39.5970436535868, -5.3600126499898675], 'name': '4ª Macro - Sertão Central'}","{'latlong': [-39.04198570967633, -3.972272374155126], 'name': '1ª Macro - Fortaleza'}",306,134.60427573279884
1998,"{'latlong': [-39.5970436535868, -5.3600126499898675], 'name': '4ª Macro - Sertão Central'}","{'latlong': [-39.4424043736871, -6.6823328399832285], 'name': '3ª Macro - Cariri'}",19,114.99291452469504
1998,"{'latlong': [-39.5970436535868, -5.3600126499898675], 'name': '4ª Macro - Sertão Central'}","{'latlong': [-39.5970436535868, -5.3600126499898675], 'name': '4ª Macro - Sertão Central'}",1558,0.0
1998,"{'latlong': [-39.5970436535868, -5.3600126499898675], 'name': '4ª Macro - Sertão Central'}","{'latlong': [-40.49827164718406, -4.270228494122716], 'name': '2ª Macro - Sobral'}",9,136.6063403884904
1998,"{'latlong': [-40.49827164718406, -4.270228494122716], 'name': '2ª Macro - Sobral'}","{'latlong': [-38.26279503575439, -5.2411729332342185], 'name': '5ª Macro - Litoral Leste/Jaguaribe'}",1,261.9034991383947
1998,"{'latlong': [-40.49827164718406, -4.270228494122716], 'name': '2ª Macro - Sobral'}","{'latlong': [-39.04198570967633, -3.972272374155126], 'name': '1ª Macro - Fortaleza'}",227,163.69432955223883
1998,"{'latlong': [-40.49827164718406, -4.270228494122716], 'name': '2ª Macro - Sobral'}","{'latlong': [-39.4424043736871, -6.6823328399832285], 'name': '3ª Macro - Cariri'}",3,237.07015549816794
1998,"{'latlong': [-40.49827164718406, -4.270228494122716], 'name': '2ª Macro - Sobral'}","{'latlong': [-39.5970436535868, -5.3600126499898675], 'name': '4ª Macro - Sertão Central'}",4,136.6063403884904
1998,"{'latlong': [-40.49827164718406, -4.270228494122716], 'name': '2ª Macro - Sobral'}","{'latlong': [-40.49827164718406, -4.270228494122716], 'name': '2ª Macro - Sobral'}",5662,0.0
1999,"{'latlong': [-38.26279503575439, -5.2411729332342185], 'name': '5ª Macro - Litoral Leste/Jaguaribe'}","{'latlong': [-38.26279503575439, -5.2411729332342185], 'name': '5ª Macro - Litoral Leste/Jaguaribe'}",1432,0.0
1999,"{'latlong': [-38.26279503575439, -5.2411729332342185], 'name': '5ª Macro - Litoral Leste/Jaguaribe'}","{'latlong': [-39.04198570967633, -3.972272374155126], 'name': '1ª Macro - Fortaleza'}",447,140.29094146329456
1999,"{'latlong': [-38.26279503575439, -5.2411729332342185], 'name': '5ª Macro - Litoral Leste/Jaguaribe'}","{'latlong': [-39.4424043736871, -6.6823328399832285], 'name': '3ª Macro - Cariri'}",6,181.09845882673415
1999,"{'latlong': [-38.26279503575439, -5.2411729332342185], 'name': '5ª Macro - Litoral Leste/Jaguaribe'}","{'latlong': [-39.5970436535868, -5.3600126499898675], 'name': '4ª Macro - Sertão Central'}",3,148.47845738572832
1999,"{'latlong': [-38.26279503575439, -5.2411729332342185], 'name': '5ª Macro - Litoral Leste/Jaguaribe'}","{'latlong': [-40.49827164718406, -4.270228494122716], 'name': '2ª Macro - Sobral'}",1,261.9034991383947
1999,"{'latlong': [-39.04198570967633, -3.972272374155126], 'name': '1ª Macro - Fortaleza'}","{'latlong': [-38.26279503575439, -5.2411729332342185], 'name': '5ª Macro - Litoral Leste/Jaguaribe'}",3,140.29094146329456
1999,"{'latlong': [-39.04198570967633, -3.972272374155126], 'name': '1ª Macro - Fortaleza'}","{'latlong': [-39.04198570967633, -3.972272374155126], 'name': '1ª Macro - Fortaleza'}",14167,0.0
1999,"{'latlong': [-39.04198570967633, -3.972272374155126], 'name': '1ª Macro - Fortaleza'}","{'latlong': [-39.4424043736871, -6.6823328399832285], 'name': '3ª Macro - Cariri'}",2,238.1362922408207
1999,"{'latlong': [-39.04198570967633, -3.972272374155126], 'name': '1ª Macro - Fortaleza'}","{'latlong': [-39.5970436535868, -5.3600126499898675], 'name': '4ª Macro - Sertão Central'}",2,134.60427573279884
1999,"{'latlong': [-39.04198570967633, -3.972272374155126], 'name': '1ª Macro - Fortaleza'}","{'latlong': [-40.49827164718406, -4.270228494122716], 'name': '2ª Macro - Sobral'}",11,163.69432955223883
1999,"{'latlong': [-39.4424043736871, -6.6823328399832285], 'name': '3ª Macro - Cariri'}","{'latlong': [-39.04198570967633, -3.972272374155126], 'name': '1ª Macro - Fortaleza'}",309,238.1362922408207
1999,"{'latlong': [-39.4424043736871, -6.6823328399832285], 'name': '3ª Macro - Cariri'}","{'latlong': [-39.4424043736871, -6.6823328399832285], 'name': '3ª Macro - Cariri'}",8435,0.0
1999,"{'latlong': [-39.4424043736871, -6.6823328399832285], 'name': '3ª Macro - Cariri'}","{'latlong': [-39.5970436535868, -5.3600126499898675], 'name': '4ª Macro - Sertão Central'}",1,114.99291452469504
1999,"{'latlong': [-39.4424043736871, -6.6823328399832285], 'name': '3ª Macro - Cariri'}","{'latlong': [-40.49827164718406, -4.270228494122716], 'name': '2ª Macro - Sobral'}",2,237.07015549816794
1999,"{'latlong': [-39.5970436535868, -5.3600126499898675], 'name': '4ª Macro - Sertão Central'}","{'latlong': [-38.26279503575439, -5.2411729332342185], 'name': '5ª Macro - Litoral Leste/Jaguaribe'}",17,148.47845738572832
1999,"{'latlong': [-39.5970436535868, -5.3600126499898675], 'name': '4ª Macro - Sertão Central'}","{'latlong': [-39.04198570967633, -3.972272374155126], 'name': '1ª Macro - Fortaleza'}",435,134.60427573279884
1999,"{'latlong': [-39.5970436535868, -5.3600126499898675], 'name': '4ª Macro - Sertão Central'}","{'latlong': [-39.4424043736871, -6.6823328399832285], 'name': '3ª Macro - Cariri'}",11,114.99291452469504
1999,"{'latlong': [-39.5970436535868, -5.3600126499898675], 'name': '4ª Macro - Sertão Central'}","{'latlong': [-39.5970436535868, -5.3600126499898675], 'name': '4ª Macro - Sertão Central'}",1794,0.0
1999,"{'latlong': [-39.5970436535868, -5.3600126499898675], 'name': '4ª Macro - Sertão Central'}","{'latlong': [-40.49827164718406, -4.270228494122716], 'name': '2ª Macro - Sobral'}",17,136.6063403884904
1999,"{'latlong': [-40.49827164718406, -4.270228494122716], 'name': '2ª Macro - Sobral'}","{'latlong': [-39.04198570967633, -3.972272374155126], 'name': '1ª Macro - Fortaleza'}",215,163.69432955223883
1999,"{'latlong': [-40.49827164718406, -4.270228494122716], 'name': '2ª Macro - Sobral'}","{'latlong': [-39.4424043736871, -6.6823328399832285], 'name': '3ª Macro - Cariri'}",1,237.07015549816794
1999,"{'latlong': [-40.49827164718406, -4.270228494122716], 'name': '2ª Macro - Sobral'}","{'latlong': [-40.49827164718406, -4.270228494122716], 'name': '2ª Macro - Sobral'}",5600,0.0
2000,"{'latlong': [-38.26279503575439, -5.2411729332342185], 'name': '5ª Macro - Litoral Leste/Jaguaribe'}","{'latlong': [-38.26279503575439, -5.2411729332342185], 'name': '5ª Macro - Litoral Leste/Jaguaribe'}",1249,0.0
2000,"{'latlong': [-38.26279503575439, -5.2411729332342185], 'name': '5ª Macro - Litoral Leste/Jaguaribe'}","{'latlong': [-39.04198570967633, -3.972272374155126], 'name': '1ª Macro - Fortaleza'}",530,140.29094146329456
2000,"{'latlong': [-38.26279503575439, -5.2411729332342185], 'name': '5ª Macro - Litoral Leste/Jaguaribe'}","{'latlong': [-39.4424043736871, -6.6823328399832285], 'name': '3ª Macro - Cariri'}",4,181.09845882673415
2000,"{'latlong': [-39.04198570967633, -3.972272374155126], 'name': '1ª Macro - Fortaleza'}","{'latlong': [-38.26279503575439, -5.2411729332342185], 'name': '5ª Macro - Litoral Leste/Jaguaribe'}",3,140.29094146329456
2000,"{'latlong': [-39.04198570967633, -3.972272374155126], 'name': '1ª Macro - Fortaleza'}","{'latlong': [-39.04198570967633, -3.972272374155126], 'name': '1ª Macro - Fortaleza'}",15182,0.0
2000,"{'latlong': [-39.04198570967633, -3.972272374155126], 'name': '1ª Macro - Fortaleza'}","{'latlong': [-39.4424043736871, -6.6823328399832285], 'name': '3ª Macro - Cariri'}",10,238.1362922408207
2000,"{'latlong': [-39.04198570967633, -3.972272374155126], 'name': '1ª Macro - Fortaleza'}","{'latlong': [-39.5970436535868, -5.3600126499898675], 'name': '4ª Macro - Sertão Central'}",2,134.60427573279884
2000,"{'latlong': [-39.04198570967633, -3.972272374155126], 'name': '1ª Macro - Fortaleza'}","{'latlong': [-40.49827164718406, -4.270228494122716], 'name': '2ª Macro - Sobral'}",6,163.69432955223883
2000,"{'latlong': [-39.4424043736871, -6.6823328399832285], 'name': '3ª Macro - Cariri'}","{'latlong': [-39.04198570967633, -3.972272374155126], 'name': '1ª Macro - Fortaleza'}",406,238.1362922408207
2000,"{'latlong': [-39.4424043736871, -6.6823328399832285], 'name': '3ª Macro - Cariri'}","{'latlong': [-39.4424043736871, -6.6823328399832285], 'name': '3ª Macro - Cariri'}",8275,0.0
2000,"{'latlong': [-39.4424043736871, -6.6823328399832285], 'name': '3ª Macro - Cariri'}","{'latlong': [-39.5970436535868, -5.3600126499898675], 'name': '4ª Macro - Sertão Central'}",1,114.99291452469504
2000,"{'latlong': [-39.4424043736871, -6.6823328399832285], 'name': '3ª Macro - Cariri'}","{'latlong': [-40.49827164718406, -4.270228494122716], 'name': '2ª Macro - Sobral'}",1,237.07015549816794
2000,"{'latlong': [-39.5970436535868, -5.3600126499898675], 'name': '4ª Macro - Sertão Central'}","{'latlong': [-38.26279503575439, -5.2411729332342185], 'name': '5ª Macro - Litoral Leste/Jaguaribe'}",7,148.47845738572832
2000,"{'latlong': [-39.5970436535868, -5.3600126499898675], 'name': '4ª Macro - Sertão Central'}","{'latlong': [-39.04198570967633, -3.972272374155126], 'name': '1ª Macro - Fortaleza'}",510,134.60427573279884
2000,"{'latlong': [-39.5970436535868, -5.3600126499898675], 'name': '4ª Macro - Sertão Central'}","{'latlong': [-39.4424043736871, -6.6823328399832285], 'name': '3ª Macro - Cariri'}",10,114.99291452469504
2000,"{'latlong': [-39.5970436535868, -5.3600126499898675], 'name': '4ª Macro - Sertão Central'}","{'latlong': [-39.5970436535868, -5.3600126499898675], 'name': '4ª Macro - Sertão Central'}",1604,0.0
2000,"{'latlong': [-39.5970436535868, -5.3600126499898675], 'name': '4ª Macro - Sertão Central'}","{'latlong': [-40.49827164718406, -4.270228494122716], 'name': '2ª Macro - Sobral'}",13,136.6063403884904
2000,"{'latlong': [-40.49827164718406, -4.270228494122716], 'name': '2ª Macro - Sobral'}","{'latlong': [-38.26279503575439, -5.2411729332342185], 'name': '5ª Macro - Litoral Leste/Jaguaribe'}",2,261.9034991383947
2000,"{'latlong': [-40.49827164718406, -4.270228494122716], 'name': '2ª Macro - Sobral'}","{'latlong': [-39.04198570967633, -3.972272374155126], 'name': '1ª Macro - Fortaleza'}",293,163.69432955223883
2000,"{'latlong': [-40.49827164718406, -4.270228494122716], 'name': '2ª Macro - Sobral'}","{'latlong': [-39.4424043736871, -6.6823328399832285], 'name': '3ª Macro - Cariri'}",2,237.07015549816794
2000,"{'latlong': [-40.49827164718406, -4.270228494122716], 'name': '2ª Macro - Sobral'}","{'latlong': [-39.5970436535868, -5.3600126499898675], 'name': '4ª Macro - Sertão Central'}",1,136.6063403884904
2000,"{'latlong': [-40.49827164718406, -4.270228494122716], 'name': '2ª Macro - Sobral'}","{'latlong': [-40.49827164718406, -4.270228494122716], 'name': '2ª Macro - Sobral'}",5304,0.0
2001,"{'latlong': [-38.26279503575439, -5.2411729332342185], 'name': '5ª Macro - Litoral Leste/Jaguaribe'}","{'latlong': [-38.26279503575439, -5.2411729332342185], 'name': '5ª Macro - Litoral Leste/Jaguaribe'}",1698,0.0
2001,"{'latlong': [-38.26279503575439, -5.2411729332342185], 'name': '5ª Macro - Litoral Leste/Jaguaribe'}","{'latlong': [-39.04198570967633, -3.972272374155126], 'name': '1ª Macro - Fortaleza'}",536,140.29094146329456
2001,"{'latlong': [-38.26279503575439, -5.2411729332342185], 'name': '5ª Macro - Litoral Leste/Jaguaribe'}","{'latlong': [-39.4424043736871, -6.6823328399832285], 'name': '3ª Macro - Cariri'}",2,181.09845882673415
2001,"{'latlong': [-39.04198570967633, -3.972272374155126], 'name': '1ª Macro - Fortaleza'}","{'latlong': [-38.26279503575439, -5.2411729332342185], 'name': '5ª Macro - Litoral Leste/Jaguaribe'}",6,140.29094146329456
2001,"{'latlong': [-39.04198570967633, -3.972272374155126], 'name': '1ª Macro - Fortaleza'}","{'latlong': [-39.04198570967633, -3.972272374155126], 'name': '1ª Macro - Fortaleza'}",15728,0.0
2001,"{'latlong': [-39.04198570967633, -3.972272374155126], 'name': '1ª Macro - Fortaleza'}","{'latlong': [-39.4424043736871, -6.6823328399832285], 'name': '3ª Macro - Cariri'}",6,238.1362922408207
2001,"{'latlong': [-39.04198570967633, -3.972272374155126], 'name': '1ª Macro - Fortaleza'}","{'latlong': [-39.5970436535868, -5.3600126499898675], 'name': '4ª Macro - Sertão Central'}",3,134.60427573279884
2001,"{'latlong': [-39.04198570967633, -3.972272374155126], 'name': '1ª Macro - Fortaleza'}","{'latlong': [-40.49827164718406, -4.270228494122716], 'name': '2ª Macro - Sobral'}",7,163.69432955223883
2001,"{'latlong': [-39.4424043736871, -6.6823328399832285], 'name': '3ª Macro - Cariri'}","{'latlong': [-39.04198570967633, -3.972272374155126], 'name': '1ª Macro - Fortaleza'}",377,238.1362922408207
2001,"{'latlong': [-39.4424043736871, -6.6823328399832285], 'name': '3ª Macro - Cariri'}","{'latlong': [-39.4424043736871, -6.6823328399832285], 'name': '3ª Macro - Cariri'}",9271,0.0
2001,"{'latlong': [-39.4424043736871, -6.6823328399832285], 'name': '3ª Macro - Cariri'}","{'latlong': [-39.5970436535868, -5.3600126499898675], 'name': '4ª Macro - Sertão Central'}",1,114.99291452469504
2001,"{'latlong': [-39.5970436535868, -5.3600126499898675], 'name': '4ª Macro - Sertão Central'}","{'latlong': [-38.26279503575439, -5.2411729332342185], 'name': '5ª Macro - Litoral Leste/Jaguaribe'}",18,148.47845738572832
2001,"{'latlong': [-39.5970436535868, -5.3600126499898675], 'name': '4ª Macro - Sertão Central'}","{'latlong': [-39.04198570967633, -3.972272374155126], 'name': '1ª Macro - Fortaleza'}",478,134.60427573279884
2001,"{'latlong': [-39.5970436535868, -5.3600126499898675], 'name': '4ª Macro - Sertão Central'}","{'latlong': [-39.4424043736871, -6.6823328399832285], 'name': '3ª Macro - Cariri'}",10,114.99291452469504
2001,"{'latlong': [-39.5970436535868, -5.3600126499898675], 'name': '4ª Macro - Sertão Central'}","{'latlong': [-39.5970436535868, -5.3600126499898675], 'name': '4ª Macro - Sertão Central'}",1818,0.0
2001,"{'latlong': [-39.5970436535868, -5.3600126499898675], 'name': '4ª Macro - Sertão Central'}","{'latlong': [-40.49827164718406, -4.270228494122716], 'name': '2ª Macro - Sobral'}",10,136.6063403884904
2001,"{'latlong': [-40.49827164718406, -4.270228494122716], 'name': '2ª Macro - Sobral'}","{'latlong': [-39.04198570967633, -3.972272374155126], 'name': '1ª Macro - Fortaleza'}",246,163.69432955223883
2001,"{'latlong': [-40.49827164718406, -4.270228494122716], 'name': '2ª Macro - Sobral'}","{'latlong': [-39.4424043736871, -6.6823328399832285], 'name': '3ª Macro - Cariri'}",2,237.07015549816794
2001,"{'latlong': [-40.49827164718406, -4.270228494122716], 'name': '2ª Macro - Sobral'}","{'latlong': [-39.5970436535868, -5.3600126499898675], 'name': '4ª Macro - Sertão Central'}",1,136.6063403884904
2001,"{'latlong': [-40.49827164718406, -4.270228494122716], 'name': '2ª Macro - Sobral'}","{'latlong': [-40.49827164718406, -4.270228494122716], 'name': '2ª Macro - Sobral'}",5921,0.0
2002,"{'latlong': [-38.26279503575439, -5.2411729332342185], 'name': '5ª Macro - Litoral Leste/Jaguaribe'}","{'latlong': [-38.26279503575439, -5.2411729332342185], 'name': '5ª Macro - Litoral Leste/Jaguaribe'}",2023,0.0
2002,"{'latlong': [-38.26279503575439, -5.2411729332342185], 'name': '5ª Macro - Litoral Leste/Jaguaribe'}","{'latlong': [-39.04198570967633, -3.972272374155126], 'name': '1ª Macro - Fortaleza'}",594,140.29094146329456
2002,"{'latlong': [-38.26279503575439, -5.2411729332342185], 'name': '5ª Macro - Litoral Leste/Jaguaribe'}","{'latlong': [-39.4424043736871, -6.6823328399832285], 'name': '3ª Macro - Cariri'}",5,181.09845882673415
2002,"{'latlong': [-39.04198570967633, -3.972272374155126], 'name': '1ª Macro - Fortaleza'}","{'latlong': [-38.26279503575439, -5.2411729332342185], 'name': '5ª Macro - Litoral Leste/Jaguaribe'}",8,140.29094146329456
2002,"{'latlong': [-39.04198570967633, -3.972272374155126], 'name': '1ª Macro - Fortaleza'}","{'latlong': [-39.04198570967633, -3.972272374155126], 'name': '1ª Macro - Fortaleza'}",16760,0.0
2002,"{'latlong': [-39.04198570967633, -3.972272374155126], 'name': '1ª Macro - Fortaleza'}","{'latlong': [-39.4424043736871, -6.6823328399832285], 'name': '3ª Macro - Cariri'}",2,238.1362922408207
2002,"{'latlong': [-39.04198570967633, -3.972272374155126], 'name': '1ª Macro - Fortaleza'}","{'latlong': [-40.49827164718406, -4.270228494122716], 'name': '2ª Macro - Sobral'}",5,163.69432955223883
2002,"{'latlong': [-39.4424043736871, -6.6823328399832285], 'name': '3ª Macro - Cariri'}","{'latlong': [-39.04198570967633, -3.972272374155126], 'name': '1ª Macro - Fortaleza'}",330,238.1362922408207
2002,"{'latlong': [-39.4424043736871, -6.6823328399832285], 'name': '3ª Macro - Cariri'}","{'latlong': [-39.4424043736871, -6.6823328399832285], 'name': '3ª Macro - Cariri'}",9513,0.0
2002,"{'latlong': [-39.4424043736871, -6.6823328399832285], 'name': '3ª Macro - Cariri'}","{'latlong': [-40.49827164718406, -4.270228494122716], 'name': '2ª Macro - Sobral'}",2,237.07015549816794
2002,"{'latlong': [-39.5970436535868, -5.3600126499898675], 'name': '4ª Macro - Sertão Central'}","{'latlong': [-38.26279503575439, -5.2411729332342185], 'name': '5ª Macro - Litoral Leste/Jaguaribe'}",25,148.47845738572832
2002,"{'latlong': [-39.5970436535868, -5.3600126499898675], 'name': '4ª Macro - Sertão Central'}","{'latlong': [-39.04198570967633, -3.972272374155126], 'name': '1ª Macro - Fortaleza'}",564,134.60427573279884
2002,"{'latlong': [-39.5970436535868, -5.3600126499898675], 'name': '4ª Macro - Sertão Central'}","{'latlong': [-39.4424043736871, -6.6823328399832285], 'name': '3ª Macro - Cariri'}",9,114.99291452469504
2002,"{'latlong': [-39.5970436535868, -5.3600126499898675], 'name': '4ª Macro - Sertão Central'}","{'latlong': [-39.5970436535868, -5.3600126499898675], 'name': '4ª Macro - Sertão Central'}",1586,0.0
2002,"{'latlong': [-39.5970436535868, -5.3600126499898675], 'name': '4ª Macro - Sertão Central'}","{'latlong': [-40.49827164718406, -4.270228494122716], 'name': '2ª Macro - Sobral'}",4,136.6063403884904
2002,"{'latlong': [-40.49827164718406, -4.270228494122716], 'name': '2ª Macro - Sobral'}","{'latlong': [-39.04198570967633, -3.972272374155126], 'name': '1ª Macro - Fortaleza'}",340,163.69432955223883
2002,"{'latlong': [-40.49827164718406, -4.270228494122716], 'name': '2ª Macro - Sobral'}","{'latlong': [-39.5970436535868, -5.3600126499898675], 'name': '4ª Macro - Sertão Central'}",1,136.6063403884904
2002,"{'latlong': [-40.49827164718406, -4.270228494122716], 'name': '2ª Macro - Sobral'}","{'latlong': [-40.49827164718406, -4.270228494122716], 'name': '2ª Macro - Sobral'}",6163,0.0
2003,"{'latlong': [-38.26279503575439, -5.2411729332342185], 'name': '5ª Macro - Litoral Leste/Jaguaribe'}","{'latlong': [-38.26279503575439, -5.2411729332342185], 'name': '5ª Macro - Litoral Leste/Jaguaribe'}",1876,0.0
2003,"{'latlong': [-38.26279503575439, -5.2411729332342185], 'name': '5ª Macro - Litoral Leste/Jaguaribe'}","{'latlong': [-39.04198570967633, -3.972272374155126], 'name': '1ª Macro - Fortaleza'}",585,140.29094146329456
2003,"{'latlong': [-38.26279503575439, -5.2411729332342185], 'name': '5ª Macro - Litoral Leste/Jaguaribe'}","{'latlong': [-39.4424043736871, -6.6823328399832285], 'name': '3ª Macro - Cariri'}",3,181.09845882673415
2003,"{'latlong': [-39.04198570967633, -3.972272374155126], 'name': '1ª Macro - Fortaleza'}","{'latlong': [-38.26279503575439, -5.2411729332342185], 'name': '5ª Macro - Litoral Leste/Jaguaribe'}",4,140.29094146329456
2003,"{'latlong': [-39.04198570967633, -3.972272374155126], 'name': '1ª Macro - Fortaleza'}","{'latlong': [-39.04198570967633, -3.972272374155126], 'name': '1ª Macro - Fortaleza'}",16648,0.0
2003,"{'latlong': [-39.04198570967633, -3.972272374155126], 'name': '1ª Macro - Fortaleza'}","{'latlong': [-39.4424043736871, -6.6823328399832285], 'name': '3ª Macro - Cariri'}",3,238.1362922408207
2003,"{'latlong': [-39.04198570967633, -3.972272374155126], 'name': '1ª Macro - Fortaleza'}","{'latlong': [-39.5970436535868, -5.3600126499898675], 'name': '4ª Macro - Sertão Central'}",1,134.60427573279884
2003,"{'latlong': [-39.04198570967633, -3.972272374155126], 'name': '1ª Macro - Fortaleza'}","{'latlong': [-40.49827164718406, -4.270228494122716], 'name': '2ª Macro - Sobral'}",6,163.69432955223883
2003,"{'latlong': [-39.4424043736871, -6.6823328399832285], 'name': '3ª Macro - Cariri'}","{'latlong': [-39.04198570967633, -3.972272374155126], 'name': '1ª Macro - Fortaleza'}",320,238.1362922408207
2003,"{'latlong': [-39.4424043736871, -6.6823328399832285], 'name': '3ª Macro - Cariri'}","{'latlong': [-39.4424043736871, -6.6823328399832285], 'name': '3ª Macro - Cariri'}",9256,0.0
2003,"{'latlong': [-39.4424043736871, -6.6823328399832285], 'name': '3ª Macro - Cariri'}","{'latlong': [-39.5970436535868, -5.3600126499898675], 'name': '4ª Macro - Sertão Central'}",1,114.99291452469504
2003,"{'latlong': [-39.4424043736871, -6.6823328399832285], 'name': '3ª Macro - Cariri'}","{'latlong': [-40.49827164718406, -4.270228494122716], 'name': '2ª Macro - Sobral'}",4,237.07015549816794
2003,"{'latlong': [-39.5970436535868, -5.3600126499898675], 'name': '4ª Macro - Sertão Central'}","{'latlong': [-38.26279503575439, -5.2411729332342185], 'name': '5ª Macro - Litoral Leste/Jaguaribe'}",22,148.47845738572832
2003,"{'latlong': [-39.5970436535868, -5.3600126499898675], 'name': '4ª Macro - Sertão Central'}","{'latlong': [-39.04198570967633, -3.972272374155126], 'name': '1ª Macro - Fortaleza'}",538,134.60427573279884
2003,"{'latlong': [-39.5970436535868, -5.3600126499898675], 'name': '4ª Macro - Sertão Central'}","{'latlong': [-39.4424043736871, -6.6823328399832285], 'name': '3ª Macro - Cariri'}",7,114.99291452469504
2003,"{'latlong': [-39.5970436535868, -5.3600126499898675], 'name': '4ª Macro - Sertão Central'}","{'latlong': [-39.5970436535868, -5.3600126499898675], 'name': '4ª Macro - Sertão Central'}",1682,0.0
2003,"{'latlong': [-39.5970436535868, -5.3600126499898675], 'name': '4ª Macro - Sertão Central'}","{'latlong': [-40.49827164718406, -4.270228494122716], 'name': '2ª Macro - Sobral'}",4,136.6063403884904
2003,"{'latlong': [-40.49827164718406, -4.270228494122716], 'name': '2ª Macro - Sobral'}","{'latlong': [-39.04198570967633, -3.972272374155126], 'name': '1ª Macro - Fortaleza'}",393,163.69432955223883
2003,"{'latlong': [-40.49827164718406, -4.270228494122716], 'name': '2ª Macro - Sobral'}","{'latlong': [-39.4424043736871, -6.6823328399832285], 'name': '3ª Macro - Cariri'}",1,237.07015549816794
2003,"{'latlong': [-40.49827164718406, -4.270228494122716], 'name': '2ª Macro - Sobral'}","{'latlong': [-39.5970436535868, -5.3600126499898675], 'name': '4ª Macro - Sertão Central'}",1,136.6063403884904
2003,"{'latlong': [-40.49827164718406, -4.270228494122716], 'name': '2ª Macro - Sobral'}","{'latlong': [-40.49827164718406, -4.270228494122716], 'name': '2ª Macro - Sobral'}",5746,0.0
2004,"{'latlong': [-38.26279503575439, -5.2411729332342185], 'name': '5ª Macro - Litoral Leste/Jaguaribe'}","{'latlong': [-38.26279503575439, -5.2411729332342185], 'name': '5ª Macro - Litoral Leste/Jaguaribe'}",1866,0.0
2004,"{'latlong': [-38.26279503575439, -5.2411729332342185], 'name': '5ª Macro - Litoral Leste/Jaguaribe'}","{'latlong': [-39.04198570967633, -3.972272374155126], 'name': '1ª Macro - Fortaleza'}",597,140.29094146329456
2004,"{'latlong': [-38.26279503575439, -5.2411729332342185], 'name': '5ª Macro - Litoral Leste/Jaguaribe'}","{'latlong': [-39.4424043736871, -6.6823328399832285], 'name': '3ª Macro - Cariri'}",4,181.09845882673415
2004,"{'latlong': [-39.04198570967633, -3.972272374155126], 'name': '1ª Macro - Fortaleza'}","{'latlong': [-38.26279503575439, -5.2411729332342185], 'name': '5ª Macro - Litoral Leste/Jaguaribe'}",9,140.29094146329456
2004,"{'latlong': [-39.04198570967633, -3.972272374155126], 'name': '1ª Macro - Fortaleza'}","{'latlong': [-39.04198570967633, -3.972272374155126], 'name': '1ª Macro - Fortaleza'}",17872,0.0
2004,"{'latlong': [-39.04198570967633, -3.972272374155126], 'name': '1ª Macro - Fortaleza'}","{'latlong': [-39.4424043736871, -6.6823328399832285], 'name': '3ª Macro - Cariri'}",1,238.1362922408207
2004,"{'latlong': [-39.04198570967633, -3.972272374155126], 'name': '1ª Macro - Fortaleza'}","{'latlong': [-40.49827164718406, -4.270228494122716], 'name': '2ª Macro - Sobral'}",6,163.69432955223883
2004,"{'latlong': [-39.4424043736871, -6.6823328399832285], 'name': '3ª Macro - Cariri'}","{'latlong': [-39.04198570967633, -3.972272374155126], 'name': '1ª Macro - Fortaleza'}",306,238.1362922408207
2004,"{'latlong': [-39.4424043736871, -6.6823328399832285], 'name': '3ª Macro - Cariri'}","{'latlong': [-39.4424043736871, -6.6823328399832285], 'name': '3ª Macro - Cariri'}",9913,0.0
2004,"{'latlong': [-39.4424043736871, -6.6823328399832285], 'name': '3ª Macro - Cariri'}","{'latlong': [-39.5970436535868, -5.3600126499898675], 'name': '4ª Macro - Sertão Central'}",3,114.99291452469504
2004,"{'latlong': [-39.5970436535868, -5.3600126499898675], 'name': '4ª Macro - Sertão Central'}","{'latlong': [-38.26279503575439, -5.2411729332342185], 'name': '5ª Macro - Litoral Leste/Jaguaribe'}",28,148.47845738572832
2004,"{'latlong': [-39.5970436535868, -5.3600126499898675], 'name': '4ª Macro - Sertão Central'}","{'latlong': [-39.04198570967633, -3.972272374155126], 'name': '1ª Macro - Fortaleza'}",568,134.60427573279884
2004,"{'latlong': [-39.5970436535868, -5.3600126499898675], 'name': '4ª Macro - Sertão Central'}","{'latlong': [-39.4424043736871, -6.6823328399832285], 'name': '3ª Macro - Cariri'}",10,114.99291452469504
2004,"{'latlong': [-39.5970436535868, -5.3600126499898675], 'name': '4ª Macro - Sertão Central'}","{'latlong': [-39.5970436535868, -5.3600126499898675], 'name': '4ª Macro - Sertão Central'}",1616,0.0
2004,"{'latlong': [-39.5970436535868, -5.3600126499898675], 'name': '4ª Macro - Sertão Central'}","{'latlong': [-40.49827164718406, -4.270228494122716], 'name': '2ª Macro - Sobral'}",8,136.6063403884904
2004,"{'latlong': [-40.49827164718406, -4.270228494122716], 'name': '2ª Macro - Sobral'}","{'latlong': [-39.04198570967633, -3.972272374155126], 'name': '1ª Macro - Fortaleza'}",413,163.69432955223883
2004,"{'latlong': [-40.49827164718406, -4.270228494122716], 'name': '2ª Macro - Sobral'}","{'latlong': [-39.5970436535868, -5.3600126499898675], 'name': '4ª Macro - Sertão Central'}",3,136.6063403884904
2004,"{'latlong': [-40.49827164718406, -4.270228494122716], 'name': '2ª Macro - Sobral'}","{'latlong': [-40.49827164718406, -4.270228494122716], 'name': '2ª Macro - Sobral'}",6353,0.0
2005,"{'latlong': [-38.26279503575439, -5.2411729332342185], 'name': '5ª Macro - Litoral Leste/Jaguaribe'}","{'latlong': [-38.26279503575439, -5.2411729332342185], 'name': '5ª Macro - Litoral Leste/Jaguaribe'}",1513,0.0
2005,"{'latlong': [-38.26279503575439, -5.2411729332342185], 'name': '5ª Macro - Litoral Leste/Jaguaribe'}","{'latlong': [-39.04198570967633, -3.972272374155126], 'name': '1ª Macro - Fortaleza'}",765,140.29094146329456
2005,"{'latlong': [-38.26279503575439, -5.2411729332342185], 'name': '5ª Macro - Litoral Leste/Jaguaribe'}","{'latlong': [-39.4424043736871, -6.6823328399832285], 'name': '3ª Macro - Cariri'}",5,181.09845882673415
2005,"{'latlong': [-39.04198570967633, -3.972272374155126], 'name': '1ª Macro - Fortaleza'}","{'latlong': [-38.26279503575439, -5.2411729332342185], 'name': '5ª Macro - Litoral Leste/Jaguaribe'}",13,140.29094146329456
2005,"{'latlong': [-39.04198570967633, -3.972272374155126], 'name': '1ª Macro - Fortaleza'}","{'latlong': [-39.04198570967633, -3.972272374155126], 'name': '1ª Macro - Fortaleza'}",19394,0.0
2005,"{'latlong': [-39.04198570967633, -3.972272374155126], 'name': '1ª Macro - Fortaleza'}","{'latlong': [-39.4424043736871, -6.6823328399832285], 'name': '3ª Macro - Cariri'}",1,238.1362922408207
2005,"{'latlong': [-39.04198570967633, -3.972272374155126], 'name': '1ª Macro - Fortaleza'}","{'latlong': [-40.49827164718406, -4.270228494122716], 'name': '2ª Macro - Sobral'}",15,163.69432955223883
2005,"{'latlong': [-39.4424043736871, -6.6823328399832285], 'name': '3ª Macro - Cariri'}","{'latlong': [-38.26279503575439, -5.2411729332342185], 'name': '5ª Macro - Litoral Leste/Jaguaribe'}",1,181.09845882673415
2005,"{'latlong': [-39.4424043736871, -6.6823328399832285], 'name': '3ª Macro - Cariri'}","{'latlong': [-39.04198570967633, -3.972272374155126], 'name': '1ª Macro - Fortaleza'}",338,238.1362922408207
2005,"{'latlong': [-39.4424043736871, -6.6823328399832285], 'name': '3ª Macro - Cariri'}","{'latlong': [-39.4424043736871, -6.6823328399832285], 'name': '3ª Macro - Cariri'}",9217,0.0
2005,"{'latlong': [-39.4424043736871, -6.6823328399832285], 'name': '3ª Macro - Cariri'}","{'latlong': [-40.49827164718406, -4.270228494122716], 'name': '2ª Macro - Sobral'}",2,237.07015549816794
2005,"{'latlong': [-39.5970436535868, -5.3600126499898675], 'name': '4ª Macro - Sertão Central'}","{'latlong': [-38.26279503575439, -5.2411729332342185], 'name': '5ª Macro - Litoral Leste/Jaguaribe'}",7,148.47845738572832
2005,"{'latlong': [-39.5970436535868, -5.3600126499898675], 'name': '4ª Macro - Sertão Central'}","{'latlong': [-39.04198570967633, -3.972272374155126], 'name': '1ª Macro - Fortaleza'}",693,134.60427573279884
2005,"{'latlong': [-39.5970436535868, -5.3600126499898675], 'name': '4ª Macro - Sertão Central'}","{'latlong': [-39.4424043736871, -6.6823328399832285], 'name': '3ª Macro - Cariri'}",9,114.99291452469504
2005,"{'latlong': [-39.5970436535868, -5.3600126499898675], 'name': '4ª Macro - Sertão Central'}","{'latlong': [-39.5970436535868, -5.3600126499898675], 'name': '4ª Macro - Sertão Central'}",1544,0.0
2005,"{'latlong': [-39.5970436535868, -5.3600126499898675], 'name': '4ª Macro - Sertão Central'}","{'latlong': [-40.49827164718406, -4.270228494122716], 'name': '2ª Macro - Sobral'}",3,136.6063403884904
2005,"{'latlong': [-40.49827164718406, -4.270228494122716], 'name': '2ª Macro - Sobral'}","{'latlong': [-39.04198570967633, -3.972272374155126], 'name': '1ª Macro - Fortaleza'}",392,163.69432955223883
2005,"{'latlong': [-40.49827164718406, -4.270228494122716], 'name': '2ª Macro - Sobral'}","{'latlong': [-39.5970436535868, -5.3600126499898675], 'name': '4ª Macro - Sertão Central'}",3,136.6063403884904
2005,"{'latlong': [-40.49827164718406, -4.270228494122716], 'name': '2ª Macro - Sobral'}","{'latlong': [-40.49827164718406, -4.270228494122716], 'name': '2ª Macro - Sobral'}",5979,0.0
2006,"{'latlong': [-38.26279503575439, -5.2411729332342185], 'name': '5ª Macro - Litoral Leste/Jaguaribe'}","{'latlong': [-38.26279503575439, -5.2411729332342185], 'name': '5ª Macro - Litoral Leste/Jaguaribe'}",1384,0.0
2006,"{'latlong': [-38.26279503575439, -5.2411729332342185], 'name': '5ª Macro - Litoral Leste/Jaguaribe'}","{'latlong': [-39.04198570967633, -3.972272374155126], 'name': '1ª Macro - Fortaleza'}",916,140.29094146329456
2006,"{'latlong': [-38.26279503575439, -5.2411729332342185], 'name': '5ª Macro - Litoral Leste/Jaguaribe'}","{'latlong': [-39.4424043736871, -6.6823328399832285], 'name': '3ª Macro - Cariri'}",2,181.09845882673415
2006,"{'latlong': [-39.04198570967633, -3.972272374155126], 'name': '1ª Macro - Fortaleza'}","{'latlong': [-38.26279503575439, -5.2411729332342185], 'name': '5ª Macro - Litoral Leste/Jaguaribe'}",8,140.29094146329456
2006,"{'latlong': [-39.04198570967633, -3.972272374155126], 'name': '1ª Macro - Fortaleza'}","{'latlong': [-39.04198570967633, -3.972272374155126], 'name': '1ª Macro - Fortaleza'}",19763,0.0
2006,"{'latlong': [-39.04198570967633, -3.972272374155126], 'name': '1ª Macro - Fortaleza'}","{'latlong': [-39.4424043736871, -6.6823328399832285], 'name': '3ª Macro - Cariri'}",1,238.1362922408207
2006,"{'latlong': [-39.04198570967633, -3.972272374155126], 'name': '1ª Macro - Fortaleza'}","{'latlong': [-40.49827164718406, -4.270228494122716], 'name': '2ª Macro - Sobral'}",6,163.69432955223883
2006,"{'latlong': [-39.4424043736871, -6.6823328399832285], 'name': '3ª Macro - Cariri'}","{'latlong': [-39.04198570967633, -3.972272374155126], 'name': '1ª Macro - Fortaleza'}",391,238.1362922408207
2006,"{'latlong': [-39.4424043736871, -6.6823328399832285], 'name': '3ª Macro - Cariri'}","{'latlong': [-39.4424043736871, -6.6823328399832285], 'name': '3ª Macro - Cariri'}",9413,0.0
2006,"{'latlong': [-39.4424043736871, -6.6823328399832285], 'name': '3ª Macro - Cariri'}","{'latlong': [-39.5970436535868, -5.3600126499898675], 'name': '4ª Macro - Sertão Central'}",1,114.99291452469504
2006,"{'latlong': [-39.5970436535868, -5.3600126499898675], 'name': '4ª Macro - Sertão Central'}","{'latlong': [-38.26279503575439, -5.2411729332342185], 'name': '5ª Macro - Litoral Leste/Jaguaribe'}",4,148.47845738572832
2006,"{'latlong': [-39.5970436535868, -5.3600126499898675], 'name': '4ª Macro - Sertão Central'}","{'latlong': [-39.04198570967633, -3.972272374155126], 'name': '1ª Macro - Fortaleza'}",763,134.60427573279884
2006,"{'latlong': [-39.5970436535868, -5.3600126499898675], 'name': '4ª Macro - Sertão Central'}","{'latlong': [-39.4424043736871, -6.6823328399832285], 'name': '3ª Macro - Cariri'}",9,114.99291452469504
2006,"{'latlong': [-39.5970436535868, -5.3600126499898675], 'name': '4ª Macro - Sertão Central'}","{'latlong': [-39.5970436535868, -5.3600126499898675], 'name': '4ª Macro - Sertão Central'}",1585,0.0
2006,"{'latlong': [-39.5970436535868, -5.3600126499898675], 'name': '4ª Macro - Sertão Central'}","{'latlong': [-40.49827164718406, -4.270228494122716], 'name': '2ª Macro - Sobral'}",2,136.6063403884904
2006,"{'latlong': [-40.49827164718406, -4.270228494122716], 'name': '2ª Macro - Sobral'}","{'latlong': [-39.04198570967633, -3.972272374155126], 'name': '1ª Macro - Fortaleza'}",412,163.69432955223883
2006,"{'latlong': [-40.49827164718406, -4.270228494122716], 'name': '2ª Macro - Sobral'}","{'latlong': [-39.4424043736871, -6.6823328399832285], 'name': '3ª Macro - Cariri'}",1,237.07015549816794
2006,"{'latlong': [-40.49827164718406, -4.270228494122716], 'name': '2ª Macro - Sobral'}","{'latlong': [-39.5970436535868, -5.3600126499898675], 'name': '4ª Macro - Sertão Central'}",2,136.6063403884904
2006,"{'latlong': [-40.49827164718406, -4.270228494122716], 'name': '2ª Macro - Sobral'}","{'latlong': [-40.49827164718406, -4.270228494122716], 'name': '2ª Macro - Sobral'}",5303,0.0
2007,"{'latlong': [-38.26279503575439, -5.2411729332342185], 'name': '5ª Macro - Litoral Leste/Jaguaribe'}","{'latlong': [-38.26279503575439, -5.2411729332342185], 'name': '5ª Macro - Litoral Leste/Jaguaribe'}",1384,0.0
2007,"{'latlong': [-38.26279503575439, -5.2411729332342185], 'name': '5ª Macro - Litoral Leste/Jaguaribe'}","{'latlong': [-39.04198570967633, -3.972272374155126], 'name': '1ª Macro - Fortaleza'}",1028,140.29094146329456
2007,"{'latlong': [-38.26279503575439, -5.2411729332342185], 'name': '5ª Macro - Litoral Leste/Jaguaribe'}","{'latlong': [-39.4424043736871, -6.6823328399832285], 'name': '3ª Macro - Cariri'}",3,181.09845882673415
2007,"{'latlong': [-38.26279503575439, -5.2411729332342185], 'name': '5ª Macro - Litoral Leste/Jaguaribe'}","{'latlong': [-39.5970436535868, -5.3600126499898675], 'name': '4ª Macro - Sertão Central'}",1,148.47845738572832
2007,"{'latlong': [-39.04198570967633, -3.972272374155126], 'name': '1ª Macro - Fortaleza'}","{'latlong': [-38.26279503575439, -5.2411729332342185], 'name': '5ª Macro - Litoral Leste/Jaguaribe'}",5,140.29094146329456
2007,"{'latlong': [-39.04198570967633, -3.972272374155126], 'name': '1ª Macro - Fortaleza'}","{'latlong': [-39.04198570967633, -3.972272374155126], 'name': '1ª Macro - Fortaleza'}",20860,0.0
2007,"{'latlong': [-39.04198570967633, -3.972272374155126], 'name': '1ª Macro - Fortaleza'}","{'latlong': [-39.4424043736871, -6.6823328399832285], 'name': '3ª Macro - Cariri'}",1,238.1362922408207
2007,"{'latlong': [-39.04198570967633, -3.972272374155126], 'name': '1ª Macro - Fortaleza'}","{'latlong': [-40.49827164718406, -4.270228494122716], 'name': '2ª Macro - Sobral'}",5,163.69432955223883
2007,"{'latlong': [-39.4424043736871, -6.6823328399832285], 'name': '3ª Macro - Cariri'}","{'latlong': [-39.04198570967633, -3.972272374155126], 'name': '1ª Macro - Fortaleza'}",461,238.1362922408207
2007,"{'latlong': [-39.4424043736871, -6.6823328399832285], 'name': '3ª Macro - Cariri'}","{'latlong': [-39.4424043736871, -6.6823328399832285], 'name': '3ª Macro - Cariri'}",8973,0.0
2007,"{'latlong': [-39.4424043736871, -6.6823328399832285], 'name': '3ª Macro - Cariri'}","{'latlong': [-40.49827164718406, -4.270228494122716], 'name': '2ª Macro - Sobral'}",1,237.07015549816794
2007,"{'latlong': [-39.5970436535868, -5.3600126499898675], 'name': '4ª Macro - Sertão Central'}","{'latlong': [-39.04198570967633, -3.972272374155126], 'name': '1ª Macro - Fortaleza'}",916,134.60427573279884
2007,"{'latlong': [-39.5970436535868, -5.3600126499898675], 'name': '4ª Macro - Sertão Central'}","{'latlong': [-39.4424043736871, -6.6823328399832285], 'name': '3ª Macro - Cariri'}",4,114.99291452469504
2007,"{'latlong': [-39.5970436535868, -5.3600126499898675], 'name': '4ª Macro - Sertão Central'}","{'latlong': [-39.5970436535868, -5.3600126499898675], 'name': '4ª Macro - Sertão Central'}",1659,0.0
2007,"{'latlong': [-39.5970436535868, -5.3600126499898675], 'name': '4ª Macro - Sertão Central'}","{'latlong': [-40.49827164718406, -4.270228494122716], 'name': '2ª Macro - Sobral'}",4,136.6063403884904
2007,"{'latlong': [-40.49827164718406, -4.270228494122716], 'name': '2ª Macro - Sobral'}","{'latlong': [-39.04198570967633, -3.972272374155126], 'name': '1ª Macro - Fortaleza'}",468,163.69432955223883
2007,"{'latlong': [-40.49827164718406, -4.270228494122716], 'name': '2ª Macro - Sobral'}","{'latlong': [-39.4424043736871, -6.6823328399832285], 'name': '3ª Macro - Cariri'}",1,237.07015549816794
2007,"{'latlong': [-40.49827164718406, -4.270228494122716], 'name': '2ª Macro - Sobral'}","{'latlong': [-39.5970436535868, -5.3600126499898675], 'name': '4ª Macro - Sertão Central'}",11,136.6063403884904
2007,"{'latlong': [-40.49827164718406, -4.270228494122716], 'name': '2ª Macro - Sobral'}","{'latlong': [-40.49827164718406, -4.270228494122716], 'name': '2ª Macro - Sobral'}",6428,0.0
2008,"{'latlong': [-38.26279503575439, -5.2411729332342185], 'name': '5ª Macro - Litoral Leste/Jaguaribe'}","{'latlong': [-38.26279503575439, -5.2411729332342185], 'name': '5ª Macro - Litoral Leste/Jaguaribe'}",1319,0.0
2008,"{'latlong': [-38.26279503575439, -5.2411729332342185], 'name': '5ª Macro - Litoral Leste/Jaguaribe'}","{'latlong': [-39.04198570967633, -3.972272374155126], 'name': '1ª Macro - Fortaleza'}",1202,140.29094146329456
2008,"{'latlong': [-38.26279503575439, -5.2411729332342185], 'name': '5ª Macro - Litoral Leste/Jaguaribe'}","{'latlong': [-39.4424043736871, -6.6823328399832285], 'name': '3ª Macro - Cariri'}",1,181.09845882673415
2008,"{'latlong': [-38.26279503575439, -5.2411729332342185], 'name': '5ª Macro - Litoral Leste/Jaguaribe'}","{'latlong': [-40.49827164718406, -4.270228494122716], 'name': '2ª Macro - Sobral'}",2,261.9034991383947
2008,"{'latlong': [-39.04198570967633, -3.972272374155126], 'name': '1ª Macro - Fortaleza'}","{'latlong': [-38.26279503575439, -5.2411729332342185], 'name': '5ª Macro - Litoral Leste/Jaguaribe'}",3,140.29094146329456
2008,"{'latlong': [-39.04198570967633, -3.972272374155126], 'name': '1ª Macro - Fortaleza'}","{'latlong': [-39.04198570967633, -3.972272374155126], 'name': '1ª Macro - Fortaleza'}",22338,0.0
2008,"{'latlong': [-39.04198570967633, -3.972272374155126], 'name': '1ª Macro - Fortaleza'}","{'latlong': [-39.4424043736871, -6.6823328399832285], 'name': '3ª Macro - Cariri'}",1,238.1362922408207
2008,"{'latlong': [-39.04198570967633, -3.972272374155126], 'name': '1ª Macro - Fortaleza'}","{'latlong': [-40.49827164718406, -4.270228494122716], 'name': '2ª Macro - Sobral'}",22,163.69432955223883
2008,"{'latlong': [-39.4424043736871, -6.6823328399832285], 'name': '3ª Macro - Cariri'}","{'latlong': [-39.04198570967633, -3.972272374155126], 'name': '1ª Macro - Fortaleza'}",520,238.1362922408207
2008,"{'latlong': [-39.4424043736871, -6.6823328399832285], 'name': '3ª Macro - Cariri'}","{'latlong': [-39.4424043736871, -6.6823328399832285], 'name': '3ª Macro - Cariri'}",8707,0.0
2008,"{'latlong': [-39.4424043736871, -6.6823328399832285], 'name': '3ª Macro - Cariri'}","{'latlong': [-39.5970436535868, -5.3600126499898675], 'name': '4ª Macro - Sertão Central'}",1,114.99291452469504
2008,"{'latlong': [-39.4424043736871, -6.6823328399832285], 'name': '3ª Macro - Cariri'}","{'latlong': [-40.49827164718406, -4.270228494122716], 'name': '2ª Macro - Sobral'}",1,237.07015549816794
2008,"{'latlong': [-39.5970436535868, -5.3600126499898675], 'name': '4ª Macro - Sertão Central'}","{'latlong': [-39.04198570967633, -3.972272374155126], 'name': '1ª Macro - Fortaleza'}",1073,134.60427573279884
2008,"{'latlong': [-39.5970436535868, -5.3600126499898675], 'name': '4ª Macro - Sertão Central'}","{'latlong': [-39.4424043736871, -6.6823328399832285], 'name': '3ª Macro - Cariri'}",5,114.99291452469504
2008,"{'latlong': [-39.5970436535868, -5.3600126499898675], 'name': '4ª Macro - Sertão Central'}","{'latlong': [-39.5970436535868, -5.3600126499898675], 'name': '4ª Macro - Sertão Central'}",1281,0.0
2008,"{'latlong': [-39.5970436535868, -5.3600126499898675], 'name': '4ª Macro - Sertão Central'}","{'latlong': [-40.49827164718406, -4.270228494122716], 'name': '2ª Macro - Sobral'}",4,136.6063403884904
2008,"{'latlong': [-40.49827164718406, -4.270228494122716], 'name': '2ª Macro - Sobral'}","{'latlong': [-39.04198570967633, -3.972272374155126], 'name': '1ª Macro - Fortaleza'}",491,163.69432955223883
2008,"{'latlong': [-40.49827164718406, -4.270228494122716], 'name': '2ª Macro - Sobral'}","{'latlong': [-39.5970436535868, -5.3600126499898675], 'name': '4ª Macro - Sertão Central'}",9,136.6063403884904
2008,"{'latlong': [-40.49827164718406, -4.270228494122716], 'name': '2ª Macro - Sobral'}","{'latlong': [-40.49827164718406, -4.270228494122716], 'name': '2ª Macro - Sobral'}",5922,0.0
2009,"{'latlong': [-38.26279503575439, -5.2411729332342185], 'name': '5ª Macro - Litoral Leste/Jaguaribe'}","{'latlong': [-38.26279503575439, -5.2411729332342185], 'name': '5ª Macro - Litoral Leste/Jaguaribe'}",1732,0.0
2009,"{'latlong': [-38.26279503575439, -5.2411729332342185], 'name': '5ª Macro - Litoral Leste/Jaguaribe'}","{'latlong': [-39.04198570967633, -3.972272374155126], 'name': '1ª Macro - Fortaleza'}",1094,140.29094146329456
2009,"{'latlong': [-38.26279503575439, -5.2411729332342185], 'name': '5ª Macro - Litoral Leste/Jaguaribe'}","{'latlong': [-40.49827164718406, -4.270228494122716], 'name': '2ª Macro - Sobral'}",1,261.9034991383947
2009,"{'latlong': [-39.04198570967633, -3.972272374155126], 'name': '1ª Macro - Fortaleza'}","{'latlong': [-38.26279503575439, -5.2411729332342185], 'name': '5ª Macro - Litoral Leste/Jaguaribe'}",7,140.29094146329456
2009,"{'latlong': [-39.04198570967633, -3.972272374155126], 'name': '1ª Macro - Fortaleza'}","{'latlong': [-39.04198570967633, -3.972272374155126], 'name': '1ª Macro - Fortaleza'}",21697,0.0
2009,"{'latlong': [-39.04198570967633, -3.972272374155126], 'name': '1ª Macro - Fortaleza'}","{'latlong': [-40.49827164718406, -4.270228494122716], 'name': '2ª Macro - Sobral'}",21,163.69432955223883
2009,"{'latlong': [-39.4424043736871, -6.6823328399832285], 'name': '3ª Macro - Cariri'}","{'latlong': [-39.04198570967633, -3.972272374155126], 'name': '1ª Macro - Fortaleza'}",521,238.1362922408207
2009,"{'latlong': [-39.4424043736871, -6.6823328399832285], 'name': '3ª Macro - Cariri'}","{'latlong': [-39.4424043736871, -6.6823328399832285], 'name': '3ª Macro - Cariri'}",8967,0.0
2009,"{'latlong': [-39.4424043736871, -6.6823328399832285], 'name': '3ª Macro - Cariri'}","{'latlong': [-39.5970436535868, -5.3600126499898675], 'name': '4ª Macro - Sertão Central'}",3,114.99291452469504
2009,"{'latlong': [-39.4424043736871, -6.6823328399832285], 'name': '3ª Macro - Cariri'}","{'latlong': [-40.49827164718406, -4.270228494122716], 'name': '2ª Macro - Sobral'}",1,237.07015549816794
2009,"{'latlong': [-39.5970436535868, -5.3600126499898675], 'name': '4ª Macro - Sertão Central'}","{'latlong': [-39.04198570967633, -3.972272374155126], 'name': '1ª Macro - Fortaleza'}",1007,134.60427573279884
2009,"{'latlong': [-39.5970436535868, -5.3600126499898675], 'name': '4ª Macro - Sertão Central'}","{'latlong': [-39.4424043736871, -6.6823328399832285], 'name': '3ª Macro - Cariri'}",10,114.99291452469504
2009,"{'latlong': [-39.5970436535868, -5.3600126499898675], 'name': '4ª Macro - Sertão Central'}","{'latlong': [-39.5970436535868, -5.3600126499898675], 'name': '4ª Macro - Sertão Central'}",1464,0.0
2009,"{'latlong': [-40.49827164718406, -4.270228494122716], 'name': '2ª Macro - Sobral'}","{'latlong': [-39.04198570967633, -3.972272374155126], 'name': '1ª Macro - Fortaleza'}",453,163.69432955223883
2009,"{'latlong': [-40.49827164718406, -4.270228494122716], 'name': '2ª Macro - Sobral'}","{'latlong': [-39.5970436535868, -5.3600126499898675], 'name': '4ª Macro - Sertão Central'}",16,136.6063403884904
2009,"{'latlong': [-40.49827164718406, -4.270228494122716], 'name': '2ª Macro - Sobral'}","{'latlong': [-40.49827164718406, -4.270228494122716], 'name': '2ª Macro - Sobral'}",6167,0.0
2010,"{'latlong': [-38.26279503575439, -5.2411729332342185], 'name': '5ª Macro - Litoral Leste/Jaguaribe'}","{'latlong': [-38.26279503575439, -5.2411729332342185], 'name': '5ª Macro - Litoral Leste/Jaguaribe'}",1623,0.0
2010,"{'latlong': [-38.26279503575439, -5.2411729332342185], 'name': '5ª Macro - Litoral Leste/Jaguaribe'}","{'latlong': [-39.04198570967633, -3.972272374155126], 'name': '1ª Macro - Fortaleza'}",920,140.29094146329456
2010,"{'latlong': [-38.26279503575439, -5.2411729332342185], 'name': '5ª Macro - Litoral Leste/Jaguaribe'}","{'latlong': [-39.4424043736871, -6.6823328399832285], 'name': '3ª Macro - Cariri'}",4,181.09845882673415
2010,"{'latlong': [-39.04198570967633, -3.972272374155126], 'name': '1ª Macro - Fortaleza'}","{'latlong': [-38.26279503575439, -5.2411729332342185], 'name': '5ª Macro - Litoral Leste/Jaguaribe'}",6,140.29094146329456
2010,"{'latlong': [-39.04198570967633, -3.972272374155126], 'name': '1ª Macro - Fortaleza'}","{'latlong': [-39.04198570967633, -3.972272374155126], 'name': '1ª Macro - Fortaleza'}",20417,0.0
2010,"{'latlong': [-39.04198570967633, -3.972272374155126], 'name': '1ª Macro - Fortaleza'}","{'latlong': [-39.5970436535868, -5.3600126499898675], 'name': '4ª Macro - Sertão Central'}",1,134.60427573279884
2010,"{'latlong': [-39.04198570967633, -3.972272374155126], 'name': '1ª Macro - Fortaleza'}","{'latlong': [-40.49827164718406, -4.270228494122716], 'name': '2ª Macro - Sobral'}",12,163.69432955223883
2010,"{'latlong': [-39.4424043736871, -6.6823328399832285], 'name': '3ª Macro - Cariri'}","{'latlong': [-38.26279503575439, -5.2411729332342185], 'name': '5ª Macro - Litoral Leste/Jaguaribe'}",1,181.09845882673415
2010,"{'latlong': [-39.4424043736871, -6.6823328399832285], 'name': '3ª Macro - Cariri'}","{'latlong': [-39.04198570967633, -3.972272374155126], 'name': '1ª Macro - Fortaleza'}",445,238.1362922408207
2010,"{'latlong': [-39.4424043736871, -6.6823328399832285], 'name': '3ª Macro - Cariri'}","{'latlong': [-39.4424043736871, -6.6823328399832285], 'name': '3ª Macro - Cariri'}",8728,0.0
2010,"{'latlong': [-39.4424043736871, -6.6823328399832285], 'name': '3ª Macro - Cariri'}","{'latlong': [-39.5970436535868, -5.3600126499898675], 'name': '4ª Macro - Sertão Central'}",2,114.99291452469504
2010,"{'latlong': [-39.5970436535868, -5.3600126499898675], 'name': '4ª Macro - Sertão Central'}","{'latlong': [-39.04198570967633, -3.972272374155126], 'name': '1ª Macro - Fortaleza'}",873,134.60427573279884
2010,"{'latlong': [-39.5970436535868, -5.3600126499898675], 'name': '4ª Macro - Sertão Central'}","{'latlong': [-39.4424043736871, -6.6823328399832285], 'name': '3ª Macro - Cariri'}",7,114.99291452469504
2010,"{'latlong': [-39.5970436535868, -5.3600126499898675], 'name': '4ª Macro - Sertão Central'}","{'latlong': [-39.5970436535868, -5.3600126499898675], 'name': '4ª Macro - Sertão Central'}",1761,0.0
2010,"{'latlong': [-39.5970436535868, -5.3600126499898675], 'name': '4ª Macro - Sertão Central'}","{'latlong': [-40.49827164718406, -4.270228494122716], 'name': '2ª Macro - Sobral'}",4,136.6063403884904
2010,"{'latlong': [-40.49827164718406, -4.270228494122716], 'name': '2ª Macro - Sobral'}","{'latlong': [-39.04198570967633, -3.972272374155126], 'name': '1ª Macro - Fortaleza'}",413,163.69432955223883
2010,"{'latlong': [-40.49827164718406, -4.270228494122716], 'name': '2ª Macro - Sobral'}","{'latlong': [-39.4424043736871, -6.6823328399832285], 'name': '3ª Macro - Cariri'}",1,237.07015549816794
2010,"{'latlong': [-40.49827164718406, -4.270228494122716], 'name': '2ª Macro - Sobral'}","{'latlong': [-39.5970436535868, -5.3600126499898675], 'name': '4ª Macro - Sertão Central'}",10,136.6063403884904
2010,"{'latlong': [-40.49827164718406, -4.270228494122716], 'name': '2ª Macro - Sobral'}","{'latlong': [-40.49827164718406, -4.270228494122716], 'name': '2ª Macro - Sobral'}",6194,0.0
2011,"{'latlong': [-38.26279503575439, -5.2411729332342185], 'name': '5ª Macro - Litoral Leste/Jaguaribe'}","{'latlong': [-38.26279503575439, -5.2411729332342185], 'name': '5ª Macro - Litoral Leste/Jaguaribe'}",1359,0.0
2011,"{'latlong': [-38.26279503575439, -5.2411729332342185], 'name': '5ª Macro - Litoral Leste/Jaguaribe'}","{'latlong': [-39.04198570967633, -3.972272374155126], 'name': '1ª Macro - Fortaleza'}",1108,140.29094146329456
2011,"{'latlong': [-38.26279503575439, -5.2411729332342185], 'name': '5ª Macro - Litoral Leste/Jaguaribe'}","{'latlong': [-39.4424043736871, -6.6823328399832285], 'name': '3ª Macro - Cariri'}",6,181.09845882673415
2011,"{'latlong': [-39.04198570967633, -3.972272374155126], 'name': '1ª Macro - Fortaleza'}","{'latlong': [-38.26279503575439, -5.2411729332342185], 'name': '5ª Macro - Litoral Leste/Jaguaribe'}",7,140.29094146329456
2011,"{'latlong': [-39.04198570967633, -3.972272374155126], 'name': '1ª Macro - Fortaleza'}","{'latlong': [-39.04198570967633, -3.972272374155126], 'name': '1ª Macro - Fortaleza'}",20088,0.0
2011,"{'latlong': [-39.04198570967633, -3.972272374155126], 'name': '1ª Macro - Fortaleza'}","{'latlong': [-39.4424043736871, -6.6823328399832285], 'name': '3ª Macro - Cariri'}",2,238.1362922408207
2011,"{'latlong': [-39.04198570967633, -3.972272374155126], 'name': '1ª Macro - Fortaleza'}","{'latlong': [-40.49827164718406, -4.270228494122716], 'name': '2ª Macro - Sobral'}",10,163.69432955223883
2011,"{'latlong': [-39.4424043736871, -6.6823328399832285], 'name': '3ª Macro - Cariri'}","{'latlong': [-39.04198570967633, -3.972272374155126], 'name': '1ª Macro - Fortaleza'}",468,238.1362922408207
2011,"{'latlong': [-39.4424043736871, -6.6823328399832285], 'name': '3ª Macro - Cariri'}","{'latlong': [-39.4424043736871, -6.6823328399832285], 'name': '3ª Macro - Cariri'}",8405,0.0
2011,"{'latlong': [-39.4424043736871, -6.6823328399832285], 'name': '3ª Macro - Cariri'}","{'latlong': [-40.49827164718406, -4.270228494122716], 'name': '2ª Macro - Sobral'}",2,237.07015549816794
2011,"{'latlong': [-39.5970436535868, -5.3600126499898675], 'name': '4ª Macro - Sertão Central'}","{'latlong': [-38.26279503575439, -5.2411729332342185], 'name': '5ª Macro - Litoral Leste/Jaguaribe'}",1,148.47845738572832
2011,"{'latlong': [-39.5970436535868, -5.3600126499898675], 'name': '4ª Macro - Sertão Central'}","{'latlong': [-39.04198570967633, -3.972272374155126], 'name': '1ª Macro - Fortaleza'}",992,134.60427573279884
2011,"{'latlong': [-39.5970436535868, -5.3600126499898675], 'name': '4ª Macro - Sertão Central'}","{'latlong': [-39.4424043736871, -6.6823328399832285], 'name': '3ª Macro - Cariri'}",4,114.99291452469504
2011,"{'latlong': [-39.5970436535868, -5.3600126499898675], 'name': '4ª Macro - Sertão Central'}","{'latlong': [-39.5970436535868, -5.3600126499898675], 'name': '4ª Macro - Sertão Central'}",1701,0.0
2011,"{'latlong': [-39.5970436535868, -5.3600126499898675], 'name': '4ª Macro - Sertão Central'}","{'latlong': [-40.49827164718406, -4.270228494122716], 'name': '2ª Macro - Sobral'}",4,136.6063403884904
2011,"{'latlong': [-40.49827164718406, -4.270228494122716], 'name': '2ª Macro - Sobral'}","{'latlong': [-39.04198570967633, -3.972272374155126], 'name': '1ª Macro - Fortaleza'}",412,163.69432955223883
2011,"{'latlong': [-40.49827164718406, -4.270228494122716], 'name': '2ª Macro - Sobral'}","{'latlong': [-39.4424043736871, -6.6823328399832285], 'name': '3ª Macro - Cariri'}",2,237.07015549816794
2011,"{'latlong': [-40.49827164718406, -4.270228494122716], 'name': '2ª Macro - Sobral'}","{'latlong': [-39.5970436535868, -5.3600126499898675], 'name': '4ª Macro - Sertão Central'}",5,136.6063403884904
2011,"{'latlong': [-40.49827164718406, -4.270228494122716], 'name': '2ª Macro - Sobral'}","{'latlong': [-40.49827164718406, -4.270228494122716], 'name': '2ª Macro - Sobral'}",6441,0.0
2012,"{'latlong': [-38.26279503575439, -5.2411729332342185], 'name': '5ª Macro - Litoral Leste/Jaguaribe'}","{'latlong': [-38.26279503575439, -5.2411729332342185], 'name': '5ª Macro - Litoral Leste/Jaguaribe'}",1033,0.0
2012,"{'latlong': [-38.26279503575439, -5.2411729332342185], 'name': '5ª Macro - Litoral Leste/Jaguaribe'}","{'latlong': [-39.04198570967633, -3.972272374155126], 'name': '1ª Macro - Fortaleza'}",1166,140.29094146329456
2012,"{'latlong': [-38.26279503575439, -5.2411729332342185], 'name': '5ª Macro - Litoral Leste/Jaguaribe'}","{'latlong': [-39.4424043736871, -6.6823328399832285], 'name': '3ª Macro - Cariri'}",5,181.09845882673415
2012,"{'latlong': [-39.04198570967633, -3.972272374155126], 'name': '1ª Macro - Fortaleza'}","{'latlong': [-38.26279503575439, -5.2411729332342185], 'name': '5ª Macro - Litoral Leste/Jaguaribe'}",6,140.29094146329456
2012,"{'latlong': [-39.04198570967633, -3.972272374155126], 'name': '1ª Macro - Fortaleza'}","{'latlong': [-39.04198570967633, -3.972272374155126], 'name': '1ª Macro - Fortaleza'}",19756,0.0
2012,"{'latlong': [-39.04198570967633, -3.972272374155126], 'name': '1ª Macro - Fortaleza'}","{'latlong': [-39.4424043736871, -6.6823328399832285], 'name': '3ª Macro - Cariri'}",1,238.1362922408207
2012,"{'latlong': [-39.04198570967633, -3.972272374155126], 'name': '1ª Macro - Fortaleza'}","{'latlong': [-40.49827164718406, -4.270228494122716], 'name': '2ª Macro - Sobral'}",22,163.69432955223883
2012,"{'latlong': [-39.4424043736871, -6.6823328399832285], 'name': '3ª Macro - Cariri'}","{'latlong': [-39.04198570967633, -3.972272374155126], 'name': '1ª Macro - Fortaleza'}",486,238.1362922408207
2012,"{'latlong': [-39.4424043736871, -6.6823328399832285], 'name': '3ª Macro - Cariri'}","{'latlong': [-39.4424043736871, -6.6823328399832285], 'name': '3ª Macro - Cariri'}",8074,0.0
2012,"{'latlong': [-39.4424043736871, -6.6823328399832285], 'name': '3ª Macro - Cariri'}","{'latlong': [-40.49827164718406, -4.270228494122716], 'name': '2ª Macro - Sobral'}",7,237.07015549816794
2012,"{'latlong': [-39.5970436535868, -5.3600126499898675], 'name': '4ª Macro - Sertão Central'}","{'latlong': [-38.26279503575439, -5.2411729332342185], 'name': '5ª Macro - Litoral Leste/Jaguaribe'}",1,148.47845738572832
2012,"{'latlong': [-39.5970436535868, -5.3600126499898675], 'name': '4ª Macro - Sertão Central'}","{'latlong': [-39.04198570967633, -3.972272374155126], 'name': '1ª Macro - Fortaleza'}",1027,134.60427573279884
2012,"{'latlong': [-39.5970436535868, -5.3600126499898675], 'name': '4ª Macro - Sertão Central'}","{'latlong': [-39.4424043736871, -6.6823328399832285], 'name': '3ª Macro - Cariri'}",10,114.99291452469504
2012,"{'latlong': [-39.5970436535868, -5.3600126499898675], 'name': '4ª Macro - Sertão Central'}","{'latlong': [-39.5970436535868, -5.3600126499898675], 'name': '4ª Macro - Sertão Central'}",1601,0.0
2012,"{'latlong': [-39.5970436535868, -5.3600126499898675], 'name': '4ª Macro - Sertão Central'}","{'latlong': [-40.49827164718406, -4.270228494122716], 'name': '2ª Macro - Sobral'}",6,136.6063403884904
2012,"{'latlong': [-40.49827164718406, -4.270228494122716], 'name': '2ª Macro - Sobral'}","{'latlong': [-39.04198570967633, -3.972272374155126], 'name': '1ª Macro - Fortaleza'}",407,163.69432955223883
2012,"{'latlong': [-40.49827164718406, -4.270228494122716], 'name': '2ª Macro - Sobral'}","{'latlong': [-39.5970436535868, -5.3600126499898675], 'name': '4ª Macro - Sertão Central'}",10,136.6063403884904
2012,"{'latlong': [-40.49827164718406, -4.270228494122716], 'name': '2ª Macro - Sobral'}","{'latlong': [-40.49827164718406, -4.270228494122716], 'name': '2ª Macro - Sobral'}",6464,0.0
2013,"{'latlong': [-38.26279503575439, -5.2411729332342185], 'name': '5ª Macro - Litoral Leste/Jaguaribe'}","{'latlong': [-38.26279503575439, -5.2411729332342185], 'name': '5ª Macro - Litoral Leste/Jaguaribe'}",910,0.0
2013,"{'latlong': [-38.26279503575439, -5.2411729332342185], 'name': '5ª Macro - Litoral Leste/Jaguaribe'}","{'latlong': [-39.04198570967633, -3.972272374155126], 'name': '1ª Macro - Fortaleza'}",1452,140.29094146329456
2013,"{'latlong': [-38.26279503575439, -5.2411729332342185], 'name': '5ª Macro - Litoral Leste/Jaguaribe'}","{'latlong': [-39.4424043736871, -6.6823328399832285], 'name': '3ª Macro - Cariri'}",3,181.09845882673415
2013,"{'latlong': [-38.26279503575439, -5.2411729332342185], 'name': '5ª Macro - Litoral Leste/Jaguaribe'}","{'latlong': [-40.49827164718406, -4.270228494122716], 'name': '2ª Macro - Sobral'}",3,261.9034991383947
2013,"{'latlong': [-39.04198570967633, -3.972272374155126], 'name': '1ª Macro - Fortaleza'}","{'latlong': [-38.26279503575439, -5.2411729332342185], 'name': '5ª Macro - Litoral Leste/Jaguaribe'}",1,140.29094146329456
2013,"{'latlong': [-39.04198570967633, -3.972272374155126], 'name': '1ª Macro - Fortaleza'}","{'latlong': [-39.04198570967633, -3.972272374155126], 'name': '1ª Macro - Fortaleza'}",22578,0.0
2013,"{'latlong': [-39.04198570967633, -3.972272374155126], 'name': '1ª Macro - Fortaleza'}","{'latlong': [-39.4424043736871, -6.6823328399832285], 'name': '3ª Macro - Cariri'}",4,238.1362922408207
2013,"{'latlong': [-39.04198570967633, -3.972272374155126], 'name': '1ª Macro - Fortaleza'}","{'latlong': [-40.49827164718406, -4.270228494122716], 'name': '2ª Macro - Sobral'}",21,163.69432955223883
2013,"{'latlong': [-39.4424043736871, -6.6823328399832285], 'name': '3ª Macro - Cariri'}","{'latlong': [-39.04198570967633, -3.972272374155126], 'name': '1ª Macro - Fortaleza'}",563,238.1362922408207
2013,"{'latlong': [-39.4424043736871, -6.6823328399832285], 'name': '3ª Macro - Cariri'}","{'latlong': [-39.4424043736871, -6.6823328399832285], 'name': '3ª Macro - Cariri'}",8674,0.0
2013,"{'latlong': [-39.4424043736871, -6.6823328399832285], 'name': '3ª Macro - Cariri'}","{'latlong': [-39.5970436535868, -5.3600126499898675], 'name': '4ª Macro - Sertão Central'}",3,114.99291452469504
2013,"{'latlong': [-39.4424043736871, -6.6823328399832285], 'name': '3ª Macro - Cariri'}","{'latlong': [-40.49827164718406, -4.270228494122716], 'name': '2ª Macro - Sobral'}",6,237.07015549816794
2013,"{'latlong': [-39.5970436535868, -5.3600126499898675], 'name': '4ª Macro - Sertão Central'}","{'latlong': [-39.04198570967633, -3.972272374155126], 'name': '1ª Macro - Fortaleza'}",1303,134.60427573279884
2013,"{'latlong': [-39.5970436535868, -5.3600126499898675], 'name': '4ª Macro - Sertão Central'}","{'latlong': [-39.4424043736871, -6.6823328399832285], 'name': '3ª Macro - Cariri'}",10,114.99291452469504
2013,"{'latlong': [-39.5970436535868, -5.3600126499898675], 'name': '4ª Macro - Sertão Central'}","{'latlong': [-39.5970436535868, -5.3600126499898675], 'name': '4ª Macro - Sertão Central'}",1581,0.0
2013,"{'latlong': [-39.5970436535868, -5.3600126499898675], 'name': '4ª Macro - Sertão Central'}","{'latlong': [-40.49827164718406, -4.270228494122716], 'name': '2ª Macro - Sobral'}",3,136.6063403884904
2013,"{'latlong': [-40.49827164718406, -4.270228494122716], 'name': '2ª Macro - Sobral'}","{'latlong': [-39.04198570967633, -3.972272374155126], 'name': '1ª Macro - Fortaleza'}",377,163.69432955223883
2013,"{'latlong': [-40.49827164718406, -4.270228494122716], 'name': '2ª Macro - Sobral'}","{'latlong': [-39.5970436535868, -5.3600126499898675], 'name': '4ª Macro - Sertão Central'}",3,136.6063403884904
2013,"{'latlong': [-40.49827164718406, -4.270228494122716], 'name': '2ª Macro - Sobral'}","{'latlong': [-40.49827164718406, -4.270228494122716], 'name': '2ª Macro - Sobral'}",6098,0.0
2014,"{'latlong': [-38.26279503575439, -5.2411729332342185], 'name': '5ª Macro - Litoral Leste/Jaguaribe'}","{'latlong': [-38.26279503575439, -5.2411729332342185], 'name': '5ª Macro - Litoral Leste/Jaguaribe'}",1002,0.0
2014,"{'latlong': [-38.26279503575439, -5.2411729332342185], 'name': '5ª Macro - Litoral Leste/Jaguaribe'}","{'latlong': [-39.04198570967633, -3.972272374155126], 'name': '1ª Macro - Fortaleza'}",1322,140.29094146329456
2014,"{'latlong': [-38.26279503575439, -5.2411729332342185], 'name': '5ª Macro - Litoral Leste/Jaguaribe'}","{'latlong': [-39.4424043736871, -6.6823328399832285], 'name': '3ª Macro - Cariri'}",1,181.09845882673415
2014,"{'latlong': [-38.26279503575439, -5.2411729332342185], 'name': '5ª Macro - Litoral Leste/Jaguaribe'}","{'latlong': [-39.5970436535868, -5.3600126499898675], 'name': '4ª Macro - Sertão Central'}",3,148.47845738572832
2014,"{'latlong': [-38.26279503575439, -5.2411729332342185], 'name': '5ª Macro - Litoral Leste/Jaguaribe'}","{'latlong': [-40.49827164718406, -4.270228494122716], 'name': '2ª Macro - Sobral'}",6,261.9034991383947
2014,"{'latlong': [-39.04198570967633, -3.972272374155126], 'name': '1ª Macro - Fortaleza'}","{'latlong': [-38.26279503575439, -5.2411729332342185], 'name': '5ª Macro - Litoral Leste/Jaguaribe'}",3,140.29094146329456
2014,"{'latlong': [-39.04198570967633, -3.972272374155126], 'name': '1ª Macro - Fortaleza'}","{'latlong': [-39.04198570967633, -3.972272374155126], 'name': '1ª Macro - Fortaleza'}",20924,0.0
2014,"{'latlong': [-39.04198570967633, -3.972272374155126], 'name': '1ª Macro - Fortaleza'}","{'latlong': [-39.4424043736871, -6.6823328399832285], 'name': '3ª Macro - Cariri'}",1,238.1362922408207
2014,"{'latlong': [-39.04198570967633, -3.972272374155126], 'name': '1ª Macro - Fortaleza'}","{'latlong': [-39.5970436535868, -5.3600126499898675], 'name': '4ª Macro - Sertão Central'}",1,134.60427573279884
2014,"{'latlong': [-39.04198570967633, -3.972272374155126], 'name': '1ª Macro - Fortaleza'}","{'latlong': [-40.49827164718406, -4.270228494122716], 'name': '2ª Macro - Sobral'}",64,163.69432955223883
2014,"{'latlong': [-39.4424043736871, -6.6823328399832285], 'name': '3ª Macro - Cariri'}","{'latlong': [-39.04198570967633, -3.972272374155126], 'name': '1ª Macro - Fortaleza'}",527,238.1362922408207
2014,"{'latlong': [-39.4424043736871, -6.6823328399832285], 'name': '3ª Macro - Cariri'}","{'latlong': [-39.4424043736871, -6.6823328399832285], 'name': '3ª Macro - Cariri'}",8441,0.0
2014,"{'latlong': [-39.4424043736871, -6.6823328399832285], 'name': '3ª Macro - Cariri'}","{'latlong': [-39.5970436535868, -5.3600126499898675], 'name': '4ª Macro - Sertão Central'}",1,114.99291452469504
2014,"{'latlong': [-39.4424043736871, -6.6823328399832285], 'name': '3ª Macro - Cariri'}","{'latlong': [-40.49827164718406, -4.270228494122716], 'name': '2ª Macro - Sobral'}",24,237.07015549816794
2014,"{'latlong': [-39.5970436535868, -5.3600126499898675], 'name': '4ª Macro - Sertão Central'}","{'latlong': [-39.04198570967633, -3.972272374155126], 'name': '1ª Macro - Fortaleza'}",1185,134.60427573279884
2014,"{'latlong': [-39.5970436535868, -5.3600126499898675], 'name': '4ª Macro - Sertão Central'}","{'latlong': [-39.4424043736871, -6.6823328399832285], 'name': '3ª Macro - Cariri'}",7,114.99291452469504
2014,"{'latlong': [-39.5970436535868, -5.3600126499898675], 'name': '4ª Macro - Sertão Central'}","{'latlong': [-39.5970436535868, -5.3600126499898675], 'name': '4ª Macro - Sertão Central'}",1350,0.0
2014,"{'latlong': [-39.5970436535868, -5.3600126499898675], 'name': '4ª Macro - Sertão Central'}","{'latlong': [-40.49827164718406, -4.270228494122716], 'name': '2ª Macro - Sobral'}",13,136.6063403884904
2014,"{'latlong': [-40.49827164718406, -4.270228494122716], 'name': '2ª Macro - Sobral'}","{'latlong': [-39.04198570967633, -3.972272374155126], 'name': '1ª Macro - Fortaleza'}",361,163.69432955223883
2014,"{'latlong': [-40.49827164718406, -4.270228494122716], 'name': '2ª Macro - Sobral'}","{'latlong': [-39.5970436535868, -5.3600126499898675], 'name': '4ª Macro - Sertão Central'}",6,136.6063403884904
2014,"{'latlong': [-40.49827164718406, -4.270228494122716], 'name': '2ª Macro - Sobral'}","{'latlong': [-40.49827164718406, -4.270228494122716], 'name': '2ª Macro - Sobral'}",6049,0.0
2015,"{'latlong': [-38.26279503575439, -5.2411729332342185], 'name': '5ª Macro - Litoral Leste/Jaguaribe'}","{'latlong': [-38.26279503575439, -5.2411729332342185], 'name': '5ª Macro - Litoral Leste/Jaguaribe'}",908,0.0
2015,"{'latlong': [-38.26279503575439, -5.2411729332342185], 'name': '5ª Macro - Litoral Leste/Jaguaribe'}","{'latlong': [-39.04198570967633, -3.972272374155126], 'name': '1ª Macro - Fortaleza'}",1295,140.29094146329456
2015,"{'latlong': [-38.26279503575439, -5.2411729332342185], 'name': '5ª Macro - Litoral Leste/Jaguaribe'}","{'latlong': [-39.5970436535868, -5.3600126499898675], 'name': '4ª Macro - Sertão Central'}",1,148.47845738572832
2015,"{'latlong': [-38.26279503575439, -5.2411729332342185], 'name': '5ª Macro - Litoral Leste/Jaguaribe'}","{'latlong': [-40.49827164718406, -4.270228494122716], 'name': '2ª Macro - Sobral'}",2,261.9034991383947
2015,"{'latlong': [-39.04198570967633, -3.972272374155126], 'name': '1ª Macro - Fortaleza'}","{'latlong': [-38.26279503575439, -5.2411729332342185], 'name': '5ª Macro - Litoral Leste/Jaguaribe'}",1,140.29094146329456
2015,"{'latlong': [-39.04198570967633, -3.972272374155126], 'name': '1ª Macro - Fortaleza'}","{'latlong': [-39.04198570967633, -3.972272374155126], 'name': '1ª Macro - Fortaleza'}",20955,0.0
2015,"{'latlong': [-39.04198570967633, -3.972272374155126], 'name': '1ª Macro - Fortaleza'}","{'latlong': [-39.4424043736871, -6.6823328399832285], 'name': '3ª Macro - Cariri'}",4,238.1362922408207
2015,"{'latlong': [-39.04198570967633, -3.972272374155126], 'name': '1ª Macro - Fortaleza'}","{'latlong': [-39.5970436535868, -5.3600126499898675], 'name': '4ª Macro - Sertão Central'}",4,134.60427573279884
2015,"{'latlong': [-39.04198570967633, -3.972272374155126], 'name': '1ª Macro - Fortaleza'}","{'latlong': [-40.49827164718406, -4.270228494122716], 'name': '2ª Macro - Sobral'}",36,163.69432955223883
2015,"{'latlong': [-39.4424043736871, -6.6823328399832285], 'name': '3ª Macro - Cariri'}","{'latlong': [-39.04198570967633, -3.972272374155126], 'name': '1ª Macro - Fortaleza'}",450,238.1362922408207
2015,"{'latlong': [-39.4424043736871, -6.6823328399832285], 'name': '3ª Macro - Cariri'}","{'latlong': [-39.4424043736871, -6.6823328399832285], 'name': '3ª Macro - Cariri'}",8168,0.0
2015,"{'latlong': [-39.4424043736871, -6.6823328399832285], 'name': '3ª Macro - Cariri'}","{'latlong': [-39.5970436535868, -5.3600126499898675], 'name': '4ª Macro - Sertão Central'}",6,114.99291452469504
2015,"{'latlong': [-39.4424043736871, -6.6823328399832285], 'name': '3ª Macro - Cariri'}","{'latlong': [-40.49827164718406, -4.270228494122716], 'name': '2ª Macro - Sobral'}",7,237.07015549816794
2015,"{'latlong': [-39.5970436535868, -5.3600126499898675], 'name': '4ª Macro - Sertão Central'}","{'latlong': [-39.04198570967633, -3.972272374155126], 'name': '1ª Macro - Fortaleza'}",1158,134.60427573279884
2015,"{'latlong': [-39.5970436535868, -5.3600126499898675], 'name': '4ª Macro - Sertão Central'}","{'latlong': [-39.4424043736871, -6.6823328399832285], 'name': '3ª Macro - Cariri'}",11,114.99291452469504
2015,"{'latlong': [-39.5970436535868, -5.3600126499898675], 'name': '4ª Macro - Sertão Central'}","{'latlong': [-39.5970436535868, -5.3600126499898675], 'name': '4ª Macro - Sertão Central'}",1221,0.0
2015,"{'latlong': [-39.5970436535868, -5.3600126499898675], 'name': '4ª Macro - Sertão Central'}","{'latlong': [-40.49827164718406, -4.270228494122716], 'name': '2ª Macro - Sobral'}",7,136.6063403884904
2015,"{'latlong': [-40.49827164718406, -4.270228494122716], 'name': '2ª Macro - Sobral'}","{'latlong': [-39.04198570967633, -3.972272374155126], 'name': '1ª Macro - Fortaleza'}",357,163.69432955223883
2015,"{'latlong': [-40.49827164718406, -4.270228494122716], 'name': '2ª Macro - Sobral'}","{'latlong': [-39.5970436535868, -5.3600126499898675], 'name': '4ª Macro - Sertão Central'}",14,136.6063403884904
2015,"{'latlong': [-40.49827164718406, -4.270228494122716], 'name': '2ª Macro - Sobral'}","{'latlong': [-40.49827164718406, -4.270228494122716], 'name': '2ª Macro - Sobral'}",6455,0.0
2016,"{'latlong': [-38.26279503575439, -5.2411729332342185], 'name': '5ª Macro - Litoral Leste/Jaguaribe'}","{'latlong': [-38.26279503575439, -5.2411729332342185], 'name': '5ª Macro - Litoral Leste/Jaguaribe'}",635,0.0
2016,"{'latlong': [-38.26279503575439, -5.2411729332342185], 'name': '5ª Macro - Litoral Leste/Jaguaribe'}","{'latlong': [-39.04198570967633, -3.972272374155126], 'name': '1ª Macro - Fortaleza'}",1442,140.29094146329456
2016,"{'latlong': [-38.26279503575439, -5.2411729332342185], 'name': '5ª Macro - Litoral Leste/Jaguaribe'}","{'latlong': [-39.5970436535868, -5.3600126499898675], 'name': '4ª Macro - Sertão Central'}",2,148.47845738572832
2016,"{'latlong': [-39.04198570967633, -3.972272374155126], 'name': '1ª Macro - Fortaleza'}","{'latlong': [-38.26279503575439, -5.2411729332342185], 'name': '5ª Macro - Litoral Leste/Jaguaribe'}",3,140.29094146329456
2016,"{'latlong': [-39.04198570967633, -3.972272374155126], 'name': '1ª Macro - Fortaleza'}","{'latlong': [-39.04198570967633, -3.972272374155126], 'name': '1ª Macro - Fortaleza'}",20341,0.0
2016,"{'latlong': [-39.04198570967633, -3.972272374155126], 'name': '1ª Macro - Fortaleza'}","{'latlong': [-39.4424043736871, -6.6823328399832285], 'name': '3ª Macro - Cariri'}",1,238.1362922408207
2016,"{'latlong': [-39.04198570967633, -3.972272374155126], 'name': '1ª Macro - Fortaleza'}","{'latlong': [-39.5970436535868, -5.3600126499898675], 'name': '4ª Macro - Sertão Central'}",2,134.60427573279884
2016,"{'latlong': [-39.04198570967633, -3.972272374155126], 'name': '1ª Macro - Fortaleza'}","{'latlong': [-40.49827164718406, -4.270228494122716], 'name': '2ª Macro - Sobral'}",16,163.69432955223883
2016,"{'latlong': [-39.4424043736871, -6.6823328399832285], 'name': '3ª Macro - Cariri'}","{'latlong': [-38.26279503575439, -5.2411729332342185], 'name': '5ª Macro - Litoral Leste/Jaguaribe'}",1,181.09845882673415
2016,"{'latlong': [-39.4424043736871, -6.6823328399832285], 'name': '3ª Macro - Cariri'}","{'latlong': [-39.04198570967633, -3.972272374155126], 'name': '1ª Macro - Fortaleza'}",401,238.1362922408207
2016,"{'latlong': [-39.4424043736871, -6.6823328399832285], 'name': '3ª Macro - Cariri'}","{'latlong': [-39.4424043736871, -6.6823328399832285], 'name': '3ª Macro - Cariri'}",8325,0.0
2016,"{'latlong': [-39.4424043736871, -6.6823328399832285], 'name': '3ª Macro - Cariri'}","{'latlong': [-39.5970436535868, -5.3600126499898675], 'name': '4ª Macro - Sertão Central'}",5,114.99291452469504
2016,"{'latlong': [-39.4424043736871, -6.6823328399832285], 'name': '3ª Macro - Cariri'}","{'latlong': [-40.49827164718406, -4.270228494122716], 'name': '2ª Macro - Sobral'}",1,237.07015549816794
2016,"{'latlong': [-39.5970436535868, -5.3600126499898675], 'name': '4ª Macro - Sertão Central'}","{'latlong': [-39.04198570967633, -3.972272374155126], 'name': '1ª Macro - Fortaleza'}",1236,134.60427573279884
2016,"{'latlong': [-39.5970436535868, -5.3600126499898675], 'name': '4ª Macro - Sertão Central'}","{'latlong': [-39.4424043736871, -6.6823328399832285], 'name': '3ª Macro - Cariri'}",13,114.99291452469504
2016,"{'latlong': [-39.5970436535868, -5.3600126499898675], 'name': '4ª Macro - Sertão Central'}","{'latlong': [-39.5970436535868, -5.3600126499898675], 'name': '4ª Macro - Sertão Central'}",1217,0.0
2016,"{'latlong': [-39.5970436535868, -5.3600126499898675], 'name': '4ª Macro - Sertão Central'}","{'latlong': [-40.49827164718406, -4.270228494122716], 'name': '2ª Macro - Sobral'}",5,136.6063403884904
2016,"{'latlong': [-40.49827164718406, -4.270228494122716], 'name': '2ª Macro - Sobral'}","{'latlong': [-39.04198570967633, -3.972272374155126], 'name': '1ª Macro - Fortaleza'}",464,163.69432955223883
2016,"{'latlong': [-40.49827164718406, -4.270228494122716], 'name': '2ª Macro - Sobral'}","{'latlong': [-39.4424043736871, -6.6823328399832285], 'name': '3ª Macro - Cariri'}",1,237.07015549816794
2016,"{'latlong': [-40.49827164718406, -4.270228494122716], 'name': '2ª Macro - Sobral'}","{'latlong': [-39.5970436535868, -5.3600126499898675], 'name': '4ª Macro - Sertão Central'}",6,136.6063403884904
2016,"{'latlong': [-40.49827164718406, -4.270228494122716], 'name': '2ª Macro - Sobral'}","{'latlong': [-40.49827164718406, -4.270228494122716], 'name': '2ª Macro - Sobral'}",5761,0.0
2017,"{'latlong': [-38.26279503575439, -5.2411729332342185], 'name': '5ª Macro - Litoral Leste/Jaguaribe'}","{'latlong': [-38.26279503575439, -5.2411729332342185], 'name': '5ª Macro - Litoral Leste/Jaguaribe'}",761,0.0
2017,"{'latlong': [-38.26279503575439, -5.2411729332342185], 'name': '5ª Macro - Litoral Leste/Jaguaribe'}","{'latlong': [-39.04198570967633, -3.972272374155126], 'name': '1ª Macro - Fortaleza'}",1314,140.29094146329456
2017,"{'latlong': [-38.26279503575439, -5.2411729332342185], 'name': '5ª Macro - Litoral Leste/Jaguaribe'}","{'latlong': [-39.4424043736871, -6.6823328399832285], 'name': '3ª Macro - Cariri'}",4,181.09845882673415
2017,"{'latlong': [-38.26279503575439, -5.2411729332342185], 'name': '5ª Macro - Litoral Leste/Jaguaribe'}","{'latlong': [-39.5970436535868, -5.3600126499898675], 'name': '4ª Macro - Sertão Central'}",3,148.47845738572832
2017,"{'latlong': [-38.26279503575439, -5.2411729332342185], 'name': '5ª Macro - Litoral Leste/Jaguaribe'}","{'latlong': [-40.49827164718406, -4.270228494122716], 'name': '2ª Macro - Sobral'}",1,261.9034991383947
2017,"{'latlong': [-39.04198570967633, -3.972272374155126], 'name': '1ª Macro - Fortaleza'}","{'latlong': [-38.26279503575439, -5.2411729332342185], 'name': '5ª Macro - Litoral Leste/Jaguaribe'}",5,140.29094146329456
2017,"{'latlong': [-39.04198570967633, -3.972272374155126], 'name': '1ª Macro - Fortaleza'}","{'latlong': [-39.04198570967633, -3.972272374155126], 'name': '1ª Macro - Fortaleza'}",19852,0.0
2017,"{'latlong': [-39.04198570967633, -3.972272374155126], 'name': '1ª Macro - Fortaleza'}","{'latlong': [-39.4424043736871, -6.6823328399832285], 'name': '3ª Macro - Cariri'}",8,238.1362922408207
2017,"{'latlong': [-39.04198570967633, -3.972272374155126], 'name': '1ª Macro - Fortaleza'}","{'latlong': [-39.5970436535868, -5.3600126499898675], 'name': '4ª Macro - Sertão Central'}",6,134.60427573279884
2017,"{'latlong': [-39.04198570967633, -3.972272374155126], 'name': '1ª Macro - Fortaleza'}","{'latlong': [-40.49827164718406, -4.270228494122716], 'name': '2ª Macro - Sobral'}",9,163.69432955223883
2017,"{'latlong': [-39.4424043736871, -6.6823328399832285], 'name': '3ª Macro - Cariri'}","{'latlong': [-39.04198570967633, -3.972272374155126], 'name': '1ª Macro - Fortaleza'}",432,238.1362922408207
2017,"{'latlong': [-39.4424043736871, -6.6823328399832285], 'name': '3ª Macro - Cariri'}","{'latlong': [-39.4424043736871, -6.6823328399832285], 'name': '3ª Macro - Cariri'}",8765,0.0
2017,"{'latlong': [-39.4424043736871, -6.6823328399832285], 'name': '3ª Macro - Cariri'}","{'latlong': [-39.5970436535868, -5.3600126499898675], 'name': '4ª Macro - Sertão Central'}",8,114.99291452469504
2017,"{'latlong': [-39.4424043736871, -6.6823328399832285], 'name': '3ª Macro - Cariri'}","{'latlong': [-40.49827164718406, -4.270228494122716], 'name': '2ª Macro - Sobral'}",2,237.07015549816794
2017,"{'latlong': [-39.5970436535868, -5.3600126499898675], 'name': '4ª Macro - Sertão Central'}","{'latlong': [-38.26279503575439, -5.2411729332342185], 'name': '5ª Macro - Litoral Leste/Jaguaribe'}",2,148.47845738572832
2017,"{'latlong': [-39.5970436535868, -5.3600126499898675], 'name': '4ª Macro - Sertão Central'}","{'latlong': [-39.04198570967633, -3.972272374155126], 'name': '1ª Macro - Fortaleza'}",1100,134.60427573279884
2017,"{'latlong': [-39.5970436535868, -5.3600126499898675], 'name': '4ª Macro - Sertão Central'}","{'latlong': [-39.4424043736871, -6.6823328399832285], 'name': '3ª Macro - Cariri'}",12,114.99291452469504
2017,"{'latlong': [-39.5970436535868, -5.3600126499898675], 'name': '4ª Macro - Sertão Central'}","{'latlong': [-39.5970436535868, -5.3600126499898675], 'name': '4ª Macro - Sertão Central'}",1173,0.0
2017,"{'latlong': [-39.5970436535868, -5.3600126499898675], 'name': '4ª Macro - Sertão Central'}","{'latlong': [-40.49827164718406, -4.270228494122716], 'name': '2ª Macro - Sobral'}",11,136.6063403884904
2017,"{'latlong': [-40.49827164718406, -4.270228494122716], 'name': '2ª Macro - Sobral'}","{'latlong': [-39.04198570967633, -3.972272374155126], 'name': '1ª Macro - Fortaleza'}",364,163.69432955223883
2017,"{'latlong': [-40.49827164718406, -4.270228494122716], 'name': '2ª Macro - Sobral'}","{'latlong': [-39.5970436535868, -5.3600126499898675], 'name': '4ª Macro - Sertão Central'}",7,136.6063403884904
2017,"{'latlong': [-40.49827164718406, -4.270228494122716], 'name': '2ª Macro - Sobral'}","{'latlong': [-40.49827164718406, -4.270228494122716], 'name': '2ª Macro - Sobral'}",5882,0.0
2018,"{'latlong': [-38.26279503575439, -5.2411729332342185], 'name': '5ª Macro - Litoral Leste/Jaguaribe'}","{'latlong': [-38.26279503575439, -5.2411729332342185], 'name': '5ª Macro - Litoral Leste/Jaguaribe'}",1199,0.0
2018,"{'latlong': [-38.26279503575439, -5.2411729332342185], 'name': '5ª Macro - Litoral Leste/Jaguaribe'}","{'latlong': [-39.04198570967633, -3.972272374155126], 'name': '1ª Macro - Fortaleza'}",1351,140.29094146329456
2018,"{'latlong': [-38.26279503575439, -5.2411729332342185], 'name': '5ª Macro - Litoral Leste/Jaguaribe'}","{'latlong': [-39.4424043736871, -6.6823328399832285], 'name': '3ª Macro - Cariri'}",2,181.09845882673415
2018,"{'latlong': [-38.26279503575439, -5.2411729332342185], 'name': '5ª Macro - Litoral Leste/Jaguaribe'}","{'latlong': [-39.5970436535868, -5.3600126499898675], 'name': '4ª Macro - Sertão Central'}",87,148.47845738572832
2018,"{'latlong': [-38.26279503575439, -5.2411729332342185], 'name': '5ª Macro - Litoral Leste/Jaguaribe'}","{'latlong': [-40.49827164718406, -4.270228494122716], 'name': '2ª Macro - Sobral'}",2,261.9034991383947
2018,"{'latlong': [-39.04198570967633, -3.972272374155126], 'name': '1ª Macro - Fortaleza'}","{'latlong': [-38.26279503575439, -5.2411729332342185], 'name': '5ª Macro - Litoral Leste/Jaguaribe'}",10,140.29094146329456
2018,"{'latlong': [-39.04198570967633, -3.972272374155126], 'name': '1ª Macro - Fortaleza'}","{'latlong': [-39.04198570967633, -3.972272374155126], 'name': '1ª Macro - Fortaleza'}",20294,0.0
2018,"{'latlong': [-39.04198570967633, -3.972272374155126], 'name': '1ª Macro - Fortaleza'}","{'latlong': [-39.4424043736871, -6.6823328399832285], 'name': '3ª Macro - Cariri'}",5,238.1362922408207
2018,"{'latlong': [-39.04198570967633, -3.972272374155126], 'name': '1ª Macro - Fortaleza'}","{'latlong': [-39.5970436535868, -5.3600126499898675], 'name': '4ª Macro - Sertão Central'}",82,134.60427573279884
2018,"{'latlong': [-39.04198570967633, -3.972272374155126], 'name': '1ª Macro - Fortaleza'}","{'latlong': [-40.49827164718406, -4.270228494122716], 'name': '2ª Macro - Sobral'}",22,163.69432955223883
2018,"{'latlong': [-39.4424043736871, -6.6823328399832285], 'name': '3ª Macro - Cariri'}","{'latlong': [-39.04198570967633, -3.972272374155126], 'name': '1ª Macro - Fortaleza'}",391,238.1362922408207
2018,"{'latlong': [-39.4424043736871, -6.6823328399832285], 'name': '3ª Macro - Cariri'}","{'latlong': [-39.4424043736871, -6.6823328399832285], 'name': '3ª Macro - Cariri'}",8768,0.0
2018,"{'latlong': [-39.4424043736871, -6.6823328399832285], 'name': '3ª Macro - Cariri'}","{'latlong': [-39.5970436535868, -5.3600126499898675], 'name': '4ª Macro - Sertão Central'}",11,114.99291452469504
2018,"{'latlong': [-39.5970436535868, -5.3600126499898675], 'name': '4ª Macro - Sertão Central'}","{'latlong': [-38.26279503575439, -5.2411729332342185], 'name': '5ª Macro - Litoral Leste/Jaguaribe'}",1,148.47845738572832
2018,"{'latlong': [-39.5970436535868, -5.3600126499898675], 'name': '4ª Macro - Sertão Central'}","{'latlong': [-39.04198570967633, -3.972272374155126], 'name': '1ª Macro - Fortaleza'}",1114,134.60427573279884
2018,"{'latlong': [-39.5970436535868, -5.3600126499898675], 'name': '4ª Macro - Sertão Central'}","{'latlong': [-39.4424043736871, -6.6823328399832285], 'name': '3ª Macro - Cariri'}",29,114.99291452469504
2018,"{'latlong': [-39.5970436535868, -5.3600126499898675], 'name': '4ª Macro - Sertão Central'}","{'latlong': [-39.5970436535868, -5.3600126499898675], 'name': '4ª Macro - Sertão Central'}",1832,0.0
2018,"{'latlong': [-39.5970436535868, -5.3600126499898675], 'name': '4ª Macro - Sertão Central'}","{'latlong': [-40.49827164718406, -4.270228494122716], 'name': '2ª Macro - Sobral'}",3,136.6063403884904
2018,"{'latlong': [-40.49827164718406, -4.270228494122716], 'name': '2ª Macro - Sobral'}","{'latlong': [-39.04198570967633, -3.972272374155126], 'name': '1ª Macro - Fortaleza'}",398,163.69432955223883
2018,"{'latlong': [-40.49827164718406, -4.270228494122716], 'name': '2ª Macro - Sobral'}","{'latlong': [-39.4424043736871, -6.6823328399832285], 'name': '3ª Macro - Cariri'}",8,237.07015549816794
2018,"{'latlong': [-40.49827164718406, -4.270228494122716], 'name': '2ª Macro - Sobral'}","{'latlong': [-39.5970436535868, -5.3600126499898675], 'name': '4ª Macro - Sertão Central'}",12,136.6063403884904
2018,"{'latlong': [-40.49827164718406, -4.270228494122716], 'name': '2ª Macro - Sobral'}","{'latlong': [-40.49827164718406, -4.270228494122716], 'name': '2ª Macro - Sobral'}",6725,0.0
2019,"{'latlong': [-38.26279503575439, -5.2411729332342185], 'name': '5ª Macro - Litoral Leste/Jaguaribe'}","{'latlong': [-38.26279503575439, -5.2411729332342185], 'name': '5ª Macro - Litoral Leste/Jaguaribe'}",1198,0.0
2019,"{'latlong': [-38.26279503575439, -5.2411729332342185], 'name': '5ª Macro - Litoral Leste/Jaguaribe'}","{'latlong': [-39.04198570967633, -3.972272374155126], 'name': '1ª Macro - Fortaleza'}",1439,140.29094146329456
2019,"{'latlong': [-38.26279503575439, -5.2411729332342185], 'name': '5ª Macro - Litoral Leste/Jaguaribe'}","{'latlong': [-39.4424043736871, -6.6823328399832285], 'name': '3ª Macro - Cariri'}",2,181.09845882673415
2019,"{'latlong': [-38.26279503575439, -5.2411729332342185], 'name': '5ª Macro - Litoral Leste/Jaguaribe'}","{'latlong': [-39.5970436535868, -5.3600126499898675], 'name': '4ª Macro - Sertão Central'}",189,148.47845738572832
2019,"{'latlong': [-39.04198570967633, -3.972272374155126], 'name': '1ª Macro - Fortaleza'}","{'latlong': [-38.26279503575439, -5.2411729332342185], 'name': '5ª Macro - Litoral Leste/Jaguaribe'}",9,140.29094146329456
2019,"{'latlong': [-39.04198570967633, -3.972272374155126], 'name': '1ª Macro - Fortaleza'}","{'latlong': [-39.04198570967633, -3.972272374155126], 'name': '1ª Macro - Fortaleza'}",21073,0.0
2019,"{'latlong': [-39.04198570967633, -3.972272374155126], 'name': '1ª Macro - Fortaleza'}","{'latlong': [-39.4424043736871, -6.6823328399832285], 'name': '3ª Macro - Cariri'}",7,238.1362922408207
2019,"{'latlong': [-39.04198570967633, -3.972272374155126], 'name': '1ª Macro - Fortaleza'}","{'latlong': [-39.5970436535868, -5.3600126499898675], 'name': '4ª Macro - Sertão Central'}",232,134.60427573279884
2019,"{'latlong': [-39.04198570967633, -3.972272374155126], 'name': '1ª Macro - Fortaleza'}","{'latlong': [-40.49827164718406, -4.270228494122716], 'name': '2ª Macro - Sobral'}",19,163.69432955223883
2019,"{'latlong': [-39.4424043736871, -6.6823328399832285], 'name': '3ª Macro - Cariri'}","{'latlong': [-39.04198570967633, -3.972272374155126], 'name': '1ª Macro - Fortaleza'}",423,238.1362922408207
2019,"{'latlong': [-39.4424043736871, -6.6823328399832285], 'name': '3ª Macro - Cariri'}","{'latlong': [-39.4424043736871, -6.6823328399832285], 'name': '3ª Macro - Cariri'}",9380,0.0
2019,"{'latlong': [-39.4424043736871, -6.6823328399832285], 'name': '3ª Macro - Cariri'}","{'latlong': [-39.5970436535868, -5.3600126499898675], 'name': '4ª Macro - Sertão Central'}",67,114.99291452469504
2019,"{'latlong': [-39.5970436535868, -5.3600126499898675], 'name': '4ª Macro - Sertão Central'}","{'latlong': [-38.26279503575439, -5.2411729332342185], 'name': '5ª Macro - Litoral Leste/Jaguaribe'}",1,148.47845738572832
2019,"{'latlong': [-39.5970436535868, -5.3600126499898675], 'name': '4ª Macro - Sertão Central'}","{'latlong': [-39.04198570967633, -3.972272374155126], 'name': '1ª Macro - Fortaleza'}",1192,134.60427573279884
2019,"{'latlong': [-39.5970436535868, -5.3600126499898675], 'name': '4ª Macro - Sertão Central'}","{'latlong': [-39.4424043736871, -6.6823328399832285], 'name': '3ª Macro - Cariri'}",40,114.99291452469504
2019,"{'latlong': [-39.5970436535868, -5.3600126499898675], 'name': '4ª Macro - Sertão Central'}","{'latlong': [-39.5970436535868, -5.3600126499898675], 'name': '4ª Macro - Sertão Central'}",2462,0.0
2019,"{'latlong': [-39.5970436535868, -5.3600126499898675], 'name': '4ª Macro - Sertão Central'}","{'latlong': [-40.49827164718406, -4.270228494122716], 'name': '2ª Macro - Sobral'}",3,136.6063403884904
2019,"{'latlong': [-40.49827164718406, -4.270228494122716], 'name': '2ª Macro - Sobral'}","{'latlong': [-39.04198570967633, -3.972272374155126], 'name': '1ª Macro - Fortaleza'}",498,163.69432955223883
2019,"{'latlong': [-40.49827164718406, -4.270228494122716], 'name': '2ª Macro - Sobral'}","{'latlong': [-39.4424043736871, -6.6823328399832285], 'name': '3ª Macro - Cariri'}",6,237.07015549816794
2019,"{'latlong': [-40.49827164718406, -4.270228494122716], 'name': '2ª Macro - Sobral'}","{'latlong': [-39.5970436535868, -5.3600126499898675], 'name': '4ª Macro - Sertão Central'}",19,136.6063403884904
2019,"{'latlong': [-40.49827164718406, -4.270228494122716], 'name': '2ª Macro - Sobral'}","{'latlong': [-40.49827164718406, -4.270228494122716], 'name': '2ª Macro - Sobral'}",8096,0.0
2020,"{'latlong': [-38.26279503575439, -5.2411729332342185], 'name': '5ª Macro - Litoral Leste/Jaguaribe'}","{'latlong': [-38.26279503575439, -5.2411729332342185], 'name': '5ª Macro - Litoral Leste/Jaguaribe'}",476,0.0
2020,"{'latlong': [-38.26279503575439, -5.2411729332342185], 'name': '5ª Macro - Litoral Leste/Jaguaribe'}","{'latlong': [-39.04198570967633, -3.972272374155126], 'name': '1ª Macro - Fortaleza'}",552,140.29094146329456
2020,"{'latlong': [-38.26279503575439, -5.2411729332342185], 'name': '5ª Macro - Litoral Leste/Jaguaribe'}","{'latlong': [-39.4424043736871, -6.6823328399832285], 'name': '3ª Macro - Cariri'}",1,181.09845882673415
2020,"{'latlong': [-38.26279503575439, -5.2411729332342185], 'name': '5ª Macro - Litoral Leste/Jaguaribe'}","{'latlong': [-39.5970436535868, -5.3600126499898675], 'name': '4ª Macro - Sertão Central'}",105,148.47845738572832
2020,"{'latlong': [-39.04198570967633, -3.972272374155126], 'name': '1ª Macro - Fortaleza'}","{'latlong': [-38.26279503575439, -5.2411729332342185], 'name': '5ª Macro - Litoral Leste/Jaguaribe'}",4,140.29094146329456
2020,"{'latlong': [-39.04198570967633, -3.972272374155126], 'name': '1ª Macro - Fortaleza'}","{'latlong': [-39.04198570967633, -3.972272374155126], 'name': '1ª Macro - Fortaleza'}",7699,0.0
2020,"{'latlong': [-39.04198570967633, -3.972272374155126], 'name': '1ª Macro - Fortaleza'}","{'latlong': [-39.4424043736871, -6.6823328399832285], 'name': '3ª Macro - Cariri'}",6,238.1362922408207
2020,"{'latlong': [-39.04198570967633, -3.972272374155126], 'name': '1ª Macro - Fortaleza'}","{'latlong': [-39.5970436535868, -5.3600126499898675], 'name': '4ª Macro - Sertão Central'}",75,134.60427573279884
2020,"{'latlong': [-39.04198570967633, -3.972272374155126], 'name': '1ª Macro - Fortaleza'}","{'latlong': [-40.49827164718406, -4.270228494122716], 'name': '2ª Macro - Sobral'}",7,163.69432955223883
2020,"{'latlong': [-39.4424043736871, -6.6823328399832285], 'name': '3ª Macro - Cariri'}","{'latlong': [-39.04198570967633, -3.972272374155126], 'name': '1ª Macro - Fortaleza'}",166,238.1362922408207
2020,"{'latlong': [-39.4424043736871, -6.6823328399832285], 'name': '3ª Macro - Cariri'}","{'latlong': [-39.4424043736871, -6.6823328399832285], 'name': '3ª Macro - Cariri'}",3051,0.0
2020,"{'latlong': [-39.4424043736871, -6.6823328399832285], 'name': '3ª Macro - Cariri'}","{'latlong': [-39.5970436535868, -5.3600126499898675], 'name': '4ª Macro - Sertão Central'}",28,114.99291452469504
2020,"{'latlong': [-39.5970436535868, -5.3600126499898675], 'name': '4ª Macro - Sertão Central'}","{'latlong': [-39.04198570967633, -3.972272374155126], 'name': '1ª Macro - Fortaleza'}",489,134.60427573279884
2020,"{'latlong': [-39.5970436535868, -5.3600126499898675], 'name': '4ª Macro - Sertão Central'}","{'latlong': [-39.4424043736871, -6.6823328399832285], 'name': '3ª Macro - Cariri'}",2,114.99291452469504
2020,"{'latlong': [-39.5970436535868, -5.3600126499898675], 'name': '4ª Macro - Sertão Central'}","{'latlong': [-39.5970436535868, -5.3600126499898675], 'name': '4ª Macro - Sertão Central'}",813,0.0
2020,"{'latlong': [-40.49827164718406, -4.270228494122716], 'name': '2ª Macro - Sobral'}","{'latlong': [-39.04198570967633, -3.972272374155126], 'name': '1ª Macro - Fortaleza'}",174,163.69432955223883
2020,"{'latlong': [-40.49827164718406, -4.270228494122716], 'name': '2ª Macro - Sobral'}","{'latlong': [-39.5970436535868, -5.3600126499898675], 'name': '4ª Macro - Sertão Central'}",5,136.6063403884904
2020,"{'latlong': [-40.49827164718406, -4.270228494122716], 'name': '2ª Macro - Sobral'}","{'latlong': [-40.49827164718406, -4.270228494122716], 'name': '2ª Macro - Sobral'}",3163,0.0
