year,from,to,hospitalizations
1995,"{'latlong': [-41.74084505657541, -21.799306433880908], 'name': 'Macrorregião III'}","{'latlong': [-42.78374566691811, -22.435006717319105], 'name': 'Macrorregião II'}",1
1995,"{'latlong': [-42.78374566691811, -22.435006717319105], 'name': 'Macrorregião II'}","{'latlong': [-42.78374566691811, -22.435006717319105], 'name': 'Macrorregião II'}",1
1998,"{'latlong': [-41.74084505657541, -21.799306433880908], 'name': 'Macrorregião III'}","{'latlong': [-41.74084505657541, -21.799306433880908], 'name': 'Macrorregião III'}",3862
1998,"{'latlong': [-41.74084505657541, -21.799306433880908], 'name': 'Macrorregião III'}","{'latlong': [-42.78374566691811, -22.435006717319105], 'name': 'Macrorregião II'}",1768
1998,"{'latlong': [-41.74084505657541, -21.799306433880908], 'name': 'Macrorregião III'}","{'latlong': [-43.93088259914695, -22.50640773396086], 'name': 'Metropolitana I'}",7
1998,"{'latlong': [-42.78374566691811, -22.435006717319105], 'name': 'Macrorregião II'}","{'latlong': [-41.74084505657541, -21.799306433880908], 'name': 'Macrorregião III'}",134
1998,"{'latlong': [-42.78374566691811, -22.435006717319105], 'name': 'Macrorregião II'}","{'latlong': [-42.78374566691811, -22.435006717319105], 'name': 'Macrorregião II'}",50874
1998,"{'latlong': [-42.78374566691811, -22.435006717319105], 'name': 'Macrorregião II'}","{'latlong': [-43.93088259914695, -22.50640773396086], 'name': 'Metropolitana I'}",11105
1998,"{'latlong': [-43.93088259914695, -22.50640773396086], 'name': 'Metropolitana I'}","{'latlong': [-41.74084505657541, -21.799306433880908], 'name': 'Macrorregião III'}",1
1998,"{'latlong': [-43.93088259914695, -22.50640773396086], 'name': 'Metropolitana I'}","{'latlong': [-42.78374566691811, -22.435006717319105], 'name': 'Macrorregião II'}",846
1998,"{'latlong': [-43.93088259914695, -22.50640773396086], 'name': 'Metropolitana I'}","{'latlong': [-43.93088259914695, -22.50640773396086], 'name': 'Metropolitana I'}",9306
1999,"{'latlong': [-41.74084505657541, -21.799306433880908], 'name': 'Macrorregião III'}","{'latlong': [-41.74084505657541, -21.799306433880908], 'name': 'Macrorregião III'}",7660
1999,"{'latlong': [-41.74084505657541, -21.799306433880908], 'name': 'Macrorregião III'}","{'latlong': [-42.78374566691811, -22.435006717319105], 'name': 'Macrorregião II'}",3997
1999,"{'latlong': [-41.74084505657541, -21.799306433880908], 'name': 'Macrorregião III'}","{'latlong': [-43.93088259914695, -22.50640773396086], 'name': 'Metropolitana I'}",20
1999,"{'latlong': [-42.78374566691811, -22.435006717319105], 'name': 'Macrorregião II'}","{'latlong': [-41.74084505657541, -21.799306433880908], 'name': 'Macrorregião III'}",271
1999,"{'latlong': [-42.78374566691811, -22.435006717319105], 'name': 'Macrorregião II'}","{'latlong': [-42.78374566691811, -22.435006717319105], 'name': 'Macrorregião II'}",100614
1999,"{'latlong': [-42.78374566691811, -22.435006717319105], 'name': 'Macrorregião II'}","{'latlong': [-43.93088259914695, -22.50640773396086], 'name': 'Metropolitana I'}",19328
1999,"{'latlong': [-43.93088259914695, -22.50640773396086], 'name': 'Metropolitana I'}","{'latlong': [-41.74084505657541, -21.799306433880908], 'name': 'Macrorregião III'}",6
1999,"{'latlong': [-43.93088259914695, -22.50640773396086], 'name': 'Metropolitana I'}","{'latlong': [-42.78374566691811, -22.435006717319105], 'name': 'Macrorregião II'}",1676
1999,"{'latlong': [-43.93088259914695, -22.50640773396086], 'name': 'Metropolitana I'}","{'latlong': [-43.93088259914695, -22.50640773396086], 'name': 'Metropolitana I'}",16345
2000,"{'latlong': [-41.74084505657541, -21.799306433880908], 'name': 'Macrorregião III'}","{'latlong': [-41.74084505657541, -21.799306433880908], 'name': 'Macrorregião III'}",7613
2000,"{'latlong': [-41.74084505657541, -21.799306433880908], 'name': 'Macrorregião III'}","{'latlong': [-42.78374566691811, -22.435006717319105], 'name': 'Macrorregião II'}",4464
2000,"{'latlong': [-41.74084505657541, -21.799306433880908], 'name': 'Macrorregião III'}","{'latlong': [-43.93088259914695, -22.50640773396086], 'name': 'Metropolitana I'}",39
2000,"{'latlong': [-42.78374566691811, -22.435006717319105], 'name': 'Macrorregião II'}","{'latlong': [-41.74084505657541, -21.799306433880908], 'name': 'Macrorregião III'}",185
2000,"{'latlong': [-42.78374566691811, -22.435006717319105], 'name': 'Macrorregião II'}","{'latlong': [-42.78374566691811, -22.435006717319105], 'name': 'Macrorregião II'}",104907
2000,"{'latlong': [-42.78374566691811, -22.435006717319105], 'name': 'Macrorregião II'}","{'latlong': [-43.93088259914695, -22.50640773396086], 'name': 'Metropolitana I'}",19195
2000,"{'latlong': [-43.93088259914695, -22.50640773396086], 'name': 'Metropolitana I'}","{'latlong': [-41.74084505657541, -21.799306433880908], 'name': 'Macrorregião III'}",3
2000,"{'latlong': [-43.93088259914695, -22.50640773396086], 'name': 'Metropolitana I'}","{'latlong': [-42.78374566691811, -22.435006717319105], 'name': 'Macrorregião II'}",1541
2000,"{'latlong': [-43.93088259914695, -22.50640773396086], 'name': 'Metropolitana I'}","{'latlong': [-43.93088259914695, -22.50640773396086], 'name': 'Metropolitana I'}",16271
2001,"{'latlong': [-41.74084505657541, -21.799306433880908], 'name': 'Macrorregião III'}","{'latlong': [-41.74084505657541, -21.799306433880908], 'name': 'Macrorregião III'}",7386
2001,"{'latlong': [-41.74084505657541, -21.799306433880908], 'name': 'Macrorregião III'}","{'latlong': [-42.78374566691811, -22.435006717319105], 'name': 'Macrorregião II'}",2747
2001,"{'latlong': [-41.74084505657541, -21.799306433880908], 'name': 'Macrorregião III'}","{'latlong': [-43.93088259914695, -22.50640773396086], 'name': 'Metropolitana I'}",17
2001,"{'latlong': [-42.78374566691811, -22.435006717319105], 'name': 'Macrorregião II'}","{'latlong': [-41.74084505657541, -21.799306433880908], 'name': 'Macrorregião III'}",185
2001,"{'latlong': [-42.78374566691811, -22.435006717319105], 'name': 'Macrorregião II'}","{'latlong': [-42.78374566691811, -22.435006717319105], 'name': 'Macrorregião II'}",98275
2001,"{'latlong': [-42.78374566691811, -22.435006717319105], 'name': 'Macrorregião II'}","{'latlong': [-43.93088259914695, -22.50640773396086], 'name': 'Metropolitana I'}",15051
2001,"{'latlong': [-43.93088259914695, -22.50640773396086], 'name': 'Metropolitana I'}","{'latlong': [-42.78374566691811, -22.435006717319105], 'name': 'Macrorregião II'}",1231
2001,"{'latlong': [-43.93088259914695, -22.50640773396086], 'name': 'Metropolitana I'}","{'latlong': [-43.93088259914695, -22.50640773396086], 'name': 'Metropolitana I'}",15362
2002,"{'latlong': [-41.74084505657541, -21.799306433880908], 'name': 'Macrorregião III'}","{'latlong': [-41.74084505657541, -21.799306433880908], 'name': 'Macrorregião III'}",6724
2002,"{'latlong': [-41.74084505657541, -21.799306433880908], 'name': 'Macrorregião III'}","{'latlong': [-42.78374566691811, -22.435006717319105], 'name': 'Macrorregião II'}",2384
2002,"{'latlong': [-41.74084505657541, -21.799306433880908], 'name': 'Macrorregião III'}","{'latlong': [-43.93088259914695, -22.50640773396086], 'name': 'Metropolitana I'}",23
2002,"{'latlong': [-42.78374566691811, -22.435006717319105], 'name': 'Macrorregião II'}","{'latlong': [-41.74084505657541, -21.799306433880908], 'name': 'Macrorregião III'}",165
2002,"{'latlong': [-42.78374566691811, -22.435006717319105], 'name': 'Macrorregião II'}","{'latlong': [-42.78374566691811, -22.435006717319105], 'name': 'Macrorregião II'}",92849
2002,"{'latlong': [-42.78374566691811, -22.435006717319105], 'name': 'Macrorregião II'}","{'latlong': [-43.93088259914695, -22.50640773396086], 'name': 'Metropolitana I'}",13540
2002,"{'latlong': [-43.93088259914695, -22.50640773396086], 'name': 'Metropolitana I'}","{'latlong': [-41.74084505657541, -21.799306433880908], 'name': 'Macrorregião III'}",2
2002,"{'latlong': [-43.93088259914695, -22.50640773396086], 'name': 'Metropolitana I'}","{'latlong': [-42.78374566691811, -22.435006717319105], 'name': 'Macrorregião II'}",1123
2002,"{'latlong': [-43.93088259914695, -22.50640773396086], 'name': 'Metropolitana I'}","{'latlong': [-43.93088259914695, -22.50640773396086], 'name': 'Metropolitana I'}",14171
2003,"{'latlong': [-41.74084505657541, -21.799306433880908], 'name': 'Macrorregião III'}","{'latlong': [-41.74084505657541, -21.799306433880908], 'name': 'Macrorregião III'}",6427
2003,"{'latlong': [-41.74084505657541, -21.799306433880908], 'name': 'Macrorregião III'}","{'latlong': [-42.78374566691811, -22.435006717319105], 'name': 'Macrorregião II'}",2189
2003,"{'latlong': [-41.74084505657541, -21.799306433880908], 'name': 'Macrorregião III'}","{'latlong': [-43.93088259914695, -22.50640773396086], 'name': 'Metropolitana I'}",7
2003,"{'latlong': [-42.78374566691811, -22.435006717319105], 'name': 'Macrorregião II'}","{'latlong': [-41.74084505657541, -21.799306433880908], 'name': 'Macrorregião III'}",127
2003,"{'latlong': [-42.78374566691811, -22.435006717319105], 'name': 'Macrorregião II'}","{'latlong': [-42.78374566691811, -22.435006717319105], 'name': 'Macrorregião II'}",85348
2003,"{'latlong': [-42.78374566691811, -22.435006717319105], 'name': 'Macrorregião II'}","{'latlong': [-43.93088259914695, -22.50640773396086], 'name': 'Metropolitana I'}",2289
2003,"{'latlong': [-43.93088259914695, -22.50640773396086], 'name': 'Metropolitana I'}","{'latlong': [-42.78374566691811, -22.435006717319105], 'name': 'Macrorregião II'}",984
2003,"{'latlong': [-43.93088259914695, -22.50640773396086], 'name': 'Metropolitana I'}","{'latlong': [-43.93088259914695, -22.50640773396086], 'name': 'Metropolitana I'}",23465
2004,"{'latlong': [-41.74084505657541, -21.799306433880908], 'name': 'Macrorregião III'}","{'latlong': [-41.74084505657541, -21.799306433880908], 'name': 'Macrorregião III'}",6953
2004,"{'latlong': [-41.74084505657541, -21.799306433880908], 'name': 'Macrorregião III'}","{'latlong': [-42.78374566691811, -22.435006717319105], 'name': 'Macrorregião II'}",2970
2004,"{'latlong': [-42.78374566691811, -22.435006717319105], 'name': 'Macrorregião II'}","{'latlong': [-41.74084505657541, -21.799306433880908], 'name': 'Macrorregião III'}",145
2004,"{'latlong': [-42.78374566691811, -22.435006717319105], 'name': 'Macrorregião II'}","{'latlong': [-42.78374566691811, -22.435006717319105], 'name': 'Macrorregião II'}",78939
2004,"{'latlong': [-42.78374566691811, -22.435006717319105], 'name': 'Macrorregião II'}","{'latlong': [-43.93088259914695, -22.50640773396086], 'name': 'Metropolitana I'}",1623
2004,"{'latlong': [-43.93088259914695, -22.50640773396086], 'name': 'Metropolitana I'}","{'latlong': [-42.78374566691811, -22.435006717319105], 'name': 'Macrorregião II'}",951
2004,"{'latlong': [-43.93088259914695, -22.50640773396086], 'name': 'Metropolitana I'}","{'latlong': [-43.93088259914695, -22.50640773396086], 'name': 'Metropolitana I'}",22256
2005,"{'latlong': [-41.74084505657541, -21.799306433880908], 'name': 'Macrorregião III'}","{'latlong': [-41.74084505657541, -21.799306433880908], 'name': 'Macrorregião III'}",6752
2005,"{'latlong': [-41.74084505657541, -21.799306433880908], 'name': 'Macrorregião III'}","{'latlong': [-42.78374566691811, -22.435006717319105], 'name': 'Macrorregião II'}",2991
2005,"{'latlong': [-41.74084505657541, -21.799306433880908], 'name': 'Macrorregião III'}","{'latlong': [-43.93088259914695, -22.50640773396086], 'name': 'Metropolitana I'}",2
2005,"{'latlong': [-42.78374566691811, -22.435006717319105], 'name': 'Macrorregião II'}","{'latlong': [-41.74084505657541, -21.799306433880908], 'name': 'Macrorregião III'}",89
2005,"{'latlong': [-42.78374566691811, -22.435006717319105], 'name': 'Macrorregião II'}","{'latlong': [-42.78374566691811, -22.435006717319105], 'name': 'Macrorregião II'}",76239
2005,"{'latlong': [-42.78374566691811, -22.435006717319105], 'name': 'Macrorregião II'}","{'latlong': [-43.93088259914695, -22.50640773396086], 'name': 'Metropolitana I'}",1964
2005,"{'latlong': [-43.93088259914695, -22.50640773396086], 'name': 'Metropolitana I'}","{'latlong': [-42.78374566691811, -22.435006717319105], 'name': 'Macrorregião II'}",866
2005,"{'latlong': [-43.93088259914695, -22.50640773396086], 'name': 'Metropolitana I'}","{'latlong': [-43.93088259914695, -22.50640773396086], 'name': 'Metropolitana I'}",19724
2006,"{'latlong': [-41.74084505657541, -21.799306433880908], 'name': 'Macrorregião III'}","{'latlong': [-41.74084505657541, -21.799306433880908], 'name': 'Macrorregião III'}",6914
2006,"{'latlong': [-41.74084505657541, -21.799306433880908], 'name': 'Macrorregião III'}","{'latlong': [-42.78374566691811, -22.435006717319105], 'name': 'Macrorregião II'}",2685
2006,"{'latlong': [-41.74084505657541, -21.799306433880908], 'name': 'Macrorregião III'}","{'latlong': [-43.93088259914695, -22.50640773396086], 'name': 'Metropolitana I'}",13
2006,"{'latlong': [-42.78374566691811, -22.435006717319105], 'name': 'Macrorregião II'}","{'latlong': [-41.74084505657541, -21.799306433880908], 'name': 'Macrorregião III'}",86
2006,"{'latlong': [-42.78374566691811, -22.435006717319105], 'name': 'Macrorregião II'}","{'latlong': [-42.78374566691811, -22.435006717319105], 'name': 'Macrorregião II'}",72876
2006,"{'latlong': [-42.78374566691811, -22.435006717319105], 'name': 'Macrorregião II'}","{'latlong': [-43.93088259914695, -22.50640773396086], 'name': 'Metropolitana I'}",1330
2006,"{'latlong': [-43.93088259914695, -22.50640773396086], 'name': 'Metropolitana I'}","{'latlong': [-42.78374566691811, -22.435006717319105], 'name': 'Macrorregião II'}",790
2006,"{'latlong': [-43.93088259914695, -22.50640773396086], 'name': 'Metropolitana I'}","{'latlong': [-43.93088259914695, -22.50640773396086], 'name': 'Metropolitana I'}",17220
2007,"{'latlong': [-41.74084505657541, -21.799306433880908], 'name': 'Macrorregião III'}","{'latlong': [-41.74084505657541, -21.799306433880908], 'name': 'Macrorregião III'}",6643
2007,"{'latlong': [-41.74084505657541, -21.799306433880908], 'name': 'Macrorregião III'}","{'latlong': [-42.78374566691811, -22.435006717319105], 'name': 'Macrorregião II'}",2752
2007,"{'latlong': [-41.74084505657541, -21.799306433880908], 'name': 'Macrorregião III'}","{'latlong': [-43.93088259914695, -22.50640773396086], 'name': 'Metropolitana I'}",1
2007,"{'latlong': [-42.78374566691811, -22.435006717319105], 'name': 'Macrorregião II'}","{'latlong': [-41.74084505657541, -21.799306433880908], 'name': 'Macrorregião III'}",114
2007,"{'latlong': [-42.78374566691811, -22.435006717319105], 'name': 'Macrorregião II'}","{'latlong': [-42.78374566691811, -22.435006717319105], 'name': 'Macrorregião II'}",69279
2007,"{'latlong': [-42.78374566691811, -22.435006717319105], 'name': 'Macrorregião II'}","{'latlong': [-43.93088259914695, -22.50640773396086], 'name': 'Metropolitana I'}",1753
2007,"{'latlong': [-43.93088259914695, -22.50640773396086], 'name': 'Metropolitana I'}","{'latlong': [-42.78374566691811, -22.435006717319105], 'name': 'Macrorregião II'}",772
2007,"{'latlong': [-43.93088259914695, -22.50640773396086], 'name': 'Metropolitana I'}","{'latlong': [-43.93088259914695, -22.50640773396086], 'name': 'Metropolitana I'}",15743
2008,"{'latlong': [-41.74084505657541, -21.799306433880908], 'name': 'Macrorregião III'}","{'latlong': [-41.74084505657541, -21.799306433880908], 'name': 'Macrorregião III'}",6671
2008,"{'latlong': [-41.74084505657541, -21.799306433880908], 'name': 'Macrorregião III'}","{'latlong': [-42.78374566691811, -22.435006717319105], 'name': 'Macrorregião II'}",2378
2008,"{'latlong': [-41.74084505657541, -21.799306433880908], 'name': 'Macrorregião III'}","{'latlong': [-43.93088259914695, -22.50640773396086], 'name': 'Metropolitana I'}",7
2008,"{'latlong': [-42.78374566691811, -22.435006717319105], 'name': 'Macrorregião II'}","{'latlong': [-41.74084505657541, -21.799306433880908], 'name': 'Macrorregião III'}",37
2008,"{'latlong': [-42.78374566691811, -22.435006717319105], 'name': 'Macrorregião II'}","{'latlong': [-42.78374566691811, -22.435006717319105], 'name': 'Macrorregião II'}",64682
2008,"{'latlong': [-42.78374566691811, -22.435006717319105], 'name': 'Macrorregião II'}","{'latlong': [-43.93088259914695, -22.50640773396086], 'name': 'Metropolitana I'}",6638
2008,"{'latlong': [-43.93088259914695, -22.50640773396086], 'name': 'Metropolitana I'}","{'latlong': [-42.78374566691811, -22.435006717319105], 'name': 'Macrorregião II'}",749
2008,"{'latlong': [-43.93088259914695, -22.50640773396086], 'name': 'Metropolitana I'}","{'latlong': [-43.93088259914695, -22.50640773396086], 'name': 'Metropolitana I'}",8923
2009,"{'latlong': [-41.74084505657541, -21.799306433880908], 'name': 'Macrorregião III'}","{'latlong': [-41.74084505657541, -21.799306433880908], 'name': 'Macrorregião III'}",6519
2009,"{'latlong': [-41.74084505657541, -21.799306433880908], 'name': 'Macrorregião III'}","{'latlong': [-42.78374566691811, -22.435006717319105], 'name': 'Macrorregião II'}",2287
2009,"{'latlong': [-41.74084505657541, -21.799306433880908], 'name': 'Macrorregião III'}","{'latlong': [-43.93088259914695, -22.50640773396086], 'name': 'Metropolitana I'}",1
2009,"{'latlong': [-42.78374566691811, -22.435006717319105], 'name': 'Macrorregião II'}","{'latlong': [-41.74084505657541, -21.799306433880908], 'name': 'Macrorregião III'}",36
2009,"{'latlong': [-42.78374566691811, -22.435006717319105], 'name': 'Macrorregião II'}","{'latlong': [-42.78374566691811, -22.435006717319105], 'name': 'Macrorregião II'}",57151
2009,"{'latlong': [-42.78374566691811, -22.435006717319105], 'name': 'Macrorregião II'}","{'latlong': [-43.93088259914695, -22.50640773396086], 'name': 'Metropolitana I'}",6679
2009,"{'latlong': [-43.93088259914695, -22.50640773396086], 'name': 'Metropolitana I'}","{'latlong': [-42.78374566691811, -22.435006717319105], 'name': 'Macrorregião II'}",643
2009,"{'latlong': [-43.93088259914695, -22.50640773396086], 'name': 'Metropolitana I'}","{'latlong': [-43.93088259914695, -22.50640773396086], 'name': 'Metropolitana I'}",7739
2010,"{'latlong': [-41.74084505657541, -21.799306433880908], 'name': 'Macrorregião III'}","{'latlong': [-41.74084505657541, -21.799306433880908], 'name': 'Macrorregião III'}",6241
2010,"{'latlong': [-41.74084505657541, -21.799306433880908], 'name': 'Macrorregião III'}","{'latlong': [-42.78374566691811, -22.435006717319105], 'name': 'Macrorregião II'}",2132
2010,"{'latlong': [-42.78374566691811, -22.435006717319105], 'name': 'Macrorregião II'}","{'latlong': [-41.74084505657541, -21.799306433880908], 'name': 'Macrorregião III'}",28
2010,"{'latlong': [-42.78374566691811, -22.435006717319105], 'name': 'Macrorregião II'}","{'latlong': [-42.78374566691811, -22.435006717319105], 'name': 'Macrorregião II'}",53013
2010,"{'latlong': [-42.78374566691811, -22.435006717319105], 'name': 'Macrorregião II'}","{'latlong': [-43.93088259914695, -22.50640773396086], 'name': 'Metropolitana I'}",6071
2010,"{'latlong': [-43.93088259914695, -22.50640773396086], 'name': 'Metropolitana I'}","{'latlong': [-42.78374566691811, -22.435006717319105], 'name': 'Macrorregião II'}",540
2010,"{'latlong': [-43.93088259914695, -22.50640773396086], 'name': 'Metropolitana I'}","{'latlong': [-43.93088259914695, -22.50640773396086], 'name': 'Metropolitana I'}",7323
2011,"{'latlong': [-41.74084505657541, -21.799306433880908], 'name': 'Macrorregião III'}","{'latlong': [-41.74084505657541, -21.799306433880908], 'name': 'Macrorregião III'}",7074
2011,"{'latlong': [-41.74084505657541, -21.799306433880908], 'name': 'Macrorregião III'}","{'latlong': [-42.78374566691811, -22.435006717319105], 'name': 'Macrorregião II'}",1839
2011,"{'latlong': [-42.78374566691811, -22.435006717319105], 'name': 'Macrorregião II'}","{'latlong': [-41.74084505657541, -21.799306433880908], 'name': 'Macrorregião III'}",7
2011,"{'latlong': [-42.78374566691811, -22.435006717319105], 'name': 'Macrorregião II'}","{'latlong': [-42.78374566691811, -22.435006717319105], 'name': 'Macrorregião II'}",51459
2011,"{'latlong': [-42.78374566691811, -22.435006717319105], 'name': 'Macrorregião II'}","{'latlong': [-43.93088259914695, -22.50640773396086], 'name': 'Metropolitana I'}",5091
2011,"{'latlong': [-43.93088259914695, -22.50640773396086], 'name': 'Metropolitana I'}","{'latlong': [-42.78374566691811, -22.435006717319105], 'name': 'Macrorregião II'}",509
2011,"{'latlong': [-43.93088259914695, -22.50640773396086], 'name': 'Metropolitana I'}","{'latlong': [-43.93088259914695, -22.50640773396086], 'name': 'Metropolitana I'}",7089
2012,"{'latlong': [-41.74084505657541, -21.799306433880908], 'name': 'Macrorregião III'}","{'latlong': [-41.74084505657541, -21.799306433880908], 'name': 'Macrorregião III'}",6576
2012,"{'latlong': [-41.74084505657541, -21.799306433880908], 'name': 'Macrorregião III'}","{'latlong': [-42.78374566691811, -22.435006717319105], 'name': 'Macrorregião II'}",900
2012,"{'latlong': [-42.78374566691811, -22.435006717319105], 'name': 'Macrorregião II'}","{'latlong': [-41.74084505657541, -21.799306433880908], 'name': 'Macrorregião III'}",5
2012,"{'latlong': [-42.78374566691811, -22.435006717319105], 'name': 'Macrorregião II'}","{'latlong': [-42.78374566691811, -22.435006717319105], 'name': 'Macrorregião II'}",43482
2012,"{'latlong': [-42.78374566691811, -22.435006717319105], 'name': 'Macrorregião II'}","{'latlong': [-43.93088259914695, -22.50640773396086], 'name': 'Metropolitana I'}",4533
2012,"{'latlong': [-43.93088259914695, -22.50640773396086], 'name': 'Metropolitana I'}","{'latlong': [-41.74084505657541, -21.799306433880908], 'name': 'Macrorregião III'}",3
2012,"{'latlong': [-43.93088259914695, -22.50640773396086], 'name': 'Metropolitana I'}","{'latlong': [-42.78374566691811, -22.435006717319105], 'name': 'Macrorregião II'}",448
2012,"{'latlong': [-43.93088259914695, -22.50640773396086], 'name': 'Metropolitana I'}","{'latlong': [-43.93088259914695, -22.50640773396086], 'name': 'Metropolitana I'}",6412
2013,"{'latlong': [-41.74084505657541, -21.799306433880908], 'name': 'Macrorregião III'}","{'latlong': [-41.74084505657541, -21.799306433880908], 'name': 'Macrorregião III'}",6298
2013,"{'latlong': [-41.74084505657541, -21.799306433880908], 'name': 'Macrorregião III'}","{'latlong': [-42.78374566691811, -22.435006717319105], 'name': 'Macrorregião II'}",866
2013,"{'latlong': [-41.74084505657541, -21.799306433880908], 'name': 'Macrorregião III'}","{'latlong': [-43.93088259914695, -22.50640773396086], 'name': 'Metropolitana I'}",1
2013,"{'latlong': [-42.78374566691811, -22.435006717319105], 'name': 'Macrorregião II'}","{'latlong': [-41.74084505657541, -21.799306433880908], 'name': 'Macrorregião III'}",2
2013,"{'latlong': [-42.78374566691811, -22.435006717319105], 'name': 'Macrorregião II'}","{'latlong': [-42.78374566691811, -22.435006717319105], 'name': 'Macrorregião II'}",37016
2013,"{'latlong': [-42.78374566691811, -22.435006717319105], 'name': 'Macrorregião II'}","{'latlong': [-43.93088259914695, -22.50640773396086], 'name': 'Metropolitana I'}",4255
2013,"{'latlong': [-43.93088259914695, -22.50640773396086], 'name': 'Metropolitana I'}","{'latlong': [-41.74084505657541, -21.799306433880908], 'name': 'Macrorregião III'}",2
2013,"{'latlong': [-43.93088259914695, -22.50640773396086], 'name': 'Metropolitana I'}","{'latlong': [-42.78374566691811, -22.435006717319105], 'name': 'Macrorregião II'}",429
2013,"{'latlong': [-43.93088259914695, -22.50640773396086], 'name': 'Metropolitana I'}","{'latlong': [-43.93088259914695, -22.50640773396086], 'name': 'Metropolitana I'}",6092
2014,"{'latlong': [-41.74084505657541, -21.799306433880908], 'name': 'Macrorregião III'}","{'latlong': [-41.74084505657541, -21.799306433880908], 'name': 'Macrorregião III'}",5822
2014,"{'latlong': [-41.74084505657541, -21.799306433880908], 'name': 'Macrorregião III'}","{'latlong': [-42.78374566691811, -22.435006717319105], 'name': 'Macrorregião II'}",856
2014,"{'latlong': [-41.74084505657541, -21.799306433880908], 'name': 'Macrorregião III'}","{'latlong': [-43.93088259914695, -22.50640773396086], 'name': 'Metropolitana I'}",3
2014,"{'latlong': [-42.78374566691811, -22.435006717319105], 'name': 'Macrorregião II'}","{'latlong': [-41.74084505657541, -21.799306433880908], 'name': 'Macrorregião III'}",1
2014,"{'latlong': [-42.78374566691811, -22.435006717319105], 'name': 'Macrorregião II'}","{'latlong': [-42.78374566691811, -22.435006717319105], 'name': 'Macrorregião II'}",32944
2014,"{'latlong': [-42.78374566691811, -22.435006717319105], 'name': 'Macrorregião II'}","{'latlong': [-43.93088259914695, -22.50640773396086], 'name': 'Metropolitana I'}",3693
2014,"{'latlong': [-43.93088259914695, -22.50640773396086], 'name': 'Metropolitana I'}","{'latlong': [-42.78374566691811, -22.435006717319105], 'name': 'Macrorregião II'}",363
2014,"{'latlong': [-43.93088259914695, -22.50640773396086], 'name': 'Metropolitana I'}","{'latlong': [-43.93088259914695, -22.50640773396086], 'name': 'Metropolitana I'}",5417
2015,"{'latlong': [-41.74084505657541, -21.799306433880908], 'name': 'Macrorregião III'}","{'latlong': [-41.74084505657541, -21.799306433880908], 'name': 'Macrorregião III'}",4094
2015,"{'latlong': [-41.74084505657541, -21.799306433880908], 'name': 'Macrorregião III'}","{'latlong': [-42.78374566691811, -22.435006717319105], 'name': 'Macrorregião II'}",735
2015,"{'latlong': [-42.78374566691811, -22.435006717319105], 'name': 'Macrorregião II'}","{'latlong': [-41.74084505657541, -21.799306433880908], 'name': 'Macrorregião III'}",1
2015,"{'latlong': [-42.78374566691811, -22.435006717319105], 'name': 'Macrorregião II'}","{'latlong': [-42.78374566691811, -22.435006717319105], 'name': 'Macrorregião II'}",32499
2015,"{'latlong': [-42.78374566691811, -22.435006717319105], 'name': 'Macrorregião II'}","{'latlong': [-43.93088259914695, -22.50640773396086], 'name': 'Metropolitana I'}",2029
2015,"{'latlong': [-43.93088259914695, -22.50640773396086], 'name': 'Metropolitana I'}","{'latlong': [-42.78374566691811, -22.435006717319105], 'name': 'Macrorregião II'}",273
2015,"{'latlong': [-43.93088259914695, -22.50640773396086], 'name': 'Metropolitana I'}","{'latlong': [-43.93088259914695, -22.50640773396086], 'name': 'Metropolitana I'}",4360
2016,"{'latlong': [-41.74084505657541, -21.799306433880908], 'name': 'Macrorregião III'}","{'latlong': [-41.74084505657541, -21.799306433880908], 'name': 'Macrorregião III'}",4037
2016,"{'latlong': [-41.74084505657541, -21.799306433880908], 'name': 'Macrorregião III'}","{'latlong': [-42.78374566691811, -22.435006717319105], 'name': 'Macrorregião II'}",504
2016,"{'latlong': [-42.78374566691811, -22.435006717319105], 'name': 'Macrorregião II'}","{'latlong': [-42.78374566691811, -22.435006717319105], 'name': 'Macrorregião II'}",28709
2016,"{'latlong': [-42.78374566691811, -22.435006717319105], 'name': 'Macrorregião II'}","{'latlong': [-43.93088259914695, -22.50640773396086], 'name': 'Metropolitana I'}",895
2016,"{'latlong': [-43.93088259914695, -22.50640773396086], 'name': 'Metropolitana I'}","{'latlong': [-42.78374566691811, -22.435006717319105], 'name': 'Macrorregião II'}",195
2016,"{'latlong': [-43.93088259914695, -22.50640773396086], 'name': 'Metropolitana I'}","{'latlong': [-43.93088259914695, -22.50640773396086], 'name': 'Metropolitana I'}",4373
2017,"{'latlong': [-41.74084505657541, -21.799306433880908], 'name': 'Macrorregião III'}","{'latlong': [-41.74084505657541, -21.799306433880908], 'name': 'Macrorregião III'}",3293
2017,"{'latlong': [-41.74084505657541, -21.799306433880908], 'name': 'Macrorregião III'}","{'latlong': [-42.78374566691811, -22.435006717319105], 'name': 'Macrorregião II'}",349
2017,"{'latlong': [-41.74084505657541, -21.799306433880908], 'name': 'Macrorregião III'}","{'latlong': [-43.93088259914695, -22.50640773396086], 'name': 'Metropolitana I'}",3
2017,"{'latlong': [-42.78374566691811, -22.435006717319105], 'name': 'Macrorregião II'}","{'latlong': [-41.74084505657541, -21.799306433880908], 'name': 'Macrorregião III'}",9
2017,"{'latlong': [-42.78374566691811, -22.435006717319105], 'name': 'Macrorregião II'}","{'latlong': [-42.78374566691811, -22.435006717319105], 'name': 'Macrorregião II'}",27548
2017,"{'latlong': [-42.78374566691811, -22.435006717319105], 'name': 'Macrorregião II'}","{'latlong': [-43.93088259914695, -22.50640773396086], 'name': 'Metropolitana I'}",1067
2017,"{'latlong': [-43.93088259914695, -22.50640773396086], 'name': 'Metropolitana I'}","{'latlong': [-42.78374566691811, -22.435006717319105], 'name': 'Macrorregião II'}",192
2017,"{'latlong': [-43.93088259914695, -22.50640773396086], 'name': 'Metropolitana I'}","{'latlong': [-43.93088259914695, -22.50640773396086], 'name': 'Metropolitana I'}",3987
2018,"{'latlong': [-41.74084505657541, -21.799306433880908], 'name': 'Macrorregião III'}","{'latlong': [-41.74084505657541, -21.799306433880908], 'name': 'Macrorregião III'}",2083
2018,"{'latlong': [-41.74084505657541, -21.799306433880908], 'name': 'Macrorregião III'}","{'latlong': [-42.78374566691811, -22.435006717319105], 'name': 'Macrorregião II'}",163
2018,"{'latlong': [-42.78374566691811, -22.435006717319105], 'name': 'Macrorregião II'}","{'latlong': [-41.74084505657541, -21.799306433880908], 'name': 'Macrorregião III'}",13
2018,"{'latlong': [-42.78374566691811, -22.435006717319105], 'name': 'Macrorregião II'}","{'latlong': [-42.78374566691811, -22.435006717319105], 'name': 'Macrorregião II'}",23399
2018,"{'latlong': [-42.78374566691811, -22.435006717319105], 'name': 'Macrorregião II'}","{'latlong': [-43.93088259914695, -22.50640773396086], 'name': 'Metropolitana I'}",742
2018,"{'latlong': [-43.93088259914695, -22.50640773396086], 'name': 'Metropolitana I'}","{'latlong': [-42.78374566691811, -22.435006717319105], 'name': 'Macrorregião II'}",149
2018,"{'latlong': [-43.93088259914695, -22.50640773396086], 'name': 'Metropolitana I'}","{'latlong': [-43.93088259914695, -22.50640773396086], 'name': 'Metropolitana I'}",3749
2019,"{'latlong': [-41.74084505657541, -21.799306433880908], 'name': 'Macrorregião III'}","{'latlong': [-41.74084505657541, -21.799306433880908], 'name': 'Macrorregião III'}",2159
2019,"{'latlong': [-41.74084505657541, -21.799306433880908], 'name': 'Macrorregião III'}","{'latlong': [-42.78374566691811, -22.435006717319105], 'name': 'Macrorregião II'}",115
2019,"{'latlong': [-41.74084505657541, -21.799306433880908], 'name': 'Macrorregião III'}","{'latlong': [-43.93088259914695, -22.50640773396086], 'name': 'Metropolitana I'}",1
2019,"{'latlong': [-42.78374566691811, -22.435006717319105], 'name': 'Macrorregião II'}","{'latlong': [-41.74084505657541, -21.799306433880908], 'name': 'Macrorregião III'}",18
2019,"{'latlong': [-42.78374566691811, -22.435006717319105], 'name': 'Macrorregião II'}","{'latlong': [-42.78374566691811, -22.435006717319105], 'name': 'Macrorregião II'}",22210
2019,"{'latlong': [-42.78374566691811, -22.435006717319105], 'name': 'Macrorregião II'}","{'latlong': [-43.93088259914695, -22.50640773396086], 'name': 'Metropolitana I'}",530
2019,"{'latlong': [-43.93088259914695, -22.50640773396086], 'name': 'Metropolitana I'}","{'latlong': [-42.78374566691811, -22.435006717319105], 'name': 'Macrorregião II'}",81
2019,"{'latlong': [-43.93088259914695, -22.50640773396086], 'name': 'Metropolitana I'}","{'latlong': [-43.93088259914695, -22.50640773396086], 'name': 'Metropolitana I'}",3774
2020,"{'latlong': [-41.74084505657541, -21.799306433880908], 'name': 'Macrorregião III'}","{'latlong': [-41.74084505657541, -21.799306433880908], 'name': 'Macrorregião III'}",747
2020,"{'latlong': [-41.74084505657541, -21.799306433880908], 'name': 'Macrorregião III'}","{'latlong': [-42.78374566691811, -22.435006717319105], 'name': 'Macrorregião II'}",49
2020,"{'latlong': [-41.74084505657541, -21.799306433880908], 'name': 'Macrorregião III'}","{'latlong': [-43.93088259914695, -22.50640773396086], 'name': 'Metropolitana I'}",1
2020,"{'latlong': [-42.78374566691811, -22.435006717319105], 'name': 'Macrorregião II'}","{'latlong': [-41.74084505657541, -21.799306433880908], 'name': 'Macrorregião III'}",9
2020,"{'latlong': [-42.78374566691811, -22.435006717319105], 'name': 'Macrorregião II'}","{'latlong': [-42.78374566691811, -22.435006717319105], 'name': 'Macrorregião II'}",7115
2020,"{'latlong': [-42.78374566691811, -22.435006717319105], 'name': 'Macrorregião II'}","{'latlong': [-43.93088259914695, -22.50640773396086], 'name': 'Metropolitana I'}",100
2020,"{'latlong': [-43.93088259914695, -22.50640773396086], 'name': 'Metropolitana I'}","{'latlong': [-42.78374566691811, -22.435006717319105], 'name': 'Macrorregião II'}",40
2020,"{'latlong': [-43.93088259914695, -22.50640773396086], 'name': 'Metropolitana I'}","{'latlong': [-43.93088259914695, -22.50640773396086], 'name': 'Metropolitana I'}",1263
