year,from,to,hospitalizations
1998,"{'latlong': [-57.78301983402671, -3.878545376148957], 'name': 'Baixo Amazonas'}","{'latlong': [-57.78301983402671, -3.878545376148957], 'name': 'Baixo Amazonas'}",515
1998,"{'latlong': [-57.78301983402671, -3.878545376148957], 'name': 'Baixo Amazonas'}","{'latlong': [-60.54555982763556, -6.682636373094532], 'name': 'Rio Madeira'}",1
1998,"{'latlong': [-57.78301983402671, -3.878545376148957], 'name': 'Baixo Amazonas'}","{'latlong': [-64.47009165648124, -0.6042378800253123], 'name': 'Entorno Manaus'}",2
1998,"{'latlong': [-57.78301983402671, -3.878545376148957], 'name': 'Baixo Amazonas'}","{'latlong': [-69.20896075625913, -6.4872294543537015], 'name': 'Regional Juruá'}",1
1998,"{'latlong': [-58.80732579359148, -1.7695729901247828], 'name': 'Médio Amazonas'}","{'latlong': [-58.80732579359148, -1.7695729901247828], 'name': 'Médio Amazonas'}",280
1998,"{'latlong': [-58.80732579359148, -1.7695729901247828], 'name': 'Médio Amazonas'}","{'latlong': [-64.47009165648124, -0.6042378800253123], 'name': 'Entorno Manaus'}",5
1998,"{'latlong': [-60.54555982763556, -6.682636373094532], 'name': 'Rio Madeira'}","{'latlong': [-60.54555982763556, -6.682636373094532], 'name': 'Rio Madeira'}",512
1998,"{'latlong': [-60.54555982763556, -6.682636373094532], 'name': 'Rio Madeira'}","{'latlong': [-64.47009165648124, -0.6042378800253123], 'name': 'Entorno Manaus'}",1
1998,"{'latlong': [-62.7508323901846, -3.587400581314067], 'name': 'Rio Negro e Solimões'}","{'latlong': [-58.80732579359148, -1.7695729901247828], 'name': 'Médio Amazonas'}",1
1998,"{'latlong': [-62.7508323901846, -3.587400581314067], 'name': 'Rio Negro e Solimões'}","{'latlong': [-60.54555982763556, -6.682636373094532], 'name': 'Rio Madeira'}",1
1998,"{'latlong': [-62.7508323901846, -3.587400581314067], 'name': 'Rio Negro e Solimões'}","{'latlong': [-62.7508323901846, -3.587400581314067], 'name': 'Rio Negro e Solimões'}",429
1998,"{'latlong': [-62.7508323901846, -3.587400581314067], 'name': 'Rio Negro e Solimões'}","{'latlong': [-64.47009165648124, -0.6042378800253123], 'name': 'Entorno Manaus'}",9
1998,"{'latlong': [-64.47009165648124, -0.6042378800253123], 'name': 'Entorno Manaus'}","{'latlong': [-57.78301983402671, -3.878545376148957], 'name': 'Baixo Amazonas'}",1
1998,"{'latlong': [-64.47009165648124, -0.6042378800253123], 'name': 'Entorno Manaus'}","{'latlong': [-58.80732579359148, -1.7695729901247828], 'name': 'Médio Amazonas'}",1
1998,"{'latlong': [-64.47009165648124, -0.6042378800253123], 'name': 'Entorno Manaus'}","{'latlong': [-64.47009165648124, -0.6042378800253123], 'name': 'Entorno Manaus'}",3010
1998,"{'latlong': [-65.88057334170182, -7.391761280156165], 'name': 'Regional Purus'}","{'latlong': [-65.88057334170182, -7.391761280156165], 'name': 'Regional Purus'}",378
1998,"{'latlong': [-65.88057334170182, -7.391761280156165], 'name': 'Regional Purus'}","{'latlong': [-69.69865585473899, -4.759892906023188], 'name': 'Alto Solimões'}",18
1998,"{'latlong': [-66.74397610654549, -2.7624940948828614], 'name': 'Triângulo'}","{'latlong': [-64.47009165648124, -0.6042378800253123], 'name': 'Entorno Manaus'}",1
1998,"{'latlong': [-66.74397610654549, -2.7624940948828614], 'name': 'Triângulo'}","{'latlong': [-66.74397610654549, -2.7624940948828614], 'name': 'Triângulo'}",164
1998,"{'latlong': [-69.20896075625913, -6.4872294543537015], 'name': 'Regional Juruá'}","{'latlong': [-64.47009165648124, -0.6042378800253123], 'name': 'Entorno Manaus'}",1
1998,"{'latlong': [-69.20896075625913, -6.4872294543537015], 'name': 'Regional Juruá'}","{'latlong': [-69.20896075625913, -6.4872294543537015], 'name': 'Regional Juruá'}",280
1998,"{'latlong': [-69.20896075625913, -6.4872294543537015], 'name': 'Regional Juruá'}","{'latlong': [-69.69865585473899, -4.759892906023188], 'name': 'Alto Solimões'}",1
1998,"{'latlong': [-69.69865585473899, -4.759892906023188], 'name': 'Alto Solimões'}","{'latlong': [-64.47009165648124, -0.6042378800253123], 'name': 'Entorno Manaus'}",3
1998,"{'latlong': [-69.69865585473899, -4.759892906023188], 'name': 'Alto Solimões'}","{'latlong': [-69.69865585473899, -4.759892906023188], 'name': 'Alto Solimões'}",342
1999,"{'latlong': [-57.78301983402671, -3.878545376148957], 'name': 'Baixo Amazonas'}","{'latlong': [-57.78301983402671, -3.878545376148957], 'name': 'Baixo Amazonas'}",474
1999,"{'latlong': [-57.78301983402671, -3.878545376148957], 'name': 'Baixo Amazonas'}","{'latlong': [-60.54555982763556, -6.682636373094532], 'name': 'Rio Madeira'}",1
1999,"{'latlong': [-57.78301983402671, -3.878545376148957], 'name': 'Baixo Amazonas'}","{'latlong': [-69.69865585473899, -4.759892906023188], 'name': 'Alto Solimões'}",1
1999,"{'latlong': [-58.80732579359148, -1.7695729901247828], 'name': 'Médio Amazonas'}","{'latlong': [-58.80732579359148, -1.7695729901247828], 'name': 'Médio Amazonas'}",252
1999,"{'latlong': [-58.80732579359148, -1.7695729901247828], 'name': 'Médio Amazonas'}","{'latlong': [-64.47009165648124, -0.6042378800253123], 'name': 'Entorno Manaus'}",5
1999,"{'latlong': [-60.54555982763556, -6.682636373094532], 'name': 'Rio Madeira'}","{'latlong': [-60.54555982763556, -6.682636373094532], 'name': 'Rio Madeira'}",365
1999,"{'latlong': [-62.7508323901846, -3.587400581314067], 'name': 'Rio Negro e Solimões'}","{'latlong': [-62.7508323901846, -3.587400581314067], 'name': 'Rio Negro e Solimões'}",448
1999,"{'latlong': [-62.7508323901846, -3.587400581314067], 'name': 'Rio Negro e Solimões'}","{'latlong': [-64.47009165648124, -0.6042378800253123], 'name': 'Entorno Manaus'}",27
1999,"{'latlong': [-62.7508323901846, -3.587400581314067], 'name': 'Rio Negro e Solimões'}","{'latlong': [-65.88057334170182, -7.391761280156165], 'name': 'Regional Purus'}",2
1999,"{'latlong': [-64.47009165648124, -0.6042378800253123], 'name': 'Entorno Manaus'}","{'latlong': [-64.47009165648124, -0.6042378800253123], 'name': 'Entorno Manaus'}",3528
1999,"{'latlong': [-65.88057334170182, -7.391761280156165], 'name': 'Regional Purus'}","{'latlong': [-60.54555982763556, -6.682636373094532], 'name': 'Rio Madeira'}",1
1999,"{'latlong': [-65.88057334170182, -7.391761280156165], 'name': 'Regional Purus'}","{'latlong': [-62.7508323901846, -3.587400581314067], 'name': 'Rio Negro e Solimões'}",1
1999,"{'latlong': [-65.88057334170182, -7.391761280156165], 'name': 'Regional Purus'}","{'latlong': [-65.88057334170182, -7.391761280156165], 'name': 'Regional Purus'}",326
1999,"{'latlong': [-65.88057334170182, -7.391761280156165], 'name': 'Regional Purus'}","{'latlong': [-69.69865585473899, -4.759892906023188], 'name': 'Alto Solimões'}",43
1999,"{'latlong': [-66.74397610654549, -2.7624940948828614], 'name': 'Triângulo'}","{'latlong': [-62.7508323901846, -3.587400581314067], 'name': 'Rio Negro e Solimões'}",7
1999,"{'latlong': [-66.74397610654549, -2.7624940948828614], 'name': 'Triângulo'}","{'latlong': [-64.47009165648124, -0.6042378800253123], 'name': 'Entorno Manaus'}",3
1999,"{'latlong': [-66.74397610654549, -2.7624940948828614], 'name': 'Triângulo'}","{'latlong': [-66.74397610654549, -2.7624940948828614], 'name': 'Triângulo'}",182
1999,"{'latlong': [-69.20896075625913, -6.4872294543537015], 'name': 'Regional Juruá'}","{'latlong': [-69.20896075625913, -6.4872294543537015], 'name': 'Regional Juruá'}",178
1999,"{'latlong': [-69.69865585473899, -4.759892906023188], 'name': 'Alto Solimões'}","{'latlong': [-64.47009165648124, -0.6042378800253123], 'name': 'Entorno Manaus'}",2
1999,"{'latlong': [-69.69865585473899, -4.759892906023188], 'name': 'Alto Solimões'}","{'latlong': [-69.69865585473899, -4.759892906023188], 'name': 'Alto Solimões'}",313
2000,"{'latlong': [-57.78301983402671, -3.878545376148957], 'name': 'Baixo Amazonas'}","{'latlong': [-57.78301983402671, -3.878545376148957], 'name': 'Baixo Amazonas'}",343
2000,"{'latlong': [-57.78301983402671, -3.878545376148957], 'name': 'Baixo Amazonas'}","{'latlong': [-64.47009165648124, -0.6042378800253123], 'name': 'Entorno Manaus'}",10
2000,"{'latlong': [-57.78301983402671, -3.878545376148957], 'name': 'Baixo Amazonas'}","{'latlong': [-69.69865585473899, -4.759892906023188], 'name': 'Alto Solimões'}",2
2000,"{'latlong': [-58.80732579359148, -1.7695729901247828], 'name': 'Médio Amazonas'}","{'latlong': [-58.80732579359148, -1.7695729901247828], 'name': 'Médio Amazonas'}",152
2000,"{'latlong': [-58.80732579359148, -1.7695729901247828], 'name': 'Médio Amazonas'}","{'latlong': [-64.47009165648124, -0.6042378800253123], 'name': 'Entorno Manaus'}",21
2000,"{'latlong': [-60.54555982763556, -6.682636373094532], 'name': 'Rio Madeira'}","{'latlong': [-60.54555982763556, -6.682636373094532], 'name': 'Rio Madeira'}",288
2000,"{'latlong': [-60.54555982763556, -6.682636373094532], 'name': 'Rio Madeira'}","{'latlong': [-64.47009165648124, -0.6042378800253123], 'name': 'Entorno Manaus'}",11
2000,"{'latlong': [-62.7508323901846, -3.587400581314067], 'name': 'Rio Negro e Solimões'}","{'latlong': [-62.7508323901846, -3.587400581314067], 'name': 'Rio Negro e Solimões'}",326
2000,"{'latlong': [-62.7508323901846, -3.587400581314067], 'name': 'Rio Negro e Solimões'}","{'latlong': [-64.47009165648124, -0.6042378800253123], 'name': 'Entorno Manaus'}",67
2000,"{'latlong': [-64.47009165648124, -0.6042378800253123], 'name': 'Entorno Manaus'}","{'latlong': [-62.7508323901846, -3.587400581314067], 'name': 'Rio Negro e Solimões'}",2
2000,"{'latlong': [-64.47009165648124, -0.6042378800253123], 'name': 'Entorno Manaus'}","{'latlong': [-64.47009165648124, -0.6042378800253123], 'name': 'Entorno Manaus'}",4489
2000,"{'latlong': [-65.88057334170182, -7.391761280156165], 'name': 'Regional Purus'}","{'latlong': [-64.47009165648124, -0.6042378800253123], 'name': 'Entorno Manaus'}",14
2000,"{'latlong': [-65.88057334170182, -7.391761280156165], 'name': 'Regional Purus'}","{'latlong': [-65.88057334170182, -7.391761280156165], 'name': 'Regional Purus'}",259
2000,"{'latlong': [-65.88057334170182, -7.391761280156165], 'name': 'Regional Purus'}","{'latlong': [-69.69865585473899, -4.759892906023188], 'name': 'Alto Solimões'}",35
2000,"{'latlong': [-66.74397610654549, -2.7624940948828614], 'name': 'Triângulo'}","{'latlong': [-62.7508323901846, -3.587400581314067], 'name': 'Rio Negro e Solimões'}",7
2000,"{'latlong': [-66.74397610654549, -2.7624940948828614], 'name': 'Triângulo'}","{'latlong': [-64.47009165648124, -0.6042378800253123], 'name': 'Entorno Manaus'}",5
2000,"{'latlong': [-66.74397610654549, -2.7624940948828614], 'name': 'Triângulo'}","{'latlong': [-65.88057334170182, -7.391761280156165], 'name': 'Regional Purus'}",2
2000,"{'latlong': [-66.74397610654549, -2.7624940948828614], 'name': 'Triângulo'}","{'latlong': [-66.74397610654549, -2.7624940948828614], 'name': 'Triângulo'}",187
2000,"{'latlong': [-69.20896075625913, -6.4872294543537015], 'name': 'Regional Juruá'}","{'latlong': [-64.47009165648124, -0.6042378800253123], 'name': 'Entorno Manaus'}",5
2000,"{'latlong': [-69.20896075625913, -6.4872294543537015], 'name': 'Regional Juruá'}","{'latlong': [-69.20896075625913, -6.4872294543537015], 'name': 'Regional Juruá'}",132
2000,"{'latlong': [-69.69865585473899, -4.759892906023188], 'name': 'Alto Solimões'}","{'latlong': [-57.78301983402671, -3.878545376148957], 'name': 'Baixo Amazonas'}",1
2000,"{'latlong': [-69.69865585473899, -4.759892906023188], 'name': 'Alto Solimões'}","{'latlong': [-64.47009165648124, -0.6042378800253123], 'name': 'Entorno Manaus'}",18
2000,"{'latlong': [-69.69865585473899, -4.759892906023188], 'name': 'Alto Solimões'}","{'latlong': [-69.69865585473899, -4.759892906023188], 'name': 'Alto Solimões'}",374
2001,"{'latlong': [-57.78301983402671, -3.878545376148957], 'name': 'Baixo Amazonas'}","{'latlong': [-57.78301983402671, -3.878545376148957], 'name': 'Baixo Amazonas'}",319
2001,"{'latlong': [-57.78301983402671, -3.878545376148957], 'name': 'Baixo Amazonas'}","{'latlong': [-64.47009165648124, -0.6042378800253123], 'name': 'Entorno Manaus'}",3
2001,"{'latlong': [-58.80732579359148, -1.7695729901247828], 'name': 'Médio Amazonas'}","{'latlong': [-58.80732579359148, -1.7695729901247828], 'name': 'Médio Amazonas'}",137
2001,"{'latlong': [-58.80732579359148, -1.7695729901247828], 'name': 'Médio Amazonas'}","{'latlong': [-64.47009165648124, -0.6042378800253123], 'name': 'Entorno Manaus'}",7
2001,"{'latlong': [-58.80732579359148, -1.7695729901247828], 'name': 'Médio Amazonas'}","{'latlong': [-65.88057334170182, -7.391761280156165], 'name': 'Regional Purus'}",1
2001,"{'latlong': [-60.54555982763556, -6.682636373094532], 'name': 'Rio Madeira'}","{'latlong': [-60.54555982763556, -6.682636373094532], 'name': 'Rio Madeira'}",237
2001,"{'latlong': [-60.54555982763556, -6.682636373094532], 'name': 'Rio Madeira'}","{'latlong': [-64.47009165648124, -0.6042378800253123], 'name': 'Entorno Manaus'}",3
2001,"{'latlong': [-62.7508323901846, -3.587400581314067], 'name': 'Rio Negro e Solimões'}","{'latlong': [-62.7508323901846, -3.587400581314067], 'name': 'Rio Negro e Solimões'}",452
2001,"{'latlong': [-62.7508323901846, -3.587400581314067], 'name': 'Rio Negro e Solimões'}","{'latlong': [-64.47009165648124, -0.6042378800253123], 'name': 'Entorno Manaus'}",16
2001,"{'latlong': [-64.47009165648124, -0.6042378800253123], 'name': 'Entorno Manaus'}","{'latlong': [-64.47009165648124, -0.6042378800253123], 'name': 'Entorno Manaus'}",4410
2001,"{'latlong': [-65.88057334170182, -7.391761280156165], 'name': 'Regional Purus'}","{'latlong': [-65.88057334170182, -7.391761280156165], 'name': 'Regional Purus'}",280
2001,"{'latlong': [-66.74397610654549, -2.7624940948828614], 'name': 'Triângulo'}","{'latlong': [-62.7508323901846, -3.587400581314067], 'name': 'Rio Negro e Solimões'}",7
2001,"{'latlong': [-66.74397610654549, -2.7624940948828614], 'name': 'Triângulo'}","{'latlong': [-64.47009165648124, -0.6042378800253123], 'name': 'Entorno Manaus'}",3
2001,"{'latlong': [-66.74397610654549, -2.7624940948828614], 'name': 'Triângulo'}","{'latlong': [-66.74397610654549, -2.7624940948828614], 'name': 'Triângulo'}",148
2001,"{'latlong': [-69.20896075625913, -6.4872294543537015], 'name': 'Regional Juruá'}","{'latlong': [-69.20896075625913, -6.4872294543537015], 'name': 'Regional Juruá'}",135
2001,"{'latlong': [-69.69865585473899, -4.759892906023188], 'name': 'Alto Solimões'}","{'latlong': [-64.47009165648124, -0.6042378800253123], 'name': 'Entorno Manaus'}",2
2001,"{'latlong': [-69.69865585473899, -4.759892906023188], 'name': 'Alto Solimões'}","{'latlong': [-69.69865585473899, -4.759892906023188], 'name': 'Alto Solimões'}",296
2002,"{'latlong': [-57.78301983402671, -3.878545376148957], 'name': 'Baixo Amazonas'}","{'latlong': [-57.78301983402671, -3.878545376148957], 'name': 'Baixo Amazonas'}",353
2002,"{'latlong': [-57.78301983402671, -3.878545376148957], 'name': 'Baixo Amazonas'}","{'latlong': [-64.47009165648124, -0.6042378800253123], 'name': 'Entorno Manaus'}",9
2002,"{'latlong': [-58.80732579359148, -1.7695729901247828], 'name': 'Médio Amazonas'}","{'latlong': [-58.80732579359148, -1.7695729901247828], 'name': 'Médio Amazonas'}",195
2002,"{'latlong': [-58.80732579359148, -1.7695729901247828], 'name': 'Médio Amazonas'}","{'latlong': [-64.47009165648124, -0.6042378800253123], 'name': 'Entorno Manaus'}",17
2002,"{'latlong': [-60.54555982763556, -6.682636373094532], 'name': 'Rio Madeira'}","{'latlong': [-60.54555982763556, -6.682636373094532], 'name': 'Rio Madeira'}",274
2002,"{'latlong': [-60.54555982763556, -6.682636373094532], 'name': 'Rio Madeira'}","{'latlong': [-64.47009165648124, -0.6042378800253123], 'name': 'Entorno Manaus'}",1
2002,"{'latlong': [-62.7508323901846, -3.587400581314067], 'name': 'Rio Negro e Solimões'}","{'latlong': [-60.54555982763556, -6.682636373094532], 'name': 'Rio Madeira'}",1
2002,"{'latlong': [-62.7508323901846, -3.587400581314067], 'name': 'Rio Negro e Solimões'}","{'latlong': [-62.7508323901846, -3.587400581314067], 'name': 'Rio Negro e Solimões'}",438
2002,"{'latlong': [-62.7508323901846, -3.587400581314067], 'name': 'Rio Negro e Solimões'}","{'latlong': [-64.47009165648124, -0.6042378800253123], 'name': 'Entorno Manaus'}",26
2002,"{'latlong': [-62.7508323901846, -3.587400581314067], 'name': 'Rio Negro e Solimões'}","{'latlong': [-69.20896075625913, -6.4872294543537015], 'name': 'Regional Juruá'}",1
2002,"{'latlong': [-64.47009165648124, -0.6042378800253123], 'name': 'Entorno Manaus'}","{'latlong': [-64.47009165648124, -0.6042378800253123], 'name': 'Entorno Manaus'}",4749
2002,"{'latlong': [-65.88057334170182, -7.391761280156165], 'name': 'Regional Purus'}","{'latlong': [-65.88057334170182, -7.391761280156165], 'name': 'Regional Purus'}",321
2002,"{'latlong': [-66.74397610654549, -2.7624940948828614], 'name': 'Triângulo'}","{'latlong': [-62.7508323901846, -3.587400581314067], 'name': 'Rio Negro e Solimões'}",4
2002,"{'latlong': [-66.74397610654549, -2.7624940948828614], 'name': 'Triângulo'}","{'latlong': [-64.47009165648124, -0.6042378800253123], 'name': 'Entorno Manaus'}",4
2002,"{'latlong': [-66.74397610654549, -2.7624940948828614], 'name': 'Triângulo'}","{'latlong': [-66.74397610654549, -2.7624940948828614], 'name': 'Triângulo'}",215
2002,"{'latlong': [-69.20896075625913, -6.4872294543537015], 'name': 'Regional Juruá'}","{'latlong': [-58.80732579359148, -1.7695729901247828], 'name': 'Médio Amazonas'}",1
2002,"{'latlong': [-69.20896075625913, -6.4872294543537015], 'name': 'Regional Juruá'}","{'latlong': [-64.47009165648124, -0.6042378800253123], 'name': 'Entorno Manaus'}",3
2002,"{'latlong': [-69.20896075625913, -6.4872294543537015], 'name': 'Regional Juruá'}","{'latlong': [-69.20896075625913, -6.4872294543537015], 'name': 'Regional Juruá'}",241
2002,"{'latlong': [-69.69865585473899, -4.759892906023188], 'name': 'Alto Solimões'}","{'latlong': [-62.7508323901846, -3.587400581314067], 'name': 'Rio Negro e Solimões'}",1
2002,"{'latlong': [-69.69865585473899, -4.759892906023188], 'name': 'Alto Solimões'}","{'latlong': [-64.47009165648124, -0.6042378800253123], 'name': 'Entorno Manaus'}",6
2002,"{'latlong': [-69.69865585473899, -4.759892906023188], 'name': 'Alto Solimões'}","{'latlong': [-69.69865585473899, -4.759892906023188], 'name': 'Alto Solimões'}",422
2003,"{'latlong': [-57.78301983402671, -3.878545376148957], 'name': 'Baixo Amazonas'}","{'latlong': [-57.78301983402671, -3.878545376148957], 'name': 'Baixo Amazonas'}",398
2003,"{'latlong': [-57.78301983402671, -3.878545376148957], 'name': 'Baixo Amazonas'}","{'latlong': [-64.47009165648124, -0.6042378800253123], 'name': 'Entorno Manaus'}",7
2003,"{'latlong': [-58.80732579359148, -1.7695729901247828], 'name': 'Médio Amazonas'}","{'latlong': [-58.80732579359148, -1.7695729901247828], 'name': 'Médio Amazonas'}",145
2003,"{'latlong': [-58.80732579359148, -1.7695729901247828], 'name': 'Médio Amazonas'}","{'latlong': [-64.47009165648124, -0.6042378800253123], 'name': 'Entorno Manaus'}",11
2003,"{'latlong': [-60.54555982763556, -6.682636373094532], 'name': 'Rio Madeira'}","{'latlong': [-60.54555982763556, -6.682636373094532], 'name': 'Rio Madeira'}",373
2003,"{'latlong': [-60.54555982763556, -6.682636373094532], 'name': 'Rio Madeira'}","{'latlong': [-64.47009165648124, -0.6042378800253123], 'name': 'Entorno Manaus'}",6
2003,"{'latlong': [-62.7508323901846, -3.587400581314067], 'name': 'Rio Negro e Solimões'}","{'latlong': [-62.7508323901846, -3.587400581314067], 'name': 'Rio Negro e Solimões'}",458
2003,"{'latlong': [-62.7508323901846, -3.587400581314067], 'name': 'Rio Negro e Solimões'}","{'latlong': [-64.47009165648124, -0.6042378800253123], 'name': 'Entorno Manaus'}",34
2003,"{'latlong': [-62.7508323901846, -3.587400581314067], 'name': 'Rio Negro e Solimões'}","{'latlong': [-66.74397610654549, -2.7624940948828614], 'name': 'Triângulo'}",1
2003,"{'latlong': [-64.47009165648124, -0.6042378800253123], 'name': 'Entorno Manaus'}","{'latlong': [-64.47009165648124, -0.6042378800253123], 'name': 'Entorno Manaus'}",5635
2003,"{'latlong': [-65.88057334170182, -7.391761280156165], 'name': 'Regional Purus'}","{'latlong': [-64.47009165648124, -0.6042378800253123], 'name': 'Entorno Manaus'}",1
2003,"{'latlong': [-65.88057334170182, -7.391761280156165], 'name': 'Regional Purus'}","{'latlong': [-65.88057334170182, -7.391761280156165], 'name': 'Regional Purus'}",441
2003,"{'latlong': [-66.74397610654549, -2.7624940948828614], 'name': 'Triângulo'}","{'latlong': [-64.47009165648124, -0.6042378800253123], 'name': 'Entorno Manaus'}",4
2003,"{'latlong': [-66.74397610654549, -2.7624940948828614], 'name': 'Triângulo'}","{'latlong': [-66.74397610654549, -2.7624940948828614], 'name': 'Triângulo'}",267
2003,"{'latlong': [-69.20896075625913, -6.4872294543537015], 'name': 'Regional Juruá'}","{'latlong': [-64.47009165648124, -0.6042378800253123], 'name': 'Entorno Manaus'}",4
2003,"{'latlong': [-69.20896075625913, -6.4872294543537015], 'name': 'Regional Juruá'}","{'latlong': [-69.20896075625913, -6.4872294543537015], 'name': 'Regional Juruá'}",249
2003,"{'latlong': [-69.69865585473899, -4.759892906023188], 'name': 'Alto Solimões'}","{'latlong': [-64.47009165648124, -0.6042378800253123], 'name': 'Entorno Manaus'}",3
2003,"{'latlong': [-69.69865585473899, -4.759892906023188], 'name': 'Alto Solimões'}","{'latlong': [-69.69865585473899, -4.759892906023188], 'name': 'Alto Solimões'}",370
2004,"{'latlong': [-57.78301983402671, -3.878545376148957], 'name': 'Baixo Amazonas'}","{'latlong': [-57.78301983402671, -3.878545376148957], 'name': 'Baixo Amazonas'}",512
2004,"{'latlong': [-57.78301983402671, -3.878545376148957], 'name': 'Baixo Amazonas'}","{'latlong': [-64.47009165648124, -0.6042378800253123], 'name': 'Entorno Manaus'}",3
2004,"{'latlong': [-58.80732579359148, -1.7695729901247828], 'name': 'Médio Amazonas'}","{'latlong': [-58.80732579359148, -1.7695729901247828], 'name': 'Médio Amazonas'}",457
2004,"{'latlong': [-58.80732579359148, -1.7695729901247828], 'name': 'Médio Amazonas'}","{'latlong': [-64.47009165648124, -0.6042378800253123], 'name': 'Entorno Manaus'}",8
2004,"{'latlong': [-60.54555982763556, -6.682636373094532], 'name': 'Rio Madeira'}","{'latlong': [-60.54555982763556, -6.682636373094532], 'name': 'Rio Madeira'}",414
2004,"{'latlong': [-60.54555982763556, -6.682636373094532], 'name': 'Rio Madeira'}","{'latlong': [-64.47009165648124, -0.6042378800253123], 'name': 'Entorno Manaus'}",1
2004,"{'latlong': [-62.7508323901846, -3.587400581314067], 'name': 'Rio Negro e Solimões'}","{'latlong': [-62.7508323901846, -3.587400581314067], 'name': 'Rio Negro e Solimões'}",627
2004,"{'latlong': [-62.7508323901846, -3.587400581314067], 'name': 'Rio Negro e Solimões'}","{'latlong': [-64.47009165648124, -0.6042378800253123], 'name': 'Entorno Manaus'}",35
2004,"{'latlong': [-64.47009165648124, -0.6042378800253123], 'name': 'Entorno Manaus'}","{'latlong': [-64.47009165648124, -0.6042378800253123], 'name': 'Entorno Manaus'}",5602
2004,"{'latlong': [-65.88057334170182, -7.391761280156165], 'name': 'Regional Purus'}","{'latlong': [-64.47009165648124, -0.6042378800253123], 'name': 'Entorno Manaus'}",1
2004,"{'latlong': [-65.88057334170182, -7.391761280156165], 'name': 'Regional Purus'}","{'latlong': [-65.88057334170182, -7.391761280156165], 'name': 'Regional Purus'}",390
2004,"{'latlong': [-66.74397610654549, -2.7624940948828614], 'name': 'Triângulo'}","{'latlong': [-64.47009165648124, -0.6042378800253123], 'name': 'Entorno Manaus'}",2
2004,"{'latlong': [-66.74397610654549, -2.7624940948828614], 'name': 'Triângulo'}","{'latlong': [-66.74397610654549, -2.7624940948828614], 'name': 'Triângulo'}",279
2004,"{'latlong': [-69.20896075625913, -6.4872294543537015], 'name': 'Regional Juruá'}","{'latlong': [-64.47009165648124, -0.6042378800253123], 'name': 'Entorno Manaus'}",5
2004,"{'latlong': [-69.20896075625913, -6.4872294543537015], 'name': 'Regional Juruá'}","{'latlong': [-69.20896075625913, -6.4872294543537015], 'name': 'Regional Juruá'}",284
2004,"{'latlong': [-69.69865585473899, -4.759892906023188], 'name': 'Alto Solimões'}","{'latlong': [-64.47009165648124, -0.6042378800253123], 'name': 'Entorno Manaus'}",5
2004,"{'latlong': [-69.69865585473899, -4.759892906023188], 'name': 'Alto Solimões'}","{'latlong': [-69.69865585473899, -4.759892906023188], 'name': 'Alto Solimões'}",363
2005,"{'latlong': [-57.78301983402671, -3.878545376148957], 'name': 'Baixo Amazonas'}","{'latlong': [-57.78301983402671, -3.878545376148957], 'name': 'Baixo Amazonas'}",845
2005,"{'latlong': [-57.78301983402671, -3.878545376148957], 'name': 'Baixo Amazonas'}","{'latlong': [-64.47009165648124, -0.6042378800253123], 'name': 'Entorno Manaus'}",5
2005,"{'latlong': [-58.80732579359148, -1.7695729901247828], 'name': 'Médio Amazonas'}","{'latlong': [-58.80732579359148, -1.7695729901247828], 'name': 'Médio Amazonas'}",530
2005,"{'latlong': [-58.80732579359148, -1.7695729901247828], 'name': 'Médio Amazonas'}","{'latlong': [-64.47009165648124, -0.6042378800253123], 'name': 'Entorno Manaus'}",6
2005,"{'latlong': [-60.54555982763556, -6.682636373094532], 'name': 'Rio Madeira'}","{'latlong': [-60.54555982763556, -6.682636373094532], 'name': 'Rio Madeira'}",296
2005,"{'latlong': [-60.54555982763556, -6.682636373094532], 'name': 'Rio Madeira'}","{'latlong': [-64.47009165648124, -0.6042378800253123], 'name': 'Entorno Manaus'}",11
2005,"{'latlong': [-62.7508323901846, -3.587400581314067], 'name': 'Rio Negro e Solimões'}","{'latlong': [-62.7508323901846, -3.587400581314067], 'name': 'Rio Negro e Solimões'}",621
2005,"{'latlong': [-62.7508323901846, -3.587400581314067], 'name': 'Rio Negro e Solimões'}","{'latlong': [-64.47009165648124, -0.6042378800253123], 'name': 'Entorno Manaus'}",14
2005,"{'latlong': [-64.47009165648124, -0.6042378800253123], 'name': 'Entorno Manaus'}","{'latlong': [-64.47009165648124, -0.6042378800253123], 'name': 'Entorno Manaus'}",5431
2005,"{'latlong': [-65.88057334170182, -7.391761280156165], 'name': 'Regional Purus'}","{'latlong': [-64.47009165648124, -0.6042378800253123], 'name': 'Entorno Manaus'}",1
2005,"{'latlong': [-65.88057334170182, -7.391761280156165], 'name': 'Regional Purus'}","{'latlong': [-65.88057334170182, -7.391761280156165], 'name': 'Regional Purus'}",476
2005,"{'latlong': [-66.74397610654549, -2.7624940948828614], 'name': 'Triângulo'}","{'latlong': [-64.47009165648124, -0.6042378800253123], 'name': 'Entorno Manaus'}",6
2005,"{'latlong': [-66.74397610654549, -2.7624940948828614], 'name': 'Triângulo'}","{'latlong': [-66.74397610654549, -2.7624940948828614], 'name': 'Triângulo'}",429
2005,"{'latlong': [-69.20896075625913, -6.4872294543537015], 'name': 'Regional Juruá'}","{'latlong': [-64.47009165648124, -0.6042378800253123], 'name': 'Entorno Manaus'}",3
2005,"{'latlong': [-69.20896075625913, -6.4872294543537015], 'name': 'Regional Juruá'}","{'latlong': [-69.20896075625913, -6.4872294543537015], 'name': 'Regional Juruá'}",351
2005,"{'latlong': [-69.69865585473899, -4.759892906023188], 'name': 'Alto Solimões'}","{'latlong': [-60.54555982763556, -6.682636373094532], 'name': 'Rio Madeira'}",1
2005,"{'latlong': [-69.69865585473899, -4.759892906023188], 'name': 'Alto Solimões'}","{'latlong': [-64.47009165648124, -0.6042378800253123], 'name': 'Entorno Manaus'}",1
2005,"{'latlong': [-69.69865585473899, -4.759892906023188], 'name': 'Alto Solimões'}","{'latlong': [-69.69865585473899, -4.759892906023188], 'name': 'Alto Solimões'}",422
2006,"{'latlong': [-57.78301983402671, -3.878545376148957], 'name': 'Baixo Amazonas'}","{'latlong': [-57.78301983402671, -3.878545376148957], 'name': 'Baixo Amazonas'}",956
2006,"{'latlong': [-57.78301983402671, -3.878545376148957], 'name': 'Baixo Amazonas'}","{'latlong': [-64.47009165648124, -0.6042378800253123], 'name': 'Entorno Manaus'}",7
2006,"{'latlong': [-58.80732579359148, -1.7695729901247828], 'name': 'Médio Amazonas'}","{'latlong': [-58.80732579359148, -1.7695729901247828], 'name': 'Médio Amazonas'}",590
2006,"{'latlong': [-58.80732579359148, -1.7695729901247828], 'name': 'Médio Amazonas'}","{'latlong': [-64.47009165648124, -0.6042378800253123], 'name': 'Entorno Manaus'}",11
2006,"{'latlong': [-60.54555982763556, -6.682636373094532], 'name': 'Rio Madeira'}","{'latlong': [-60.54555982763556, -6.682636373094532], 'name': 'Rio Madeira'}",368
2006,"{'latlong': [-60.54555982763556, -6.682636373094532], 'name': 'Rio Madeira'}","{'latlong': [-64.47009165648124, -0.6042378800253123], 'name': 'Entorno Manaus'}",21
2006,"{'latlong': [-62.7508323901846, -3.587400581314067], 'name': 'Rio Negro e Solimões'}","{'latlong': [-62.7508323901846, -3.587400581314067], 'name': 'Rio Negro e Solimões'}",1069
2006,"{'latlong': [-62.7508323901846, -3.587400581314067], 'name': 'Rio Negro e Solimões'}","{'latlong': [-64.47009165648124, -0.6042378800253123], 'name': 'Entorno Manaus'}",16
2006,"{'latlong': [-64.47009165648124, -0.6042378800253123], 'name': 'Entorno Manaus'}","{'latlong': [-62.7508323901846, -3.587400581314067], 'name': 'Rio Negro e Solimões'}",3
2006,"{'latlong': [-64.47009165648124, -0.6042378800253123], 'name': 'Entorno Manaus'}","{'latlong': [-64.47009165648124, -0.6042378800253123], 'name': 'Entorno Manaus'}",5452
2006,"{'latlong': [-65.88057334170182, -7.391761280156165], 'name': 'Regional Purus'}","{'latlong': [-65.88057334170182, -7.391761280156165], 'name': 'Regional Purus'}",480
2006,"{'latlong': [-66.74397610654549, -2.7624940948828614], 'name': 'Triângulo'}","{'latlong': [-64.47009165648124, -0.6042378800253123], 'name': 'Entorno Manaus'}",4
2006,"{'latlong': [-66.74397610654549, -2.7624940948828614], 'name': 'Triângulo'}","{'latlong': [-66.74397610654549, -2.7624940948828614], 'name': 'Triângulo'}",583
2006,"{'latlong': [-69.20896075625913, -6.4872294543537015], 'name': 'Regional Juruá'}","{'latlong': [-58.80732579359148, -1.7695729901247828], 'name': 'Médio Amazonas'}",1
2006,"{'latlong': [-69.20896075625913, -6.4872294543537015], 'name': 'Regional Juruá'}","{'latlong': [-64.47009165648124, -0.6042378800253123], 'name': 'Entorno Manaus'}",4
2006,"{'latlong': [-69.20896075625913, -6.4872294543537015], 'name': 'Regional Juruá'}","{'latlong': [-69.20896075625913, -6.4872294543537015], 'name': 'Regional Juruá'}",461
2006,"{'latlong': [-69.69865585473899, -4.759892906023188], 'name': 'Alto Solimões'}","{'latlong': [-64.47009165648124, -0.6042378800253123], 'name': 'Entorno Manaus'}",5
2006,"{'latlong': [-69.69865585473899, -4.759892906023188], 'name': 'Alto Solimões'}","{'latlong': [-66.74397610654549, -2.7624940948828614], 'name': 'Triângulo'}",1
2006,"{'latlong': [-69.69865585473899, -4.759892906023188], 'name': 'Alto Solimões'}","{'latlong': [-69.69865585473899, -4.759892906023188], 'name': 'Alto Solimões'}",558
2007,"{'latlong': [-57.78301983402671, -3.878545376148957], 'name': 'Baixo Amazonas'}","{'latlong': [-57.78301983402671, -3.878545376148957], 'name': 'Baixo Amazonas'}",789
2007,"{'latlong': [-57.78301983402671, -3.878545376148957], 'name': 'Baixo Amazonas'}","{'latlong': [-64.47009165648124, -0.6042378800253123], 'name': 'Entorno Manaus'}",3
2007,"{'latlong': [-58.80732579359148, -1.7695729901247828], 'name': 'Médio Amazonas'}","{'latlong': [-58.80732579359148, -1.7695729901247828], 'name': 'Médio Amazonas'}",807
2007,"{'latlong': [-58.80732579359148, -1.7695729901247828], 'name': 'Médio Amazonas'}","{'latlong': [-64.47009165648124, -0.6042378800253123], 'name': 'Entorno Manaus'}",7
2007,"{'latlong': [-60.54555982763556, -6.682636373094532], 'name': 'Rio Madeira'}","{'latlong': [-60.54555982763556, -6.682636373094532], 'name': 'Rio Madeira'}",370
2007,"{'latlong': [-60.54555982763556, -6.682636373094532], 'name': 'Rio Madeira'}","{'latlong': [-64.47009165648124, -0.6042378800253123], 'name': 'Entorno Manaus'}",16
2007,"{'latlong': [-62.7508323901846, -3.587400581314067], 'name': 'Rio Negro e Solimões'}","{'latlong': [-62.7508323901846, -3.587400581314067], 'name': 'Rio Negro e Solimões'}",1143
2007,"{'latlong': [-62.7508323901846, -3.587400581314067], 'name': 'Rio Negro e Solimões'}","{'latlong': [-64.47009165648124, -0.6042378800253123], 'name': 'Entorno Manaus'}",17
2007,"{'latlong': [-64.47009165648124, -0.6042378800253123], 'name': 'Entorno Manaus'}","{'latlong': [-62.7508323901846, -3.587400581314067], 'name': 'Rio Negro e Solimões'}",3
2007,"{'latlong': [-64.47009165648124, -0.6042378800253123], 'name': 'Entorno Manaus'}","{'latlong': [-64.47009165648124, -0.6042378800253123], 'name': 'Entorno Manaus'}",5639
2007,"{'latlong': [-65.88057334170182, -7.391761280156165], 'name': 'Regional Purus'}","{'latlong': [-64.47009165648124, -0.6042378800253123], 'name': 'Entorno Manaus'}",2
2007,"{'latlong': [-65.88057334170182, -7.391761280156165], 'name': 'Regional Purus'}","{'latlong': [-65.88057334170182, -7.391761280156165], 'name': 'Regional Purus'}",515
2007,"{'latlong': [-66.74397610654549, -2.7624940948828614], 'name': 'Triângulo'}","{'latlong': [-58.80732579359148, -1.7695729901247828], 'name': 'Médio Amazonas'}",1
2007,"{'latlong': [-66.74397610654549, -2.7624940948828614], 'name': 'Triângulo'}","{'latlong': [-64.47009165648124, -0.6042378800253123], 'name': 'Entorno Manaus'}",2
2007,"{'latlong': [-66.74397610654549, -2.7624940948828614], 'name': 'Triângulo'}","{'latlong': [-66.74397610654549, -2.7624940948828614], 'name': 'Triângulo'}",573
2007,"{'latlong': [-69.20896075625913, -6.4872294543537015], 'name': 'Regional Juruá'}","{'latlong': [-64.47009165648124, -0.6042378800253123], 'name': 'Entorno Manaus'}",2
2007,"{'latlong': [-69.20896075625913, -6.4872294543537015], 'name': 'Regional Juruá'}","{'latlong': [-69.20896075625913, -6.4872294543537015], 'name': 'Regional Juruá'}",475
2007,"{'latlong': [-69.69865585473899, -4.759892906023188], 'name': 'Alto Solimões'}","{'latlong': [-64.47009165648124, -0.6042378800253123], 'name': 'Entorno Manaus'}",3
2007,"{'latlong': [-69.69865585473899, -4.759892906023188], 'name': 'Alto Solimões'}","{'latlong': [-66.74397610654549, -2.7624940948828614], 'name': 'Triângulo'}",2
2007,"{'latlong': [-69.69865585473899, -4.759892906023188], 'name': 'Alto Solimões'}","{'latlong': [-69.69865585473899, -4.759892906023188], 'name': 'Alto Solimões'}",602
2008,"{'latlong': [-57.78301983402671, -3.878545376148957], 'name': 'Baixo Amazonas'}","{'latlong': [-57.78301983402671, -3.878545376148957], 'name': 'Baixo Amazonas'}",832
2008,"{'latlong': [-57.78301983402671, -3.878545376148957], 'name': 'Baixo Amazonas'}","{'latlong': [-64.47009165648124, -0.6042378800253123], 'name': 'Entorno Manaus'}",14
2008,"{'latlong': [-58.80732579359148, -1.7695729901247828], 'name': 'Médio Amazonas'}","{'latlong': [-58.80732579359148, -1.7695729901247828], 'name': 'Médio Amazonas'}",874
2008,"{'latlong': [-58.80732579359148, -1.7695729901247828], 'name': 'Médio Amazonas'}","{'latlong': [-64.47009165648124, -0.6042378800253123], 'name': 'Entorno Manaus'}",18
2008,"{'latlong': [-60.54555982763556, -6.682636373094532], 'name': 'Rio Madeira'}","{'latlong': [-60.54555982763556, -6.682636373094532], 'name': 'Rio Madeira'}",514
2008,"{'latlong': [-60.54555982763556, -6.682636373094532], 'name': 'Rio Madeira'}","{'latlong': [-64.47009165648124, -0.6042378800253123], 'name': 'Entorno Manaus'}",44
2008,"{'latlong': [-62.7508323901846, -3.587400581314067], 'name': 'Rio Negro e Solimões'}","{'latlong': [-62.7508323901846, -3.587400581314067], 'name': 'Rio Negro e Solimões'}",935
2008,"{'latlong': [-62.7508323901846, -3.587400581314067], 'name': 'Rio Negro e Solimões'}","{'latlong': [-64.47009165648124, -0.6042378800253123], 'name': 'Entorno Manaus'}",36
2008,"{'latlong': [-64.47009165648124, -0.6042378800253123], 'name': 'Entorno Manaus'}","{'latlong': [-62.7508323901846, -3.587400581314067], 'name': 'Rio Negro e Solimões'}",1
2008,"{'latlong': [-64.47009165648124, -0.6042378800253123], 'name': 'Entorno Manaus'}","{'latlong': [-64.47009165648124, -0.6042378800253123], 'name': 'Entorno Manaus'}",5752
2008,"{'latlong': [-65.88057334170182, -7.391761280156165], 'name': 'Regional Purus'}","{'latlong': [-64.47009165648124, -0.6042378800253123], 'name': 'Entorno Manaus'}",9
2008,"{'latlong': [-65.88057334170182, -7.391761280156165], 'name': 'Regional Purus'}","{'latlong': [-65.88057334170182, -7.391761280156165], 'name': 'Regional Purus'}",630
2008,"{'latlong': [-66.74397610654549, -2.7624940948828614], 'name': 'Triângulo'}","{'latlong': [-64.47009165648124, -0.6042378800253123], 'name': 'Entorno Manaus'}",1
2008,"{'latlong': [-66.74397610654549, -2.7624940948828614], 'name': 'Triângulo'}","{'latlong': [-66.74397610654549, -2.7624940948828614], 'name': 'Triângulo'}",677
2008,"{'latlong': [-69.20896075625913, -6.4872294543537015], 'name': 'Regional Juruá'}","{'latlong': [-64.47009165648124, -0.6042378800253123], 'name': 'Entorno Manaus'}",1
2008,"{'latlong': [-69.20896075625913, -6.4872294543537015], 'name': 'Regional Juruá'}","{'latlong': [-69.20896075625913, -6.4872294543537015], 'name': 'Regional Juruá'}",629
2008,"{'latlong': [-69.69865585473899, -4.759892906023188], 'name': 'Alto Solimões'}","{'latlong': [-64.47009165648124, -0.6042378800253123], 'name': 'Entorno Manaus'}",15
2008,"{'latlong': [-69.69865585473899, -4.759892906023188], 'name': 'Alto Solimões'}","{'latlong': [-66.74397610654549, -2.7624940948828614], 'name': 'Triângulo'}",1
2008,"{'latlong': [-69.69865585473899, -4.759892906023188], 'name': 'Alto Solimões'}","{'latlong': [-69.69865585473899, -4.759892906023188], 'name': 'Alto Solimões'}",334
2009,"{'latlong': [-57.78301983402671, -3.878545376148957], 'name': 'Baixo Amazonas'}","{'latlong': [-57.78301983402671, -3.878545376148957], 'name': 'Baixo Amazonas'}",763
2009,"{'latlong': [-57.78301983402671, -3.878545376148957], 'name': 'Baixo Amazonas'}","{'latlong': [-60.54555982763556, -6.682636373094532], 'name': 'Rio Madeira'}",2
2009,"{'latlong': [-57.78301983402671, -3.878545376148957], 'name': 'Baixo Amazonas'}","{'latlong': [-64.47009165648124, -0.6042378800253123], 'name': 'Entorno Manaus'}",29
2009,"{'latlong': [-58.80732579359148, -1.7695729901247828], 'name': 'Médio Amazonas'}","{'latlong': [-58.80732579359148, -1.7695729901247828], 'name': 'Médio Amazonas'}",877
2009,"{'latlong': [-58.80732579359148, -1.7695729901247828], 'name': 'Médio Amazonas'}","{'latlong': [-64.47009165648124, -0.6042378800253123], 'name': 'Entorno Manaus'}",14
2009,"{'latlong': [-58.80732579359148, -1.7695729901247828], 'name': 'Médio Amazonas'}","{'latlong': [-69.20896075625913, -6.4872294543537015], 'name': 'Regional Juruá'}",1
2009,"{'latlong': [-60.54555982763556, -6.682636373094532], 'name': 'Rio Madeira'}","{'latlong': [-60.54555982763556, -6.682636373094532], 'name': 'Rio Madeira'}",472
2009,"{'latlong': [-60.54555982763556, -6.682636373094532], 'name': 'Rio Madeira'}","{'latlong': [-64.47009165648124, -0.6042378800253123], 'name': 'Entorno Manaus'}",30
2009,"{'latlong': [-62.7508323901846, -3.587400581314067], 'name': 'Rio Negro e Solimões'}","{'latlong': [-62.7508323901846, -3.587400581314067], 'name': 'Rio Negro e Solimões'}",792
2009,"{'latlong': [-62.7508323901846, -3.587400581314067], 'name': 'Rio Negro e Solimões'}","{'latlong': [-64.47009165648124, -0.6042378800253123], 'name': 'Entorno Manaus'}",29
2009,"{'latlong': [-64.47009165648124, -0.6042378800253123], 'name': 'Entorno Manaus'}","{'latlong': [-62.7508323901846, -3.587400581314067], 'name': 'Rio Negro e Solimões'}",2
2009,"{'latlong': [-64.47009165648124, -0.6042378800253123], 'name': 'Entorno Manaus'}","{'latlong': [-64.47009165648124, -0.6042378800253123], 'name': 'Entorno Manaus'}",6551
2009,"{'latlong': [-65.88057334170182, -7.391761280156165], 'name': 'Regional Purus'}","{'latlong': [-64.47009165648124, -0.6042378800253123], 'name': 'Entorno Manaus'}",10
2009,"{'latlong': [-65.88057334170182, -7.391761280156165], 'name': 'Regional Purus'}","{'latlong': [-65.88057334170182, -7.391761280156165], 'name': 'Regional Purus'}",512
2009,"{'latlong': [-65.88057334170182, -7.391761280156165], 'name': 'Regional Purus'}","{'latlong': [-69.20896075625913, -6.4872294543537015], 'name': 'Regional Juruá'}",1
2009,"{'latlong': [-66.74397610654549, -2.7624940948828614], 'name': 'Triângulo'}","{'latlong': [-64.47009165648124, -0.6042378800253123], 'name': 'Entorno Manaus'}",8
2009,"{'latlong': [-66.74397610654549, -2.7624940948828614], 'name': 'Triângulo'}","{'latlong': [-66.74397610654549, -2.7624940948828614], 'name': 'Triângulo'}",490
2009,"{'latlong': [-66.74397610654549, -2.7624940948828614], 'name': 'Triângulo'}","{'latlong': [-69.69865585473899, -4.759892906023188], 'name': 'Alto Solimões'}",1
2009,"{'latlong': [-69.20896075625913, -6.4872294543537015], 'name': 'Regional Juruá'}","{'latlong': [-64.47009165648124, -0.6042378800253123], 'name': 'Entorno Manaus'}",4
2009,"{'latlong': [-69.20896075625913, -6.4872294543537015], 'name': 'Regional Juruá'}","{'latlong': [-69.20896075625913, -6.4872294543537015], 'name': 'Regional Juruá'}",511
2009,"{'latlong': [-69.69865585473899, -4.759892906023188], 'name': 'Alto Solimões'}","{'latlong': [-58.80732579359148, -1.7695729901247828], 'name': 'Médio Amazonas'}",1
2009,"{'latlong': [-69.69865585473899, -4.759892906023188], 'name': 'Alto Solimões'}","{'latlong': [-64.47009165648124, -0.6042378800253123], 'name': 'Entorno Manaus'}",2
2009,"{'latlong': [-69.69865585473899, -4.759892906023188], 'name': 'Alto Solimões'}","{'latlong': [-69.69865585473899, -4.759892906023188], 'name': 'Alto Solimões'}",412
2010,"{'latlong': [-57.78301983402671, -3.878545376148957], 'name': 'Baixo Amazonas'}","{'latlong': [-57.78301983402671, -3.878545376148957], 'name': 'Baixo Amazonas'}",664
2010,"{'latlong': [-57.78301983402671, -3.878545376148957], 'name': 'Baixo Amazonas'}","{'latlong': [-64.47009165648124, -0.6042378800253123], 'name': 'Entorno Manaus'}",10
2010,"{'latlong': [-58.80732579359148, -1.7695729901247828], 'name': 'Médio Amazonas'}","{'latlong': [-57.78301983402671, -3.878545376148957], 'name': 'Baixo Amazonas'}",1
2010,"{'latlong': [-58.80732579359148, -1.7695729901247828], 'name': 'Médio Amazonas'}","{'latlong': [-58.80732579359148, -1.7695729901247828], 'name': 'Médio Amazonas'}",793
2010,"{'latlong': [-58.80732579359148, -1.7695729901247828], 'name': 'Médio Amazonas'}","{'latlong': [-64.47009165648124, -0.6042378800253123], 'name': 'Entorno Manaus'}",9
2010,"{'latlong': [-60.54555982763556, -6.682636373094532], 'name': 'Rio Madeira'}","{'latlong': [-60.54555982763556, -6.682636373094532], 'name': 'Rio Madeira'}",484
2010,"{'latlong': [-60.54555982763556, -6.682636373094532], 'name': 'Rio Madeira'}","{'latlong': [-64.47009165648124, -0.6042378800253123], 'name': 'Entorno Manaus'}",33
2010,"{'latlong': [-60.54555982763556, -6.682636373094532], 'name': 'Rio Madeira'}","{'latlong': [-69.20896075625913, -6.4872294543537015], 'name': 'Regional Juruá'}",3
2010,"{'latlong': [-62.7508323901846, -3.587400581314067], 'name': 'Rio Negro e Solimões'}","{'latlong': [-62.7508323901846, -3.587400581314067], 'name': 'Rio Negro e Solimões'}",1138
2010,"{'latlong': [-62.7508323901846, -3.587400581314067], 'name': 'Rio Negro e Solimões'}","{'latlong': [-64.47009165648124, -0.6042378800253123], 'name': 'Entorno Manaus'}",17
2010,"{'latlong': [-64.47009165648124, -0.6042378800253123], 'name': 'Entorno Manaus'}","{'latlong': [-62.7508323901846, -3.587400581314067], 'name': 'Rio Negro e Solimões'}",5
2010,"{'latlong': [-64.47009165648124, -0.6042378800253123], 'name': 'Entorno Manaus'}","{'latlong': [-64.47009165648124, -0.6042378800253123], 'name': 'Entorno Manaus'}",6162
2010,"{'latlong': [-65.88057334170182, -7.391761280156165], 'name': 'Regional Purus'}","{'latlong': [-64.47009165648124, -0.6042378800253123], 'name': 'Entorno Manaus'}",6
2010,"{'latlong': [-65.88057334170182, -7.391761280156165], 'name': 'Regional Purus'}","{'latlong': [-65.88057334170182, -7.391761280156165], 'name': 'Regional Purus'}",558
2010,"{'latlong': [-65.88057334170182, -7.391761280156165], 'name': 'Regional Purus'}","{'latlong': [-69.20896075625913, -6.4872294543537015], 'name': 'Regional Juruá'}",3
2010,"{'latlong': [-66.74397610654549, -2.7624940948828614], 'name': 'Triângulo'}","{'latlong': [-64.47009165648124, -0.6042378800253123], 'name': 'Entorno Manaus'}",6
2010,"{'latlong': [-66.74397610654549, -2.7624940948828614], 'name': 'Triângulo'}","{'latlong': [-66.74397610654549, -2.7624940948828614], 'name': 'Triângulo'}",647
2010,"{'latlong': [-69.20896075625913, -6.4872294543537015], 'name': 'Regional Juruá'}","{'latlong': [-69.20896075625913, -6.4872294543537015], 'name': 'Regional Juruá'}",690
2010,"{'latlong': [-69.69865585473899, -4.759892906023188], 'name': 'Alto Solimões'}","{'latlong': [-64.47009165648124, -0.6042378800253123], 'name': 'Entorno Manaus'}",4
2010,"{'latlong': [-69.69865585473899, -4.759892906023188], 'name': 'Alto Solimões'}","{'latlong': [-69.69865585473899, -4.759892906023188], 'name': 'Alto Solimões'}",513
2011,"{'latlong': [-57.78301983402671, -3.878545376148957], 'name': 'Baixo Amazonas'}","{'latlong': [-57.78301983402671, -3.878545376148957], 'name': 'Baixo Amazonas'}",759
2011,"{'latlong': [-57.78301983402671, -3.878545376148957], 'name': 'Baixo Amazonas'}","{'latlong': [-58.80732579359148, -1.7695729901247828], 'name': 'Médio Amazonas'}",1
2011,"{'latlong': [-57.78301983402671, -3.878545376148957], 'name': 'Baixo Amazonas'}","{'latlong': [-64.47009165648124, -0.6042378800253123], 'name': 'Entorno Manaus'}",8
2011,"{'latlong': [-57.78301983402671, -3.878545376148957], 'name': 'Baixo Amazonas'}","{'latlong': [-69.20896075625913, -6.4872294543537015], 'name': 'Regional Juruá'}",1
2011,"{'latlong': [-58.80732579359148, -1.7695729901247828], 'name': 'Médio Amazonas'}","{'latlong': [-58.80732579359148, -1.7695729901247828], 'name': 'Médio Amazonas'}",722
2011,"{'latlong': [-58.80732579359148, -1.7695729901247828], 'name': 'Médio Amazonas'}","{'latlong': [-64.47009165648124, -0.6042378800253123], 'name': 'Entorno Manaus'}",18
2011,"{'latlong': [-60.54555982763556, -6.682636373094532], 'name': 'Rio Madeira'}","{'latlong': [-60.54555982763556, -6.682636373094532], 'name': 'Rio Madeira'}",612
2011,"{'latlong': [-60.54555982763556, -6.682636373094532], 'name': 'Rio Madeira'}","{'latlong': [-64.47009165648124, -0.6042378800253123], 'name': 'Entorno Manaus'}",22
2011,"{'latlong': [-62.7508323901846, -3.587400581314067], 'name': 'Rio Negro e Solimões'}","{'latlong': [-62.7508323901846, -3.587400581314067], 'name': 'Rio Negro e Solimões'}",1119
2011,"{'latlong': [-62.7508323901846, -3.587400581314067], 'name': 'Rio Negro e Solimões'}","{'latlong': [-64.47009165648124, -0.6042378800253123], 'name': 'Entorno Manaus'}",18
2011,"{'latlong': [-64.47009165648124, -0.6042378800253123], 'name': 'Entorno Manaus'}","{'latlong': [-62.7508323901846, -3.587400581314067], 'name': 'Rio Negro e Solimões'}",1
2011,"{'latlong': [-64.47009165648124, -0.6042378800253123], 'name': 'Entorno Manaus'}","{'latlong': [-64.47009165648124, -0.6042378800253123], 'name': 'Entorno Manaus'}",8003
2011,"{'latlong': [-64.47009165648124, -0.6042378800253123], 'name': 'Entorno Manaus'}","{'latlong': [-66.74397610654549, -2.7624940948828614], 'name': 'Triângulo'}",1
2011,"{'latlong': [-65.88057334170182, -7.391761280156165], 'name': 'Regional Purus'}","{'latlong': [-64.47009165648124, -0.6042378800253123], 'name': 'Entorno Manaus'}",1
2011,"{'latlong': [-65.88057334170182, -7.391761280156165], 'name': 'Regional Purus'}","{'latlong': [-65.88057334170182, -7.391761280156165], 'name': 'Regional Purus'}",513
2011,"{'latlong': [-65.88057334170182, -7.391761280156165], 'name': 'Regional Purus'}","{'latlong': [-69.20896075625913, -6.4872294543537015], 'name': 'Regional Juruá'}",1
2011,"{'latlong': [-66.74397610654549, -2.7624940948828614], 'name': 'Triângulo'}","{'latlong': [-64.47009165648124, -0.6042378800253123], 'name': 'Entorno Manaus'}",4
2011,"{'latlong': [-66.74397610654549, -2.7624940948828614], 'name': 'Triângulo'}","{'latlong': [-66.74397610654549, -2.7624940948828614], 'name': 'Triângulo'}",545
2011,"{'latlong': [-69.20896075625913, -6.4872294543537015], 'name': 'Regional Juruá'}","{'latlong': [-60.54555982763556, -6.682636373094532], 'name': 'Rio Madeira'}",3
2011,"{'latlong': [-69.20896075625913, -6.4872294543537015], 'name': 'Regional Juruá'}","{'latlong': [-64.47009165648124, -0.6042378800253123], 'name': 'Entorno Manaus'}",2
2011,"{'latlong': [-69.20896075625913, -6.4872294543537015], 'name': 'Regional Juruá'}","{'latlong': [-69.20896075625913, -6.4872294543537015], 'name': 'Regional Juruá'}",545
2011,"{'latlong': [-69.69865585473899, -4.759892906023188], 'name': 'Alto Solimões'}","{'latlong': [-57.78301983402671, -3.878545376148957], 'name': 'Baixo Amazonas'}",1
2011,"{'latlong': [-69.69865585473899, -4.759892906023188], 'name': 'Alto Solimões'}","{'latlong': [-60.54555982763556, -6.682636373094532], 'name': 'Rio Madeira'}",1
2011,"{'latlong': [-69.69865585473899, -4.759892906023188], 'name': 'Alto Solimões'}","{'latlong': [-64.47009165648124, -0.6042378800253123], 'name': 'Entorno Manaus'}",8
2011,"{'latlong': [-69.69865585473899, -4.759892906023188], 'name': 'Alto Solimões'}","{'latlong': [-66.74397610654549, -2.7624940948828614], 'name': 'Triângulo'}",2
2011,"{'latlong': [-69.69865585473899, -4.759892906023188], 'name': 'Alto Solimões'}","{'latlong': [-69.69865585473899, -4.759892906023188], 'name': 'Alto Solimões'}",458
2012,"{'latlong': [-57.78301983402671, -3.878545376148957], 'name': 'Baixo Amazonas'}","{'latlong': [-57.78301983402671, -3.878545376148957], 'name': 'Baixo Amazonas'}",837
2012,"{'latlong': [-57.78301983402671, -3.878545376148957], 'name': 'Baixo Amazonas'}","{'latlong': [-64.47009165648124, -0.6042378800253123], 'name': 'Entorno Manaus'}",15
2012,"{'latlong': [-58.80732579359148, -1.7695729901247828], 'name': 'Médio Amazonas'}","{'latlong': [-57.78301983402671, -3.878545376148957], 'name': 'Baixo Amazonas'}",1
2012,"{'latlong': [-58.80732579359148, -1.7695729901247828], 'name': 'Médio Amazonas'}","{'latlong': [-58.80732579359148, -1.7695729901247828], 'name': 'Médio Amazonas'}",693
2012,"{'latlong': [-58.80732579359148, -1.7695729901247828], 'name': 'Médio Amazonas'}","{'latlong': [-64.47009165648124, -0.6042378800253123], 'name': 'Entorno Manaus'}",15
2012,"{'latlong': [-60.54555982763556, -6.682636373094532], 'name': 'Rio Madeira'}","{'latlong': [-60.54555982763556, -6.682636373094532], 'name': 'Rio Madeira'}",758
2012,"{'latlong': [-60.54555982763556, -6.682636373094532], 'name': 'Rio Madeira'}","{'latlong': [-64.47009165648124, -0.6042378800253123], 'name': 'Entorno Manaus'}",31
2012,"{'latlong': [-62.7508323901846, -3.587400581314067], 'name': 'Rio Negro e Solimões'}","{'latlong': [-62.7508323901846, -3.587400581314067], 'name': 'Rio Negro e Solimões'}",927
2012,"{'latlong': [-62.7508323901846, -3.587400581314067], 'name': 'Rio Negro e Solimões'}","{'latlong': [-64.47009165648124, -0.6042378800253123], 'name': 'Entorno Manaus'}",37
2012,"{'latlong': [-62.7508323901846, -3.587400581314067], 'name': 'Rio Negro e Solimões'}","{'latlong': [-69.20896075625913, -6.4872294543537015], 'name': 'Regional Juruá'}",1
2012,"{'latlong': [-64.47009165648124, -0.6042378800253123], 'name': 'Entorno Manaus'}","{'latlong': [-62.7508323901846, -3.587400581314067], 'name': 'Rio Negro e Solimões'}",2
2012,"{'latlong': [-64.47009165648124, -0.6042378800253123], 'name': 'Entorno Manaus'}","{'latlong': [-64.47009165648124, -0.6042378800253123], 'name': 'Entorno Manaus'}",7831
2012,"{'latlong': [-65.88057334170182, -7.391761280156165], 'name': 'Regional Purus'}","{'latlong': [-62.7508323901846, -3.587400581314067], 'name': 'Rio Negro e Solimões'}",1
2012,"{'latlong': [-65.88057334170182, -7.391761280156165], 'name': 'Regional Purus'}","{'latlong': [-64.47009165648124, -0.6042378800253123], 'name': 'Entorno Manaus'}",1
2012,"{'latlong': [-65.88057334170182, -7.391761280156165], 'name': 'Regional Purus'}","{'latlong': [-65.88057334170182, -7.391761280156165], 'name': 'Regional Purus'}",631
2012,"{'latlong': [-66.74397610654549, -2.7624940948828614], 'name': 'Triângulo'}","{'latlong': [-64.47009165648124, -0.6042378800253123], 'name': 'Entorno Manaus'}",7
2012,"{'latlong': [-66.74397610654549, -2.7624940948828614], 'name': 'Triângulo'}","{'latlong': [-66.74397610654549, -2.7624940948828614], 'name': 'Triângulo'}",601
2012,"{'latlong': [-69.20896075625913, -6.4872294543537015], 'name': 'Regional Juruá'}","{'latlong': [-64.47009165648124, -0.6042378800253123], 'name': 'Entorno Manaus'}",1
2012,"{'latlong': [-69.20896075625913, -6.4872294543537015], 'name': 'Regional Juruá'}","{'latlong': [-69.20896075625913, -6.4872294543537015], 'name': 'Regional Juruá'}",356
2012,"{'latlong': [-69.69865585473899, -4.759892906023188], 'name': 'Alto Solimões'}","{'latlong': [-69.69865585473899, -4.759892906023188], 'name': 'Alto Solimões'}",474
2013,"{'latlong': [-57.78301983402671, -3.878545376148957], 'name': 'Baixo Amazonas'}","{'latlong': [-57.78301983402671, -3.878545376148957], 'name': 'Baixo Amazonas'}",781
2013,"{'latlong': [-57.78301983402671, -3.878545376148957], 'name': 'Baixo Amazonas'}","{'latlong': [-64.47009165648124, -0.6042378800253123], 'name': 'Entorno Manaus'}",15
2013,"{'latlong': [-57.78301983402671, -3.878545376148957], 'name': 'Baixo Amazonas'}","{'latlong': [-69.69865585473899, -4.759892906023188], 'name': 'Alto Solimões'}",1
2013,"{'latlong': [-58.80732579359148, -1.7695729901247828], 'name': 'Médio Amazonas'}","{'latlong': [-58.80732579359148, -1.7695729901247828], 'name': 'Médio Amazonas'}",619
2013,"{'latlong': [-58.80732579359148, -1.7695729901247828], 'name': 'Médio Amazonas'}","{'latlong': [-64.47009165648124, -0.6042378800253123], 'name': 'Entorno Manaus'}",26
2013,"{'latlong': [-60.54555982763556, -6.682636373094532], 'name': 'Rio Madeira'}","{'latlong': [-60.54555982763556, -6.682636373094532], 'name': 'Rio Madeira'}",566
2013,"{'latlong': [-60.54555982763556, -6.682636373094532], 'name': 'Rio Madeira'}","{'latlong': [-64.47009165648124, -0.6042378800253123], 'name': 'Entorno Manaus'}",26
2013,"{'latlong': [-62.7508323901846, -3.587400581314067], 'name': 'Rio Negro e Solimões'}","{'latlong': [-62.7508323901846, -3.587400581314067], 'name': 'Rio Negro e Solimões'}",1162
2013,"{'latlong': [-62.7508323901846, -3.587400581314067], 'name': 'Rio Negro e Solimões'}","{'latlong': [-64.47009165648124, -0.6042378800253123], 'name': 'Entorno Manaus'}",39
2013,"{'latlong': [-64.47009165648124, -0.6042378800253123], 'name': 'Entorno Manaus'}","{'latlong': [-62.7508323901846, -3.587400581314067], 'name': 'Rio Negro e Solimões'}",3
2013,"{'latlong': [-64.47009165648124, -0.6042378800253123], 'name': 'Entorno Manaus'}","{'latlong': [-64.47009165648124, -0.6042378800253123], 'name': 'Entorno Manaus'}",7793
2013,"{'latlong': [-65.88057334170182, -7.391761280156165], 'name': 'Regional Purus'}","{'latlong': [-64.47009165648124, -0.6042378800253123], 'name': 'Entorno Manaus'}",2
2013,"{'latlong': [-65.88057334170182, -7.391761280156165], 'name': 'Regional Purus'}","{'latlong': [-65.88057334170182, -7.391761280156165], 'name': 'Regional Purus'}",521
2013,"{'latlong': [-66.74397610654549, -2.7624940948828614], 'name': 'Triângulo'}","{'latlong': [-64.47009165648124, -0.6042378800253123], 'name': 'Entorno Manaus'}",10
2013,"{'latlong': [-66.74397610654549, -2.7624940948828614], 'name': 'Triângulo'}","{'latlong': [-66.74397610654549, -2.7624940948828614], 'name': 'Triângulo'}",570
2013,"{'latlong': [-69.20896075625913, -6.4872294543537015], 'name': 'Regional Juruá'}","{'latlong': [-64.47009165648124, -0.6042378800253123], 'name': 'Entorno Manaus'}",6
2013,"{'latlong': [-69.20896075625913, -6.4872294543537015], 'name': 'Regional Juruá'}","{'latlong': [-66.74397610654549, -2.7624940948828614], 'name': 'Triângulo'}",1
2013,"{'latlong': [-69.20896075625913, -6.4872294543537015], 'name': 'Regional Juruá'}","{'latlong': [-69.20896075625913, -6.4872294543537015], 'name': 'Regional Juruá'}",620
2013,"{'latlong': [-69.20896075625913, -6.4872294543537015], 'name': 'Regional Juruá'}","{'latlong': [-69.69865585473899, -4.759892906023188], 'name': 'Alto Solimões'}",1
2013,"{'latlong': [-69.69865585473899, -4.759892906023188], 'name': 'Alto Solimões'}","{'latlong': [-64.47009165648124, -0.6042378800253123], 'name': 'Entorno Manaus'}",11
2013,"{'latlong': [-69.69865585473899, -4.759892906023188], 'name': 'Alto Solimões'}","{'latlong': [-69.69865585473899, -4.759892906023188], 'name': 'Alto Solimões'}",547
2014,"{'latlong': [-57.78301983402671, -3.878545376148957], 'name': 'Baixo Amazonas'}","{'latlong': [-57.78301983402671, -3.878545376148957], 'name': 'Baixo Amazonas'}",838
2014,"{'latlong': [-57.78301983402671, -3.878545376148957], 'name': 'Baixo Amazonas'}","{'latlong': [-64.47009165648124, -0.6042378800253123], 'name': 'Entorno Manaus e Alto Rio Negro'}",19
2014,"{'latlong': [-58.80732579359148, -1.7695729901247828], 'name': 'Médio Amazonas'}","{'latlong': [-57.78301983402671, -3.878545376148957], 'name': 'Baixo Amazonas'}",1
2014,"{'latlong': [-58.80732579359148, -1.7695729901247828], 'name': 'Médio Amazonas'}","{'latlong': [-58.80732579359148, -1.7695729901247828], 'name': 'Médio Amazonas'}",668
2014,"{'latlong': [-58.80732579359148, -1.7695729901247828], 'name': 'Médio Amazonas'}","{'latlong': [-64.47009165648124, -0.6042378800253123], 'name': 'Entorno Manaus e Alto Rio Negro'}",26
2014,"{'latlong': [-60.54555982763556, -6.682636373094532], 'name': 'Rio Madeira'}","{'latlong': [-60.54555982763556, -6.682636373094532], 'name': 'Rio Madeira'}",779
2014,"{'latlong': [-60.54555982763556, -6.682636373094532], 'name': 'Rio Madeira'}","{'latlong': [-64.47009165648124, -0.6042378800253123], 'name': 'Entorno Manaus e Alto Rio Negro'}",30
2014,"{'latlong': [-60.54555982763556, -6.682636373094532], 'name': 'Rio Madeira'}","{'latlong': [-69.20896075625913, -6.4872294543537015], 'name': 'Regional Juruá'}",1
2014,"{'latlong': [-62.7508323901846, -3.587400581314067], 'name': 'Rio Negro e Solimões'}","{'latlong': [-62.7508323901846, -3.587400581314067], 'name': 'Rio Negro e Solimões'}",1003
2014,"{'latlong': [-62.7508323901846, -3.587400581314067], 'name': 'Rio Negro e Solimões'}","{'latlong': [-64.47009165648124, -0.6042378800253123], 'name': 'Entorno Manaus e Alto Rio Negro'}",57
2014,"{'latlong': [-64.47009165648124, -0.6042378800253123], 'name': 'Entorno Manaus e Alto Rio Negro'}","{'latlong': [-62.7508323901846, -3.587400581314067], 'name': 'Rio Negro e Solimões'}",3
2014,"{'latlong': [-64.47009165648124, -0.6042378800253123], 'name': 'Entorno Manaus e Alto Rio Negro'}","{'latlong': [-64.47009165648124, -0.6042378800253123], 'name': 'Entorno Manaus e Alto Rio Negro'}",6147
2014,"{'latlong': [-65.88057334170182, -7.391761280156165], 'name': 'Regional Purus'}","{'latlong': [-64.47009165648124, -0.6042378800253123], 'name': 'Entorno Manaus e Alto Rio Negro'}",8
2014,"{'latlong': [-65.88057334170182, -7.391761280156165], 'name': 'Regional Purus'}","{'latlong': [-65.88057334170182, -7.391761280156165], 'name': 'Regional Purus'}",643
2014,"{'latlong': [-66.74397610654549, -2.7624940948828614], 'name': 'Triângulo'}","{'latlong': [-62.7508323901846, -3.587400581314067], 'name': 'Rio Negro e Solimões'}",1
2014,"{'latlong': [-66.74397610654549, -2.7624940948828614], 'name': 'Triângulo'}","{'latlong': [-64.47009165648124, -0.6042378800253123], 'name': 'Entorno Manaus e Alto Rio Negro'}",5
2014,"{'latlong': [-66.74397610654549, -2.7624940948828614], 'name': 'Triângulo'}","{'latlong': [-66.74397610654549, -2.7624940948828614], 'name': 'Triângulo'}",624
2014,"{'latlong': [-69.20896075625913, -6.4872294543537015], 'name': 'Regional Juruá'}","{'latlong': [-60.54555982763556, -6.682636373094532], 'name': 'Rio Madeira'}",1
2014,"{'latlong': [-69.20896075625913, -6.4872294543537015], 'name': 'Regional Juruá'}","{'latlong': [-64.47009165648124, -0.6042378800253123], 'name': 'Entorno Manaus e Alto Rio Negro'}",14
2014,"{'latlong': [-69.20896075625913, -6.4872294543537015], 'name': 'Regional Juruá'}","{'latlong': [-69.20896075625913, -6.4872294543537015], 'name': 'Regional Juruá'}",657
2014,"{'latlong': [-69.69865585473899, -4.759892906023188], 'name': 'Alto Solimões'}","{'latlong': [-64.47009165648124, -0.6042378800253123], 'name': 'Entorno Manaus e Alto Rio Negro'}",13
2014,"{'latlong': [-69.69865585473899, -4.759892906023188], 'name': 'Alto Solimões'}","{'latlong': [-69.69865585473899, -4.759892906023188], 'name': 'Alto Solimões'}",551
2015,"{'latlong': [-57.78301983402671, -3.878545376148957], 'name': 'Baixo Amazonas'}","{'latlong': [-57.78301983402671, -3.878545376148957], 'name': 'Baixo Amazonas'}",743
2015,"{'latlong': [-57.78301983402671, -3.878545376148957], 'name': 'Baixo Amazonas'}","{'latlong': [-64.47009165648124, -0.6042378800253123], 'name': 'Entorno Manaus e Alto Rio Negro'}",24
2015,"{'latlong': [-58.80732579359148, -1.7695729901247828], 'name': 'Médio Amazonas'}","{'latlong': [-58.80732579359148, -1.7695729901247828], 'name': 'Médio Amazonas'}",618
2015,"{'latlong': [-58.80732579359148, -1.7695729901247828], 'name': 'Médio Amazonas'}","{'latlong': [-64.47009165648124, -0.6042378800253123], 'name': 'Entorno Manaus e Alto Rio Negro'}",49
2015,"{'latlong': [-58.80732579359148, -1.7695729901247828], 'name': 'Médio Amazonas'}","{'latlong': [-69.20896075625913, -6.4872294543537015], 'name': 'Regional Juruá'}",1
2015,"{'latlong': [-60.54555982763556, -6.682636373094532], 'name': 'Rio Madeira'}","{'latlong': [-60.54555982763556, -6.682636373094532], 'name': 'Rio Madeira'}",970
2015,"{'latlong': [-60.54555982763556, -6.682636373094532], 'name': 'Rio Madeira'}","{'latlong': [-64.47009165648124, -0.6042378800253123], 'name': 'Entorno Manaus e Alto Rio Negro'}",22
2015,"{'latlong': [-60.54555982763556, -6.682636373094532], 'name': 'Rio Madeira'}","{'latlong': [-65.88057334170182, -7.391761280156165], 'name': 'Regional Purus'}",1
2015,"{'latlong': [-60.54555982763556, -6.682636373094532], 'name': 'Rio Madeira'}","{'latlong': [-66.74397610654549, -2.7624940948828614], 'name': 'Triângulo'}",1
2015,"{'latlong': [-62.7508323901846, -3.587400581314067], 'name': 'Rio Negro e Solimões'}","{'latlong': [-62.7508323901846, -3.587400581314067], 'name': 'Rio Negro e Solimões'}",1049
2015,"{'latlong': [-62.7508323901846, -3.587400581314067], 'name': 'Rio Negro e Solimões'}","{'latlong': [-64.47009165648124, -0.6042378800253123], 'name': 'Entorno Manaus e Alto Rio Negro'}",80
2015,"{'latlong': [-62.7508323901846, -3.587400581314067], 'name': 'Rio Negro e Solimões'}","{'latlong': [-66.74397610654549, -2.7624940948828614], 'name': 'Triângulo'}",1
2015,"{'latlong': [-64.47009165648124, -0.6042378800253123], 'name': 'Entorno Manaus e Alto Rio Negro'}","{'latlong': [-57.78301983402671, -3.878545376148957], 'name': 'Baixo Amazonas'}",1
2015,"{'latlong': [-64.47009165648124, -0.6042378800253123], 'name': 'Entorno Manaus e Alto Rio Negro'}","{'latlong': [-62.7508323901846, -3.587400581314067], 'name': 'Rio Negro e Solimões'}",1
2015,"{'latlong': [-64.47009165648124, -0.6042378800253123], 'name': 'Entorno Manaus e Alto Rio Negro'}","{'latlong': [-64.47009165648124, -0.6042378800253123], 'name': 'Entorno Manaus e Alto Rio Negro'}",7279
2015,"{'latlong': [-64.47009165648124, -0.6042378800253123], 'name': 'Entorno Manaus e Alto Rio Negro'}","{'latlong': [-66.74397610654549, -2.7624940948828614], 'name': 'Triângulo'}",3
2015,"{'latlong': [-64.47009165648124, -0.6042378800253123], 'name': 'Entorno Manaus e Alto Rio Negro'}","{'latlong': [-69.69865585473899, -4.759892906023188], 'name': 'Alto Solimões'}",2
2015,"{'latlong': [-65.88057334170182, -7.391761280156165], 'name': 'Regional Purus'}","{'latlong': [-64.47009165648124, -0.6042378800253123], 'name': 'Entorno Manaus e Alto Rio Negro'}",14
2015,"{'latlong': [-65.88057334170182, -7.391761280156165], 'name': 'Regional Purus'}","{'latlong': [-65.88057334170182, -7.391761280156165], 'name': 'Regional Purus'}",613
2015,"{'latlong': [-66.74397610654549, -2.7624940948828614], 'name': 'Triângulo'}","{'latlong': [-64.47009165648124, -0.6042378800253123], 'name': 'Entorno Manaus e Alto Rio Negro'}",19
2015,"{'latlong': [-66.74397610654549, -2.7624940948828614], 'name': 'Triângulo'}","{'latlong': [-66.74397610654549, -2.7624940948828614], 'name': 'Triângulo'}",631
2015,"{'latlong': [-69.20896075625913, -6.4872294543537015], 'name': 'Regional Juruá'}","{'latlong': [-64.47009165648124, -0.6042378800253123], 'name': 'Entorno Manaus e Alto Rio Negro'}",8
2015,"{'latlong': [-69.20896075625913, -6.4872294543537015], 'name': 'Regional Juruá'}","{'latlong': [-65.88057334170182, -7.391761280156165], 'name': 'Regional Purus'}",1
2015,"{'latlong': [-69.20896075625913, -6.4872294543537015], 'name': 'Regional Juruá'}","{'latlong': [-69.20896075625913, -6.4872294543537015], 'name': 'Regional Juruá'}",457
2015,"{'latlong': [-69.69865585473899, -4.759892906023188], 'name': 'Alto Solimões'}","{'latlong': [-62.7508323901846, -3.587400581314067], 'name': 'Rio Negro e Solimões'}",1
2015,"{'latlong': [-69.69865585473899, -4.759892906023188], 'name': 'Alto Solimões'}","{'latlong': [-64.47009165648124, -0.6042378800253123], 'name': 'Entorno Manaus e Alto Rio Negro'}",12
2015,"{'latlong': [-69.69865585473899, -4.759892906023188], 'name': 'Alto Solimões'}","{'latlong': [-69.69865585473899, -4.759892906023188], 'name': 'Alto Solimões'}",653
2016,"{'latlong': [-57.78301983402671, -3.878545376148957], 'name': 'Baixo Amazonas'}","{'latlong': [-57.78301983402671, -3.878545376148957], 'name': 'Baixo Amazonas'}",772
2016,"{'latlong': [-57.78301983402671, -3.878545376148957], 'name': 'Baixo Amazonas'}","{'latlong': [-64.47009165648124, -0.6042378800253123], 'name': 'Manaus, Entorno e Alto Rio Negro'}",36
2016,"{'latlong': [-58.80732579359148, -1.7695729901247828], 'name': 'Médio Amazonas'}","{'latlong': [-58.80732579359148, -1.7695729901247828], 'name': 'Médio Amazonas'}",399
2016,"{'latlong': [-58.80732579359148, -1.7695729901247828], 'name': 'Médio Amazonas'}","{'latlong': [-64.47009165648124, -0.6042378800253123], 'name': 'Manaus, Entorno e Alto Rio Negro'}",45
2016,"{'latlong': [-60.54555982763556, -6.682636373094532], 'name': 'Rio Madeira'}","{'latlong': [-60.54555982763556, -6.682636373094532], 'name': 'Rio Madeira'}",992
2016,"{'latlong': [-60.54555982763556, -6.682636373094532], 'name': 'Rio Madeira'}","{'latlong': [-64.47009165648124, -0.6042378800253123], 'name': 'Manaus, Entorno e Alto Rio Negro'}",19
2016,"{'latlong': [-62.7508323901846, -3.587400581314067], 'name': 'Rio Negro e Solimões'}","{'latlong': [-62.7508323901846, -3.587400581314067], 'name': 'Rio Negro e Solimões'}",865
2016,"{'latlong': [-62.7508323901846, -3.587400581314067], 'name': 'Rio Negro e Solimões'}","{'latlong': [-64.47009165648124, -0.6042378800253123], 'name': 'Manaus, Entorno e Alto Rio Negro'}",104
2016,"{'latlong': [-64.47009165648124, -0.6042378800253123], 'name': 'Manaus, Entorno e Alto Rio Negro'}","{'latlong': [-62.7508323901846, -3.587400581314067], 'name': 'Rio Negro e Solimões'}",4
2016,"{'latlong': [-64.47009165648124, -0.6042378800253123], 'name': 'Manaus, Entorno e Alto Rio Negro'}","{'latlong': [-64.47009165648124, -0.6042378800253123], 'name': 'Manaus, Entorno e Alto Rio Negro'}",6861
2016,"{'latlong': [-64.47009165648124, -0.6042378800253123], 'name': 'Manaus, Entorno e Alto Rio Negro'}","{'latlong': [-66.74397610654549, -2.7624940948828614], 'name': 'Triângulo'}",3
2016,"{'latlong': [-65.88057334170182, -7.391761280156165], 'name': 'Regional Purus'}","{'latlong': [-64.47009165648124, -0.6042378800253123], 'name': 'Manaus, Entorno e Alto Rio Negro'}",13
2016,"{'latlong': [-65.88057334170182, -7.391761280156165], 'name': 'Regional Purus'}","{'latlong': [-65.88057334170182, -7.391761280156165], 'name': 'Regional Purus'}",374
2016,"{'latlong': [-66.74397610654549, -2.7624940948828614], 'name': 'Triângulo'}","{'latlong': [-64.47009165648124, -0.6042378800253123], 'name': 'Manaus, Entorno e Alto Rio Negro'}",19
2016,"{'latlong': [-66.74397610654549, -2.7624940948828614], 'name': 'Triângulo'}","{'latlong': [-66.74397610654549, -2.7624940948828614], 'name': 'Triângulo'}",450
2016,"{'latlong': [-69.20896075625913, -6.4872294543537015], 'name': 'Regional Juruá'}","{'latlong': [-64.47009165648124, -0.6042378800253123], 'name': 'Manaus, Entorno e Alto Rio Negro'}",12
2016,"{'latlong': [-69.20896075625913, -6.4872294543537015], 'name': 'Regional Juruá'}","{'latlong': [-65.88057334170182, -7.391761280156165], 'name': 'Regional Purus'}",4
2016,"{'latlong': [-69.20896075625913, -6.4872294543537015], 'name': 'Regional Juruá'}","{'latlong': [-69.20896075625913, -6.4872294543537015], 'name': 'Regional Juruá'}",434
2016,"{'latlong': [-69.69865585473899, -4.759892906023188], 'name': 'Alto Solimões'}","{'latlong': [-64.47009165648124, -0.6042378800253123], 'name': 'Manaus, Entorno e Alto Rio Negro'}",6
2016,"{'latlong': [-69.69865585473899, -4.759892906023188], 'name': 'Alto Solimões'}","{'latlong': [-69.69865585473899, -4.759892906023188], 'name': 'Alto Solimões'}",601
2017,"{'latlong': [-57.78301983402671, -3.878545376148957], 'name': 'Baixo Amazonas'}","{'latlong': [-57.78301983402671, -3.878545376148957], 'name': 'Baixo Amazonas'}",741
2017,"{'latlong': [-57.78301983402671, -3.878545376148957], 'name': 'Baixo Amazonas'}","{'latlong': [-64.47009165648124, -0.6042378800253123], 'name': 'Entorno Manaus'}",55
2017,"{'latlong': [-58.80732579359148, -1.7695729901247828], 'name': 'Médio Amazonas'}","{'latlong': [-58.80732579359148, -1.7695729901247828], 'name': 'Médio Amazonas'}",541
2017,"{'latlong': [-58.80732579359148, -1.7695729901247828], 'name': 'Médio Amazonas'}","{'latlong': [-64.47009165648124, -0.6042378800253123], 'name': 'Entorno Manaus'}",81
2017,"{'latlong': [-60.54555982763556, -6.682636373094532], 'name': 'Rio Madeira'}","{'latlong': [-60.54555982763556, -6.682636373094532], 'name': 'Rio Madeira'}",783
2017,"{'latlong': [-60.54555982763556, -6.682636373094532], 'name': 'Rio Madeira'}","{'latlong': [-64.47009165648124, -0.6042378800253123], 'name': 'Entorno Manaus'}",20
2017,"{'latlong': [-62.7508323901846, -3.587400581314067], 'name': 'Rio Negro e Solimões'}","{'latlong': [-62.7508323901846, -3.587400581314067], 'name': 'Rio Negro e Solimões'}",1011
2017,"{'latlong': [-62.7508323901846, -3.587400581314067], 'name': 'Rio Negro e Solimões'}","{'latlong': [-64.47009165648124, -0.6042378800253123], 'name': 'Entorno Manaus'}",115
2017,"{'latlong': [-64.47009165648124, -0.6042378800253123], 'name': 'Entorno Manaus'}","{'latlong': [-62.7508323901846, -3.587400581314067], 'name': 'Rio Negro e Solimões'}",2
2017,"{'latlong': [-64.47009165648124, -0.6042378800253123], 'name': 'Entorno Manaus'}","{'latlong': [-64.47009165648124, -0.6042378800253123], 'name': 'Entorno Manaus'}",7683
2017,"{'latlong': [-64.47009165648124, -0.6042378800253123], 'name': 'Entorno Manaus'}","{'latlong': [-69.69865585473899, -4.759892906023188], 'name': 'Alto Solimões'}",2
2017,"{'latlong': [-65.88057334170182, -7.391761280156165], 'name': 'Regional Purus'}","{'latlong': [-60.54555982763556, -6.682636373094532], 'name': 'Rio Madeira'}",1
2017,"{'latlong': [-65.88057334170182, -7.391761280156165], 'name': 'Regional Purus'}","{'latlong': [-64.47009165648124, -0.6042378800253123], 'name': 'Entorno Manaus'}",11
2017,"{'latlong': [-65.88057334170182, -7.391761280156165], 'name': 'Regional Purus'}","{'latlong': [-65.88057334170182, -7.391761280156165], 'name': 'Regional Purus'}",371
2017,"{'latlong': [-66.74397610654549, -2.7624940948828614], 'name': 'Triângulo'}","{'latlong': [-64.47009165648124, -0.6042378800253123], 'name': 'Entorno Manaus'}",25
2017,"{'latlong': [-66.74397610654549, -2.7624940948828614], 'name': 'Triângulo'}","{'latlong': [-66.74397610654549, -2.7624940948828614], 'name': 'Triângulo'}",508
2017,"{'latlong': [-69.20896075625913, -6.4872294543537015], 'name': 'Regional Juruá'}","{'latlong': [-64.47009165648124, -0.6042378800253123], 'name': 'Entorno Manaus'}",27
2017,"{'latlong': [-69.20896075625913, -6.4872294543537015], 'name': 'Regional Juruá'}","{'latlong': [-65.88057334170182, -7.391761280156165], 'name': 'Regional Purus'}",9
2017,"{'latlong': [-69.20896075625913, -6.4872294543537015], 'name': 'Regional Juruá'}","{'latlong': [-69.20896075625913, -6.4872294543537015], 'name': 'Regional Juruá'}",504
2017,"{'latlong': [-69.69865585473899, -4.759892906023188], 'name': 'Alto Solimões'}","{'latlong': [-64.47009165648124, -0.6042378800253123], 'name': 'Entorno Manaus'}",26
2017,"{'latlong': [-69.69865585473899, -4.759892906023188], 'name': 'Alto Solimões'}","{'latlong': [-66.74397610654549, -2.7624940948828614], 'name': 'Triângulo'}",2
2017,"{'latlong': [-69.69865585473899, -4.759892906023188], 'name': 'Alto Solimões'}","{'latlong': [-69.69865585473899, -4.759892906023188], 'name': 'Alto Solimões'}",590
2018,"{'latlong': [-57.78301983402671, -3.878545376148957], 'name': 'Baixo Amazonas'}","{'latlong': [-57.78301983402671, -3.878545376148957], 'name': 'Baixo Amazonas'}",1065
2018,"{'latlong': [-57.78301983402671, -3.878545376148957], 'name': 'Baixo Amazonas'}","{'latlong': [-64.47009165648124, -0.6042378800253123], 'name': 'Entorno Manaus'}",40
2018,"{'latlong': [-58.80732579359148, -1.7695729901247828], 'name': 'Médio Amazonas'}","{'latlong': [-57.78301983402671, -3.878545376148957], 'name': 'Baixo Amazonas'}",1
2018,"{'latlong': [-58.80732579359148, -1.7695729901247828], 'name': 'Médio Amazonas'}","{'latlong': [-58.80732579359148, -1.7695729901247828], 'name': 'Médio Amazonas'}",438
2018,"{'latlong': [-58.80732579359148, -1.7695729901247828], 'name': 'Médio Amazonas'}","{'latlong': [-64.47009165648124, -0.6042378800253123], 'name': 'Entorno Manaus'}",107
2018,"{'latlong': [-60.54555982763556, -6.682636373094532], 'name': 'Rio Madeira'}","{'latlong': [-60.54555982763556, -6.682636373094532], 'name': 'Rio Madeira'}",842
2018,"{'latlong': [-60.54555982763556, -6.682636373094532], 'name': 'Rio Madeira'}","{'latlong': [-64.47009165648124, -0.6042378800253123], 'name': 'Entorno Manaus'}",56
2018,"{'latlong': [-62.7508323901846, -3.587400581314067], 'name': 'Rio Negro e Solimões'}","{'latlong': [-62.7508323901846, -3.587400581314067], 'name': 'Rio Negro e Solimões'}",1205
2018,"{'latlong': [-62.7508323901846, -3.587400581314067], 'name': 'Rio Negro e Solimões'}","{'latlong': [-64.47009165648124, -0.6042378800253123], 'name': 'Entorno Manaus'}",175
2018,"{'latlong': [-64.47009165648124, -0.6042378800253123], 'name': 'Entorno Manaus'}","{'latlong': [-58.80732579359148, -1.7695729901247828], 'name': 'Médio Amazonas'}",1
2018,"{'latlong': [-64.47009165648124, -0.6042378800253123], 'name': 'Entorno Manaus'}","{'latlong': [-60.54555982763556, -6.682636373094532], 'name': 'Rio Madeira'}",1
2018,"{'latlong': [-64.47009165648124, -0.6042378800253123], 'name': 'Entorno Manaus'}","{'latlong': [-62.7508323901846, -3.587400581314067], 'name': 'Rio Negro e Solimões'}",5
2018,"{'latlong': [-64.47009165648124, -0.6042378800253123], 'name': 'Entorno Manaus'}","{'latlong': [-64.47009165648124, -0.6042378800253123], 'name': 'Entorno Manaus'}",8128
2018,"{'latlong': [-64.47009165648124, -0.6042378800253123], 'name': 'Entorno Manaus'}","{'latlong': [-66.74397610654549, -2.7624940948828614], 'name': 'Triângulo'}",1
2018,"{'latlong': [-64.47009165648124, -0.6042378800253123], 'name': 'Entorno Manaus'}","{'latlong': [-69.69865585473899, -4.759892906023188], 'name': 'Alto Solimões'}",1
2018,"{'latlong': [-65.88057334170182, -7.391761280156165], 'name': 'Regional Purus'}","{'latlong': [-64.47009165648124, -0.6042378800253123], 'name': 'Entorno Manaus'}",7
2018,"{'latlong': [-65.88057334170182, -7.391761280156165], 'name': 'Regional Purus'}","{'latlong': [-65.88057334170182, -7.391761280156165], 'name': 'Regional Purus'}",492
2018,"{'latlong': [-66.74397610654549, -2.7624940948828614], 'name': 'Triângulo'}","{'latlong': [-64.47009165648124, -0.6042378800253123], 'name': 'Entorno Manaus'}",39
2018,"{'latlong': [-66.74397610654549, -2.7624940948828614], 'name': 'Triângulo'}","{'latlong': [-66.74397610654549, -2.7624940948828614], 'name': 'Triângulo'}",468
2018,"{'latlong': [-69.20896075625913, -6.4872294543537015], 'name': 'Regional Juruá'}","{'latlong': [-64.47009165648124, -0.6042378800253123], 'name': 'Entorno Manaus'}",14
2018,"{'latlong': [-69.20896075625913, -6.4872294543537015], 'name': 'Regional Juruá'}","{'latlong': [-69.20896075625913, -6.4872294543537015], 'name': 'Regional Juruá'}",571
2018,"{'latlong': [-69.69865585473899, -4.759892906023188], 'name': 'Alto Solimões'}","{'latlong': [-62.7508323901846, -3.587400581314067], 'name': 'Rio Negro e Solimões'}",1
2018,"{'latlong': [-69.69865585473899, -4.759892906023188], 'name': 'Alto Solimões'}","{'latlong': [-64.47009165648124, -0.6042378800253123], 'name': 'Entorno Manaus'}",29
2018,"{'latlong': [-69.69865585473899, -4.759892906023188], 'name': 'Alto Solimões'}","{'latlong': [-66.74397610654549, -2.7624940948828614], 'name': 'Triângulo'}",1
2018,"{'latlong': [-69.69865585473899, -4.759892906023188], 'name': 'Alto Solimões'}","{'latlong': [-69.69865585473899, -4.759892906023188], 'name': 'Alto Solimões'}",442
2019,"{'latlong': [-57.78301983402671, -3.878545376148957], 'name': 'Baixo Amazonas'}","{'latlong': [-57.78301983402671, -3.878545376148957], 'name': 'Baixo Amazonas'}",926
2019,"{'latlong': [-57.78301983402671, -3.878545376148957], 'name': 'Baixo Amazonas'}","{'latlong': [-58.80732579359148, -1.7695729901247828], 'name': 'Médio Amazonas'}",2
2019,"{'latlong': [-57.78301983402671, -3.878545376148957], 'name': 'Baixo Amazonas'}","{'latlong': [-64.47009165648124, -0.6042378800253123], 'name': 'Entorno Manaus'}",60
2019,"{'latlong': [-58.80732579359148, -1.7695729901247828], 'name': 'Médio Amazonas'}","{'latlong': [-57.78301983402671, -3.878545376148957], 'name': 'Baixo Amazonas'}",1
2019,"{'latlong': [-58.80732579359148, -1.7695729901247828], 'name': 'Médio Amazonas'}","{'latlong': [-58.80732579359148, -1.7695729901247828], 'name': 'Médio Amazonas'}",533
2019,"{'latlong': [-58.80732579359148, -1.7695729901247828], 'name': 'Médio Amazonas'}","{'latlong': [-64.47009165648124, -0.6042378800253123], 'name': 'Entorno Manaus'}",108
2019,"{'latlong': [-60.54555982763556, -6.682636373094532], 'name': 'Rio Madeira'}","{'latlong': [-60.54555982763556, -6.682636373094532], 'name': 'Rio Madeira'}",819
2019,"{'latlong': [-60.54555982763556, -6.682636373094532], 'name': 'Rio Madeira'}","{'latlong': [-64.47009165648124, -0.6042378800253123], 'name': 'Entorno Manaus'}",70
2019,"{'latlong': [-62.7508323901846, -3.587400581314067], 'name': 'Rio Negro e Solimões'}","{'latlong': [-57.78301983402671, -3.878545376148957], 'name': 'Baixo Amazonas'}",1
2019,"{'latlong': [-62.7508323901846, -3.587400581314067], 'name': 'Rio Negro e Solimões'}","{'latlong': [-62.7508323901846, -3.587400581314067], 'name': 'Rio Negro e Solimões'}",1331
2019,"{'latlong': [-62.7508323901846, -3.587400581314067], 'name': 'Rio Negro e Solimões'}","{'latlong': [-64.47009165648124, -0.6042378800253123], 'name': 'Entorno Manaus'}",167
2019,"{'latlong': [-64.47009165648124, -0.6042378800253123], 'name': 'Entorno Manaus'}","{'latlong': [-57.78301983402671, -3.878545376148957], 'name': 'Baixo Amazonas'}",5
2019,"{'latlong': [-64.47009165648124, -0.6042378800253123], 'name': 'Entorno Manaus'}","{'latlong': [-58.80732579359148, -1.7695729901247828], 'name': 'Médio Amazonas'}",1
2019,"{'latlong': [-64.47009165648124, -0.6042378800253123], 'name': 'Entorno Manaus'}","{'latlong': [-62.7508323901846, -3.587400581314067], 'name': 'Rio Negro e Solimões'}",24
2019,"{'latlong': [-64.47009165648124, -0.6042378800253123], 'name': 'Entorno Manaus'}","{'latlong': [-64.47009165648124, -0.6042378800253123], 'name': 'Entorno Manaus'}",8915
2019,"{'latlong': [-64.47009165648124, -0.6042378800253123], 'name': 'Entorno Manaus'}","{'latlong': [-69.69865585473899, -4.759892906023188], 'name': 'Alto Solimões'}",5
2019,"{'latlong': [-65.88057334170182, -7.391761280156165], 'name': 'Regional Purus'}","{'latlong': [-64.47009165648124, -0.6042378800253123], 'name': 'Entorno Manaus'}",16
2019,"{'latlong': [-65.88057334170182, -7.391761280156165], 'name': 'Regional Purus'}","{'latlong': [-65.88057334170182, -7.391761280156165], 'name': 'Regional Purus'}",583
2019,"{'latlong': [-66.74397610654549, -2.7624940948828614], 'name': 'Triângulo'}","{'latlong': [-62.7508323901846, -3.587400581314067], 'name': 'Rio Negro e Solimões'}",2
2019,"{'latlong': [-66.74397610654549, -2.7624940948828614], 'name': 'Triângulo'}","{'latlong': [-64.47009165648124, -0.6042378800253123], 'name': 'Entorno Manaus'}",54
2019,"{'latlong': [-66.74397610654549, -2.7624940948828614], 'name': 'Triângulo'}","{'latlong': [-66.74397610654549, -2.7624940948828614], 'name': 'Triângulo'}",569
2019,"{'latlong': [-69.20896075625913, -6.4872294543537015], 'name': 'Regional Juruá'}","{'latlong': [-64.47009165648124, -0.6042378800253123], 'name': 'Entorno Manaus'}",24
2019,"{'latlong': [-69.20896075625913, -6.4872294543537015], 'name': 'Regional Juruá'}","{'latlong': [-69.20896075625913, -6.4872294543537015], 'name': 'Regional Juruá'}",754
2019,"{'latlong': [-69.69865585473899, -4.759892906023188], 'name': 'Alto Solimões'}","{'latlong': [-62.7508323901846, -3.587400581314067], 'name': 'Rio Negro e Solimões'}",1
2019,"{'latlong': [-69.69865585473899, -4.759892906023188], 'name': 'Alto Solimões'}","{'latlong': [-64.47009165648124, -0.6042378800253123], 'name': 'Entorno Manaus'}",53
2019,"{'latlong': [-69.69865585473899, -4.759892906023188], 'name': 'Alto Solimões'}","{'latlong': [-66.74397610654549, -2.7624940948828614], 'name': 'Triângulo'}",2
2019,"{'latlong': [-69.69865585473899, -4.759892906023188], 'name': 'Alto Solimões'}","{'latlong': [-69.69865585473899, -4.759892906023188], 'name': 'Alto Solimões'}",744
2020,"{'latlong': [-57.78301983402671, -3.878545376148957], 'name': 'Baixo Amazonas'}","{'latlong': [-57.78301983402671, -3.878545376148957], 'name': 'Baixo Amazonas'}",271
2020,"{'latlong': [-57.78301983402671, -3.878545376148957], 'name': 'Baixo Amazonas'}","{'latlong': [-64.47009165648124, -0.6042378800253123], 'name': 'Entorno Manaus'}",27
2020,"{'latlong': [-58.80732579359148, -1.7695729901247828], 'name': 'Médio Amazonas'}","{'latlong': [-58.80732579359148, -1.7695729901247828], 'name': 'Médio Amazonas'}",159
2020,"{'latlong': [-58.80732579359148, -1.7695729901247828], 'name': 'Médio Amazonas'}","{'latlong': [-64.47009165648124, -0.6042378800253123], 'name': 'Entorno Manaus'}",29
2020,"{'latlong': [-60.54555982763556, -6.682636373094532], 'name': 'Rio Madeira'}","{'latlong': [-60.54555982763556, -6.682636373094532], 'name': 'Rio Madeira'}",265
2020,"{'latlong': [-60.54555982763556, -6.682636373094532], 'name': 'Rio Madeira'}","{'latlong': [-64.47009165648124, -0.6042378800253123], 'name': 'Entorno Manaus'}",12
2020,"{'latlong': [-62.7508323901846, -3.587400581314067], 'name': 'Rio Negro e Solimões'}","{'latlong': [-62.7508323901846, -3.587400581314067], 'name': 'Rio Negro e Solimões'}",428
2020,"{'latlong': [-62.7508323901846, -3.587400581314067], 'name': 'Rio Negro e Solimões'}","{'latlong': [-64.47009165648124, -0.6042378800253123], 'name': 'Entorno Manaus'}",66
2020,"{'latlong': [-64.47009165648124, -0.6042378800253123], 'name': 'Entorno Manaus'}","{'latlong': [-57.78301983402671, -3.878545376148957], 'name': 'Baixo Amazonas'}",1
2020,"{'latlong': [-64.47009165648124, -0.6042378800253123], 'name': 'Entorno Manaus'}","{'latlong': [-58.80732579359148, -1.7695729901247828], 'name': 'Médio Amazonas'}",1
2020,"{'latlong': [-64.47009165648124, -0.6042378800253123], 'name': 'Entorno Manaus'}","{'latlong': [-62.7508323901846, -3.587400581314067], 'name': 'Rio Negro e Solimões'}",33
2020,"{'latlong': [-64.47009165648124, -0.6042378800253123], 'name': 'Entorno Manaus'}","{'latlong': [-64.47009165648124, -0.6042378800253123], 'name': 'Entorno Manaus'}",2988
2020,"{'latlong': [-64.47009165648124, -0.6042378800253123], 'name': 'Entorno Manaus'}","{'latlong': [-69.69865585473899, -4.759892906023188], 'name': 'Alto Solimões'}",2
2020,"{'latlong': [-65.88057334170182, -7.391761280156165], 'name': 'Regional Purus'}","{'latlong': [-60.54555982763556, -6.682636373094532], 'name': 'Rio Madeira'}",1
2020,"{'latlong': [-65.88057334170182, -7.391761280156165], 'name': 'Regional Purus'}","{'latlong': [-64.47009165648124, -0.6042378800253123], 'name': 'Entorno Manaus'}",9
2020,"{'latlong': [-65.88057334170182, -7.391761280156165], 'name': 'Regional Purus'}","{'latlong': [-65.88057334170182, -7.391761280156165], 'name': 'Regional Purus'}",208
2020,"{'latlong': [-66.74397610654549, -2.7624940948828614], 'name': 'Triângulo'}","{'latlong': [-62.7508323901846, -3.587400581314067], 'name': 'Rio Negro e Solimões'}",1
2020,"{'latlong': [-66.74397610654549, -2.7624940948828614], 'name': 'Triângulo'}","{'latlong': [-64.47009165648124, -0.6042378800253123], 'name': 'Entorno Manaus'}",15
2020,"{'latlong': [-66.74397610654549, -2.7624940948828614], 'name': 'Triângulo'}","{'latlong': [-66.74397610654549, -2.7624940948828614], 'name': 'Triângulo'}",204
2020,"{'latlong': [-69.20896075625913, -6.4872294543537015], 'name': 'Regional Juruá'}","{'latlong': [-64.47009165648124, -0.6042378800253123], 'name': 'Entorno Manaus'}",8
2020,"{'latlong': [-69.20896075625913, -6.4872294543537015], 'name': 'Regional Juruá'}","{'latlong': [-69.20896075625913, -6.4872294543537015], 'name': 'Regional Juruá'}",257
2020,"{'latlong': [-69.69865585473899, -4.759892906023188], 'name': 'Alto Solimões'}","{'latlong': [-62.7508323901846, -3.587400581314067], 'name': 'Rio Negro e Solimões'}",4
2020,"{'latlong': [-69.69865585473899, -4.759892906023188], 'name': 'Alto Solimões'}","{'latlong': [-64.47009165648124, -0.6042378800253123], 'name': 'Entorno Manaus'}",15
2020,"{'latlong': [-69.69865585473899, -4.759892906023188], 'name': 'Alto Solimões'}","{'latlong': [-66.74397610654549, -2.7624940948828614], 'name': 'Triângulo'}",2
2020,"{'latlong': [-69.69865585473899, -4.759892906023188], 'name': 'Alto Solimões'}","{'latlong': [-69.69865585473899, -4.759892906023188], 'name': 'Alto Solimões'}",196
