year,all,pregnancy,skin_diseases,mental_disorders,parasitic_diseases,external_causes,genitourinary_system,eye_ear_diseases,musculoskeletal_system,diabetes,nervous_system,neoplasm,circulatory_system
1994,74.37254274970516,,,,67.0214847546436,,,,,,,,
1995,77.50954849799508,,,,70.3786341248795,,,,,,,25.221848216786352,
1996,74.44214996225092,,,,74.02938492225668,,,,,,,43.60700870075345,
1997,77.62784594362873,,,,68.83300672409442,,,,,,,,
1998,72.97586940764094,80.39034785239073,61.03235317673364,49.30654742380735,57.055976399795206,59.19603370102309,71.0553721993105,64.45297778271633,61.9740558554693,55.13905646246019,55.491936903641424,57.86192288029507,64.00726032316952
1999,71.86152606320701,79.74683360594496,58.228605315289215,47.77750915807501,58.79481184352532,59.88864691174305,73.02280976468836,60.30841811017734,59.55835627937726,60.54424511707586,53.97908979650936,54.91617366634751,67.69211160376577
2000,72.88391120275827,80.91802814656207,58.63433544167,46.48124643861159,61.46060646325776,59.329297762837086,72.3892768967594,62.898198327008416,,55.79056237111429,53.00100609154076,57.85665460410216,62.66575417687683
2001,74.05658428445551,84.0778024041822,56.91830256932116,45.6519824566556,60.9832346141745,57.81198283063607,69.64999214729666,48.47540077256484,57.12441965257112,56.86850223468964,53.647243396876334,55.4935829236463,61.37713993886192
2002,77.89062507899645,84.20262483790543,65.06771158191141,44.066042128124586,65.27989977479562,67.65476446318378,72.97070847889393,56.81593753172537,65.95304698866458,61.65325881964721,,58.26039604204859,65.18749462120118
2003,79.19482119960263,82.67537225677027,65.18600724292598,46.43177385228296,63.652732884885786,68.99241264705618,74.26087526139061,,69.5417991418358,64.95265504363094,51.34663634148095,63.23704678193812,64.6838940507648
2004,80.44972202260084,85.91058972963151,74.73484502094287,47.07375145114857,71.22285873835872,76.15481691252253,74.61549907411082,,73.95859210353136,63.56130140873595,51.18023338007025,63.23026774188336,68.10382101515174
2005,85.32923039063725,84.52279181383958,74.95920470206782,48.71096737310955,70.01446960632771,81.12534945388774,82.8132515422527,49.91537028078306,72.24591046351988,61.52266888583189,57.169771365907074,66.86476184219914,62.96774564945037
2006,81.69576531536296,89.84301040760518,72.29044357900807,51.41964387532655,72.13662988415172,83.40336107866626,80.76013572946947,53.10644459301156,74.03262088668546,65.02734105703377,51.29866197338724,66.53209606612603,68.0018977709279
2007,80.86353055324707,87.82122181564424,73.12046343881526,47.76780197667862,69.08484914162125,82.73706193349199,77.92913691082386,57.05613483139901,72.53375928597131,66.09216710373681,53.64044780712904,64.99647672419697,65.25910892562085
2008,85.32471802631629,89.52448928178785,72.3123038066837,45.899234975815126,71.90894189941332,83.71037528858551,79.15653972141197,52.57795524972333,78.70970316780726,69.57800786359905,55.54480645791734,63.65072852363512,60.157972257206225
2009,87.06547815656872,90.33732657742644,77.37522401330808,48.11684757749566,78.08984694151286,89.42326845153016,78.25975484954158,56.27282424186176,73.71072255334443,69.97052258927484,54.09083826802582,60.048720969326816,67.56316706935225
2010,87.59297762659085,89.958370180575,77.06731505783225,46.336754175589626,75.0624693697336,85.49598266950468,81.51258371693967,55.88825108562519,69.07787580568106,,52.82548315255791,57.0517755066698,66.08654195486554
2011,87.41407802587963,92.70988845698552,79.57027519073779,48.04574661717669,72.52125980851129,88.21441160962247,80.18926142950835,,70.52581338387593,76.50300152832597,54.61114189474217,57.63558761900314,67.3426682406924
2012,89.82628662433744,92.5242794155492,76.99609591146391,46.725624241769424,75.42869301224182,87.04799441231198,82.34268924319211,46.31331046912414,67.64446029238223,77.93400009610039,46.84357509224043,54.43466076292795,66.44689795691137
2013,89.31133156165987,93.01043532504625,78.94654605504381,46.08132133741695,72.22358400612762,86.02548904817635,86.13733575140213,54.05547519024737,63.218140491837495,57.076271326534055,57.12307142333309,53.152032762746735,64.48293075153697
2014,84.63652632054504,93.86020839084856,79.36403625797261,47.10357537020566,75.0614767078519,81.53152059995112,79.8990656309939,48.431955230423846,62.97096568461677,74.35638492691889,58.72241795163462,54.98655548364437,66.5044965867682
2015,84.62621237828505,94.62500956665382,77.51097768197678,45.340656929117785,75.07913275571018,78.47792099828966,80.58950360733773,46.871795977857126,64.89578487950862,78.9825808495292,50.9509103008607,52.95204213354621,64.95483887466072
2016,84.24455713393282,93.57971203658091,76.05752411893776,41.51447818775239,78.23603200130503,74.69587909603177,79.02165501638605,47.03065536405008,64.70071954528446,76.68407318747144,51.68949101517125,47.80723692790894,63.77140359078774
2017,86.46586001282063,91.15081608079842,76.28577794038279,37.80673770099556,75.75510218949626,78.69998762751277,80.10172823426575,46.5544140939236,62.76065846824491,71.73182446217751,55.14510370032042,48.44713940249029,67.6381067156778
2018,85.99893364525573,92.59547819313453,77.16306663516418,36.43810276732098,66.82920567495349,79.08710057396526,84.57967192475606,,64.58252627397727,76.0528226262545,55.6317906159853,52.59890400893896,67.40632538308829
2019,88.09049506742227,94.27789449184026,75.08616286245794,39.54370155755464,70.9349090016861,82.12454017712804,83.28790547962491,44.455493492145735,60.02637248803272,76.46496727068548,57.856717468770505,51.578108504540346,69.78528206579287
2020,85.2106316764706,93.7006005463059,70.70114083691664,41.10262378130114,68.29571705979403,77.0067092167983,79.77043099401524,,59.26827888547575,37.9397824842849,56.636810518645376,47.90101687376217,66.16290268382308
