year,name,self_hospitalizations,to_hospitalizations,from_hospitalizations,lifo,lofi
1994,Açailândia,1766,1892,1898,0.9334038054968288,0.9304531085353003
1994,Bacabal,4266,4523,4440,0.9431793057705063,0.9608108108108108
1994,Balsas,1396,1602,1481,0.8714107365792759,0.9426063470627954
1994,Barra do Corda,2256,2303,2390,0.9795918367346939,0.9439330543933054
1994,Caxias,5435,5912,5478,0.9193166441136671,0.9921504198612633
1994,Chapadinha,1923,1983,2172,0.9697428139183056,0.8853591160220995
1994,Codó,3367,3498,3788,0.9625500285877644,0.8888595564941922
1994,Imperatriz,7775,7964,7850,0.9762682069311903,0.9904458598726115
1994,Itapecuru Mirim,2330,2411,2724,0.9664039817503111,0.855359765051395
1994,Pedreiras,3545,3796,3696,0.9338777660695469,0.9591450216450217
1994,Pinheiro,2704,3026,2773,0.8935888962326504,0.9751172015867292
1994,Presidente Dutra,3830,4001,4084,0.9572606848287928,0.9378060724779628
1994,Rosario,1748,1770,1853,0.9875706214689266,0.9433351322180248
1994,Santa Inês,4363,4635,4668,0.9413160733549083,0.9346615252784919
1994,São João dos Patos,2811,2868,2832,0.9801255230125523,0.9925847457627118
1994,São Luís,13228,13754,13327,0.961756579904028,0.9925714714489382
1994,Tïmon,497,507,564,0.980276134122288,0.8812056737588653
1994,Viana,1418,1426,1812,0.9943899018232819,0.782560706401766
1994,Zé Doca,2337,2414,2455,0.968102734051367,0.9519348268839104
1995,Açailândia,10518,11148,11549,0.9434876210979548,0.9107282015758941
1995,Bacabal,30767,32249,32647,0.9540450866693541,0.9424143106564156
1995,Balsas,14118,15535,14651,0.9087866108786611,0.963620230700976
1995,Barra do Corda,19805,20581,20774,0.9622953209270687,0.953355155482815
1995,Caxias,38775,41809,39374,0.9274318926546916,0.9847869152232438
1995,Chapadinha,19818,20372,21462,0.9728058118986844,0.9233994967850154
1995,Codó,26986,27873,29895,0.9681770889391167,0.9026927579862853
1995,Imperatriz,57870,59344,58590,0.9751617686708007,0.9877112135176651
1995,Itapecuru Mirim,22758,23501,25290,0.9683843240713161,0.8998813760379597
1995,Pedreiras,27402,31753,28371,0.8629735772997827,0.9658454055197209
1995,Pinheiro,22434,26920,23009,0.8333580980683507,0.9750097787822156
1995,Presidente Dutra,25622,26805,27536,0.9558664428278306,0.9304909936083672
1995,Rosario,12935,13171,13807,0.982081846480905,0.936843630042732
1995,Santa Inês,37325,39552,39822,0.9436943770226537,0.9372959670533876
1995,São João dos Patos,22048,22504,22832,0.9797369356558834,0.9656622284512965
1995,São Luís,114642,120593,118989,0.9506521937425887,0.9634672112548218
1995,Tïmon,9316,9649,9854,0.9654886516737485,0.9454028820783438
1995,Viana,15243,15334,19110,0.9940654754141124,0.7976452119309262
1995,Zé Doca,17608,19067,20198,0.9234803587349871,0.8717694821269433
1996,Açailândia,6644,6758,7038,0.9831311038768866,0.9440181869849389
1996,Bacabal,23222,23988,24263,0.9680673670168417,0.9570951654783003
1996,Balsas,11396,11541,11790,0.9874360973919071,0.9665818490245971
1996,Barra do Corda,14672,15291,15200,0.959518671113727,0.9652631578947368
1996,Caxias,22134,23580,22507,0.938676844783715,0.9834273781490203
1996,Chapadinha,18052,18506,18444,0.9754674159731979,0.9787464758186945
1996,Codó,18809,19086,20252,0.985486744210416,0.9287477779972348
1996,Imperatriz,38908,39850,39122,0.9763613550815559,0.9945299320075661
1996,Itapecuru Mirim,20210,20723,22429,0.9752448969743763,0.9010655847340496
1996,Pedreiras,19985,22500,20704,0.8882222222222222,0.9652724111282844
1996,Pinheiro,17624,21296,18221,0.8275732531930879,0.9672356072663411
1996,Presidente Dutra,16493,17150,17939,0.9616909620991254,0.9193935001951057
1996,Rosario,10696,11010,11653,0.971480472297911,0.9178752252638805
1996,Santa Inês,28345,29792,30040,0.9514299140708915,0.9435752330226365
1996,São João dos Patos,15332,15601,15546,0.9827575155438754,0.986234401132124
1996,São Luís,70490,75380,72250,0.9351286813478377,0.9756401384083045
1996,Tïmon,8160,8377,8473,0.9740957383311448,0.9630591289979936
1996,Viana,12076,12194,15423,0.9903231097260948,0.7829864488102185
1996,Zé Doca,14895,15212,16541,0.9791611885353668,0.9004896922797896
1997,Açailândia,5474,5566,5809,0.9834710743801653,0.9423308658977448
1997,Bacabal,23421,23929,24467,0.978770529483054,0.9572485388482446
1997,Balsas,11250,11443,11458,0.9831337935855982,0.9818467446325712
1997,Barra do Corda,13846,14381,14378,0.9627981364300118,0.9629990262901655
1997,Caxias,23493,24839,23761,0.945811022988043,0.9887210134253609
1997,Chapadinha,15143,15622,15569,0.9693381129176802,0.9726379343567345
1997,Codó,17398,17534,18321,0.9922436409262005,0.9496206538944381
1997,Imperatriz,32781,33469,32996,0.9794436642863545,0.9934840586737786
1997,Itapecuru Mirim,21289,21825,23264,0.9754410080183276,0.9151048830811555
1997,Pedreiras,19306,20579,19726,0.9381408231692502,0.978708303761533
1997,Pinheiro,16819,18774,17374,0.8958666240545435,0.9680557154368596
1997,Presidente Dutra,15998,16313,17524,0.9806902470422363,0.912919424788861
1997,Rosario,9659,10057,10541,0.9604255742269067,0.9163267242197135
1997,Santa Inês,22822,23889,24322,0.9553350914646909,0.9383274401776169
1997,São João dos Patos,14225,14795,14482,0.9614734707671511,0.982253832343599
1997,São Luís,71774,76875,73754,0.9336455284552846,0.973153998427204
1997,Tïmon,7096,7253,7483,0.9783537846408382,0.948282774288387
1997,Viana,11476,11638,13574,0.9860800824884001,0.845439811404155
1997,Zé Doca,12874,13576,13554,0.9482911019446081,0.9498303083960454
1998,Açailândia,7023,7116,9475,0.9869308600337268,0.7412137203166227
1998,Bacabal,19722,20101,20741,0.9811452166558877,0.9508702569789306
1998,Balsas,12713,12799,13058,0.993280725056645,0.9735794149180579
1998,Barra do Corda,12529,13140,13078,0.9535007610350076,0.9580211041443646
1998,Caxias,23841,25728,24156,0.9266557835820896,0.9869597615499255
1998,Chapadinha,16190,18301,16727,0.884651111961095,0.9678962156991691
1998,Codó,15421,15492,18311,0.995416989413891,0.8421713723991043
1998,Imperatriz,30268,32016,30766,0.9454022988505747,0.9838133003965417
1998,Itapecuru Mirim,19107,19776,20796,0.9661711165048543,0.9187824581650318
1998,Pedreiras,18265,18993,19517,0.9616700889801506,0.9358507967413024
1998,Pinheiro,17240,18014,17969,0.9570334184523148,0.9594301296677611
1998,Presidente Dutra,17863,18103,20037,0.9867425288626195,0.8915007236612267
1998,Rosario,9910,10149,11027,0.9764508818602818,0.898703183096037
1998,Santa Inês,24543,25576,26415,0.9596105724116359,0.9291311754684838
1998,São João dos Patos,14373,14923,14715,0.963144139918247,0.9767584097859328
1998,São Luís,72755,82965,73327,0.8769360573735913,0.9921993263054536
1998,Tïmon,8497,9207,8868,0.922884761594439,0.9581641858367163
1998,Viana,13768,13899,14713,0.9905748615008274,0.9357710867939917
1998,Zé Doca,11372,11726,14328,0.9698106771277503,0.7936906756002233
1999,Açailândia,8919,8968,11778,0.9945361284567351,0.7572592969943963
1999,Bacabal,16803,17078,18261,0.9838974118749269,0.9201577131591917
1999,Balsas,12168,12184,12713,0.9986868023637557,0.9571304963423267
1999,Barra do Corda,12997,13576,13523,0.9573512080141426,0.9611033054795534
1999,Caxias,20544,22367,20914,0.9184959985693208,0.9823085014822607
1999,Chapadinha,20152,22582,20805,0.892392170755469,0.9686133141071858
1999,Codó,16459,16625,18987,0.990015037593985,0.8668562700795281
1999,Imperatriz,31677,34050,32363,0.9303083700440529,0.9788029539906683
1999,Itapecuru Mirim,16824,17573,18705,0.9573777954817049,0.8994386527666399
1999,Pedreiras,13384,13866,15368,0.9652387133996827,0.8709005726184279
1999,Pinheiro,17869,18285,18902,0.9772491112934099,0.945349698444609
1999,Presidente Dutra,14961,15154,16895,0.9872640886894549,0.8855282627996449
1999,Rosario,8584,8655,10022,0.9917966493356442,0.8565156655358211
1999,Santa Inês,23249,24019,25720,0.9679420458803447,0.9039269051321929
1999,São João dos Patos,15114,15528,15521,0.973338485316847,0.9737774627923459
1999,São Luís,84196,98776,84378,0.8523932939175508,0.9978430396548863
1999,Tïmon,11441,11730,11805,0.9753623188405797,0.969165607793308
1999,Viana,14621,14803,15913,0.9877051948929271,0.9188085213347578
1999,Zé Doca,10156,10234,13480,0.9923783466875122,0.7534124629080119
2000,Açailândia,12283,12324,13706,0.9966731580655631,0.8961768568510141
2000,Bacabal,17231,17601,18711,0.9789784671325493,0.9209021431243654
2000,Balsas,12681,12699,13074,0.9985825655563431,0.9699403396053236
2000,Barra do Corda,12699,13350,13274,0.9512359550561797,0.9566822359499774
2000,Caxias,17832,19287,18131,0.9245605848498989,0.9835089073961722
2000,Chapadinha,20638,21046,21393,0.9806138933764136,0.9647080820829244
2000,Codó,16642,16820,18595,0.9894173602853745,0.8949717666039257
2000,Imperatriz,31511,32779,31829,0.9613166966655481,0.9900091111879104
2000,Itapecuru Mirim,15109,15421,17568,0.9797678490370274,0.8600295992714025
2000,Pedreiras,13968,14386,15174,0.9709439733073821,0.9205219454329775
2000,Pinheiro,17557,17855,18749,0.9833099971996639,0.9364232759080484
2000,Presidente Dutra,15529,15684,17225,0.9901173170109666,0.9015384615384615
2000,Rosario,8977,9036,10892,0.9934705621956618,0.8241828865222182
2000,Santa Inês,23415,24226,25675,0.9665235697184843,0.9119766309639727
2000,São João dos Patos,13573,13992,13945,0.9700543167524299,0.9733237719612764
2000,São Luís,85814,100110,85946,0.8571970832084707,0.9984641519093385
2000,Tïmon,9726,10042,10157,0.9685321649073889,0.957566210495225
2000,Viana,15521,15634,16957,0.9927721632339772,0.9153152090582061
2000,Zé Doca,11557,11684,12975,0.9891304347826086,0.8907129094412332
2001,Açailândia,11918,11996,13216,0.9934978326108703,0.9017857142857143
2001,Bacabal,15398,15737,16880,0.9784584101162864,0.9122037914691943
2001,Balsas,13207,13249,13634,0.9968299494301457,0.9686812380812674
2001,Barra do Corda,10821,11099,11488,0.9749526984413011,0.9419394150417827
2001,Caxias,15711,16588,16115,0.9471304557511454,0.9749301892646602
2001,Chapadinha,19404,19783,20288,0.9808421371884952,0.9564274447949527
2001,Codó,17004,17209,18673,0.9880876285664478,0.9106196112033417
2001,Imperatriz,29245,30532,29549,0.9578475042578278,0.9897120037903144
2001,Itapecuru Mirim,14943,15087,17395,0.990455358918274,0.859039954009773
2001,Pedreiras,14562,14966,15474,0.973005479085928,0.9410624272974021
2001,Pinheiro,17475,17752,18851,0.9843961243803515,0.927006524852793
2001,Presidente Dutra,16738,16883,18034,0.9914114790025469,0.9281357435954308
2001,Rosario,9816,9909,12092,0.9906145927944293,0.8117763810783989
2001,Santa Inês,21004,21535,22871,0.9753424657534246,0.9183682392549517
2001,São João dos Patos,15290,15777,15619,0.96913228116879,0.9789359113899737
2001,São Luís,90195,104979,90360,0.8591718343668734,0.9981739707835325
2001,Tïmon,10935,11221,11368,0.9745120755725871,0.9619106263194933
2001,Viana,12267,12407,13707,0.988716047392601,0.8949441891004596
2001,Zé Doca,14063,14202,15297,0.9902126461061822,0.919330587696934
2002,Açailândia,11081,11112,12853,0.9972102231821455,0.8621333540807593
2002,Bacabal,16587,16912,18345,0.980782876064333,0.9041700735895339
2002,Balsas,12448,12490,13004,0.9966373098478783,0.9572439249461704
2002,Barra do Corda,12199,12694,12865,0.9610051993067591,0.9482316362223085
2002,Caxias,16177,17213,16637,0.9398129320862139,0.9723507843962252
2002,Chapadinha,19212,19657,20116,0.9773617540825151,0.9550606482402068
2002,Codó,15983,16193,17257,0.9870314333353918,0.9261748855536883
2002,Imperatriz,29364,31327,29706,0.9373383981868676,0.9884871743082205
2002,Itapecuru Mirim,14616,14718,17202,0.9930697105584998,0.8496686431810254
2002,Pedreiras,15603,16172,16571,0.9648157308929013,0.9415846961559351
2002,Pinheiro,18424,18711,19667,0.9846614291058735,0.9367976813952306
2002,Presidente Dutra,15987,16080,17489,0.9942164179104478,0.9141174452513008
2002,Rosario,9707,9825,12018,0.9879898218829517,0.807705109003162
2002,Santa Inês,22195,22636,24327,0.9805177593214349,0.912360751428454
2002,São João dos Patos,14636,15322,14989,0.9552277770526041,0.9764493962238975
2002,São Luís,86134,101055,86320,0.8523477314333778,0.9978452270620946
2002,Tïmon,11915,12337,12400,0.9657939531490638,0.9608870967741936
2002,Viana,12497,12626,14050,0.9897829874861397,0.8894661921708185
2002,Zé Doca,12774,12823,14087,0.9961787413241832,0.9067934975509335
2003,Açailândia,10139,10156,11790,0.9983261126427727,0.8599660729431722
2003,Bacabal,16763,17184,18239,0.9755004655493482,0.9190745106639618
2003,Balsas,11864,11899,12311,0.9970585763509539,0.9636910080415888
2003,Barra do Corda,11724,12279,12449,0.954800879550452,0.9417623905534581
2003,Caxias,16800,17801,17252,0.9437672040896579,0.9738001391143056
2003,Chapadinha,19507,19971,20592,0.9767663111511692,0.9473096348096348
2003,Codó,13890,14087,15426,0.9860154752608788,0.9004278490859587
2003,Imperatriz,30928,32768,31314,0.94384765625,0.987673245193843
2003,Itapecuru Mirim,13093,13152,15903,0.9955139902676399,0.8233037791611646
2003,Pedreiras,14263,14725,15179,0.9686247877758913,0.9396534686079452
2003,Pinheiro,13767,13941,15185,0.9875188293522703,0.9066183733947974
2003,Presidente Dutra,15583,15639,17103,0.9964192083892832,0.9111267029176168
2003,Rosario,8591,8696,11345,0.9879254829806807,0.7572498898193036
2003,Santa Inês,21292,21530,23846,0.9889456572224803,0.8928960832005368
2003,São João dos Patos,12439,13106,12808,0.9491072791088051,0.9711898813241724
2003,São Luís,85525,102051,85630,0.8380613614761246,0.9987737942309938
2003,Tïmon,10792,11256,11273,0.9587775408670931,0.9573316774594163
2003,Viana,11871,11960,13586,0.9925585284280937,0.8737671132047696
2003,Zé Doca,11435,11476,12446,0.9964273265946323,0.9187690824361241
2004,Açailândia,10593,10603,11840,0.9990568706969726,0.894679054054054
2004,Bacabal,16160,16768,17447,0.9637404580152672,0.9262337364589901
2004,Balsas,12612,12620,13087,0.9993660855784469,0.9637044395201345
2004,Barra do Corda,11618,12100,12212,0.9601652892561984,0.9513593187029151
2004,Caxias,14501,15288,15020,0.9485217163788592,0.9654460719041278
2004,Chapadinha,18460,18883,19475,0.9775988984801144,0.9478818998716303
2004,Codó,14638,14818,16242,0.9878526116884869,0.9012436892008373
2004,Imperatriz,28776,30105,29114,0.955854509217738,0.988390465068352
2004,Itapecuru Mirim,13005,13076,15931,0.994570204955644,0.8163329357855753
2004,Pedreiras,10109,10281,11059,0.9832701099114872,0.9140971154715616
2004,Pinheiro,16179,16493,17829,0.9809616200812465,0.9074541477368332
2004,Presidente Dutra,16306,16373,17638,0.9959078971477432,0.9244812336999659
2004,Rosario,8067,8133,11116,0.9918849133161195,0.725710687297589
2004,Santa Inês,19728,20698,22299,0.9531355686539762,0.8847033499260056
2004,São João dos Patos,12756,13261,13071,0.9619184073599276,0.9759008492081708
2004,São Luís,84298,101652,84354,0.8292802896155511,0.9993361310666952
2004,Tïmon,9643,10153,10030,0.9497685413178371,0.9614157527417747
2004,Viana,11875,11971,13787,0.9919806198312588,0.8613186334953217
2004,Zé Doca,11857,11872,13597,0.9987365229110512,0.8720305949841877
2005,Açailândia,10290,10336,12021,0.9955495356037152,0.8560019965061143
2005,Bacabal,15019,15452,16553,0.9719777375097075,0.9073279768017882
2005,Balsas,13154,13158,13628,0.9996960024319805,0.9652186674493689
2005,Barra do Corda,9086,9416,9845,0.9649532710280374,0.9229050279329609
2005,Caxias,15963,17127,16391,0.932037134349273,0.97388810932829
2005,Chapadinha,18938,19253,20084,0.983638913416091,0.9429396534554869
2005,Codó,13596,13833,15158,0.982867057037519,0.8969521044992743
2005,Imperatriz,27025,28773,27341,0.9392486011191047,0.9884422661936286
2005,Itapecuru Mirim,13102,13236,16181,0.9898760954971291,0.809715097954391
2005,Pedreiras,11664,11950,12795,0.9760669456066946,0.9116060961313013
2005,Pinheiro,14781,14984,16337,0.9864522156967432,0.9047560751667993
2005,Presidente Dutra,14993,15105,16098,0.9925852366765971,0.9313579326624425
2005,Rosario,8704,8734,12157,0.996565147698649,0.7159661100600477
2005,Santa Inês,17748,18145,20590,0.9781206944061726,0.8619718309859155
2005,São João dos Patos,10876,10992,11347,0.9894468704512372,0.9584912311624217
2005,São Luís,82507,101675,82551,0.8114777477255962,0.9994669961599496
2005,Tïmon,8852,9342,9307,0.9475487047741383,0.9511120661867412
2005,Viana,11643,11695,13658,0.9955536554082941,0.8524674183628642
2005,Zé Doca,14706,14819,15983,0.9923746541601998,0.920102609022086
2006,Açailândia,11912,11968,13831,0.9953208556149733,0.8612537054442918
2006,Bacabal,15299,15772,16857,0.9700101445599797,0.9075754879278638
2006,Balsas,15407,15410,16169,0.999805321219987,0.9528727812480673
2006,Barra do Corda,11188,11554,12071,0.9683226588194564,0.9268494739458205
2006,Caxias,15359,16538,15914,0.9287096384085137,0.9651250471283147
2006,Chapadinha,20589,21048,22023,0.9781927023945268,0.9348862552785724
2006,Codó,14163,14494,15904,0.9771629639850973,0.8905306841046278
2006,Imperatriz,27672,29824,27990,0.927843347639485,0.9886387995712754
2006,Itapecuru Mirim,14126,14197,17610,0.9949989434387546,0.8021578648495173
2006,Pedreiras,11594,11891,13140,0.9750231267345051,0.8823439878234399
2006,Pinheiro,17572,17748,19371,0.9900833896777101,0.907129213773166
2006,Presidente Dutra,17794,17903,19005,0.9939116349215216,0.936279926335175
2006,Rosario,9808,9848,13349,0.9959382615759546,0.734736684395835
2006,Santa Inês,17925,17980,21113,0.9969410456062291,0.8490029839435419
2006,São João dos Patos,16619,16765,17087,0.9912913808529675,0.9726107567156318
2006,São Luís,82236,104240,82286,0.7889102072141213,0.999392363220961
2006,Tïmon,10927,11467,11408,0.9529083456876254,0.957836605890603
2006,Viana,13569,13638,15802,0.9949406071271447,0.8586887735729655
2006,Zé Doca,12724,12748,14103,0.9981173517414497,0.9022193859462526
2007,Açailândia,12931,12970,14896,0.9969930609097918,0.8680853920515574
2007,Bacabal,14698,15137,16317,0.970998216291207,0.9007783293497579
2007,Balsas,15463,15464,16188,0.9999353336782204,0.9552137385717816
2007,Barra do Corda,10365,10703,11181,0.9684200691394936,0.927019050174403
2007,Caxias,16041,17273,16782,0.9286748103977306,0.9558455488022881
2007,Chapadinha,18546,19319,19961,0.959987576996739,0.9291117679474976
2007,Codó,14747,15111,16424,0.9759115875852028,0.8978933268387725
2007,Imperatriz,24445,26770,24790,0.9131490474411654,0.9860830980233966
2007,Itapecuru Mirim,14996,15038,18752,0.9972070754089639,0.7997013651877133
2007,Pedreiras,12574,12875,14146,0.976621359223301,0.888873179697441
2007,Pinheiro,17909,18142,19774,0.9871568735530812,0.905684231819561
2007,Presidente Dutra,18327,18376,19638,0.9973334784501524,0.933241674304919
2007,Rosario,12379,12410,15819,0.9975020145044319,0.7825399835640685
2007,Santa Inês,18734,18789,21719,0.9970727553355687,0.8625627330908421
2007,São João dos Patos,18883,18948,19393,0.9965695587924847,0.9737018511834167
2007,São Luís,78496,100329,78528,0.7823859502237638,0.9995925020374898
2007,Tïmon,11736,12288,12100,0.955078125,0.9699173553719008
2007,Viana,12311,12374,14422,0.9949086794892517,0.8536264041048398
2007,Zé Doca,12965,12975,14461,0.9992292870905588,0.8965493396030704
2008,Açailândia,13940,13997,16135,0.9959276987925985,0.8639603346761698
2008,Bacabal,14665,15106,16055,0.9708063021316033,0.9134226097788851
2008,Balsas,14399,14414,15243,0.9989593450811711,0.9446303221150693
2008,Barra do Corda,11342,11647,12202,0.9738129990555507,0.9295197508605146
2008,Caxias,16216,17746,16972,0.9137833878057027,0.9554560452510017
2008,Chapadinha,18888,19884,20134,0.9499094749547374,0.9381146319658289
2008,Codó,14296,14587,15821,0.9800507301021457,0.903609127109538
2008,Imperatriz,28524,31289,28850,0.9116302854038161,0.9887001733102253
2008,Itapecuru Mirim,13197,13281,16629,0.9936751750621188,0.7936135666606531
2008,Pedreiras,11277,11585,12990,0.9734138972809667,0.8681293302540416
2008,Pinheiro,17856,18147,19766,0.9839642916184493,0.9033694222402104
2008,Presidente Dutra,19838,19920,21277,0.9958835341365462,0.932368285002585
2008,Rosario,11107,11237,14225,0.9884310759099404,0.7808084358523726
2008,Santa Inês,17419,17465,20048,0.997366160893215,0.868864724660814
2008,São João dos Patos,15017,15108,15609,0.9939767010855176,0.9620731629188288
2008,São Luís,71512,91570,71559,0.7809544610680353,0.9993431993180453
2008,Tïmon,11490,11903,11848,0.965302864823994,0.9697839297771775
2008,Viana,11894,12092,14045,0.9836255375454847,0.8468494126023496
2008,Zé Doca,11138,11170,12740,0.9971351835273052,0.87425431711146
2009,Açailândia,13896,13938,16120,0.9969866551872578,0.8620347394540943
2009,Bacabal,14289,14705,15702,0.971710302618157,0.9100114635078334
2009,Balsas,15976,15993,16953,0.9989370349527918,0.9423700819913879
2009,Barra do Corda,11848,12193,12754,0.9717050766833429,0.9289634624431551
2009,Caxias,17583,19090,18145,0.9210581456259822,0.9690272802424911
2009,Chapadinha,18438,19156,19554,0.962518271037795,0.9429272783062289
2009,Codó,12939,13178,14497,0.9818637122476855,0.8925294888597641
2009,Imperatriz,31482,34418,31851,0.9146957987099773,0.9884148064424979
2009,Itapecuru Mirim,14601,14684,18171,0.9943475892127486,0.8035331021958065
2009,Pedreiras,14330,14833,15747,0.966089125598328,0.9100146059566901
2009,Pinheiro,20778,21271,22606,0.9768229044238634,0.9191365124303282
2009,Presidente Dutra,20206,20291,21678,0.9958109506677838,0.9320970569240705
2009,Rosario,11362,11488,14306,0.9890320334261838,0.7942122186495176
2009,Santa Inês,20284,20384,23110,0.9950941915227629,0.8777152747728256
2009,São João dos Patos,17058,17226,17648,0.9902473005921282,0.9665684496826836
2009,São Luís,77063,96649,77152,0.7973491707105091,0.9988464330153464
2009,Tïmon,11424,11748,11817,0.9724208375893769,0.9667428281289667
2009,Viana,13510,13553,15766,0.9968272707149709,0.856907268806292
2009,Zé Doca,12232,12478,13699,0.9802853021317519,0.8929118913789328
2010,Açailândia,15756,15823,18270,0.9957656575870568,0.8623973727422003
2010,Bacabal,15506,15810,17306,0.9807716635041113,0.8959898301167225
2010,Balsas,16711,16726,17975,0.9991031926342222,0.9296801112656468
2010,Barra do Corda,13250,13545,14171,0.9782207456626061,0.9350081151647731
2010,Caxias,17680,19482,18275,0.9075043630017452,0.9674418604651163
2010,Chapadinha,18053,18981,19252,0.9511090037405827,0.9377207562850612
2010,Codó,13445,13577,15355,0.9902776754805922,0.8756105503093455
2010,Imperatriz,30962,34495,31398,0.8975793593274387,0.986113765207975
2010,Itapecuru Mirim,17920,18016,21667,0.9946714031971581,0.8270641990123229
2010,Pedreiras,16526,17064,17808,0.9684716361931551,0.9280098831985625
2010,Pinheiro,21937,22519,23806,0.9741551578666904,0.9214903805763253
2010,Presidente Dutra,19146,19392,20623,0.9873143564356436,0.9283809339087427
2010,Rosario,15090,15238,18240,0.9902874392964957,0.8273026315789473
2010,Santa Inês,22343,22686,25057,0.9848805430662082,0.8916869537454604
2010,São João dos Patos,17408,17493,18145,0.9951409135082604,0.9593827500688895
2010,São Luís,76145,96778,76265,0.7868007191717126,0.9984265390415
2010,Tïmon,10834,11021,11332,0.9830323927048362,0.9560536533709848
2010,Viana,14044,14119,16605,0.9946880090657979,0.8457693465823547
2010,Zé Doca,15353,15660,16875,0.9803959131545339,0.9098074074074074
2011,Açailândia,15761,15850,18624,0.994384858044164,0.8462736254295533
2011,Bacabal,14922,15201,16767,0.9816459443457667,0.8899624261943102
2011,Balsas,16428,16444,17866,0.9990270007297495,0.919511922086645
2011,Barra do Corda,13250,13486,14817,0.9825003707548569,0.8942430991428765
2011,Caxias,18318,20245,18915,0.904816003951593,0.9684377478191911
2011,Chapadinha,18954,19844,20374,0.9551501713364241,0.9303033277706881
2011,Codó,13964,14142,16573,0.9874133785886013,0.8425752730344537
2011,Imperatriz,32098,36412,32527,0.8815225749752829,0.9868109570510653
2011,Itapecuru Mirim,16839,16917,20661,0.9953892534137259,0.8150137941048352
2011,Pedreiras,18085,18662,20215,0.9690815561033116,0.8946326984912194
2011,Pinheiro,23362,23817,25427,0.9808959986564219,0.9187871160577339
2011,Presidente Dutra,23049,26239,24529,0.8784252448645147,0.9396632557381059
2011,Rosario,16941,17089,20343,0.9913394581309615,0.8327680283144079
2011,Santa Inês,24795,25002,27713,0.9917206623470123,0.894706455454119
2011,São João dos Patos,17840,17925,19563,0.995258019525802,0.9119255737872515
2011,São Luís,78538,100285,78647,0.7831480281198584,0.9986140602947347
2011,Tïmon,9837,9886,10368,0.995043495852721,0.9487847222222222
2011,Viana,14497,14572,16980,0.9948531430139994,0.8537691401648999
2011,Zé Doca,18080,18390,19499,0.9831430125067971,0.9272270372839633
2012,Açailândia,14823,14880,18180,0.9961693548387097,0.8153465346534653
2012,Bacabal,15636,15934,17508,0.981297853646291,0.8930774503084304
2012,Balsas,16474,16495,18285,0.998726886935435,0.9009570686354935
2012,Barra do Corda,13016,13524,14475,0.9624371487725525,0.8992055267702936
2012,Caxias,20157,21870,20741,0.9216735253772291,0.9718432091027434
2012,Chapadinha,17338,18236,18928,0.9507567449001975,0.9159974640743872
2012,Codó,13334,13987,15614,0.9533137913777079,0.853977199948764
2012,Imperatriz,29925,35039,30497,0.8540483461285996,0.9812440567924714
2012,Itapecuru Mirim,16207,16335,20229,0.9921640648913376,0.8011765287458599
2012,Pedreiras,17985,18524,20021,0.9709026128266033,0.8983067778832227
2012,Pinheiro,21352,21812,23950,0.9789106913625527,0.8915240083507306
2012,Presidente Dutra,19346,22106,21105,0.8751470189088935,0.916654821132433
2012,Rosário,16990,17108,20505,0.9931026420388123,0.8285783955132895
2012,Santa Inês,22400,22591,25481,0.9915453056526935,0.8790863780856324
2012,São João dos Patos,17372,17450,19246,0.9955300859598853,0.9026291177387509
2012,São Luís,77988,101189,78130,0.770716184565516,0.9981825163189556
2012,Timon,8024,8059,8496,0.9956570294081152,0.9444444444444444
2012,Viana,12246,12397,14946,0.9878196337823667,0.8193496587715777
2012,Zé Doca,16580,16888,18087,0.9817621980104216,0.9166804887488251
2013,Açailândia,16863,16937,20643,0.995630867331877,0.8168870803662258
2013,Bacabal,14307,14530,17050,0.9846524432209223,0.8391202346041056
2013,Balsas,15557,15567,17306,0.9993576154686196,0.898936784930082
2013,Barra do Corda,15625,16301,17025,0.9585301515244463,0.9177679882525698
2013,Caxias,17610,18670,18241,0.9432244242099626,0.9654075982676389
2013,Chapadinha,17331,18162,18997,0.9542451271886356,0.9123019424119598
2013,Codó,16800,20224,18303,0.8306962025316456,0.9178823143746927
2013,Imperatriz,31490,36810,32380,0.8554740559630535,0.9725138974675726
2013,Itapecuru Mirim,16594,16803,21227,0.9875617449265012,0.7817402364912611
2013,Pedreiras,19593,20249,22222,0.967603338436466,0.8816938169381694
2013,Pinheiro,23638,24373,26283,0.9698436794813934,0.8993646083019442
2013,Presidente Dutra,21053,23450,22837,0.8977825159914712,0.921881157770285
2013,Rosário,17243,17404,20677,0.990749253045277,0.8339217488030178
2013,Santa Inês,25914,26251,29371,0.987162393813569,0.8822988662285929
2013,São João dos Patos,18401,18461,20082,0.9967499052055685,0.9162931978886565
2013,São Luís,72156,95070,72396,0.7589775954559798,0.9966848997182165
2013,Timon,9517,9636,9958,0.9876504773765048,0.9557139987949388
2013,Viana,13119,13213,16056,0.9928857942934989,0.8170777279521674
2013,Zé Doca,15461,15886,16943,0.9732468840488481,0.9125302484801983
2014,Açailândia,15434,15546,19264,0.9927955744242892,0.8011835548172758
2014,Bacabal,13939,14181,16953,0.9829349129116424,0.8222143573408837
2014,Balsas,14565,14585,16469,0.9986287281453549,0.8843888517821361
2014,Barra do Corda,17363,18218,19000,0.9530683938961466,0.9138421052631579
2014,Caxias,17279,18305,18160,0.9439497405080579,0.9514867841409692
2014,Chapadinha,17779,18526,19897,0.9596782899708518,0.8935517917273961
2014,Codó,16555,20387,18226,0.8120370824545053,0.908317787775705
2014,Imperatriz,32579,38131,33662,0.8543966851118513,0.9678272235755451
2014,Itapecuru Mirim,17035,17365,21723,0.9809962568384681,0.7841918703678129
2014,Pedreiras,18199,18709,21089,0.9727403923245497,0.862961733605197
2014,Pinheiro,23401,24146,26239,0.9691460283276733,0.8918403902587752
2014,Presidente Dutra,20124,22577,22127,0.8913496035788634,0.9094771094138383
2014,Rosário,16480,16731,20036,0.9849979080748311,0.8225194649630665
2014,Santa Inês,26805,27829,29997,0.9632038520967336,0.8935893589358936
2014,São João dos Patos,17294,17343,19140,0.9971746525975899,0.9035527690700105
2014,São Luís,74439,99282,74707,0.7497733728168248,0.9964126520941813
2014,Timon,9071,9274,9656,0.9781108475307311,0.9394159072079536
2014,Viana,12435,12503,15592,0.9945613052867311,0.7975243714725501
2014,Zé Doca,16686,17090,18791,0.9763604447045056,0.887978287478048
2015,Açailândia,15101,15307,19531,0.9865421049193179,0.773181096718038
2015,Bacabal,12559,12809,15923,0.9804824732609884,0.788733278904729
2015,Balsas,15988,16044,17989,0.9965095986038395,0.8887653566068153
2015,Barra do Corda,15459,16112,17559,0.9594712015888779,0.8804032120280199
2015,Caxias,17041,18115,17939,0.9407121170300856,0.9499414683092703
2015,Chapadinha,18402,18991,20868,0.9689853088304986,0.881828637147786
2015,Codó,15335,19391,17169,0.7908307977927904,0.8931795678257324
2015,Imperatriz,31283,37726,32284,0.829215925356518,0.9689939288811795
2015,Itapecuru Mirim,16474,17268,21304,0.9540189946722261,0.7732820127675554
2015,Pedreiras,15616,16416,18839,0.9512670565302144,0.8289187324167949
2015,Pinheiro,25032,26057,28181,0.9606631615304908,0.8882580462013413
2015,Presidente Dutra,22074,24868,24299,0.8876467749718514,0.9084324457796618
2015,Rosário,15641,15985,19761,0.9784798248357836,0.7915085268964122
2015,Santa Inês,25826,26639,29428,0.9694808363677315,0.8775995650400978
2015,São João dos Patos,18174,18292,20359,0.9935490924994533,0.8926764575863254
2015,São Luís,74605,102321,75077,0.729126963184488,0.9937131211955725
2015,Timon,8726,8872,9408,0.9835437330928765,0.9275085034013606
2015,Viana,12512,12605,16016,0.9926219754065847,0.7812187812187812
2015,Zé Doca,18797,19283,21167,0.9747964528341025,0.8880332593187509
2016,Açailândia,14961,15339,19889,0.975356933307256,0.7522248479058776
2016,Bacabal,11099,11437,14724,0.9704467954883274,0.7538033143167617
2016,Balsas,14758,14841,16922,0.994407384947106,0.8721191348540361
2016,Barra do Corda,13455,14520,16021,0.9266528925619835,0.8398352162786343
2016,Caxias,17444,19365,18381,0.9008004131164472,0.9490234481257821
2016,Chapadinha,16898,17383,19870,0.9720991773571881,0.8504277805737293
2016,Codó,14684,18898,16854,0.7770134405757223,0.8712471816779399
2016,Imperatriz,29221,36397,30462,0.8028408934802319,0.9592607182719454
2016,Itapecuru Mirim,14687,15634,19762,0.9394268901112959,0.7431940087035726
2016,Pedreiras,14899,15936,18371,0.9349272088353414,0.8110064776005661
2016,Pinheiro,23974,26422,27001,0.9073499356596776,0.8878930409984815
2016,Presidente Dutra,21802,24780,24482,0.8798224374495561,0.8905318192958092
2016,Rosário,14967,15550,19507,0.9625080385852091,0.7672630337827446
2016,Santa Inês,20614,21270,24790,0.969158439116126,0.8315449778136346
2016,São João dos Patos,17291,17521,19868,0.9868728953826836,0.8702939400040266
2016,São Luís,72719,102557,73565,0.7090593523601509,0.9884999660164481
2016,Timon,7726,7823,8685,0.9876006647066343,0.8895797351755901
2016,Viana,9819,9928,13804,0.9890209508460919,0.7113155607070414
2016,Zé Doca,15978,16561,19204,0.9647968117867278,0.8320141637158925
2017,Açailândia,14706,15086,19659,0.9748110831234257,0.7480543262627805
2017,Bacabal,17084,18149,20418,0.9413190809410987,0.8367127044764423
2017,Balsas,15674,15772,17931,0.9937864570124271,0.8741286040934694
2017,Barra do Corda,14551,15326,17132,0.9494323372047501,0.8493462526266635
2017,Caxias,17177,19521,18276,0.8799241842118743,0.9398664915736485
2017,Chapadinha,15931,16590,19150,0.9602772754671489,0.8319060052219321
2017,Codó,17351,22011,19617,0.7882876743446459,0.8844879441300912
2017,Imperatriz,34490,41920,35821,0.8227576335877863,0.9628430250411769
2017,Itapecuru Mirim,15773,16641,21528,0.9478396730965687,0.7326737272389446
2017,Pedreiras,16553,17385,21064,0.9521426517112453,0.785843144701861
2017,Pinheiro,26977,29704,30191,0.9081941826016698,0.8935444337716538
2017,Presidente Dutra,23360,26617,26511,0.8776345944321299,0.8811436762098751
2017,Rosario,15043,16116,20078,0.9334202035244478,0.7492280107580437
2017,Santa Inês,23694,25621,27365,0.9247882596307716,0.8658505390096839
2017,São João dos Patos,19452,19589,22444,0.9930062790341518,0.8666904295134558
2017,São Luís,77263,108755,78557,0.710431704289458,0.9835278842114643
2017,Tïmon,8988,9085,10304,0.9893230599889928,0.8722826086956522
2017,Viana,13063,13235,17651,0.9870041556479033,0.7400713840575605
2017,Zé Doca,12213,12630,16056,0.9669833729216152,0.7606502242152466
2018,Açailândia,15230,15781,20048,0.9650845953995311,0.7596767757382282
2018,Bacabal,16553,17595,19672,0.9407786302926968,0.8414497763318423
2018,Balsas,19217,19498,21224,0.9855882654631244,0.9054372408594045
2018,Barra do Corda,15005,15826,17716,0.9481233413370403,0.8469744863400316
2018,Caxias,17550,20765,18789,0.8451721647002167,0.9340571611049018
2018,Chapadinha,13346,14082,16839,0.9477346967760262,0.7925648791495932
2018,Codó,18076,22981,20421,0.7865628127583656,0.885167229812448
2018,Imperatriz,35244,42371,36617,0.831795331712728,0.9625037550864353
2018,Itapecuru Mirim,15393,16054,21679,0.9588264606951539,0.7100419761059089
2018,Pedreiras,19327,20370,23977,0.9487972508591065,0.8060641448054385
2018,Pinheiro,27370,30112,30546,0.9089399574920297,0.8960256662083416
2018,Presidente Dutra,22562,26091,26251,0.8647426315587751,0.8594720201135195
2018,Rosario,16737,17687,22030,0.9462882342963759,0.7597367226509305
2018,Santa Inês,26800,29015,30641,0.9236601757711529,0.874645083385007
2018,São João dos Patos,20156,20366,23811,0.9896886968476873,0.8464995170299442
2018,São Luís,81178,113782,82413,0.7134520398657082,0.9850145001395411
2018,Tïmon,10259,10367,11650,0.9895823285424906,0.8806008583690987
2018,Viana,13353,13547,18152,0.9856794862331143,0.7356214191273689
2018,Zé Doca,15449,15865,19679,0.9737787582729278,0.7850500533563697
2019,Açailândia,14901,15456,19444,0.9640916149068323,0.7663546595350751
2019,Bacabal,15924,17117,19023,0.9303032073377344,0.8370919413341744
2019,Balsas,19034,19241,21352,0.9892417234031495,0.8914387411015362
2019,Barra do Corda,14070,15015,16829,0.9370629370629371,0.8360568067027155
2019,Caxias,17345,20028,18986,0.866037547433593,0.913567892131044
2019,Chapadinha,12969,14661,16346,0.8845917740945365,0.7934051144010767
2019,Codó,18534,23501,21010,0.7886472916046126,0.8821513564969062
2019,Imperatriz,34685,41831,36179,0.8291697544882981,0.9587053262942591
2019,Itapecuru Mirim,11914,12363,19167,0.9636819542182318,0.6215891897532216
2019,Pedreiras,17488,18471,22470,0.946781441178063,0.7782821539830885
2019,Pinheiro,24925,27134,28277,0.9185892238519938,0.8814584291119991
2019,Presidente Dutra,20423,23864,23880,0.8558079114984914,0.8552345058626466
2019,Rosario,15361,16112,20640,0.9533887785501489,0.744234496124031
2019,Santa Inês,23883,26011,27814,0.9181884587289992,0.8586682965413102
2019,São João dos Patos,22590,22849,25952,0.9886647118035801,0.8704531442663379
2019,São Luís,83404,117358,84683,0.7106801411066992,0.9848966144326489
2019,Tïmon,9955,10078,11183,0.9877951974598135,0.8901904676741482
2019,Viana,13575,13910,18027,0.9759166067577283,0.7530371110001665
2019,Zé Doca,14328,14765,18503,0.9704029800203183,0.7743609144463061
2020,Açailândia,5323,5493,6717,0.969051520116512,0.7924668750930475
2020,Bacabal,5203,5609,6298,0.9276163308967731,0.8261352810416005
2020,Balsas,7360,7434,8077,0.9900457358084477,0.9112294168626965
2020,Barra do Corda,4487,4848,5441,0.925536303630363,0.8246645837162286
2020,Caxias,5992,7018,6554,0.853804502707324,0.9142508391821789
2020,Chapadinha,3857,4308,5087,0.8953110492107706,0.7582071948103007
2020,Codó,5442,7168,6383,0.7592075892857143,0.8525771580761398
2020,Imperatriz,11734,13873,12256,0.8458156130613422,0.9574086161879896
2020,Itapecuru Mirim,3377,3492,5768,0.9670675830469645,0.5854715672676838
2020,Pedreiras,4755,5055,6513,0.9406528189910979,0.7300783049286044
2020,Pinheiro,7297,8010,8416,0.9109862671660425,0.8670389733840305
2020,Presidente Dutra,4657,5775,6099,0.8064069264069265,0.7635677979996721
2020,Rosario,4646,4925,6547,0.9433502538071066,0.709638002138384
2020,Santa Inês,4112,4563,5628,0.901161516546132,0.7306325515280739
2020,São João dos Patos,6299,6483,7333,0.9716180780502853,0.8589935906177554
2020,São Luís,29781,42339,30194,0.7033940338694821,0.9863217857852553
2020,Tïmon,3422,3450,3853,0.9918840579710145,0.8881391123799637
2020,Viana,4318,4395,5770,0.9824800910125142,0.7483535528596187
2020,Zé Doca,4494,4597,5901,0.9775940830976724,0.7615658362989324
