year,from,to,hospitalizations
1998,"{'latlong': [-59.713461151252574, -5.31150506386977], 'name': 'Leste'}","{'latlong': [-59.713461151252574, -5.31150506386977], 'name': 'Leste'}",6
1998,"{'latlong': [-64.5801949329809, -3.4202327918909665], 'name': 'Central'}","{'latlong': [-64.5801949329809, -3.4202327918909665], 'name': 'Central'}",45
1998,"{'latlong': [-68.70673643686315, -4.527961254801425], 'name': 'Oeste'}","{'latlong': [-68.70673643686315, -4.527961254801425], 'name': 'Oeste'}",12
1999,"{'latlong': [-59.713461151252574, -5.31150506386977], 'name': 'Leste'}","{'latlong': [-59.713461151252574, -5.31150506386977], 'name': 'Leste'}",14
1999,"{'latlong': [-64.5801949329809, -3.4202327918909665], 'name': 'Central'}","{'latlong': [-64.5801949329809, -3.4202327918909665], 'name': 'Central'}",44
1999,"{'latlong': [-68.70673643686315, -4.527961254801425], 'name': 'Oeste'}","{'latlong': [-68.70673643686315, -4.527961254801425], 'name': 'Oeste'}",14
2000,"{'latlong': [-59.713461151252574, -5.31150506386977], 'name': 'Leste'}","{'latlong': [-59.713461151252574, -5.31150506386977], 'name': 'Leste'}",5
2000,"{'latlong': [-59.713461151252574, -5.31150506386977], 'name': 'Leste'}","{'latlong': [-64.5801949329809, -3.4202327918909665], 'name': 'Central'}",1
2000,"{'latlong': [-64.5801949329809, -3.4202327918909665], 'name': 'Central'}","{'latlong': [-64.5801949329809, -3.4202327918909665], 'name': 'Central'}",75
2000,"{'latlong': [-68.70673643686315, -4.527961254801425], 'name': 'Oeste'}","{'latlong': [-64.5801949329809, -3.4202327918909665], 'name': 'Central'}",2
2000,"{'latlong': [-68.70673643686315, -4.527961254801425], 'name': 'Oeste'}","{'latlong': [-68.70673643686315, -4.527961254801425], 'name': 'Oeste'}",64
2001,"{'latlong': [-59.713461151252574, -5.31150506386977], 'name': 'Leste'}","{'latlong': [-59.713461151252574, -5.31150506386977], 'name': 'Leste'}",5
2001,"{'latlong': [-64.5801949329809, -3.4202327918909665], 'name': 'Central'}","{'latlong': [-64.5801949329809, -3.4202327918909665], 'name': 'Central'}",96
2001,"{'latlong': [-68.70673643686315, -4.527961254801425], 'name': 'Oeste'}","{'latlong': [-68.70673643686315, -4.527961254801425], 'name': 'Oeste'}",8
2002,"{'latlong': [-59.713461151252574, -5.31150506386977], 'name': 'Leste'}","{'latlong': [-59.713461151252574, -5.31150506386977], 'name': 'Leste'}",2
2002,"{'latlong': [-64.5801949329809, -3.4202327918909665], 'name': 'Central'}","{'latlong': [-64.5801949329809, -3.4202327918909665], 'name': 'Central'}",98
2002,"{'latlong': [-68.70673643686315, -4.527961254801425], 'name': 'Oeste'}","{'latlong': [-64.5801949329809, -3.4202327918909665], 'name': 'Central'}",1
2002,"{'latlong': [-68.70673643686315, -4.527961254801425], 'name': 'Oeste'}","{'latlong': [-68.70673643686315, -4.527961254801425], 'name': 'Oeste'}",12
2003,"{'latlong': [-59.713461151252574, -5.31150506386977], 'name': 'Leste'}","{'latlong': [-59.713461151252574, -5.31150506386977], 'name': 'Leste'}",7
2003,"{'latlong': [-59.713461151252574, -5.31150506386977], 'name': 'Leste'}","{'latlong': [-64.5801949329809, -3.4202327918909665], 'name': 'Central'}",2
2003,"{'latlong': [-64.5801949329809, -3.4202327918909665], 'name': 'Central'}","{'latlong': [-64.5801949329809, -3.4202327918909665], 'name': 'Central'}",140
2003,"{'latlong': [-68.70673643686315, -4.527961254801425], 'name': 'Oeste'}","{'latlong': [-68.70673643686315, -4.527961254801425], 'name': 'Oeste'}",9
2004,"{'latlong': [-59.713461151252574, -5.31150506386977], 'name': 'Leste'}","{'latlong': [-59.713461151252574, -5.31150506386977], 'name': 'Leste'}",5
2004,"{'latlong': [-64.5801949329809, -3.4202327918909665], 'name': 'Central'}","{'latlong': [-64.5801949329809, -3.4202327918909665], 'name': 'Central'}",187
2004,"{'latlong': [-68.70673643686315, -4.527961254801425], 'name': 'Oeste'}","{'latlong': [-64.5801949329809, -3.4202327918909665], 'name': 'Central'}",1
2004,"{'latlong': [-68.70673643686315, -4.527961254801425], 'name': 'Oeste'}","{'latlong': [-68.70673643686315, -4.527961254801425], 'name': 'Oeste'}",10
2005,"{'latlong': [-59.713461151252574, -5.31150506386977], 'name': 'Leste'}","{'latlong': [-59.713461151252574, -5.31150506386977], 'name': 'Leste'}",6
2005,"{'latlong': [-64.5801949329809, -3.4202327918909665], 'name': 'Central'}","{'latlong': [-64.5801949329809, -3.4202327918909665], 'name': 'Central'}",167
2005,"{'latlong': [-68.70673643686315, -4.527961254801425], 'name': 'Oeste'}","{'latlong': [-68.70673643686315, -4.527961254801425], 'name': 'Oeste'}",10
2006,"{'latlong': [-59.713461151252574, -5.31150506386977], 'name': 'Leste'}","{'latlong': [-59.713461151252574, -5.31150506386977], 'name': 'Leste'}",9
2006,"{'latlong': [-59.713461151252574, -5.31150506386977], 'name': 'Leste'}","{'latlong': [-64.5801949329809, -3.4202327918909665], 'name': 'Central'}",3
2006,"{'latlong': [-64.5801949329809, -3.4202327918909665], 'name': 'Central'}","{'latlong': [-64.5801949329809, -3.4202327918909665], 'name': 'Central'}",243
2006,"{'latlong': [-68.70673643686315, -4.527961254801425], 'name': 'Oeste'}","{'latlong': [-64.5801949329809, -3.4202327918909665], 'name': 'Central'}",4
2006,"{'latlong': [-68.70673643686315, -4.527961254801425], 'name': 'Oeste'}","{'latlong': [-68.70673643686315, -4.527961254801425], 'name': 'Oeste'}",15
2007,"{'latlong': [-59.713461151252574, -5.31150506386977], 'name': 'Leste'}","{'latlong': [-59.713461151252574, -5.31150506386977], 'name': 'Leste'}",8
2007,"{'latlong': [-64.5801949329809, -3.4202327918909665], 'name': 'Central'}","{'latlong': [-64.5801949329809, -3.4202327918909665], 'name': 'Central'}",210
2007,"{'latlong': [-68.70673643686315, -4.527961254801425], 'name': 'Oeste'}","{'latlong': [-64.5801949329809, -3.4202327918909665], 'name': 'Central'}",1
2007,"{'latlong': [-68.70673643686315, -4.527961254801425], 'name': 'Oeste'}","{'latlong': [-68.70673643686315, -4.527961254801425], 'name': 'Oeste'}",9
2008,"{'latlong': [-59.713461151252574, -5.31150506386977], 'name': 'Leste'}","{'latlong': [-59.713461151252574, -5.31150506386977], 'name': 'Leste'}",17
2008,"{'latlong': [-64.5801949329809, -3.4202327918909665], 'name': 'Central'}","{'latlong': [-64.5801949329809, -3.4202327918909665], 'name': 'Central'}",144
2008,"{'latlong': [-68.70673643686315, -4.527961254801425], 'name': 'Oeste'}","{'latlong': [-68.70673643686315, -4.527961254801425], 'name': 'Oeste'}",10
2009,"{'latlong': [-59.713461151252574, -5.31150506386977], 'name': 'Leste'}","{'latlong': [-59.713461151252574, -5.31150506386977], 'name': 'Leste'}",24
2009,"{'latlong': [-59.713461151252574, -5.31150506386977], 'name': 'Leste'}","{'latlong': [-64.5801949329809, -3.4202327918909665], 'name': 'Central'}",2
2009,"{'latlong': [-64.5801949329809, -3.4202327918909665], 'name': 'Central'}","{'latlong': [-64.5801949329809, -3.4202327918909665], 'name': 'Central'}",149
2009,"{'latlong': [-68.70673643686315, -4.527961254801425], 'name': 'Oeste'}","{'latlong': [-68.70673643686315, -4.527961254801425], 'name': 'Oeste'}",22
2010,"{'latlong': [-59.713461151252574, -5.31150506386977], 'name': 'Leste'}","{'latlong': [-59.713461151252574, -5.31150506386977], 'name': 'Leste'}",17
2010,"{'latlong': [-59.713461151252574, -5.31150506386977], 'name': 'Leste'}","{'latlong': [-64.5801949329809, -3.4202327918909665], 'name': 'Central'}",2
2010,"{'latlong': [-64.5801949329809, -3.4202327918909665], 'name': 'Central'}","{'latlong': [-64.5801949329809, -3.4202327918909665], 'name': 'Central'}",396
2010,"{'latlong': [-68.70673643686315, -4.527961254801425], 'name': 'Oeste'}","{'latlong': [-68.70673643686315, -4.527961254801425], 'name': 'Oeste'}",29
2011,"{'latlong': [-59.713461151252574, -5.31150506386977], 'name': 'Leste'}","{'latlong': [-59.713461151252574, -5.31150506386977], 'name': 'Leste'}",18
2011,"{'latlong': [-64.5801949329809, -3.4202327918909665], 'name': 'Central'}","{'latlong': [-64.5801949329809, -3.4202327918909665], 'name': 'Central'}",458
2011,"{'latlong': [-68.70673643686315, -4.527961254801425], 'name': 'Oeste'}","{'latlong': [-64.5801949329809, -3.4202327918909665], 'name': 'Central'}",1
2011,"{'latlong': [-68.70673643686315, -4.527961254801425], 'name': 'Oeste'}","{'latlong': [-68.70673643686315, -4.527961254801425], 'name': 'Oeste'}",20
2012,"{'latlong': [-59.713461151252574, -5.31150506386977], 'name': 'Leste'}","{'latlong': [-59.713461151252574, -5.31150506386977], 'name': 'Leste'}",8
2012,"{'latlong': [-59.713461151252574, -5.31150506386977], 'name': 'Leste'}","{'latlong': [-64.5801949329809, -3.4202327918909665], 'name': 'Central'}",3
2012,"{'latlong': [-64.5801949329809, -3.4202327918909665], 'name': 'Central'}","{'latlong': [-64.5801949329809, -3.4202327918909665], 'name': 'Central'}",254
2012,"{'latlong': [-68.70673643686315, -4.527961254801425], 'name': 'Oeste'}","{'latlong': [-64.5801949329809, -3.4202327918909665], 'name': 'Central'}",3
2012,"{'latlong': [-68.70673643686315, -4.527961254801425], 'name': 'Oeste'}","{'latlong': [-68.70673643686315, -4.527961254801425], 'name': 'Oeste'}",17
2013,"{'latlong': [-59.713461151252574, -5.31150506386977], 'name': 'Leste'}","{'latlong': [-59.713461151252574, -5.31150506386977], 'name': 'Leste'}",24
2013,"{'latlong': [-59.713461151252574, -5.31150506386977], 'name': 'Leste'}","{'latlong': [-64.5801949329809, -3.4202327918909665], 'name': 'Central'}",2
2013,"{'latlong': [-64.5801949329809, -3.4202327918909665], 'name': 'Central'}","{'latlong': [-64.5801949329809, -3.4202327918909665], 'name': 'Central'}",384
2013,"{'latlong': [-68.70673643686315, -4.527961254801425], 'name': 'Oeste'}","{'latlong': [-68.70673643686315, -4.527961254801425], 'name': 'Oeste'}",21
2014,"{'latlong': [-59.713461151252574, -5.31150506386977], 'name': 'Leste'}","{'latlong': [-59.713461151252574, -5.31150506386977], 'name': 'Leste'}",18
2014,"{'latlong': [-59.713461151252574, -5.31150506386977], 'name': 'Leste'}","{'latlong': [-64.5801949329809, -3.4202327918909665], 'name': 'Central'}",3
2014,"{'latlong': [-64.5801949329809, -3.4202327918909665], 'name': 'Central'}","{'latlong': [-64.5801949329809, -3.4202327918909665], 'name': 'Central'}",381
2014,"{'latlong': [-68.70673643686315, -4.527961254801425], 'name': 'Oeste'}","{'latlong': [-64.5801949329809, -3.4202327918909665], 'name': 'Central'}",1
2014,"{'latlong': [-68.70673643686315, -4.527961254801425], 'name': 'Oeste'}","{'latlong': [-68.70673643686315, -4.527961254801425], 'name': 'Oeste'}",33
2015,"{'latlong': [-59.713461151252574, -5.31150506386977], 'name': 'Leste'}","{'latlong': [-59.713461151252574, -5.31150506386977], 'name': 'Leste'}",18
2015,"{'latlong': [-59.713461151252574, -5.31150506386977], 'name': 'Leste'}","{'latlong': [-64.5801949329809, -3.4202327918909665], 'name': 'Central'}",10
2015,"{'latlong': [-64.5801949329809, -3.4202327918909665], 'name': 'Central'}","{'latlong': [-64.5801949329809, -3.4202327918909665], 'name': 'Central'}",700
2015,"{'latlong': [-68.70673643686315, -4.527961254801425], 'name': 'Oeste'}","{'latlong': [-64.5801949329809, -3.4202327918909665], 'name': 'Central'}",3
2015,"{'latlong': [-68.70673643686315, -4.527961254801425], 'name': 'Oeste'}","{'latlong': [-68.70673643686315, -4.527961254801425], 'name': 'Oeste'}",32
2016,"{'latlong': [-59.713461151252574, -5.31150506386977], 'name': 'Leste'}","{'latlong': [-59.713461151252574, -5.31150506386977], 'name': 'Leste'}",15
2016,"{'latlong': [-59.713461151252574, -5.31150506386977], 'name': 'Leste'}","{'latlong': [-64.5801949329809, -3.4202327918909665], 'name': 'Central'}",15
2016,"{'latlong': [-64.5801949329809, -3.4202327918909665], 'name': 'Central'}","{'latlong': [-64.5801949329809, -3.4202327918909665], 'name': 'Central'}",819
2016,"{'latlong': [-68.70673643686315, -4.527961254801425], 'name': 'Oeste'}","{'latlong': [-64.5801949329809, -3.4202327918909665], 'name': 'Central'}",6
2016,"{'latlong': [-68.70673643686315, -4.527961254801425], 'name': 'Oeste'}","{'latlong': [-68.70673643686315, -4.527961254801425], 'name': 'Oeste'}",32
2017,"{'latlong': [-59.713461151252574, -5.31150506386977], 'name': 'Leste'}","{'latlong': [-59.713461151252574, -5.31150506386977], 'name': 'Leste'}",44
2017,"{'latlong': [-59.713461151252574, -5.31150506386977], 'name': 'Leste'}","{'latlong': [-64.5801949329809, -3.4202327918909665], 'name': 'Central'}",26
2017,"{'latlong': [-64.5801949329809, -3.4202327918909665], 'name': 'Central'}","{'latlong': [-64.5801949329809, -3.4202327918909665], 'name': 'Central'}",899
2017,"{'latlong': [-68.70673643686315, -4.527961254801425], 'name': 'Oeste'}","{'latlong': [-64.5801949329809, -3.4202327918909665], 'name': 'Central'}",5
2017,"{'latlong': [-68.70673643686315, -4.527961254801425], 'name': 'Oeste'}","{'latlong': [-68.70673643686315, -4.527961254801425], 'name': 'Oeste'}",27
2018,"{'latlong': [-59.713461151252574, -5.31150506386977], 'name': 'Leste'}","{'latlong': [-59.713461151252574, -5.31150506386977], 'name': 'Leste'}",29
2018,"{'latlong': [-59.713461151252574, -5.31150506386977], 'name': 'Leste'}","{'latlong': [-64.5801949329809, -3.4202327918909665], 'name': 'Central'}",17
2018,"{'latlong': [-64.5801949329809, -3.4202327918909665], 'name': 'Central'}","{'latlong': [-64.5801949329809, -3.4202327918909665], 'name': 'Central'}",883
2018,"{'latlong': [-68.70673643686315, -4.527961254801425], 'name': 'Oeste'}","{'latlong': [-64.5801949329809, -3.4202327918909665], 'name': 'Central'}",9
2018,"{'latlong': [-68.70673643686315, -4.527961254801425], 'name': 'Oeste'}","{'latlong': [-68.70673643686315, -4.527961254801425], 'name': 'Oeste'}",30
2019,"{'latlong': [-59.713461151252574, -5.31150506386977], 'name': 'Leste'}","{'latlong': [-59.713461151252574, -5.31150506386977], 'name': 'Leste'}",203
2019,"{'latlong': [-59.713461151252574, -5.31150506386977], 'name': 'Leste'}","{'latlong': [-64.5801949329809, -3.4202327918909665], 'name': 'Central'}",35
2019,"{'latlong': [-64.5801949329809, -3.4202327918909665], 'name': 'Central'}","{'latlong': [-59.713461151252574, -5.31150506386977], 'name': 'Leste'}",2
2019,"{'latlong': [-64.5801949329809, -3.4202327918909665], 'name': 'Central'}","{'latlong': [-64.5801949329809, -3.4202327918909665], 'name': 'Central'}",793
2019,"{'latlong': [-68.70673643686315, -4.527961254801425], 'name': 'Oeste'}","{'latlong': [-64.5801949329809, -3.4202327918909665], 'name': 'Central'}",16
2019,"{'latlong': [-68.70673643686315, -4.527961254801425], 'name': 'Oeste'}","{'latlong': [-68.70673643686315, -4.527961254801425], 'name': 'Oeste'}",40
2020,"{'latlong': [-59.713461151252574, -5.31150506386977], 'name': 'Leste'}","{'latlong': [-59.713461151252574, -5.31150506386977], 'name': 'Leste'}",15
2020,"{'latlong': [-59.713461151252574, -5.31150506386977], 'name': 'Leste'}","{'latlong': [-64.5801949329809, -3.4202327918909665], 'name': 'Central'}",11
2020,"{'latlong': [-64.5801949329809, -3.4202327918909665], 'name': 'Central'}","{'latlong': [-64.5801949329809, -3.4202327918909665], 'name': 'Central'}",354
2020,"{'latlong': [-68.70673643686315, -4.527961254801425], 'name': 'Oeste'}","{'latlong': [-64.5801949329809, -3.4202327918909665], 'name': 'Central'}",6
2020,"{'latlong': [-68.70673643686315, -4.527961254801425], 'name': 'Oeste'}","{'latlong': [-68.70673643686315, -4.527961254801425], 'name': 'Oeste'}",14
