year,from,to,hospitalizations
1998,"{'latlong': [-59.713461151252574, -5.31150506386977], 'name': 'Leste'}","{'latlong': [-59.713461151252574, -5.31150506386977], 'name': 'Leste'}",73
1998,"{'latlong': [-64.5801949329809, -3.4202327918909665], 'name': 'Central'}","{'latlong': [-64.5801949329809, -3.4202327918909665], 'name': 'Central'}",498
1998,"{'latlong': [-68.70673643686315, -4.527961254801425], 'name': 'Oeste'}","{'latlong': [-64.5801949329809, -3.4202327918909665], 'name': 'Central'}",1
1998,"{'latlong': [-68.70673643686315, -4.527961254801425], 'name': 'Oeste'}","{'latlong': [-68.70673643686315, -4.527961254801425], 'name': 'Oeste'}",31
1999,"{'latlong': [-59.713461151252574, -5.31150506386977], 'name': 'Leste'}","{'latlong': [-59.713461151252574, -5.31150506386977], 'name': 'Leste'}",82
1999,"{'latlong': [-64.5801949329809, -3.4202327918909665], 'name': 'Central'}","{'latlong': [-64.5801949329809, -3.4202327918909665], 'name': 'Central'}",882
1999,"{'latlong': [-64.5801949329809, -3.4202327918909665], 'name': 'Central'}","{'latlong': [-68.70673643686315, -4.527961254801425], 'name': 'Oeste'}",1
1999,"{'latlong': [-68.70673643686315, -4.527961254801425], 'name': 'Oeste'}","{'latlong': [-68.70673643686315, -4.527961254801425], 'name': 'Oeste'}",42
2000,"{'latlong': [-59.713461151252574, -5.31150506386977], 'name': 'Leste'}","{'latlong': [-59.713461151252574, -5.31150506386977], 'name': 'Leste'}",61
2000,"{'latlong': [-59.713461151252574, -5.31150506386977], 'name': 'Leste'}","{'latlong': [-64.5801949329809, -3.4202327918909665], 'name': 'Central'}",6
2000,"{'latlong': [-64.5801949329809, -3.4202327918909665], 'name': 'Central'}","{'latlong': [-64.5801949329809, -3.4202327918909665], 'name': 'Central'}",941
2000,"{'latlong': [-64.5801949329809, -3.4202327918909665], 'name': 'Central'}","{'latlong': [-68.70673643686315, -4.527961254801425], 'name': 'Oeste'}",1
2000,"{'latlong': [-68.70673643686315, -4.527961254801425], 'name': 'Oeste'}","{'latlong': [-64.5801949329809, -3.4202327918909665], 'name': 'Central'}",3
2000,"{'latlong': [-68.70673643686315, -4.527961254801425], 'name': 'Oeste'}","{'latlong': [-68.70673643686315, -4.527961254801425], 'name': 'Oeste'}",35
2001,"{'latlong': [-59.713461151252574, -5.31150506386977], 'name': 'Leste'}","{'latlong': [-59.713461151252574, -5.31150506386977], 'name': 'Leste'}",51
2001,"{'latlong': [-59.713461151252574, -5.31150506386977], 'name': 'Leste'}","{'latlong': [-64.5801949329809, -3.4202327918909665], 'name': 'Central'}",9
2001,"{'latlong': [-64.5801949329809, -3.4202327918909665], 'name': 'Central'}","{'latlong': [-64.5801949329809, -3.4202327918909665], 'name': 'Central'}",1033
2001,"{'latlong': [-68.70673643686315, -4.527961254801425], 'name': 'Oeste'}","{'latlong': [-68.70673643686315, -4.527961254801425], 'name': 'Oeste'}",49
2002,"{'latlong': [-59.713461151252574, -5.31150506386977], 'name': 'Leste'}","{'latlong': [-59.713461151252574, -5.31150506386977], 'name': 'Leste'}",63
2002,"{'latlong': [-59.713461151252574, -5.31150506386977], 'name': 'Leste'}","{'latlong': [-64.5801949329809, -3.4202327918909665], 'name': 'Central'}",4
2002,"{'latlong': [-64.5801949329809, -3.4202327918909665], 'name': 'Central'}","{'latlong': [-64.5801949329809, -3.4202327918909665], 'name': 'Central'}",625
2002,"{'latlong': [-68.70673643686315, -4.527961254801425], 'name': 'Oeste'}","{'latlong': [-68.70673643686315, -4.527961254801425], 'name': 'Oeste'}",48
2003,"{'latlong': [-59.713461151252574, -5.31150506386977], 'name': 'Leste'}","{'latlong': [-59.713461151252574, -5.31150506386977], 'name': 'Leste'}",60
2003,"{'latlong': [-59.713461151252574, -5.31150506386977], 'name': 'Leste'}","{'latlong': [-64.5801949329809, -3.4202327918909665], 'name': 'Central'}",1
2003,"{'latlong': [-64.5801949329809, -3.4202327918909665], 'name': 'Central'}","{'latlong': [-64.5801949329809, -3.4202327918909665], 'name': 'Central'}",611
2003,"{'latlong': [-68.70673643686315, -4.527961254801425], 'name': 'Oeste'}","{'latlong': [-68.70673643686315, -4.527961254801425], 'name': 'Oeste'}",31
2004,"{'latlong': [-59.713461151252574, -5.31150506386977], 'name': 'Leste'}","{'latlong': [-59.713461151252574, -5.31150506386977], 'name': 'Leste'}",98
2004,"{'latlong': [-59.713461151252574, -5.31150506386977], 'name': 'Leste'}","{'latlong': [-64.5801949329809, -3.4202327918909665], 'name': 'Central'}",1
2004,"{'latlong': [-64.5801949329809, -3.4202327918909665], 'name': 'Central'}","{'latlong': [-64.5801949329809, -3.4202327918909665], 'name': 'Central'}",649
2004,"{'latlong': [-68.70673643686315, -4.527961254801425], 'name': 'Oeste'}","{'latlong': [-68.70673643686315, -4.527961254801425], 'name': 'Oeste'}",13
2005,"{'latlong': [-59.713461151252574, -5.31150506386977], 'name': 'Leste'}","{'latlong': [-59.713461151252574, -5.31150506386977], 'name': 'Leste'}",95
2005,"{'latlong': [-64.5801949329809, -3.4202327918909665], 'name': 'Central'}","{'latlong': [-64.5801949329809, -3.4202327918909665], 'name': 'Central'}",688
2005,"{'latlong': [-68.70673643686315, -4.527961254801425], 'name': 'Oeste'}","{'latlong': [-68.70673643686315, -4.527961254801425], 'name': 'Oeste'}",38
2006,"{'latlong': [-59.713461151252574, -5.31150506386977], 'name': 'Leste'}","{'latlong': [-59.713461151252574, -5.31150506386977], 'name': 'Leste'}",79
2006,"{'latlong': [-59.713461151252574, -5.31150506386977], 'name': 'Leste'}","{'latlong': [-64.5801949329809, -3.4202327918909665], 'name': 'Central'}",2
2006,"{'latlong': [-64.5801949329809, -3.4202327918909665], 'name': 'Central'}","{'latlong': [-64.5801949329809, -3.4202327918909665], 'name': 'Central'}",660
2006,"{'latlong': [-68.70673643686315, -4.527961254801425], 'name': 'Oeste'}","{'latlong': [-68.70673643686315, -4.527961254801425], 'name': 'Oeste'}",50
2007,"{'latlong': [-59.713461151252574, -5.31150506386977], 'name': 'Leste'}","{'latlong': [-59.713461151252574, -5.31150506386977], 'name': 'Leste'}",63
2007,"{'latlong': [-59.713461151252574, -5.31150506386977], 'name': 'Leste'}","{'latlong': [-64.5801949329809, -3.4202327918909665], 'name': 'Central'}",2
2007,"{'latlong': [-64.5801949329809, -3.4202327918909665], 'name': 'Central'}","{'latlong': [-64.5801949329809, -3.4202327918909665], 'name': 'Central'}",612
2007,"{'latlong': [-68.70673643686315, -4.527961254801425], 'name': 'Oeste'}","{'latlong': [-68.70673643686315, -4.527961254801425], 'name': 'Oeste'}",44
2008,"{'latlong': [-59.713461151252574, -5.31150506386977], 'name': 'Leste'}","{'latlong': [-59.713461151252574, -5.31150506386977], 'name': 'Leste'}",212
2008,"{'latlong': [-59.713461151252574, -5.31150506386977], 'name': 'Leste'}","{'latlong': [-64.5801949329809, -3.4202327918909665], 'name': 'Central'}",6
2008,"{'latlong': [-64.5801949329809, -3.4202327918909665], 'name': 'Central'}","{'latlong': [-64.5801949329809, -3.4202327918909665], 'name': 'Central'}",1060
2008,"{'latlong': [-68.70673643686315, -4.527961254801425], 'name': 'Oeste'}","{'latlong': [-64.5801949329809, -3.4202327918909665], 'name': 'Central'}",2
2008,"{'latlong': [-68.70673643686315, -4.527961254801425], 'name': 'Oeste'}","{'latlong': [-68.70673643686315, -4.527961254801425], 'name': 'Oeste'}",71
2009,"{'latlong': [-59.713461151252574, -5.31150506386977], 'name': 'Leste'}","{'latlong': [-59.713461151252574, -5.31150506386977], 'name': 'Leste'}",235
2009,"{'latlong': [-59.713461151252574, -5.31150506386977], 'name': 'Leste'}","{'latlong': [-64.5801949329809, -3.4202327918909665], 'name': 'Central'}",3
2009,"{'latlong': [-64.5801949329809, -3.4202327918909665], 'name': 'Central'}","{'latlong': [-64.5801949329809, -3.4202327918909665], 'name': 'Central'}",1200
2009,"{'latlong': [-68.70673643686315, -4.527961254801425], 'name': 'Oeste'}","{'latlong': [-64.5801949329809, -3.4202327918909665], 'name': 'Central'}",1
2009,"{'latlong': [-68.70673643686315, -4.527961254801425], 'name': 'Oeste'}","{'latlong': [-68.70673643686315, -4.527961254801425], 'name': 'Oeste'}",106
2010,"{'latlong': [-59.713461151252574, -5.31150506386977], 'name': 'Leste'}","{'latlong': [-59.713461151252574, -5.31150506386977], 'name': 'Leste'}",248
2010,"{'latlong': [-59.713461151252574, -5.31150506386977], 'name': 'Leste'}","{'latlong': [-64.5801949329809, -3.4202327918909665], 'name': 'Central'}",10
2010,"{'latlong': [-64.5801949329809, -3.4202327918909665], 'name': 'Central'}","{'latlong': [-64.5801949329809, -3.4202327918909665], 'name': 'Central'}",1259
2010,"{'latlong': [-68.70673643686315, -4.527961254801425], 'name': 'Oeste'}","{'latlong': [-64.5801949329809, -3.4202327918909665], 'name': 'Central'}",1
2010,"{'latlong': [-68.70673643686315, -4.527961254801425], 'name': 'Oeste'}","{'latlong': [-68.70673643686315, -4.527961254801425], 'name': 'Oeste'}",138
2011,"{'latlong': [-59.713461151252574, -5.31150506386977], 'name': 'Leste'}","{'latlong': [-59.713461151252574, -5.31150506386977], 'name': 'Leste'}",314
2011,"{'latlong': [-59.713461151252574, -5.31150506386977], 'name': 'Leste'}","{'latlong': [-64.5801949329809, -3.4202327918909665], 'name': 'Central'}",9
2011,"{'latlong': [-64.5801949329809, -3.4202327918909665], 'name': 'Central'}","{'latlong': [-64.5801949329809, -3.4202327918909665], 'name': 'Central'}",1587
2011,"{'latlong': [-68.70673643686315, -4.527961254801425], 'name': 'Oeste'}","{'latlong': [-64.5801949329809, -3.4202327918909665], 'name': 'Central'}",1
2011,"{'latlong': [-68.70673643686315, -4.527961254801425], 'name': 'Oeste'}","{'latlong': [-68.70673643686315, -4.527961254801425], 'name': 'Oeste'}",149
2012,"{'latlong': [-59.713461151252574, -5.31150506386977], 'name': 'Leste'}","{'latlong': [-59.713461151252574, -5.31150506386977], 'name': 'Leste'}",334
2012,"{'latlong': [-59.713461151252574, -5.31150506386977], 'name': 'Leste'}","{'latlong': [-64.5801949329809, -3.4202327918909665], 'name': 'Central'}",8
2012,"{'latlong': [-64.5801949329809, -3.4202327918909665], 'name': 'Central'}","{'latlong': [-64.5801949329809, -3.4202327918909665], 'name': 'Central'}",1888
2012,"{'latlong': [-68.70673643686315, -4.527961254801425], 'name': 'Oeste'}","{'latlong': [-64.5801949329809, -3.4202327918909665], 'name': 'Central'}",1
2012,"{'latlong': [-68.70673643686315, -4.527961254801425], 'name': 'Oeste'}","{'latlong': [-68.70673643686315, -4.527961254801425], 'name': 'Oeste'}",158
2013,"{'latlong': [-59.713461151252574, -5.31150506386977], 'name': 'Leste'}","{'latlong': [-59.713461151252574, -5.31150506386977], 'name': 'Leste'}",412
2013,"{'latlong': [-59.713461151252574, -5.31150506386977], 'name': 'Leste'}","{'latlong': [-64.5801949329809, -3.4202327918909665], 'name': 'Central'}",7
2013,"{'latlong': [-64.5801949329809, -3.4202327918909665], 'name': 'Central'}","{'latlong': [-64.5801949329809, -3.4202327918909665], 'name': 'Central'}",1774
2013,"{'latlong': [-68.70673643686315, -4.527961254801425], 'name': 'Oeste'}","{'latlong': [-64.5801949329809, -3.4202327918909665], 'name': 'Central'}",1
2013,"{'latlong': [-68.70673643686315, -4.527961254801425], 'name': 'Oeste'}","{'latlong': [-68.70673643686315, -4.527961254801425], 'name': 'Oeste'}",175
2014,"{'latlong': [-59.713461151252574, -5.31150506386977], 'name': 'Leste'}","{'latlong': [-59.713461151252574, -5.31150506386977], 'name': 'Leste'}",339
2014,"{'latlong': [-59.713461151252574, -5.31150506386977], 'name': 'Leste'}","{'latlong': [-64.5801949329809, -3.4202327918909665], 'name': 'Central'}",7
2014,"{'latlong': [-64.5801949329809, -3.4202327918909665], 'name': 'Central'}","{'latlong': [-64.5801949329809, -3.4202327918909665], 'name': 'Central'}",1301
2014,"{'latlong': [-68.70673643686315, -4.527961254801425], 'name': 'Oeste'}","{'latlong': [-59.713461151252574, -5.31150506386977], 'name': 'Leste'}",1
2014,"{'latlong': [-68.70673643686315, -4.527961254801425], 'name': 'Oeste'}","{'latlong': [-64.5801949329809, -3.4202327918909665], 'name': 'Central'}",2
2014,"{'latlong': [-68.70673643686315, -4.527961254801425], 'name': 'Oeste'}","{'latlong': [-68.70673643686315, -4.527961254801425], 'name': 'Oeste'}",192
2015,"{'latlong': [-59.713461151252574, -5.31150506386977], 'name': 'Leste'}","{'latlong': [-59.713461151252574, -5.31150506386977], 'name': 'Leste'}",427
2015,"{'latlong': [-59.713461151252574, -5.31150506386977], 'name': 'Leste'}","{'latlong': [-64.5801949329809, -3.4202327918909665], 'name': 'Central'}",28
2015,"{'latlong': [-64.5801949329809, -3.4202327918909665], 'name': 'Central'}","{'latlong': [-64.5801949329809, -3.4202327918909665], 'name': 'Central'}",1716
2015,"{'latlong': [-64.5801949329809, -3.4202327918909665], 'name': 'Central'}","{'latlong': [-68.70673643686315, -4.527961254801425], 'name': 'Oeste'}",1
2015,"{'latlong': [-68.70673643686315, -4.527961254801425], 'name': 'Oeste'}","{'latlong': [-64.5801949329809, -3.4202327918909665], 'name': 'Central'}",17
2015,"{'latlong': [-68.70673643686315, -4.527961254801425], 'name': 'Oeste'}","{'latlong': [-68.70673643686315, -4.527961254801425], 'name': 'Oeste'}",214
2016,"{'latlong': [-59.713461151252574, -5.31150506386977], 'name': 'Leste'}","{'latlong': [-59.713461151252574, -5.31150506386977], 'name': 'Leste'}",333
2016,"{'latlong': [-59.713461151252574, -5.31150506386977], 'name': 'Leste'}","{'latlong': [-64.5801949329809, -3.4202327918909665], 'name': 'Central'}",43
2016,"{'latlong': [-64.5801949329809, -3.4202327918909665], 'name': 'Central'}","{'latlong': [-64.5801949329809, -3.4202327918909665], 'name': 'Central'}",1785
2016,"{'latlong': [-64.5801949329809, -3.4202327918909665], 'name': 'Central'}","{'latlong': [-68.70673643686315, -4.527961254801425], 'name': 'Oeste'}",1
2016,"{'latlong': [-68.70673643686315, -4.527961254801425], 'name': 'Oeste'}","{'latlong': [-64.5801949329809, -3.4202327918909665], 'name': 'Central'}",16
2016,"{'latlong': [-68.70673643686315, -4.527961254801425], 'name': 'Oeste'}","{'latlong': [-68.70673643686315, -4.527961254801425], 'name': 'Oeste'}",179
2017,"{'latlong': [-59.713461151252574, -5.31150506386977], 'name': 'Leste'}","{'latlong': [-59.713461151252574, -5.31150506386977], 'name': 'Leste'}",349
2017,"{'latlong': [-59.713461151252574, -5.31150506386977], 'name': 'Leste'}","{'latlong': [-64.5801949329809, -3.4202327918909665], 'name': 'Central'}",95
2017,"{'latlong': [-64.5801949329809, -3.4202327918909665], 'name': 'Central'}","{'latlong': [-59.713461151252574, -5.31150506386977], 'name': 'Leste'}",1
2017,"{'latlong': [-64.5801949329809, -3.4202327918909665], 'name': 'Central'}","{'latlong': [-64.5801949329809, -3.4202327918909665], 'name': 'Central'}",2199
2017,"{'latlong': [-68.70673643686315, -4.527961254801425], 'name': 'Oeste'}","{'latlong': [-64.5801949329809, -3.4202327918909665], 'name': 'Central'}",25
2017,"{'latlong': [-68.70673643686315, -4.527961254801425], 'name': 'Oeste'}","{'latlong': [-68.70673643686315, -4.527961254801425], 'name': 'Oeste'}",219
2018,"{'latlong': [-59.713461151252574, -5.31150506386977], 'name': 'Leste'}","{'latlong': [-59.713461151252574, -5.31150506386977], 'name': 'Leste'}",413
2018,"{'latlong': [-59.713461151252574, -5.31150506386977], 'name': 'Leste'}","{'latlong': [-64.5801949329809, -3.4202327918909665], 'name': 'Central'}",123
2018,"{'latlong': [-64.5801949329809, -3.4202327918909665], 'name': 'Central'}","{'latlong': [-64.5801949329809, -3.4202327918909665], 'name': 'Central'}",2443
2018,"{'latlong': [-64.5801949329809, -3.4202327918909665], 'name': 'Central'}","{'latlong': [-68.70673643686315, -4.527961254801425], 'name': 'Oeste'}",2
2018,"{'latlong': [-68.70673643686315, -4.527961254801425], 'name': 'Oeste'}","{'latlong': [-64.5801949329809, -3.4202327918909665], 'name': 'Central'}",23
2018,"{'latlong': [-68.70673643686315, -4.527961254801425], 'name': 'Oeste'}","{'latlong': [-68.70673643686315, -4.527961254801425], 'name': 'Oeste'}",200
2019,"{'latlong': [-59.713461151252574, -5.31150506386977], 'name': 'Leste'}","{'latlong': [-59.713461151252574, -5.31150506386977], 'name': 'Leste'}",408
2019,"{'latlong': [-59.713461151252574, -5.31150506386977], 'name': 'Leste'}","{'latlong': [-64.5801949329809, -3.4202327918909665], 'name': 'Central'}",110
2019,"{'latlong': [-64.5801949329809, -3.4202327918909665], 'name': 'Central'}","{'latlong': [-59.713461151252574, -5.31150506386977], 'name': 'Leste'}",1
2019,"{'latlong': [-64.5801949329809, -3.4202327918909665], 'name': 'Central'}","{'latlong': [-64.5801949329809, -3.4202327918909665], 'name': 'Central'}",2400
2019,"{'latlong': [-64.5801949329809, -3.4202327918909665], 'name': 'Central'}","{'latlong': [-68.70673643686315, -4.527961254801425], 'name': 'Oeste'}",3
2019,"{'latlong': [-68.70673643686315, -4.527961254801425], 'name': 'Oeste'}","{'latlong': [-59.713461151252574, -5.31150506386977], 'name': 'Leste'}",1
2019,"{'latlong': [-68.70673643686315, -4.527961254801425], 'name': 'Oeste'}","{'latlong': [-64.5801949329809, -3.4202327918909665], 'name': 'Central'}",35
2019,"{'latlong': [-68.70673643686315, -4.527961254801425], 'name': 'Oeste'}","{'latlong': [-68.70673643686315, -4.527961254801425], 'name': 'Oeste'}",318
2020,"{'latlong': [-59.713461151252574, -5.31150506386977], 'name': 'Leste'}","{'latlong': [-59.713461151252574, -5.31150506386977], 'name': 'Leste'}",140
2020,"{'latlong': [-59.713461151252574, -5.31150506386977], 'name': 'Leste'}","{'latlong': [-64.5801949329809, -3.4202327918909665], 'name': 'Central'}",40
2020,"{'latlong': [-64.5801949329809, -3.4202327918909665], 'name': 'Central'}","{'latlong': [-59.713461151252574, -5.31150506386977], 'name': 'Leste'}",2
2020,"{'latlong': [-64.5801949329809, -3.4202327918909665], 'name': 'Central'}","{'latlong': [-64.5801949329809, -3.4202327918909665], 'name': 'Central'}",898
2020,"{'latlong': [-68.70673643686315, -4.527961254801425], 'name': 'Oeste'}","{'latlong': [-64.5801949329809, -3.4202327918909665], 'name': 'Central'}",15
2020,"{'latlong': [-68.70673643686315, -4.527961254801425], 'name': 'Oeste'}","{'latlong': [-68.70673643686315, -4.527961254801425], 'name': 'Oeste'}",109
