year,from,to,hospitalizations
1998,"{'latlong': [-44.27497484025333, -5.493289451643147], 'name': 'Macrorregião Leste'}","{'latlong': [-44.27497484025333, -5.493289451643147], 'name': 'Macrorregião Leste'}",358
1998,"{'latlong': [-44.27497484025333, -5.493289451643147], 'name': 'Macrorregião Leste'}","{'latlong': [-44.80345012921731, -2.9260426894763576], 'name': 'Macrorregião Norte'}",43
1998,"{'latlong': [-44.27497484025333, -5.493289451643147], 'name': 'Macrorregião Leste'}","{'latlong': [-46.430337294867904, -6.654407452005538], 'name': 'Macrorregião Sul'}",1
1998,"{'latlong': [-44.80345012921731, -2.9260426894763576], 'name': 'Macrorregião Norte'}","{'latlong': [-44.27497484025333, -5.493289451643147], 'name': 'Macrorregião Leste'}",3
1998,"{'latlong': [-44.80345012921731, -2.9260426894763576], 'name': 'Macrorregião Norte'}","{'latlong': [-44.80345012921731, -2.9260426894763576], 'name': 'Macrorregião Norte'}",2071
1998,"{'latlong': [-44.80345012921731, -2.9260426894763576], 'name': 'Macrorregião Norte'}","{'latlong': [-46.430337294867904, -6.654407452005538], 'name': 'Macrorregião Sul'}",5
1998,"{'latlong': [-46.430337294867904, -6.654407452005538], 'name': 'Macrorregião Sul'}","{'latlong': [-44.27497484025333, -5.493289451643147], 'name': 'Macrorregião Leste'}",2
1998,"{'latlong': [-46.430337294867904, -6.654407452005538], 'name': 'Macrorregião Sul'}","{'latlong': [-44.80345012921731, -2.9260426894763576], 'name': 'Macrorregião Norte'}",30
1998,"{'latlong': [-46.430337294867904, -6.654407452005538], 'name': 'Macrorregião Sul'}","{'latlong': [-46.430337294867904, -6.654407452005538], 'name': 'Macrorregião Sul'}",722
1999,"{'latlong': [-44.27497484025333, -5.493289451643147], 'name': 'Macrorregião Leste'}","{'latlong': [-44.27497484025333, -5.493289451643147], 'name': 'Macrorregião Leste'}",486
1999,"{'latlong': [-44.27497484025333, -5.493289451643147], 'name': 'Macrorregião Leste'}","{'latlong': [-44.80345012921731, -2.9260426894763576], 'name': 'Macrorregião Norte'}",17
1999,"{'latlong': [-44.80345012921731, -2.9260426894763576], 'name': 'Macrorregião Norte'}","{'latlong': [-44.27497484025333, -5.493289451643147], 'name': 'Macrorregião Leste'}",3
1999,"{'latlong': [-44.80345012921731, -2.9260426894763576], 'name': 'Macrorregião Norte'}","{'latlong': [-44.80345012921731, -2.9260426894763576], 'name': 'Macrorregião Norte'}",1511
1999,"{'latlong': [-44.80345012921731, -2.9260426894763576], 'name': 'Macrorregião Norte'}","{'latlong': [-46.430337294867904, -6.654407452005538], 'name': 'Macrorregião Sul'}",3
1999,"{'latlong': [-46.430337294867904, -6.654407452005538], 'name': 'Macrorregião Sul'}","{'latlong': [-44.27497484025333, -5.493289451643147], 'name': 'Macrorregião Leste'}",1
1999,"{'latlong': [-46.430337294867904, -6.654407452005538], 'name': 'Macrorregião Sul'}","{'latlong': [-44.80345012921731, -2.9260426894763576], 'name': 'Macrorregião Norte'}",13
1999,"{'latlong': [-46.430337294867904, -6.654407452005538], 'name': 'Macrorregião Sul'}","{'latlong': [-46.430337294867904, -6.654407452005538], 'name': 'Macrorregião Sul'}",815
2000,"{'latlong': [-44.27497484025333, -5.493289451643147], 'name': 'Macrorregião Leste'}","{'latlong': [-44.27497484025333, -5.493289451643147], 'name': 'Macrorregião Leste'}",240
2000,"{'latlong': [-44.27497484025333, -5.493289451643147], 'name': 'Macrorregião Leste'}","{'latlong': [-44.80345012921731, -2.9260426894763576], 'name': 'Macrorregião Norte'}",39
2000,"{'latlong': [-44.27497484025333, -5.493289451643147], 'name': 'Macrorregião Leste'}","{'latlong': [-46.430337294867904, -6.654407452005538], 'name': 'Macrorregião Sul'}",5
2000,"{'latlong': [-44.80345012921731, -2.9260426894763576], 'name': 'Macrorregião Norte'}","{'latlong': [-44.80345012921731, -2.9260426894763576], 'name': 'Macrorregião Norte'}",2423
2000,"{'latlong': [-44.80345012921731, -2.9260426894763576], 'name': 'Macrorregião Norte'}","{'latlong': [-46.430337294867904, -6.654407452005538], 'name': 'Macrorregião Sul'}",3
2000,"{'latlong': [-46.430337294867904, -6.654407452005538], 'name': 'Macrorregião Sul'}","{'latlong': [-44.27497484025333, -5.493289451643147], 'name': 'Macrorregião Leste'}",3
2000,"{'latlong': [-46.430337294867904, -6.654407452005538], 'name': 'Macrorregião Sul'}","{'latlong': [-44.80345012921731, -2.9260426894763576], 'name': 'Macrorregião Norte'}",14
2000,"{'latlong': [-46.430337294867904, -6.654407452005538], 'name': 'Macrorregião Sul'}","{'latlong': [-46.430337294867904, -6.654407452005538], 'name': 'Macrorregião Sul'}",874
2001,"{'latlong': [-44.27497484025333, -5.493289451643147], 'name': 'Macrorregião Leste'}","{'latlong': [-44.27497484025333, -5.493289451643147], 'name': 'Macrorregião Leste'}",287
2001,"{'latlong': [-44.27497484025333, -5.493289451643147], 'name': 'Macrorregião Leste'}","{'latlong': [-44.80345012921731, -2.9260426894763576], 'name': 'Macrorregião Norte'}",35
2001,"{'latlong': [-44.80345012921731, -2.9260426894763576], 'name': 'Macrorregião Norte'}","{'latlong': [-44.27497484025333, -5.493289451643147], 'name': 'Macrorregião Leste'}",1
2001,"{'latlong': [-44.80345012921731, -2.9260426894763576], 'name': 'Macrorregião Norte'}","{'latlong': [-44.80345012921731, -2.9260426894763576], 'name': 'Macrorregião Norte'}",1760
2001,"{'latlong': [-44.80345012921731, -2.9260426894763576], 'name': 'Macrorregião Norte'}","{'latlong': [-46.430337294867904, -6.654407452005538], 'name': 'Macrorregião Sul'}",6
2001,"{'latlong': [-46.430337294867904, -6.654407452005538], 'name': 'Macrorregião Sul'}","{'latlong': [-44.80345012921731, -2.9260426894763576], 'name': 'Macrorregião Norte'}",16
2001,"{'latlong': [-46.430337294867904, -6.654407452005538], 'name': 'Macrorregião Sul'}","{'latlong': [-46.430337294867904, -6.654407452005538], 'name': 'Macrorregião Sul'}",895
2002,"{'latlong': [-44.27497484025333, -5.493289451643147], 'name': 'Macrorregião Leste'}","{'latlong': [-44.27497484025333, -5.493289451643147], 'name': 'Macrorregião Leste'}",242
2002,"{'latlong': [-44.27497484025333, -5.493289451643147], 'name': 'Macrorregião Leste'}","{'latlong': [-44.80345012921731, -2.9260426894763576], 'name': 'Macrorregião Norte'}",33
2002,"{'latlong': [-44.27497484025333, -5.493289451643147], 'name': 'Macrorregião Leste'}","{'latlong': [-46.430337294867904, -6.654407452005538], 'name': 'Macrorregião Sul'}",3
2002,"{'latlong': [-44.80345012921731, -2.9260426894763576], 'name': 'Macrorregião Norte'}","{'latlong': [-44.80345012921731, -2.9260426894763576], 'name': 'Macrorregião Norte'}",1909
2002,"{'latlong': [-44.80345012921731, -2.9260426894763576], 'name': 'Macrorregião Norte'}","{'latlong': [-46.430337294867904, -6.654407452005538], 'name': 'Macrorregião Sul'}",2
2002,"{'latlong': [-46.430337294867904, -6.654407452005538], 'name': 'Macrorregião Sul'}","{'latlong': [-44.27497484025333, -5.493289451643147], 'name': 'Macrorregião Leste'}",1
2002,"{'latlong': [-46.430337294867904, -6.654407452005538], 'name': 'Macrorregião Sul'}","{'latlong': [-44.80345012921731, -2.9260426894763576], 'name': 'Macrorregião Norte'}",24
2002,"{'latlong': [-46.430337294867904, -6.654407452005538], 'name': 'Macrorregião Sul'}","{'latlong': [-46.430337294867904, -6.654407452005538], 'name': 'Macrorregião Sul'}",557
2003,"{'latlong': [-44.27497484025333, -5.493289451643147], 'name': 'Macrorregião Leste'}","{'latlong': [-44.27497484025333, -5.493289451643147], 'name': 'Macrorregião Leste'}",221
2003,"{'latlong': [-44.27497484025333, -5.493289451643147], 'name': 'Macrorregião Leste'}","{'latlong': [-44.80345012921731, -2.9260426894763576], 'name': 'Macrorregião Norte'}",73
2003,"{'latlong': [-44.27497484025333, -5.493289451643147], 'name': 'Macrorregião Leste'}","{'latlong': [-46.430337294867904, -6.654407452005538], 'name': 'Macrorregião Sul'}",3
2003,"{'latlong': [-44.80345012921731, -2.9260426894763576], 'name': 'Macrorregião Norte'}","{'latlong': [-44.27497484025333, -5.493289451643147], 'name': 'Macrorregião Leste'}",3
2003,"{'latlong': [-44.80345012921731, -2.9260426894763576], 'name': 'Macrorregião Norte'}","{'latlong': [-44.80345012921731, -2.9260426894763576], 'name': 'Macrorregião Norte'}",2821
2003,"{'latlong': [-44.80345012921731, -2.9260426894763576], 'name': 'Macrorregião Norte'}","{'latlong': [-46.430337294867904, -6.654407452005538], 'name': 'Macrorregião Sul'}",3
2003,"{'latlong': [-46.430337294867904, -6.654407452005538], 'name': 'Macrorregião Sul'}","{'latlong': [-44.80345012921731, -2.9260426894763576], 'name': 'Macrorregião Norte'}",46
2003,"{'latlong': [-46.430337294867904, -6.654407452005538], 'name': 'Macrorregião Sul'}","{'latlong': [-46.430337294867904, -6.654407452005538], 'name': 'Macrorregião Sul'}",797
2004,"{'latlong': [-44.27497484025333, -5.493289451643147], 'name': 'Macrorregião Leste'}","{'latlong': [-44.27497484025333, -5.493289451643147], 'name': 'Macrorregião Leste'}",263
2004,"{'latlong': [-44.27497484025333, -5.493289451643147], 'name': 'Macrorregião Leste'}","{'latlong': [-44.80345012921731, -2.9260426894763576], 'name': 'Macrorregião Norte'}",96
2004,"{'latlong': [-44.80345012921731, -2.9260426894763576], 'name': 'Macrorregião Norte'}","{'latlong': [-44.27497484025333, -5.493289451643147], 'name': 'Macrorregião Leste'}",3
2004,"{'latlong': [-44.80345012921731, -2.9260426894763576], 'name': 'Macrorregião Norte'}","{'latlong': [-44.80345012921731, -2.9260426894763576], 'name': 'Macrorregião Norte'}",2963
2004,"{'latlong': [-46.430337294867904, -6.654407452005538], 'name': 'Macrorregião Sul'}","{'latlong': [-44.80345012921731, -2.9260426894763576], 'name': 'Macrorregião Norte'}",27
2004,"{'latlong': [-46.430337294867904, -6.654407452005538], 'name': 'Macrorregião Sul'}","{'latlong': [-46.430337294867904, -6.654407452005538], 'name': 'Macrorregião Sul'}",685
2005,"{'latlong': [-44.27497484025333, -5.493289451643147], 'name': 'Macrorregião Leste'}","{'latlong': [-44.27497484025333, -5.493289451643147], 'name': 'Macrorregião Leste'}",207
2005,"{'latlong': [-44.27497484025333, -5.493289451643147], 'name': 'Macrorregião Leste'}","{'latlong': [-44.80345012921731, -2.9260426894763576], 'name': 'Macrorregião Norte'}",92
2005,"{'latlong': [-44.80345012921731, -2.9260426894763576], 'name': 'Macrorregião Norte'}","{'latlong': [-44.27497484025333, -5.493289451643147], 'name': 'Macrorregião Leste'}",1
2005,"{'latlong': [-44.80345012921731, -2.9260426894763576], 'name': 'Macrorregião Norte'}","{'latlong': [-44.80345012921731, -2.9260426894763576], 'name': 'Macrorregião Norte'}",2695
2005,"{'latlong': [-46.430337294867904, -6.654407452005538], 'name': 'Macrorregião Sul'}","{'latlong': [-44.80345012921731, -2.9260426894763576], 'name': 'Macrorregião Norte'}",26
2005,"{'latlong': [-46.430337294867904, -6.654407452005538], 'name': 'Macrorregião Sul'}","{'latlong': [-46.430337294867904, -6.654407452005538], 'name': 'Macrorregião Sul'}",539
2006,"{'latlong': [-44.27497484025333, -5.493289451643147], 'name': 'Macrorregião Leste'}","{'latlong': [-44.27497484025333, -5.493289451643147], 'name': 'Macrorregião Leste'}",285
2006,"{'latlong': [-44.27497484025333, -5.493289451643147], 'name': 'Macrorregião Leste'}","{'latlong': [-44.80345012921731, -2.9260426894763576], 'name': 'Macrorregião Norte'}",89
2006,"{'latlong': [-44.80345012921731, -2.9260426894763576], 'name': 'Macrorregião Norte'}","{'latlong': [-44.27497484025333, -5.493289451643147], 'name': 'Macrorregião Leste'}",2
2006,"{'latlong': [-44.80345012921731, -2.9260426894763576], 'name': 'Macrorregião Norte'}","{'latlong': [-44.80345012921731, -2.9260426894763576], 'name': 'Macrorregião Norte'}",2725
2006,"{'latlong': [-44.80345012921731, -2.9260426894763576], 'name': 'Macrorregião Norte'}","{'latlong': [-46.430337294867904, -6.654407452005538], 'name': 'Macrorregião Sul'}",1
2006,"{'latlong': [-46.430337294867904, -6.654407452005538], 'name': 'Macrorregião Sul'}","{'latlong': [-44.27497484025333, -5.493289451643147], 'name': 'Macrorregião Leste'}",1
2006,"{'latlong': [-46.430337294867904, -6.654407452005538], 'name': 'Macrorregião Sul'}","{'latlong': [-44.80345012921731, -2.9260426894763576], 'name': 'Macrorregião Norte'}",39
2006,"{'latlong': [-46.430337294867904, -6.654407452005538], 'name': 'Macrorregião Sul'}","{'latlong': [-46.430337294867904, -6.654407452005538], 'name': 'Macrorregião Sul'}",551
2007,"{'latlong': [-44.27497484025333, -5.493289451643147], 'name': 'Macrorregião Leste'}","{'latlong': [-44.27497484025333, -5.493289451643147], 'name': 'Macrorregião Leste'}",339
2007,"{'latlong': [-44.27497484025333, -5.493289451643147], 'name': 'Macrorregião Leste'}","{'latlong': [-44.80345012921731, -2.9260426894763576], 'name': 'Macrorregião Norte'}",87
2007,"{'latlong': [-44.80345012921731, -2.9260426894763576], 'name': 'Macrorregião Norte'}","{'latlong': [-44.27497484025333, -5.493289451643147], 'name': 'Macrorregião Leste'}",2
2007,"{'latlong': [-44.80345012921731, -2.9260426894763576], 'name': 'Macrorregião Norte'}","{'latlong': [-44.80345012921731, -2.9260426894763576], 'name': 'Macrorregião Norte'}",2047
2007,"{'latlong': [-44.80345012921731, -2.9260426894763576], 'name': 'Macrorregião Norte'}","{'latlong': [-46.430337294867904, -6.654407452005538], 'name': 'Macrorregião Sul'}",1
2007,"{'latlong': [-46.430337294867904, -6.654407452005538], 'name': 'Macrorregião Sul'}","{'latlong': [-44.27497484025333, -5.493289451643147], 'name': 'Macrorregião Leste'}",1
2007,"{'latlong': [-46.430337294867904, -6.654407452005538], 'name': 'Macrorregião Sul'}","{'latlong': [-44.80345012921731, -2.9260426894763576], 'name': 'Macrorregião Norte'}",21
2007,"{'latlong': [-46.430337294867904, -6.654407452005538], 'name': 'Macrorregião Sul'}","{'latlong': [-46.430337294867904, -6.654407452005538], 'name': 'Macrorregião Sul'}",609
2008,"{'latlong': [-44.27497484025333, -5.493289451643147], 'name': 'Macrorregião Leste'}","{'latlong': [-44.27497484025333, -5.493289451643147], 'name': 'Macrorregião Leste'}",512
2008,"{'latlong': [-44.27497484025333, -5.493289451643147], 'name': 'Macrorregião Leste'}","{'latlong': [-44.80345012921731, -2.9260426894763576], 'name': 'Macrorregião Norte'}",83
2008,"{'latlong': [-44.80345012921731, -2.9260426894763576], 'name': 'Macrorregião Norte'}","{'latlong': [-44.27497484025333, -5.493289451643147], 'name': 'Macrorregião Leste'}",4
2008,"{'latlong': [-44.80345012921731, -2.9260426894763576], 'name': 'Macrorregião Norte'}","{'latlong': [-44.80345012921731, -2.9260426894763576], 'name': 'Macrorregião Norte'}",2516
2008,"{'latlong': [-46.430337294867904, -6.654407452005538], 'name': 'Macrorregião Sul'}","{'latlong': [-44.27497484025333, -5.493289451643147], 'name': 'Macrorregião Leste'}",1
2008,"{'latlong': [-46.430337294867904, -6.654407452005538], 'name': 'Macrorregião Sul'}","{'latlong': [-44.80345012921731, -2.9260426894763576], 'name': 'Macrorregião Norte'}",15
2008,"{'latlong': [-46.430337294867904, -6.654407452005538], 'name': 'Macrorregião Sul'}","{'latlong': [-46.430337294867904, -6.654407452005538], 'name': 'Macrorregião Sul'}",439
2009,"{'latlong': [-44.27497484025333, -5.493289451643147], 'name': 'Macrorregião Leste'}","{'latlong': [-44.27497484025333, -5.493289451643147], 'name': 'Macrorregião Leste'}",825
2009,"{'latlong': [-44.27497484025333, -5.493289451643147], 'name': 'Macrorregião Leste'}","{'latlong': [-44.80345012921731, -2.9260426894763576], 'name': 'Macrorregião Norte'}",49
2009,"{'latlong': [-44.27497484025333, -5.493289451643147], 'name': 'Macrorregião Leste'}","{'latlong': [-46.430337294867904, -6.654407452005538], 'name': 'Macrorregião Sul'}",1
2009,"{'latlong': [-44.80345012921731, -2.9260426894763576], 'name': 'Macrorregião Norte'}","{'latlong': [-44.27497484025333, -5.493289451643147], 'name': 'Macrorregião Leste'}",3
2009,"{'latlong': [-44.80345012921731, -2.9260426894763576], 'name': 'Macrorregião Norte'}","{'latlong': [-44.80345012921731, -2.9260426894763576], 'name': 'Macrorregião Norte'}",3318
2009,"{'latlong': [-46.430337294867904, -6.654407452005538], 'name': 'Macrorregião Sul'}","{'latlong': [-44.80345012921731, -2.9260426894763576], 'name': 'Macrorregião Norte'}",21
2009,"{'latlong': [-46.430337294867904, -6.654407452005538], 'name': 'Macrorregião Sul'}","{'latlong': [-46.430337294867904, -6.654407452005538], 'name': 'Macrorregião Sul'}",738
2010,"{'latlong': [-44.27497484025333, -5.493289451643147], 'name': 'Macrorregião Leste'}","{'latlong': [-44.27497484025333, -5.493289451643147], 'name': 'Macrorregião Leste'}",1015
2010,"{'latlong': [-44.27497484025333, -5.493289451643147], 'name': 'Macrorregião Leste'}","{'latlong': [-44.80345012921731, -2.9260426894763576], 'name': 'Macrorregião Norte'}",92
2010,"{'latlong': [-44.80345012921731, -2.9260426894763576], 'name': 'Macrorregião Norte'}","{'latlong': [-44.27497484025333, -5.493289451643147], 'name': 'Macrorregião Leste'}",4
2010,"{'latlong': [-44.80345012921731, -2.9260426894763576], 'name': 'Macrorregião Norte'}","{'latlong': [-44.80345012921731, -2.9260426894763576], 'name': 'Macrorregião Norte'}",4227
2010,"{'latlong': [-46.430337294867904, -6.654407452005538], 'name': 'Macrorregião Sul'}","{'latlong': [-44.27497484025333, -5.493289451643147], 'name': 'Macrorregião Leste'}",1
2010,"{'latlong': [-46.430337294867904, -6.654407452005538], 'name': 'Macrorregião Sul'}","{'latlong': [-44.80345012921731, -2.9260426894763576], 'name': 'Macrorregião Norte'}",42
2010,"{'latlong': [-46.430337294867904, -6.654407452005538], 'name': 'Macrorregião Sul'}","{'latlong': [-46.430337294867904, -6.654407452005538], 'name': 'Macrorregião Sul'}",977
2011,"{'latlong': [-44.27497484025333, -5.493289451643147], 'name': 'Macrorregião Leste'}","{'latlong': [-44.27497484025333, -5.493289451643147], 'name': 'Macrorregião Leste'}",1202
2011,"{'latlong': [-44.27497484025333, -5.493289451643147], 'name': 'Macrorregião Leste'}","{'latlong': [-44.80345012921731, -2.9260426894763576], 'name': 'Macrorregião Norte'}",116
2011,"{'latlong': [-44.27497484025333, -5.493289451643147], 'name': 'Macrorregião Leste'}","{'latlong': [-46.430337294867904, -6.654407452005538], 'name': 'Macrorregião Sul'}",1
2011,"{'latlong': [-44.80345012921731, -2.9260426894763576], 'name': 'Macrorregião Norte'}","{'latlong': [-44.27497484025333, -5.493289451643147], 'name': 'Macrorregião Leste'}",7
2011,"{'latlong': [-44.80345012921731, -2.9260426894763576], 'name': 'Macrorregião Norte'}","{'latlong': [-44.80345012921731, -2.9260426894763576], 'name': 'Macrorregião Norte'}",4570
2011,"{'latlong': [-46.430337294867904, -6.654407452005538], 'name': 'Macrorregião Sul'}","{'latlong': [-44.27497484025333, -5.493289451643147], 'name': 'Macrorregião Leste'}",18
2011,"{'latlong': [-46.430337294867904, -6.654407452005538], 'name': 'Macrorregião Sul'}","{'latlong': [-44.80345012921731, -2.9260426894763576], 'name': 'Macrorregião Norte'}",52
2011,"{'latlong': [-46.430337294867904, -6.654407452005538], 'name': 'Macrorregião Sul'}","{'latlong': [-46.430337294867904, -6.654407452005538], 'name': 'Macrorregião Sul'}",1371
2012,"{'latlong': [-44.27497484025333, -5.493289451643147], 'name': 'Macrorregião Leste'}","{'latlong': [-44.27497484025333, -5.493289451643147], 'name': 'Macrorregião Leste'}",1142
2012,"{'latlong': [-44.27497484025333, -5.493289451643147], 'name': 'Macrorregião Leste'}","{'latlong': [-44.80345012921731, -2.9260426894763576], 'name': 'Macrorregião Norte'}",118
2012,"{'latlong': [-44.27497484025333, -5.493289451643147], 'name': 'Macrorregião Leste'}","{'latlong': [-46.430337294867904, -6.654407452005538], 'name': 'Macrorregião Sul'}",3
2012,"{'latlong': [-44.80345012921731, -2.9260426894763576], 'name': 'Macrorregião Norte'}","{'latlong': [-44.27497484025333, -5.493289451643147], 'name': 'Macrorregião Leste'}",11
2012,"{'latlong': [-44.80345012921731, -2.9260426894763576], 'name': 'Macrorregião Norte'}","{'latlong': [-44.80345012921731, -2.9260426894763576], 'name': 'Macrorregião Norte'}",4280
2012,"{'latlong': [-46.430337294867904, -6.654407452005538], 'name': 'Macrorregião Sul'}","{'latlong': [-44.27497484025333, -5.493289451643147], 'name': 'Macrorregião Leste'}",11
2012,"{'latlong': [-46.430337294867904, -6.654407452005538], 'name': 'Macrorregião Sul'}","{'latlong': [-44.80345012921731, -2.9260426894763576], 'name': 'Macrorregião Norte'}",21
2012,"{'latlong': [-46.430337294867904, -6.654407452005538], 'name': 'Macrorregião Sul'}","{'latlong': [-46.430337294867904, -6.654407452005538], 'name': 'Macrorregião Sul'}",1447
2013,"{'latlong': [-44.27497484025333, -5.493289451643147], 'name': 'Macrorregião Leste'}","{'latlong': [-44.27497484025333, -5.493289451643147], 'name': 'Macrorregião Leste'}",1847
2013,"{'latlong': [-44.27497484025333, -5.493289451643147], 'name': 'Macrorregião Leste'}","{'latlong': [-44.80345012921731, -2.9260426894763576], 'name': 'Macrorregião Norte'}",78
2013,"{'latlong': [-44.27497484025333, -5.493289451643147], 'name': 'Macrorregião Leste'}","{'latlong': [-46.430337294867904, -6.654407452005538], 'name': 'Macrorregião Sul'}",3
2013,"{'latlong': [-44.80345012921731, -2.9260426894763576], 'name': 'Macrorregião Norte'}","{'latlong': [-44.27497484025333, -5.493289451643147], 'name': 'Macrorregião Leste'}",46
2013,"{'latlong': [-44.80345012921731, -2.9260426894763576], 'name': 'Macrorregião Norte'}","{'latlong': [-44.80345012921731, -2.9260426894763576], 'name': 'Macrorregião Norte'}",4173
2013,"{'latlong': [-44.80345012921731, -2.9260426894763576], 'name': 'Macrorregião Norte'}","{'latlong': [-46.430337294867904, -6.654407452005538], 'name': 'Macrorregião Sul'}",8
2013,"{'latlong': [-46.430337294867904, -6.654407452005538], 'name': 'Macrorregião Sul'}","{'latlong': [-44.27497484025333, -5.493289451643147], 'name': 'Macrorregião Leste'}",13
2013,"{'latlong': [-46.430337294867904, -6.654407452005538], 'name': 'Macrorregião Sul'}","{'latlong': [-44.80345012921731, -2.9260426894763576], 'name': 'Macrorregião Norte'}",27
2013,"{'latlong': [-46.430337294867904, -6.654407452005538], 'name': 'Macrorregião Sul'}","{'latlong': [-46.430337294867904, -6.654407452005538], 'name': 'Macrorregião Sul'}",2174
2014,"{'latlong': [-44.27497484025333, -5.493289451643147], 'name': 'Macrorregião Leste'}","{'latlong': [-44.27497484025333, -5.493289451643147], 'name': 'Macrorregião Leste'}",2205
2014,"{'latlong': [-44.27497484025333, -5.493289451643147], 'name': 'Macrorregião Leste'}","{'latlong': [-44.80345012921731, -2.9260426894763576], 'name': 'Macrorregião Norte'}",75
2014,"{'latlong': [-44.27497484025333, -5.493289451643147], 'name': 'Macrorregião Leste'}","{'latlong': [-46.430337294867904, -6.654407452005538], 'name': 'Macrorregião Sul'}",2
2014,"{'latlong': [-44.80345012921731, -2.9260426894763576], 'name': 'Macrorregião Norte'}","{'latlong': [-44.27497484025333, -5.493289451643147], 'name': 'Macrorregião Leste'}",89
2014,"{'latlong': [-44.80345012921731, -2.9260426894763576], 'name': 'Macrorregião Norte'}","{'latlong': [-44.80345012921731, -2.9260426894763576], 'name': 'Macrorregião Norte'}",4652
2014,"{'latlong': [-44.80345012921731, -2.9260426894763576], 'name': 'Macrorregião Norte'}","{'latlong': [-46.430337294867904, -6.654407452005538], 'name': 'Macrorregião Sul'}",4
2014,"{'latlong': [-46.430337294867904, -6.654407452005538], 'name': 'Macrorregião Sul'}","{'latlong': [-44.27497484025333, -5.493289451643147], 'name': 'Macrorregião Leste'}",9
2014,"{'latlong': [-46.430337294867904, -6.654407452005538], 'name': 'Macrorregião Sul'}","{'latlong': [-44.80345012921731, -2.9260426894763576], 'name': 'Macrorregião Norte'}",12
2014,"{'latlong': [-46.430337294867904, -6.654407452005538], 'name': 'Macrorregião Sul'}","{'latlong': [-46.430337294867904, -6.654407452005538], 'name': 'Macrorregião Sul'}",1742
2015,"{'latlong': [-44.27497484025333, -5.493289451643147], 'name': 'Macrorregião Leste'}","{'latlong': [-44.27497484025333, -5.493289451643147], 'name': 'Macrorregião Leste'}",1962
2015,"{'latlong': [-44.27497484025333, -5.493289451643147], 'name': 'Macrorregião Leste'}","{'latlong': [-44.80345012921731, -2.9260426894763576], 'name': 'Macrorregião Norte'}",70
2015,"{'latlong': [-44.27497484025333, -5.493289451643147], 'name': 'Macrorregião Leste'}","{'latlong': [-46.430337294867904, -6.654407452005538], 'name': 'Macrorregião Sul'}",6
2015,"{'latlong': [-44.80345012921731, -2.9260426894763576], 'name': 'Macrorregião Norte'}","{'latlong': [-44.27497484025333, -5.493289451643147], 'name': 'Macrorregião Leste'}",111
2015,"{'latlong': [-44.80345012921731, -2.9260426894763576], 'name': 'Macrorregião Norte'}","{'latlong': [-44.80345012921731, -2.9260426894763576], 'name': 'Macrorregião Norte'}",5098
2015,"{'latlong': [-44.80345012921731, -2.9260426894763576], 'name': 'Macrorregião Norte'}","{'latlong': [-46.430337294867904, -6.654407452005538], 'name': 'Macrorregião Sul'}",8
2015,"{'latlong': [-46.430337294867904, -6.654407452005538], 'name': 'Macrorregião Sul'}","{'latlong': [-44.27497484025333, -5.493289451643147], 'name': 'Macrorregião Leste'}",20
2015,"{'latlong': [-46.430337294867904, -6.654407452005538], 'name': 'Macrorregião Sul'}","{'latlong': [-44.80345012921731, -2.9260426894763576], 'name': 'Macrorregião Norte'}",22
2015,"{'latlong': [-46.430337294867904, -6.654407452005538], 'name': 'Macrorregião Sul'}","{'latlong': [-46.430337294867904, -6.654407452005538], 'name': 'Macrorregião Sul'}",2239
2016,"{'latlong': [-44.27497484025333, -5.493289451643147], 'name': 'Macrorregião Leste'}","{'latlong': [-44.27497484025333, -5.493289451643147], 'name': 'Macrorregião Leste'}",2221
2016,"{'latlong': [-44.27497484025333, -5.493289451643147], 'name': 'Macrorregião Leste'}","{'latlong': [-44.80345012921731, -2.9260426894763576], 'name': 'Macrorregião Norte'}",105
2016,"{'latlong': [-44.27497484025333, -5.493289451643147], 'name': 'Macrorregião Leste'}","{'latlong': [-46.430337294867904, -6.654407452005538], 'name': 'Macrorregião Sul'}",13
2016,"{'latlong': [-44.80345012921731, -2.9260426894763576], 'name': 'Macrorregião Norte'}","{'latlong': [-44.27497484025333, -5.493289451643147], 'name': 'Macrorregião Leste'}",151
2016,"{'latlong': [-44.80345012921731, -2.9260426894763576], 'name': 'Macrorregião Norte'}","{'latlong': [-44.80345012921731, -2.9260426894763576], 'name': 'Macrorregião Norte'}",6161
2016,"{'latlong': [-44.80345012921731, -2.9260426894763576], 'name': 'Macrorregião Norte'}","{'latlong': [-46.430337294867904, -6.654407452005538], 'name': 'Macrorregião Sul'}",20
2016,"{'latlong': [-46.430337294867904, -6.654407452005538], 'name': 'Macrorregião Sul'}","{'latlong': [-44.27497484025333, -5.493289451643147], 'name': 'Macrorregião Leste'}",17
2016,"{'latlong': [-46.430337294867904, -6.654407452005538], 'name': 'Macrorregião Sul'}","{'latlong': [-44.80345012921731, -2.9260426894763576], 'name': 'Macrorregião Norte'}",29
2016,"{'latlong': [-46.430337294867904, -6.654407452005538], 'name': 'Macrorregião Sul'}","{'latlong': [-46.430337294867904, -6.654407452005538], 'name': 'Macrorregião Sul'}",2133
2017,"{'latlong': [-44.27497484025333, -5.493289451643147], 'name': 'Macrorregião Leste'}","{'latlong': [-44.27497484025333, -5.493289451643147], 'name': 'Macrorregião Leste'}",2977
2017,"{'latlong': [-44.27497484025333, -5.493289451643147], 'name': 'Macrorregião Leste'}","{'latlong': [-44.80345012921731, -2.9260426894763576], 'name': 'Macrorregião Norte'}",95
2017,"{'latlong': [-44.27497484025333, -5.493289451643147], 'name': 'Macrorregião Leste'}","{'latlong': [-46.430337294867904, -6.654407452005538], 'name': 'Macrorregião Sul'}",10
2017,"{'latlong': [-44.80345012921731, -2.9260426894763576], 'name': 'Macrorregião Norte'}","{'latlong': [-44.27497484025333, -5.493289451643147], 'name': 'Macrorregião Leste'}",78
2017,"{'latlong': [-44.80345012921731, -2.9260426894763576], 'name': 'Macrorregião Norte'}","{'latlong': [-44.80345012921731, -2.9260426894763576], 'name': 'Macrorregião Norte'}",7591
2017,"{'latlong': [-44.80345012921731, -2.9260426894763576], 'name': 'Macrorregião Norte'}","{'latlong': [-46.430337294867904, -6.654407452005538], 'name': 'Macrorregião Sul'}",30
2017,"{'latlong': [-46.430337294867904, -6.654407452005538], 'name': 'Macrorregião Sul'}","{'latlong': [-44.27497484025333, -5.493289451643147], 'name': 'Macrorregião Leste'}",7
2017,"{'latlong': [-46.430337294867904, -6.654407452005538], 'name': 'Macrorregião Sul'}","{'latlong': [-44.80345012921731, -2.9260426894763576], 'name': 'Macrorregião Norte'}",42
2017,"{'latlong': [-46.430337294867904, -6.654407452005538], 'name': 'Macrorregião Sul'}","{'latlong': [-46.430337294867904, -6.654407452005538], 'name': 'Macrorregião Sul'}",2801
2018,"{'latlong': [-44.27497484025333, -5.493289451643147], 'name': 'Macrorregião Leste'}","{'latlong': [-44.27497484025333, -5.493289451643147], 'name': 'Macrorregião Leste'}",3628
2018,"{'latlong': [-44.27497484025333, -5.493289451643147], 'name': 'Macrorregião Leste'}","{'latlong': [-44.80345012921731, -2.9260426894763576], 'name': 'Macrorregião Norte'}",102
2018,"{'latlong': [-44.27497484025333, -5.493289451643147], 'name': 'Macrorregião Leste'}","{'latlong': [-46.430337294867904, -6.654407452005538], 'name': 'Macrorregião Sul'}",25
2018,"{'latlong': [-44.80345012921731, -2.9260426894763576], 'name': 'Macrorregião Norte'}","{'latlong': [-44.27497484025333, -5.493289451643147], 'name': 'Macrorregião Leste'}",59
2018,"{'latlong': [-44.80345012921731, -2.9260426894763576], 'name': 'Macrorregião Norte'}","{'latlong': [-44.80345012921731, -2.9260426894763576], 'name': 'Macrorregião Norte'}",8134
2018,"{'latlong': [-44.80345012921731, -2.9260426894763576], 'name': 'Macrorregião Norte'}","{'latlong': [-46.430337294867904, -6.654407452005538], 'name': 'Macrorregião Sul'}",19
2018,"{'latlong': [-46.430337294867904, -6.654407452005538], 'name': 'Macrorregião Sul'}","{'latlong': [-44.27497484025333, -5.493289451643147], 'name': 'Macrorregião Leste'}",12
2018,"{'latlong': [-46.430337294867904, -6.654407452005538], 'name': 'Macrorregião Sul'}","{'latlong': [-44.80345012921731, -2.9260426894763576], 'name': 'Macrorregião Norte'}",32
2018,"{'latlong': [-46.430337294867904, -6.654407452005538], 'name': 'Macrorregião Sul'}","{'latlong': [-46.430337294867904, -6.654407452005538], 'name': 'Macrorregião Sul'}",3303
2019,"{'latlong': [-44.27497484025333, -5.493289451643147], 'name': 'Macrorregião Leste'}","{'latlong': [-44.27497484025333, -5.493289451643147], 'name': 'Macrorregião Leste'}",3746
2019,"{'latlong': [-44.27497484025333, -5.493289451643147], 'name': 'Macrorregião Leste'}","{'latlong': [-44.80345012921731, -2.9260426894763576], 'name': 'Macrorregião Norte'}",121
2019,"{'latlong': [-44.27497484025333, -5.493289451643147], 'name': 'Macrorregião Leste'}","{'latlong': [-46.430337294867904, -6.654407452005538], 'name': 'Macrorregião Sul'}",20
2019,"{'latlong': [-44.80345012921731, -2.9260426894763576], 'name': 'Macrorregião Norte'}","{'latlong': [-44.27497484025333, -5.493289451643147], 'name': 'Macrorregião Leste'}",73
2019,"{'latlong': [-44.80345012921731, -2.9260426894763576], 'name': 'Macrorregião Norte'}","{'latlong': [-44.80345012921731, -2.9260426894763576], 'name': 'Macrorregião Norte'}",8624
2019,"{'latlong': [-44.80345012921731, -2.9260426894763576], 'name': 'Macrorregião Norte'}","{'latlong': [-46.430337294867904, -6.654407452005538], 'name': 'Macrorregião Sul'}",29
2019,"{'latlong': [-46.430337294867904, -6.654407452005538], 'name': 'Macrorregião Sul'}","{'latlong': [-44.27497484025333, -5.493289451643147], 'name': 'Macrorregião Leste'}",14
2019,"{'latlong': [-46.430337294867904, -6.654407452005538], 'name': 'Macrorregião Sul'}","{'latlong': [-44.80345012921731, -2.9260426894763576], 'name': 'Macrorregião Norte'}",35
2019,"{'latlong': [-46.430337294867904, -6.654407452005538], 'name': 'Macrorregião Sul'}","{'latlong': [-46.430337294867904, -6.654407452005538], 'name': 'Macrorregião Sul'}",3125
2020,"{'latlong': [-44.27497484025333, -5.493289451643147], 'name': 'Macrorregião Leste'}","{'latlong': [-44.27497484025333, -5.493289451643147], 'name': 'Macrorregião Leste'}",1133
2020,"{'latlong': [-44.27497484025333, -5.493289451643147], 'name': 'Macrorregião Leste'}","{'latlong': [-44.80345012921731, -2.9260426894763576], 'name': 'Macrorregião Norte'}",38
2020,"{'latlong': [-44.27497484025333, -5.493289451643147], 'name': 'Macrorregião Leste'}","{'latlong': [-46.430337294867904, -6.654407452005538], 'name': 'Macrorregião Sul'}",6
2020,"{'latlong': [-44.80345012921731, -2.9260426894763576], 'name': 'Macrorregião Norte'}","{'latlong': [-44.27497484025333, -5.493289451643147], 'name': 'Macrorregião Leste'}",10
2020,"{'latlong': [-44.80345012921731, -2.9260426894763576], 'name': 'Macrorregião Norte'}","{'latlong': [-44.80345012921731, -2.9260426894763576], 'name': 'Macrorregião Norte'}",2434
2020,"{'latlong': [-44.80345012921731, -2.9260426894763576], 'name': 'Macrorregião Norte'}","{'latlong': [-46.430337294867904, -6.654407452005538], 'name': 'Macrorregião Sul'}",4
2020,"{'latlong': [-46.430337294867904, -6.654407452005538], 'name': 'Macrorregião Sul'}","{'latlong': [-44.27497484025333, -5.493289451643147], 'name': 'Macrorregião Leste'}",11
2020,"{'latlong': [-46.430337294867904, -6.654407452005538], 'name': 'Macrorregião Sul'}","{'latlong': [-44.80345012921731, -2.9260426894763576], 'name': 'Macrorregião Norte'}",14
2020,"{'latlong': [-46.430337294867904, -6.654407452005538], 'name': 'Macrorregião Sul'}","{'latlong': [-46.430337294867904, -6.654407452005538], 'name': 'Macrorregião Sul'}",1103
