year,all
1994,53.67375035070434
1995,51.68654423062852
1996,52.53422946704253
1997,47.112453264308314
1998,53.67601980664938
1999,56.86920929595314
2000,45.89845147549678
2001,44.19071305429161
2002,53.62900100751763
2003,50.71757378824804
2004,65.86336250994658
2005,65.86336250994658
2006,60.76578248579505
2007,64.54968148556294
2008,64.02188518013708
2009,64.02188518013708
2010,71.38447335775899
2011,56.38771516887389
2012,65.2287317491025
2013,66.63009268616638
2014,75.84356342657811
2015,75.84356342657811
2016,75.84356342657811
2017,78.57877189442635
2018,84.05480711228564
2019,84.05480711228564
2020,86.6457572008172
