year,from,to,hospitalizations
1994,"{'latlong': [-57.78301983402671, -3.878545376148957], 'name': 'Baixo Amazonas'}","{'latlong': [-57.78301983402671, -3.878545376148957], 'name': 'Baixo Amazonas'}",33
1994,"{'latlong': [-58.80732579359148, -1.7695729901247828], 'name': 'Médio Amazonas'}","{'latlong': [-58.80732579359148, -1.7695729901247828], 'name': 'Médio Amazonas'}",10
1994,"{'latlong': [-60.54555982763556, -6.682636373094532], 'name': 'Rio Madeira'}","{'latlong': [-60.54555982763556, -6.682636373094532], 'name': 'Rio Madeira'}",8
1994,"{'latlong': [-62.7508323901846, -3.587400581314067], 'name': 'Rio Negro e Solimões'}","{'latlong': [-62.7508323901846, -3.587400581314067], 'name': 'Rio Negro e Solimões'}",43
1994,"{'latlong': [-64.47009165648124, -0.6042378800253123], 'name': 'Entorno Manaus'}","{'latlong': [-64.47009165648124, -0.6042378800253123], 'name': 'Entorno Manaus'}",319
1994,"{'latlong': [-65.88057334170182, -7.391761280156165], 'name': 'Regional Purus'}","{'latlong': [-65.88057334170182, -7.391761280156165], 'name': 'Regional Purus'}",10
1994,"{'latlong': [-65.88057334170182, -7.391761280156165], 'name': 'Regional Purus'}","{'latlong': [-69.69865585473899, -4.759892906023188], 'name': 'Alto Solimões'}",3
1994,"{'latlong': [-66.74397610654549, -2.7624940948828614], 'name': 'Triângulo'}","{'latlong': [-66.74397610654549, -2.7624940948828614], 'name': 'Triângulo'}",45
1994,"{'latlong': [-69.20896075625913, -6.4872294543537015], 'name': 'Regional Juruá'}","{'latlong': [-69.20896075625913, -6.4872294543537015], 'name': 'Regional Juruá'}",38
1994,"{'latlong': [-69.69865585473899, -4.759892906023188], 'name': 'Alto Solimões'}","{'latlong': [-69.69865585473899, -4.759892906023188], 'name': 'Alto Solimões'}",21
1995,"{'latlong': [-57.78301983402671, -3.878545376148957], 'name': 'Baixo Amazonas'}","{'latlong': [-57.78301983402671, -3.878545376148957], 'name': 'Baixo Amazonas'}",457
1995,"{'latlong': [-57.78301983402671, -3.878545376148957], 'name': 'Baixo Amazonas'}","{'latlong': [-58.80732579359148, -1.7695729901247828], 'name': 'Médio Amazonas'}",1
1995,"{'latlong': [-57.78301983402671, -3.878545376148957], 'name': 'Baixo Amazonas'}","{'latlong': [-64.47009165648124, -0.6042378800253123], 'name': 'Entorno Manaus'}",1
1995,"{'latlong': [-58.80732579359148, -1.7695729901247828], 'name': 'Médio Amazonas'}","{'latlong': [-58.80732579359148, -1.7695729901247828], 'name': 'Médio Amazonas'}",190
1995,"{'latlong': [-58.80732579359148, -1.7695729901247828], 'name': 'Médio Amazonas'}","{'latlong': [-64.47009165648124, -0.6042378800253123], 'name': 'Entorno Manaus'}",2
1995,"{'latlong': [-60.54555982763556, -6.682636373094532], 'name': 'Rio Madeira'}","{'latlong': [-60.54555982763556, -6.682636373094532], 'name': 'Rio Madeira'}",189
1995,"{'latlong': [-60.54555982763556, -6.682636373094532], 'name': 'Rio Madeira'}","{'latlong': [-64.47009165648124, -0.6042378800253123], 'name': 'Entorno Manaus'}",3
1995,"{'latlong': [-60.54555982763556, -6.682636373094532], 'name': 'Rio Madeira'}","{'latlong': [-65.88057334170182, -7.391761280156165], 'name': 'Regional Purus'}",1
1995,"{'latlong': [-60.54555982763556, -6.682636373094532], 'name': 'Rio Madeira'}","{'latlong': [-69.20896075625913, -6.4872294543537015], 'name': 'Regional Juruá'}",1
1995,"{'latlong': [-62.7508323901846, -3.587400581314067], 'name': 'Rio Negro e Solimões'}","{'latlong': [-57.78301983402671, -3.878545376148957], 'name': 'Baixo Amazonas'}",1
1995,"{'latlong': [-62.7508323901846, -3.587400581314067], 'name': 'Rio Negro e Solimões'}","{'latlong': [-62.7508323901846, -3.587400581314067], 'name': 'Rio Negro e Solimões'}",479
1995,"{'latlong': [-62.7508323901846, -3.587400581314067], 'name': 'Rio Negro e Solimões'}","{'latlong': [-64.47009165648124, -0.6042378800253123], 'name': 'Entorno Manaus'}",5
1995,"{'latlong': [-62.7508323901846, -3.587400581314067], 'name': 'Rio Negro e Solimões'}","{'latlong': [-65.88057334170182, -7.391761280156165], 'name': 'Regional Purus'}",1
1995,"{'latlong': [-64.47009165648124, -0.6042378800253123], 'name': 'Entorno Manaus'}","{'latlong': [-60.54555982763556, -6.682636373094532], 'name': 'Rio Madeira'}",120
1995,"{'latlong': [-64.47009165648124, -0.6042378800253123], 'name': 'Entorno Manaus'}","{'latlong': [-64.47009165648124, -0.6042378800253123], 'name': 'Entorno Manaus'}",4229
1995,"{'latlong': [-65.88057334170182, -7.391761280156165], 'name': 'Regional Purus'}","{'latlong': [-58.80732579359148, -1.7695729901247828], 'name': 'Médio Amazonas'}",1
1995,"{'latlong': [-65.88057334170182, -7.391761280156165], 'name': 'Regional Purus'}","{'latlong': [-64.47009165648124, -0.6042378800253123], 'name': 'Entorno Manaus'}",3
1995,"{'latlong': [-65.88057334170182, -7.391761280156165], 'name': 'Regional Purus'}","{'latlong': [-65.88057334170182, -7.391761280156165], 'name': 'Regional Purus'}",292
1995,"{'latlong': [-65.88057334170182, -7.391761280156165], 'name': 'Regional Purus'}","{'latlong': [-69.69865585473899, -4.759892906023188], 'name': 'Alto Solimões'}",8
1995,"{'latlong': [-66.74397610654549, -2.7624940948828614], 'name': 'Triângulo'}","{'latlong': [-64.47009165648124, -0.6042378800253123], 'name': 'Entorno Manaus'}",1
1995,"{'latlong': [-66.74397610654549, -2.7624940948828614], 'name': 'Triângulo'}","{'latlong': [-66.74397610654549, -2.7624940948828614], 'name': 'Triângulo'}",494
1995,"{'latlong': [-69.20896075625913, -6.4872294543537015], 'name': 'Regional Juruá'}","{'latlong': [-64.47009165648124, -0.6042378800253123], 'name': 'Entorno Manaus'}",6
1995,"{'latlong': [-69.20896075625913, -6.4872294543537015], 'name': 'Regional Juruá'}","{'latlong': [-69.20896075625913, -6.4872294543537015], 'name': 'Regional Juruá'}",217
1995,"{'latlong': [-69.69865585473899, -4.759892906023188], 'name': 'Alto Solimões'}","{'latlong': [-64.47009165648124, -0.6042378800253123], 'name': 'Entorno Manaus'}",2
1995,"{'latlong': [-69.69865585473899, -4.759892906023188], 'name': 'Alto Solimões'}","{'latlong': [-69.69865585473899, -4.759892906023188], 'name': 'Alto Solimões'}",247
1996,"{'latlong': [-57.78301983402671, -3.878545376148957], 'name': 'Baixo Amazonas'}","{'latlong': [-57.78301983402671, -3.878545376148957], 'name': 'Baixo Amazonas'}",353
1996,"{'latlong': [-57.78301983402671, -3.878545376148957], 'name': 'Baixo Amazonas'}","{'latlong': [-64.47009165648124, -0.6042378800253123], 'name': 'Entorno Manaus'}",2
1996,"{'latlong': [-58.80732579359148, -1.7695729901247828], 'name': 'Médio Amazonas'}","{'latlong': [-58.80732579359148, -1.7695729901247828], 'name': 'Médio Amazonas'}",141
1996,"{'latlong': [-58.80732579359148, -1.7695729901247828], 'name': 'Médio Amazonas'}","{'latlong': [-64.47009165648124, -0.6042378800253123], 'name': 'Entorno Manaus'}",1
1996,"{'latlong': [-60.54555982763556, -6.682636373094532], 'name': 'Rio Madeira'}","{'latlong': [-60.54555982763556, -6.682636373094532], 'name': 'Rio Madeira'}",200
1996,"{'latlong': [-60.54555982763556, -6.682636373094532], 'name': 'Rio Madeira'}","{'latlong': [-65.88057334170182, -7.391761280156165], 'name': 'Regional Purus'}",1
1996,"{'latlong': [-62.7508323901846, -3.587400581314067], 'name': 'Rio Negro e Solimões'}","{'latlong': [-62.7508323901846, -3.587400581314067], 'name': 'Rio Negro e Solimões'}",369
1996,"{'latlong': [-62.7508323901846, -3.587400581314067], 'name': 'Rio Negro e Solimões'}","{'latlong': [-64.47009165648124, -0.6042378800253123], 'name': 'Entorno Manaus'}",4
1996,"{'latlong': [-64.47009165648124, -0.6042378800253123], 'name': 'Entorno Manaus'}","{'latlong': [-57.78301983402671, -3.878545376148957], 'name': 'Baixo Amazonas'}",1
1996,"{'latlong': [-64.47009165648124, -0.6042378800253123], 'name': 'Entorno Manaus'}","{'latlong': [-60.54555982763556, -6.682636373094532], 'name': 'Rio Madeira'}",122
1996,"{'latlong': [-64.47009165648124, -0.6042378800253123], 'name': 'Entorno Manaus'}","{'latlong': [-62.7508323901846, -3.587400581314067], 'name': 'Rio Negro e Solimões'}",1
1996,"{'latlong': [-64.47009165648124, -0.6042378800253123], 'name': 'Entorno Manaus'}","{'latlong': [-64.47009165648124, -0.6042378800253123], 'name': 'Entorno Manaus'}",3723
1996,"{'latlong': [-64.47009165648124, -0.6042378800253123], 'name': 'Entorno Manaus'}","{'latlong': [-66.74397610654549, -2.7624940948828614], 'name': 'Triângulo'}",1
1996,"{'latlong': [-65.88057334170182, -7.391761280156165], 'name': 'Regional Purus'}","{'latlong': [-64.47009165648124, -0.6042378800253123], 'name': 'Entorno Manaus'}",2
1996,"{'latlong': [-65.88057334170182, -7.391761280156165], 'name': 'Regional Purus'}","{'latlong': [-65.88057334170182, -7.391761280156165], 'name': 'Regional Purus'}",228
1996,"{'latlong': [-66.74397610654549, -2.7624940948828614], 'name': 'Triângulo'}","{'latlong': [-62.7508323901846, -3.587400581314067], 'name': 'Rio Negro e Solimões'}",1
1996,"{'latlong': [-66.74397610654549, -2.7624940948828614], 'name': 'Triângulo'}","{'latlong': [-65.88057334170182, -7.391761280156165], 'name': 'Regional Purus'}",2
1996,"{'latlong': [-66.74397610654549, -2.7624940948828614], 'name': 'Triângulo'}","{'latlong': [-66.74397610654549, -2.7624940948828614], 'name': 'Triângulo'}",346
1996,"{'latlong': [-69.20896075625913, -6.4872294543537015], 'name': 'Regional Juruá'}","{'latlong': [-69.20896075625913, -6.4872294543537015], 'name': 'Regional Juruá'}",233
1996,"{'latlong': [-69.69865585473899, -4.759892906023188], 'name': 'Alto Solimões'}","{'latlong': [-64.47009165648124, -0.6042378800253123], 'name': 'Entorno Manaus'}",2
1996,"{'latlong': [-69.69865585473899, -4.759892906023188], 'name': 'Alto Solimões'}","{'latlong': [-65.88057334170182, -7.391761280156165], 'name': 'Regional Purus'}",4
1996,"{'latlong': [-69.69865585473899, -4.759892906023188], 'name': 'Alto Solimões'}","{'latlong': [-69.69865585473899, -4.759892906023188], 'name': 'Alto Solimões'}",340
1997,"{'latlong': [-57.78301983402671, -3.878545376148957], 'name': 'Baixo Amazonas'}","{'latlong': [-57.78301983402671, -3.878545376148957], 'name': 'Baixo Amazonas'}",239
1997,"{'latlong': [-58.80732579359148, -1.7695729901247828], 'name': 'Médio Amazonas'}","{'latlong': [-58.80732579359148, -1.7695729901247828], 'name': 'Médio Amazonas'}",116
1997,"{'latlong': [-58.80732579359148, -1.7695729901247828], 'name': 'Médio Amazonas'}","{'latlong': [-64.47009165648124, -0.6042378800253123], 'name': 'Entorno Manaus'}",2
1997,"{'latlong': [-60.54555982763556, -6.682636373094532], 'name': 'Rio Madeira'}","{'latlong': [-60.54555982763556, -6.682636373094532], 'name': 'Rio Madeira'}",261
1997,"{'latlong': [-62.7508323901846, -3.587400581314067], 'name': 'Rio Negro e Solimões'}","{'latlong': [-62.7508323901846, -3.587400581314067], 'name': 'Rio Negro e Solimões'}",276
1997,"{'latlong': [-62.7508323901846, -3.587400581314067], 'name': 'Rio Negro e Solimões'}","{'latlong': [-64.47009165648124, -0.6042378800253123], 'name': 'Entorno Manaus'}",1
1997,"{'latlong': [-64.47009165648124, -0.6042378800253123], 'name': 'Entorno Manaus'}","{'latlong': [-57.78301983402671, -3.878545376148957], 'name': 'Baixo Amazonas'}",1
1997,"{'latlong': [-64.47009165648124, -0.6042378800253123], 'name': 'Entorno Manaus'}","{'latlong': [-64.47009165648124, -0.6042378800253123], 'name': 'Entorno Manaus'}",4085
1997,"{'latlong': [-64.47009165648124, -0.6042378800253123], 'name': 'Entorno Manaus'}","{'latlong': [-69.69865585473899, -4.759892906023188], 'name': 'Alto Solimões'}",2
1997,"{'latlong': [-65.88057334170182, -7.391761280156165], 'name': 'Regional Purus'}","{'latlong': [-65.88057334170182, -7.391761280156165], 'name': 'Regional Purus'}",166
1997,"{'latlong': [-65.88057334170182, -7.391761280156165], 'name': 'Regional Purus'}","{'latlong': [-69.69865585473899, -4.759892906023188], 'name': 'Alto Solimões'}",2
1997,"{'latlong': [-66.74397610654549, -2.7624940948828614], 'name': 'Triângulo'}","{'latlong': [-66.74397610654549, -2.7624940948828614], 'name': 'Triângulo'}",209
1997,"{'latlong': [-69.20896075625913, -6.4872294543537015], 'name': 'Regional Juruá'}","{'latlong': [-69.20896075625913, -6.4872294543537015], 'name': 'Regional Juruá'}",114
1997,"{'latlong': [-69.69865585473899, -4.759892906023188], 'name': 'Alto Solimões'}","{'latlong': [-69.69865585473899, -4.759892906023188], 'name': 'Alto Solimões'}",251
1998,"{'latlong': [-57.78301983402671, -3.878545376148957], 'name': 'Baixo Amazonas'}","{'latlong': [-57.78301983402671, -3.878545376148957], 'name': 'Baixo Amazonas'}",87
1998,"{'latlong': [-57.78301983402671, -3.878545376148957], 'name': 'Baixo Amazonas'}","{'latlong': [-64.47009165648124, -0.6042378800253123], 'name': 'Entorno Manaus'}",1
1998,"{'latlong': [-57.78301983402671, -3.878545376148957], 'name': 'Baixo Amazonas'}","{'latlong': [-69.20896075625913, -6.4872294543537015], 'name': 'Regional Juruá'}",3
1998,"{'latlong': [-58.80732579359148, -1.7695729901247828], 'name': 'Médio Amazonas'}","{'latlong': [-58.80732579359148, -1.7695729901247828], 'name': 'Médio Amazonas'}",126
1998,"{'latlong': [-58.80732579359148, -1.7695729901247828], 'name': 'Médio Amazonas'}","{'latlong': [-64.47009165648124, -0.6042378800253123], 'name': 'Entorno Manaus'}",5
1998,"{'latlong': [-60.54555982763556, -6.682636373094532], 'name': 'Rio Madeira'}","{'latlong': [-60.54555982763556, -6.682636373094532], 'name': 'Rio Madeira'}",414
1998,"{'latlong': [-60.54555982763556, -6.682636373094532], 'name': 'Rio Madeira'}","{'latlong': [-64.47009165648124, -0.6042378800253123], 'name': 'Entorno Manaus'}",2
1998,"{'latlong': [-62.7508323901846, -3.587400581314067], 'name': 'Rio Negro e Solimões'}","{'latlong': [-60.54555982763556, -6.682636373094532], 'name': 'Rio Madeira'}",1
1998,"{'latlong': [-62.7508323901846, -3.587400581314067], 'name': 'Rio Negro e Solimões'}","{'latlong': [-62.7508323901846, -3.587400581314067], 'name': 'Rio Negro e Solimões'}",264
1998,"{'latlong': [-62.7508323901846, -3.587400581314067], 'name': 'Rio Negro e Solimões'}","{'latlong': [-64.47009165648124, -0.6042378800253123], 'name': 'Entorno Manaus'}",1
1998,"{'latlong': [-64.47009165648124, -0.6042378800253123], 'name': 'Entorno Manaus'}","{'latlong': [-57.78301983402671, -3.878545376148957], 'name': 'Baixo Amazonas'}",1
1998,"{'latlong': [-64.47009165648124, -0.6042378800253123], 'name': 'Entorno Manaus'}","{'latlong': [-64.47009165648124, -0.6042378800253123], 'name': 'Entorno Manaus'}",1208
1998,"{'latlong': [-65.88057334170182, -7.391761280156165], 'name': 'Regional Purus'}","{'latlong': [-64.47009165648124, -0.6042378800253123], 'name': 'Entorno Manaus'}",1
1998,"{'latlong': [-65.88057334170182, -7.391761280156165], 'name': 'Regional Purus'}","{'latlong': [-65.88057334170182, -7.391761280156165], 'name': 'Regional Purus'}",307
1998,"{'latlong': [-65.88057334170182, -7.391761280156165], 'name': 'Regional Purus'}","{'latlong': [-69.69865585473899, -4.759892906023188], 'name': 'Alto Solimões'}",29
1998,"{'latlong': [-66.74397610654549, -2.7624940948828614], 'name': 'Triângulo'}","{'latlong': [-66.74397610654549, -2.7624940948828614], 'name': 'Triângulo'}",481
1998,"{'latlong': [-69.20896075625913, -6.4872294543537015], 'name': 'Regional Juruá'}","{'latlong': [-60.54555982763556, -6.682636373094532], 'name': 'Rio Madeira'}",3
1998,"{'latlong': [-69.20896075625913, -6.4872294543537015], 'name': 'Regional Juruá'}","{'latlong': [-69.20896075625913, -6.4872294543537015], 'name': 'Regional Juruá'}",270
1998,"{'latlong': [-69.69865585473899, -4.759892906023188], 'name': 'Alto Solimões'}","{'latlong': [-64.47009165648124, -0.6042378800253123], 'name': 'Entorno Manaus'}",1
1998,"{'latlong': [-69.69865585473899, -4.759892906023188], 'name': 'Alto Solimões'}","{'latlong': [-69.69865585473899, -4.759892906023188], 'name': 'Alto Solimões'}",313
1999,"{'latlong': [-57.78301983402671, -3.878545376148957], 'name': 'Baixo Amazonas'}","{'latlong': [-57.78301983402671, -3.878545376148957], 'name': 'Baixo Amazonas'}",97
1999,"{'latlong': [-57.78301983402671, -3.878545376148957], 'name': 'Baixo Amazonas'}","{'latlong': [-60.54555982763556, -6.682636373094532], 'name': 'Rio Madeira'}",1
1999,"{'latlong': [-57.78301983402671, -3.878545376148957], 'name': 'Baixo Amazonas'}","{'latlong': [-64.47009165648124, -0.6042378800253123], 'name': 'Entorno Manaus'}",2
1999,"{'latlong': [-58.80732579359148, -1.7695729901247828], 'name': 'Médio Amazonas'}","{'latlong': [-58.80732579359148, -1.7695729901247828], 'name': 'Médio Amazonas'}",162
1999,"{'latlong': [-58.80732579359148, -1.7695729901247828], 'name': 'Médio Amazonas'}","{'latlong': [-64.47009165648124, -0.6042378800253123], 'name': 'Entorno Manaus'}",3
1999,"{'latlong': [-60.54555982763556, -6.682636373094532], 'name': 'Rio Madeira'}","{'latlong': [-60.54555982763556, -6.682636373094532], 'name': 'Rio Madeira'}",280
1999,"{'latlong': [-60.54555982763556, -6.682636373094532], 'name': 'Rio Madeira'}","{'latlong': [-64.47009165648124, -0.6042378800253123], 'name': 'Entorno Manaus'}",3
1999,"{'latlong': [-60.54555982763556, -6.682636373094532], 'name': 'Rio Madeira'}","{'latlong': [-69.20896075625913, -6.4872294543537015], 'name': 'Regional Juruá'}",1
1999,"{'latlong': [-62.7508323901846, -3.587400581314067], 'name': 'Rio Negro e Solimões'}","{'latlong': [-60.54555982763556, -6.682636373094532], 'name': 'Rio Madeira'}",1
1999,"{'latlong': [-62.7508323901846, -3.587400581314067], 'name': 'Rio Negro e Solimões'}","{'latlong': [-62.7508323901846, -3.587400581314067], 'name': 'Rio Negro e Solimões'}",295
1999,"{'latlong': [-62.7508323901846, -3.587400581314067], 'name': 'Rio Negro e Solimões'}","{'latlong': [-64.47009165648124, -0.6042378800253123], 'name': 'Entorno Manaus'}",10
1999,"{'latlong': [-64.47009165648124, -0.6042378800253123], 'name': 'Entorno Manaus'}","{'latlong': [-64.47009165648124, -0.6042378800253123], 'name': 'Entorno Manaus'}",1387
1999,"{'latlong': [-64.47009165648124, -0.6042378800253123], 'name': 'Entorno Manaus'}","{'latlong': [-69.69865585473899, -4.759892906023188], 'name': 'Alto Solimões'}",1
1999,"{'latlong': [-65.88057334170182, -7.391761280156165], 'name': 'Regional Purus'}","{'latlong': [-65.88057334170182, -7.391761280156165], 'name': 'Regional Purus'}",242
1999,"{'latlong': [-65.88057334170182, -7.391761280156165], 'name': 'Regional Purus'}","{'latlong': [-69.69865585473899, -4.759892906023188], 'name': 'Alto Solimões'}",24
1999,"{'latlong': [-66.74397610654549, -2.7624940948828614], 'name': 'Triângulo'}","{'latlong': [-62.7508323901846, -3.587400581314067], 'name': 'Rio Negro e Solimões'}",7
1999,"{'latlong': [-66.74397610654549, -2.7624940948828614], 'name': 'Triângulo'}","{'latlong': [-66.74397610654549, -2.7624940948828614], 'name': 'Triângulo'}",251
1999,"{'latlong': [-69.20896075625913, -6.4872294543537015], 'name': 'Regional Juruá'}","{'latlong': [-69.20896075625913, -6.4872294543537015], 'name': 'Regional Juruá'}",477
1999,"{'latlong': [-69.69865585473899, -4.759892906023188], 'name': 'Alto Solimões'}","{'latlong': [-64.47009165648124, -0.6042378800253123], 'name': 'Entorno Manaus'}",1
1999,"{'latlong': [-69.69865585473899, -4.759892906023188], 'name': 'Alto Solimões'}","{'latlong': [-69.69865585473899, -4.759892906023188], 'name': 'Alto Solimões'}",334
2000,"{'latlong': [-57.78301983402671, -3.878545376148957], 'name': 'Baixo Amazonas'}","{'latlong': [-57.78301983402671, -3.878545376148957], 'name': 'Baixo Amazonas'}",53
2000,"{'latlong': [-57.78301983402671, -3.878545376148957], 'name': 'Baixo Amazonas'}","{'latlong': [-64.47009165648124, -0.6042378800253123], 'name': 'Entorno Manaus'}",4
2000,"{'latlong': [-58.80732579359148, -1.7695729901247828], 'name': 'Médio Amazonas'}","{'latlong': [-58.80732579359148, -1.7695729901247828], 'name': 'Médio Amazonas'}",53
2000,"{'latlong': [-58.80732579359148, -1.7695729901247828], 'name': 'Médio Amazonas'}","{'latlong': [-64.47009165648124, -0.6042378800253123], 'name': 'Entorno Manaus'}",7
2000,"{'latlong': [-60.54555982763556, -6.682636373094532], 'name': 'Rio Madeira'}","{'latlong': [-60.54555982763556, -6.682636373094532], 'name': 'Rio Madeira'}",144
2000,"{'latlong': [-60.54555982763556, -6.682636373094532], 'name': 'Rio Madeira'}","{'latlong': [-64.47009165648124, -0.6042378800253123], 'name': 'Entorno Manaus'}",3
2000,"{'latlong': [-62.7508323901846, -3.587400581314067], 'name': 'Rio Negro e Solimões'}","{'latlong': [-62.7508323901846, -3.587400581314067], 'name': 'Rio Negro e Solimões'}",434
2000,"{'latlong': [-62.7508323901846, -3.587400581314067], 'name': 'Rio Negro e Solimões'}","{'latlong': [-64.47009165648124, -0.6042378800253123], 'name': 'Entorno Manaus'}",14
2000,"{'latlong': [-64.47009165648124, -0.6042378800253123], 'name': 'Entorno Manaus'}","{'latlong': [-64.47009165648124, -0.6042378800253123], 'name': 'Entorno Manaus'}",1044
2000,"{'latlong': [-65.88057334170182, -7.391761280156165], 'name': 'Regional Purus'}","{'latlong': [-64.47009165648124, -0.6042378800253123], 'name': 'Entorno Manaus'}",4
2000,"{'latlong': [-65.88057334170182, -7.391761280156165], 'name': 'Regional Purus'}","{'latlong': [-65.88057334170182, -7.391761280156165], 'name': 'Regional Purus'}",113
2000,"{'latlong': [-65.88057334170182, -7.391761280156165], 'name': 'Regional Purus'}","{'latlong': [-69.69865585473899, -4.759892906023188], 'name': 'Alto Solimões'}",27
2000,"{'latlong': [-66.74397610654549, -2.7624940948828614], 'name': 'Triângulo'}","{'latlong': [-62.7508323901846, -3.587400581314067], 'name': 'Rio Negro e Solimões'}",16
2000,"{'latlong': [-66.74397610654549, -2.7624940948828614], 'name': 'Triângulo'}","{'latlong': [-64.47009165648124, -0.6042378800253123], 'name': 'Entorno Manaus'}",1
2000,"{'latlong': [-66.74397610654549, -2.7624940948828614], 'name': 'Triângulo'}","{'latlong': [-66.74397610654549, -2.7624940948828614], 'name': 'Triângulo'}",202
2000,"{'latlong': [-69.20896075625913, -6.4872294543537015], 'name': 'Regional Juruá'}","{'latlong': [-69.20896075625913, -6.4872294543537015], 'name': 'Regional Juruá'}",181
2000,"{'latlong': [-69.69865585473899, -4.759892906023188], 'name': 'Alto Solimões'}","{'latlong': [-64.47009165648124, -0.6042378800253123], 'name': 'Entorno Manaus'}",2
2000,"{'latlong': [-69.69865585473899, -4.759892906023188], 'name': 'Alto Solimões'}","{'latlong': [-69.69865585473899, -4.759892906023188], 'name': 'Alto Solimões'}",183
2001,"{'latlong': [-57.78301983402671, -3.878545376148957], 'name': 'Baixo Amazonas'}","{'latlong': [-57.78301983402671, -3.878545376148957], 'name': 'Baixo Amazonas'}",37
2001,"{'latlong': [-57.78301983402671, -3.878545376148957], 'name': 'Baixo Amazonas'}","{'latlong': [-64.47009165648124, -0.6042378800253123], 'name': 'Entorno Manaus'}",1
2001,"{'latlong': [-58.80732579359148, -1.7695729901247828], 'name': 'Médio Amazonas'}","{'latlong': [-58.80732579359148, -1.7695729901247828], 'name': 'Médio Amazonas'}",8
2001,"{'latlong': [-58.80732579359148, -1.7695729901247828], 'name': 'Médio Amazonas'}","{'latlong': [-64.47009165648124, -0.6042378800253123], 'name': 'Entorno Manaus'}",8
2001,"{'latlong': [-60.54555982763556, -6.682636373094532], 'name': 'Rio Madeira'}","{'latlong': [-60.54555982763556, -6.682636373094532], 'name': 'Rio Madeira'}",89
2001,"{'latlong': [-60.54555982763556, -6.682636373094532], 'name': 'Rio Madeira'}","{'latlong': [-64.47009165648124, -0.6042378800253123], 'name': 'Entorno Manaus'}",1
2001,"{'latlong': [-62.7508323901846, -3.587400581314067], 'name': 'Rio Negro e Solimões'}","{'latlong': [-62.7508323901846, -3.587400581314067], 'name': 'Rio Negro e Solimões'}",252
2001,"{'latlong': [-62.7508323901846, -3.587400581314067], 'name': 'Rio Negro e Solimões'}","{'latlong': [-64.47009165648124, -0.6042378800253123], 'name': 'Entorno Manaus'}",21
2001,"{'latlong': [-64.47009165648124, -0.6042378800253123], 'name': 'Entorno Manaus'}","{'latlong': [-64.47009165648124, -0.6042378800253123], 'name': 'Entorno Manaus'}",948
2001,"{'latlong': [-65.88057334170182, -7.391761280156165], 'name': 'Regional Purus'}","{'latlong': [-62.7508323901846, -3.587400581314067], 'name': 'Rio Negro e Solimões'}",1
2001,"{'latlong': [-65.88057334170182, -7.391761280156165], 'name': 'Regional Purus'}","{'latlong': [-64.47009165648124, -0.6042378800253123], 'name': 'Entorno Manaus'}",2
2001,"{'latlong': [-65.88057334170182, -7.391761280156165], 'name': 'Regional Purus'}","{'latlong': [-65.88057334170182, -7.391761280156165], 'name': 'Regional Purus'}",108
2001,"{'latlong': [-66.74397610654549, -2.7624940948828614], 'name': 'Triângulo'}","{'latlong': [-62.7508323901846, -3.587400581314067], 'name': 'Rio Negro e Solimões'}",5
2001,"{'latlong': [-66.74397610654549, -2.7624940948828614], 'name': 'Triângulo'}","{'latlong': [-64.47009165648124, -0.6042378800253123], 'name': 'Entorno Manaus'}",4
2001,"{'latlong': [-66.74397610654549, -2.7624940948828614], 'name': 'Triângulo'}","{'latlong': [-66.74397610654549, -2.7624940948828614], 'name': 'Triângulo'}",85
2001,"{'latlong': [-69.20896075625913, -6.4872294543537015], 'name': 'Regional Juruá'}","{'latlong': [-64.47009165648124, -0.6042378800253123], 'name': 'Entorno Manaus'}",1
2001,"{'latlong': [-69.20896075625913, -6.4872294543537015], 'name': 'Regional Juruá'}","{'latlong': [-69.20896075625913, -6.4872294543537015], 'name': 'Regional Juruá'}",102
2001,"{'latlong': [-69.69865585473899, -4.759892906023188], 'name': 'Alto Solimões'}","{'latlong': [-64.47009165648124, -0.6042378800253123], 'name': 'Entorno Manaus'}",3
2001,"{'latlong': [-69.69865585473899, -4.759892906023188], 'name': 'Alto Solimões'}","{'latlong': [-69.69865585473899, -4.759892906023188], 'name': 'Alto Solimões'}",73
2002,"{'latlong': [-57.78301983402671, -3.878545376148957], 'name': 'Baixo Amazonas'}","{'latlong': [-57.78301983402671, -3.878545376148957], 'name': 'Baixo Amazonas'}",101
2002,"{'latlong': [-57.78301983402671, -3.878545376148957], 'name': 'Baixo Amazonas'}","{'latlong': [-64.47009165648124, -0.6042378800253123], 'name': 'Entorno Manaus'}",5
2002,"{'latlong': [-58.80732579359148, -1.7695729901247828], 'name': 'Médio Amazonas'}","{'latlong': [-58.80732579359148, -1.7695729901247828], 'name': 'Médio Amazonas'}",39
2002,"{'latlong': [-58.80732579359148, -1.7695729901247828], 'name': 'Médio Amazonas'}","{'latlong': [-64.47009165648124, -0.6042378800253123], 'name': 'Entorno Manaus'}",8
2002,"{'latlong': [-60.54555982763556, -6.682636373094532], 'name': 'Rio Madeira'}","{'latlong': [-60.54555982763556, -6.682636373094532], 'name': 'Rio Madeira'}",142
2002,"{'latlong': [-60.54555982763556, -6.682636373094532], 'name': 'Rio Madeira'}","{'latlong': [-64.47009165648124, -0.6042378800253123], 'name': 'Entorno Manaus'}",6
2002,"{'latlong': [-62.7508323901846, -3.587400581314067], 'name': 'Rio Negro e Solimões'}","{'latlong': [-62.7508323901846, -3.587400581314067], 'name': 'Rio Negro e Solimões'}",184
2002,"{'latlong': [-62.7508323901846, -3.587400581314067], 'name': 'Rio Negro e Solimões'}","{'latlong': [-64.47009165648124, -0.6042378800253123], 'name': 'Entorno Manaus'}",30
2002,"{'latlong': [-62.7508323901846, -3.587400581314067], 'name': 'Rio Negro e Solimões'}","{'latlong': [-69.20896075625913, -6.4872294543537015], 'name': 'Regional Juruá'}",2
2002,"{'latlong': [-64.47009165648124, -0.6042378800253123], 'name': 'Entorno Manaus'}","{'latlong': [-64.47009165648124, -0.6042378800253123], 'name': 'Entorno Manaus'}",1705
2002,"{'latlong': [-65.88057334170182, -7.391761280156165], 'name': 'Regional Purus'}","{'latlong': [-64.47009165648124, -0.6042378800253123], 'name': 'Entorno Manaus'}",2
2002,"{'latlong': [-65.88057334170182, -7.391761280156165], 'name': 'Regional Purus'}","{'latlong': [-65.88057334170182, -7.391761280156165], 'name': 'Regional Purus'}",129
2002,"{'latlong': [-66.74397610654549, -2.7624940948828614], 'name': 'Triângulo'}","{'latlong': [-62.7508323901846, -3.587400581314067], 'name': 'Rio Negro e Solimões'}",2
2002,"{'latlong': [-66.74397610654549, -2.7624940948828614], 'name': 'Triângulo'}","{'latlong': [-64.47009165648124, -0.6042378800253123], 'name': 'Entorno Manaus'}",4
2002,"{'latlong': [-66.74397610654549, -2.7624940948828614], 'name': 'Triângulo'}","{'latlong': [-66.74397610654549, -2.7624940948828614], 'name': 'Triângulo'}",112
2002,"{'latlong': [-66.74397610654549, -2.7624940948828614], 'name': 'Triângulo'}","{'latlong': [-69.69865585473899, -4.759892906023188], 'name': 'Alto Solimões'}",1
2002,"{'latlong': [-69.20896075625913, -6.4872294543537015], 'name': 'Regional Juruá'}","{'latlong': [-60.54555982763556, -6.682636373094532], 'name': 'Rio Madeira'}",1
2002,"{'latlong': [-69.20896075625913, -6.4872294543537015], 'name': 'Regional Juruá'}","{'latlong': [-64.47009165648124, -0.6042378800253123], 'name': 'Entorno Manaus'}",1
2002,"{'latlong': [-69.20896075625913, -6.4872294543537015], 'name': 'Regional Juruá'}","{'latlong': [-69.20896075625913, -6.4872294543537015], 'name': 'Regional Juruá'}",100
2002,"{'latlong': [-69.69865585473899, -4.759892906023188], 'name': 'Alto Solimões'}","{'latlong': [-64.47009165648124, -0.6042378800253123], 'name': 'Entorno Manaus'}",2
2002,"{'latlong': [-69.69865585473899, -4.759892906023188], 'name': 'Alto Solimões'}","{'latlong': [-69.69865585473899, -4.759892906023188], 'name': 'Alto Solimões'}",118
2003,"{'latlong': [-57.78301983402671, -3.878545376148957], 'name': 'Baixo Amazonas'}","{'latlong': [-57.78301983402671, -3.878545376148957], 'name': 'Baixo Amazonas'}",109
2003,"{'latlong': [-57.78301983402671, -3.878545376148957], 'name': 'Baixo Amazonas'}","{'latlong': [-64.47009165648124, -0.6042378800253123], 'name': 'Entorno Manaus'}",5
2003,"{'latlong': [-58.80732579359148, -1.7695729901247828], 'name': 'Médio Amazonas'}","{'latlong': [-58.80732579359148, -1.7695729901247828], 'name': 'Médio Amazonas'}",20
2003,"{'latlong': [-58.80732579359148, -1.7695729901247828], 'name': 'Médio Amazonas'}","{'latlong': [-64.47009165648124, -0.6042378800253123], 'name': 'Entorno Manaus'}",14
2003,"{'latlong': [-60.54555982763556, -6.682636373094532], 'name': 'Rio Madeira'}","{'latlong': [-60.54555982763556, -6.682636373094532], 'name': 'Rio Madeira'}",92
2003,"{'latlong': [-60.54555982763556, -6.682636373094532], 'name': 'Rio Madeira'}","{'latlong': [-64.47009165648124, -0.6042378800253123], 'name': 'Entorno Manaus'}",3
2003,"{'latlong': [-62.7508323901846, -3.587400581314067], 'name': 'Rio Negro e Solimões'}","{'latlong': [-62.7508323901846, -3.587400581314067], 'name': 'Rio Negro e Solimões'}",96
2003,"{'latlong': [-62.7508323901846, -3.587400581314067], 'name': 'Rio Negro e Solimões'}","{'latlong': [-64.47009165648124, -0.6042378800253123], 'name': 'Entorno Manaus'}",24
2003,"{'latlong': [-64.47009165648124, -0.6042378800253123], 'name': 'Entorno Manaus'}","{'latlong': [-64.47009165648124, -0.6042378800253123], 'name': 'Entorno Manaus'}",2678
2003,"{'latlong': [-65.88057334170182, -7.391761280156165], 'name': 'Regional Purus'}","{'latlong': [-65.88057334170182, -7.391761280156165], 'name': 'Regional Purus'}",129
2003,"{'latlong': [-66.74397610654549, -2.7624940948828614], 'name': 'Triângulo'}","{'latlong': [-66.74397610654549, -2.7624940948828614], 'name': 'Triângulo'}",114
2003,"{'latlong': [-69.20896075625913, -6.4872294543537015], 'name': 'Regional Juruá'}","{'latlong': [-64.47009165648124, -0.6042378800253123], 'name': 'Entorno Manaus'}",1
2003,"{'latlong': [-69.20896075625913, -6.4872294543537015], 'name': 'Regional Juruá'}","{'latlong': [-69.20896075625913, -6.4872294543537015], 'name': 'Regional Juruá'}",103
2003,"{'latlong': [-69.69865585473899, -4.759892906023188], 'name': 'Alto Solimões'}","{'latlong': [-69.69865585473899, -4.759892906023188], 'name': 'Alto Solimões'}",98
2004,"{'latlong': [-57.78301983402671, -3.878545376148957], 'name': 'Baixo Amazonas'}","{'latlong': [-57.78301983402671, -3.878545376148957], 'name': 'Baixo Amazonas'}",117
2004,"{'latlong': [-57.78301983402671, -3.878545376148957], 'name': 'Baixo Amazonas'}","{'latlong': [-60.54555982763556, -6.682636373094532], 'name': 'Rio Madeira'}",1
2004,"{'latlong': [-57.78301983402671, -3.878545376148957], 'name': 'Baixo Amazonas'}","{'latlong': [-64.47009165648124, -0.6042378800253123], 'name': 'Entorno Manaus'}",10
2004,"{'latlong': [-58.80732579359148, -1.7695729901247828], 'name': 'Médio Amazonas'}","{'latlong': [-58.80732579359148, -1.7695729901247828], 'name': 'Médio Amazonas'}",127
2004,"{'latlong': [-58.80732579359148, -1.7695729901247828], 'name': 'Médio Amazonas'}","{'latlong': [-64.47009165648124, -0.6042378800253123], 'name': 'Entorno Manaus'}",17
2004,"{'latlong': [-60.54555982763556, -6.682636373094532], 'name': 'Rio Madeira'}","{'latlong': [-60.54555982763556, -6.682636373094532], 'name': 'Rio Madeira'}",176
2004,"{'latlong': [-60.54555982763556, -6.682636373094532], 'name': 'Rio Madeira'}","{'latlong': [-64.47009165648124, -0.6042378800253123], 'name': 'Entorno Manaus'}",13
2004,"{'latlong': [-62.7508323901846, -3.587400581314067], 'name': 'Rio Negro e Solimões'}","{'latlong': [-62.7508323901846, -3.587400581314067], 'name': 'Rio Negro e Solimões'}",103
2004,"{'latlong': [-62.7508323901846, -3.587400581314067], 'name': 'Rio Negro e Solimões'}","{'latlong': [-64.47009165648124, -0.6042378800253123], 'name': 'Entorno Manaus'}",35
2004,"{'latlong': [-64.47009165648124, -0.6042378800253123], 'name': 'Entorno Manaus'}","{'latlong': [-64.47009165648124, -0.6042378800253123], 'name': 'Entorno Manaus'}",2670
2004,"{'latlong': [-65.88057334170182, -7.391761280156165], 'name': 'Regional Purus'}","{'latlong': [-64.47009165648124, -0.6042378800253123], 'name': 'Entorno Manaus'}",1
2004,"{'latlong': [-65.88057334170182, -7.391761280156165], 'name': 'Regional Purus'}","{'latlong': [-65.88057334170182, -7.391761280156165], 'name': 'Regional Purus'}",166
2004,"{'latlong': [-66.74397610654549, -2.7624940948828614], 'name': 'Triângulo'}","{'latlong': [-64.47009165648124, -0.6042378800253123], 'name': 'Entorno Manaus'}",6
2004,"{'latlong': [-66.74397610654549, -2.7624940948828614], 'name': 'Triângulo'}","{'latlong': [-66.74397610654549, -2.7624940948828614], 'name': 'Triângulo'}",142
2004,"{'latlong': [-69.20896075625913, -6.4872294543537015], 'name': 'Regional Juruá'}","{'latlong': [-64.47009165648124, -0.6042378800253123], 'name': 'Entorno Manaus'}",2
2004,"{'latlong': [-69.20896075625913, -6.4872294543537015], 'name': 'Regional Juruá'}","{'latlong': [-69.20896075625913, -6.4872294543537015], 'name': 'Regional Juruá'}",89
2004,"{'latlong': [-69.69865585473899, -4.759892906023188], 'name': 'Alto Solimões'}","{'latlong': [-64.47009165648124, -0.6042378800253123], 'name': 'Entorno Manaus'}",4
2004,"{'latlong': [-69.69865585473899, -4.759892906023188], 'name': 'Alto Solimões'}","{'latlong': [-69.69865585473899, -4.759892906023188], 'name': 'Alto Solimões'}",86
2005,"{'latlong': [-57.78301983402671, -3.878545376148957], 'name': 'Baixo Amazonas'}","{'latlong': [-57.78301983402671, -3.878545376148957], 'name': 'Baixo Amazonas'}",197
2005,"{'latlong': [-57.78301983402671, -3.878545376148957], 'name': 'Baixo Amazonas'}","{'latlong': [-64.47009165648124, -0.6042378800253123], 'name': 'Entorno Manaus'}",4
2005,"{'latlong': [-58.80732579359148, -1.7695729901247828], 'name': 'Médio Amazonas'}","{'latlong': [-58.80732579359148, -1.7695729901247828], 'name': 'Médio Amazonas'}",120
2005,"{'latlong': [-58.80732579359148, -1.7695729901247828], 'name': 'Médio Amazonas'}","{'latlong': [-64.47009165648124, -0.6042378800253123], 'name': 'Entorno Manaus'}",11
2005,"{'latlong': [-60.54555982763556, -6.682636373094532], 'name': 'Rio Madeira'}","{'latlong': [-60.54555982763556, -6.682636373094532], 'name': 'Rio Madeira'}",266
2005,"{'latlong': [-60.54555982763556, -6.682636373094532], 'name': 'Rio Madeira'}","{'latlong': [-64.47009165648124, -0.6042378800253123], 'name': 'Entorno Manaus'}",12
2005,"{'latlong': [-62.7508323901846, -3.587400581314067], 'name': 'Rio Negro e Solimões'}","{'latlong': [-62.7508323901846, -3.587400581314067], 'name': 'Rio Negro e Solimões'}",163
2005,"{'latlong': [-62.7508323901846, -3.587400581314067], 'name': 'Rio Negro e Solimões'}","{'latlong': [-64.47009165648124, -0.6042378800253123], 'name': 'Entorno Manaus'}",29
2005,"{'latlong': [-64.47009165648124, -0.6042378800253123], 'name': 'Entorno Manaus'}","{'latlong': [-64.47009165648124, -0.6042378800253123], 'name': 'Entorno Manaus'}",2865
2005,"{'latlong': [-65.88057334170182, -7.391761280156165], 'name': 'Regional Purus'}","{'latlong': [-64.47009165648124, -0.6042378800253123], 'name': 'Entorno Manaus'}",4
2005,"{'latlong': [-65.88057334170182, -7.391761280156165], 'name': 'Regional Purus'}","{'latlong': [-65.88057334170182, -7.391761280156165], 'name': 'Regional Purus'}",242
2005,"{'latlong': [-66.74397610654549, -2.7624940948828614], 'name': 'Triângulo'}","{'latlong': [-64.47009165648124, -0.6042378800253123], 'name': 'Entorno Manaus'}",5
2005,"{'latlong': [-66.74397610654549, -2.7624940948828614], 'name': 'Triângulo'}","{'latlong': [-66.74397610654549, -2.7624940948828614], 'name': 'Triângulo'}",195
2005,"{'latlong': [-69.20896075625913, -6.4872294543537015], 'name': 'Regional Juruá'}","{'latlong': [-64.47009165648124, -0.6042378800253123], 'name': 'Entorno Manaus'}",1
2005,"{'latlong': [-69.20896075625913, -6.4872294543537015], 'name': 'Regional Juruá'}","{'latlong': [-69.20896075625913, -6.4872294543537015], 'name': 'Regional Juruá'}",149
2005,"{'latlong': [-69.69865585473899, -4.759892906023188], 'name': 'Alto Solimões'}","{'latlong': [-64.47009165648124, -0.6042378800253123], 'name': 'Entorno Manaus'}",5
2005,"{'latlong': [-69.69865585473899, -4.759892906023188], 'name': 'Alto Solimões'}","{'latlong': [-69.69865585473899, -4.759892906023188], 'name': 'Alto Solimões'}",165
2006,"{'latlong': [-57.78301983402671, -3.878545376148957], 'name': 'Baixo Amazonas'}","{'latlong': [-57.78301983402671, -3.878545376148957], 'name': 'Baixo Amazonas'}",209
2006,"{'latlong': [-57.78301983402671, -3.878545376148957], 'name': 'Baixo Amazonas'}","{'latlong': [-64.47009165648124, -0.6042378800253123], 'name': 'Entorno Manaus'}",2
2006,"{'latlong': [-58.80732579359148, -1.7695729901247828], 'name': 'Médio Amazonas'}","{'latlong': [-58.80732579359148, -1.7695729901247828], 'name': 'Médio Amazonas'}",71
2006,"{'latlong': [-58.80732579359148, -1.7695729901247828], 'name': 'Médio Amazonas'}","{'latlong': [-64.47009165648124, -0.6042378800253123], 'name': 'Entorno Manaus'}",11
2006,"{'latlong': [-60.54555982763556, -6.682636373094532], 'name': 'Rio Madeira'}","{'latlong': [-60.54555982763556, -6.682636373094532], 'name': 'Rio Madeira'}",195
2006,"{'latlong': [-60.54555982763556, -6.682636373094532], 'name': 'Rio Madeira'}","{'latlong': [-64.47009165648124, -0.6042378800253123], 'name': 'Entorno Manaus'}",14
2006,"{'latlong': [-62.7508323901846, -3.587400581314067], 'name': 'Rio Negro e Solimões'}","{'latlong': [-62.7508323901846, -3.587400581314067], 'name': 'Rio Negro e Solimões'}",120
2006,"{'latlong': [-62.7508323901846, -3.587400581314067], 'name': 'Rio Negro e Solimões'}","{'latlong': [-64.47009165648124, -0.6042378800253123], 'name': 'Entorno Manaus'}",27
2006,"{'latlong': [-64.47009165648124, -0.6042378800253123], 'name': 'Entorno Manaus'}","{'latlong': [-64.47009165648124, -0.6042378800253123], 'name': 'Entorno Manaus'}",1994
2006,"{'latlong': [-65.88057334170182, -7.391761280156165], 'name': 'Regional Purus'}","{'latlong': [-64.47009165648124, -0.6042378800253123], 'name': 'Entorno Manaus'}",1
2006,"{'latlong': [-65.88057334170182, -7.391761280156165], 'name': 'Regional Purus'}","{'latlong': [-65.88057334170182, -7.391761280156165], 'name': 'Regional Purus'}",290
2006,"{'latlong': [-65.88057334170182, -7.391761280156165], 'name': 'Regional Purus'}","{'latlong': [-69.20896075625913, -6.4872294543537015], 'name': 'Regional Juruá'}",2
2006,"{'latlong': [-66.74397610654549, -2.7624940948828614], 'name': 'Triângulo'}","{'latlong': [-64.47009165648124, -0.6042378800253123], 'name': 'Entorno Manaus'}",5
2006,"{'latlong': [-66.74397610654549, -2.7624940948828614], 'name': 'Triângulo'}","{'latlong': [-66.74397610654549, -2.7624940948828614], 'name': 'Triângulo'}",204
2006,"{'latlong': [-69.20896075625913, -6.4872294543537015], 'name': 'Regional Juruá'}","{'latlong': [-64.47009165648124, -0.6042378800253123], 'name': 'Entorno Manaus'}",1
2006,"{'latlong': [-69.20896075625913, -6.4872294543537015], 'name': 'Regional Juruá'}","{'latlong': [-69.20896075625913, -6.4872294543537015], 'name': 'Regional Juruá'}",192
2006,"{'latlong': [-69.69865585473899, -4.759892906023188], 'name': 'Alto Solimões'}","{'latlong': [-64.47009165648124, -0.6042378800253123], 'name': 'Entorno Manaus'}",1
2006,"{'latlong': [-69.69865585473899, -4.759892906023188], 'name': 'Alto Solimões'}","{'latlong': [-69.69865585473899, -4.759892906023188], 'name': 'Alto Solimões'}",255
2007,"{'latlong': [-57.78301983402671, -3.878545376148957], 'name': 'Baixo Amazonas'}","{'latlong': [-57.78301983402671, -3.878545376148957], 'name': 'Baixo Amazonas'}",181
2007,"{'latlong': [-57.78301983402671, -3.878545376148957], 'name': 'Baixo Amazonas'}","{'latlong': [-64.47009165648124, -0.6042378800253123], 'name': 'Entorno Manaus'}",7
2007,"{'latlong': [-58.80732579359148, -1.7695729901247828], 'name': 'Médio Amazonas'}","{'latlong': [-58.80732579359148, -1.7695729901247828], 'name': 'Médio Amazonas'}",86
2007,"{'latlong': [-58.80732579359148, -1.7695729901247828], 'name': 'Médio Amazonas'}","{'latlong': [-64.47009165648124, -0.6042378800253123], 'name': 'Entorno Manaus'}",16
2007,"{'latlong': [-60.54555982763556, -6.682636373094532], 'name': 'Rio Madeira'}","{'latlong': [-60.54555982763556, -6.682636373094532], 'name': 'Rio Madeira'}",198
2007,"{'latlong': [-60.54555982763556, -6.682636373094532], 'name': 'Rio Madeira'}","{'latlong': [-64.47009165648124, -0.6042378800253123], 'name': 'Entorno Manaus'}",13
2007,"{'latlong': [-62.7508323901846, -3.587400581314067], 'name': 'Rio Negro e Solimões'}","{'latlong': [-62.7508323901846, -3.587400581314067], 'name': 'Rio Negro e Solimões'}",135
2007,"{'latlong': [-62.7508323901846, -3.587400581314067], 'name': 'Rio Negro e Solimões'}","{'latlong': [-64.47009165648124, -0.6042378800253123], 'name': 'Entorno Manaus'}",18
2007,"{'latlong': [-64.47009165648124, -0.6042378800253123], 'name': 'Entorno Manaus'}","{'latlong': [-64.47009165648124, -0.6042378800253123], 'name': 'Entorno Manaus'}",1986
2007,"{'latlong': [-65.88057334170182, -7.391761280156165], 'name': 'Regional Purus'}","{'latlong': [-64.47009165648124, -0.6042378800253123], 'name': 'Entorno Manaus'}",1
2007,"{'latlong': [-65.88057334170182, -7.391761280156165], 'name': 'Regional Purus'}","{'latlong': [-65.88057334170182, -7.391761280156165], 'name': 'Regional Purus'}",92
2007,"{'latlong': [-66.74397610654549, -2.7624940948828614], 'name': 'Triângulo'}","{'latlong': [-64.47009165648124, -0.6042378800253123], 'name': 'Entorno Manaus'}",2
2007,"{'latlong': [-66.74397610654549, -2.7624940948828614], 'name': 'Triângulo'}","{'latlong': [-66.74397610654549, -2.7624940948828614], 'name': 'Triângulo'}",183
2007,"{'latlong': [-69.20896075625913, -6.4872294543537015], 'name': 'Regional Juruá'}","{'latlong': [-69.20896075625913, -6.4872294543537015], 'name': 'Regional Juruá'}",99
2007,"{'latlong': [-69.69865585473899, -4.759892906023188], 'name': 'Alto Solimões'}","{'latlong': [-64.47009165648124, -0.6042378800253123], 'name': 'Entorno Manaus'}",1
2007,"{'latlong': [-69.69865585473899, -4.759892906023188], 'name': 'Alto Solimões'}","{'latlong': [-69.69865585473899, -4.759892906023188], 'name': 'Alto Solimões'}",298
2008,"{'latlong': [-57.78301983402671, -3.878545376148957], 'name': 'Baixo Amazonas'}","{'latlong': [-57.78301983402671, -3.878545376148957], 'name': 'Baixo Amazonas'}",113
2008,"{'latlong': [-57.78301983402671, -3.878545376148957], 'name': 'Baixo Amazonas'}","{'latlong': [-64.47009165648124, -0.6042378800253123], 'name': 'Entorno Manaus'}",9
2008,"{'latlong': [-58.80732579359148, -1.7695729901247828], 'name': 'Médio Amazonas'}","{'latlong': [-58.80732579359148, -1.7695729901247828], 'name': 'Médio Amazonas'}",76
2008,"{'latlong': [-58.80732579359148, -1.7695729901247828], 'name': 'Médio Amazonas'}","{'latlong': [-64.47009165648124, -0.6042378800253123], 'name': 'Entorno Manaus'}",29
2008,"{'latlong': [-60.54555982763556, -6.682636373094532], 'name': 'Rio Madeira'}","{'latlong': [-60.54555982763556, -6.682636373094532], 'name': 'Rio Madeira'}",178
2008,"{'latlong': [-60.54555982763556, -6.682636373094532], 'name': 'Rio Madeira'}","{'latlong': [-64.47009165648124, -0.6042378800253123], 'name': 'Entorno Manaus'}",5
2008,"{'latlong': [-62.7508323901846, -3.587400581314067], 'name': 'Rio Negro e Solimões'}","{'latlong': [-62.7508323901846, -3.587400581314067], 'name': 'Rio Negro e Solimões'}",138
2008,"{'latlong': [-62.7508323901846, -3.587400581314067], 'name': 'Rio Negro e Solimões'}","{'latlong': [-64.47009165648124, -0.6042378800253123], 'name': 'Entorno Manaus'}",22
2008,"{'latlong': [-64.47009165648124, -0.6042378800253123], 'name': 'Entorno Manaus'}","{'latlong': [-64.47009165648124, -0.6042378800253123], 'name': 'Entorno Manaus'}",2360
2008,"{'latlong': [-65.88057334170182, -7.391761280156165], 'name': 'Regional Purus'}","{'latlong': [-64.47009165648124, -0.6042378800253123], 'name': 'Entorno Manaus'}",2
2008,"{'latlong': [-65.88057334170182, -7.391761280156165], 'name': 'Regional Purus'}","{'latlong': [-65.88057334170182, -7.391761280156165], 'name': 'Regional Purus'}",115
2008,"{'latlong': [-66.74397610654549, -2.7624940948828614], 'name': 'Triângulo'}","{'latlong': [-64.47009165648124, -0.6042378800253123], 'name': 'Entorno Manaus'}",6
2008,"{'latlong': [-66.74397610654549, -2.7624940948828614], 'name': 'Triângulo'}","{'latlong': [-66.74397610654549, -2.7624940948828614], 'name': 'Triângulo'}",178
2008,"{'latlong': [-69.20896075625913, -6.4872294543537015], 'name': 'Regional Juruá'}","{'latlong': [-64.47009165648124, -0.6042378800253123], 'name': 'Entorno Manaus'}",1
2008,"{'latlong': [-69.20896075625913, -6.4872294543537015], 'name': 'Regional Juruá'}","{'latlong': [-69.20896075625913, -6.4872294543537015], 'name': 'Regional Juruá'}",97
2008,"{'latlong': [-69.69865585473899, -4.759892906023188], 'name': 'Alto Solimões'}","{'latlong': [-64.47009165648124, -0.6042378800253123], 'name': 'Entorno Manaus'}",1
2008,"{'latlong': [-69.69865585473899, -4.759892906023188], 'name': 'Alto Solimões'}","{'latlong': [-69.69865585473899, -4.759892906023188], 'name': 'Alto Solimões'}",139
2009,"{'latlong': [-57.78301983402671, -3.878545376148957], 'name': 'Baixo Amazonas'}","{'latlong': [-57.78301983402671, -3.878545376148957], 'name': 'Baixo Amazonas'}",118
2009,"{'latlong': [-57.78301983402671, -3.878545376148957], 'name': 'Baixo Amazonas'}","{'latlong': [-64.47009165648124, -0.6042378800253123], 'name': 'Entorno Manaus'}",28
2009,"{'latlong': [-58.80732579359148, -1.7695729901247828], 'name': 'Médio Amazonas'}","{'latlong': [-58.80732579359148, -1.7695729901247828], 'name': 'Médio Amazonas'}",67
2009,"{'latlong': [-58.80732579359148, -1.7695729901247828], 'name': 'Médio Amazonas'}","{'latlong': [-64.47009165648124, -0.6042378800253123], 'name': 'Entorno Manaus'}",13
2009,"{'latlong': [-60.54555982763556, -6.682636373094532], 'name': 'Rio Madeira'}","{'latlong': [-60.54555982763556, -6.682636373094532], 'name': 'Rio Madeira'}",202
2009,"{'latlong': [-60.54555982763556, -6.682636373094532], 'name': 'Rio Madeira'}","{'latlong': [-64.47009165648124, -0.6042378800253123], 'name': 'Entorno Manaus'}",7
2009,"{'latlong': [-62.7508323901846, -3.587400581314067], 'name': 'Rio Negro e Solimões'}","{'latlong': [-62.7508323901846, -3.587400581314067], 'name': 'Rio Negro e Solimões'}",133
2009,"{'latlong': [-62.7508323901846, -3.587400581314067], 'name': 'Rio Negro e Solimões'}","{'latlong': [-64.47009165648124, -0.6042378800253123], 'name': 'Entorno Manaus'}",30
2009,"{'latlong': [-64.47009165648124, -0.6042378800253123], 'name': 'Entorno Manaus'}","{'latlong': [-64.47009165648124, -0.6042378800253123], 'name': 'Entorno Manaus'}",3590
2009,"{'latlong': [-65.88057334170182, -7.391761280156165], 'name': 'Regional Purus'}","{'latlong': [-64.47009165648124, -0.6042378800253123], 'name': 'Entorno Manaus'}",2
2009,"{'latlong': [-65.88057334170182, -7.391761280156165], 'name': 'Regional Purus'}","{'latlong': [-65.88057334170182, -7.391761280156165], 'name': 'Regional Purus'}",145
2009,"{'latlong': [-66.74397610654549, -2.7624940948828614], 'name': 'Triângulo'}","{'latlong': [-64.47009165648124, -0.6042378800253123], 'name': 'Entorno Manaus'}",9
2009,"{'latlong': [-66.74397610654549, -2.7624940948828614], 'name': 'Triângulo'}","{'latlong': [-66.74397610654549, -2.7624940948828614], 'name': 'Triângulo'}",126
2009,"{'latlong': [-69.20896075625913, -6.4872294543537015], 'name': 'Regional Juruá'}","{'latlong': [-69.20896075625913, -6.4872294543537015], 'name': 'Regional Juruá'}",87
2009,"{'latlong': [-69.69865585473899, -4.759892906023188], 'name': 'Alto Solimões'}","{'latlong': [-64.47009165648124, -0.6042378800253123], 'name': 'Entorno Manaus'}",15
2009,"{'latlong': [-69.69865585473899, -4.759892906023188], 'name': 'Alto Solimões'}","{'latlong': [-69.69865585473899, -4.759892906023188], 'name': 'Alto Solimões'}",112
2010,"{'latlong': [-57.78301983402671, -3.878545376148957], 'name': 'Baixo Amazonas'}","{'latlong': [-57.78301983402671, -3.878545376148957], 'name': 'Baixo Amazonas'}",183
2010,"{'latlong': [-57.78301983402671, -3.878545376148957], 'name': 'Baixo Amazonas'}","{'latlong': [-60.54555982763556, -6.682636373094532], 'name': 'Rio Madeira'}",1
2010,"{'latlong': [-57.78301983402671, -3.878545376148957], 'name': 'Baixo Amazonas'}","{'latlong': [-64.47009165648124, -0.6042378800253123], 'name': 'Entorno Manaus'}",18
2010,"{'latlong': [-58.80732579359148, -1.7695729901247828], 'name': 'Médio Amazonas'}","{'latlong': [-58.80732579359148, -1.7695729901247828], 'name': 'Médio Amazonas'}",25
2010,"{'latlong': [-58.80732579359148, -1.7695729901247828], 'name': 'Médio Amazonas'}","{'latlong': [-64.47009165648124, -0.6042378800253123], 'name': 'Entorno Manaus'}",14
2010,"{'latlong': [-60.54555982763556, -6.682636373094532], 'name': 'Rio Madeira'}","{'latlong': [-60.54555982763556, -6.682636373094532], 'name': 'Rio Madeira'}",154
2010,"{'latlong': [-60.54555982763556, -6.682636373094532], 'name': 'Rio Madeira'}","{'latlong': [-64.47009165648124, -0.6042378800253123], 'name': 'Entorno Manaus'}",10
2010,"{'latlong': [-62.7508323901846, -3.587400581314067], 'name': 'Rio Negro e Solimões'}","{'latlong': [-62.7508323901846, -3.587400581314067], 'name': 'Rio Negro e Solimões'}",96
2010,"{'latlong': [-62.7508323901846, -3.587400581314067], 'name': 'Rio Negro e Solimões'}","{'latlong': [-64.47009165648124, -0.6042378800253123], 'name': 'Entorno Manaus'}",22
2010,"{'latlong': [-64.47009165648124, -0.6042378800253123], 'name': 'Entorno Manaus'}","{'latlong': [-64.47009165648124, -0.6042378800253123], 'name': 'Entorno Manaus'}",2962
2010,"{'latlong': [-65.88057334170182, -7.391761280156165], 'name': 'Regional Purus'}","{'latlong': [-64.47009165648124, -0.6042378800253123], 'name': 'Entorno Manaus'}",1
2010,"{'latlong': [-65.88057334170182, -7.391761280156165], 'name': 'Regional Purus'}","{'latlong': [-65.88057334170182, -7.391761280156165], 'name': 'Regional Purus'}",69
2010,"{'latlong': [-65.88057334170182, -7.391761280156165], 'name': 'Regional Purus'}","{'latlong': [-66.74397610654549, -2.7624940948828614], 'name': 'Triângulo'}",1
2010,"{'latlong': [-66.74397610654549, -2.7624940948828614], 'name': 'Triângulo'}","{'latlong': [-64.47009165648124, -0.6042378800253123], 'name': 'Entorno Manaus'}",8
2010,"{'latlong': [-66.74397610654549, -2.7624940948828614], 'name': 'Triângulo'}","{'latlong': [-66.74397610654549, -2.7624940948828614], 'name': 'Triângulo'}",94
2010,"{'latlong': [-69.20896075625913, -6.4872294543537015], 'name': 'Regional Juruá'}","{'latlong': [-64.47009165648124, -0.6042378800253123], 'name': 'Entorno Manaus'}",2
2010,"{'latlong': [-69.20896075625913, -6.4872294543537015], 'name': 'Regional Juruá'}","{'latlong': [-69.20896075625913, -6.4872294543537015], 'name': 'Regional Juruá'}",113
2010,"{'latlong': [-69.69865585473899, -4.759892906023188], 'name': 'Alto Solimões'}","{'latlong': [-64.47009165648124, -0.6042378800253123], 'name': 'Entorno Manaus'}",2
2010,"{'latlong': [-69.69865585473899, -4.759892906023188], 'name': 'Alto Solimões'}","{'latlong': [-69.69865585473899, -4.759892906023188], 'name': 'Alto Solimões'}",121
2011,"{'latlong': [-57.78301983402671, -3.878545376148957], 'name': 'Baixo Amazonas'}","{'latlong': [-57.78301983402671, -3.878545376148957], 'name': 'Baixo Amazonas'}",170
2011,"{'latlong': [-57.78301983402671, -3.878545376148957], 'name': 'Baixo Amazonas'}","{'latlong': [-64.47009165648124, -0.6042378800253123], 'name': 'Entorno Manaus'}",21
2011,"{'latlong': [-58.80732579359148, -1.7695729901247828], 'name': 'Médio Amazonas'}","{'latlong': [-58.80732579359148, -1.7695729901247828], 'name': 'Médio Amazonas'}",40
2011,"{'latlong': [-58.80732579359148, -1.7695729901247828], 'name': 'Médio Amazonas'}","{'latlong': [-64.47009165648124, -0.6042378800253123], 'name': 'Entorno Manaus'}",11
2011,"{'latlong': [-60.54555982763556, -6.682636373094532], 'name': 'Rio Madeira'}","{'latlong': [-60.54555982763556, -6.682636373094532], 'name': 'Rio Madeira'}",114
2011,"{'latlong': [-60.54555982763556, -6.682636373094532], 'name': 'Rio Madeira'}","{'latlong': [-64.47009165648124, -0.6042378800253123], 'name': 'Entorno Manaus'}",4
2011,"{'latlong': [-60.54555982763556, -6.682636373094532], 'name': 'Rio Madeira'}","{'latlong': [-69.20896075625913, -6.4872294543537015], 'name': 'Regional Juruá'}",1
2011,"{'latlong': [-62.7508323901846, -3.587400581314067], 'name': 'Rio Negro e Solimões'}","{'latlong': [-62.7508323901846, -3.587400581314067], 'name': 'Rio Negro e Solimões'}",71
2011,"{'latlong': [-62.7508323901846, -3.587400581314067], 'name': 'Rio Negro e Solimões'}","{'latlong': [-64.47009165648124, -0.6042378800253123], 'name': 'Entorno Manaus'}",18
2011,"{'latlong': [-64.47009165648124, -0.6042378800253123], 'name': 'Entorno Manaus'}","{'latlong': [-64.47009165648124, -0.6042378800253123], 'name': 'Entorno Manaus'}",3230
2011,"{'latlong': [-65.88057334170182, -7.391761280156165], 'name': 'Regional Purus'}","{'latlong': [-64.47009165648124, -0.6042378800253123], 'name': 'Entorno Manaus'}",2
2011,"{'latlong': [-65.88057334170182, -7.391761280156165], 'name': 'Regional Purus'}","{'latlong': [-65.88057334170182, -7.391761280156165], 'name': 'Regional Purus'}",52
2011,"{'latlong': [-66.74397610654549, -2.7624940948828614], 'name': 'Triângulo'}","{'latlong': [-64.47009165648124, -0.6042378800253123], 'name': 'Entorno Manaus'}",10
2011,"{'latlong': [-66.74397610654549, -2.7624940948828614], 'name': 'Triângulo'}","{'latlong': [-66.74397610654549, -2.7624940948828614], 'name': 'Triângulo'}",62
2011,"{'latlong': [-69.20896075625913, -6.4872294543537015], 'name': 'Regional Juruá'}","{'latlong': [-64.47009165648124, -0.6042378800253123], 'name': 'Entorno Manaus'}",7
2011,"{'latlong': [-69.20896075625913, -6.4872294543537015], 'name': 'Regional Juruá'}","{'latlong': [-69.20896075625913, -6.4872294543537015], 'name': 'Regional Juruá'}",132
2011,"{'latlong': [-69.69865585473899, -4.759892906023188], 'name': 'Alto Solimões'}","{'latlong': [-64.47009165648124, -0.6042378800253123], 'name': 'Entorno Manaus'}",8
2011,"{'latlong': [-69.69865585473899, -4.759892906023188], 'name': 'Alto Solimões'}","{'latlong': [-69.69865585473899, -4.759892906023188], 'name': 'Alto Solimões'}",133
2012,"{'latlong': [-57.78301983402671, -3.878545376148957], 'name': 'Baixo Amazonas'}","{'latlong': [-57.78301983402671, -3.878545376148957], 'name': 'Baixo Amazonas'}",107
2012,"{'latlong': [-57.78301983402671, -3.878545376148957], 'name': 'Baixo Amazonas'}","{'latlong': [-64.47009165648124, -0.6042378800253123], 'name': 'Entorno Manaus'}",12
2012,"{'latlong': [-58.80732579359148, -1.7695729901247828], 'name': 'Médio Amazonas'}","{'latlong': [-58.80732579359148, -1.7695729901247828], 'name': 'Médio Amazonas'}",18
2012,"{'latlong': [-58.80732579359148, -1.7695729901247828], 'name': 'Médio Amazonas'}","{'latlong': [-64.47009165648124, -0.6042378800253123], 'name': 'Entorno Manaus'}",20
2012,"{'latlong': [-60.54555982763556, -6.682636373094532], 'name': 'Rio Madeira'}","{'latlong': [-60.54555982763556, -6.682636373094532], 'name': 'Rio Madeira'}",55
2012,"{'latlong': [-60.54555982763556, -6.682636373094532], 'name': 'Rio Madeira'}","{'latlong': [-64.47009165648124, -0.6042378800253123], 'name': 'Entorno Manaus'}",13
2012,"{'latlong': [-62.7508323901846, -3.587400581314067], 'name': 'Rio Negro e Solimões'}","{'latlong': [-62.7508323901846, -3.587400581314067], 'name': 'Rio Negro e Solimões'}",52
2012,"{'latlong': [-62.7508323901846, -3.587400581314067], 'name': 'Rio Negro e Solimões'}","{'latlong': [-64.47009165648124, -0.6042378800253123], 'name': 'Entorno Manaus'}",18
2012,"{'latlong': [-64.47009165648124, -0.6042378800253123], 'name': 'Entorno Manaus'}","{'latlong': [-64.47009165648124, -0.6042378800253123], 'name': 'Entorno Manaus'}",2426
2012,"{'latlong': [-65.88057334170182, -7.391761280156165], 'name': 'Regional Purus'}","{'latlong': [-64.47009165648124, -0.6042378800253123], 'name': 'Entorno Manaus'}",10
2012,"{'latlong': [-65.88057334170182, -7.391761280156165], 'name': 'Regional Purus'}","{'latlong': [-65.88057334170182, -7.391761280156165], 'name': 'Regional Purus'}",111
2012,"{'latlong': [-66.74397610654549, -2.7624940948828614], 'name': 'Triângulo'}","{'latlong': [-64.47009165648124, -0.6042378800253123], 'name': 'Entorno Manaus'}",8
2012,"{'latlong': [-66.74397610654549, -2.7624940948828614], 'name': 'Triângulo'}","{'latlong': [-66.74397610654549, -2.7624940948828614], 'name': 'Triângulo'}",85
2012,"{'latlong': [-69.20896075625913, -6.4872294543537015], 'name': 'Regional Juruá'}","{'latlong': [-64.47009165648124, -0.6042378800253123], 'name': 'Entorno Manaus'}",2
2012,"{'latlong': [-69.20896075625913, -6.4872294543537015], 'name': 'Regional Juruá'}","{'latlong': [-69.20896075625913, -6.4872294543537015], 'name': 'Regional Juruá'}",131
2012,"{'latlong': [-69.69865585473899, -4.759892906023188], 'name': 'Alto Solimões'}","{'latlong': [-64.47009165648124, -0.6042378800253123], 'name': 'Entorno Manaus'}",7
2012,"{'latlong': [-69.69865585473899, -4.759892906023188], 'name': 'Alto Solimões'}","{'latlong': [-69.69865585473899, -4.759892906023188], 'name': 'Alto Solimões'}",120
2013,"{'latlong': [-57.78301983402671, -3.878545376148957], 'name': 'Baixo Amazonas'}","{'latlong': [-57.78301983402671, -3.878545376148957], 'name': 'Baixo Amazonas'}",86
2013,"{'latlong': [-57.78301983402671, -3.878545376148957], 'name': 'Baixo Amazonas'}","{'latlong': [-64.47009165648124, -0.6042378800253123], 'name': 'Entorno Manaus'}",11
2013,"{'latlong': [-58.80732579359148, -1.7695729901247828], 'name': 'Médio Amazonas'}","{'latlong': [-58.80732579359148, -1.7695729901247828], 'name': 'Médio Amazonas'}",13
2013,"{'latlong': [-58.80732579359148, -1.7695729901247828], 'name': 'Médio Amazonas'}","{'latlong': [-64.47009165648124, -0.6042378800253123], 'name': 'Entorno Manaus'}",25
2013,"{'latlong': [-60.54555982763556, -6.682636373094532], 'name': 'Rio Madeira'}","{'latlong': [-60.54555982763556, -6.682636373094532], 'name': 'Rio Madeira'}",34
2013,"{'latlong': [-60.54555982763556, -6.682636373094532], 'name': 'Rio Madeira'}","{'latlong': [-64.47009165648124, -0.6042378800253123], 'name': 'Entorno Manaus'}",9
2013,"{'latlong': [-62.7508323901846, -3.587400581314067], 'name': 'Rio Negro e Solimões'}","{'latlong': [-62.7508323901846, -3.587400581314067], 'name': 'Rio Negro e Solimões'}",98
2013,"{'latlong': [-62.7508323901846, -3.587400581314067], 'name': 'Rio Negro e Solimões'}","{'latlong': [-64.47009165648124, -0.6042378800253123], 'name': 'Entorno Manaus'}",45
2013,"{'latlong': [-64.47009165648124, -0.6042378800253123], 'name': 'Entorno Manaus'}","{'latlong': [-60.54555982763556, -6.682636373094532], 'name': 'Rio Madeira'}",1
2013,"{'latlong': [-64.47009165648124, -0.6042378800253123], 'name': 'Entorno Manaus'}","{'latlong': [-64.47009165648124, -0.6042378800253123], 'name': 'Entorno Manaus'}",2456
2013,"{'latlong': [-65.88057334170182, -7.391761280156165], 'name': 'Regional Purus'}","{'latlong': [-64.47009165648124, -0.6042378800253123], 'name': 'Entorno Manaus'}",4
2013,"{'latlong': [-65.88057334170182, -7.391761280156165], 'name': 'Regional Purus'}","{'latlong': [-65.88057334170182, -7.391761280156165], 'name': 'Regional Purus'}",56
2013,"{'latlong': [-66.74397610654549, -2.7624940948828614], 'name': 'Triângulo'}","{'latlong': [-64.47009165648124, -0.6042378800253123], 'name': 'Entorno Manaus'}",7
2013,"{'latlong': [-66.74397610654549, -2.7624940948828614], 'name': 'Triângulo'}","{'latlong': [-66.74397610654549, -2.7624940948828614], 'name': 'Triângulo'}",100
2013,"{'latlong': [-69.20896075625913, -6.4872294543537015], 'name': 'Regional Juruá'}","{'latlong': [-64.47009165648124, -0.6042378800253123], 'name': 'Entorno Manaus'}",6
2013,"{'latlong': [-69.20896075625913, -6.4872294543537015], 'name': 'Regional Juruá'}","{'latlong': [-69.20896075625913, -6.4872294543537015], 'name': 'Regional Juruá'}",121
2013,"{'latlong': [-69.69865585473899, -4.759892906023188], 'name': 'Alto Solimões'}","{'latlong': [-64.47009165648124, -0.6042378800253123], 'name': 'Entorno Manaus'}",11
2013,"{'latlong': [-69.69865585473899, -4.759892906023188], 'name': 'Alto Solimões'}","{'latlong': [-69.69865585473899, -4.759892906023188], 'name': 'Alto Solimões'}",89
2014,"{'latlong': [-57.78301983402671, -3.878545376148957], 'name': 'Baixo Amazonas'}","{'latlong': [-57.78301983402671, -3.878545376148957], 'name': 'Baixo Amazonas'}",31
2014,"{'latlong': [-57.78301983402671, -3.878545376148957], 'name': 'Baixo Amazonas'}","{'latlong': [-64.47009165648124, -0.6042378800253123], 'name': 'Entorno Manaus e Alto Rio Negro'}",22
2014,"{'latlong': [-58.80732579359148, -1.7695729901247828], 'name': 'Médio Amazonas'}","{'latlong': [-58.80732579359148, -1.7695729901247828], 'name': 'Médio Amazonas'}",27
2014,"{'latlong': [-58.80732579359148, -1.7695729901247828], 'name': 'Médio Amazonas'}","{'latlong': [-64.47009165648124, -0.6042378800253123], 'name': 'Entorno Manaus e Alto Rio Negro'}",31
2014,"{'latlong': [-60.54555982763556, -6.682636373094532], 'name': 'Rio Madeira'}","{'latlong': [-60.54555982763556, -6.682636373094532], 'name': 'Rio Madeira'}",29
2014,"{'latlong': [-60.54555982763556, -6.682636373094532], 'name': 'Rio Madeira'}","{'latlong': [-64.47009165648124, -0.6042378800253123], 'name': 'Entorno Manaus e Alto Rio Negro'}",13
2014,"{'latlong': [-62.7508323901846, -3.587400581314067], 'name': 'Rio Negro e Solimões'}","{'latlong': [-62.7508323901846, -3.587400581314067], 'name': 'Rio Negro e Solimões'}",76
2014,"{'latlong': [-62.7508323901846, -3.587400581314067], 'name': 'Rio Negro e Solimões'}","{'latlong': [-64.47009165648124, -0.6042378800253123], 'name': 'Entorno Manaus e Alto Rio Negro'}",42
2014,"{'latlong': [-64.47009165648124, -0.6042378800253123], 'name': 'Entorno Manaus e Alto Rio Negro'}","{'latlong': [-64.47009165648124, -0.6042378800253123], 'name': 'Entorno Manaus e Alto Rio Negro'}",2164
2014,"{'latlong': [-65.88057334170182, -7.391761280156165], 'name': 'Regional Purus'}","{'latlong': [-64.47009165648124, -0.6042378800253123], 'name': 'Entorno Manaus e Alto Rio Negro'}",3
2014,"{'latlong': [-65.88057334170182, -7.391761280156165], 'name': 'Regional Purus'}","{'latlong': [-65.88057334170182, -7.391761280156165], 'name': 'Regional Purus'}",80
2014,"{'latlong': [-66.74397610654549, -2.7624940948828614], 'name': 'Triângulo'}","{'latlong': [-64.47009165648124, -0.6042378800253123], 'name': 'Entorno Manaus e Alto Rio Negro'}",15
2014,"{'latlong': [-66.74397610654549, -2.7624940948828614], 'name': 'Triângulo'}","{'latlong': [-66.74397610654549, -2.7624940948828614], 'name': 'Triângulo'}",71
2014,"{'latlong': [-69.20896075625913, -6.4872294543537015], 'name': 'Regional Juruá'}","{'latlong': [-64.47009165648124, -0.6042378800253123], 'name': 'Entorno Manaus e Alto Rio Negro'}",13
2014,"{'latlong': [-69.20896075625913, -6.4872294543537015], 'name': 'Regional Juruá'}","{'latlong': [-69.20896075625913, -6.4872294543537015], 'name': 'Regional Juruá'}",73
2014,"{'latlong': [-69.69865585473899, -4.759892906023188], 'name': 'Alto Solimões'}","{'latlong': [-64.47009165648124, -0.6042378800253123], 'name': 'Entorno Manaus e Alto Rio Negro'}",16
2014,"{'latlong': [-69.69865585473899, -4.759892906023188], 'name': 'Alto Solimões'}","{'latlong': [-66.74397610654549, -2.7624940948828614], 'name': 'Triângulo'}",1
2014,"{'latlong': [-69.69865585473899, -4.759892906023188], 'name': 'Alto Solimões'}","{'latlong': [-69.69865585473899, -4.759892906023188], 'name': 'Alto Solimões'}",77
2015,"{'latlong': [-57.78301983402671, -3.878545376148957], 'name': 'Baixo Amazonas'}","{'latlong': [-57.78301983402671, -3.878545376148957], 'name': 'Baixo Amazonas'}",42
2015,"{'latlong': [-57.78301983402671, -3.878545376148957], 'name': 'Baixo Amazonas'}","{'latlong': [-64.47009165648124, -0.6042378800253123], 'name': 'Entorno Manaus e Alto Rio Negro'}",15
2015,"{'latlong': [-58.80732579359148, -1.7695729901247828], 'name': 'Médio Amazonas'}","{'latlong': [-58.80732579359148, -1.7695729901247828], 'name': 'Médio Amazonas'}",6
2015,"{'latlong': [-58.80732579359148, -1.7695729901247828], 'name': 'Médio Amazonas'}","{'latlong': [-64.47009165648124, -0.6042378800253123], 'name': 'Entorno Manaus e Alto Rio Negro'}",46
2015,"{'latlong': [-60.54555982763556, -6.682636373094532], 'name': 'Rio Madeira'}","{'latlong': [-60.54555982763556, -6.682636373094532], 'name': 'Rio Madeira'}",46
2015,"{'latlong': [-60.54555982763556, -6.682636373094532], 'name': 'Rio Madeira'}","{'latlong': [-64.47009165648124, -0.6042378800253123], 'name': 'Entorno Manaus e Alto Rio Negro'}",11
2015,"{'latlong': [-62.7508323901846, -3.587400581314067], 'name': 'Rio Negro e Solimões'}","{'latlong': [-62.7508323901846, -3.587400581314067], 'name': 'Rio Negro e Solimões'}",67
2015,"{'latlong': [-62.7508323901846, -3.587400581314067], 'name': 'Rio Negro e Solimões'}","{'latlong': [-64.47009165648124, -0.6042378800253123], 'name': 'Entorno Manaus e Alto Rio Negro'}",37
2015,"{'latlong': [-64.47009165648124, -0.6042378800253123], 'name': 'Entorno Manaus e Alto Rio Negro'}","{'latlong': [-64.47009165648124, -0.6042378800253123], 'name': 'Entorno Manaus e Alto Rio Negro'}",2192
2015,"{'latlong': [-65.88057334170182, -7.391761280156165], 'name': 'Regional Purus'}","{'latlong': [-64.47009165648124, -0.6042378800253123], 'name': 'Entorno Manaus e Alto Rio Negro'}",4
2015,"{'latlong': [-65.88057334170182, -7.391761280156165], 'name': 'Regional Purus'}","{'latlong': [-65.88057334170182, -7.391761280156165], 'name': 'Regional Purus'}",58
2015,"{'latlong': [-66.74397610654549, -2.7624940948828614], 'name': 'Triângulo'}","{'latlong': [-64.47009165648124, -0.6042378800253123], 'name': 'Entorno Manaus e Alto Rio Negro'}",8
2015,"{'latlong': [-66.74397610654549, -2.7624940948828614], 'name': 'Triângulo'}","{'latlong': [-66.74397610654549, -2.7624940948828614], 'name': 'Triângulo'}",64
2015,"{'latlong': [-69.20896075625913, -6.4872294543537015], 'name': 'Regional Juruá'}","{'latlong': [-64.47009165648124, -0.6042378800253123], 'name': 'Entorno Manaus e Alto Rio Negro'}",12
2015,"{'latlong': [-69.20896075625913, -6.4872294543537015], 'name': 'Regional Juruá'}","{'latlong': [-69.20896075625913, -6.4872294543537015], 'name': 'Regional Juruá'}",100
2015,"{'latlong': [-69.69865585473899, -4.759892906023188], 'name': 'Alto Solimões'}","{'latlong': [-64.47009165648124, -0.6042378800253123], 'name': 'Entorno Manaus e Alto Rio Negro'}",14
2015,"{'latlong': [-69.69865585473899, -4.759892906023188], 'name': 'Alto Solimões'}","{'latlong': [-66.74397610654549, -2.7624940948828614], 'name': 'Triângulo'}",1
2015,"{'latlong': [-69.69865585473899, -4.759892906023188], 'name': 'Alto Solimões'}","{'latlong': [-69.69865585473899, -4.759892906023188], 'name': 'Alto Solimões'}",92
2016,"{'latlong': [-57.78301983402671, -3.878545376148957], 'name': 'Baixo Amazonas'}","{'latlong': [-57.78301983402671, -3.878545376148957], 'name': 'Baixo Amazonas'}",39
2016,"{'latlong': [-57.78301983402671, -3.878545376148957], 'name': 'Baixo Amazonas'}","{'latlong': [-64.47009165648124, -0.6042378800253123], 'name': 'Manaus, Entorno e Alto Rio Negro'}",22
2016,"{'latlong': [-58.80732579359148, -1.7695729901247828], 'name': 'Médio Amazonas'}","{'latlong': [-58.80732579359148, -1.7695729901247828], 'name': 'Médio Amazonas'}",5
2016,"{'latlong': [-58.80732579359148, -1.7695729901247828], 'name': 'Médio Amazonas'}","{'latlong': [-64.47009165648124, -0.6042378800253123], 'name': 'Manaus, Entorno e Alto Rio Negro'}",17
2016,"{'latlong': [-60.54555982763556, -6.682636373094532], 'name': 'Rio Madeira'}","{'latlong': [-60.54555982763556, -6.682636373094532], 'name': 'Rio Madeira'}",68
2016,"{'latlong': [-60.54555982763556, -6.682636373094532], 'name': 'Rio Madeira'}","{'latlong': [-64.47009165648124, -0.6042378800253123], 'name': 'Manaus, Entorno e Alto Rio Negro'}",5
2016,"{'latlong': [-62.7508323901846, -3.587400581314067], 'name': 'Rio Negro e Solimões'}","{'latlong': [-62.7508323901846, -3.587400581314067], 'name': 'Rio Negro e Solimões'}",41
2016,"{'latlong': [-62.7508323901846, -3.587400581314067], 'name': 'Rio Negro e Solimões'}","{'latlong': [-64.47009165648124, -0.6042378800253123], 'name': 'Manaus, Entorno e Alto Rio Negro'}",54
2016,"{'latlong': [-64.47009165648124, -0.6042378800253123], 'name': 'Manaus, Entorno e Alto Rio Negro'}","{'latlong': [-64.47009165648124, -0.6042378800253123], 'name': 'Manaus, Entorno e Alto Rio Negro'}",2017
2016,"{'latlong': [-65.88057334170182, -7.391761280156165], 'name': 'Regional Purus'}","{'latlong': [-64.47009165648124, -0.6042378800253123], 'name': 'Manaus, Entorno e Alto Rio Negro'}",8
2016,"{'latlong': [-65.88057334170182, -7.391761280156165], 'name': 'Regional Purus'}","{'latlong': [-65.88057334170182, -7.391761280156165], 'name': 'Regional Purus'}",22
2016,"{'latlong': [-66.74397610654549, -2.7624940948828614], 'name': 'Triângulo'}","{'latlong': [-64.47009165648124, -0.6042378800253123], 'name': 'Manaus, Entorno e Alto Rio Negro'}",10
2016,"{'latlong': [-66.74397610654549, -2.7624940948828614], 'name': 'Triângulo'}","{'latlong': [-66.74397610654549, -2.7624940948828614], 'name': 'Triângulo'}",46
2016,"{'latlong': [-69.20896075625913, -6.4872294543537015], 'name': 'Regional Juruá'}","{'latlong': [-64.47009165648124, -0.6042378800253123], 'name': 'Manaus, Entorno e Alto Rio Negro'}",5
2016,"{'latlong': [-69.20896075625913, -6.4872294543537015], 'name': 'Regional Juruá'}","{'latlong': [-69.20896075625913, -6.4872294543537015], 'name': 'Regional Juruá'}",36
2016,"{'latlong': [-69.69865585473899, -4.759892906023188], 'name': 'Alto Solimões'}","{'latlong': [-64.47009165648124, -0.6042378800253123], 'name': 'Manaus, Entorno e Alto Rio Negro'}",10
2016,"{'latlong': [-69.69865585473899, -4.759892906023188], 'name': 'Alto Solimões'}","{'latlong': [-69.69865585473899, -4.759892906023188], 'name': 'Alto Solimões'}",66
2017,"{'latlong': [-57.78301983402671, -3.878545376148957], 'name': 'Baixo Amazonas'}","{'latlong': [-57.78301983402671, -3.878545376148957], 'name': 'Baixo Amazonas'}",30
2017,"{'latlong': [-57.78301983402671, -3.878545376148957], 'name': 'Baixo Amazonas'}","{'latlong': [-64.47009165648124, -0.6042378800253123], 'name': 'Entorno Manaus'}",36
2017,"{'latlong': [-58.80732579359148, -1.7695729901247828], 'name': 'Médio Amazonas'}","{'latlong': [-58.80732579359148, -1.7695729901247828], 'name': 'Médio Amazonas'}",14
2017,"{'latlong': [-58.80732579359148, -1.7695729901247828], 'name': 'Médio Amazonas'}","{'latlong': [-64.47009165648124, -0.6042378800253123], 'name': 'Entorno Manaus'}",35
2017,"{'latlong': [-60.54555982763556, -6.682636373094532], 'name': 'Rio Madeira'}","{'latlong': [-60.54555982763556, -6.682636373094532], 'name': 'Rio Madeira'}",53
2017,"{'latlong': [-60.54555982763556, -6.682636373094532], 'name': 'Rio Madeira'}","{'latlong': [-64.47009165648124, -0.6042378800253123], 'name': 'Entorno Manaus'}",15
2017,"{'latlong': [-62.7508323901846, -3.587400581314067], 'name': 'Rio Negro e Solimões'}","{'latlong': [-62.7508323901846, -3.587400581314067], 'name': 'Rio Negro e Solimões'}",53
2017,"{'latlong': [-62.7508323901846, -3.587400581314067], 'name': 'Rio Negro e Solimões'}","{'latlong': [-64.47009165648124, -0.6042378800253123], 'name': 'Entorno Manaus'}",28
2017,"{'latlong': [-64.47009165648124, -0.6042378800253123], 'name': 'Entorno Manaus'}","{'latlong': [-64.47009165648124, -0.6042378800253123], 'name': 'Entorno Manaus'}",2049
2017,"{'latlong': [-65.88057334170182, -7.391761280156165], 'name': 'Regional Purus'}","{'latlong': [-64.47009165648124, -0.6042378800253123], 'name': 'Entorno Manaus'}",1
2017,"{'latlong': [-65.88057334170182, -7.391761280156165], 'name': 'Regional Purus'}","{'latlong': [-65.88057334170182, -7.391761280156165], 'name': 'Regional Purus'}",21
2017,"{'latlong': [-66.74397610654549, -2.7624940948828614], 'name': 'Triângulo'}","{'latlong': [-64.47009165648124, -0.6042378800253123], 'name': 'Entorno Manaus'}",12
2017,"{'latlong': [-66.74397610654549, -2.7624940948828614], 'name': 'Triângulo'}","{'latlong': [-66.74397610654549, -2.7624940948828614], 'name': 'Triângulo'}",41
2017,"{'latlong': [-69.20896075625913, -6.4872294543537015], 'name': 'Regional Juruá'}","{'latlong': [-64.47009165648124, -0.6042378800253123], 'name': 'Entorno Manaus'}",6
2017,"{'latlong': [-69.20896075625913, -6.4872294543537015], 'name': 'Regional Juruá'}","{'latlong': [-69.20896075625913, -6.4872294543537015], 'name': 'Regional Juruá'}",42
2017,"{'latlong': [-69.69865585473899, -4.759892906023188], 'name': 'Alto Solimões'}","{'latlong': [-64.47009165648124, -0.6042378800253123], 'name': 'Entorno Manaus'}",24
2017,"{'latlong': [-69.69865585473899, -4.759892906023188], 'name': 'Alto Solimões'}","{'latlong': [-69.69865585473899, -4.759892906023188], 'name': 'Alto Solimões'}",61
2018,"{'latlong': [-57.78301983402671, -3.878545376148957], 'name': 'Baixo Amazonas'}","{'latlong': [-57.78301983402671, -3.878545376148957], 'name': 'Baixo Amazonas'}",71
2018,"{'latlong': [-57.78301983402671, -3.878545376148957], 'name': 'Baixo Amazonas'}","{'latlong': [-64.47009165648124, -0.6042378800253123], 'name': 'Entorno Manaus'}",26
2018,"{'latlong': [-58.80732579359148, -1.7695729901247828], 'name': 'Médio Amazonas'}","{'latlong': [-58.80732579359148, -1.7695729901247828], 'name': 'Médio Amazonas'}",21
2018,"{'latlong': [-58.80732579359148, -1.7695729901247828], 'name': 'Médio Amazonas'}","{'latlong': [-64.47009165648124, -0.6042378800253123], 'name': 'Entorno Manaus'}",33
2018,"{'latlong': [-60.54555982763556, -6.682636373094532], 'name': 'Rio Madeira'}","{'latlong': [-60.54555982763556, -6.682636373094532], 'name': 'Rio Madeira'}",73
2018,"{'latlong': [-60.54555982763556, -6.682636373094532], 'name': 'Rio Madeira'}","{'latlong': [-64.47009165648124, -0.6042378800253123], 'name': 'Entorno Manaus'}",11
2018,"{'latlong': [-62.7508323901846, -3.587400581314067], 'name': 'Rio Negro e Solimões'}","{'latlong': [-62.7508323901846, -3.587400581314067], 'name': 'Rio Negro e Solimões'}",115
2018,"{'latlong': [-62.7508323901846, -3.587400581314067], 'name': 'Rio Negro e Solimões'}","{'latlong': [-64.47009165648124, -0.6042378800253123], 'name': 'Entorno Manaus'}",84
2018,"{'latlong': [-64.47009165648124, -0.6042378800253123], 'name': 'Entorno Manaus'}","{'latlong': [-64.47009165648124, -0.6042378800253123], 'name': 'Entorno Manaus'}",2891
2018,"{'latlong': [-65.88057334170182, -7.391761280156165], 'name': 'Regional Purus'}","{'latlong': [-64.47009165648124, -0.6042378800253123], 'name': 'Entorno Manaus'}",12
2018,"{'latlong': [-65.88057334170182, -7.391761280156165], 'name': 'Regional Purus'}","{'latlong': [-65.88057334170182, -7.391761280156165], 'name': 'Regional Purus'}",31
2018,"{'latlong': [-66.74397610654549, -2.7624940948828614], 'name': 'Triângulo'}","{'latlong': [-64.47009165648124, -0.6042378800253123], 'name': 'Entorno Manaus'}",20
2018,"{'latlong': [-66.74397610654549, -2.7624940948828614], 'name': 'Triângulo'}","{'latlong': [-66.74397610654549, -2.7624940948828614], 'name': 'Triângulo'}",60
2018,"{'latlong': [-69.20896075625913, -6.4872294543537015], 'name': 'Regional Juruá'}","{'latlong': [-64.47009165648124, -0.6042378800253123], 'name': 'Entorno Manaus'}",4
2018,"{'latlong': [-69.20896075625913, -6.4872294543537015], 'name': 'Regional Juruá'}","{'latlong': [-69.20896075625913, -6.4872294543537015], 'name': 'Regional Juruá'}",30
2018,"{'latlong': [-69.69865585473899, -4.759892906023188], 'name': 'Alto Solimões'}","{'latlong': [-64.47009165648124, -0.6042378800253123], 'name': 'Entorno Manaus'}",20
2018,"{'latlong': [-69.69865585473899, -4.759892906023188], 'name': 'Alto Solimões'}","{'latlong': [-69.69865585473899, -4.759892906023188], 'name': 'Alto Solimões'}",72
2019,"{'latlong': [-57.78301983402671, -3.878545376148957], 'name': 'Baixo Amazonas'}","{'latlong': [-57.78301983402671, -3.878545376148957], 'name': 'Baixo Amazonas'}",44
2019,"{'latlong': [-57.78301983402671, -3.878545376148957], 'name': 'Baixo Amazonas'}","{'latlong': [-64.47009165648124, -0.6042378800253123], 'name': 'Entorno Manaus'}",21
2019,"{'latlong': [-58.80732579359148, -1.7695729901247828], 'name': 'Médio Amazonas'}","{'latlong': [-58.80732579359148, -1.7695729901247828], 'name': 'Médio Amazonas'}",16
2019,"{'latlong': [-58.80732579359148, -1.7695729901247828], 'name': 'Médio Amazonas'}","{'latlong': [-64.47009165648124, -0.6042378800253123], 'name': 'Entorno Manaus'}",21
2019,"{'latlong': [-60.54555982763556, -6.682636373094532], 'name': 'Rio Madeira'}","{'latlong': [-60.54555982763556, -6.682636373094532], 'name': 'Rio Madeira'}",58
2019,"{'latlong': [-60.54555982763556, -6.682636373094532], 'name': 'Rio Madeira'}","{'latlong': [-64.47009165648124, -0.6042378800253123], 'name': 'Entorno Manaus'}",15
2019,"{'latlong': [-62.7508323901846, -3.587400581314067], 'name': 'Rio Negro e Solimões'}","{'latlong': [-62.7508323901846, -3.587400581314067], 'name': 'Rio Negro e Solimões'}",44
2019,"{'latlong': [-62.7508323901846, -3.587400581314067], 'name': 'Rio Negro e Solimões'}","{'latlong': [-64.47009165648124, -0.6042378800253123], 'name': 'Entorno Manaus'}",67
2019,"{'latlong': [-64.47009165648124, -0.6042378800253123], 'name': 'Entorno Manaus'}","{'latlong': [-64.47009165648124, -0.6042378800253123], 'name': 'Entorno Manaus'}",2043
2019,"{'latlong': [-65.88057334170182, -7.391761280156165], 'name': 'Regional Purus'}","{'latlong': [-64.47009165648124, -0.6042378800253123], 'name': 'Entorno Manaus'}",14
2019,"{'latlong': [-65.88057334170182, -7.391761280156165], 'name': 'Regional Purus'}","{'latlong': [-65.88057334170182, -7.391761280156165], 'name': 'Regional Purus'}",41
2019,"{'latlong': [-66.74397610654549, -2.7624940948828614], 'name': 'Triângulo'}","{'latlong': [-64.47009165648124, -0.6042378800253123], 'name': 'Entorno Manaus'}",21
2019,"{'latlong': [-66.74397610654549, -2.7624940948828614], 'name': 'Triângulo'}","{'latlong': [-66.74397610654549, -2.7624940948828614], 'name': 'Triângulo'}",41
2019,"{'latlong': [-69.20896075625913, -6.4872294543537015], 'name': 'Regional Juruá'}","{'latlong': [-64.47009165648124, -0.6042378800253123], 'name': 'Entorno Manaus'}",9
2019,"{'latlong': [-69.20896075625913, -6.4872294543537015], 'name': 'Regional Juruá'}","{'latlong': [-69.20896075625913, -6.4872294543537015], 'name': 'Regional Juruá'}",55
2019,"{'latlong': [-69.69865585473899, -4.759892906023188], 'name': 'Alto Solimões'}","{'latlong': [-64.47009165648124, -0.6042378800253123], 'name': 'Entorno Manaus'}",24
2019,"{'latlong': [-69.69865585473899, -4.759892906023188], 'name': 'Alto Solimões'}","{'latlong': [-69.69865585473899, -4.759892906023188], 'name': 'Alto Solimões'}",44
2020,"{'latlong': [-57.78301983402671, -3.878545376148957], 'name': 'Baixo Amazonas'}","{'latlong': [-57.78301983402671, -3.878545376148957], 'name': 'Baixo Amazonas'}",109
2020,"{'latlong': [-57.78301983402671, -3.878545376148957], 'name': 'Baixo Amazonas'}","{'latlong': [-64.47009165648124, -0.6042378800253123], 'name': 'Entorno Manaus'}",29
2020,"{'latlong': [-58.80732579359148, -1.7695729901247828], 'name': 'Médio Amazonas'}","{'latlong': [-58.80732579359148, -1.7695729901247828], 'name': 'Médio Amazonas'}",35
2020,"{'latlong': [-58.80732579359148, -1.7695729901247828], 'name': 'Médio Amazonas'}","{'latlong': [-64.47009165648124, -0.6042378800253123], 'name': 'Entorno Manaus'}",10
2020,"{'latlong': [-60.54555982763556, -6.682636373094532], 'name': 'Rio Madeira'}","{'latlong': [-60.54555982763556, -6.682636373094532], 'name': 'Rio Madeira'}",62
2020,"{'latlong': [-60.54555982763556, -6.682636373094532], 'name': 'Rio Madeira'}","{'latlong': [-64.47009165648124, -0.6042378800253123], 'name': 'Entorno Manaus'}",13
2020,"{'latlong': [-62.7508323901846, -3.587400581314067], 'name': 'Rio Negro e Solimões'}","{'latlong': [-62.7508323901846, -3.587400581314067], 'name': 'Rio Negro e Solimões'}",155
2020,"{'latlong': [-62.7508323901846, -3.587400581314067], 'name': 'Rio Negro e Solimões'}","{'latlong': [-64.47009165648124, -0.6042378800253123], 'name': 'Entorno Manaus'}",35
2020,"{'latlong': [-64.47009165648124, -0.6042378800253123], 'name': 'Entorno Manaus'}","{'latlong': [-58.80732579359148, -1.7695729901247828], 'name': 'Médio Amazonas'}",1
2020,"{'latlong': [-64.47009165648124, -0.6042378800253123], 'name': 'Entorno Manaus'}","{'latlong': [-62.7508323901846, -3.587400581314067], 'name': 'Rio Negro e Solimões'}",5
2020,"{'latlong': [-64.47009165648124, -0.6042378800253123], 'name': 'Entorno Manaus'}","{'latlong': [-64.47009165648124, -0.6042378800253123], 'name': 'Entorno Manaus'}",2453
2020,"{'latlong': [-64.47009165648124, -0.6042378800253123], 'name': 'Entorno Manaus'}","{'latlong': [-69.69865585473899, -4.759892906023188], 'name': 'Alto Solimões'}",2
2020,"{'latlong': [-65.88057334170182, -7.391761280156165], 'name': 'Regional Purus'}","{'latlong': [-64.47009165648124, -0.6042378800253123], 'name': 'Entorno Manaus'}",2
2020,"{'latlong': [-65.88057334170182, -7.391761280156165], 'name': 'Regional Purus'}","{'latlong': [-65.88057334170182, -7.391761280156165], 'name': 'Regional Purus'}",26
2020,"{'latlong': [-66.74397610654549, -2.7624940948828614], 'name': 'Triângulo'}","{'latlong': [-64.47009165648124, -0.6042378800253123], 'name': 'Entorno Manaus'}",9
2020,"{'latlong': [-66.74397610654549, -2.7624940948828614], 'name': 'Triângulo'}","{'latlong': [-66.74397610654549, -2.7624940948828614], 'name': 'Triângulo'}",44
2020,"{'latlong': [-69.20896075625913, -6.4872294543537015], 'name': 'Regional Juruá'}","{'latlong': [-64.47009165648124, -0.6042378800253123], 'name': 'Entorno Manaus'}",5
2020,"{'latlong': [-69.20896075625913, -6.4872294543537015], 'name': 'Regional Juruá'}","{'latlong': [-69.20896075625913, -6.4872294543537015], 'name': 'Regional Juruá'}",21
2020,"{'latlong': [-69.69865585473899, -4.759892906023188], 'name': 'Alto Solimões'}","{'latlong': [-64.47009165648124, -0.6042378800253123], 'name': 'Entorno Manaus'}",11
2020,"{'latlong': [-69.69865585473899, -4.759892906023188], 'name': 'Alto Solimões'}","{'latlong': [-69.69865585473899, -4.759892906023188], 'name': 'Alto Solimões'}",98
