Division,WeightClassKg,Place,Name,Team,BodyweightKg,Best3SquatKg,Best3BenchKg,Best3DeadliftKg,TotalKg,Equipment,Event,Sex
Boys,55.79,1,Billy Pearson,Pflugerville Connally,51.89,104.33,49.9,120.2,274.42,Single-ply,SBD,M
Boys,51.71,2,Michael Sanchez,Hutto,50.89,90.72,58.97,120.2,269.89,Single-ply,SBD,M
Boys,51.71,3,Clayton Tomes,Smithville,42.82,22.68,31.75,49.9,104.33,Single-ply,SBD,M
Boys,55.79,1,Davion Aldridge,Hutto,55.52,165.56,92.99,188.24,446.79,Single-ply,SBD,M
Boys,55.79,2,Isaiah Mesa,Taylor,54.7,140.61,102.06,149.69,392.36,Single-ply,SBD,M
Boys,59.87,3,Austin Carrow,Austin Lake Travis,55.88,124.74,74.84,142.88,342.46,Single-ply,SBD,M
Boys,55.79,4,Abel Montemayor,Waco University,54.52,102.06,65.77,124.74,292.57,Single-ply,SBD,M
Boys,55.79,5,TJ Renfro,Thrall,55.25,90.72,70.31,102.06,263.08,Single-ply,SBD,M
Boys,59.87,6,Zuri Chairez,San Marcos,55.88,77.11,47.63,117.93,242.67,Single-ply,SBD,M
Boys,55.79,7,Clayton Hutto,San Marcos,53.43,61.23,45.36,77.11,183.7,Single-ply,SBD,M
Boys,59.87,DQ,Jeffrey Sounthone,Hutto,55.88,,,,,Single-ply,SBD,M
Boys,67.13,1,Josh Bedolla,Elgin,59.96,183.7,111.13,197.31,492.15,Single-ply,SBD,M
Boys,59.87,2,Dominique Ubias,Elgin,57.42,158.76,95.25,179.17,433.18,Single-ply,SBD,M
Boys,59.87,3,Estefano Lopez,Waco University,59.42,142.88,86.18,161.03,390.09,Single-ply,SBD,M
Boys,59.87,4,Jesse Barron,Hutto,58.88,145.15,77.11,163.29,385.55,Single-ply,SBD,M
Boys,59.87,5,Fernando Maldonado,Smithville,58.88,124.74,88.45,140.61,353.8,Single-ply,SBD,M
Boys,59.87,6,Dereon Kizzee,Pflugerville Connally,58.51,122.47,72.57,156.49,351.53,Single-ply,SBD,M
Boys,59.87,7,Damien Gamboa,Florence,58.88,136.08,70.31,127.01,333.39,Single-ply,SBD,M
Boys,59.87,8,Eric Guerrero,San Marcos,56.43,102.06,63.5,120.2,285.76,Single-ply,SBD,M
Boys,59.87,9,Thomas Motyka,Smithville,56.88,102.06,58.97,108.86,269.89,Single-ply,SBD,M
Boys,67.13,1,Braden Tschirart,College Station,65.59,192.78,115.67,172.37,480.81,Single-ply,SBD,M
Boys,67.13,2,Johnathan Quiroga,Waco University,65.95,142.88,124.74,183.7,451.32,Single-ply,SBD,M
Boys,67.13,3,Kenny Miller,Manor,66.5,172.37,83.91,188.24,444.52,Single-ply,SBD,M
Boys,67.13,4,Jordan Lawrence,Pflugerville Connally,67.04,151.95,104.33,185.97,442.25,Single-ply,SBD,M
Boys,67.13,5,Isaac Johnson,Elgin,64.68,161.03,88.45,183.7,433.18,Single-ply,SBD,M
Boys,67.13,6,Timarcus Davis,College Station,65.95,181.44,90.72,156.49,428.64,Single-ply,SBD,M
Boys,67.13,7,Caden Forisha,Hutto,66.86,145.15,97.52,183.7,426.38,Single-ply,SBD,M
Boys,67.13,8,Trey Elkins,Austin Lake Travis,66.5,142.88,88.45,154.22,385.55,Single-ply,SBD,M
Boys,74.84,9,Devin Winn,Pflugerville Hendrickson,67.22,138.35,77.11,147.42,362.87,Single-ply,SBD,M
Boys,67.13,10,Kaleb Chandler,College Station A&M Cons,63.5,136.08,70.31,147.42,353.8,Single-ply,SBD,M
Boys,67.13,11,Zac Johle,Thrall,64.23,129.27,83.91,129.27,342.46,Single-ply,SBD,M
Boys,67.13,12,Jordan Owens,San Marcos,64.32,117.93,63.5,131.54,312.98,Single-ply,SBD,M
Boys,67.13,13,Isaiah Leza,Smithville,66.86,102.06,74.84,124.74,301.64,Single-ply,SBD,M
Boys,67.13,14,Weston Matthews,Florence,65.68,111.13,54.43,120.2,285.76,Single-ply,SBD,M
Boys,67.13,15,Justin Trussell,Florence,65.05,99.79,56.7,120.2,276.69,Single-ply,SBD,M
Boys,67.13,DQ,Caleb Jonas,Smithville,61.05,,,,,Single-ply,SBD,M
Boys,74.84,1,Alex Kyner,Thrall,73.84,217.72,124.74,226.8,569.26,Single-ply,SBD,M
Boys,74.84,2,Alec Behrendt,Thrall,74.84,204.12,131.54,190.51,526.17,Single-ply,SBD,M
Boys,74.84,3,Blaine Wootan,College Station,73.57,208.65,106.59,192.78,508.02,Single-ply,SBD,M
Boys,82.1,4,Cole Ballard,Hutto,75.02,192.78,113.4,195.04,501.22,Single-ply,SBD,M
Boys,74.84,5,Geoffrey Ali,Pflugerville Hendrickson,69.94,179.17,111.13,192.78,483.08,Single-ply,SBD,M
Boys,74.84,6,Jeremiah Walker,Waco University,71.12,183.7,97.52,201.85,483.08,Single-ply,SBD,M
Boys,74.84,7,Chris Blaschke,Smithville,73.03,181.44,117.93,181.44,480.81,Single-ply,SBD,M
Boys,74.84,8,Matt Bates,Hutto,74.66,167.83,113.4,199.58,480.81,Single-ply,SBD,M
Boys,74.84,9,Derek Camero,Hutto,71.94,183.7,97.52,195.04,476.27,Single-ply,SBD,M
Boys,74.84,10,Teondre Parsons,Waco University,73.39,181.44,102.06,181.44,464.93,Single-ply,SBD,M
Boys,74.84,11,Shane Freeland,Elgin,74.03,163.29,106.59,190.51,460.4,Single-ply,SBD,M
Boys,74.84,12,TaJari Benson,College Station A&M Cons,70.76,163.29,86.18,183.7,433.18,Single-ply,SBD,M
Boys,82.1,13,Nick Vasquez,College Station A&M Cons,75.02,147.42,97.52,181.44,426.38,Single-ply,SBD,M
Boys,82.1,14,Preston Reading,Pflugerville Connally,75.02,149.69,88.45,183.7,421.84,Single-ply,SBD,M
Boys,74.84,15,Akif Memon,Pflugerville Connally,72.94,158.76,97.52,161.03,417.3,Single-ply,SBD,M
Boys,74.84,16,Nomar Rivera,Smithville,70.31,145.15,92.99,165.56,403.7,Single-ply,SBD,M
Boys,74.84,17,Andrew Wyatt,Smithville,68.58,136.08,106.59,156.49,399.16,Single-ply,SBD,M
Boys,74.84,18,Michael Hernandez,Pflugerville,74.48,142.88,92.99,161.03,396.89,Single-ply,SBD,M
Boys,74.84,19,Aubrion Williams,Pflugerville Connally,69.94,136.08,83.91,172.37,392.36,Single-ply,SBD,M
Boys,74.84,20,Kevin Best,Manor,68.95,151.95,92.99,142.88,387.82,Single-ply,SBD,M
Boys,74.84,21,Abraham Franco,Waco University,67.49,142.88,90.72,147.42,381.02,Single-ply,SBD,M
Boys,74.84,22,Trevor Williams,College Station A&M Cons,68.49,138.35,88.45,149.69,376.48,Single-ply,SBD,M
Boys,74.84,23,D'Morea Horton,Pflugerville,67.86,151.95,83.91,133.81,369.68,Single-ply,SBD,M
Boys,74.84,24,Alex Shillow,Pflugerville,72.48,142.88,74.84,136.08,353.8,Single-ply,SBD,M
Boys,74.84,25,Taylor Brocato,Manor,69.58,111.13,83.91,122.47,317.51,Single-ply,SBD,M
Boys,74.84,DQ,Christion Lopez,Taylor,70.67,,,,,Single-ply,SBD,M
Boys,82.1,1,Everado Araujo,Taylor,81.28,247.21,147.42,229.06,623.69,Single-ply,SBD,M
Boys,82.1,2,Phillip Wilson,Pflugerville Connally,81.65,249.48,124.74,195.04,569.26,Single-ply,SBD,M
Boys,82.1,3,Jonathon Sylvester,College Station A&M Cons,80.83,217.72,120.2,226.8,564.72,Single-ply,SBD,M
Boys,82.1,4,Breon Kelley,Manor,81.37,183.7,104.33,219.99,508.02,Single-ply,SBD,M
Boys,82.1,5,Garrett Pluhar,Florence,81.19,174.63,99.79,176.9,451.32,Single-ply,SBD,M
Boys,89.81,6,Tyler Chandler,Thrall,82.19,163.29,102.06,183.7,449.06,Single-ply,SBD,M
Boys,82.1,7,Alejandro Rangel,Taylor,78.56,174.63,104.33,158.76,437.72,Single-ply,SBD,M
Boys,82.1,8,Isaiah Manzanares,San Marcos,80.65,156.49,92.99,185.97,435.45,Single-ply,SBD,M
Boys,82.1,9,Joseph Wilburn,San Marcos,77.47,151.95,83.91,183.7,419.57,Single-ply,SBD,M
Boys,89.81,10,Cade Langston,Austin Lake Travis,82.19,151.95,102.06,165.56,419.57,Single-ply,SBD,M
Boys,82.1,11,Frank Trevino,Smithville,82.1,147.42,88.45,165.56,401.43,Single-ply,SBD,M
Boys,82.1,12,Devin Levias,College Station A&M Cons,79.2,122.47,77.11,138.35,337.93,Single-ply,SBD,M
Boys,82.1,13,Tre' Newton,College Station A&M Cons,81.19,108.86,83.91,117.93,310.71,Single-ply,SBD,M
Boys,89.81,DQ,Fabien Perez,Elgin,82.28,231.33,122.47,,,Single-ply,SBD,M
Boys,82.1,DQ,Ty Watson,College Station,78.56,158.76,90.72,,,Single-ply,SBD,M
Boys,82.1,DQ,Victor Martinez,San Marcos,80.83,161.03,106.59,,,Single-ply,SBD,M
Boys,82.1,DQ,Chukie Ojiyi,Pflugerville Hendrickson,76.29,,,,,Single-ply,SBD,M
Boys,89.81,1,Desmond Payton,College Station,88.54,299.37,124.74,260.82,684.92,Single-ply,SBD,M
Boys,89.81,2,Tyrique Hayes,College Station,85.73,229.06,145.15,226.8,601.01,Single-ply,SBD,M
Boys,89.81,3,Chris Hatch,Taylor,88.18,217.72,158.76,192.78,569.26,Single-ply,SBD,M
Boys,89.81,4,Spencer Majors,Waco University,85.82,181.44,122.47,229.06,532.97,Single-ply,SBD,M
Boys,89.81,5,Adrian Williams,Pflugerville Connally,88.63,195.04,120.2,217.72,532.97,Single-ply,SBD,M
Boys,89.81,6,Daniel Anderson,Elgin,89.81,181.44,142.88,199.58,523.9,Single-ply,SBD,M
Boys,89.81,7,Isaac Villanueva,Taylor,85.73,188.24,108.86,185.97,483.08,Single-ply,SBD,M
Boys,99.79,8,Jake Dawson,Smithville,89.99,192.78,120.2,158.76,471.74,Single-ply,SBD,M
Boys,89.81,9,Jacob Seggern,Thrall,86,167.83,102.06,190.51,460.4,Single-ply,SBD,M
Boys,89.81,10,Jesus Oranday,Taylor,83.82,170.1,113.4,174.63,458.13,Single-ply,SBD,M
Boys,89.81,11,Dylan Syms,Taylor,85.64,174.63,113.4,167.83,455.86,Single-ply,SBD,M
Boys,89.81,12,Kevin Leonard,College Station A&M Cons,87,158.76,106.59,183.7,449.06,Single-ply,SBD,M
Boys,89.81,13,Garrett Womack,Austin Lake Travis,89.63,161.03,117.93,163.29,442.25,Single-ply,SBD,M
Boys,99.79,14,Chris Anderson #10,Pflugerville Connally,89.9,147.42,92.99,176.9,417.3,Single-ply,SBD,M
Boys,89.81,15,RJ Petaia,Pflugerville,87.27,133.81,120.2,161.03,415.04,Single-ply,SBD,M
Boys,89.81,16,Roderick Lloyd,Waco University,89.18,142.88,88.45,183.7,415.04,Single-ply,SBD,M
Boys,99.79,17,Robert Pitman,Thrall,89.99,154.22,92.99,161.03,408.23,Single-ply,SBD,M
Boys,89.81,18,Martin Navarrete,Taylor,84.96,138.35,72.57,131.54,342.46,Single-ply,SBD,M
Boys,89.81,19,Tristin Denson,Florence,87.91,124.74,58.97,111.13,294.84,Single-ply,SBD,M
Boys,89.81,DQ,Olisa Uzuegbunam,Manor,83.1,,,,,Single-ply,SBD,M
Boys,89.81,DQ,Bruce Dodd,Elgin,85.46,176.9,117.93,,,Single-ply,SBD,M
Boys,99.79,1,Will Efendiev,College Station,95.53,226.8,158.76,215.46,601.01,Single-ply,SBD,M
Boys,99.79,2,Carter Clouston,College Station,93.89,240.4,129.27,226.8,596.47,Single-ply,SBD,M
Boys,99.79,3,Carlos Chester,Manor,97.52,199.58,142.88,226.8,569.26,Single-ply,SBD,M
Boys,99.79,4,Omar Smith,Pflugerville Hendrickson,93.98,204.12,106.59,240.4,551.11,Single-ply,SBD,M
Boys,99.79,5,Vincent Gallegos,Giddings,90.45,192.78,117.93,185.97,496.68,Single-ply,SBD,M
Boys,99.79,6,Nakia Watson,Manor,91.63,183.7,111.13,188.24,483.08,Single-ply,SBD,M
Boys,99.79,7,Roel Santana,Hutto,97.34,181.44,106.59,185.97,474,Single-ply,SBD,M
Boys,99.79,8,Cameron Baker #4,Pflugerville Hendrickson,92.53,174.63,95.25,192.78,462.66,Single-ply,SBD,M
Boys,99.79,9,James Rodriguez,Pflugerville,99.06,188.24,120.2,142.88,451.32,Single-ply,SBD,M
Boys,99.79,10,Jonas Nava,San Marcos,91.08,161.03,88.45,197.31,446.79,Single-ply,SBD,M
Boys,99.79,11,Sheppard Rason,Manor,92.26,151.95,83.91,183.7,419.57,Single-ply,SBD,M
Boys,99.79,12,Jorge Riojas,San Marcos,98.16,149.69,90.72,165.56,405.97,Single-ply,SBD,M
Boys,99.79,13,John Bonnet,Florence,97.75,151.95,95.25,136.08,383.29,Single-ply,SBD,M
Boys,99.79,DQ,Joe Barron,Florence,98.52,206.38,99.79,,,Single-ply,SBD,M
Boys,99.79,DQ,Jordan Jackson #2,Pflugerville Connally,93.08,,,,,Single-ply,SBD,M
Boys,99.79,DQ,Sebastian Bravo,Waco University,95.16,,,,,Single-ply,SBD,M
Boys,109.77,1,Justin Paul,Hutto,108.77,217.72,120.2,226.8,564.72,Single-ply,SBD,M
Boys,109.77,2,Josh Tran,Pflugerville Connally,104.6,176.9,117.93,208.65,503.49,Single-ply,SBD,M
Boys,109.77,3,Josh Gordon,Elgin,106.96,174.63,127.01,188.24,489.88,Single-ply,SBD,M
Boys,109.77,4,Chris Sangasy,Florence,101.79,204.12,81.65,158.76,444.52,Single-ply,SBD,M
Boys,109.77,5,Charles Gunter,Manor,107.86,129.27,92.99,163.29,385.55,Single-ply,SBD,M
Boys,109.77,6,Sean Slauenwhite,Smithville,103.33,136.08,88.45,142.88,367.41,Single-ply,SBD,M
Boys,109.77,7,John Navajas,Elgin,100.88,124.74,74.84,142.88,342.46,Single-ply,SBD,M
Boys,109.77,DQ,Shawn Goldstein,Giddings,104.78,249.48,,,,Single-ply,SBD,M
Boys,109.77,DQ,Alec Garrett,Pflugerville,103.33,151.95,,,,Single-ply,SBD,M
Boys,109.77,DQ,Colten Heine,Taylor,102.51,201.85,,,,Single-ply,SBD,M
Boys,109.77,DQ,Tairhek Kerley,Pflugerville Connally,102.69,183.7,,,,Single-ply,SBD,M
Boys,124.74,1,Paul Dominguez,Taylor,112.72,265.35,183.7,206.38,655.44,Single-ply,SBD,M
Boys,124.74,2,Drew Rodriguez,College Station,121.56,276.69,136.08,229.06,641.83,Single-ply,SBD,M
Boys,124.74,3,James Hayes,College Station,114.12,254.01,120.2,251.74,625.96,Single-ply,SBD,M
Boys,124.74,4,Josh Ficklin,Elgin,119.75,224.53,156.49,231.33,612.35,Single-ply,SBD,M
Boys,124.74,5,Jesse Tamez,Elgin,116.17,226.8,120.2,192.78,539.77,Single-ply,SBD,M
Boys,124.74,6,Jordan Barrs,Pflugerville,118.21,188.24,138.35,206.38,532.97,Single-ply,SBD,M
Boys,124.74,7,Julian Namkin,Giddings,124.19,215.46,136.08,172.37,523.9,Single-ply,SBD,M
Boys,124.74,8,Tevin Paul,Austin Lake Travis,120.84,197.31,117.93,201.85,517.1,Single-ply,SBD,M
Boys,124.74,9,Alex Gamboa,Florence,114.99,215.46,95.25,181.44,492.15,Single-ply,SBD,M
Boys,124.74,10,Nial Creager,College Station A&M Cons,115.48,179.17,117.93,181.44,478.54,Single-ply,SBD,M
Boys,124.74,11,Mikey Trevino,Smithville,112.94,181.44,102.06,192.78,476.27,Single-ply,SBD,M
Boys,124.74,12,Zach Ransom,College Station A&M Cons,119.39,170.1,113.4,188.24,471.74,Single-ply,SBD,M
Boys,124.74,13,Ryan Bevan,College Station A&M Cons,112.94,181.44,106.59,181.44,469.47,Single-ply,SBD,M
Boys,124.74,14,Austin Moreno,Pflugerville Connally,113.4,181.44,108.86,172.37,462.66,Single-ply,SBD,M
Boys,124.74,15,Chastain Stautz,Thrall,122.92,181.44,106.59,170.1,458.13,Single-ply,SBD,M
Boys,124.74,DQ,Chase Hall,Pflugerville Connally,116.75,208.65,,,,Single-ply,SBD,M
Boys,124.74,DQ,Domenic Pastucci,Pflugerville Hendrickson,111.13,,,,,Single-ply,SBD,M
Boys,124.74,DQ,Matthew Armendariz,Austin Lake Travis,122.11,,,,,Single-ply,SBD,M
Boys,124.74,DQ,Marty Rodriguez,Hutto,123.92,213.19,95.25,,,Single-ply,SBD,M
Boys,124.74+,1,Jordan Seymore,College Station,137.53,299.37,147.42,240.4,687.19,Single-ply,SBD,M
Boys,124.74+,2,Josh Urrutia,San Marcos,131.54,167.83,149.69,197.31,514.83,Single-ply,SBD,M
Boys,124.74+,3,Tristan Reyes,Manor,129.36,199.58,108.86,204.12,512.56,Single-ply,SBD,M
Boys,124.74+,4,Juan Ramirez,Giddings,128.28,190.51,113.4,190.51,494.42,Single-ply,SBD,M
Boys,124.74+,5,Andrew Cobus,Pflugerville Hendrickson,129.09,188.24,108.86,185.97,483.08,Single-ply,SBD,M
Boys,124.74+,6,Anthony Hill,Manor,155.4,136.08,95.25,165.56,396.89,Single-ply,SBD,M
Boys,124.74+,7,Nick Dela Rosa,San Marcos,139.16,142.88,77.11,163.29,383.29,Single-ply,SBD,M
Boys,124.74+,8,Jose Ortiz,Manor,128.19,104.33,95.25,142.88,342.46,Single-ply,SBD,M
Boys,124.74+,DQ,David Brown #11,Manor,131.54,183.7,,,,Single-ply,SBD,M
Boys,124.74+,DQ,Najeik Willis,Manor,126.82,,,,,Single-ply,SBD,M
Boys,124.74+,DQ,Dom Valdespino,Pflugerville Hendrickson,128.64,,,,,Single-ply,SBD,M
