Division,WeightClassKg,Place,Name,Team,BodyweightKg,Best3SquatKg,Best3BenchKg,Best3DeadliftKg,TotalKg,Equipment,Event,Sex
Boys,51.71,1,Joel Santillan,Clifton,50.8,124.74,86.18,142.88,353.8,Single-ply,SBD,M
Boys,51.71,2,Barrett Hubbard,Moody,50.08,92.99,68.04,115.67,276.69,Single-ply,SBD,M
Boys,51.71,3,Brazos Gibson,Axtell,51.71,99.79,49.9,106.59,256.28,Single-ply,SBD,M
Boys,51.71,4,Aaron Matche,Fairfield,49.26,83.91,61.23,83.91,229.06,Single-ply,SBD,M
Boys,51.71,DQ,Weston Schasteen,Clifton,50.62,106.59,,,,Single-ply,SBD,M
Boys,55.79,1,Diego Rivera,Mexia,54.61,170.1,102.06,161.03,433.18,Single-ply,SBD,M
Boys,55.79,2,Gilberto Olguin,Waco Connally,52.44,97.52,61.23,127.01,285.76,Single-ply,SBD,M
Boys,55.79,3,Jared Rocha,Waco Reicher Catholic,51.98,83.91,61.23,124.74,269.89,Single-ply,SBD,M
Boys,55.79,4,Osvaldo Ortiz,Mexia,55.52,72.57,49.9,72.57,195.04,Single-ply,SBD,M
Boys,59.87,1,Fausto Rodriguez,West,59.15,183.7,106.59,181.44,471.74,Single-ply,SBD,M
Boys,59.87,2,Isaack Santillan,Clifton,58.24,147.42,97.52,161.03,405.97,Single-ply,SBD,M
Boys,59.87,3,Robby Brewer,Clifton,58.79,156.49,88.45,115.67,360.61,Single-ply,SBD,M
Boys,59.87,4,Reece Walker,Dawson,59.6,120.2,81.65,140.61,342.46,Single-ply,SBD,M
Boys,59.87,5,Ricardo Garcia,Mexia,59.6,122.47,68.04,142.88,333.39,Single-ply,SBD,M
Boys,59.87,6,Fernando Padilla,Mexia,58.79,99.79,58.97,140.61,299.37,Single-ply,SBD,M
Boys,59.87,7,Adam Elkins #2,Dawson,57.15,120.2,45.36,106.59,272.16,Single-ply,SBD,M
Boys,67.13,1,Alex Reynoso,West,63.05,149.69,95.25,185.97,430.91,Single-ply,SBD,M
Boys,67.13,2,Chase Kirby,Dawson,62.32,163.29,88.45,174.63,426.38,Single-ply,SBD,M
Boys,67.13,3,Will Ferlet,Dawson,67.13,147.42,95.25,172.37,415.04,Single-ply,SBD,M
Boys,67.13,4,Malik Dickson,Dawson,60.06,140.61,90.72,158.76,390.09,Single-ply,SBD,M
Boys,67.13,5,Dylan Martin,Valley Mills,65.77,136.08,81.65,156.49,374.21,Single-ply,SBD,M
Boys,67.13,6,Holden Rogers,Clifton,62.23,138.35,79.38,147.42,365.14,Single-ply,SBD,M
Boys,67.13,7,Zachary Klosterman,Mexia,65.32,127.01,65.77,131.54,324.32,Single-ply,SBD,M
Boys,67.13,8,Isaac Garcia,Riesel,63.14,104.33,74.84,124.74,303.91,Single-ply,SBD,M
Boys,67.13,9,Luis Gonzalez,Valley Mills,61.23,95.25,72.57,122.47,290.3,Single-ply,SBD,M
Boys,67.13,10,David Lopez,West,65.41,113.4,61.23,111.13,285.76,Single-ply,SBD,M
Boys,67.13,11,Bryce Tonkin,Waco Reicher Catholic,65.41,70.31,52.16,97.52,219.99,Single-ply,SBD,M
Boys,67.13,DQ,Kyle Gibson #2,Valley Mills,62.69,,,,,Single-ply,SBD,M
Boys,74.84,1,Nathan Gerik,West,74.48,204.12,120.2,199.58,523.9,Single-ply,SBD,M
Boys,74.84,2,Austin Sauceda,Axtell,70.94,190.51,113.4,185.97,489.88,Single-ply,SBD,M
Boys,74.84,3,Dillon Daniel,Crawford,67.4,199.58,108.86,176.9,485.34,Single-ply,SBD,M
Boys,74.84,4,Dalton Wiethorn,West,73.94,176.9,104.33,185.97,467.2,Single-ply,SBD,M
Boys,74.84,5,Treston Horn,Clifton,72.76,165.56,115.67,172.37,453.59,Single-ply,SBD,M
Boys,74.84,6,Jordan Olson,West,69.49,174.63,81.65,172.37,428.64,Single-ply,SBD,M
Boys,74.84,7,Ulises Ramirez,Fairfield,70.13,151.95,97.52,163.29,412.77,Single-ply,SBD,M
Boys,74.84,8,Stephen Davis,Moody,74.84,142.88,86.18,181.44,410.5,Single-ply,SBD,M
Boys,74.84,9,Patrick Saucedo,Bosqueville,69.22,147.42,97.52,154.22,399.16,Single-ply,SBD,M
Boys,74.84,10,Luke Brookshire,Crawford,72.57,147.42,72.57,161.03,381.02,Single-ply,SBD,M
Boys,74.84,11,Ty Bachtel,Fairfield,73.3,136.08,86.18,154.22,376.48,Single-ply,SBD,M
Boys,74.84,12,Zane Anderson,Fairfield,67.49,140.61,81.65,142.88,365.14,Single-ply,SBD,M
Boys,74.84,13,Robert Krammer,Dawson,69.67,120.2,83.91,147.42,351.53,Single-ply,SBD,M
Boys,74.84,14,Brandon Williams #3,Waco Connally,68.86,108.86,81.65,124.74,315.25,Single-ply,SBD,M
Boys,74.84,15,John Griffin,Riesel,68.86,117.93,79.38,113.4,310.71,Single-ply,SBD,M
Boys,74.84,DQ,Luis Moya,Valley Mills,69.04,127.01,,,,Single-ply,SBD,M
Boys,74.84,DQ,Corey Horn,Mexia,69.67,,,,,Single-ply,SBD,M
Boys,74.84,DQ,Ian Smith,Bosqueville,73.8,136.08,,,,Single-ply,SBD,M
Boys,82.1,1,Michael Rodriguez #7,Axtell,80.56,242.67,115.67,254.01,612.35,Single-ply,SBD,M
Boys,82.1,2,Mariano Perez,West,79.83,188.24,106.59,172.37,467.2,Single-ply,SBD,M
Boys,82.1,3,Ryan Lloyd,Clifton,81.01,165.56,127.01,172.37,464.93,Single-ply,SBD,M
Boys,82.1,4,Jordan Morgan,Waco La Vega,75.39,181.44,95.25,167.83,444.52,Single-ply,SBD,M
Boys,82.1,5,Marcus DeLeon,Waco Connally,80.65,167.83,106.59,145.15,419.57,Single-ply,SBD,M
Boys,82.1,6,Dustin Richter,Bosqueville,82.1,154.22,88.45,172.37,415.04,Single-ply,SBD,M
Boys,82.1,7,Garridan Henderson,Fairfield,75.02,149.69,83.91,172.37,405.97,Single-ply,SBD,M
Boys,82.1,8,Dylan Martin,Wortham,82.1,142.88,79.38,165.56,387.82,Single-ply,SBD,M
Boys,82.1,9,Matthew Bodnar,Moody,76.57,127.01,90.72,122.47,340.19,Single-ply,SBD,M
Boys,82.1,10,Dakota Vasquez,Moody,77.38,115.67,72.57,122.47,310.71,Single-ply,SBD,M
Boys,82.1,11,Ryan Perez,Waco Reicher Catholic,80.83,113.4,61.23,124.74,299.37,Single-ply,SBD,M
Boys,82.1,DQ,Colby Woodall,Wortham,80.01,102.06,,,,Single-ply,SBD,M
Boys,82.1,DQ,Riley Brooks #2,Valley Mills,78.29,113.4,,,,Single-ply,SBD,M
Boys,82.1,DQ,Jose Vega,Valley Mills,75.66,,,,,Single-ply,SBD,M
Boys,82.1,DQ,JaShaughn Hatcher,Fairfield,79.38,,,,,Single-ply,SBD,M
Boys,89.81,1,Drew Roberts,Bosqueville,86.27,208.65,154.22,206.38,569.26,Single-ply,SBD,M
Boys,89.81,2,Aaron Harralson,West,89.72,195.04,142.88,188.24,526.17,Single-ply,SBD,M
Boys,89.81,3,Hunter Ringo,Clifton,89.27,172.37,122.47,204.12,498.95,Single-ply,SBD,M
Boys,89.81,4,Lance Bracco,Crawford,87.54,176.9,115.67,183.7,476.27,Single-ply,SBD,M
Boys,89.81,5,Damian Dominguez,Grandview,87.72,181.44,108.86,174.63,464.93,Single-ply,SBD,M
Boys,89.81,6,Bodee Humphreys,Clifton,85.46,176.9,104.33,181.44,462.66,Single-ply,SBD,M
Boys,89.81,7,Koby Smith,Crawford,86.27,163.29,117.93,167.83,449.06,Single-ply,SBD,M
Boys,89.81,8,Gustavo Aguilar,Moody,88.54,156.49,106.59,181.44,444.52,Single-ply,SBD,M
Boys,89.81,9,Tristan Fletcher,Moody,86.91,156.49,104.33,167.83,428.64,Single-ply,SBD,M
Boys,89.81,10,Parker Eidson,Fairfield,87.45,149.69,74.84,170.1,394.63,Single-ply,SBD,M
Boys,89.81,11,Landry Bruce,Crawford,89.18,151.95,79.38,147.42,378.75,Single-ply,SBD,M
Boys,89.81,12,James Ferguson,Waco Connally,87,145.15,72.57,131.54,349.27,Single-ply,SBD,M
Boys,89.81,13,Jarred Maler,West,85.18,124.74,74.84,102.06,301.64,Single-ply,SBD,M
Boys,89.81,DQ,Dalton Martin,Valley Mills,82.64,129.27,,,,Single-ply,SBD,M
Boys,99.79,1,Coy Benfer,Valley Mills,99.06,206.38,140.61,183.7,530.7,Single-ply,SBD,M
Boys,99.79,2,Nick Barrios,West,92.44,192.78,102.06,174.63,469.47,Single-ply,SBD,M
Boys,99.79,3,Mason Howell,Bosqueville,97.2,170.1,113.4,170.1,453.59,Single-ply,SBD,M
Boys,99.79,4,Tanner Mitchell,Crawford,89.9,174.63,102.06,174.63,451.32,Single-ply,SBD,M
Boys,99.79,5,EJ Salazar,Wortham,98.43,163.29,99.79,158.76,421.84,Single-ply,SBD,M
Boys,99.79,6,Brian Williams,Waco Connally,93.53,142.88,92.99,138.35,374.21,Single-ply,SBD,M
Boys,99.79,7,Oscar Gaona,Valley Mills,93.44,154.22,70.31,136.08,360.61,Single-ply,SBD,M
Boys,99.79,8,Colton McCloskey,Mexia,98.34,133.81,92.99,117.93,344.73,Single-ply,SBD,M
Boys,99.79,9,Jackson Bayer,Waco Reicher Catholic,97.98,106.59,68.04,124.74,299.37,Single-ply,SBD,M
Boys,99.79,10,Hunter Heath,Bosqueville,94.12,81.65,68.04,127.01,276.69,Single-ply,SBD,M
Boys,99.79,DQ,Drew Williams,Fairfield,94.62,142.88,,,,Single-ply,SBD,M
Boys,109.77,1,Erick Marton,Axtell,104.33,285.76,154.22,272.16,712.14,Single-ply,SBD,M
Boys,109.77,2,Jacob Gomez,Fairfield,107.5,272.16,181.44,249.48,703.07,Single-ply,SBD,M
Boys,109.77,3,Steven Frausto,Waco Connally,106.96,256.28,117.93,204.12,578.33,Single-ply,SBD,M
Boys,109.77,4,Casey Allison,Waco La Vega,108.59,215.46,147.42,199.58,562.45,Single-ply,SBD,M
Boys,109.77,5,Cameron Fimbres,Waco Connally,104.87,217.72,124.74,181.44,523.9,Single-ply,SBD,M
Boys,109.77,6,LaDarius Price,Fairfield,106.14,192.78,129.27,195.04,517.1,Single-ply,SBD,M
Boys,109.77,7,Dakota Geer,Dawson,108.41,204.12,117.93,165.56,487.61,Single-ply,SBD,M
Boys,109.77,8,Jorge Saldana,Grandview,103.6,208.65,113.4,158.76,480.81,Single-ply,SBD,M
Boys,109.77,9,Matthew Pina,Axtell,107.5,176.9,120.2,183.7,480.81,Single-ply,SBD,M
Boys,109.77,10,Michael Simmons,Waco La Vega,106.32,183.7,104.33,183.7,471.74,Single-ply,SBD,M
Boys,109.77,11,Jordan Rios,Mexia,105.41,197.31,102.06,151.95,451.32,Single-ply,SBD,M
Boys,109.77,12,Colton Schmedthorst,Riesel,100.97,158.76,102.06,181.44,442.25,Single-ply,SBD,M
Boys,109.77,13,Julian Landeros,Chilton,107.68,188.24,83.91,167.83,439.98,Single-ply,SBD,M
Boys,109.77,14,Hayden Keeney,Grandview,109.68,161.03,65.77,102.06,328.85,Single-ply,SBD,M
Boys,109.77,DQ,James Baggatt,Waco La Vega,103.96,,,,,Single-ply,SBD,M
Boys,109.77,DQ,Logan Salisbury,Wortham,108.05,,,,,Single-ply,SBD,M
Boys,124.74,1,Jairo Rodriguez,Waco La Vega,123.2,240.4,149.69,222.26,612.35,Single-ply,SBD,M
Boys,124.74,2,Seth Kohlscheen,Crawford,122.65,249.48,124.74,190.51,564.72,Single-ply,SBD,M
Boys,124.74,3,Crispin Salinas,Chilton,111.22,204.12,113.4,192.78,510.29,Single-ply,SBD,M
Boys,124.74,4,Hunter Stratan,Moody,122.02,183.7,129.27,190.51,503.49,Single-ply,SBD,M
Boys,124.74,5,Gabriel Gongora,Waco La Vega,110.22,174.63,95.25,165.56,435.45,Single-ply,SBD,M
Boys,124.74,6,Dustin Stewart,Crawford,112.94,167.83,97.52,161.03,426.38,Single-ply,SBD,M
Boys,124.74,7,Derek Matthews,Valley Mills,110.95,163.29,68.04,147.42,378.75,Single-ply,SBD,M
Boys,124.74,DQ,Dalton Zander,Bosqueville,122.92,170.1,,,,Single-ply,SBD,M
Boys,124.74,DQ,Garrett Garvelli,Bosqueville,114.44,113.4,,,,Single-ply,SBD,M
Boys,124.74+,1,Robert Gober,Waco Connally,132.36,272.16,149.69,229.06,650.91,Single-ply,SBD,M
Boys,124.74+,2,Vincent Torres,Waco Connally,127.19,258.55,127.01,235.87,621.42,Single-ply,SBD,M
Boys,124.74+,3,Trederek Anglin,Mexia,138.53,208.65,172.37,219.99,601.01,Single-ply,SBD,M
Boys,124.74+,4,Demarcus Mason,Waco La Vega,142.43,247.21,149.69,199.58,596.47,Single-ply,SBD,M
Boys,124.74+,5,Jaylen Tobler,Waco Connally,177.17,263.08,117.93,167.83,548.85,Single-ply,SBD,M
Boys,124.74+,6,Travarius Glasker,Waco La Vega,175.45,213.19,124.74,197.31,535.24,Single-ply,SBD,M
Boys,124.74+,7,Juan Rodriguez,Clifton,149.87,183.7,124.74,199.58,508.02,Single-ply,SBD,M
Boys,124.74+,8,Angel Gaytan,Chilton,139.16,208.65,113.4,181.44,503.49,Single-ply,SBD,M
Boys,124.74+,DQ,Henry Dawson,Waco La Vega,130.54,219.99,,,,Single-ply,SBD,M
