
<svg version="1.1" xmlns="http://www.w3.org/2000/svg" width="512" height="512" viewBox="0 0 512 512">
<path d="M224 143.993c0 4.454-1.849 8.885-5.464 12.048l-114.239 99.959 114.239 99.959c6.65 5.818 7.325 15.928 1.505 22.577-5.819 6.65-15.927 7.324-22.577 1.505l-128-112c-3.472-3.038-5.464-7.427-5.464-12.041s1.992-9.003 5.464-12.041l128-112c6.65-5.819 16.758-5.146 22.577 1.505 2.656 3.035 3.959 6.791 3.959 10.529z"></path>
</svg>
