<?xml version="1.0" encoding="utf-8"?>
<COLLADA version="1.5.0" xmlns="http://www.collada.org/2008/03/COLLADASchema">
	<asset>
		<contributor>
			<authoring_tool>BrawlBox</authoring_tool>
		</contributor>
		<created>2020-09-15T17:47:17Z</created>
		<modified>2020-09-15T17:47:17Z</modified>
		<unit meter="0.01" name="centimeter" />
		<up_axis>Y_UP</up_axis>
	</asset>
	<library_images>
		<image id="body-image" name="body">
			<init_from>
				<ref>body.png</ref>
			</init_from>
		</image>
		<image id="low_light_1-image" name="low_light_1">
			<init_from>
				<ref>low_light_1.png</ref>
			</init_from>
		</image>
		<image id="metal0-image" name="metal0">
			<init_from>
				<ref>metal0.png</ref>
			</init_from>
		</image>
		<image id="tire-image" name="tire">
			<init_from>
				<ref>tire.png</ref>
			</init_from>
		</image>
	</library_images>
	<library_materials>
		<material id="mat_body">
			<instance_effect url="#mat_body-fx" />
		</material>
		<material id="mat_tire">
			<instance_effect url="#mat_tire-fx" />
		</material>
	</library_materials>
	<library_effects>
		<effect id="mat_body-fx" name="mat_body">
			<profile_COMMON>
				<newparam sid="body-surface">
					<surface type="2D">
						<init_from>
							<ref>body-image</ref>
						</init_from>
					</surface>
				</newparam>
				<newparam sid="body-sampler">
					<sampler2D>
						<source>body-surface</source>
						<instance_image url="#body-image" />
						<wrap_s>MIRROR</wrap_s>
						<wrap_t>MIRROR</wrap_t>
						<minfilter>LINEAR</minfilter>
						<magfilter>LINEAR</magfilter>
					</sampler2D>
				</newparam>
				<technique sid="COMMON">
					<phong>
						<diffuse>
							<texture texture="body-sampler" texcoord="TEXCOORD0" />
						</diffuse>
					</phong>
				</technique>
			</profile_COMMON>
		</effect>
		<effect id="mat_tire-fx" name="mat_tire">
			<profile_COMMON>
				<newparam sid="tire-surface">
					<surface type="2D">
						<init_from>
							<ref>tire-image</ref>
						</init_from>
					</surface>
				</newparam>
				<newparam sid="tire-sampler">
					<sampler2D>
						<source>tire-surface</source>
						<instance_image url="#tire-image" />
						<wrap_s>WRAP</wrap_s>
						<wrap_t>WRAP</wrap_t>
						<minfilter>LINEAR</minfilter>
						<magfilter>LINEAR</magfilter>
					</sampler2D>
				</newparam>
				<technique sid="COMMON">
					<phong>
						<diffuse>
							<texture texture="tire-sampler" texcoord="TEXCOORD0" />
						</diffuse>
					</phong>
				</technique>
			</profile_COMMON>
		</effect>
	</library_effects>
	<library_geometries>
		<geometry id="polygon0" name="polygon0">
			<mesh>
				<source id="polygon0_Positions">
					<float_array id="polygon0_PosArr" count="240">-22.51758 0 -13.30664 -12.92969 0 -22.09766 -22.51758 5.091797 -12.29297 -12.92969 8.457031 -20.41602 -22.50684 9.40918 -9.40918 -12.92969 15.62598 -15.62598 -22.51758 12.29395 -5.091797 -12.92969 20.41602 -8.456055 -12.92969 22.09766 0 -0.03710938 22.6416 -9.378906 -0.03710938 24.50684 0 12.85645 22.09766 0 -22.51758 5.091797 12.29395 -22.51758 9.40918 9.40918 -12.92969 8.457031 20.41602 -12.92969 15.62598 15.62598 -0.03710938 9.378906 22.6416 -0.03710938 17.3291 17.3291 12.85645 15.62598 15.62598 12.85645 20.41602 8.456055 22.44434 12.29395 5.091797 22.44434 13.30664 0 -22.51758 0 13.30664 -12.92969 0 22.09766 -22.51758 -5.091797 12.29297 -12.92969 -8.456055 20.41602 -22.51758 -9.40918 9.40918 -12.92969 -15.62598 15.62598 -22.51758 -12.29395 5.091797 -12.92969 -20.41602 8.457031 -22.51758 -13.30664 0 -12.92969 -22.09766 0 -0.03710938 0 24.50684 12.85645 8.457031 20.41602 22.44434 9.40918 9.40918 -22.51758 -5.091797 -12.29297 -12.92969 -8.456055 -20.41602 -0.03710938 -9.378906 -22.6416 -0.03710938 -17.3291 -17.3291 12.85645 -8.456055 -20.41602 12.85645 -15.62598 -15.62598 22.44434 -9.40918 -9.40918 22.44434 -12.29395 -5.091797 -22.51758 -9.40918 -9.40918 -12.92969 -15.62598 -15.62598 -0.03710938 -22.6416 -9.378906 12.85645 -20.41602 -8.457031 22.44434 -13.30664 0 -22.51758 -12.29395 -5.091797 -12.92969 -20.41602 -8.457031 -0.03710938 -24.50684 0 12.85645 -22.09766 0 -22.51758 12.29395 5.091797 -12.92969 20.41602 8.456055 -0.03710938 22.6416 9.378906 -0.03710938 -22.6416 9.378906 12.85645 -20.41602 8.457031 12.85645 -15.62598 15.62598 22.44434 -12.29395 5.091797 22.44434 -9.40918 9.40918 -0.03710938 -17.3291 17.3291 12.85645 -8.456055 20.41602 22.44434 -5.091797 12.29297 -0.03710938 -9.378906 22.6416 12.85645 0 22.09766 22.44434 0 13.30664 -0.03710938 0 -24.50684 -0.03710938 9.378906 -22.6416 -0.03710938 17.3291 -17.3291 22.44434 0 -13.30664 22.44434 5.091797 -12.29297 12.85645 0 -22.09766 12.85645 8.457031 -20.41602 22.43359 9.40918 -9.40918 12.85645 15.62598 -15.62598 22.44434 12.29395 -5.091797 12.85645 20.41602 -8.456055 22.44434 5.091797 12.29395 22.44434 -5.091797 -12.29395 -22.51758 13.30664 0</float_array>
					<technique_common>
						<accessor source="#polygon0_PosArr" count="80" stride="3">
							<param name="X" type="float" />
							<param name="Y" type="float" />
							<param name="Z" type="float" />
						</accessor>
					</technique_common>
				</source>
				<source id="polygon0_Normals">
					<float_array id="polygon0_NormArr" count="240">-0.6758423 0 -0.7370605 -0.4480591 0 -0.8939819 -0.6759644 0.2822266 -0.6807251 -0.4481201 0.3422241 -0.8258667 -0.6759644 0.5210571 -0.5210571 -0.4481812 0.6321411 -0.6321411 -0.6759644 0.6807251 -0.2822266 -0.4481201 0.8258667 -0.3422241 -0.4480591 0.8939819 0 0 0.9238892 -0.3826904 0 1 0 0.4480591 0.8939819 0 -0.6758423 0.2820435 0.6809692 -0.6758423 0.5211792 0.5211792 -0.4480591 0.3421021 0.8259277 -0.4480591 0.6321411 0.6321411 0 0.3826904 0.9238892 0 0.7070923 0.7070923 0.4480591 0.6321411 0.6321411 0.4480591 0.8259277 0.3421021 0.6758423 0.6809692 0.2820435 0.6758423 0.7370605 0 -0.6758423 0 0.7370605 -0.4480591 0 0.8939819 -0.6758423 -0.2820435 0.6809692 -0.4480591 -0.3421021 0.8259277 -0.6758423 -0.5211792 0.5211792 -0.4480591 -0.6321411 0.6321411 -0.6758423 -0.6809692 0.2820435 -0.4480591 -0.8259277 0.3421021 -0.6758423 -0.7370605 0 -0.4480591 -0.8939819 0 0 0 1 0.4480591 0.3421021 0.8259277 0.6758423 0.5211792 0.5211792 -0.6758423 -0.2820435 -0.6809692 -0.4480591 -0.3421021 -0.8259277 0 -0.3826904 -0.9238892 0 -0.7070923 -0.7070923 0.4480591 -0.3421021 -0.8259277 0.4480591 -0.6321411 -0.6321411 0.6758423 -0.5211792 -0.5211792 0.6758423 -0.6809692 -0.2820435 -0.6758423 -0.5211792 -0.5211792 -0.4480591 -0.6321411 -0.6321411 0 -0.9238892 -0.3826904 0.4480591 -0.8259277 -0.3421021 0.6758423 -0.7370605 0 -0.6758423 -0.6809692 -0.2820435 -0.4480591 -0.8259277 -0.3421021 0 -1 0 0.4480591 -0.8939819 0 -0.6758423 0.6809692 0.2820435 -0.4480591 0.8259277 0.3421021 0 0.9238892 0.3826904 0 -0.9238892 0.3826904 0.4480591 -0.8259277 0.3421021 0.4480591 -0.6321411 0.6321411 0.6758423 -0.6809692 0.2820435 0.6758423 -0.5211792 0.5211792 0 -0.7070923 0.7070923 0.4480591 -0.3421021 0.8259277 0.6758423 -0.2820435 0.6809692 0 -0.3826904 0.9238892 0.4480591 0 0.8939819 0.6758423 0 0.7370605 0 0 -1 0 0.3826904 -0.9238892 0 0.7070923 -0.7070923 0.6758423 0 -0.7370605 0.6759644 0.2822266 -0.6807251 0.4480591 0 -0.8939819 0.4481201 0.3422241 -0.8258667 0.6759644 0.5210571 -0.5210571 0.4481812 0.6321411 -0.6321411 0.6759644 0.6807251 -0.2822266 0.4481201 0.8258667 -0.3422241 0.6758423 0.2820435 0.6809692 0.6758423 -0.2820435 -0.6809692 -0.6758423 0.7370605 0</float_array>
					<technique_common>
						<accessor source="#polygon0_NormArr" count="80" stride="3">
							<param name="X" type="float" />
							<param name="Y" type="float" />
							<param name="Z" type="float" />
						</accessor>
					</technique_common>
				</source>
				<source id="polygon0_Colors0">
					<float_array id="polygon0_ColorArr0" count="16">0.2509804 0.2509804 0.2509804 1 0.6980392 0.6980392 0.6980392 1 0.2980392 0.2980392 0.2980392 1 0.8000001 0.8000001 0.8000001 1</float_array>
					<technique_common>
						<accessor source="#polygon0_ColorArr0" count="4" stride="4">
							<param name="R" type="float" />
							<param name="G" type="float" />
							<param name="B" type="float" />
							<param name="A" type="float" />
						</accessor>
					</technique_common>
				</source>
				<source id="polygon0_UVs0">
					<float_array id="polygon0_UVArr0" count="120">1.061646 -0.97229 1.13916 -0.97229 1.061646 -0.8258667 1.13916 -0.8258667 1.07019 -0.6794434 1.13916 -0.6794434 1.061646 -0.53302 1.13916 -0.53302 1.13916 -0.3866577 1.5047 -0.53302 1.5047 -0.3866577 1.939087 0.05279541 1.939087 -0.09362793 1.861633 0.05279541 1.861633 -0.09362793 1.496155 0.05279541 1.496155 -0.09362793 1.861633 -0.2400513 1.939087 -0.2400513 1.861633 -0.3864746 1.939087 -0.3864746 1.938965 -2.144714 1.86145 -2.144714 1.938965 -1.998291 1.86145 -1.998291 1.938965 -1.851868 1.86145 -1.851868 1.938965 -1.705444 1.86145 -1.705444 1.938965 -1.559021 1.86145 -1.559021 1.939087 0.1991577 1.861633 0.1991577 1.496155 0.1991577 1.938477 -0.9720459 1.938477 -1.118774 1.860901 -0.9720459 1.860901 -1.118774 1.495422 -1.118774 1.495422 -1.265503 1.860901 -1.265503 1.938477 -1.265503 1.938477 -1.412231 1.495422 -1.412231 1.860901 -1.412231 1.938477 -1.559021 1.495422 -1.559021 1.860901 -1.559021 1.496155 -0.2400513 1.495972 -1.559021 1.495972 -1.705444 1.495972 -1.851868 1.495972 -1.998291 1.5047 -0.97229 1.5047 -0.8258667 1.5047 -0.6794434 1.495972 -2.144714 1.496155 -0.3864746 1.495422 -0.9720459 1.061646 -0.3866577</float_array>
					<technique_common>
						<accessor source="#polygon0_UVArr0" count="60" stride="2">
							<param name="S" type="float" />
							<param name="T" type="float" />
						</accessor>
					</technique_common>
				</source>
				<vertices id="polygon0_Vertices">
					<input semantic="POSITION" source="#polygon0_Positions" />
				</vertices>
				<triangles material="mat_tire" count="128">
					<input semantic="VERTEX" source="#polygon0_Vertices" offset="0" />
					<input semantic="NORMAL" source="#polygon0_Normals" offset="1" />
					<input semantic="COLOR" source="#polygon0_Colors0" set="0" offset="2" />
					<input semantic="TEXCOORD" source="#polygon0_UVs0" set="0" offset="3" />
					<p>2 2 0 2 1 1 1 1 0 0 0 0 3 3 1 3 1 1 1 1 2 2 0 2 4 4 2 4 3 3 1 3 2 2 0 2 5 5 1 5 3 3 1 3 4 4 2 4 6 6 0 6 5 5 1 5 4 4 2 4 7 7 1 7 5 5 1 5 6 6 0 6 8 8 1 8 7 7 1 7 6 6 0 6 9 9 3 9 7 7 1 7 8 8 1 8 10 10 3 10 9 9 3 9 8 8 1 8 11 11 1 8 9 9 3 9 10 10 3 10 14 14 1 13 13 13 0 12 12 12 0 11 15 15 1 14 13 13 0 12 14 14 1 13 16 16 3 15 15 15 1 14 14 14 1 13 17 17 3 16 15 15 1 14 16 16 3 15 18 18 1 14 17 17 3 16 16 16 3 15 19 19 1 17 17 17 3 16 18 18 1 14 20 20 0 18 19 19 1 17 18 18 1 14 11 11 1 19 19 19 1 17 20 20 0 18 21 21 0 20 11 11 1 19 20 20 0 18 24 24 0 23 23 23 1 22 22 22 0 21 25 25 1 24 23 23 1 22 24 24 0 23 26 26 0 25 25 25 1 24 24 24 0 23 27 27 1 26 25 25 1 24 26 26 0 25 28 28 0 27 27 27 1 26 26 26 0 25 29 29 1 28 27 27 1 26 28 28 0 27 30 30 0 29 29 29 1 28 28 28 0 27 31 31 1 30 29 29 1 28 30 30 0 29 23 23 1 32 12 12 0 11 22 22 0 31 14 14 1 13 12 12 0 11 23 23 1 32 32 32 3 33 14 14 1 13 23 23 1 32 16 16 3 15 14 14 1 13 32 32 3 33 33 33 1 13 16 16 3 15 32 32 3 33 18 18 1 14 16 16 3 15 33 33 1 13 34 34 0 12 18 18 1 14 33 33 1 13 20 20 0 18 18 18 1 14 34 34 0 12 1 1 1 36 35 35 0 35 0 0 0 34 36 36 1 37 35 35 0 35 1 1 1 36 37 37 3 38 36 36 1 37 1 1 1 36 38 38 3 39 36 36 1 37 37 37 3 38 39 39 1 37 38 38 3 39 37 37 3 38 40 40 1 40 38 38 3 39 39 39 1 37 41 41 0 41 40 40 1 40 39 39 1 37 42 42 0 42 40 40 1 40 41 41 0 41 36 36 1 37 43 43 0 41 35 35 0 35 44 44 1 40 43 43 0 41 36 36 1 37 38 38 3 39 44 44 1 40 36 36 1 37 45 45 3 43 44 44 1 40 38 38 3 39 40 40 1 40 45 45 3 43 38 38 3 39 46 46 1 44 45 45 3 43 40 40 1 40 42 42 0 42 46 46 1 44 40 40 1 40 47 47 0 45 46 46 1 44 42 42 0 42 44 44 1 40 48 48 0 42 43 43 0 41 49 49 1 44 48 48 0 42 44 44 1 40 45 45 3 43 49 49 1 44 44 44 1 40 50 50 3 46 49 49 1 44 45 45 3 43 46 46 1 44 50 50 3 46 45 45 3 43 51 51 1 47 50 50 3 46 46 46 1 44 47 47 0 45 51 51 1 47 46 46 1 44 15 15 1 14 52 52 0 18 13 13 0 12 53 53 1 17 52 52 0 18 15 15 1 14 17 17 3 16 53 53 1 17 15 15 1 14 54 54 3 48 53 53 1 17 17 17 3 16 19 19 1 17 54 54 3 48 17 17 3 16 11 11 1 19 54 54 3 48 19 19 1 17 50 50 3 49 29 29 1 28 31 31 1 30 55 55 3 50 29 29 1 28 50 50 3 49 56 56 1 28 55 55 3 50 50 50 3 49 57 57 1 26 55 55 3 50 56 56 1 28 58 58 0 27 57 57 1 26 56 56 1 28 59 59 0 25 57 57 1 26 58 58 0 27 55 55 3 50 27 27 1 26 29 29 1 28 60 60 3 51 27 27 1 26 55 55 3 50 57 57 1 26 60 60 3 51 55 55 3 50 61 61 1 24 60 60 3 51 57 57 1 26 59 59 0 25 61 61 1 24 57 57 1 26 62 62 0 23 61 61 1 24 59 59 0 25 60 60 3 51 25 25 1 24 27 27 1 26 63 63 3 52 25 25 1 24 60 60 3 51 61 61 1 24 63 63 3 52 60 60 3 51 64 64 1 22 63 63 3 52 61 61 1 24 62 62 0 23 64 64 1 22 61 61 1 24 65 65 0 21 64 64 1 22 62 62 0 23 3 3 1 3 66 66 3 53 1 1 1 1 67 67 3 54 66 66 3 53 3 3 1 3 5 5 1 5 67 67 3 54 3 3 1 3 68 68 3 55 67 67 3 54 5 5 1 5 7 7 1 7 68 68 3 55 5 5 1 5 9 9 3 9 68 68 3 55 7 7 1 7 71 71 1 1 70 70 0 2 69 69 0 0 72 72 1 3 70 70 0 2 71 71 1 1 66 66 3 53 72 72 1 3 71 71 1 1 67 67 3 54 72 72 1 3 66 66 3 53 72 72 1 3 73 73 2 4 70 70 0 2 74 74 1 5 73 73 2 4 72 72 1 3 67 67 3 54 74 74 1 5 72 72 1 3 68 68 3 55 74 74 1 5 67 67 3 54 74 74 1 5 75 75 0 6 73 73 2 4 76 76 1 7 75 75 0 6 74 74 1 5 68 68 3 55 76 76 1 7 74 74 1 5 9 9 3 9 76 76 1 7 68 68 3 55 63 63 3 52 23 23 1 22 25 25 1 24 32 32 3 56 23 23 1 22 63 63 3 52 64 64 1 22 32 32 3 56 63 63 3 52 54 54 3 48 8 8 1 19 53 53 1 17 10 10 3 57 8 8 1 19 54 54 3 48 11 11 1 19 10 10 3 57 54 54 3 48 49 49 1 44 30 30 0 45 48 48 0 42 31 31 1 47 30 30 0 45 49 49 1 44 50 50 3 46 31 31 1 47 49 49 1 44 56 56 1 28 47 47 0 29 58 58 0 27 51 51 1 30 47 47 0 29 56 56 1 28 50 50 3 49 51 51 1 30 56 56 1 28 77 77 0 11 64 64 1 32 65 65 0 31 33 33 1 13 64 64 1 32 77 77 0 11 34 34 0 12 33 33 1 13 77 77 0 11 39 39 1 37 78 78 0 35 41 41 0 41 71 71 1 36 78 78 0 35 39 39 1 37 37 37 3 38 71 71 1 36 39 39 1 37 52 52 0 18 8 8 1 19 79 79 0 20 53 53 1 17 8 8 1 19 52 52 0 18 66 66 3 58 37 37 3 38 1 1 1 36 71 71 1 36 37 37 3 38 66 66 3 58 75 75 0 6 11 11 1 8 21 21 0 59 76 76 1 7 11 11 1 8 75 75 0 6 79 79 0 59 8 8 1 8 6 6 0 6 64 64 1 32 33 33 1 13 32 32 3 33 71 71 1 36 69 69 0 34 78 78 0 35 76 76 1 7 9 9 3 9 11 11 1 8</p>
				</triangles>
			</mesh>
		</geometry>
		<geometry id="polygon1" name="polygon1">
			<mesh>
				<source id="polygon1_Positions">
					<float_array id="polygon1_PosArr" count="96">-22.51758 -13.30664 0 -22.51758 -12.29395 -5.091797 -22.51758 -12.29395 5.091797 -22.51758 -9.40918 9.40918 -22.51758 -5.091797 12.29297 -22.51758 0 13.30664 -22.51758 5.091797 12.29395 -22.51758 9.40918 9.40918 -22.51758 12.29395 5.091797 -22.51758 13.30664 0 -22.51758 12.29395 -5.091797 -22.50684 9.40918 -9.40918 -22.51758 5.091797 -12.29297 -22.51758 0 -13.30664 -22.51758 -5.091797 -12.29297 -22.51758 -9.40918 -9.40918 22.44434 -12.29395 5.091797 22.44434 -9.40918 9.40918 22.44434 -13.30664 0 22.44434 -12.29395 -5.091797 22.44434 -9.40918 -9.40918 22.44434 -5.091797 -12.29395 22.44434 0 -13.30664 22.44434 5.091797 -12.29297 22.43359 9.40918 -9.40918 22.44434 12.29395 -5.091797 22.44434 13.30664 0 22.44434 12.29395 5.091797 22.44434 9.40918 9.40918 22.44434 5.091797 12.29395 22.44434 0 13.30664 22.44434 -5.091797 12.29297</float_array>
					<technique_common>
						<accessor source="#polygon1_PosArr" count="32" stride="3">
							<param name="X" type="float" />
							<param name="Y" type="float" />
							<param name="Z" type="float" />
						</accessor>
					</technique_common>
				</source>
				<source id="polygon1_Normals">
					<float_array id="polygon1_NormArr" count="6">-1 0 0 1 0 0</float_array>
					<technique_common>
						<accessor source="#polygon1_NormArr" count="2" stride="3">
							<param name="X" type="float" />
							<param name="Y" type="float" />
							<param name="Z" type="float" />
						</accessor>
					</technique_common>
				</source>
				<source id="polygon1_Colors0">
					<float_array id="polygon1_ColorArr0" count="4">0.6 0.6 0.6 1</float_array>
					<technique_common>
						<accessor source="#polygon1_ColorArr0" count="1" stride="4">
							<param name="R" type="float" />
							<param name="G" type="float" />
							<param name="B" type="float" />
							<param name="A" type="float" />
						</accessor>
					</technique_common>
				</source>
				<source id="polygon1_UVs0">
					<float_array id="polygon1_UVArr0" count="32">0.6599426 0.2957458 0.6753235 0.303009 0.6445313 0.303009 0.6314697 0.3237 0.6227417 0.3546448 0.6196899 0.3911743 0.6227417 0.4277039 0.6314697 0.4586792 0.6445313 0.4793701 0.6599426 0.4866333 0.6753235 0.4793701 0.688385 0.4586792 0.697113 0.4277039 0.7001648 0.3911743 0.697113 0.3546448 0.688385 0.3237</float_array>
					<technique_common>
						<accessor source="#polygon1_UVArr0" count="16" stride="2">
							<param name="S" type="float" />
							<param name="T" type="float" />
						</accessor>
					</technique_common>
				</source>
				<vertices id="polygon1_Vertices">
					<input semantic="POSITION" source="#polygon1_Positions" />
				</vertices>
				<triangles material="mat_body" count="28">
					<input semantic="VERTEX" source="#polygon1_Vertices" offset="0" />
					<input semantic="NORMAL" source="#polygon1_Normals" offset="1" />
					<input semantic="COLOR" source="#polygon1_Colors0" set="0" offset="2" />
					<input semantic="TEXCOORD" source="#polygon1_UVs0" set="0" offset="3" />
					<p>2 0 0 2 1 0 0 1 0 0 0 0 3 0 0 3 1 0 0 1 2 0 0 2 4 0 0 4 1 0 0 1 3 0 0 3 5 0 0 5 1 0 0 1 4 0 0 4 6 0 0 6 1 0 0 1 5 0 0 5 7 0 0 7 1 0 0 1 6 0 0 6 8 0 0 8 1 0 0 1 7 0 0 7 9 0 0 9 1 0 0 1 8 0 0 8 10 0 0 10 1 0 0 1 9 0 0 9 11 0 0 11 1 0 0 1 10 0 0 10 12 0 0 12 1 0 0 1 11 0 0 11 13 0 0 13 1 0 0 1 12 0 0 12 14 0 0 14 1 0 0 1 13 0 0 13 15 0 0 15 1 0 0 1 14 0 0 14 18 1 0 0 17 1 0 3 16 1 0 2 19 1 0 1 17 1 0 3 18 1 0 0 20 1 0 15 17 1 0 3 19 1 0 1 21 1 0 14 17 1 0 3 20 1 0 15 22 1 0 13 17 1 0 3 21 1 0 14 23 1 0 12 17 1 0 3 22 1 0 13 24 1 0 11 17 1 0 3 23 1 0 12 25 1 0 10 17 1 0 3 24 1 0 11 26 1 0 9 17 1 0 3 25 1 0 10 27 1 0 8 17 1 0 3 26 1 0 9 28 1 0 7 17 1 0 3 27 1 0 8 29 1 0 6 17 1 0 3 28 1 0 7 30 1 0 5 17 1 0 3 29 1 0 6 31 1 0 4 17 1 0 3 30 1 0 5</p>
				</triangles>
			</mesh>
		</geometry>
	</library_geometries>
	<library_controllers>
		<controller id="polygon0_Controller">
			<skin source="#polygon0">
				<bind_shape_matrix>1 0 0 0 0 1 0 0 0 0 1 0 0 0 0 1</bind_shape_matrix>
				<source id="polygon0_Joints">
					<Name_array id="polygon0_JointArr" count="1">tire_r</Name_array>
					<technique_common>
						<accessor source="#polygon0_JointArr" count="1">
							<param name="JOINT" type="Name" />
						</accessor>
					</technique_common>
				</source>
				<source id="polygon0_Matrices">
					<float_array id="polygon0_MatArr" count="16">1 0 0 0 0 1 0 0 0 0 1 0 0 0 0 1</float_array>
					<technique_common>
						<accessor source="#polygon0_MatArr" count="1" stride="16">
							<param type="float4x4" />
						</accessor>
					</technique_common>
				</source>
				<source id="polygon0_Weights">
					<float_array id="polygon0_WeightArr" count="1">1</float_array>
					<technique_common>
						<accessor source="#polygon0_WeightArr" count="1">
							<param type="float" />
						</accessor>
					</technique_common>
				</source>
				<joints>
					<input semantic="JOINT" source="#polygon0_Joints" />
					<input semantic="INV_BIND_MATRIX" source="#polygon0_Matrices" />
				</joints>
				<vertex_weights count="80">
					<input semantic="JOINT" offset="0" source="#polygon0_Joints" />
					<input semantic="WEIGHT" offset="1" source="#polygon0_Weights" />
					<vcount>1 1 1 1 1 1 1 1 1 1 1 1 1 1 1 1 1 1 1 1 1 1 1 1 1 1 1 1 1 1 1 1 1 1 1 1 1 1 1 1 1 1 1 1 1 1 1 1 1 1 1 1 1 1 1 1 1 1 1 1 1 1 1 1 1 1 1 1 1 1 1 1 1 1 1 1 1 1 1 1</vcount>
					<v>0 0 0 0 0 0 0 0 0 0 0 0 0 0 0 0 0 0 0 0 0 0 0 0 0 0 0 0 0 0 0 0 0 0 0 0 0 0 0 0 0 0 0 0 0 0 0 0 0 0 0 0 0 0 0 0 0 0 0 0 0 0 0 0 0 0 0 0 0 0 0 0 0 0 0 0 0 0 0 0 0 0 0 0 0 0 0 0 0 0 0 0 0 0 0 0 0 0 0 0 0 0 0 0 0 0 0 0 0 0 0 0 0 0 0 0 0 0 0 0 0 0 0 0 0 0 0 0 0 0 0 0 0 0 0 0 0 0 0 0 0 0 0 0 0 0 0 0 0 0 0 0 0 0 0 0 0 0 0 0</v>
				</vertex_weights>
			</skin>
		</controller>
		<controller id="polygon1_Controller">
			<skin source="#polygon1">
				<bind_shape_matrix>1 0 0 0 0 1 0 0 0 0 1 0 0 0 0 1</bind_shape_matrix>
				<source id="polygon1_Joints">
					<Name_array id="polygon1_JointArr" count="1">tire_r</Name_array>
					<technique_common>
						<accessor source="#polygon1_JointArr" count="1">
							<param name="JOINT" type="Name" />
						</accessor>
					</technique_common>
				</source>
				<source id="polygon1_Matrices">
					<float_array id="polygon1_MatArr" count="16">1 0 0 0 0 1 0 0 0 0 1 0 0 0 0 1</float_array>
					<technique_common>
						<accessor source="#polygon1_MatArr" count="1" stride="16">
							<param type="float4x4" />
						</accessor>
					</technique_common>
				</source>
				<source id="polygon1_Weights">
					<float_array id="polygon1_WeightArr" count="1">1</float_array>
					<technique_common>
						<accessor source="#polygon1_WeightArr" count="1">
							<param type="float" />
						</accessor>
					</technique_common>
				</source>
				<joints>
					<input semantic="JOINT" source="#polygon1_Joints" />
					<input semantic="INV_BIND_MATRIX" source="#polygon1_Matrices" />
				</joints>
				<vertex_weights count="32">
					<input semantic="JOINT" offset="0" source="#polygon1_Joints" />
					<input semantic="WEIGHT" offset="1" source="#polygon1_Weights" />
					<vcount>1 1 1 1 1 1 1 1 1 1 1 1 1 1 1 1 1 1 1 1 1 1 1 1 1 1 1 1 1 1 1 1</vcount>
					<v>0 0 0 0 0 0 0 0 0 0 0 0 0 0 0 0 0 0 0 0 0 0 0 0 0 0 0 0 0 0 0 0 0 0 0 0 0 0 0 0 0 0 0 0 0 0 0 0 0 0 0 0 0 0 0 0 0 0 0 0 0 0 0 0</v>
				</vertex_weights>
			</skin>
		</controller>
	</library_controllers>
	<library_visual_scenes>
		<visual_scene id="RootNode" name="RootNode">
			<node id="tire_r" name="tire_r" sid="tire_r" type="JOINT" />
			<node id="polygon0" name="polygon0" type="NODE">
				<instance_controller url="#polygon0_Controller">
					<skeleton>#tire_r</skeleton>
					<bind_material>
						<technique_common>
							<instance_material symbol="mat_tire" target="#mat_tire">
								<bind_vertex_input semantic="TEXCOORD0" input_semantic="TEXCOORD" input_set="0" />
								<bind_vertex_input semantic="TEXCOORD0" input_semantic="TEXCOORD" input_set="0" />
							</instance_material>
						</technique_common>
					</bind_material>
				</instance_controller>
			</node>
			<node id="polygon1" name="polygon1" type="NODE">
				<instance_controller url="#polygon1_Controller">
					<skeleton>#tire_r</skeleton>
					<bind_material>
						<technique_common>
							<instance_material symbol="mat_body" target="#mat_body">
								<bind_vertex_input semantic="TEXCOORD0" input_semantic="TEXCOORD" input_set="0" />
								<bind_vertex_input semantic="TEXCOORD0" input_semantic="TEXCOORD" input_set="0" />
							</instance_material>
						</technique_common>
					</bind_material>
				</instance_controller>
			</node>
		</visual_scene>
	</library_visual_scenes>
	<scene>
		<instance_visual_scene url="#RootNode" />
	</scene>
</COLLADA>