<?xml version="1.0" encoding="utf-8"?>
<COLLADA version="1.5.0" xmlns="http://www.collada.org/2008/03/COLLADASchema">
	<asset>
		<contributor>
			<authoring_tool>BrawlBox</authoring_tool>
		</contributor>
		<created>2020-09-15T17:47:02Z</created>
		<modified>2020-09-15T17:47:02Z</modified>
		<unit meter="0.01" name="centimeter" />
		<up_axis>Y_UP</up_axis>
	</asset>
	<library_images>
		<image id="body-image" name="body">
			<init_from>
				<ref>body.png</ref>
			</init_from>
		</image>
		<image id="metal0-image" name="metal0">
			<init_from>
				<ref>metal0.png</ref>
			</init_from>
		</image>
	</library_images>
	<library_materials>
		<material id="mat_body">
			<instance_effect url="#mat_body-fx" />
		</material>
	</library_materials>
	<library_effects>
		<effect id="mat_body-fx" name="mat_body">
			<profile_COMMON>
				<newparam sid="body-surface">
					<surface type="2D">
						<init_from>
							<ref>body-image</ref>
						</init_from>
					</surface>
				</newparam>
				<newparam sid="body-sampler">
					<sampler2D>
						<source>body-surface</source>
						<instance_image url="#body-image" />
						<wrap_s>MIRROR</wrap_s>
						<wrap_t>MIRROR</wrap_t>
						<minfilter>LINEAR</minfilter>
						<magfilter>LINEAR</magfilter>
					</sampler2D>
				</newparam>
				<technique sid="COMMON">
					<phong>
						<diffuse>
							<texture texture="body-sampler" texcoord="TEXCOORD0" />
						</diffuse>
					</phong>
				</technique>
			</profile_COMMON>
		</effect>
	</library_effects>
	<library_geometries>
		<geometry id="polygon0" name="polygon0">
			<mesh>
				<source id="polygon0_Positions">
					<float_array id="polygon0_PosArr" count="132">-2E-06 -1.929684 -2.280037 -1E-06 7.13676 -2.280035 1.634446 -1.929684 2.175713 1.785197 7.136755 2.175713 3.457904 -1.929693 2.17571 6.791136 8.397636 2.17571 2.244369 -1.929693 -2.280037 6.727539 8.397636 -2.280037 5.887613 13.8564 -2.280039 6.503667 13.73745 2.175711 -1.634451 -1.929684 2.175713 -1.770273 7.136765 2.175708 -6.468838 13.73974 2.175711 -6.754515 8.397636 2.17571 -11.11033 16.27768 2.175711 -11.07044 11.87221 2.175713 -17.02727 12.14549 2.17571 -16.94554 11.95003 -2.280036 -2.244372 -1.929684 -2.28004 -6.568615 8.397636 -2.280035 -5.487845 13.84594 -2.280035 -11.2566 11.47357 -2.28004 -10.39683 16.39315 -2.28004 -17.02727 16.98256 -2.280036 -17.02727 16.90662 2.175711 11.04642 11.46715 -2.280036 10.22695 16.39438 -2.28004 10.87594 16.27806 2.175711 10.94077 12.10517 2.175708 -40.18155 12.38128 -1.915976 -40.18155 12.51951 1.90589 -40.18154 16.80998 1.815929 -40.18154 16.72156 -1.993378 17.02727 12.14549 2.17571 16.94554 11.95003 -2.280035 17.02727 16.98256 -2.280036 17.02727 16.90662 2.175711 40.18155 12.38128 -1.915976 40.18155 16.72156 -1.993377 40.18155 16.80998 1.815929 40.18155 12.51952 1.905894 -3.457906 -1.929684 2.175708 -42.07975 14.51707 -0.029447 42.07975 14.51707 -0.029446</float_array>
					<technique_common>
						<accessor source="#polygon0_PosArr" count="44" stride="3">
							<param name="X" type="float" />
							<param name="Y" type="float" />
							<param name="Z" type="float" />
						</accessor>
					</technique_common>
				</source>
				<source id="polygon0_Normals">
					<float_array id="polygon0_NormArr" count="144">-0.9335938 0.007751465 0.3582764 -0.6559448 0.7365112 -0.1651001 0.3082886 0.9367065 0.1661377 -0.5307007 0.1743164 0.8294678 0.7039185 -0.2663574 0.6584473 0.5302734 -0.7648315 0.3659058 0.6158447 -0.2330322 -0.7526245 -0.05841064 -0.6907349 -0.7207642 0.5168457 0.7627563 0.3886108 -0.4612427 0.6520386 -0.6018066 -0.08392334 0.7897949 0.607605 0.9262695 0.161377 -0.3406372 0.5670166 0.004272461 0.8236694 -0.1375732 0.607666 0.7821655 -0.9262695 0.161377 -0.3406372 0.08392334 0.7897949 0.607605 -0.5302734 -0.7648315 0.3659058 0.194458 0.6459351 0.7382202 -0.2290649 -0.633667 0.7388916 -0.1687622 -0.6690063 0.7238159 -0.02954102 -0.7113647 -0.7021484 -0.6131592 -0.2262573 -0.756897 -0.3082886 0.9367065 0.1661377 0.05841064 -0.6907349 -0.7207642 0.4612427 0.6520386 -0.6018066 -0.2416992 -0.6687012 -0.703125 0.2088623 0.6937256 -0.6893311 0.1439819 0.6795654 -0.7193604 0.008666992 0.7425537 0.6697388 0.2520142 -0.670166 -0.6981201 -0.2198486 0.6856079 -0.6939697 -0.2064819 0.6439819 0.7366333 0.232666 -0.6186523 0.7504272 -0.548645 -0.6251221 -0.5551758 -0.5499878 -0.546875 0.6312256 -0.5472412 0.6358643 0.5442505 -0.5214844 0.5629272 -0.6412354 0.1687622 -0.6690063 0.7238159 0.02954102 -0.7113647 -0.7021484 -0.1439819 0.6795654 -0.7193604 -0.008666992 0.7424927 0.6697388 0.548645 -0.6251221 -0.5551758 0.5214844 0.5629272 -0.6412354 0.5472412 0.6358643 0.5442505 0.5499878 -0.546875 0.6312256 -0.789917 -0.5484009 0.2744141 -1 0 0 1 0 0</float_array>
					<technique_common>
						<accessor source="#polygon0_NormArr" count="48" stride="3">
							<param name="X" type="float" />
							<param name="Y" type="float" />
							<param name="Z" type="float" />
						</accessor>
					</technique_common>
				</source>
				<source id="polygon0_Colors0">
					<float_array id="polygon0_ColorArr0" count="56">0 0 0 1 0.3019608 0.3019608 0.3019608 1 0.5019608 0.5019608 0.5019608 1 0.6980392 0.6980392 0.6980392 1 0.654902 0.654902 0.654902 1 0.8980393 0.8980393 0.8980393 1 0.9058824 0.9058824 0.9058824 1 0.8509805 0.8509805 0.8509805 1 0.5058824 0.5058824 0.5058824 1 0.6666667 0.6666667 0.6666667 1 0.6745098 0.6745098 0.6745098 1 0.8470589 0.8470589 0.8470589 1 0.6 0.6 0.6 1 1 1 1 1</float_array>
					<technique_common>
						<accessor source="#polygon0_ColorArr0" count="14" stride="4">
							<param name="R" type="float" />
							<param name="G" type="float" />
							<param name="B" type="float" />
							<param name="A" type="float" />
						</accessor>
					</technique_common>
				</source>
				<source id="polygon0_UVs0">
					<float_array id="polygon0_UVArr0" count="68">0.1340942 0.7834473 0.1298523 0.7834473 0.1340942 0.7818604 0.1340942 0.7789001 0.127594 0.7808228 0.127594 0.7749023 0.127594 0.7819519 0.1255188 0.7749023 0.127594 0.7834473 0.1298523 0.7749023 0.1340942 0.7749023 0.1340942 0.7818909 0.1340942 0.7681885 0.127594 0.7681885 0.127594 0.7657776 0.1255188 0.7657776 0.1255188 0.7681885 0.1298523 0.7681885 0.1298523 0.7657776 0.1340942 0.7657776 0.1255188 0.7684021 0.1298523 0.7684021 0.1340942 0.7684021 0.127594 0.7684021 0.9293823 0.3534241 1.077087 0.3003235 0.9293823 0.3003235 1.077087 0.3511963 0.9293823 0.3516541 1.077087 0.3229065 0.9293823 0.3229065 1.077087 0.3538818 0.127594 0.7808533 1.088409 0.3470459</float_array>
					<technique_common>
						<accessor source="#polygon0_UVArr0" count="34" stride="2">
							<param name="S" type="float" />
							<param name="T" type="float" />
						</accessor>
					</technique_common>
				</source>
				<vertices id="polygon0_Vertices">
					<input semantic="POSITION" source="#polygon0_Positions" />
				</vertices>
				<triangles material="mat_body" count="80">
					<input semantic="VERTEX" source="#polygon0_Vertices" offset="0" />
					<input semantic="NORMAL" source="#polygon0_Normals" offset="1" />
					<input semantic="COLOR" source="#polygon0_Colors0" set="0" offset="2" />
					<input semantic="TEXCOORD" source="#polygon0_UVs0" set="0" offset="3" />
					<p>2 2 0 2 1 1 1 1 0 0 0 0 3 3 2 3 1 1 1 1 2 2 0 2 4 4 0 4 3 3 2 3 2 2 0 2 5 5 3 5 3 3 2 3 4 4 0 4 6 6 0 6 5 5 3 5 4 4 0 4 7 7 2 7 5 5 3 5 6 6 0 6 0 8 0 8 7 7 2 7 6 6 0 6 8 9 4 9 7 7 2 7 0 8 0 8 1 1 1 1 8 9 4 9 0 8 0 8 9 10 5 10 8 9 4 9 1 1 1 1 3 3 2 3 9 10 5 10 1 1 1 1 5 5 3 5 9 10 5 10 3 3 2 3 1 13 1 1 10 12 0 11 0 11 0 0 11 14 2 3 10 12 0 11 1 13 1 1 12 15 5 10 11 14 2 3 1 13 1 1 13 16 3 5 11 14 2 3 12 15 5 10 14 17 6 12 13 16 3 5 12 15 5 10 15 18 7 13 13 16 3 5 14 17 6 12 16 19 6 14 15 18 7 13 14 17 6 12 17 20 8 15 15 18 7 13 16 19 6 14 19 23 2 7 0 22 0 8 18 21 0 6 20 24 4 9 0 22 0 8 19 23 2 7 21 25 8 16 20 24 4 9 19 23 2 7 22 26 9 17 20 24 4 9 21 25 8 16 23 27 10 18 22 26 9 17 21 25 8 16 14 17 6 12 22 26 9 17 23 27 10 18 24 28 6 19 14 17 6 12 23 27 10 18 16 19 6 14 14 17 6 12 24 28 6 19 8 9 4 9 25 29 8 20 7 7 2 7 26 30 9 21 25 29 8 20 8 9 4 9 9 10 5 10 26 30 9 21 8 9 4 9 27 31 6 22 26 30 9 21 9 10 5 10 5 5 3 5 27 31 6 22 9 10 5 10 28 32 11 23 27 31 6 22 5 5 3 5 7 7 2 7 28 32 11 23 5 5 3 5 25 29 8 20 28 32 11 23 7 7 2 7 17 20 8 26 29 33 12 25 23 27 10 24 30 34 13 27 29 33 12 25 17 20 8 26 16 19 6 28 30 34 13 27 17 20 8 26 31 35 13 29 30 34 13 27 16 19 6 28 24 28 6 30 31 35 13 29 16 19 6 28 32 36 13 31 31 35 13 29 24 28 6 30 23 27 10 24 32 36 13 31 24 28 6 30 29 33 12 25 32 36 13 31 23 27 10 24 25 29 8 20 33 37 6 14 28 32 11 23 34 38 8 15 33 37 6 14 25 29 8 20 26 30 9 21 34 38 8 15 25 29 8 20 35 39 10 18 34 38 8 15 26 30 9 21 27 31 6 22 35 39 10 18 26 30 9 21 36 40 6 19 35 39 10 18 27 31 6 22 28 32 11 23 36 40 6 19 27 31 6 22 33 37 6 14 36 40 6 19 28 32 11 23 35 39 10 24 37 41 12 25 34 38 8 26 38 42 13 31 37 41 12 25 35 39 10 24 36 40 6 30 38 42 13 31 35 39 10 24 39 43 13 29 38 42 13 31 36 40 6 30 33 37 6 28 39 43 13 29 36 40 6 30 40 44 13 27 39 43 13 29 33 37 6 28 34 38 8 26 40 44 13 27 33 37 6 28 37 41 12 25 40 44 13 27 34 38 8 26 13 16 3 5 18 21 0 6 41 45 0 32 19 23 2 7 18 21 0 6 13 16 3 5 15 18 7 13 19 23 2 7 13 16 3 5 21 25 8 16 19 23 2 7 15 18 7 13 17 20 8 15 21 25 8 16 15 18 7 13 23 27 10 18 21 25 8 16 17 20 8 15 12 15 5 10 22 26 9 17 14 17 6 12 20 24 4 9 22 26 9 17 12 15 5 10 1 13 1 1 20 24 4 9 12 15 5 10 0 22 0 8 20 24 4 9 1 13 1 1 42 46 13 33 32 36 13 31 29 33 12 25 31 35 13 29 32 36 13 31 42 46 13 33 30 34 13 27 31 35 13 29 42 46 13 33 43 47 13 33 40 44 13 27 37 41 12 25 39 43 13 29 40 44 13 27 43 47 13 33 38 42 13 31 39 43 13 29 43 47 13 33 11 14 2 3 41 45 0 32 10 12 0 11 13 16 3 5 41 45 0 32 11 14 2 3 30 34 13 27 42 46 13 33 29 33 12 25 37 41 12 25 38 42 13 31 43 47 13 33</p>
				</triangles>
			</mesh>
		</geometry>
	</library_geometries>
	<library_controllers>
		<controller id="polygon0_Controller">
			<skin source="#polygon0">
				<bind_shape_matrix>1 0 0 0 0 1 0 0 0 0 1 0 0 0 0 1</bind_shape_matrix>
				<source id="polygon0_Joints">
					<Name_array id="polygon0_JointArr" count="1">handle</Name_array>
					<technique_common>
						<accessor source="#polygon0_JointArr" count="1">
							<param name="JOINT" type="Name" />
						</accessor>
					</technique_common>
				</source>
				<source id="polygon0_Matrices">
					<float_array id="polygon0_MatArr" count="16">1 0 0 0 0 1 0 0 0 0 1 0 0 0 0 1</float_array>
					<technique_common>
						<accessor source="#polygon0_MatArr" count="1" stride="16">
							<param type="float4x4" />
						</accessor>
					</technique_common>
				</source>
				<source id="polygon0_Weights">
					<float_array id="polygon0_WeightArr" count="1">1</float_array>
					<technique_common>
						<accessor source="#polygon0_WeightArr" count="1">
							<param type="float" />
						</accessor>
					</technique_common>
				</source>
				<joints>
					<input semantic="JOINT" source="#polygon0_Joints" />
					<input semantic="INV_BIND_MATRIX" source="#polygon0_Matrices" />
				</joints>
				<vertex_weights count="44">
					<input semantic="JOINT" offset="0" source="#polygon0_Joints" />
					<input semantic="WEIGHT" offset="1" source="#polygon0_Weights" />
					<vcount>1 1 1 1 1 1 1 1 1 1 1 1 1 1 1 1 1 1 1 1 1 1 1 1 1 1 1 1 1 1 1 1 1 1 1 1 1 1 1 1 1 1 1 1</vcount>
					<v>0 0 0 0 0 0 0 0 0 0 0 0 0 0 0 0 0 0 0 0 0 0 0 0 0 0 0 0 0 0 0 0 0 0 0 0 0 0 0 0 0 0 0 0 0 0 0 0 0 0 0 0 0 0 0 0 0 0 0 0 0 0 0 0 0 0 0 0 0 0 0 0 0 0 0 0 0 0 0 0 0 0 0 0 0 0 0 0</v>
				</vertex_weights>
			</skin>
		</controller>
	</library_controllers>
	<library_visual_scenes>
		<visual_scene id="RootNode" name="RootNode">
			<node id="handle" name="handle" sid="handle" type="JOINT" />
			<node id="polygon0" name="polygon0" type="NODE">
				<instance_controller url="#polygon0_Controller">
					<skeleton>#handle</skeleton>
					<bind_material>
						<technique_common>
							<instance_material symbol="mat_body" target="#mat_body">
								<bind_vertex_input semantic="TEXCOORD0" input_semantic="TEXCOORD" input_set="0" />
								<bind_vertex_input semantic="TEXCOORD0" input_semantic="TEXCOORD" input_set="0" />
							</instance_material>
						</technique_common>
					</bind_material>
				</instance_controller>
			</node>
		</visual_scene>
	</library_visual_scenes>
	<scene>
		<instance_visual_scene url="#RootNode" />
	</scene>
</COLLADA>