
2016-09-26 20:57:56...Begin System Check Process *************
2016-09-26 20:57:56...XML Parsing Support Found
2016-09-26 20:57:56...MBString Support Found
2016-09-26 20:57:56...ZIP Support Found
2016-09-26 20:57:56.../custom directory and subdirectory check passed
2016-09-26 20:57:56...cache directory and subdirectory check passed
2016-09-26 20:57:58.../module  directory and subdirectory check passed
2016-09-26 20:57:58.../upload directory check passed
2016-09-26 20:57:58.../zip check passed
2016-09-26 20:57:58...PCRE version check passed
2016-09-26 20:57:58...installerHook: Could not find custom/install/install_hooks.php
2016-09-26 20:57:58...php.ini location found. C:\Program Files\PHP\v7.0\php.ini
2016-09-26 20:57:58...Outputting HTML for System check
2016-09-26 20:57:58...No Errors were found *************
2016-09-26 20:57:58...installerHook: Could not find custom/install/install_hooks.php
2016-09-26 20:58:03...installerHook: Could not find custom/install/install_hooks.php
2016-09-26 20:58:06...Begin System Check Process *************
2016-09-26 20:58:06...XML Parsing Support Found
2016-09-26 20:58:06...MBString Support Found
2016-09-26 20:58:06...ZIP Support Found
2016-09-26 20:58:06.../custom directory and subdirectory check passed
2016-09-26 20:58:06...cache directory and subdirectory check passed
2016-09-26 20:58:08.../module  directory and subdirectory check passed
2016-09-26 20:58:08.../upload directory check passed
2016-09-26 20:58:08.../zip check passed
2016-09-26 20:58:08...PCRE version check passed
2016-09-26 20:58:08...installerHook: Could not find custom/install/install_hooks.php
2016-09-26 20:58:08...php.ini location found. C:\Program Files\PHP\v7.0\php.ini
2016-09-26 20:58:08...Outputting HTML for System check
2016-09-26 20:58:08...No Errors were found *************
2016-09-26 20:58:08...installerHook: Could not find custom/install/install_hooks.php
2016-09-26 20:59:40...installerHook: Could not find custom/install/install_hooks.php
2016-09-26 21:00:15...installerHook: Could not find custom/install/install_hooks.php
2016-09-26 21:00:23...installerHook: Could not find custom/install/install_hooks.php
2016-09-26 21:00:26...Begin System Check Process *************
2016-09-26 21:00:26...XML Parsing Support Found
2016-09-26 21:00:26...MBString Support Found
2016-09-26 21:00:26...ZIP Support Found
2016-09-26 21:00:26.../custom directory and subdirectory check passed
2016-09-26 21:00:26...cache directory and subdirectory check passed
2016-09-26 21:00:29.../module  directory and subdirectory check passed
2016-09-26 21:00:29.../upload directory check passed
2016-09-26 21:00:29.../zip check passed
2016-09-26 21:00:29...PCRE version check passed
2016-09-26 21:00:29...installerHook: Could not find custom/install/install_hooks.php
2016-09-26 21:00:29...php.ini location found. C:\Program Files\PHP\v7.0\php.ini
2016-09-26 21:00:29...Outputting HTML for System check
2016-09-26 21:00:29...No Errors were found *************
2016-09-26 21:00:30...installerHook: Could not find custom/install/install_hooks.php
2016-09-26 21:00:32...installerHook: Could not find custom/install/install_hooks.php
2016-09-26 21:02:02...installerHook: Could not find custom/install/install_hooks.php
2016-09-27 11:22:40...Begin System Check Process *************
2016-09-27 11:22:40...XML Parsing Support Found
2016-09-27 11:22:40...MBString Support Found
2016-09-27 11:22:40...ZIP Support Found
2016-09-27 11:22:40.../custom directory and subdirectory check passed
2016-09-27 11:22:40...cache directory and subdirectory check passed
2016-09-27 11:22:45.../module  directory and subdirectory check passed
2016-09-27 11:22:45.../upload directory check passed
2016-09-27 11:22:45.../zip check passed
2016-09-27 11:22:45...PCRE version check passed
2016-09-27 11:22:45...installerHook: Could not find custom/install/install_hooks.php
2016-09-27 11:22:45...php.ini location found. C:\Program Files\PHP\v7.0\php.ini
2016-09-27 11:22:45...Outputting HTML for System check
2016-09-27 11:22:45...No Errors were found *************
2016-09-27 11:22:46...installerHook: Could not find custom/install/install_hooks.php
2016-09-27 11:23:02...installerHook: Could not find custom/install/install_hooks.php
2016-09-27 11:52:28...installerHook: Could not find custom/install/install_hooks.php
2016-09-27 11:52:31...Begin System Check Process *************
2016-09-27 11:52:31...XML Parsing Support Found
2016-09-27 11:52:31...MBString Support Found
2016-09-27 11:52:31...ZIP Support Found
2016-09-27 11:52:31.../custom directory and subdirectory check passed
2016-09-27 11:52:31...cache directory and subdirectory check passed
2016-09-27 11:52:34.../module  directory and subdirectory check passed
2016-09-27 11:52:34.../upload directory check passed
2016-09-27 11:52:34.../zip check passed
2016-09-27 11:52:34...PCRE version check passed
2016-09-27 11:52:34...installerHook: Could not find custom/install/install_hooks.php
2016-09-27 11:52:34...php.ini location found. C:\Program Files\PHP\v7.0\php.ini
2016-09-27 11:52:34...Outputting HTML for System check
2016-09-27 11:52:34...No Errors were found *************
2016-09-27 11:52:34...installerHook: Could not find custom/install/install_hooks.php
2016-09-27 11:52:41...installerHook: Could not find custom/install/install_hooks.php
2016-09-27 11:58:01...installerHook: Could not find custom/install/install_hooks.php
2016-09-27 11:58:43...installerHook: Could not find custom/install/install_hooks.php
2016-09-27 11:58:46...Begin System Check Process *************
2016-09-27 11:58:46...XML Parsing Support Found
2016-09-27 11:58:46...MBString Support Found
2016-09-27 11:58:46...ZIP Support Found
2016-09-27 11:58:46.../custom directory and subdirectory check passed
2016-09-27 11:58:46...cache directory and subdirectory check passed
2016-09-27 11:58:49.../module  directory and subdirectory check passed
2016-09-27 11:58:49.../upload directory check passed
2016-09-27 11:58:49.../zip check passed
2016-09-27 11:58:49...PCRE version check passed
2016-09-27 11:58:49...installerHook: Could not find custom/install/install_hooks.php
2016-09-27 11:58:49...php.ini location found. C:\Program Files\PHP\v7.0\php.ini
2016-09-27 11:58:49...Outputting HTML for System check
2016-09-27 11:58:49...No Errors were found *************
2016-09-27 11:58:50...installerHook: Could not find custom/install/install_hooks.php
2016-09-27 11:59:48...installerHook: Could not find custom/install/install_hooks.php
2016-09-27 12:19:39...Begin DB Check Process *************
2016-09-27 12:19:39...testing with mysql:mysqli
2016-09-27 12:19:39...Basic form info is valid, continuing Process.
2016-09-27 12:19:39...Testing user account...
2016-09-27 12:19:39...Connection made using  host: 10.11.100.11, usr: suite
2016-09-27 12:19:39...SUCCESS:: no errors detected!
2016-09-27 12:19:39...End DB Check Process *************
2016-09-27 12:19:39...installerHook: Could not find custom/install/install_hooks.php
2016-09-27 12:19:39...calling handleSugarConfig()
2016-09-27 12:19:39...calling handleWebConfig()
2016-09-27 12:19:39...calling handleDbCreateDatabase()
2016-09-27 12:19:41...looping through all the Beans and create their tables
2016-09-27 12:19:41...processing table acl_actions
2016-09-27 12:19:41...creating table acl_actions
2016-09-27 12:19:41...creating Relationship Meta for ACLAction
2016-09-27 12:19:41...processing table acl_roles
2016-09-27 12:19:42...creating table acl_roles
2016-09-27 12:19:42...creating Relationship Meta for ACLRole
2016-09-27 12:19:42...processing table relationships
2016-09-27 12:19:42...creating table relationships
2016-09-27 12:19:42...creating Relationship Meta for Relationship
2016-09-27 12:19:42...processing table leads
2016-09-27 12:19:43...creating table leads
2016-09-27 12:19:43...creating Relationship Meta for Lead
2016-09-27 12:19:44...processing table cases
2016-09-27 12:19:45...creating table cases
2016-09-27 12:19:45...creating Relationship Meta for Case
2016-09-27 12:19:45...processing table bugs
2016-09-27 12:19:46...creating table bugs
2016-09-27 12:19:46...creating Relationship Meta for Bug
2016-09-27 12:19:46...processing table users
2016-09-27 12:19:47...creating table users
2016-09-27 12:19:47...creating Relationship Meta for User
2016-09-27 12:19:47...processing table campaign_log
2016-09-27 12:19:47...creating table campaign_log
2016-09-27 12:19:47...creating Relationship Meta for CampaignLog
2016-09-27 12:19:48...processing table project
2016-09-27 12:19:48...creating table project
2016-09-27 12:19:48...creating Relationship Meta for Project
2016-09-27 12:19:48...processing table project_task
2016-09-27 12:19:49...creating table project_task
2016-09-27 12:19:49...creating Relationship Meta for ProjectTask
2016-09-27 12:19:50...processing table campaigns
2016-09-27 12:19:50...creating table campaigns
2016-09-27 12:19:50...creating Relationship Meta for Campaign
2016-09-27 12:19:51...processing table prospect_lists
2016-09-27 12:19:51...creating table prospect_lists
2016-09-27 12:19:51...creating Relationship Meta for ProspectList
2016-09-27 12:19:51...processing table prospects
2016-09-27 12:19:52...creating table prospects
2016-09-27 12:19:52...creating Relationship Meta for Prospect
2016-09-27 12:19:52...processing table email_marketing
2016-09-27 12:19:53...creating table email_marketing
2016-09-27 12:19:53...creating Relationship Meta for EmailMarketing
2016-09-27 12:19:53...processing table campaign_trkrs
2016-09-27 12:19:53...creating table campaign_trkrs
2016-09-27 12:19:53...creating Relationship Meta for CampaignTracker
2016-09-27 12:19:53...processing table releases
2016-09-27 12:19:53...creating table releases
2016-09-27 12:19:53...creating Relationship Meta for Release
2016-09-27 12:19:53...processing table emailman
2016-09-27 12:19:54...creating table emailman
2016-09-27 12:19:54...creating Relationship Meta for EmailMan
2016-09-27 12:19:54...processing table schedulers
2016-09-27 12:19:54...creating table schedulers
2016-09-27 12:19:54...creating Relationship Meta for Scheduler
2016-09-27 12:19:54...processing table job_queue
2016-09-27 12:19:54...creating table job_queue
2016-09-27 12:19:54...creating Relationship Meta for SchedulersJob
2016-09-27 12:19:54...processing table contacts
2016-09-27 12:19:55...creating table contacts
2016-09-27 12:19:55...creating Relationship Meta for Contact
2016-09-27 12:19:56...processing table accounts
2016-09-27 12:19:57...creating table accounts
2016-09-27 12:19:57...creating Relationship Meta for Account
2016-09-27 12:19:57...processing table opportunities
2016-09-27 12:19:58...creating table opportunities
2016-09-27 12:19:58...creating Relationship Meta for Opportunity
2016-09-27 12:19:59...processing table email_templates
2016-09-27 12:19:59...creating table email_templates
2016-09-27 12:19:59...creating Relationship Meta for EmailTemplate
2016-09-27 12:19:59...processing table notes
2016-09-27 12:20:00...creating table notes
2016-09-27 12:20:00...creating Relationship Meta for Note
2016-09-27 12:20:00...processing table calls
2016-09-27 12:20:01...creating table calls
2016-09-27 12:20:01...creating Relationship Meta for Call
2016-09-27 12:20:01...processing table emails
2016-09-27 12:20:02...creating table emails
2016-09-27 12:20:02...creating Relationship Meta for Email
2016-09-27 12:20:02...processing table meetings
2016-09-27 12:20:03...creating table meetings
2016-09-27 12:20:03...creating Relationship Meta for Meeting
2016-09-27 12:20:03...processing table tasks
2016-09-27 12:20:04...creating table tasks
2016-09-27 12:20:04...creating Relationship Meta for Task
2016-09-27 12:20:04...processing table users
2016-09-27 12:20:04...processing table users
2016-09-27 12:20:04...processing table currencies
2016-09-27 12:20:04...creating table currencies
2016-09-27 12:20:04...creating Relationship Meta for Currency
2016-09-27 12:20:04...processing table tracker
2016-09-27 12:20:04...creating table tracker
2016-09-27 12:20:04...creating Relationship Meta for Tracker
2016-09-27 12:20:04...processing table import_maps
2016-09-27 12:20:05...creating table import_maps
2016-09-27 12:20:05...creating Relationship Meta for ImportMap
2016-09-27 12:20:05...processing table users_last_import
2016-09-27 12:20:05...creating table users_last_import
2016-09-27 12:20:05...creating Relationship Meta for UsersLastImport
2016-09-27 12:20:05...processing table config
2016-09-27 12:20:05...creating table config
2016-09-27 12:20:05...creating Relationship Meta for Administration
2016-09-27 12:20:05...processing table upgrade_history
2016-09-27 12:20:05...creating table upgrade_history
2016-09-27 12:20:05...creating Relationship Meta for UpgradeHistory
2016-09-27 12:20:05...processing table vcals
2016-09-27 12:20:06...creating table vcals
2016-09-27 12:20:06...creating Relationship Meta for vCal
2016-09-27 12:20:06...processing table alerts
2016-09-27 12:20:06...creating table alerts
2016-09-27 12:20:06...creating Relationship Meta for Alert
2016-09-27 12:20:06...processing table roles
2016-09-27 12:20:06...creating table roles
2016-09-27 12:20:06...creating Relationship Meta for Role
2016-09-27 12:20:07...processing table documents
2016-09-27 12:20:07...creating table documents
2016-09-27 12:20:07...creating Relationship Meta for Document
2016-09-27 12:20:07...processing table document_revisions
2016-09-27 12:20:07...creating table document_revisions
2016-09-27 12:20:07...creating Relationship Meta for DocumentRevision
2016-09-27 12:20:08...processing table fields_meta_data
2016-09-27 12:20:08...creating table fields_meta_data
2016-09-27 12:20:08...creating Relationship Meta for FieldsMetaData
2016-09-27 12:20:08...processing table inbound_email
2016-09-27 12:20:08...creating table inbound_email
2016-09-27 12:20:08...creating Relationship Meta for InboundEmail
2016-09-27 12:20:08...processing table saved_search
2016-09-27 12:20:09...creating table saved_search
2016-09-27 12:20:09...creating Relationship Meta for SavedSearch
2016-09-27 12:20:09...processing table user_preferences
2016-09-27 12:20:09...creating table user_preferences
2016-09-27 12:20:09...creating Relationship Meta for UserPreference
2016-09-27 12:20:09...processing table 
2016-09-27 12:20:09...processing table email_addresses
2016-09-27 12:20:09...creating table email_addresses
2016-09-27 12:20:09...creating Relationship Meta for EmailAddress
2016-09-27 12:20:09...processing table emails_text
2016-09-27 12:20:09...creating table emails_text
2016-09-27 12:20:09...creating Relationship Meta for EmailText
2016-09-27 12:20:09...processing table spots
2016-09-27 12:20:10...creating table spots
2016-09-27 12:20:10...creating Relationship Meta for Spots
2016-09-27 12:20:10...processing table aobh_businesshours
2016-09-27 12:20:11...creating table aobh_businesshours
2016-09-27 12:20:11...creating Relationship Meta for AOBH_BusinessHours
2016-09-27 12:20:11...processing table sugarfeed
2016-09-27 12:20:11...creating table sugarfeed
2016-09-27 12:20:11...creating Relationship Meta for SugarFeed
2016-09-27 12:20:11...processing table eapm
2016-09-27 12:20:12...creating table eapm
2016-09-27 12:20:12...creating Relationship Meta for EAPM
2016-09-27 12:20:12...processing table oauth_consumer
2016-09-27 12:20:12...creating table oauth_consumer
2016-09-27 12:20:12...creating Relationship Meta for OAuthKey
2016-09-27 12:20:12...processing table oauth_tokens
2016-09-27 12:20:13...creating table oauth_tokens
2016-09-27 12:20:13...creating Relationship Meta for OAuthToken
2016-09-27 12:20:13...processing table am_projecttemplates
2016-09-27 12:20:14...creating table am_projecttemplates
2016-09-27 12:20:14...creating Relationship Meta for AM_ProjectTemplates
2016-09-27 12:20:14...processing table am_tasktemplates
2016-09-27 12:20:14...creating table am_tasktemplates
2016-09-27 12:20:14...creating Relationship Meta for AM_TaskTemplates
2016-09-27 12:20:14...processing table favorites
2016-09-27 12:20:15...creating table favorites
2016-09-27 12:20:15...creating Relationship Meta for Favorites
2016-09-27 12:20:15...processing table aok_knowledge_base_categories
2016-09-27 12:20:16...creating table aok_knowledge_base_categories
2016-09-27 12:20:16...creating Relationship Meta for AOK_Knowledge_Base_Categories
2016-09-27 12:20:16...processing table aok_knowledgebase
2016-09-27 12:20:17...creating table aok_knowledgebase
2016-09-27 12:20:17...creating Relationship Meta for AOK_KnowledgeBase
2016-09-27 12:20:17...processing table reminders
2016-09-27 12:20:18...creating table reminders
2016-09-27 12:20:18...creating Relationship Meta for Reminder
2016-09-27 12:20:18...processing table reminders_invitees
2016-09-27 12:20:18...creating table reminders_invitees
2016-09-27 12:20:18...creating Relationship Meta for Reminder_Invitee
2016-09-27 12:20:18...processing table fp_events
2016-09-27 12:20:19...creating table fp_events
2016-09-27 12:20:19...creating Relationship Meta for FP_events
2016-09-27 12:20:19...processing table fp_event_locations
2016-09-27 12:20:20...creating table fp_event_locations
2016-09-27 12:20:20...creating Relationship Meta for FP_Event_Locations
2016-09-27 12:20:20...processing table aod_indexevent
2016-09-27 12:20:21...creating table aod_indexevent
2016-09-27 12:20:21...creating Relationship Meta for AOD_IndexEvent
2016-09-27 12:20:21...processing table aod_index
2016-09-27 12:20:22...creating table aod_index
2016-09-27 12:20:22...creating Relationship Meta for AOD_Index
2016-09-27 12:20:22...processing table aop_case_events
2016-09-27 12:20:23...creating table aop_case_events
2016-09-27 12:20:23...creating Relationship Meta for AOP_Case_Events
2016-09-27 12:20:23...processing table aop_case_updates
2016-09-27 12:20:24...creating table aop_case_updates
2016-09-27 12:20:24...creating Relationship Meta for AOP_Case_Updates
2016-09-27 12:20:24...processing table aor_reports
2016-09-27 12:20:25...creating table aor_reports
2016-09-27 12:20:25...creating Relationship Meta for AOR_Report
2016-09-27 12:20:25...processing table aor_fields
2016-09-27 12:20:25...creating table aor_fields
2016-09-27 12:20:25...creating Relationship Meta for AOR_Field
2016-09-27 12:20:25...processing table aor_charts
2016-09-27 12:20:26...creating table aor_charts
2016-09-27 12:20:26...creating Relationship Meta for AOR_Chart
2016-09-27 12:20:26...processing table aor_conditions
2016-09-27 12:20:26...creating table aor_conditions
2016-09-27 12:20:26...creating Relationship Meta for AOR_Condition
2016-09-27 12:20:26...processing table aor_scheduled_reports
2016-09-27 12:20:27...creating table aor_scheduled_reports
2016-09-27 12:20:27...creating Relationship Meta for AOR_Scheduled_Reports
2016-09-27 12:20:27...processing table aos_contracts
2016-09-27 12:20:28...creating table aos_contracts
2016-09-27 12:20:28...creating Relationship Meta for AOS_Contracts
2016-09-27 12:20:28...processing table aos_invoices
2016-09-27 12:20:29...creating table aos_invoices
2016-09-27 12:20:29...creating Relationship Meta for AOS_Invoices
2016-09-27 12:20:30...processing table aos_pdf_templates
2016-09-27 12:20:31...creating table aos_pdf_templates
2016-09-27 12:20:31...creating Relationship Meta for AOS_PDF_Templates
2016-09-27 12:20:31...processing table aos_product_categories
2016-09-27 12:20:32...creating table aos_product_categories
2016-09-27 12:20:32...creating Relationship Meta for AOS_Product_Categories
2016-09-27 12:20:32...processing table aos_products
2016-09-27 12:20:33...creating table aos_products
2016-09-27 12:20:33...creating Relationship Meta for AOS_Products
2016-09-27 12:20:34...processing table aos_products_quotes
2016-09-27 12:20:34...creating table aos_products_quotes
2016-09-27 12:20:34...creating Relationship Meta for AOS_Products_Quotes
2016-09-27 12:20:34...processing table aos_line_item_groups
2016-09-27 12:20:35...creating table aos_line_item_groups
2016-09-27 12:20:35...creating Relationship Meta for AOS_Line_Item_Groups
2016-09-27 12:20:36...processing table aos_quotes
2016-09-27 12:20:36...creating table aos_quotes
2016-09-27 12:20:36...creating Relationship Meta for AOS_Quotes
2016-09-27 12:20:37...processing table aow_actions
2016-09-27 12:20:37...creating table aow_actions
2016-09-27 12:20:37...creating Relationship Meta for AOW_Action
2016-09-27 12:20:37...processing table aow_workflow
2016-09-27 12:20:38...creating table aow_workflow
2016-09-27 12:20:38...creating Relationship Meta for AOW_WorkFlow
2016-09-27 12:20:38...processing table aow_processed
2016-09-27 12:20:39...creating table aow_processed
2016-09-27 12:20:39...creating Relationship Meta for AOW_Processed
2016-09-27 12:20:39...processing table aow_conditions
2016-09-27 12:20:40...creating table aow_conditions
2016-09-27 12:20:40...creating Relationship Meta for AOW_Condition
2016-09-27 12:20:40...processing table jjwg_maps
2016-09-27 12:20:41...creating table jjwg_maps
2016-09-27 12:20:41...creating Relationship Meta for jjwg_Maps
2016-09-27 12:20:41...processing table jjwg_markers
2016-09-27 12:20:42...creating table jjwg_markers
2016-09-27 12:20:42...creating Relationship Meta for jjwg_Markers
2016-09-27 12:20:42...processing table jjwg_areas
2016-09-27 12:20:43...creating table jjwg_areas
2016-09-27 12:20:43...creating Relationship Meta for jjwg_Areas
2016-09-27 12:20:43...processing table jjwg_address_cache
2016-09-27 12:20:44...creating table jjwg_address_cache
2016-09-27 12:20:44...creating Relationship Meta for jjwg_Address_Cache
2016-09-27 12:20:44...processing table calls_reschedule
2016-09-27 12:20:45...creating table calls_reschedule
2016-09-27 12:20:45...creating Relationship Meta for Calls_Reschedule
2016-09-27 12:20:45...processing table securitygroups
2016-09-27 12:20:45...creating table securitygroups
2016-09-27 12:20:45...creating Relationship Meta for SecurityGroup
2016-09-27 12:20:46...processing table outbound_email
2016-09-27 12:20:46...creating table outbound_email
2016-09-27 12:20:46...creating Relationship Meta for OutboundEmailAccounts
2016-09-27 12:20:46...processing table templatesectionline
2016-09-27 12:20:47...creating table templatesectionline
2016-09-27 12:20:47...creating Relationship Meta for TemplateSectionLine
2016-09-27 12:21:11...Begin creating Defaults
2016-09-27 12:21:11...insert defaults into config table
2016-09-27 12:21:11...Creating default users
2016-09-27 12:21:11...Creating default scheduler jobs
2016-09-27 12:21:12...Enable SugarFeeds
2016-09-27 12:21:12...Installation has completed *********
2016-09-27 12:21:46...populating the db with seed data
2016-09-27 12:21:46...Save configuration settings..
2016-09-27 12:21:46...save locale
2016-09-27 12:21:46...new Administration
2016-09-27 12:21:46...retrieveSettings
2016-09-27 12:21:46...AdminWizard OFF
2016-09-27 12:21:46...saveConfig
2016-09-27 12:21:46...new Configurator
2016-09-27 12:21:46...populateFromPost
2016-09-27 12:21:46...handleOverride
2016-09-27 12:21:46...saveConfig
2016-09-27 12:21:46...new Currency
2016-09-27 12:21:46...retrieve
2016-09-27 12:21:46...DBG: save currency
2016-09-27 12:21:46...Save user settings..
2016-09-27 12:21:47...DBG: SugarThemeRegistry::getDefault
2016-09-27 12:21:47...DBG: require modules/Users/Save.php