{
    "db":{
        "host":"localhost",
        "user":"root",
        "password":"root",
        "database":"cypresstest"
    },
    "mongo":"mongodb+srv://hansgpe:l3opardo@cluster0.sb8yg.mongodb.net/?retryWrites=true&w=majority"
}