%YAML 1.1
%TAG !u! tag:unity3d.com,2011:
--- !u!114 &11400000
MonoBehaviour:
  m_ObjectHideFlags: 0
  m_CorrespondingSourceObject: {fileID: 0}
  m_PrefabInstance: {fileID: 0}
  m_PrefabAsset: {fileID: 0}
  m_GameObject: {fileID: 0}
  m_Enabled: 1
  m_EditorHideFlags: 0
  m_Script: {fileID: 11500000, guid: bb386707081f4064fb873458f20b5f9d, type: 3}
  m_Name: BestOfThree
  m_EditorClassIdentifier: 
  _roundsToWin: 2
  _secondsPerRound: 99
  _startCountdown: 3
