{
  "kind": "collectionType",
  "collectionName": "customers",
  "info": {
    "singularName": "customer",
    "pluralName": "customers",
    "displayName": "Customer",
    "description": ""
  },
  "options": {
    "draftAndPublish": true
  },
  "pluginOptions": {},
  "attributes": {
    "firstName": {
      "type": "string"
    },
    "lastName": {
      "type": "string"
    },
    "athlete": {
      "type": "relation",
      "relation": "oneToOne",
      "target": "api::athlete.athlete",
      "inversedBy": "customer"
    },
    "user": {
      "type": "relation",
      "relation": "oneToOne",
      "target": "plugin::users-permissions.user",
      "inversedBy": "customer"
    },
    "photo": {
      "type": "string"
    }
  }
}
