<svg width="64" height="69" viewBox="0 0 64 69" fill="none" xmlns="http://www.w3.org/2000/svg">
<circle cx="9.552" cy="6.68657" r="4.77612" fill="#36304B"/>
<circle cx="18.1492" cy="4.77612" r="4.77612" fill="#36304B"/>
<path fill-rule="evenodd" clip-rule="evenodd" d="M18.6269 7.1642C10.9851 6.40002 3.02488 14.1692 0 18.1493C16.352 21.7387 11.3893 29.9907 8.4729 34.8403C7.89679 35.7983 7.40053 36.6235 7.16418 37.2537C6.83301 38.1369 6.53586 39.3886 6.35922 40.8789C8.92011 39.1912 11.9871 38.209 15.2835 38.209C24.252 38.209 31.5223 45.4793 31.5223 54.4478C31.5223 58.6418 29.9324 62.4644 27.3224 65.3459C27.7586 65.3817 28.2033 65.4107 28.6567 65.4328C31.783 65.5853 34.6232 65.3726 37.2031 64.8521C34.8493 62.0343 33.4327 58.4065 33.4327 54.4478C33.4327 45.4793 40.7031 38.209 49.6715 38.209C53.3581 38.209 56.7577 39.4374 59.4834 41.5073C63.6742 27.2581 62.0896 11.9403 62.0896 11.9403C62.0896 11.9403 43.4627 37.7313 32 25.791C29.2857 22.9636 28.1497 19.5037 27.1085 16.3325C25.5963 11.7267 24.284 7.72991 18.6269 7.1642Z" fill="#36304B"/>
<circle cx="15.2837" cy="54.4478" r="14.3284" fill="#36304B"/>
<circle cx="49.6716" cy="54.4478" r="14.3284" fill="#36304B"/>
</svg>
