%!PS-Adobe-3.0 EPSF-3.0
%%Creator: (MATLAB, The Mathworks, Inc. Version 9.12.0.2529717 \(R2022a\) Update 8. Operating System: Linux)
%%Title: plots/Example3_rx_dot.eps
%%CreationDate: 2024-06-16T12:51:07
%%Pages: (atend)
%%BoundingBox:     9     2   390   335
%%LanguageLevel: 3
%%EndComments
%%BeginProlog
%%BeginResource: procset (Apache XML Graphics Std ProcSet) 1.2 0
%%Version: 1.2 0
%%Copyright: (Copyright 2001-2003,2010 The Apache Software Foundation. License terms: http://www.apache.org/licenses/LICENSE-2.0)
/bd{bind def}bind def
/ld{load def}bd
/GR/grestore ld
/GS/gsave ld
/RM/rmoveto ld
/C/curveto ld
/t/show ld
/L/lineto ld
/ML/setmiterlimit ld
/CT/concat ld
/f/fill ld
/N/newpath ld
/S/stroke ld
/CC/setcmykcolor ld
/A/ashow ld
/cp/closepath ld
/RC/setrgbcolor ld
/LJ/setlinejoin ld
/GC/setgray ld
/LW/setlinewidth ld
/M/moveto ld
/re {4 2 roll M
1 index 0 rlineto
0 exch rlineto
neg 0 rlineto
cp } bd
/_ctm matrix def
/_tm matrix def
/BT { _ctm currentmatrix pop matrix _tm copy pop 0 0 moveto } bd
/ET { _ctm setmatrix } bd
/iTm { _ctm setmatrix _tm concat } bd
/Tm { _tm astore pop iTm 0 0 moveto } bd
/ux 0.0 def
/uy 0.0 def
/F {
  /Tp exch def
  /Tf exch def
  Tf findfont Tp scalefont setfont
  /cf Tf def  /cs Tp def
} bd
/ULS {currentpoint /uy exch def /ux exch def} bd
/ULE {
  /Tcx currentpoint pop def
  gsave
  newpath
  cf findfont cs scalefont dup
  /FontMatrix get 0 get /Ts exch def /FontInfo get dup
  /UnderlinePosition get Ts mul /To exch def
  /UnderlineThickness get Ts mul /Tt exch def
  ux uy To add moveto  Tcx uy To add lineto
  Tt setlinewidth stroke
  grestore
} bd
/OLE {
  /Tcx currentpoint pop def
  gsave
  newpath
  cf findfont cs scalefont dup
  /FontMatrix get 0 get /Ts exch def /FontInfo get dup
  /UnderlinePosition get Ts mul /To exch def
  /UnderlineThickness get Ts mul /Tt exch def
  ux uy To add cs add moveto Tcx uy To add cs add lineto
  Tt setlinewidth stroke
  grestore
} bd
/SOE {
  /Tcx currentpoint pop def
  gsave
  newpath
  cf findfont cs scalefont dup
  /FontMatrix get 0 get /Ts exch def /FontInfo get dup
  /UnderlinePosition get Ts mul /To exch def
  /UnderlineThickness get Ts mul /Tt exch def
  ux uy To add cs 10 mul 26 idiv add moveto Tcx uy To add cs 10 mul 26 idiv add lineto
  Tt setlinewidth stroke
  grestore
} bd
/QT {
/Y22 exch store
/X22 exch store
/Y21 exch store
/X21 exch store
currentpoint
/Y21 load 2 mul add 3 div exch
/X21 load 2 mul add 3 div exch
/X21 load 2 mul /X22 load add 3 div
/Y21 load 2 mul /Y22 load add 3 div
/X22 load /Y22 load curveto
} bd
/SSPD {
dup length /d exch dict def
{
/v exch def
/k exch def
currentpagedevice k known {
/cpdv currentpagedevice k get def
v cpdv ne {
/upd false def
/nullv v type /nulltype eq def
/nullcpdv cpdv type /nulltype eq def
nullv nullcpdv or
{
/upd true def
} {
/sametype v type cpdv type eq def
sametype {
v type /arraytype eq {
/vlen v length def
/cpdvlen cpdv length def
vlen cpdvlen eq {
0 1 vlen 1 sub {
/i exch def
/obj v i get def
/cpdobj cpdv i get def
obj cpdobj ne {
/upd true def
exit
} if
} for
} {
/upd true def
} ifelse
} {
v type /dicttype eq {
v {
/dv exch def
/dk exch def
/cpddv cpdv dk get def
dv cpddv ne {
/upd true def
exit
} if
} forall
} {
/upd true def
} ifelse
} ifelse
} if
} ifelse
upd true eq {
d k v put
} if
} if
} if
} forall
d length 0 gt {
d setpagedevice
} if
} bd
/RE { % /NewFontName [NewEncodingArray] /FontName RE -
  findfont dup length dict begin
  {
    1 index /FID ne
    {def} {pop pop} ifelse
  } forall
  /Encoding exch def
  /FontName 1 index def
  currentdict definefont pop
  end
} bind def
%%EndResource
%%BeginResource: procset (Apache XML Graphics EPS ProcSet) 1.0 0
%%Version: 1.0 0
%%Copyright: (Copyright 2002-2003 The Apache Software Foundation. License terms: http://www.apache.org/licenses/LICENSE-2.0)
/BeginEPSF { %def
/b4_Inc_state save def         % Save state for cleanup
/dict_count countdictstack def % Count objects on dict stack
/op_count count 1 sub def      % Count objects on operand stack
userdict begin                 % Push userdict on dict stack
/showpage { } def              % Redefine showpage, { } = null proc
0 setgray 0 setlinecap         % Prepare graphics state
1 setlinewidth 0 setlinejoin
10 setmiterlimit [ ] 0 setdash newpath
/languagelevel where           % If level not equal to 1 then
{pop languagelevel             % set strokeadjust and
1 ne                           % overprint to their defaults.
{false setstrokeadjust false setoverprint
} if
} if
} bd
/EndEPSF { %def
count op_count sub {pop} repeat            % Clean up stacks
countdictstack dict_count sub {end} repeat
b4_Inc_state restore
} bd
%%EndResource
%FOPBeginFontDict
%%IncludeResource: font Courier-Oblique
%%IncludeResource: font Courier-BoldOblique
%%IncludeResource: font Courier-Bold
%%IncludeResource: font ZapfDingbats
%%IncludeResource: font Symbol
%%IncludeResource: font Helvetica
%%IncludeResource: font Helvetica-Oblique
%%IncludeResource: font Helvetica-Bold
%%IncludeResource: font Helvetica-BoldOblique
%%IncludeResource: font Times-Roman
%%IncludeResource: font Times-Italic
%%IncludeResource: font Times-Bold
%%IncludeResource: font Times-BoldItalic
%%IncludeResource: font Courier
%FOPEndFontDict
%%BeginResource: encoding WinAnsiEncoding
/WinAnsiEncoding [
/.notdef /.notdef /.notdef /.notdef /.notdef
/.notdef /.notdef /.notdef /.notdef /.notdef
/.notdef /.notdef /.notdef /.notdef /.notdef
/.notdef /.notdef /.notdef /.notdef /.notdef
/.notdef /.notdef /.notdef /.notdef /.notdef
/.notdef /.notdef /.notdef /.notdef /.notdef
/.notdef /.notdef /space /exclam /quotedbl
/numbersign /dollar /percent /ampersand /quotesingle
/parenleft /parenright /asterisk /plus /comma
/hyphen /period /slash /zero /one
/two /three /four /five /six
/seven /eight /nine /colon /semicolon
/less /equal /greater /question /at
/A /B /C /D /E
/F /G /H /I /J
/K /L /M /N /O
/P /Q /R /S /T
/U /V /W /X /Y
/Z /bracketleft /backslash /bracketright /asciicircum
/underscore /quoteleft /a /b /c
/d /e /f /g /h
/i /j /k /l /m
/n /o /p /q /r
/s /t /u /v /w
/x /y /z /braceleft /bar
/braceright /asciitilde /bullet /Euro /bullet
/quotesinglbase /florin /quotedblbase /ellipsis /dagger
/daggerdbl /circumflex /perthousand /Scaron /guilsinglleft
/OE /bullet /Zcaron /bullet /bullet
/quoteleft /quoteright /quotedblleft /quotedblright /bullet
/endash /emdash /asciitilde /trademark /scaron
/guilsinglright /oe /bullet /zcaron /Ydieresis
/space /exclamdown /cent /sterling /currency
/yen /brokenbar /section /dieresis /copyright
/ordfeminine /guillemotleft /logicalnot /sfthyphen /registered
/macron /degree /plusminus /twosuperior /threesuperior
/acute /mu /paragraph /middot /cedilla
/onesuperior /ordmasculine /guillemotright /onequarter /onehalf
/threequarters /questiondown /Agrave /Aacute /Acircumflex
/Atilde /Adieresis /Aring /AE /Ccedilla
/Egrave /Eacute /Ecircumflex /Edieresis /Igrave
/Iacute /Icircumflex /Idieresis /Eth /Ntilde
/Ograve /Oacute /Ocircumflex /Otilde /Odieresis
/multiply /Oslash /Ugrave /Uacute /Ucircumflex
/Udieresis /Yacute /Thorn /germandbls /agrave
/aacute /acircumflex /atilde /adieresis /aring
/ae /ccedilla /egrave /eacute /ecircumflex
/edieresis /igrave /iacute /icircumflex /idieresis
/eth /ntilde /ograve /oacute /ocircumflex
/otilde /odieresis /divide /oslash /ugrave
/uacute /ucircumflex /udieresis /yacute /thorn
/ydieresis
] def
%%EndResource
%FOPBeginFontReencode
/Courier-Oblique findfont
dup length dict begin
  {1 index /FID ne {def} {pop pop} ifelse} forall
  /Encoding WinAnsiEncoding def
  currentdict
end
/Courier-Oblique exch definefont pop
/Courier-BoldOblique findfont
dup length dict begin
  {1 index /FID ne {def} {pop pop} ifelse} forall
  /Encoding WinAnsiEncoding def
  currentdict
end
/Courier-BoldOblique exch definefont pop
/Courier-Bold findfont
dup length dict begin
  {1 index /FID ne {def} {pop pop} ifelse} forall
  /Encoding WinAnsiEncoding def
  currentdict
end
/Courier-Bold exch definefont pop
/Helvetica findfont
dup length dict begin
  {1 index /FID ne {def} {pop pop} ifelse} forall
  /Encoding WinAnsiEncoding def
  currentdict
end
/Helvetica exch definefont pop
/Helvetica-Oblique findfont
dup length dict begin
  {1 index /FID ne {def} {pop pop} ifelse} forall
  /Encoding WinAnsiEncoding def
  currentdict
end
/Helvetica-Oblique exch definefont pop
/Helvetica-Bold findfont
dup length dict begin
  {1 index /FID ne {def} {pop pop} ifelse} forall
  /Encoding WinAnsiEncoding def
  currentdict
end
/Helvetica-Bold exch definefont pop
/Helvetica-BoldOblique findfont
dup length dict begin
  {1 index /FID ne {def} {pop pop} ifelse} forall
  /Encoding WinAnsiEncoding def
  currentdict
end
/Helvetica-BoldOblique exch definefont pop
/Times-Roman findfont
dup length dict begin
  {1 index /FID ne {def} {pop pop} ifelse} forall
  /Encoding WinAnsiEncoding def
  currentdict
end
/Times-Roman exch definefont pop
/Times-Italic findfont
dup length dict begin
  {1 index /FID ne {def} {pop pop} ifelse} forall
  /Encoding WinAnsiEncoding def
  currentdict
end
/Times-Italic exch definefont pop
/Times-Bold findfont
dup length dict begin
  {1 index /FID ne {def} {pop pop} ifelse} forall
  /Encoding WinAnsiEncoding def
  currentdict
end
/Times-Bold exch definefont pop
/Times-BoldItalic findfont
dup length dict begin
  {1 index /FID ne {def} {pop pop} ifelse} forall
  /Encoding WinAnsiEncoding def
  currentdict
end
/Times-BoldItalic exch definefont pop
/Courier findfont
dup length dict begin
  {1 index /FID ne {def} {pop pop} ifelse} forall
  /Encoding WinAnsiEncoding def
  currentdict
end
/Courier exch definefont pop
%FOPEndFontReencode
%%EndProlog
%%Page: 1 1
%%PageBoundingBox: 0 0 428 338
%%BeginPageSetup
N
    9     2 M
  399     2 L
  399   337 L
    9   337 L
cp
clip
[1 0 0 -1 0 338] CT
%%EndPageSetup
GS
[0.75 0 0 0.75 0 0.5] CT
N
0 0 M
570 0 L
570 450 L
0 450 L
0 0 L
cp
clip
1 GC
N
0 0 570 450 re
f
GR
GS
[0.75 0 0 0.75 0 0.5] CT
1 GC
N
0 0 570 450 re
f
GR
GS
[0.75 0 0 0.75 0 0.5] CT
1 GC
N
74 390 M
516 390 L
516 38 L
74 38 L
cp
f
GR
GS
[0.75 0 0 0.75 0 0.5] CT
0.873 GC
1 LJ
0.667 LW
N
74 390 M
74 38 L
S
GR
GS
[0.75 0 0 0.75 0 0.5] CT
0.873 GC
1 LJ
0.667 LW
N
118.2 390 M
118.2 38 L
S
GR
GS
[0.75 0 0 0.75 0 0.5] CT
0.873 GC
1 LJ
0.667 LW
N
162.4 390 M
162.4 38 L
S
GR
GS
[0.75 0 0 0.75 0 0.5] CT
0.873 GC
1 LJ
0.667 LW
N
206.6 390 M
206.6 38 L
S
GR
GS
[0.75 0 0 0.75 0 0.5] CT
0.873 GC
1 LJ
0.667 LW
N
250.8 390 M
250.8 38 L
S
GR
GS
[0.75 0 0 0.75 0 0.5] CT
0.873 GC
1 LJ
0.667 LW
N
295 390 M
295 38 L
S
GR
GS
[0.75 0 0 0.75 0 0.5] CT
0.873 GC
1 LJ
0.667 LW
N
339.2 390 M
339.2 38 L
S
GR
GS
[0.75 0 0 0.75 0 0.5] CT
0.873 GC
1 LJ
0.667 LW
N
383.4 390 M
383.4 38 L
S
GR
GS
[0.75 0 0 0.75 0 0.5] CT
0.873 GC
1 LJ
0.667 LW
N
427.6 390 M
427.6 38 L
S
GR
GS
[0.75 0 0 0.75 0 0.5] CT
0.873 GC
1 LJ
0.667 LW
N
471.8 390 M
471.8 38 L
S
GR
GS
[0.75 0 0 0.75 0 0.5] CT
0.873 GC
1 LJ
0.667 LW
N
516 390 M
516 38 L
S
GR
GS
[0.75 0 0 0.75 0 0.5] CT
0.873 GC
1 LJ
0.667 LW
N
516 390 M
74 390 L
S
GR
GS
[0.75 0 0 0.75 0 0.5] CT
0.873 GC
1 LJ
0.667 LW
N
516 346 M
74 346 L
S
GR
GS
[0.75 0 0 0.75 0 0.5] CT
0.873 GC
1 LJ
0.667 LW
N
516 302 M
74 302 L
S
GR
GS
[0.75 0 0 0.75 0 0.5] CT
0.873 GC
1 LJ
0.667 LW
N
516 258 M
74 258 L
S
GR
GS
[0.75 0 0 0.75 0 0.5] CT
0.873 GC
1 LJ
0.667 LW
N
516 214 M
74 214 L
S
GR
GS
[0.75 0 0 0.75 0 0.5] CT
0.873 GC
1 LJ
0.667 LW
N
516 170 M
74 170 L
S
GR
GS
[0.75 0 0 0.75 0 0.5] CT
0.873 GC
1 LJ
0.667 LW
N
516 126 M
74 126 L
S
GR
GS
[0.75 0 0 0.75 0 0.5] CT
0.873 GC
1 LJ
0.667 LW
N
516 82 M
74 82 L
S
GR
GS
[0.75 0 0 0.75 0 0.5] CT
0.873 GC
1 LJ
0.667 LW
N
516 38 M
74 38 L
S
GR
GS
[0.75 0 0 0.75 0 0.5] CT
0.149 GC
2 setlinecap
1 LJ
0.667 LW
N
74 390 M
516 390 L
S
GR
GS
[0.75 0 0 0.75 0 0.5] CT
0.149 GC
2 setlinecap
1 LJ
0.667 LW
N
74 390 M
74 385.58 L
S
GR
GS
[0.75 0 0 0.75 0 0.5] CT
0.149 GC
2 setlinecap
1 LJ
0.667 LW
N
118.2 390 M
118.2 385.58 L
S
GR
GS
[0.75 0 0 0.75 0 0.5] CT
0.149 GC
2 setlinecap
1 LJ
0.667 LW
N
162.4 390 M
162.4 385.58 L
S
GR
GS
[0.75 0 0 0.75 0 0.5] CT
0.149 GC
2 setlinecap
1 LJ
0.667 LW
N
206.6 390 M
206.6 385.58 L
S
GR
GS
[0.75 0 0 0.75 0 0.5] CT
0.149 GC
2 setlinecap
1 LJ
0.667 LW
N
250.8 390 M
250.8 385.58 L
S
GR
GS
[0.75 0 0 0.75 0 0.5] CT
0.149 GC
2 setlinecap
1 LJ
0.667 LW
N
295 390 M
295 385.58 L
S
GR
GS
[0.75 0 0 0.75 0 0.5] CT
0.149 GC
2 setlinecap
1 LJ
0.667 LW
N
339.2 390 M
339.2 385.58 L
S
GR
GS
[0.75 0 0 0.75 0 0.5] CT
0.149 GC
2 setlinecap
1 LJ
0.667 LW
N
383.4 390 M
383.4 385.58 L
S
GR
GS
[0.75 0 0 0.75 0 0.5] CT
0.149 GC
2 setlinecap
1 LJ
0.667 LW
N
427.6 390 M
427.6 385.58 L
S
GR
GS
[0.75 0 0 0.75 0 0.5] CT
0.149 GC
2 setlinecap
1 LJ
0.667 LW
N
471.8 390 M
471.8 385.58 L
S
GR
GS
[0.75 0 0 0.75 0 0.5] CT
0.149 GC
2 setlinecap
1 LJ
0.667 LW
N
516 390 M
516 385.58 L
S
GR
GS
[0.75 0 0 0.75 55.5 296.99998] CT
0.149 GC
/Helvetica 13.333 F
GS
[1 0 0 1 0 0] CT
-4 15 moveto 
1 -1 scale
(0) t 
GR
GR
GS
[0.75 0 0 0.75 88.65 296.99998] CT
0.149 GC
/Helvetica 13.333 F
GS
[1 0 0 1 0 0] CT
-9.5 15 moveto 
1 -1 scale
(0.5) t 
GR
GR
GS
[0.75 0 0 0.75 121.8 296.99998] CT
0.149 GC
/Helvetica 13.333 F
GS
[1 0 0 1 0 0] CT
-4 15 moveto 
1 -1 scale
(1) t 
GR
GR
GS
[0.75 0 0 0.75 154.95 296.99998] CT
0.149 GC
/Helvetica 13.333 F
GS
[1 0 0 1 0 0] CT
-9.5 15 moveto 
1 -1 scale
(1.5) t 
GR
GR
GS
[0.75 0 0 0.75 188.1 296.99998] CT
0.149 GC
/Helvetica 13.333 F
GS
[1 0 0 1 0 0] CT
-4 15 moveto 
1 -1 scale
(2) t 
GR
GR
GS
[0.75 0 0 0.75 221.25 296.99998] CT
0.149 GC
/Helvetica 13.333 F
GS
[1 0 0 1 0 0] CT
-9.5 15 moveto 
1 -1 scale
(2.5) t 
GR
GR
GS
[0.75 0 0 0.75 254.40001 296.99998] CT
0.149 GC
/Helvetica 13.333 F
GS
[1 0 0 1 0 0] CT
-4 15 moveto 
1 -1 scale
(3) t 
GR
GR
GS
[0.75 0 0 0.75 287.55 296.99998] CT
0.149 GC
/Helvetica 13.333 F
GS
[1 0 0 1 0 0] CT
-9.5 15 moveto 
1 -1 scale
(3.5) t 
GR
GR
GS
[0.75 0 0 0.75 320.7 296.99998] CT
0.149 GC
/Helvetica 13.333 F
GS
[1 0 0 1 0 0] CT
-4 15 moveto 
1 -1 scale
(4) t 
GR
GR
GS
[0.75 0 0 0.75 353.84999 296.99998] CT
0.149 GC
/Helvetica 13.333 F
GS
[1 0 0 1 0 0] CT
-9.5 15 moveto 
1 -1 scale
(4.5) t 
GR
GR
GS
[0.75 0 0 0.75 387 296.99998] CT
0.149 GC
/Helvetica 13.333 F
GS
[1 0 0 1 0 0] CT
-4 15 moveto 
1 -1 scale
(5) t 
GR
GR
GS
[0.75 0 0 0.75 221.25016 311.49999] CT
0.149 GC
N
-43.282 22.296 M
-43.282 21.859 -43.188 21.484 QT
-41.095 13.156 L
-44.142 13.156 L
-44.438 13.156 -44.438 12.781 QT
-44.329 12.14 -44.063 12.14 QT
-40.845 12.14 L
-39.688 7.406 L
-39.563 7.031 -39.227 6.757 QT
-38.892 6.484 -38.47 6.484 QT
-38.095 6.484 -37.845 6.702 QT
-37.595 6.921 -37.595 7.296 QT
-37.595 7.374 -37.602 7.429 QT
-37.61 7.484 -37.626 7.531 QT
-38.798 12.14 L
-35.798 12.14 L
-35.501 12.14 -35.501 12.515 QT
-35.517 12.593 -35.563 12.765 QT
-35.61 12.937 -35.681 13.046 QT
-35.751 13.156 -35.892 13.156 QT
-39.048 13.156 L
-41.126 21.546 L
-41.345 22.359 -41.345 22.952 QT
-41.345 24.202 -40.485 24.202 QT
-39.22 24.202 -38.235 23.007 QT
-37.251 21.812 -36.72 20.374 QT
-36.61 20.202 -36.501 20.202 QT
-36.142 20.202 L
-36.032 20.202 -35.962 20.281 QT
-35.892 20.359 -35.892 20.468 QT
-35.892 20.515 -35.923 20.546 QT
-36.548 22.296 -37.767 23.632 QT
-38.985 24.968 -40.563 24.968 QT
-41.704 24.968 -42.493 24.218 QT
-43.282 23.468 -43.282 22.296 QT
cp
f
GR
GS
[0.75 0 0 0.75 221.25016 311.49999] CT
0.149 GC
N
-32.221 22.562 M
-32.221 22.015 -31.986 21.421 QT
-29.643 15.187 L
-29.268 14.124 -29.268 13.437 QT
-29.268 12.577 -29.893 12.577 QT
-31.049 12.577 -31.791 13.757 QT
-32.533 14.937 -32.893 16.406 QT
-32.94 16.577 -33.127 16.577 QT
-33.471 16.577 L
-33.705 16.577 -33.705 16.312 QT
-33.705 16.234 L
-33.236 14.499 -32.276 13.163 QT
-31.315 11.827 -29.846 11.827 QT
-28.815 11.827 -28.096 12.507 QT
-27.377 13.187 -27.377 14.234 QT
-27.377 14.765 -27.611 15.359 QT
-29.971 21.593 L
-30.361 22.562 -30.361 23.343 QT
-30.361 24.202 -29.705 24.202 QT
-28.565 24.202 -27.807 22.991 QT
-27.049 21.781 -26.736 20.374 QT
-26.69 20.202 -26.518 20.202 QT
-26.158 20.202 L
-26.049 20.202 -25.979 20.281 QT
-25.908 20.359 -25.908 20.468 QT
-25.908 20.484 -25.94 20.546 QT
-26.33 22.187 -27.315 23.577 QT
-28.299 24.968 -29.752 24.968 QT
-30.783 24.968 -31.502 24.265 QT
-32.221 23.562 -32.221 22.562 QT
cp
-28.955 7.062 M
-28.955 6.452 -28.44 5.96 QT
-27.924 5.468 -27.315 5.468 QT
-26.83 5.468 -26.51 5.773 QT
-26.19 6.077 -26.19 6.546 QT
-26.19 7.187 -26.705 7.679 QT
-27.221 8.171 -27.846 8.171 QT
-28.315 8.171 -28.635 7.851 QT
-28.955 7.531 -28.955 7.062 QT
cp
f
GR
GS
[0.75 0 0 0.75 221.25016 311.49999] CT
0.149 GC
N
-22.146 24.14 M
-22.146 23.968 -22.115 23.89 QT
-19.943 15.234 L
-19.74 14.437 -19.74 13.827 QT
-19.74 12.577 -20.584 12.577 QT
-21.49 12.577 -21.928 13.663 QT
-22.365 14.749 -22.787 16.406 QT
-22.787 16.484 -22.865 16.531 QT
-22.943 16.577 -23.021 16.577 QT
-23.365 16.577 L
-23.459 16.577 -23.529 16.476 QT
-23.599 16.374 -23.599 16.281 QT
-23.287 15.031 -22.998 14.148 QT
-22.709 13.265 -22.092 12.546 QT
-21.474 11.827 -20.553 11.827 QT
-19.474 11.827 -18.639 12.515 QT
-17.803 13.202 -17.803 14.265 QT
-16.928 13.124 -15.771 12.476 QT
-14.615 11.827 -13.303 11.827 QT
-11.928 11.827 -10.935 12.531 QT
-9.943 13.234 -9.943 14.515 QT
-9.053 13.249 -7.849 12.538 QT
-6.646 11.827 -5.24 11.827 QT
-3.74 11.827 -2.826 12.64 QT
-1.912 13.452 -1.912 14.952 QT
-1.912 16.14 -2.443 17.827 QT
-2.974 19.515 -3.756 21.593 QT
-4.178 22.593 -4.178 23.343 QT
-4.178 24.202 -3.49 24.202 QT
-2.365 24.202 -1.615 22.984 QT
-0.865 21.765 -0.553 20.374 QT
-0.459 20.202 -0.303 20.202 QT
0.026 20.202 L
0.151 20.202 0.229 20.281 QT
0.307 20.359 0.307 20.468 QT
0.307 20.484 0.276 20.546 QT
-0.131 22.187 -1.115 23.577 QT
-2.099 24.968 -3.568 24.968 QT
-4.584 24.968 -5.303 24.265 QT
-6.021 23.562 -6.021 22.562 QT
-6.021 22.046 -5.787 21.421 QT
-4.974 19.249 -4.428 17.531 QT
-3.881 15.812 -3.881 14.515 QT
-3.881 13.702 -4.201 13.14 QT
-4.521 12.577 -5.287 12.577 QT
-6.881 12.577 -8.037 13.546 QT
-9.193 14.515 -10.053 16.109 QT
-10.099 16.406 -10.131 16.562 QT
-12.006 23.999 L
-12.099 24.406 -12.451 24.687 QT
-12.803 24.968 -13.224 24.968 QT
-13.568 24.968 -13.826 24.741 QT
-14.084 24.515 -14.084 24.14 QT
-14.084 23.968 -14.053 23.89 QT
-12.209 16.499 L
-11.912 15.312 -11.912 14.515 QT
-11.912 13.702 -12.24 13.14 QT
-12.568 12.577 -13.365 12.577 QT
-14.428 12.577 -15.318 13.046 QT
-16.209 13.515 -16.873 14.281 QT
-17.537 15.046 -18.099 16.109 QT
-20.068 23.999 L
-20.162 24.406 -20.506 24.687 QT
-20.849 24.968 -21.287 24.968 QT
-21.631 24.968 -21.889 24.741 QT
-22.146 24.515 -22.146 24.14 QT
cp
f
GR
GS
[0.75 0 0 0.75 221.25016 311.49999] CT
0.149 GC
N
7.202 24.968 M
5.827 24.968 4.781 24.241 QT
3.734 23.515 3.195 22.296 QT
2.656 21.077 2.656 19.718 QT
2.656 17.64 3.695 15.82 QT
4.734 13.999 6.515 12.913 QT
8.296 11.827 10.343 11.827 QT
11.577 11.827 12.507 12.468 QT
13.437 13.109 13.437 14.312 QT
13.437 15.984 12.109 16.796 QT
10.781 17.609 9.109 17.804 QT
7.437 17.999 5.406 17.999 QT
5.327 17.999 L
4.859 19.734 4.859 20.952 QT
4.859 22.249 5.452 23.226 QT
6.046 24.202 7.265 24.202 QT
8.999 24.202 10.585 23.406 QT
12.171 22.609 13.187 21.218 QT
13.265 21.124 13.406 21.124 QT
13.546 21.124 13.695 21.288 QT
13.843 21.452 13.843 21.593 QT
13.843 21.702 13.796 21.765 QT
12.734 23.249 10.937 24.109 QT
9.14 24.968 7.202 24.968 QT
cp
5.499 17.249 M
7.187 17.249 8.617 17.093 QT
10.046 16.937 11.202 16.304 QT
12.359 15.671 12.359 14.343 QT
12.359 13.812 12.062 13.406 QT
11.765 12.999 11.288 12.788 QT
10.812 12.577 10.312 12.577 QT
9.077 12.577 8.093 13.241 QT
7.109 13.906 6.468 14.976 QT
5.827 16.046 5.499 17.249 QT
cp
f
GR
GS
[0.75 0 0 0.75 221.25016 311.49999] CT
0.149 GC
N
18.455 31.89 M
18.455 2.89 L
22.423 2.89 L
22.423 4.046 L
19.626 4.046 L
19.626 30.734 L
22.423 30.734 L
22.423 31.89 L
18.455 31.89 L
cp
f
GR
GS
[0.75 0 0 0.75 221.25016 311.49999] CT
0.149 GC
N
25.697 22.874 M
26.478 24.202 28.837 24.202 QT
29.853 24.202 30.775 23.851 QT
31.697 23.499 32.298 22.812 QT
32.9 22.124 32.9 21.124 QT
32.9 20.374 32.361 19.898 QT
31.822 19.421 31.04 19.249 QT
29.462 18.937 L
28.4 18.671 27.704 17.929 QT
27.009 17.187 27.009 16.14 QT
27.009 14.859 27.704 13.866 QT
28.4 12.874 29.548 12.351 QT
30.697 11.827 31.931 11.827 QT
33.243 11.827 34.29 12.452 QT
35.337 13.077 35.337 14.312 QT
35.337 14.984 34.962 15.491 QT
34.587 15.999 33.915 15.999 QT
33.525 15.999 33.251 15.749 QT
32.978 15.499 32.978 15.124 QT
32.978 14.781 33.173 14.46 QT
33.368 14.14 33.681 13.952 QT
33.993 13.765 34.337 13.765 QT
34.087 13.14 33.384 12.859 QT
32.681 12.577 31.868 12.577 QT
31.134 12.577 30.4 12.874 QT
29.665 13.171 29.22 13.741 QT
28.775 14.312 28.775 15.093 QT
28.775 15.624 29.142 16.015 QT
29.509 16.406 30.056 16.577 QT
31.728 16.921 L
32.54 17.093 33.212 17.523 QT
33.884 17.952 34.275 18.616 QT
34.665 19.281 34.665 20.124 QT
34.665 21.202 34.064 22.249 QT
33.462 23.296 32.587 23.921 QT
31.04 24.968 28.806 24.968 QT
27.259 24.968 25.97 24.257 QT
24.681 23.546 24.681 22.14 QT
24.681 21.359 25.142 20.773 QT
25.603 20.187 26.4 20.187 QT
26.868 20.187 27.181 20.468 QT
27.493 20.749 27.493 21.218 QT
27.493 21.874 27.001 22.374 QT
26.509 22.874 25.837 22.874 QT
25.697 22.874 L
cp
f
GR
GS
[0.75 0 0 0.75 221.25016 311.49999] CT
0.149 GC
N
37.572 31.89 M
37.572 30.734 L
40.384 30.734 L
40.384 4.046 L
37.572 4.046 L
37.572 2.89 L
41.54 2.89 L
41.54 31.89 L
37.572 31.89 L
cp
f
GR
GS
[0.75 0 0 0.75 0 0.5] CT
0.149 GC
2 setlinecap
1 LJ
0.667 LW
N
74 390 M
74 38 L
S
GR
GS
[0.75 0 0 0.75 0 0.5] CT
0.149 GC
2 setlinecap
1 LJ
0.667 LW
N
74 390 M
78.42 390 L
S
GR
GS
[0.75 0 0 0.75 0 0.5] CT
0.149 GC
2 setlinecap
1 LJ
0.667 LW
N
74 346 M
78.42 346 L
S
GR
GS
[0.75 0 0 0.75 0 0.5] CT
0.149 GC
2 setlinecap
1 LJ
0.667 LW
N
74 302 M
78.42 302 L
S
GR
GS
[0.75 0 0 0.75 0 0.5] CT
0.149 GC
2 setlinecap
1 LJ
0.667 LW
N
74 258 M
78.42 258 L
S
GR
GS
[0.75 0 0 0.75 0 0.5] CT
0.149 GC
2 setlinecap
1 LJ
0.667 LW
N
74 214 M
78.42 214 L
S
GR
GS
[0.75 0 0 0.75 0 0.5] CT
0.149 GC
2 setlinecap
1 LJ
0.667 LW
N
74 170 M
78.42 170 L
S
GR
GS
[0.75 0 0 0.75 0 0.5] CT
0.149 GC
2 setlinecap
1 LJ
0.667 LW
N
74 126 M
78.42 126 L
S
GR
GS
[0.75 0 0 0.75 0 0.5] CT
0.149 GC
2 setlinecap
1 LJ
0.667 LW
N
74 82 M
78.42 82 L
S
GR
GS
[0.75 0 0 0.75 0 0.5] CT
0.149 GC
2 setlinecap
1 LJ
0.667 LW
N
74 38 M
78.42 38 L
S
GR
GS
[0.75 0 0 0.75 51.5 293] CT
0.149 GC
/Helvetica 13.333 F
GS
[1 0 0 1 0 0] CT
-20 5.5 moveto 
1 -1 scale
(-20) t 
GR
GR
GS
[0.75 0 0 0.75 51.5 260] CT
0.149 GC
/Helvetica 13.333 F
GS
[1 0 0 1 0 0] CT
-20 5.5 moveto 
1 -1 scale
(-15) t 
GR
GR
GS
[0.75 0 0 0.75 51.5 227] CT
0.149 GC
/Helvetica 13.333 F
GS
[1 0 0 1 0 0] CT
-20 5.5 moveto 
1 -1 scale
(-10) t 
GR
GR
GS
[0.75 0 0 0.75 51.5 194] CT
0.149 GC
/Helvetica 13.333 F
GS
[1 0 0 1 0 0] CT
-12 5.5 moveto 
1 -1 scale
(-5) t 
GR
GR
GS
[0.75 0 0 0.75 51.5 161] CT
0.149 GC
/Helvetica 13.333 F
GS
[1 0 0 1 0 0] CT
-8 5.5 moveto 
1 -1 scale
(0) t 
GR
GR
GS
[0.75 0 0 0.75 51.5 128] CT
0.149 GC
/Helvetica 13.333 F
GS
[1 0 0 1 0 0] CT
-8 5.5 moveto 
1 -1 scale
(5) t 
GR
GR
GS
[0.75 0 0 0.75 51.5 95] CT
0.149 GC
/Helvetica 13.333 F
GS
[1 0 0 1 0 0] CT
-16 5.5 moveto 
1 -1 scale
(10) t 
GR
GR
GS
[0.75 0 0 0.75 51.5 62] CT
0.149 GC
/Helvetica 13.333 F
GS
[1 0 0 1 0 0] CT
-16 5.5 moveto 
1 -1 scale
(15) t 
GR
GR
GS
[0.75 0 0 0.75 51.5 29] CT
0.149 GC
/Helvetica 13.333 F
GS
[1 0 0 1 0 0] CT
-16 5.5 moveto 
1 -1 scale
(20) t 
GR
GR
GS
[0 -0.75 0.75 0 33.5 160.99987] CT
0.149 GC
N
-41.435 -28.357 M
-41.435 -28.998 -40.95 -29.482 QT
-40.466 -29.966 -39.841 -29.966 QT
-39.435 -29.966 -39.052 -29.748 QT
-38.669 -29.529 -38.458 -29.146 QT
-38.247 -28.763 -38.247 -28.357 QT
-38.247 -27.732 -38.716 -27.255 QT
-39.185 -26.779 -39.841 -26.779 QT
-40.466 -26.779 -40.95 -27.255 QT
-41.435 -27.732 -41.435 -28.357 QT
cp
f
GR
GS
[0 -0.75 0.75 0 33.5 160.99987] CT
0.149 GC
N
-46.218 -11.06 M
-46.218 -11.232 -46.186 -11.31 QT
-44.015 -19.966 L
-43.811 -20.763 -43.811 -21.373 QT
-43.811 -22.623 -44.655 -22.623 QT
-45.561 -22.623 -45.999 -21.537 QT
-46.436 -20.451 -46.858 -18.794 QT
-46.858 -18.716 -46.936 -18.669 QT
-47.015 -18.623 -47.093 -18.623 QT
-47.436 -18.623 L
-47.53 -18.623 -47.6 -18.724 QT
-47.671 -18.826 -47.671 -18.919 QT
-47.358 -20.169 -47.069 -21.052 QT
-46.78 -21.935 -46.163 -22.654 QT
-45.546 -23.373 -44.624 -23.373 QT
-43.624 -23.373 -42.866 -22.794 QT
-42.108 -22.216 -41.921 -21.263 QT
-41.186 -22.232 -40.249 -22.802 QT
-39.311 -23.373 -38.186 -23.373 QT
-37.265 -23.373 -36.561 -22.834 QT
-35.858 -22.294 -35.858 -21.373 QT
-35.858 -20.638 -36.319 -20.091 QT
-36.78 -19.544 -37.546 -19.544 QT
-38.015 -19.544 -38.335 -19.841 QT
-38.655 -20.138 -38.655 -20.607 QT
-38.655 -21.232 -38.186 -21.74 QT
-37.718 -22.248 -37.108 -22.248 QT
-37.577 -22.623 -38.249 -22.623 QT
-39.483 -22.623 -40.405 -21.74 QT
-41.327 -20.857 -42.061 -19.498 QT
-44.14 -11.201 L
-44.233 -10.794 -44.577 -10.513 QT
-44.921 -10.232 -45.358 -10.232 QT
-45.702 -10.232 -45.96 -10.459 QT
-46.218 -10.685 -46.218 -11.06 QT
cp
f
GR
GS
[0 -0.75 0.75 0 33.5 160.99987] CT
0.149 GC
N
-33.577 -6.77 M
-33.202 -6.473 -32.531 -6.473 QT
-31.874 -6.473 -31.374 -7.105 QT
-30.874 -7.738 -30.687 -8.488 QT
-29.734 -12.207 L
-29.499 -13.223 -29.499 -13.598 QT
-29.499 -14.113 -29.796 -14.504 QT
-30.093 -14.895 -30.609 -14.895 QT
-31.281 -14.895 -31.867 -14.48 QT
-32.452 -14.066 -32.851 -13.426 QT
-33.249 -12.785 -33.406 -12.129 QT
-33.452 -11.988 -33.577 -11.988 QT
-33.827 -11.988 L
-33.999 -11.988 -33.999 -12.191 QT
-33.999 -12.254 L
-33.796 -13.035 -33.304 -13.777 QT
-32.812 -14.52 -32.101 -14.98 QT
-31.39 -15.441 -30.577 -15.441 QT
-29.796 -15.441 -29.179 -15.027 QT
-28.562 -14.613 -28.312 -13.91 QT
-27.952 -14.551 -27.39 -14.996 QT
-26.827 -15.441 -26.171 -15.441 QT
-25.718 -15.441 -25.242 -15.285 QT
-24.765 -15.129 -24.468 -14.801 QT
-24.171 -14.473 -24.171 -13.973 QT
-24.171 -13.441 -24.515 -13.059 QT
-24.859 -12.676 -25.39 -12.676 QT
-25.734 -12.676 -25.96 -12.887 QT
-26.187 -13.098 -26.187 -13.426 QT
-26.187 -13.879 -25.882 -14.207 QT
-25.577 -14.535 -25.156 -14.598 QT
-25.531 -14.895 -26.202 -14.895 QT
-26.874 -14.895 -27.374 -14.27 QT
-27.874 -13.645 -28.077 -12.879 QT
-28.999 -9.16 L
-29.234 -8.316 -29.234 -7.785 QT
-29.234 -7.254 -28.929 -6.863 QT
-28.624 -6.473 -28.124 -6.473 QT
-27.14 -6.473 -26.367 -7.34 QT
-25.593 -8.207 -25.343 -9.254 QT
-25.296 -9.363 -25.187 -9.363 QT
-24.921 -9.363 L
-24.843 -9.363 -24.788 -9.309 QT
-24.734 -9.254 -24.734 -9.191 QT
-24.734 -9.16 -24.765 -9.129 QT
-25.062 -7.879 -26.015 -6.902 QT
-26.968 -5.926 -28.156 -5.926 QT
-28.937 -5.926 -29.554 -6.34 QT
-30.171 -6.754 -30.437 -7.457 QT
-30.765 -6.848 -31.343 -6.387 QT
-31.921 -5.926 -32.577 -5.926 QT
-33.031 -5.926 -33.507 -6.082 QT
-33.984 -6.238 -34.281 -6.566 QT
-34.577 -6.895 -34.577 -7.395 QT
-34.577 -7.895 -34.234 -8.301 QT
-33.89 -8.707 -33.374 -8.707 QT
-33.031 -8.707 -32.788 -8.496 QT
-32.546 -8.285 -32.546 -7.941 QT
-32.546 -7.504 -32.843 -7.176 QT
-33.14 -6.848 -33.577 -6.77 QT
cp
f
GR
GS
[0 -0.75 0.75 0 33.5 160.99987] CT
0.149 GC
N
-18.594 -3.31 M
-18.594 -32.31 L
-14.625 -32.31 L
-14.625 -31.154 L
-17.422 -31.154 L
-17.422 -4.466 L
-14.625 -4.466 L
-14.625 -3.31 L
-18.594 -3.31 L
cp
f
GR
GS
[0 -0.75 0.75 0 33.5 160.99987] CT
0.149 GC
N
-11.634 -11.06 M
-11.634 -11.232 -11.602 -11.31 QT
-9.43 -19.966 L
-9.227 -20.763 -9.227 -21.373 QT
-9.227 -22.623 -10.071 -22.623 QT
-10.977 -22.623 -11.415 -21.537 QT
-11.852 -20.451 -12.274 -18.794 QT
-12.274 -18.716 -12.352 -18.669 QT
-12.43 -18.623 -12.509 -18.623 QT
-12.852 -18.623 L
-12.946 -18.623 -13.016 -18.724 QT
-13.087 -18.826 -13.087 -18.919 QT
-12.774 -20.169 -12.485 -21.052 QT
-12.196 -21.935 -11.579 -22.654 QT
-10.962 -23.373 -10.04 -23.373 QT
-8.962 -23.373 -8.126 -22.685 QT
-7.29 -21.998 -7.29 -20.935 QT
-6.415 -22.076 -5.259 -22.724 QT
-4.102 -23.373 -2.79 -23.373 QT
-1.415 -23.373 -0.423 -22.669 QT
0.57 -21.966 0.57 -20.685 QT
1.46 -21.951 2.663 -22.662 QT
3.866 -23.373 5.273 -23.373 QT
6.773 -23.373 7.687 -22.56 QT
8.601 -21.748 8.601 -20.248 QT
8.601 -19.06 8.07 -17.373 QT
7.538 -15.685 6.757 -13.607 QT
6.335 -12.607 6.335 -11.857 QT
6.335 -10.998 7.023 -10.998 QT
8.148 -10.998 8.898 -12.216 QT
9.648 -13.435 9.96 -14.826 QT
10.054 -14.998 10.21 -14.998 QT
10.538 -14.998 L
10.663 -14.998 10.741 -14.919 QT
10.82 -14.841 10.82 -14.732 QT
10.82 -14.716 10.788 -14.654 QT
10.382 -13.013 9.398 -11.623 QT
8.413 -10.232 6.945 -10.232 QT
5.929 -10.232 5.21 -10.935 QT
4.491 -11.638 4.491 -12.638 QT
4.491 -13.154 4.726 -13.779 QT
5.538 -15.951 6.085 -17.669 QT
6.632 -19.388 6.632 -20.685 QT
6.632 -21.498 6.312 -22.06 QT
5.991 -22.623 5.226 -22.623 QT
3.632 -22.623 2.476 -21.654 QT
1.32 -20.685 0.46 -19.091 QT
0.413 -18.794 0.382 -18.638 QT
-1.493 -11.201 L
-1.587 -10.794 -1.938 -10.513 QT
-2.29 -10.232 -2.712 -10.232 QT
-3.055 -10.232 -3.313 -10.459 QT
-3.571 -10.685 -3.571 -11.06 QT
-3.571 -11.232 -3.54 -11.31 QT
-1.696 -18.701 L
-1.399 -19.888 -1.399 -20.685 QT
-1.399 -21.498 -1.727 -22.06 QT
-2.055 -22.623 -2.852 -22.623 QT
-3.915 -22.623 -4.805 -22.154 QT
-5.696 -21.685 -6.36 -20.919 QT
-7.024 -20.154 -7.587 -19.091 QT
-9.555 -11.201 L
-9.649 -10.794 -9.993 -10.513 QT
-10.337 -10.232 -10.774 -10.232 QT
-11.118 -10.232 -11.376 -10.459 QT
-11.634 -10.685 -11.634 -11.06 QT
cp
f
GR
GS
[0 -0.75 0.75 0 33.5 160.99987] CT
0.149 GC
N
13.512 -3.888 M
13.512 -3.982 13.543 -3.998 QT
23.622 -31.951 L
23.684 -32.123 23.825 -32.216 QT
23.965 -32.31 24.153 -32.31 QT
24.403 -32.31 24.567 -32.154 QT
24.731 -31.998 24.731 -31.732 QT
24.731 -31.623 L
14.653 -3.669 L
14.481 -3.31 14.09 -3.31 QT
13.856 -3.31 13.684 -3.482 QT
13.512 -3.654 13.512 -3.888 QT
cp
f
GR
GS
[0 -0.75 0.75 0 33.5 160.99987] CT
0.149 GC
N
29.07 -12.326 M
29.851 -10.998 32.21 -10.998 QT
33.226 -10.998 34.148 -11.349 QT
35.07 -11.701 35.671 -12.388 QT
36.273 -13.076 36.273 -14.076 QT
36.273 -14.826 35.734 -15.302 QT
35.195 -15.779 34.413 -15.951 QT
32.835 -16.263 L
31.773 -16.529 31.077 -17.271 QT
30.382 -18.013 30.382 -19.06 QT
30.382 -20.341 31.077 -21.334 QT
31.773 -22.326 32.921 -22.849 QT
34.07 -23.373 35.304 -23.373 QT
36.616 -23.373 37.663 -22.748 QT
38.71 -22.123 38.71 -20.888 QT
38.71 -20.216 38.335 -19.709 QT
37.96 -19.201 37.288 -19.201 QT
36.898 -19.201 36.624 -19.451 QT
36.351 -19.701 36.351 -20.076 QT
36.351 -20.419 36.546 -20.74 QT
36.741 -21.06 37.054 -21.248 QT
37.366 -21.435 37.71 -21.435 QT
37.46 -22.06 36.757 -22.341 QT
36.054 -22.623 35.241 -22.623 QT
34.507 -22.623 33.773 -22.326 QT
33.038 -22.029 32.593 -21.459 QT
32.148 -20.888 32.148 -20.107 QT
32.148 -19.576 32.515 -19.185 QT
32.882 -18.794 33.429 -18.623 QT
35.101 -18.279 L
35.913 -18.107 36.585 -17.677 QT
37.257 -17.248 37.648 -16.584 QT
38.038 -15.919 38.038 -15.076 QT
38.038 -13.998 37.437 -12.951 QT
36.835 -11.904 35.96 -11.279 QT
34.413 -10.232 32.179 -10.232 QT
30.632 -10.232 29.343 -10.943 QT
28.054 -11.654 28.054 -13.06 QT
28.054 -13.841 28.515 -14.427 QT
28.976 -15.013 29.773 -15.013 QT
30.241 -15.013 30.554 -14.732 QT
30.866 -14.451 30.866 -13.982 QT
30.866 -13.326 30.374 -12.826 QT
29.882 -12.326 29.21 -12.326 QT
29.07 -12.326 L
cp
f
GR
GS
[0 -0.75 0.75 0 33.5 160.99987] CT
0.149 GC
N
40.945 -3.31 M
40.945 -4.466 L
43.757 -4.466 L
43.757 -31.154 L
40.945 -31.154 L
40.945 -32.31 L
44.913 -32.31 L
44.913 -3.31 L
40.945 -3.31 L
cp
f
GR
GS
[0.75 0 0 0.75 221.25021 25.22857] CT
N
-109.209 -9.6 M
-109.209 -10.553 L
-106.428 -10.553 -106.428 -11.413 QT
-106.428 -26.241 L
-106.428 -27.1 -109.209 -27.1 QT
-109.209 -28.038 L
-101.131 -28.038 L
-101.131 -27.1 L
-103.912 -27.1 -103.912 -26.241 QT
-103.912 -19.678 L
-95.944 -19.678 L
-95.944 -26.241 L
-95.944 -27.1 -98.725 -27.1 QT
-98.725 -28.038 L
-90.662 -28.038 L
-90.662 -27.1 L
-93.428 -27.1 -93.428 -26.241 QT
-93.428 -11.413 L
-93.428 -10.553 -90.662 -10.553 QT
-90.662 -9.6 L
-98.725 -9.6 L
-98.725 -10.553 L
-95.944 -10.553 -95.944 -11.413 QT
-95.944 -18.725 L
-103.912 -18.725 L
-103.912 -11.413 L
-103.912 -10.553 -101.131 -10.553 QT
-101.131 -9.6 L
-109.209 -9.6 L
cp
f
GR
GS
[0.75 0 0 0.75 221.25021 25.22857] CT
N
-83.287 -9.303 M
-84.912 -9.303 -86.295 -10.124 QT
-87.678 -10.944 -88.483 -12.327 QT
-89.287 -13.709 -89.287 -15.35 QT
-89.287 -16.584 -88.842 -17.733 QT
-88.397 -18.881 -87.576 -19.788 QT
-86.756 -20.694 -85.662 -21.202 QT
-84.568 -21.709 -83.287 -21.709 QT
-81.631 -21.709 -80.264 -20.827 QT
-78.897 -19.944 -78.108 -18.475 QT
-77.318 -17.006 -77.318 -15.35 QT
-77.318 -13.725 -78.123 -12.334 QT
-78.928 -10.944 -80.303 -10.124 QT
-81.678 -9.303 -83.287 -9.303 QT
cp
-83.287 -10.084 M
-81.131 -10.084 -80.404 -11.655 QT
-79.678 -13.225 -79.678 -15.647 QT
-79.678 -17.006 -79.818 -17.897 QT
-79.959 -18.788 -80.459 -19.522 QT
-80.756 -19.959 -81.225 -20.295 QT
-81.693 -20.631 -82.217 -20.811 QT
-82.74 -20.991 -83.287 -20.991 QT
-84.131 -20.991 -84.889 -20.608 QT
-85.647 -20.225 -86.147 -19.522 QT
-86.647 -18.756 -86.787 -17.834 QT
-86.928 -16.913 -86.928 -15.647 QT
-86.928 -14.131 -86.662 -12.928 QT
-86.397 -11.725 -85.6 -10.905 QT
-84.803 -10.084 -83.287 -10.084 QT
cp
f
GR
GS
[0.75 0 0 0.75 221.25021 25.22857] CT
N
-76.001 -9.6 M
-76.001 -10.553 L
-75.079 -10.553 -74.485 -10.694 QT
-73.891 -10.834 -73.891 -11.413 QT
-73.891 -18.772 L
-73.891 -19.506 -74.11 -19.827 QT
-74.329 -20.147 -74.735 -20.217 QT
-75.141 -20.288 -76.001 -20.288 QT
-76.001 -21.241 L
-72.141 -21.538 L
-72.141 -18.897 L
-71.704 -20.069 -70.899 -20.803 QT
-70.094 -21.538 -68.954 -21.538 QT
-68.141 -21.538 -67.509 -21.061 QT
-66.876 -20.584 -66.876 -19.803 QT
-66.876 -19.319 -67.227 -18.952 QT
-67.579 -18.584 -68.094 -18.584 QT
-68.594 -18.584 -68.954 -18.944 QT
-69.313 -19.303 -69.313 -19.803 QT
-69.313 -20.522 -68.798 -20.834 QT
-68.954 -20.834 L
-70.048 -20.834 -70.735 -20.045 QT
-71.423 -19.256 -71.719 -18.077 QT
-72.016 -16.897 -72.016 -15.834 QT
-72.016 -11.413 L
-72.016 -10.553 -69.391 -10.553 QT
-69.391 -9.6 L
-76.001 -9.6 L
cp
f
GR
GS
[0.75 0 0 0.75 221.25021 25.22857] CT
N
-65.431 -9.6 M
-65.431 -10.553 L
-64.509 -10.553 -63.916 -10.694 QT
-63.322 -10.834 -63.322 -11.413 QT
-63.322 -18.772 L
-63.322 -19.819 -63.72 -20.053 QT
-64.119 -20.288 -65.306 -20.288 QT
-65.306 -21.241 L
-61.416 -21.538 L
-61.416 -11.413 L
-61.416 -10.834 -60.908 -10.694 QT
-60.4 -10.553 -59.541 -10.553 QT
-59.541 -9.6 L
-65.431 -9.6 L
cp
-64.275 -26.178 M
-64.275 -26.772 -63.83 -27.217 QT
-63.384 -27.663 -62.806 -27.663 QT
-62.416 -27.663 -62.064 -27.467 QT
-61.713 -27.272 -61.517 -26.913 QT
-61.322 -26.553 -61.322 -26.178 QT
-61.322 -25.584 -61.767 -25.139 QT
-62.213 -24.694 -62.806 -24.694 QT
-63.384 -24.694 -63.83 -25.139 QT
-64.275 -25.584 -64.275 -26.178 QT
cp
f
GR
GS
[0.75 0 0 0.75 221.25021 25.22857] CT
N
-57.789 -9.6 M
-58.102 -9.6 -58.102 -9.897 QT
-58.102 -10.116 L
-58.102 -10.225 -58.024 -10.303 QT
-50.477 -20.522 L
-52.899 -20.522 L
-54.055 -20.522 -54.797 -20.381 QT
-55.539 -20.241 -56.024 -19.834 QT
-56.508 -19.428 -56.727 -18.725 QT
-56.946 -18.022 -56.946 -16.788 QT
-57.711 -16.788 L
-57.414 -21.241 L
-48.368 -21.241 L
-48.258 -21.241 -48.172 -21.155 QT
-48.086 -21.069 -48.086 -20.944 QT
-48.086 -20.788 L
-48.086 -20.694 -48.133 -20.6 QT
-55.68 -10.381 L
-53.102 -10.381 L
-51.93 -10.381 -51.149 -10.522 QT
-50.368 -10.663 -49.805 -11.225 QT
-49.289 -11.741 -49.102 -12.608 QT
-48.914 -13.475 -48.805 -14.756 QT
-48.024 -14.756 L
-48.493 -9.6 L
-57.789 -9.6 L
cp
f
GR
GS
[0.75 0 0 0.75 221.25021 25.22857] CT
N
-40.25 -9.303 M
-41.875 -9.303 -43.258 -10.124 QT
-44.641 -10.944 -45.445 -12.327 QT
-46.25 -13.709 -46.25 -15.35 QT
-46.25 -16.584 -45.805 -17.733 QT
-45.359 -18.881 -44.539 -19.788 QT
-43.719 -20.694 -42.625 -21.202 QT
-41.531 -21.709 -40.25 -21.709 QT
-38.594 -21.709 -37.227 -20.827 QT
-35.859 -19.944 -35.07 -18.475 QT
-34.281 -17.006 -34.281 -15.35 QT
-34.281 -13.725 -35.086 -12.334 QT
-35.891 -10.944 -37.266 -10.124 QT
-38.641 -9.303 -40.25 -9.303 QT
cp
-40.25 -10.084 M
-38.094 -10.084 -37.367 -11.655 QT
-36.641 -13.225 -36.641 -15.647 QT
-36.641 -17.006 -36.781 -17.897 QT
-36.922 -18.788 -37.422 -19.522 QT
-37.719 -19.959 -38.188 -20.295 QT
-38.656 -20.631 -39.18 -20.811 QT
-39.703 -20.991 -40.25 -20.991 QT
-41.094 -20.991 -41.852 -20.608 QT
-42.609 -20.225 -43.109 -19.522 QT
-43.609 -18.756 -43.75 -17.834 QT
-43.891 -16.913 -43.891 -15.647 QT
-43.891 -14.131 -43.625 -12.928 QT
-43.359 -11.725 -42.563 -10.905 QT
-41.766 -10.084 -40.25 -10.084 QT
cp
f
GR
GS
[0.75 0 0 0.75 221.25021 25.22857] CT
N
-32.87 -9.6 M
-32.87 -10.553 L
-31.932 -10.553 -31.346 -10.694 QT
-30.76 -10.834 -30.76 -11.413 QT
-30.76 -18.772 L
-30.76 -19.506 -30.971 -19.827 QT
-31.182 -20.147 -31.596 -20.217 QT
-32.01 -20.288 -32.87 -20.288 QT
-32.87 -21.241 L
-28.948 -21.538 L
-28.948 -18.897 L
-28.401 -20.053 -27.339 -20.795 QT
-26.276 -21.538 -25.026 -21.538 QT
-23.167 -21.538 -22.221 -20.639 QT
-21.276 -19.741 -21.276 -17.897 QT
-21.276 -11.413 L
-21.276 -10.834 -20.682 -10.694 QT
-20.089 -10.553 -19.167 -10.553 QT
-19.167 -9.6 L
-25.354 -9.6 L
-25.354 -10.553 L
-24.432 -10.553 -23.839 -10.694 QT
-23.245 -10.834 -23.245 -11.413 QT
-23.245 -17.819 L
-23.245 -19.131 -23.628 -19.983 QT
-24.01 -20.834 -25.182 -20.834 QT
-26.76 -20.834 -27.768 -19.584 QT
-28.776 -18.334 -28.776 -16.725 QT
-28.776 -11.413 L
-28.776 -10.834 -28.182 -10.694 QT
-27.589 -10.553 -26.682 -10.553 QT
-26.682 -9.6 L
-32.87 -9.6 L
cp
f
GR
GS
[0.75 0 0 0.75 221.25021 25.22857] CT
N
-16.843 -12.85 M
-16.843 -20.288 L
-19.077 -20.288 L
-19.077 -20.991 L
-17.311 -20.991 -16.483 -22.639 QT
-15.655 -24.288 -15.655 -26.209 QT
-14.874 -26.209 L
-14.874 -21.241 L
-11.061 -21.241 L
-11.061 -20.288 L
-14.874 -20.288 L
-14.874 -12.897 L
-14.874 -11.772 -14.499 -10.928 QT
-14.124 -10.084 -13.14 -10.084 QT
-12.218 -10.084 -11.811 -10.975 QT
-11.405 -11.866 -11.405 -12.897 QT
-11.405 -14.491 L
-10.624 -14.491 L
-10.624 -12.85 L
-10.624 -12.006 -10.936 -11.178 QT
-11.249 -10.35 -11.858 -9.827 QT
-12.468 -9.303 -13.327 -9.303 QT
-14.952 -9.303 -15.897 -10.272 QT
-16.843 -11.241 -16.843 -12.85 QT
cp
f
GR
GS
[0.75 0 0 0.75 221.25021 25.22857] CT
N
-8.144 -12.256 M
-8.144 -13.866 -6.878 -14.874 QT
-5.613 -15.881 -3.839 -16.295 QT
-2.066 -16.709 -0.472 -16.709 QT
-0.472 -17.819 L
-0.472 -18.584 -0.816 -19.319 QT
-1.16 -20.053 -1.8 -20.522 QT
-2.441 -20.991 -3.222 -20.991 QT
-5.019 -20.991 -5.957 -20.194 QT
-5.441 -20.194 -5.105 -19.803 QT
-4.769 -19.413 -4.769 -18.897 QT
-4.769 -18.35 -5.152 -17.967 QT
-5.535 -17.584 -6.05 -17.584 QT
-6.597 -17.584 -6.98 -17.967 QT
-7.363 -18.35 -7.363 -18.897 QT
-7.363 -20.319 -6.074 -21.014 QT
-4.785 -21.709 -3.222 -21.709 QT
-2.128 -21.709 -1.019 -21.241 QT
0.09 -20.772 0.793 -19.897 QT
1.497 -19.022 1.497 -17.866 QT
1.497 -11.788 L
1.497 -11.256 1.723 -10.819 QT
1.95 -10.381 2.418 -10.381 QT
2.872 -10.381 3.09 -10.827 QT
3.309 -11.272 3.309 -11.788 QT
3.309 -13.522 L
4.09 -13.522 L
4.09 -11.788 L
4.09 -11.178 3.778 -10.631 QT
3.465 -10.084 2.926 -9.764 QT
2.387 -9.444 1.778 -9.444 QT
0.981 -9.444 0.411 -10.053 QT
-0.16 -10.663 -0.238 -11.506 QT
-0.738 -10.491 -1.707 -9.897 QT
-2.675 -9.303 -3.785 -9.303 QT
-4.816 -9.303 -5.816 -9.6 QT
-6.816 -9.897 -7.48 -10.553 QT
-8.144 -11.209 -8.144 -12.256 QT
cp
-5.957 -12.256 M
-5.957 -11.303 -5.253 -10.655 QT
-4.55 -10.006 -3.613 -10.006 QT
-2.738 -10.006 -2.027 -10.444 QT
-1.316 -10.881 -0.894 -11.631 QT
-0.472 -12.381 -0.472 -13.209 QT
-0.472 -16.022 L
-1.691 -16.022 -2.98 -15.616 QT
-4.269 -15.209 -5.113 -14.358 QT
-5.957 -13.506 -5.957 -12.256 QT
cp
f
GR
GS
[0.75 0 0 0.75 221.25021 25.22857] CT
N
4.939 -9.6 M
4.939 -10.553 L
5.861 -10.553 6.455 -10.694 QT
7.049 -10.834 7.049 -11.413 QT
7.049 -25.584 L
7.049 -26.303 6.83 -26.624 QT
6.611 -26.944 6.205 -27.022 QT
5.799 -27.1 4.939 -27.1 QT
4.939 -28.038 L
8.955 -28.334 L
8.955 -11.413 L
8.955 -10.834 9.549 -10.694 QT
10.142 -10.553 11.049 -10.553 QT
11.049 -9.6 L
4.939 -9.6 L
cp
f
GR
GS
[0.75 0 0 0.75 221.25021 25.22857] CT
N
27.001 -9.6 M
23.064 -19.522 L
22.814 -20.022 22.29 -20.155 QT
21.767 -20.288 20.923 -20.288 QT
20.923 -21.241 L
26.595 -21.241 L
26.595 -20.288 L
25.079 -20.288 25.079 -19.647 QT
25.079 -19.538 25.095 -19.491 QT
28.126 -11.866 L
30.861 -18.756 L
30.939 -18.959 30.939 -19.178 QT
30.939 -19.694 30.548 -19.991 QT
30.157 -20.288 29.642 -20.288 QT
29.642 -21.241 L
34.126 -21.241 L
34.126 -20.288 L
33.282 -20.288 32.657 -19.905 QT
32.032 -19.522 31.689 -18.772 QT
28.048 -9.6 L
27.954 -9.303 27.626 -9.303 QT
27.423 -9.303 L
27.095 -9.303 27.001 -9.6 QT
cp
f
GR
GS
[0.75 0 0 0.75 221.25021 25.22857] CT
N
40.46 -9.303 M
38.819 -9.303 37.444 -10.163 QT
36.069 -11.022 35.28 -12.467 QT
34.491 -13.913 34.491 -15.522 QT
34.491 -17.1 35.21 -18.522 QT
35.928 -19.944 37.217 -20.827 QT
38.506 -21.709 40.085 -21.709 QT
41.319 -21.709 42.233 -21.288 QT
43.147 -20.866 43.741 -20.131 QT
44.335 -19.397 44.639 -18.397 QT
44.944 -17.397 44.944 -16.194 QT
44.944 -15.834 44.663 -15.834 QT
36.85 -15.834 L
36.85 -15.553 L
36.85 -13.303 37.756 -11.694 QT
38.663 -10.084 40.71 -10.084 QT
41.538 -10.084 42.241 -10.452 QT
42.944 -10.819 43.467 -11.483 QT
43.991 -12.147 44.163 -12.897 QT
44.194 -12.991 44.264 -13.061 QT
44.335 -13.131 44.428 -13.131 QT
44.663 -13.131 L
44.944 -13.131 44.944 -12.788 QT
44.569 -11.256 43.303 -10.28 QT
42.038 -9.303 40.46 -9.303 QT
cp
36.881 -16.506 M
43.038 -16.506 L
43.038 -17.522 42.756 -18.561 QT
42.475 -19.6 41.811 -20.295 QT
41.147 -20.991 40.085 -20.991 QT
38.553 -20.991 37.717 -19.561 QT
36.881 -18.131 36.881 -16.506 QT
cp
f
GR
GS
[0.75 0 0 0.75 221.25021 25.22857] CT
N
46.421 -9.6 M
46.421 -10.553 L
47.343 -10.553 47.936 -10.694 QT
48.53 -10.834 48.53 -11.413 QT
48.53 -25.584 L
48.53 -26.303 48.311 -26.624 QT
48.093 -26.944 47.686 -27.022 QT
47.28 -27.1 46.421 -27.1 QT
46.421 -28.038 L
50.436 -28.334 L
50.436 -11.413 L
50.436 -10.834 51.03 -10.694 QT
51.624 -10.553 52.53 -10.553 QT
52.53 -9.6 L
46.421 -9.6 L
cp
f
GR
GS
[0.75 0 0 0.75 221.25021 25.22857] CT
N
59.75 -9.303 M
58.125 -9.303 56.742 -10.124 QT
55.359 -10.944 54.555 -12.327 QT
53.75 -13.709 53.75 -15.35 QT
53.75 -16.584 54.195 -17.733 QT
54.641 -18.881 55.461 -19.788 QT
56.281 -20.694 57.375 -21.202 QT
58.469 -21.709 59.75 -21.709 QT
61.406 -21.709 62.774 -20.827 QT
64.141 -19.944 64.93 -18.475 QT
65.719 -17.006 65.719 -15.35 QT
65.719 -13.725 64.914 -12.334 QT
64.109 -10.944 62.734 -10.124 QT
61.359 -9.303 59.75 -9.303 QT
cp
59.75 -10.084 M
61.906 -10.084 62.633 -11.655 QT
63.359 -13.225 63.359 -15.647 QT
63.359 -17.006 63.219 -17.897 QT
63.078 -18.788 62.578 -19.522 QT
62.281 -19.959 61.813 -20.295 QT
61.344 -20.631 60.82 -20.811 QT
60.297 -20.991 59.75 -20.991 QT
58.906 -20.991 58.149 -20.608 QT
57.391 -20.225 56.891 -19.522 QT
56.391 -18.756 56.25 -17.834 QT
56.109 -16.913 56.109 -15.647 QT
56.109 -14.131 56.375 -12.928 QT
56.641 -11.725 57.438 -10.905 QT
58.234 -10.084 59.75 -10.084 QT
cp
f
GR
GS
[0.75 0 0 0.75 221.25021 25.22857] CT
N
73.793 -9.303 M
72.168 -9.303 70.832 -10.147 QT
69.496 -10.991 68.73 -12.413 QT
67.965 -13.834 67.965 -15.428 QT
67.965 -17.022 68.723 -18.483 QT
69.48 -19.944 70.824 -20.827 QT
72.168 -21.709 73.793 -21.709 QT
75.387 -21.709 76.684 -21.084 QT
77.98 -20.459 77.98 -19.053 QT
77.98 -18.522 77.605 -18.131 QT
77.23 -17.741 76.684 -17.741 QT
76.152 -17.741 75.77 -18.131 QT
75.387 -18.522 75.387 -19.053 QT
75.387 -19.522 75.691 -19.874 QT
75.996 -20.225 76.449 -20.319 QT
75.512 -20.913 73.824 -20.913 QT
72.527 -20.913 71.738 -20.053 QT
70.949 -19.194 70.637 -17.928 QT
70.324 -16.663 70.324 -15.428 QT
70.324 -14.116 70.707 -12.897 QT
71.09 -11.678 71.957 -10.881 QT
72.824 -10.084 74.121 -10.084 QT
75.402 -10.084 76.301 -10.874 QT
77.199 -11.663 77.527 -12.928 QT
77.527 -13.084 77.746 -13.084 QT
78.074 -13.084 L
78.152 -13.084 78.215 -13.006 QT
78.277 -12.928 78.277 -12.85 QT
78.277 -12.772 L
77.871 -11.163 76.66 -10.233 QT
75.449 -9.303 73.793 -9.303 QT
cp
f
GR
GS
[0.75 0 0 0.75 221.25021 25.22857] CT
N
79.754 -9.6 M
79.754 -10.553 L
80.676 -10.553 81.27 -10.694 QT
81.864 -10.834 81.864 -11.413 QT
81.864 -18.772 L
81.864 -19.819 81.465 -20.053 QT
81.067 -20.288 79.879 -20.288 QT
79.879 -21.241 L
83.77 -21.538 L
83.77 -11.413 L
83.77 -10.834 84.278 -10.694 QT
84.785 -10.553 85.645 -10.553 QT
85.645 -9.6 L
79.754 -9.6 L
cp
80.91 -26.178 M
80.91 -26.772 81.356 -27.217 QT
81.801 -27.663 82.379 -27.663 QT
82.77 -27.663 83.121 -27.467 QT
83.473 -27.272 83.668 -26.913 QT
83.864 -26.553 83.864 -26.178 QT
83.864 -25.584 83.418 -25.139 QT
82.973 -24.694 82.379 -24.694 QT
81.801 -24.694 81.356 -25.139 QT
80.91 -25.584 80.91 -26.178 QT
cp
f
GR
GS
[0.75 0 0 0.75 221.25021 25.22857] CT
N
89.083 -12.85 M
89.083 -20.288 L
86.849 -20.288 L
86.849 -20.991 L
88.615 -20.991 89.443 -22.639 QT
90.271 -24.288 90.271 -26.209 QT
91.052 -26.209 L
91.052 -21.241 L
94.865 -21.241 L
94.865 -20.288 L
91.052 -20.288 L
91.052 -12.897 L
91.052 -11.772 91.427 -10.928 QT
91.802 -10.084 92.787 -10.084 QT
93.708 -10.084 94.115 -10.975 QT
94.521 -11.866 94.521 -12.897 QT
94.521 -14.491 L
95.302 -14.491 L
95.302 -12.85 L
95.302 -12.006 94.99 -11.178 QT
94.677 -10.35 94.068 -9.827 QT
93.458 -9.303 92.599 -9.303 QT
90.974 -9.303 90.029 -10.272 QT
89.083 -11.241 89.083 -12.85 QT
cp
f
GR
GS
[0.75 0 0 0.75 221.25021 25.22857] CT
N
97.823 -5.163 M
98.338 -4.756 98.963 -4.756 QT
100.651 -4.756 101.744 -7.334 QT
102.666 -9.6 L
98.619 -19.522 L
98.369 -20.022 97.854 -20.155 QT
97.338 -20.288 96.479 -20.288 QT
96.479 -21.241 L
102.151 -21.241 L
102.151 -20.288 L
100.651 -20.288 100.651 -19.647 QT
100.651 -19.538 100.682 -19.491 QT
103.682 -12.1 L
106.385 -18.756 L
106.463 -18.959 106.463 -19.209 QT
106.463 -19.538 106.291 -19.78 QT
106.119 -20.022 105.83 -20.155 QT
105.541 -20.288 105.198 -20.288 QT
105.198 -21.241 L
109.682 -21.241 L
109.682 -20.288 L
108.838 -20.288 108.213 -19.905 QT
107.588 -19.522 107.244 -18.772 QT
102.588 -7.334 L
102.213 -6.459 101.721 -5.733 QT
101.229 -5.006 100.518 -4.538 QT
99.807 -4.069 98.963 -4.069 QT
97.963 -4.069 97.221 -4.717 QT
96.479 -5.366 96.479 -6.334 QT
96.479 -6.834 96.823 -7.178 QT
97.166 -7.522 97.666 -7.522 QT
98.01 -7.522 98.276 -7.366 QT
98.541 -7.209 98.698 -6.952 QT
98.854 -6.694 98.854 -6.334 QT
98.854 -5.897 98.565 -5.553 QT
98.276 -5.209 97.823 -5.163 QT
cp
f
GR
GS
[0.75 0 0 0.75 0 0.5] CT
0.2 0.702 0.2 RC
1 LJ
0.667 LW
N
162.4 214 M
250.8 199.333 L
339.2 140.667 L
427.6 38 L
S
GR
GS
[0.75 0 0 0.75 0 0.5] CT
1 LJ
0.667 LW
N
162.4 214 M
250.8 38 L
339.2 38 L
427.6 38 L
S
GR
GS
[0.75 0 0 0.75 0 0.5] CT
0 0 1 RC
1 LJ
0.667 LW
N
162.4 214 M
250.8 302 L
339.2 390 L
427.6 390 L
S
GR
GS
[0.75 0 0 0.75 0 0.5] CT
0.6 0.2 0.2 RC
1 LJ
0.667 LW
N
162.4 214 M
250.8 228.667 L
339.2 287.333 L
427.6 390 L
S
GR
GS
[0.75 0 0 0.75 0 0.5] CT
1 GC
N
505 158 M
505 50 L
381 50 L
381 158 L
cp
f
GR
GS
[0.75 0 0 0.75 320.86361 49.11029] CT
N
0.672 5.12 M
0.672 4.386 L
2.547 4.386 2.984 3.136 QT
7.391 -9.693 L
7.453 -9.911 7.734 -9.911 QT
8 -9.911 L
8.281 -9.911 8.344 -9.693 QT
12.938 3.714 L
13.141 4.151 13.688 4.268 QT
14.234 4.386 15.047 4.386 QT
15.047 5.12 L
9.203 5.12 L
9.203 4.386 L
10.938 4.386 10.938 3.823 QT
10.938 3.714 L
9.797 0.432 L
4.703 0.432 L
3.766 3.136 L
3.75 3.214 3.75 3.354 QT
3.75 3.886 4.242 4.136 QT
4.734 4.386 5.313 4.386 QT
5.313 5.12 L
0.672 5.12 L
cp
4.953 -0.302 M
9.563 -0.302 L
7.25 -7.005 L
4.953 -0.302 L
cp
f
GR
GS
[0.75 0 0 0.75 320.86361 49.11029] CT
N
16.578 6.761 M
16.578 6.011 17.125 5.456 QT
17.672 4.901 18.422 4.651 QT
18 4.339 17.781 3.854 QT
17.563 3.37 17.563 2.839 QT
17.563 1.854 18.188 1.089 QT
17.219 0.151 17.219 -1.068 QT
17.219 -1.724 17.5 -2.302 QT
17.781 -2.88 18.289 -3.302 QT
18.797 -3.724 19.406 -3.943 QT
20.016 -4.161 20.672 -4.161 QT
21.922 -4.161 22.906 -3.427 QT
23.344 -3.896 23.93 -4.146 QT
24.516 -4.396 25.156 -4.396 QT
25.609 -4.396 25.898 -4.075 QT
26.188 -3.755 26.188 -3.302 QT
26.188 -3.036 25.992 -2.841 QT
25.797 -2.646 25.531 -2.646 QT
25.266 -2.646 25.07 -2.841 QT
24.875 -3.036 24.875 -3.302 QT
24.875 -3.693 25.141 -3.849 QT
24.047 -3.849 23.266 -3.099 QT
23.656 -2.708 23.883 -2.161 QT
24.109 -1.614 24.109 -1.068 QT
24.109 -0.177 23.617 0.534 QT
23.125 1.245 22.32 1.636 QT
21.516 2.026 20.672 2.026 QT
19.516 2.026 18.563 1.401 QT
18.266 1.823 18.266 2.323 QT
18.266 2.886 18.633 3.3 QT
19 3.714 19.547 3.714 QT
21.266 3.714 L
22.516 3.714 23.523 3.94 QT
24.531 4.167 25.211 4.846 QT
25.891 5.526 25.891 6.761 QT
25.891 7.682 25.117 8.292 QT
24.344 8.901 23.258 9.175 QT
22.172 9.448 21.25 9.448 QT
20.313 9.448 19.227 9.175 QT
18.141 8.901 17.359 8.292 QT
16.578 7.682 16.578 6.761 QT
cp
17.766 6.761 M
17.766 7.464 18.336 7.94 QT
18.906 8.417 19.719 8.651 QT
20.531 8.886 21.25 8.886 QT
21.953 8.886 22.766 8.651 QT
23.578 8.417 24.148 7.94 QT
24.719 7.464 24.719 6.761 QT
24.719 5.667 23.711 5.339 QT
22.703 5.011 21.266 5.011 QT
19.547 5.011 L
19.063 5.011 18.656 5.245 QT
18.25 5.479 18.008 5.893 QT
17.766 6.307 17.766 6.761 QT
cp
20.672 1.464 M
22.453 1.464 22.453 -1.068 QT
22.453 -2.177 22.07 -2.888 QT
21.688 -3.599 20.672 -3.599 QT
19.641 -3.599 19.258 -2.888 QT
18.875 -2.177 18.875 -1.068 QT
18.875 -0.38 19.023 0.182 QT
19.172 0.745 19.563 1.104 QT
19.953 1.464 20.672 1.464 QT
cp
f
GR
GS
[0.75 0 0 0.75 320.86361 49.11029] CT
N
31.901 5.354 M
30.62 5.354 29.55 4.682 QT
28.479 4.011 27.862 2.886 QT
27.245 1.761 27.245 0.511 QT
27.245 -0.708 27.807 -1.818 QT
28.37 -2.927 29.37 -3.607 QT
30.37 -4.286 31.604 -4.286 QT
32.557 -4.286 33.276 -3.966 QT
33.995 -3.646 34.456 -3.075 QT
34.917 -2.505 35.151 -1.724 QT
35.385 -0.943 35.385 -0.005 QT
35.385 0.276 35.167 0.276 QT
29.089 0.276 L
29.089 0.495 L
29.089 2.245 29.792 3.495 QT
30.495 4.745 32.089 4.745 QT
32.729 4.745 33.276 4.456 QT
33.823 4.167 34.229 3.651 QT
34.635 3.136 34.776 2.557 QT
34.792 2.479 34.854 2.425 QT
34.917 2.37 34.979 2.37 QT
35.167 2.37 L
35.385 2.37 35.385 2.636 QT
35.089 3.823 34.104 4.589 QT
33.12 5.354 31.901 5.354 QT
cp
29.104 -0.255 M
33.901 -0.255 L
33.901 -1.036 33.675 -1.849 QT
33.448 -2.661 32.94 -3.2 QT
32.432 -3.739 31.604 -3.739 QT
30.417 -3.739 29.76 -2.63 QT
29.104 -1.521 29.104 -0.255 QT
cp
f
GR
GS
[0.75 0 0 0.75 320.86361 49.11029] CT
N
36.773 5.12 M
36.773 4.386 L
37.492 4.386 37.953 4.268 QT
38.414 4.151 38.414 3.714 QT
38.414 -2.021 L
38.414 -2.583 38.242 -2.833 QT
38.07 -3.083 37.758 -3.138 QT
37.445 -3.193 36.773 -3.193 QT
36.773 -3.927 L
39.82 -4.161 L
39.82 -2.114 L
40.242 -3.005 41.07 -3.583 QT
41.898 -4.161 42.867 -4.161 QT
44.32 -4.161 45.054 -3.466 QT
45.789 -2.771 45.789 -1.333 QT
45.789 3.714 L
45.789 4.151 46.25 4.268 QT
46.711 4.386 47.429 4.386 QT
47.429 5.12 L
42.617 5.12 L
42.617 4.386 L
43.336 4.386 43.797 4.268 QT
44.258 4.151 44.258 3.714 QT
44.258 -1.271 L
44.258 -2.286 43.961 -2.95 QT
43.664 -3.614 42.742 -3.614 QT
41.523 -3.614 40.734 -2.638 QT
39.945 -1.661 39.945 -0.427 QT
39.945 3.714 L
39.945 4.151 40.414 4.268 QT
40.883 4.386 41.586 4.386 QT
41.586 5.12 L
36.773 5.12 L
cp
f
GR
GS
[0.75 0 0 0.75 320.86361 49.11029] CT
N
49.548 2.604 M
49.548 -3.193 L
47.814 -3.193 L
47.814 -3.739 L
49.189 -3.739 49.829 -5.021 QT
50.47 -6.302 50.47 -7.802 QT
51.079 -7.802 L
51.079 -3.927 L
54.048 -3.927 L
54.048 -3.193 L
51.079 -3.193 L
51.079 2.557 L
51.079 3.432 51.368 4.089 QT
51.657 4.745 52.423 4.745 QT
53.142 4.745 53.462 4.05 QT
53.782 3.354 53.782 2.557 QT
53.782 1.323 L
54.376 1.323 L
54.376 2.604 L
54.376 3.261 54.134 3.901 QT
53.892 4.542 53.423 4.948 QT
52.954 5.354 52.282 5.354 QT
51.017 5.354 50.282 4.604 QT
49.548 3.854 49.548 2.604 QT
cp
f
GR
GS
[0.75 0 0 0.75 320.86361 49.11029] CT
N
64.768 5.12 M
64.768 4.386 L
67.393 4.386 67.393 3.714 QT
67.393 -7.302 L
66.299 -6.786 64.643 -6.786 QT
64.643 -7.521 L
67.221 -7.521 68.534 -8.864 QT
68.831 -8.864 L
68.893 -8.864 68.963 -8.81 QT
69.034 -8.755 69.034 -8.677 QT
69.034 3.714 L
69.034 4.386 71.659 4.386 QT
71.659 5.12 L
64.768 5.12 L
cp
f
GR
GS
[0.75 0 0 0.75 0 0.5] CT
0.2 0.702 0.2 RC
1 LJ
0.667 LW
N
384.985 64.814 M
424.83 64.814 L
S
GR
GS
[0.75 0 0 0.75 320.86361 68.70343] CT
N
/f-597267615{0.672 5.12 M
0.672 4.386 L
2.547 4.386 2.984 3.136 QT
7.391 -9.693 L
7.453 -9.911 7.734 -9.911 QT
8 -9.911 L
8.281 -9.911 8.344 -9.693 QT
12.938 3.714 L
13.141 4.151 13.688 4.268 QT
14.234 4.386 15.047 4.386 QT
15.047 5.12 L
9.203 5.12 L
9.203 4.386 L
10.938 4.386 10.938 3.823 QT
10.938 3.714 L
9.797 0.432 L
4.703 0.432 L
3.766 3.136 L
3.75 3.214 3.75 3.354 QT
3.75 3.886 4.242 4.136 QT
4.734 4.386 5.313 4.386 QT
5.313 5.12 L
0.672 5.12 L
cp
4.953 -0.302 M
9.563 -0.302 L
7.25 -7.005 L
4.953 -0.302 L
cp}def
f-597267615
f
GR
GS
[0.75 0 0 0.75 320.86361 68.70343] CT
N
/f-745240314{16.578 6.761 M
16.578 6.011 17.125 5.456 QT
17.672 4.901 18.422 4.651 QT
18 4.339 17.781 3.854 QT
17.563 3.37 17.563 2.839 QT
17.563 1.854 18.188 1.089 QT
17.219 0.151 17.219 -1.068 QT
17.219 -1.724 17.5 -2.302 QT
17.781 -2.88 18.289 -3.302 QT
18.797 -3.724 19.406 -3.943 QT
20.016 -4.161 20.672 -4.161 QT
21.922 -4.161 22.906 -3.427 QT
23.344 -3.896 23.93 -4.146 QT
24.516 -4.396 25.156 -4.396 QT
25.609 -4.396 25.898 -4.075 QT
26.188 -3.755 26.188 -3.302 QT
26.188 -3.036 25.992 -2.841 QT
25.797 -2.646 25.531 -2.646 QT
25.266 -2.646 25.07 -2.841 QT
24.875 -3.036 24.875 -3.302 QT
24.875 -3.693 25.141 -3.849 QT
24.047 -3.849 23.266 -3.099 QT
23.656 -2.708 23.883 -2.161 QT
24.109 -1.614 24.109 -1.068 QT
24.109 -0.177 23.617 0.534 QT
23.125 1.245 22.32 1.636 QT
21.516 2.026 20.672 2.026 QT
19.516 2.026 18.563 1.401 QT
18.266 1.823 18.266 2.323 QT
18.266 2.886 18.633 3.3 QT
19 3.714 19.547 3.714 QT
21.266 3.714 L
22.516 3.714 23.523 3.94 QT
24.531 4.167 25.211 4.846 QT
25.891 5.526 25.891 6.761 QT
25.891 7.682 25.117 8.292 QT
24.344 8.901 23.258 9.175 QT
22.172 9.448 21.25 9.448 QT
20.313 9.448 19.227 9.175 QT
18.141 8.901 17.359 8.292 QT
16.578 7.682 16.578 6.761 QT
cp
17.766 6.761 M
17.766 7.464 18.336 7.94 QT
18.906 8.417 19.719 8.651 QT
20.531 8.886 21.25 8.886 QT
21.953 8.886 22.766 8.651 QT
23.578 8.417 24.148 7.94 QT
24.719 7.464 24.719 6.761 QT
24.719 5.667 23.711 5.339 QT
22.703 5.011 21.266 5.011 QT
19.547 5.011 L
19.063 5.011 18.656 5.245 QT
18.25 5.479 18.008 5.893 QT
17.766 6.307 17.766 6.761 QT
cp
20.672 1.464 M
22.453 1.464 22.453 -1.068 QT
22.453 -2.177 22.07 -2.888 QT
21.688 -3.599 20.672 -3.599 QT
19.641 -3.599 19.258 -2.888 QT
18.875 -2.177 18.875 -1.068 QT
18.875 -0.38 19.023 0.182 QT
19.172 0.745 19.563 1.104 QT
19.953 1.464 20.672 1.464 QT
cp}def
f-745240314
f
GR
GS
[0.75 0 0 0.75 320.86361 68.70343] CT
N
/f1964844890{31.901 5.354 M
30.62 5.354 29.55 4.682 QT
28.479 4.011 27.862 2.886 QT
27.245 1.761 27.245 0.511 QT
27.245 -0.708 27.807 -1.818 QT
28.37 -2.927 29.37 -3.607 QT
30.37 -4.286 31.604 -4.286 QT
32.557 -4.286 33.276 -3.966 QT
33.995 -3.646 34.456 -3.075 QT
34.917 -2.505 35.151 -1.724 QT
35.385 -0.943 35.385 -0.005 QT
35.385 0.276 35.167 0.276 QT
29.089 0.276 L
29.089 0.495 L
29.089 2.245 29.792 3.495 QT
30.495 4.745 32.089 4.745 QT
32.729 4.745 33.276 4.456 QT
33.823 4.167 34.229 3.651 QT
34.635 3.136 34.776 2.557 QT
34.792 2.479 34.854 2.425 QT
34.917 2.37 34.979 2.37 QT
35.167 2.37 L
35.385 2.37 35.385 2.636 QT
35.089 3.823 34.104 4.589 QT
33.12 5.354 31.901 5.354 QT
cp
29.104 -0.255 M
33.901 -0.255 L
33.901 -1.036 33.675 -1.849 QT
33.448 -2.661 32.94 -3.2 QT
32.432 -3.739 31.604 -3.739 QT
30.417 -3.739 29.76 -2.63 QT
29.104 -1.521 29.104 -0.255 QT
cp}def
f1964844890
f
GR
GS
[0.75 0 0 0.75 320.86361 68.70343] CT
N
/f1881606250{36.773 5.12 M
36.773 4.386 L
37.492 4.386 37.953 4.268 QT
38.414 4.151 38.414 3.714 QT
38.414 -2.021 L
38.414 -2.583 38.242 -2.833 QT
38.07 -3.083 37.758 -3.138 QT
37.445 -3.193 36.773 -3.193 QT
36.773 -3.927 L
39.82 -4.161 L
39.82 -2.114 L
40.242 -3.005 41.07 -3.583 QT
41.898 -4.161 42.867 -4.161 QT
44.32 -4.161 45.054 -3.466 QT
45.789 -2.771 45.789 -1.333 QT
45.789 3.714 L
45.789 4.151 46.25 4.268 QT
46.711 4.386 47.429 4.386 QT
47.429 5.12 L
42.617 5.12 L
42.617 4.386 L
43.336 4.386 43.797 4.268 QT
44.258 4.151 44.258 3.714 QT
44.258 -1.271 L
44.258 -2.286 43.961 -2.95 QT
43.664 -3.614 42.742 -3.614 QT
41.523 -3.614 40.734 -2.638 QT
39.945 -1.661 39.945 -0.427 QT
39.945 3.714 L
39.945 4.151 40.414 4.268 QT
40.883 4.386 41.586 4.386 QT
41.586 5.12 L
36.773 5.12 L
cp}def
f1881606250
f
GR
GS
[0.75 0 0 0.75 320.86361 68.70343] CT
N
/f-1218143468{49.548 2.604 M
49.548 -3.193 L
47.814 -3.193 L
47.814 -3.739 L
49.189 -3.739 49.829 -5.021 QT
50.47 -6.302 50.47 -7.802 QT
51.079 -7.802 L
51.079 -3.927 L
54.048 -3.927 L
54.048 -3.193 L
51.079 -3.193 L
51.079 2.557 L
51.079 3.432 51.368 4.089 QT
51.657 4.745 52.423 4.745 QT
53.142 4.745 53.462 4.05 QT
53.782 3.354 53.782 2.557 QT
53.782 1.323 L
54.376 1.323 L
54.376 2.604 L
54.376 3.261 54.134 3.901 QT
53.892 4.542 53.423 4.948 QT
52.954 5.354 52.282 5.354 QT
51.017 5.354 50.282 4.604 QT
49.548 3.854 49.548 2.604 QT
cp}def
f-1218143468
f
GR
GS
[0.75 0 0 0.75 320.86361 68.70343] CT
N
/f-1429999007{63.862 5.12 M
63.862 4.557 L
63.862 4.511 63.909 4.448 QT
67.159 0.839 L
67.909 0.026 68.37 -0.513 QT
68.831 -1.052 69.276 -1.763 QT
69.721 -2.474 69.987 -3.2 QT
70.252 -3.927 70.252 -4.755 QT
70.252 -5.614 69.932 -6.404 QT
69.612 -7.193 68.979 -7.661 QT
68.346 -8.13 67.456 -8.13 QT
66.549 -8.13 65.823 -7.583 QT
65.096 -7.036 64.799 -6.161 QT
64.877 -6.177 65.018 -6.177 QT
65.487 -6.177 65.823 -5.864 QT
66.159 -5.552 66.159 -5.036 QT
66.159 -4.568 65.823 -4.232 QT
65.487 -3.896 65.018 -3.896 QT
64.534 -3.896 64.198 -4.239 QT
63.862 -4.583 63.862 -5.036 QT
63.862 -5.833 64.159 -6.521 QT
64.456 -7.208 65.018 -7.747 QT
65.581 -8.286 66.276 -8.575 QT
66.971 -8.864 67.768 -8.864 QT
68.971 -8.864 70.002 -8.357 QT
71.034 -7.849 71.643 -6.919 QT
72.252 -5.989 72.252 -4.755 QT
72.252 -3.849 71.854 -3.029 QT
71.456 -2.208 70.831 -1.536 QT
70.206 -0.864 69.229 -0.013 QT
68.252 0.839 67.94 1.136 QT
65.565 3.417 L
67.581 3.417 L
69.065 3.417 70.065 3.393 QT
71.065 3.37 71.127 3.307 QT
71.377 3.042 71.627 1.37 QT
72.252 1.37 L
71.659 5.12 L
63.862 5.12 L
cp}def
f-1429999007
f
GR
GS
[0.75 0 0 0.75 0 0.5] CT
1 LJ
0.667 LW
N
384.985 90.938 M
424.83 90.938 L
S
GR
GS
[0.75 0 0 0.75 320.86361 88.29657] CT
N
f-597267615
f
GR
GS
[0.75 0 0 0.75 320.86361 88.29657] CT
N
f-745240314
f
GR
GS
[0.75 0 0 0.75 320.86361 88.29657] CT
N
f1964844890
f
GR
GS
[0.75 0 0 0.75 320.86361 88.29657] CT
N
f1881606250
f
GR
GS
[0.75 0 0 0.75 320.86361 88.29657] CT
N
f-1218143468
f
GR
GS
[0.75 0 0 0.75 320.86361 88.29657] CT
N
/f300774680{64.815 3.495 M
65.299 4.214 66.135 4.565 QT
66.971 4.917 67.924 4.917 QT
69.143 4.917 69.659 3.878 QT
70.174 2.839 70.174 1.511 QT
70.174 0.917 70.065 0.323 QT
69.956 -0.271 69.698 -0.786 QT
69.44 -1.302 68.995 -1.607 QT
68.549 -1.911 67.909 -1.911 QT
66.502 -1.911 L
66.315 -1.911 66.315 -2.114 QT
66.315 -2.286 L
66.315 -2.458 66.502 -2.458 QT
67.659 -2.552 L
68.409 -2.552 68.893 -3.107 QT
69.377 -3.661 69.604 -4.45 QT
69.831 -5.239 69.831 -5.958 QT
69.831 -6.974 69.362 -7.614 QT
68.893 -8.255 67.924 -8.255 QT
67.127 -8.255 66.393 -7.958 QT
65.659 -7.661 65.237 -7.036 QT
65.284 -7.052 65.307 -7.06 QT
65.331 -7.068 65.377 -7.068 QT
65.846 -7.068 66.166 -6.739 QT
66.487 -6.411 66.487 -5.943 QT
66.487 -5.489 66.166 -5.161 QT
65.846 -4.833 65.377 -4.833 QT
64.924 -4.833 64.596 -5.161 QT
64.268 -5.489 64.268 -5.943 QT
64.268 -6.849 64.807 -7.513 QT
65.346 -8.177 66.206 -8.521 QT
67.065 -8.864 67.924 -8.864 QT
68.565 -8.864 69.268 -8.677 QT
69.971 -8.489 70.549 -8.138 QT
71.127 -7.786 71.487 -7.232 QT
71.846 -6.677 71.846 -5.958 QT
71.846 -5.083 71.456 -4.333 QT
71.065 -3.583 70.377 -3.044 QT
69.69 -2.505 68.862 -2.239 QT
69.784 -2.052 70.604 -1.544 QT
71.424 -1.036 71.916 -0.232 QT
72.409 0.573 72.409 1.495 QT
72.409 2.651 71.776 3.589 QT
71.143 4.526 70.104 5.057 QT
69.065 5.589 67.924 5.589 QT
66.94 5.589 65.948 5.214 QT
64.956 4.839 64.323 4.089 QT
63.69 3.339 63.69 2.292 QT
63.69 1.761 64.041 1.417 QT
64.393 1.073 64.924 1.073 QT
65.252 1.073 65.534 1.229 QT
65.815 1.386 65.979 1.675 QT
66.143 1.964 66.143 2.292 QT
66.143 2.807 65.784 3.151 QT
65.424 3.495 64.924 3.495 QT
64.815 3.495 L
cp}def
f300774680
f
GR
GS
[0.75 0 0 0.75 0 0.5] CT
0 0 1 RC
1 LJ
0.667 LW
N
384.985 117.062 M
424.83 117.062 L
S
GR
GS
[0.75 0 0 0.75 320.86361 107.88971] CT
N
f-597267615
f
GR
GS
[0.75 0 0 0.75 320.86361 107.88971] CT
N
f-745240314
f
GR
GS
[0.75 0 0 0.75 320.86361 107.88971] CT
N
f1964844890
f
GR
GS
[0.75 0 0 0.75 320.86361 107.88971] CT
N
f1881606250
f
GR
GS
[0.75 0 0 0.75 320.86361 107.88971] CT
N
f-1218143468
f
GR
GS
[0.75 0 0 0.75 320.86361 107.88971] CT
N
/f-1674298674{63.393 1.651 M
63.393 0.917 L
69.893 -8.771 L
69.956 -8.864 70.112 -8.864 QT
70.409 -8.864 L
70.643 -8.864 70.643 -8.63 QT
70.643 0.917 L
72.706 0.917 L
72.706 1.651 L
70.643 1.651 L
70.643 3.714 L
70.643 4.151 71.26 4.268 QT
71.877 4.386 72.69 4.386 QT
72.69 5.12 L
66.909 5.12 L
66.909 4.386 L
67.721 4.386 68.331 4.268 QT
68.94 4.151 68.94 3.714 QT
68.94 1.651 L
63.393 1.651 L
cp
64.096 0.917 M
69.065 0.917 L
69.065 -6.521 L
64.096 0.917 L
cp}def
f-1674298674
f
GR
GS
[0.75 0 0 0.75 0 0.5] CT
0.6 0.2 0.2 RC
1 LJ
0.667 LW
N
384.985 143.186 M
424.83 143.186 L
S
GR
GS
[0.75 0 0 0.75 0 0.5] CT
0.149 GC
10.0 ML
0.667 LW
N
381 158 M
381 50 L
505 50 L
505 158 L
cp
S
GR
%%Trailer
%%Pages: 1
%%EOF
