%!PS-Adobe-3.0 EPSF-3.0
%%Creator: (MATLAB, The Mathworks, Inc. Version 9.12.0.2529717 \(R2022a\) Update 8. Operating System: Linux)
%%Title: plots/Example2_u_abs.eps
%%CreationDate: 2024-05-27T22:42:34
%%Pages: (atend)
%%BoundingBox:     7     2   417   335
%%LanguageLevel: 3
%%EndComments
%%BeginProlog
%%BeginResource: procset (Apache XML Graphics Std ProcSet) 1.2 0
%%Version: 1.2 0
%%Copyright: (Copyright 2001-2003,2010 The Apache Software Foundation. License terms: http://www.apache.org/licenses/LICENSE-2.0)
/bd{bind def}bind def
/ld{load def}bd
/GR/grestore ld
/GS/gsave ld
/RM/rmoveto ld
/C/curveto ld
/t/show ld
/L/lineto ld
/ML/setmiterlimit ld
/CT/concat ld
/f/fill ld
/N/newpath ld
/S/stroke ld
/CC/setcmykcolor ld
/A/ashow ld
/cp/closepath ld
/RC/setrgbcolor ld
/LJ/setlinejoin ld
/GC/setgray ld
/LW/setlinewidth ld
/M/moveto ld
/re {4 2 roll M
1 index 0 rlineto
0 exch rlineto
neg 0 rlineto
cp } bd
/_ctm matrix def
/_tm matrix def
/BT { _ctm currentmatrix pop matrix _tm copy pop 0 0 moveto } bd
/ET { _ctm setmatrix } bd
/iTm { _ctm setmatrix _tm concat } bd
/Tm { _tm astore pop iTm 0 0 moveto } bd
/ux 0.0 def
/uy 0.0 def
/F {
  /Tp exch def
  /Tf exch def
  Tf findfont Tp scalefont setfont
  /cf Tf def  /cs Tp def
} bd
/ULS {currentpoint /uy exch def /ux exch def} bd
/ULE {
  /Tcx currentpoint pop def
  gsave
  newpath
  cf findfont cs scalefont dup
  /FontMatrix get 0 get /Ts exch def /FontInfo get dup
  /UnderlinePosition get Ts mul /To exch def
  /UnderlineThickness get Ts mul /Tt exch def
  ux uy To add moveto  Tcx uy To add lineto
  Tt setlinewidth stroke
  grestore
} bd
/OLE {
  /Tcx currentpoint pop def
  gsave
  newpath
  cf findfont cs scalefont dup
  /FontMatrix get 0 get /Ts exch def /FontInfo get dup
  /UnderlinePosition get Ts mul /To exch def
  /UnderlineThickness get Ts mul /Tt exch def
  ux uy To add cs add moveto Tcx uy To add cs add lineto
  Tt setlinewidth stroke
  grestore
} bd
/SOE {
  /Tcx currentpoint pop def
  gsave
  newpath
  cf findfont cs scalefont dup
  /FontMatrix get 0 get /Ts exch def /FontInfo get dup
  /UnderlinePosition get Ts mul /To exch def
  /UnderlineThickness get Ts mul /Tt exch def
  ux uy To add cs 10 mul 26 idiv add moveto Tcx uy To add cs 10 mul 26 idiv add lineto
  Tt setlinewidth stroke
  grestore
} bd
/QT {
/Y22 exch store
/X22 exch store
/Y21 exch store
/X21 exch store
currentpoint
/Y21 load 2 mul add 3 div exch
/X21 load 2 mul add 3 div exch
/X21 load 2 mul /X22 load add 3 div
/Y21 load 2 mul /Y22 load add 3 div
/X22 load /Y22 load curveto
} bd
/SSPD {
dup length /d exch dict def
{
/v exch def
/k exch def
currentpagedevice k known {
/cpdv currentpagedevice k get def
v cpdv ne {
/upd false def
/nullv v type /nulltype eq def
/nullcpdv cpdv type /nulltype eq def
nullv nullcpdv or
{
/upd true def
} {
/sametype v type cpdv type eq def
sametype {
v type /arraytype eq {
/vlen v length def
/cpdvlen cpdv length def
vlen cpdvlen eq {
0 1 vlen 1 sub {
/i exch def
/obj v i get def
/cpdobj cpdv i get def
obj cpdobj ne {
/upd true def
exit
} if
} for
} {
/upd true def
} ifelse
} {
v type /dicttype eq {
v {
/dv exch def
/dk exch def
/cpddv cpdv dk get def
dv cpddv ne {
/upd true def
exit
} if
} forall
} {
/upd true def
} ifelse
} ifelse
} if
} ifelse
upd true eq {
d k v put
} if
} if
} if
} forall
d length 0 gt {
d setpagedevice
} if
} bd
/RE { % /NewFontName [NewEncodingArray] /FontName RE -
  findfont dup length dict begin
  {
    1 index /FID ne
    {def} {pop pop} ifelse
  } forall
  /Encoding exch def
  /FontName 1 index def
  currentdict definefont pop
  end
} bind def
%%EndResource
%%BeginResource: procset (Apache XML Graphics EPS ProcSet) 1.0 0
%%Version: 1.0 0
%%Copyright: (Copyright 2002-2003 The Apache Software Foundation. License terms: http://www.apache.org/licenses/LICENSE-2.0)
/BeginEPSF { %def
/b4_Inc_state save def         % Save state for cleanup
/dict_count countdictstack def % Count objects on dict stack
/op_count count 1 sub def      % Count objects on operand stack
userdict begin                 % Push userdict on dict stack
/showpage { } def              % Redefine showpage, { } = null proc
0 setgray 0 setlinecap         % Prepare graphics state
1 setlinewidth 0 setlinejoin
10 setmiterlimit [ ] 0 setdash newpath
/languagelevel where           % If level not equal to 1 then
{pop languagelevel             % set strokeadjust and
1 ne                           % overprint to their defaults.
{false setstrokeadjust false setoverprint
} if
} if
} bd
/EndEPSF { %def
count op_count sub {pop} repeat            % Clean up stacks
countdictstack dict_count sub {end} repeat
b4_Inc_state restore
} bd
%%EndResource
%FOPBeginFontDict
%%IncludeResource: font Courier-Oblique
%%IncludeResource: font Courier-BoldOblique
%%IncludeResource: font Courier-Bold
%%IncludeResource: font ZapfDingbats
%%IncludeResource: font Symbol
%%IncludeResource: font Helvetica
%%IncludeResource: font Helvetica-Oblique
%%IncludeResource: font Helvetica-Bold
%%IncludeResource: font Helvetica-BoldOblique
%%IncludeResource: font Times-Roman
%%IncludeResource: font Times-Italic
%%IncludeResource: font Times-Bold
%%IncludeResource: font Times-BoldItalic
%%IncludeResource: font Courier
%FOPEndFontDict
%%BeginResource: encoding WinAnsiEncoding
/WinAnsiEncoding [
/.notdef /.notdef /.notdef /.notdef /.notdef
/.notdef /.notdef /.notdef /.notdef /.notdef
/.notdef /.notdef /.notdef /.notdef /.notdef
/.notdef /.notdef /.notdef /.notdef /.notdef
/.notdef /.notdef /.notdef /.notdef /.notdef
/.notdef /.notdef /.notdef /.notdef /.notdef
/.notdef /.notdef /space /exclam /quotedbl
/numbersign /dollar /percent /ampersand /quotesingle
/parenleft /parenright /asterisk /plus /comma
/hyphen /period /slash /zero /one
/two /three /four /five /six
/seven /eight /nine /colon /semicolon
/less /equal /greater /question /at
/A /B /C /D /E
/F /G /H /I /J
/K /L /M /N /O
/P /Q /R /S /T
/U /V /W /X /Y
/Z /bracketleft /backslash /bracketright /asciicircum
/underscore /quoteleft /a /b /c
/d /e /f /g /h
/i /j /k /l /m
/n /o /p /q /r
/s /t /u /v /w
/x /y /z /braceleft /bar
/braceright /asciitilde /bullet /Euro /bullet
/quotesinglbase /florin /quotedblbase /ellipsis /dagger
/daggerdbl /circumflex /perthousand /Scaron /guilsinglleft
/OE /bullet /Zcaron /bullet /bullet
/quoteleft /quoteright /quotedblleft /quotedblright /bullet
/endash /emdash /asciitilde /trademark /scaron
/guilsinglright /oe /bullet /zcaron /Ydieresis
/space /exclamdown /cent /sterling /currency
/yen /brokenbar /section /dieresis /copyright
/ordfeminine /guillemotleft /logicalnot /sfthyphen /registered
/macron /degree /plusminus /twosuperior /threesuperior
/acute /mu /paragraph /middot /cedilla
/onesuperior /ordmasculine /guillemotright /onequarter /onehalf
/threequarters /questiondown /Agrave /Aacute /Acircumflex
/Atilde /Adieresis /Aring /AE /Ccedilla
/Egrave /Eacute /Ecircumflex /Edieresis /Igrave
/Iacute /Icircumflex /Idieresis /Eth /Ntilde
/Ograve /Oacute /Ocircumflex /Otilde /Odieresis
/multiply /Oslash /Ugrave /Uacute /Ucircumflex
/Udieresis /Yacute /Thorn /germandbls /agrave
/aacute /acircumflex /atilde /adieresis /aring
/ae /ccedilla /egrave /eacute /ecircumflex
/edieresis /igrave /iacute /icircumflex /idieresis
/eth /ntilde /ograve /oacute /ocircumflex
/otilde /odieresis /divide /oslash /ugrave
/uacute /ucircumflex /udieresis /yacute /thorn
/ydieresis
] def
%%EndResource
%FOPBeginFontReencode
/Courier-Oblique findfont
dup length dict begin
  {1 index /FID ne {def} {pop pop} ifelse} forall
  /Encoding WinAnsiEncoding def
  currentdict
end
/Courier-Oblique exch definefont pop
/Courier-BoldOblique findfont
dup length dict begin
  {1 index /FID ne {def} {pop pop} ifelse} forall
  /Encoding WinAnsiEncoding def
  currentdict
end
/Courier-BoldOblique exch definefont pop
/Courier-Bold findfont
dup length dict begin
  {1 index /FID ne {def} {pop pop} ifelse} forall
  /Encoding WinAnsiEncoding def
  currentdict
end
/Courier-Bold exch definefont pop
/Helvetica findfont
dup length dict begin
  {1 index /FID ne {def} {pop pop} ifelse} forall
  /Encoding WinAnsiEncoding def
  currentdict
end
/Helvetica exch definefont pop
/Helvetica-Oblique findfont
dup length dict begin
  {1 index /FID ne {def} {pop pop} ifelse} forall
  /Encoding WinAnsiEncoding def
  currentdict
end
/Helvetica-Oblique exch definefont pop
/Helvetica-Bold findfont
dup length dict begin
  {1 index /FID ne {def} {pop pop} ifelse} forall
  /Encoding WinAnsiEncoding def
  currentdict
end
/Helvetica-Bold exch definefont pop
/Helvetica-BoldOblique findfont
dup length dict begin
  {1 index /FID ne {def} {pop pop} ifelse} forall
  /Encoding WinAnsiEncoding def
  currentdict
end
/Helvetica-BoldOblique exch definefont pop
/Times-Roman findfont
dup length dict begin
  {1 index /FID ne {def} {pop pop} ifelse} forall
  /Encoding WinAnsiEncoding def
  currentdict
end
/Times-Roman exch definefont pop
/Times-Italic findfont
dup length dict begin
  {1 index /FID ne {def} {pop pop} ifelse} forall
  /Encoding WinAnsiEncoding def
  currentdict
end
/Times-Italic exch definefont pop
/Times-Bold findfont
dup length dict begin
  {1 index /FID ne {def} {pop pop} ifelse} forall
  /Encoding WinAnsiEncoding def
  currentdict
end
/Times-Bold exch definefont pop
/Times-BoldItalic findfont
dup length dict begin
  {1 index /FID ne {def} {pop pop} ifelse} forall
  /Encoding WinAnsiEncoding def
  currentdict
end
/Times-BoldItalic exch definefont pop
/Courier findfont
dup length dict begin
  {1 index /FID ne {def} {pop pop} ifelse} forall
  /Encoding WinAnsiEncoding def
  currentdict
end
/Courier exch definefont pop
%FOPEndFontReencode
%%EndProlog
%%Page: 1 1
%%PageBoundingBox: 0 0 428 338
%%BeginPageSetup
N
    7     2 M
  424     2 L
  424   337 L
    7   337 L
cp
clip
[1 0 0 -1 0 338] CT
%%EndPageSetup
GS
[0.75 0 0 0.75 0 0.5] CT
N
0 0 M
570 0 L
570 450 L
0 450 L
0 0 L
cp
clip
1 GC
N
0 0 570 450 re
f
GR
GS
[0.75 0 0 0.75 0 0.5] CT
1 GC
N
0 0 570 450 re
f
GR
GS
[0.75 0 0 0.75 0 0.5] CT
1 GC
N
74 390 M
516 390 L
516 38 L
74 38 L
cp
f
GR
GS
[0.75 0 0 0.75 0 0.5] CT
0.873 GC
1 LJ
0.667 LW
N
74 390 M
74 38 L
S
GR
GS
[0.75 0 0 0.75 0 0.5] CT
0.873 GC
1 LJ
0.667 LW
N
114.182 390 M
114.182 38 L
S
GR
GS
[0.75 0 0 0.75 0 0.5] CT
0.873 GC
1 LJ
0.667 LW
N
154.364 390 M
154.364 38 L
S
GR
GS
[0.75 0 0 0.75 0 0.5] CT
0.873 GC
1 LJ
0.667 LW
N
194.545 390 M
194.545 38 L
S
GR
GS
[0.75 0 0 0.75 0 0.5] CT
0.873 GC
1 LJ
0.667 LW
N
234.727 390 M
234.727 38 L
S
GR
GS
[0.75 0 0 0.75 0 0.5] CT
0.873 GC
1 LJ
0.667 LW
N
274.909 390 M
274.909 38 L
S
GR
GS
[0.75 0 0 0.75 0 0.5] CT
0.873 GC
1 LJ
0.667 LW
N
315.091 390 M
315.091 38 L
S
GR
GS
[0.75 0 0 0.75 0 0.5] CT
0.873 GC
1 LJ
0.667 LW
N
355.273 390 M
355.273 38 L
S
GR
GS
[0.75 0 0 0.75 0 0.5] CT
0.873 GC
1 LJ
0.667 LW
N
395.455 390 M
395.455 38 L
S
GR
GS
[0.75 0 0 0.75 0 0.5] CT
0.873 GC
1 LJ
0.667 LW
N
435.636 390 M
435.636 38 L
S
GR
GS
[0.75 0 0 0.75 0 0.5] CT
0.873 GC
1 LJ
0.667 LW
N
475.818 390 M
475.818 38 L
S
GR
GS
[0.75 0 0 0.75 0 0.5] CT
0.873 GC
1 LJ
0.667 LW
N
516 390 M
516 38 L
S
GR
GS
[0.75 0 0 0.75 0 0.5] CT
0.873 GC
1 LJ
0.667 LW
N
516 390 M
74 390 L
S
GR
GS
[0.75 0 0 0.75 0 0.5] CT
0.873 GC
1 LJ
0.667 LW
N
516 331.333 M
74 331.333 L
S
GR
GS
[0.75 0 0 0.75 0 0.5] CT
0.873 GC
1 LJ
0.667 LW
N
516 272.667 M
74 272.667 L
S
GR
GS
[0.75 0 0 0.75 0 0.5] CT
0.873 GC
1 LJ
0.667 LW
N
516 214 M
74 214 L
S
GR
GS
[0.75 0 0 0.75 0 0.5] CT
0.873 GC
1 LJ
0.667 LW
N
516 155.333 M
74 155.333 L
S
GR
GS
[0.75 0 0 0.75 0 0.5] CT
0.873 GC
1 LJ
0.667 LW
N
516 96.667 M
74 96.667 L
S
GR
GS
[0.75 0 0 0.75 0 0.5] CT
0.873 GC
1 LJ
0.667 LW
N
516 38 M
74 38 L
S
GR
GS
[0.75 0 0 0.75 0 0.5] CT
0.149 GC
2 setlinecap
1 LJ
0.667 LW
N
74 390 M
516 390 L
S
GR
GS
[0.75 0 0 0.75 0 0.5] CT
0.149 GC
2 setlinecap
1 LJ
0.667 LW
N
74 390 M
74 385.58 L
S
GR
GS
[0.75 0 0 0.75 0 0.5] CT
0.149 GC
2 setlinecap
1 LJ
0.667 LW
N
114.182 390 M
114.182 385.58 L
S
GR
GS
[0.75 0 0 0.75 0 0.5] CT
0.149 GC
2 setlinecap
1 LJ
0.667 LW
N
154.364 390 M
154.364 385.58 L
S
GR
GS
[0.75 0 0 0.75 0 0.5] CT
0.149 GC
2 setlinecap
1 LJ
0.667 LW
N
194.545 390 M
194.545 385.58 L
S
GR
GS
[0.75 0 0 0.75 0 0.5] CT
0.149 GC
2 setlinecap
1 LJ
0.667 LW
N
234.727 390 M
234.727 385.58 L
S
GR
GS
[0.75 0 0 0.75 0 0.5] CT
0.149 GC
2 setlinecap
1 LJ
0.667 LW
N
274.909 390 M
274.909 385.58 L
S
GR
GS
[0.75 0 0 0.75 0 0.5] CT
0.149 GC
2 setlinecap
1 LJ
0.667 LW
N
315.091 390 M
315.091 385.58 L
S
GR
GS
[0.75 0 0 0.75 0 0.5] CT
0.149 GC
2 setlinecap
1 LJ
0.667 LW
N
355.273 390 M
355.273 385.58 L
S
GR
GS
[0.75 0 0 0.75 0 0.5] CT
0.149 GC
2 setlinecap
1 LJ
0.667 LW
N
395.455 390 M
395.455 385.58 L
S
GR
GS
[0.75 0 0 0.75 0 0.5] CT
0.149 GC
2 setlinecap
1 LJ
0.667 LW
N
435.636 390 M
435.636 385.58 L
S
GR
GS
[0.75 0 0 0.75 0 0.5] CT
0.149 GC
2 setlinecap
1 LJ
0.667 LW
N
475.818 390 M
475.818 385.58 L
S
GR
GS
[0.75 0 0 0.75 0 0.5] CT
0.149 GC
2 setlinecap
1 LJ
0.667 LW
N
516 390 M
516 385.58 L
S
GR
GS
[0.75 0 0 0.75 55.5 297.00001] CT
0.149 GC
/Helvetica 13.333 F
GS
[1 0 0 1 0 0] CT
-4 15 moveto 
1 -1 scale
(0) t 
GR
GR
GS
[0.75 0 0 0.75 85.63636 297.00001] CT
0.149 GC
/Helvetica 13.333 F
GS
[1 0 0 1 0 0] CT
-4 15 moveto 
1 -1 scale
(2) t 
GR
GR
GS
[0.75 0 0 0.75 115.77272 297.00001] CT
0.149 GC
/Helvetica 13.333 F
GS
[1 0 0 1 0 0] CT
-4 15 moveto 
1 -1 scale
(4) t 
GR
GR
GS
[0.75 0 0 0.75 145.90909 297.00001] CT
0.149 GC
/Helvetica 13.333 F
GS
[1 0 0 1 0 0] CT
-4 15 moveto 
1 -1 scale
(6) t 
GR
GR
GS
[0.75 0 0 0.75 176.04546 297.00001] CT
0.149 GC
/Helvetica 13.333 F
GS
[1 0 0 1 0 0] CT
-4 15 moveto 
1 -1 scale
(8) t 
GR
GR
GS
[0.75 0 0 0.75 206.18182 297.00001] CT
0.149 GC
/Helvetica 13.333 F
GS
[1 0 0 1 0 0] CT
-8 15 moveto 
1 -1 scale
(10) t 
GR
GR
GS
[0.75 0 0 0.75 236.31818 297.00001] CT
0.149 GC
/Helvetica 13.333 F
GS
[1 0 0 1 0 0] CT
-8 15 moveto 
1 -1 scale
(12) t 
GR
GR
GS
[0.75 0 0 0.75 266.45455 297.00001] CT
0.149 GC
/Helvetica 13.333 F
GS
[1 0 0 1 0 0] CT
-8 15 moveto 
1 -1 scale
(14) t 
GR
GR
GS
[0.75 0 0 0.75 296.59092 297.00001] CT
0.149 GC
/Helvetica 13.333 F
GS
[1 0 0 1 0 0] CT
-8 15 moveto 
1 -1 scale
(16) t 
GR
GR
GS
[0.75 0 0 0.75 326.72726 297.00001] CT
0.149 GC
/Helvetica 13.333 F
GS
[1 0 0 1 0 0] CT
-8 15 moveto 
1 -1 scale
(18) t 
GR
GR
GS
[0.75 0 0 0.75 356.86363 297.00001] CT
0.149 GC
/Helvetica 13.333 F
GS
[1 0 0 1 0 0] CT
-8 15 moveto 
1 -1 scale
(20) t 
GR
GR
GS
[0.75 0 0 0.75 387 297.00001] CT
0.149 GC
/Helvetica 13.333 F
GS
[1 0 0 1 0 0] CT
-8 15 moveto 
1 -1 scale
(22) t 
GR
GR
GS
[0.75 0 0 0.75 221.25016 311.49999] CT
0.149 GC
N
-43.282 22.296 M
-43.282 21.859 -43.188 21.484 QT
-41.095 13.156 L
-44.142 13.156 L
-44.438 13.156 -44.438 12.781 QT
-44.329 12.14 -44.063 12.14 QT
-40.845 12.14 L
-39.688 7.406 L
-39.563 7.031 -39.227 6.757 QT
-38.892 6.484 -38.47 6.484 QT
-38.095 6.484 -37.845 6.702 QT
-37.595 6.921 -37.595 7.296 QT
-37.595 7.374 -37.602 7.429 QT
-37.61 7.484 -37.626 7.531 QT
-38.798 12.14 L
-35.798 12.14 L
-35.501 12.14 -35.501 12.515 QT
-35.517 12.593 -35.563 12.765 QT
-35.61 12.937 -35.681 13.046 QT
-35.751 13.156 -35.892 13.156 QT
-39.048 13.156 L
-41.126 21.546 L
-41.345 22.359 -41.345 22.952 QT
-41.345 24.202 -40.485 24.202 QT
-39.22 24.202 -38.235 23.007 QT
-37.251 21.812 -36.72 20.374 QT
-36.61 20.202 -36.501 20.202 QT
-36.142 20.202 L
-36.032 20.202 -35.962 20.281 QT
-35.892 20.359 -35.892 20.468 QT
-35.892 20.515 -35.923 20.546 QT
-36.548 22.296 -37.767 23.632 QT
-38.985 24.968 -40.563 24.968 QT
-41.704 24.968 -42.493 24.218 QT
-43.282 23.468 -43.282 22.296 QT
cp
f
GR
GS
[0.75 0 0 0.75 221.25016 311.49999] CT
0.149 GC
N
-32.221 22.562 M
-32.221 22.015 -31.986 21.421 QT
-29.643 15.187 L
-29.268 14.124 -29.268 13.437 QT
-29.268 12.577 -29.893 12.577 QT
-31.049 12.577 -31.791 13.757 QT
-32.533 14.937 -32.893 16.406 QT
-32.94 16.577 -33.127 16.577 QT
-33.471 16.577 L
-33.705 16.577 -33.705 16.312 QT
-33.705 16.234 L
-33.236 14.499 -32.276 13.163 QT
-31.315 11.827 -29.846 11.827 QT
-28.815 11.827 -28.096 12.507 QT
-27.377 13.187 -27.377 14.234 QT
-27.377 14.765 -27.611 15.359 QT
-29.971 21.593 L
-30.361 22.562 -30.361 23.343 QT
-30.361 24.202 -29.705 24.202 QT
-28.565 24.202 -27.807 22.991 QT
-27.049 21.781 -26.736 20.374 QT
-26.69 20.202 -26.518 20.202 QT
-26.158 20.202 L
-26.049 20.202 -25.979 20.281 QT
-25.908 20.359 -25.908 20.468 QT
-25.908 20.484 -25.94 20.546 QT
-26.33 22.187 -27.315 23.577 QT
-28.299 24.968 -29.752 24.968 QT
-30.783 24.968 -31.502 24.265 QT
-32.221 23.562 -32.221 22.562 QT
cp
-28.955 7.062 M
-28.955 6.452 -28.44 5.96 QT
-27.924 5.468 -27.315 5.468 QT
-26.83 5.468 -26.51 5.773 QT
-26.19 6.077 -26.19 6.546 QT
-26.19 7.187 -26.705 7.679 QT
-27.221 8.171 -27.846 8.171 QT
-28.315 8.171 -28.635 7.851 QT
-28.955 7.531 -28.955 7.062 QT
cp
f
GR
GS
[0.75 0 0 0.75 221.25016 311.49999] CT
0.149 GC
N
-22.146 24.14 M
-22.146 23.968 -22.115 23.89 QT
-19.943 15.234 L
-19.74 14.437 -19.74 13.827 QT
-19.74 12.577 -20.584 12.577 QT
-21.49 12.577 -21.928 13.663 QT
-22.365 14.749 -22.787 16.406 QT
-22.787 16.484 -22.865 16.531 QT
-22.943 16.577 -23.021 16.577 QT
-23.365 16.577 L
-23.459 16.577 -23.529 16.476 QT
-23.599 16.374 -23.599 16.281 QT
-23.287 15.031 -22.998 14.148 QT
-22.709 13.265 -22.092 12.546 QT
-21.474 11.827 -20.553 11.827 QT
-19.474 11.827 -18.639 12.515 QT
-17.803 13.202 -17.803 14.265 QT
-16.928 13.124 -15.771 12.476 QT
-14.615 11.827 -13.303 11.827 QT
-11.928 11.827 -10.935 12.531 QT
-9.943 13.234 -9.943 14.515 QT
-9.053 13.249 -7.849 12.538 QT
-6.646 11.827 -5.24 11.827 QT
-3.74 11.827 -2.826 12.64 QT
-1.912 13.452 -1.912 14.952 QT
-1.912 16.14 -2.443 17.827 QT
-2.974 19.515 -3.756 21.593 QT
-4.178 22.593 -4.178 23.343 QT
-4.178 24.202 -3.49 24.202 QT
-2.365 24.202 -1.615 22.984 QT
-0.865 21.765 -0.553 20.374 QT
-0.459 20.202 -0.303 20.202 QT
0.026 20.202 L
0.151 20.202 0.229 20.281 QT
0.307 20.359 0.307 20.468 QT
0.307 20.484 0.276 20.546 QT
-0.131 22.187 -1.115 23.577 QT
-2.099 24.968 -3.568 24.968 QT
-4.584 24.968 -5.303 24.265 QT
-6.021 23.562 -6.021 22.562 QT
-6.021 22.046 -5.787 21.421 QT
-4.974 19.249 -4.428 17.531 QT
-3.881 15.812 -3.881 14.515 QT
-3.881 13.702 -4.201 13.14 QT
-4.521 12.577 -5.287 12.577 QT
-6.881 12.577 -8.037 13.546 QT
-9.193 14.515 -10.053 16.109 QT
-10.099 16.406 -10.131 16.562 QT
-12.006 23.999 L
-12.099 24.406 -12.451 24.687 QT
-12.803 24.968 -13.224 24.968 QT
-13.568 24.968 -13.826 24.741 QT
-14.084 24.515 -14.084 24.14 QT
-14.084 23.968 -14.053 23.89 QT
-12.209 16.499 L
-11.912 15.312 -11.912 14.515 QT
-11.912 13.702 -12.24 13.14 QT
-12.568 12.577 -13.365 12.577 QT
-14.428 12.577 -15.318 13.046 QT
-16.209 13.515 -16.873 14.281 QT
-17.537 15.046 -18.099 16.109 QT
-20.068 23.999 L
-20.162 24.406 -20.506 24.687 QT
-20.849 24.968 -21.287 24.968 QT
-21.631 24.968 -21.889 24.741 QT
-22.146 24.515 -22.146 24.14 QT
cp
f
GR
GS
[0.75 0 0 0.75 221.25016 311.49999] CT
0.149 GC
N
7.202 24.968 M
5.827 24.968 4.781 24.241 QT
3.734 23.515 3.195 22.296 QT
2.656 21.077 2.656 19.718 QT
2.656 17.64 3.695 15.82 QT
4.734 13.999 6.515 12.913 QT
8.296 11.827 10.343 11.827 QT
11.577 11.827 12.507 12.468 QT
13.437 13.109 13.437 14.312 QT
13.437 15.984 12.109 16.796 QT
10.781 17.609 9.109 17.804 QT
7.437 17.999 5.406 17.999 QT
5.327 17.999 L
4.859 19.734 4.859 20.952 QT
4.859 22.249 5.452 23.226 QT
6.046 24.202 7.265 24.202 QT
8.999 24.202 10.585 23.406 QT
12.171 22.609 13.187 21.218 QT
13.265 21.124 13.406 21.124 QT
13.546 21.124 13.695 21.288 QT
13.843 21.452 13.843 21.593 QT
13.843 21.702 13.796 21.765 QT
12.734 23.249 10.937 24.109 QT
9.14 24.968 7.202 24.968 QT
cp
5.499 17.249 M
7.187 17.249 8.617 17.093 QT
10.046 16.937 11.202 16.304 QT
12.359 15.671 12.359 14.343 QT
12.359 13.812 12.062 13.406 QT
11.765 12.999 11.288 12.788 QT
10.812 12.577 10.312 12.577 QT
9.077 12.577 8.093 13.241 QT
7.109 13.906 6.468 14.976 QT
5.827 16.046 5.499 17.249 QT
cp
f
GR
GS
[0.75 0 0 0.75 221.25016 311.49999] CT
0.149 GC
N
18.455 31.89 M
18.455 2.89 L
22.423 2.89 L
22.423 4.046 L
19.626 4.046 L
19.626 30.734 L
22.423 30.734 L
22.423 31.89 L
18.455 31.89 L
cp
f
GR
GS
[0.75 0 0 0.75 221.25016 311.49999] CT
0.149 GC
N
25.697 22.874 M
26.478 24.202 28.837 24.202 QT
29.853 24.202 30.775 23.851 QT
31.697 23.499 32.298 22.812 QT
32.9 22.124 32.9 21.124 QT
32.9 20.374 32.361 19.898 QT
31.822 19.421 31.04 19.249 QT
29.462 18.937 L
28.4 18.671 27.704 17.929 QT
27.009 17.187 27.009 16.14 QT
27.009 14.859 27.704 13.866 QT
28.4 12.874 29.548 12.351 QT
30.697 11.827 31.931 11.827 QT
33.243 11.827 34.29 12.452 QT
35.337 13.077 35.337 14.312 QT
35.337 14.984 34.962 15.491 QT
34.587 15.999 33.915 15.999 QT
33.525 15.999 33.251 15.749 QT
32.978 15.499 32.978 15.124 QT
32.978 14.781 33.173 14.46 QT
33.368 14.14 33.681 13.952 QT
33.993 13.765 34.337 13.765 QT
34.087 13.14 33.384 12.859 QT
32.681 12.577 31.868 12.577 QT
31.134 12.577 30.4 12.874 QT
29.665 13.171 29.22 13.741 QT
28.775 14.312 28.775 15.093 QT
28.775 15.624 29.142 16.015 QT
29.509 16.406 30.056 16.577 QT
31.728 16.921 L
32.54 17.093 33.212 17.523 QT
33.884 17.952 34.275 18.616 QT
34.665 19.281 34.665 20.124 QT
34.665 21.202 34.064 22.249 QT
33.462 23.296 32.587 23.921 QT
31.04 24.968 28.806 24.968 QT
27.259 24.968 25.97 24.257 QT
24.681 23.546 24.681 22.14 QT
24.681 21.359 25.142 20.773 QT
25.603 20.187 26.4 20.187 QT
26.868 20.187 27.181 20.468 QT
27.493 20.749 27.493 21.218 QT
27.493 21.874 27.001 22.374 QT
26.509 22.874 25.837 22.874 QT
25.697 22.874 L
cp
f
GR
GS
[0.75 0 0 0.75 221.25016 311.49999] CT
0.149 GC
N
37.572 31.89 M
37.572 30.734 L
40.384 30.734 L
40.384 4.046 L
37.572 4.046 L
37.572 2.89 L
41.54 2.89 L
41.54 31.89 L
37.572 31.89 L
cp
f
GR
GS
[0.75 0 0 0.75 0 0.5] CT
0.149 GC
2 setlinecap
1 LJ
0.667 LW
N
74 390 M
74 38 L
S
GR
GS
[0.75 0 0 0.75 0 0.5] CT
0.149 GC
2 setlinecap
1 LJ
0.667 LW
N
74 390 M
78.42 390 L
S
GR
GS
[0.75 0 0 0.75 0 0.5] CT
0.149 GC
2 setlinecap
1 LJ
0.667 LW
N
74 331.333 M
78.42 331.333 L
S
GR
GS
[0.75 0 0 0.75 0 0.5] CT
0.149 GC
2 setlinecap
1 LJ
0.667 LW
N
74 272.667 M
78.42 272.667 L
S
GR
GS
[0.75 0 0 0.75 0 0.5] CT
0.149 GC
2 setlinecap
1 LJ
0.667 LW
N
74 214 M
78.42 214 L
S
GR
GS
[0.75 0 0 0.75 0 0.5] CT
0.149 GC
2 setlinecap
1 LJ
0.667 LW
N
74 155.333 M
78.42 155.333 L
S
GR
GS
[0.75 0 0 0.75 0 0.5] CT
0.149 GC
2 setlinecap
1 LJ
0.667 LW
N
74 96.667 M
78.42 96.667 L
S
GR
GS
[0.75 0 0 0.75 0 0.5] CT
0.149 GC
2 setlinecap
1 LJ
0.667 LW
N
74 38 M
78.42 38 L
S
GR
GS
[0.75 0 0 0.75 51.5 293] CT
0.149 GC
/Helvetica 13.333 F
GS
[1 0 0 1 0 0] CT
-8 5.5 moveto 
1 -1 scale
(0) t 
GR
GR
GS
[0.75 0 0 0.75 51.5 249.00001] CT
0.149 GC
/Helvetica 13.333 F
GS
[1 0 0 1 0 0] CT
-19 5.5 moveto 
1 -1 scale
(0.2) t 
GR
GR
GS
[0.75 0 0 0.75 51.5 204.99999] CT
0.149 GC
/Helvetica 13.333 F
GS
[1 0 0 1 0 0] CT
-19 5.5 moveto 
1 -1 scale
(0.4) t 
GR
GR
GS
[0.75 0 0 0.75 51.5 161] CT
0.149 GC
/Helvetica 13.333 F
GS
[1 0 0 1 0 0] CT
-19 5.5 moveto 
1 -1 scale
(0.6) t 
GR
GR
GS
[0.75 0 0 0.75 51.5 117] CT
0.149 GC
/Helvetica 13.333 F
GS
[1 0 0 1 0 0] CT
-19 5.5 moveto 
1 -1 scale
(0.8) t 
GR
GR
GS
[0.75 0 0 0.75 51.5 73] CT
0.149 GC
/Helvetica 13.333 F
GS
[1 0 0 1 0 0] CT
-8 5.5 moveto 
1 -1 scale
(1) t 
GR
GR
GS
[0.75 0 0 0.75 51.5 28.99999] CT
0.149 GC
/Helvetica 13.333 F
GS
[1 0 0 1 0 0] CT
-19 5.5 moveto 
1 -1 scale
(1.2) t 
GR
GR
GS
[0 -0.75 0.75 0 34.25 160.99986] CT
0.149 GC
N
-61.797 -13.716 M
-61.797 -14.669 -61.547 -15.669 QT
-61.297 -16.669 -60.837 -17.888 QT
-60.376 -19.107 -60.032 -20.013 QT
-59.657 -21.076 -59.657 -21.763 QT
-59.657 -22.623 -60.282 -22.623 QT
-61.438 -22.623 -62.18 -21.443 QT
-62.922 -20.263 -63.282 -18.794 QT
-63.329 -18.623 -63.516 -18.623 QT
-63.86 -18.623 L
-64.094 -18.623 -64.094 -18.888 QT
-64.094 -18.966 L
-63.626 -20.701 -62.665 -22.037 QT
-61.704 -23.373 -60.235 -23.373 QT
-59.204 -23.373 -58.485 -22.693 QT
-57.766 -22.013 -57.766 -20.966 QT
-57.766 -20.435 -58.001 -19.841 QT
-58.141 -19.482 -58.594 -18.294 QT
-59.047 -17.107 -59.282 -16.326 QT
-59.516 -15.544 -59.672 -14.794 QT
-59.829 -14.044 -59.829 -13.294 QT
-59.829 -12.326 -59.422 -11.662 QT
-59.016 -10.998 -58.094 -10.998 QT
-56.235 -10.998 -54.829 -13.294 QT
-54.813 -13.404 -54.79 -13.513 QT
-54.766 -13.623 -54.751 -13.716 QT
-52.672 -22.123 L
-52.563 -22.513 -52.212 -22.787 QT
-51.86 -23.06 -51.454 -23.06 QT
-51.094 -23.06 -50.837 -22.834 QT
-50.579 -22.607 -50.579 -22.248 QT
-50.579 -22.076 -50.594 -22.013 QT
-52.704 -13.654 L
-52.891 -12.794 -52.891 -12.248 QT
-52.891 -10.998 -52.063 -10.998 QT
-51.126 -10.998 -50.665 -12.154 QT
-50.204 -13.31 -49.876 -14.826 QT
-49.829 -14.998 -49.657 -14.998 QT
-49.297 -14.998 L
-49.188 -14.998 -49.118 -14.896 QT
-49.047 -14.794 -49.047 -14.716 QT
-49.36 -13.466 -49.649 -12.576 QT
-49.938 -11.685 -50.563 -10.959 QT
-51.188 -10.232 -52.11 -10.232 QT
-53.032 -10.232 -53.766 -10.74 QT
-54.501 -11.248 -54.751 -12.107 QT
-55.422 -11.248 -56.297 -10.74 QT
-57.172 -10.232 -58.157 -10.232 QT
-59.813 -10.232 -60.805 -11.146 QT
-61.797 -12.06 -61.797 -13.716 QT
cp
f
GR
GS
[0 -0.75 0.75 0 34.25 160.99986] CT
0.149 GC
N
-44.427 -5.926 M
-45.755 -5.926 -46.521 -6.926 QT
-47.287 -7.926 -47.287 -9.285 QT
-47.287 -10.629 -46.591 -12.074 QT
-45.896 -13.52 -44.708 -14.48 QT
-43.521 -15.441 -42.162 -15.441 QT
-41.537 -15.441 -41.044 -15.105 QT
-40.552 -14.77 -40.271 -14.176 QT
-40.037 -15.02 -39.349 -15.02 QT
-39.083 -15.02 -38.904 -14.863 QT
-38.724 -14.707 -38.724 -14.441 QT
-38.724 -14.379 -38.724 -14.348 QT
-38.724 -14.316 -38.74 -14.27 QT
-40.208 -8.41 L
-40.349 -7.785 -40.349 -7.379 QT
-40.349 -6.473 -39.74 -6.473 QT
-39.083 -6.473 -38.74 -7.309 QT
-38.396 -8.145 -38.162 -9.254 QT
-38.13 -9.363 -38.005 -9.363 QT
-37.74 -9.363 L
-37.662 -9.363 -37.615 -9.293 QT
-37.568 -9.223 -37.568 -9.16 QT
-37.927 -7.691 -38.365 -6.809 QT
-38.802 -5.926 -39.787 -5.926 QT
-40.49 -5.926 -41.037 -6.34 QT
-41.583 -6.754 -41.708 -7.441 QT
-43.068 -5.926 -44.427 -5.926 QT
cp
-44.412 -6.473 M
-43.646 -6.473 -42.935 -7.043 QT
-42.224 -7.613 -41.708 -8.379 QT
-41.693 -8.41 -41.693 -8.441 QT
-40.568 -13.004 L
-40.552 -13.066 L
-40.677 -13.816 -41.091 -14.355 QT
-41.505 -14.895 -42.208 -14.895 QT
-42.912 -14.895 -43.521 -14.316 QT
-44.13 -13.738 -44.552 -12.941 QT
-44.958 -12.113 -45.333 -10.645 QT
-45.708 -9.176 -45.708 -8.363 QT
-45.708 -7.645 -45.396 -7.059 QT
-45.083 -6.473 -44.412 -6.473 QT
cp
f
GR
GS
[0 -0.75 0.75 0 34.25 160.99986] CT
0.149 GC
N
-33.605 -5.926 M
-34.87 -5.926 -35.581 -6.918 QT
-36.292 -7.91 -36.292 -9.254 QT
-36.292 -9.441 -36.191 -10.012 QT
-36.089 -10.582 -36.089 -10.707 QT
-34.058 -18.863 L
-33.98 -19.223 -33.964 -19.426 QT
-33.964 -19.77 -35.324 -19.77 QT
-35.527 -19.77 -35.527 -20.051 QT
-35.511 -20.098 -35.48 -20.23 QT
-35.449 -20.363 -35.394 -20.434 QT
-35.339 -20.504 -35.23 -20.504 QT
-32.402 -20.738 L
-32.136 -20.738 -32.136 -20.457 QT
-33.699 -14.27 L
-32.511 -15.441 -31.308 -15.441 QT
-30.417 -15.441 -29.777 -14.973 QT
-29.136 -14.504 -28.816 -13.73 QT
-28.495 -12.957 -28.495 -12.082 QT
-28.495 -11.066 -28.886 -9.988 QT
-29.277 -8.91 -29.98 -7.98 QT
-30.683 -7.051 -31.613 -6.488 QT
-32.542 -5.926 -33.605 -5.926 QT
cp
-33.558 -6.473 M
-32.839 -6.473 -32.214 -7.074 QT
-31.589 -7.676 -31.199 -8.426 QT
-30.777 -9.27 -30.417 -10.707 QT
-30.058 -12.145 -30.058 -13.004 QT
-30.058 -13.754 -30.37 -14.324 QT
-30.683 -14.895 -31.355 -14.895 QT
-32.12 -14.895 -32.808 -14.34 QT
-33.495 -13.785 -34.027 -13.004 QT
-34.605 -10.629 L
-34.949 -9.301 -34.964 -8.504 QT
-34.964 -7.723 -34.62 -7.098 QT
-34.277 -6.473 -33.558 -6.473 QT
cp
f
GR
GS
[0 -0.75 0.75 0 34.25 160.99986] CT
0.149 GC
N
-26.589 -7.441 M
-26.027 -6.473 -24.324 -6.473 QT
-23.589 -6.473 -22.925 -6.73 QT
-22.261 -6.988 -21.824 -7.488 QT
-21.386 -7.988 -21.386 -8.707 QT
-21.386 -9.254 -21.777 -9.598 QT
-22.168 -9.941 -22.73 -10.066 QT
-23.871 -10.285 L
-24.636 -10.488 -25.144 -11.02 QT
-25.652 -11.551 -25.652 -12.316 QT
-25.652 -13.238 -25.144 -13.957 QT
-24.636 -14.676 -23.808 -15.059 QT
-22.98 -15.441 -22.074 -15.441 QT
-21.121 -15.441 -20.371 -14.988 QT
-19.621 -14.535 -19.621 -13.629 QT
-19.621 -13.16 -19.894 -12.785 QT
-20.168 -12.41 -20.652 -12.41 QT
-20.918 -12.41 -21.121 -12.59 QT
-21.324 -12.77 -21.324 -13.051 QT
-21.324 -13.301 -21.183 -13.527 QT
-21.043 -13.754 -20.816 -13.895 QT
-20.589 -14.035 -20.339 -14.035 QT
-20.527 -14.488 -21.035 -14.691 QT
-21.543 -14.895 -22.121 -14.895 QT
-22.652 -14.895 -23.183 -14.684 QT
-23.714 -14.473 -24.043 -14.051 QT
-24.371 -13.629 -24.371 -13.066 QT
-24.371 -12.691 -24.105 -12.402 QT
-23.839 -12.113 -23.449 -11.988 QT
-22.23 -11.754 L
-21.636 -11.629 -21.152 -11.316 QT
-20.668 -11.004 -20.386 -10.527 QT
-20.105 -10.051 -20.105 -9.426 QT
-20.105 -8.645 -20.543 -7.887 QT
-20.98 -7.129 -21.605 -6.676 QT
-22.73 -5.926 -24.339 -5.926 QT
-25.464 -5.926 -26.394 -6.441 QT
-27.324 -6.957 -27.324 -7.973 QT
-27.324 -8.535 -26.996 -8.965 QT
-26.668 -9.395 -26.089 -9.395 QT
-25.746 -9.395 -25.519 -9.184 QT
-25.293 -8.973 -25.293 -8.645 QT
-25.293 -8.16 -25.652 -7.801 QT
-26.011 -7.441 -26.496 -7.441 QT
-26.589 -7.441 L
cp
f
GR
GS
[0 -0.75 0.75 0 34.25 160.99986] CT
0.149 GC
N
-13.904 -3.31 M
-13.904 -32.31 L
-9.935 -32.31 L
-9.935 -31.154 L
-12.732 -31.154 L
-12.732 -4.466 L
-9.935 -4.466 L
-9.935 -3.31 L
-13.904 -3.31 L
cp
f
GR
GS
[0 -0.75 0.75 0 34.25 160.99986] CT
0.149 GC
N
-6.943 -11.06 M
-6.943 -11.232 -6.912 -11.31 QT
-4.74 -19.966 L
-4.537 -20.763 -4.537 -21.373 QT
-4.537 -22.623 -5.381 -22.623 QT
-6.287 -22.623 -6.725 -21.537 QT
-7.162 -20.451 -7.584 -18.794 QT
-7.584 -18.716 -7.662 -18.669 QT
-7.74 -18.623 -7.818 -18.623 QT
-8.162 -18.623 L
-8.256 -18.623 -8.326 -18.724 QT
-8.396 -18.826 -8.396 -18.919 QT
-8.084 -20.169 -7.795 -21.052 QT
-7.506 -21.935 -6.889 -22.654 QT
-6.271 -23.373 -5.35 -23.373 QT
-4.271 -23.373 -3.436 -22.685 QT
-2.6 -21.998 -2.6 -20.935 QT
-1.725 -22.076 -0.568 -22.724 QT
0.588 -23.373 1.9 -23.373 QT
3.275 -23.373 4.268 -22.669 QT
5.26 -21.966 5.26 -20.685 QT
6.15 -21.951 7.354 -22.662 QT
8.557 -23.373 9.963 -23.373 QT
11.463 -23.373 12.377 -22.56 QT
13.291 -21.748 13.291 -20.248 QT
13.291 -19.06 12.76 -17.373 QT
12.229 -15.685 11.447 -13.607 QT
11.025 -12.607 11.025 -11.857 QT
11.025 -10.998 11.713 -10.998 QT
12.838 -10.998 13.588 -12.216 QT
14.338 -13.435 14.65 -14.826 QT
14.744 -14.998 14.9 -14.998 QT
15.229 -14.998 L
15.354 -14.998 15.432 -14.919 QT
15.51 -14.841 15.51 -14.732 QT
15.51 -14.716 15.479 -14.654 QT
15.072 -13.013 14.088 -11.623 QT
13.104 -10.232 11.635 -10.232 QT
10.619 -10.232 9.9 -10.935 QT
9.182 -11.638 9.182 -12.638 QT
9.182 -13.154 9.416 -13.779 QT
10.229 -15.951 10.775 -17.669 QT
11.322 -19.388 11.322 -20.685 QT
11.322 -21.498 11.002 -22.06 QT
10.682 -22.623 9.916 -22.623 QT
8.322 -22.623 7.166 -21.654 QT
6.01 -20.685 5.15 -19.091 QT
5.104 -18.794 5.072 -18.638 QT
3.197 -11.201 L
3.104 -10.794 2.752 -10.513 QT
2.4 -10.232 1.979 -10.232 QT
1.635 -10.232 1.377 -10.459 QT
1.119 -10.685 1.119 -11.06 QT
1.119 -11.232 1.15 -11.31 QT
2.994 -18.701 L
3.291 -19.888 3.291 -20.685 QT
3.291 -21.498 2.963 -22.06 QT
2.635 -22.623 1.838 -22.623 QT
0.775 -22.623 -0.115 -22.154 QT
-1.006 -21.685 -1.67 -20.919 QT
-2.334 -20.154 -2.896 -19.091 QT
-4.865 -11.201 L
-4.959 -10.794 -5.303 -10.513 QT
-5.646 -10.232 -6.084 -10.232 QT
-6.428 -10.232 -6.686 -10.459 QT
-6.943 -10.685 -6.943 -11.06 QT
cp
f
GR
GS
[0 -0.75 0.75 0 34.25 160.99986] CT
0.149 GC
N
18.202 -3.888 M
18.202 -3.982 18.234 -3.998 QT
28.312 -31.951 L
28.374 -32.123 28.515 -32.216 QT
28.655 -32.31 28.843 -32.31 QT
29.093 -32.31 29.257 -32.154 QT
29.421 -31.998 29.421 -31.732 QT
29.421 -31.623 L
19.343 -3.669 L
19.171 -3.31 18.78 -3.31 QT
18.546 -3.31 18.374 -3.482 QT
18.202 -3.654 18.202 -3.888 QT
cp
f
GR
GS
[0 -0.75 0.75 0 34.25 160.99986] CT
0.149 GC
N
33.76 -12.326 M
34.541 -10.998 36.9 -10.998 QT
37.916 -10.998 38.838 -11.349 QT
39.76 -11.701 40.361 -12.388 QT
40.963 -13.076 40.963 -14.076 QT
40.963 -14.826 40.424 -15.302 QT
39.885 -15.779 39.103 -15.951 QT
37.525 -16.263 L
36.463 -16.529 35.767 -17.271 QT
35.072 -18.013 35.072 -19.06 QT
35.072 -20.341 35.767 -21.334 QT
36.463 -22.326 37.611 -22.849 QT
38.76 -23.373 39.994 -23.373 QT
41.307 -23.373 42.353 -22.748 QT
43.4 -22.123 43.4 -20.888 QT
43.4 -20.216 43.025 -19.709 QT
42.65 -19.201 41.978 -19.201 QT
41.588 -19.201 41.314 -19.451 QT
41.041 -19.701 41.041 -20.076 QT
41.041 -20.419 41.236 -20.74 QT
41.432 -21.06 41.744 -21.248 QT
42.057 -21.435 42.4 -21.435 QT
42.15 -22.06 41.447 -22.341 QT
40.744 -22.623 39.932 -22.623 QT
39.197 -22.623 38.463 -22.326 QT
37.728 -22.029 37.283 -21.459 QT
36.838 -20.888 36.838 -20.107 QT
36.838 -19.576 37.205 -19.185 QT
37.572 -18.794 38.119 -18.623 QT
39.791 -18.279 L
40.603 -18.107 41.275 -17.677 QT
41.947 -17.248 42.338 -16.584 QT
42.728 -15.919 42.728 -15.076 QT
42.728 -13.998 42.127 -12.951 QT
41.525 -11.904 40.65 -11.279 QT
39.103 -10.232 36.869 -10.232 QT
35.322 -10.232 34.033 -10.943 QT
32.744 -11.654 32.744 -13.06 QT
32.744 -13.841 33.205 -14.427 QT
33.666 -15.013 34.463 -15.013 QT
34.932 -15.013 35.244 -14.732 QT
35.557 -14.451 35.557 -13.982 QT
35.557 -13.326 35.064 -12.826 QT
34.572 -12.326 33.9 -12.326 QT
33.76 -12.326 L
cp
f
GR
GS
[0 -0.75 0.75 0 34.25 160.99986] CT
0.149 GC
N
46.041 -21.205 M
46.041 -21.767 L
46.041 -21.814 46.088 -21.877 QT
49.338 -25.486 L
50.088 -26.299 50.549 -26.838 QT
51.01 -27.377 51.455 -28.088 QT
51.9 -28.799 52.166 -29.525 QT
52.432 -30.252 52.432 -31.08 QT
52.432 -31.939 52.111 -32.728 QT
51.791 -33.517 51.158 -33.986 QT
50.525 -34.455 49.635 -34.455 QT
48.728 -34.455 48.002 -33.908 QT
47.275 -33.361 46.978 -32.486 QT
47.057 -32.502 47.197 -32.502 QT
47.666 -32.502 48.002 -32.189 QT
48.338 -31.877 48.338 -31.361 QT
48.338 -30.892 48.002 -30.557 QT
47.666 -30.221 47.197 -30.221 QT
46.713 -30.221 46.377 -30.564 QT
46.041 -30.908 46.041 -31.361 QT
46.041 -32.158 46.338 -32.846 QT
46.635 -33.533 47.197 -34.072 QT
47.76 -34.611 48.455 -34.9 QT
49.15 -35.189 49.947 -35.189 QT
51.15 -35.189 52.182 -34.682 QT
53.213 -34.174 53.822 -33.244 QT
54.432 -32.314 54.432 -31.08 QT
54.432 -30.174 54.033 -29.353 QT
53.635 -28.533 53.01 -27.861 QT
52.385 -27.189 51.408 -26.338 QT
50.432 -25.486 50.119 -25.189 QT
47.744 -22.908 L
49.76 -22.908 L
51.244 -22.908 52.244 -22.932 QT
53.244 -22.955 53.307 -23.017 QT
53.557 -23.283 53.807 -24.955 QT
54.432 -24.955 L
53.838 -21.205 L
46.041 -21.205 L
cp
f
GR
GS
[0 -0.75 0.75 0 34.25 160.99986] CT
0.149 GC
N
57.368 -3.31 M
57.368 -4.466 L
60.181 -4.466 L
60.181 -31.154 L
57.368 -31.154 L
57.368 -32.31 L
61.337 -32.31 L
61.337 -3.31 L
57.368 -3.31 L
cp
f
GR
GS
[0.75 0 0 0.75 221.25021 25.22855] CT
N
-261.369 -9.6 M
-261.369 -10.553 L
-258.588 -10.553 -258.588 -11.413 QT
-258.588 -26.241 L
-258.588 -27.1 -261.369 -27.1 QT
-261.369 -28.038 L
-251.416 -28.038 L
-249.557 -28.038 -248.033 -27.241 QT
-246.51 -26.444 -245.424 -25.116 QT
-244.338 -23.788 -243.752 -22.1 QT
-243.166 -20.413 -243.166 -18.647 QT
-243.166 -16.928 -243.76 -15.311 QT
-244.353 -13.694 -245.471 -12.397 QT
-246.588 -11.1 -248.111 -10.35 QT
-249.635 -9.6 -251.416 -9.6 QT
-261.369 -9.6 L
cp
-256.15 -11.413 M
-256.15 -10.819 -255.822 -10.686 QT
-255.494 -10.553 -254.791 -10.553 QT
-252.103 -10.553 L
-250.728 -10.553 -249.478 -11.155 QT
-248.228 -11.756 -247.416 -12.819 QT
-246.557 -13.944 -246.268 -15.35 QT
-245.978 -16.756 -245.978 -18.647 QT
-245.978 -20.616 -246.268 -22.092 QT
-246.557 -23.569 -247.416 -24.725 QT
-248.213 -25.866 -249.455 -26.483 QT
-250.697 -27.1 -252.103 -27.1 QT
-254.791 -27.1 L
-255.275 -27.1 -255.541 -27.061 QT
-255.807 -27.022 -255.978 -26.827 QT
-256.15 -26.631 -256.15 -26.241 QT
-256.15 -11.413 L
cp
f
GR
GS
[0.75 0 0 0.75 221.25021 25.22855] CT
N
-241.061 -9.6 M
-241.061 -10.553 L
-240.139 -10.553 -239.546 -10.694 QT
-238.952 -10.834 -238.952 -11.413 QT
-238.952 -18.772 L
-238.952 -19.819 -239.35 -20.053 QT
-239.749 -20.288 -240.936 -20.288 QT
-240.936 -21.241 L
-237.046 -21.538 L
-237.046 -11.413 L
-237.046 -10.834 -236.538 -10.694 QT
-236.03 -10.553 -235.171 -10.553 QT
-235.171 -9.6 L
-241.061 -9.6 L
cp
-239.905 -26.178 M
-239.905 -26.772 -239.46 -27.217 QT
-239.014 -27.663 -238.436 -27.663 QT
-238.046 -27.663 -237.694 -27.467 QT
-237.342 -27.272 -237.147 -26.913 QT
-236.952 -26.553 -236.952 -26.178 QT
-236.952 -25.584 -237.397 -25.139 QT
-237.842 -24.694 -238.436 -24.694 QT
-239.014 -24.694 -239.46 -25.139 QT
-239.905 -25.584 -239.905 -26.178 QT
cp
f
GR
GS
[0.75 0 0 0.75 221.25021 25.22855] CT
N
-233.591 -9.522 M
-233.591 -13.928 L
-233.591 -14.131 -233.341 -14.131 QT
-233.013 -14.131 L
-232.857 -14.131 -232.81 -13.928 QT
-232.06 -10.006 -229.169 -10.006 QT
-227.888 -10.006 -227.029 -10.584 QT
-226.169 -11.163 -226.169 -12.381 QT
-226.169 -13.256 -226.841 -13.866 QT
-227.513 -14.475 -228.435 -14.709 QT
-230.232 -15.053 L
-231.154 -15.256 -231.896 -15.663 QT
-232.638 -16.069 -233.115 -16.749 QT
-233.591 -17.428 -233.591 -18.334 QT
-233.591 -19.522 -232.958 -20.28 QT
-232.326 -21.038 -231.326 -21.374 QT
-230.326 -21.709 -229.169 -21.709 QT
-227.779 -21.709 -226.763 -20.959 QT
-225.982 -21.631 L
-225.982 -21.709 -225.841 -21.709 QT
-225.654 -21.709 L
-225.576 -21.709 -225.505 -21.631 QT
-225.435 -21.553 -225.435 -21.475 QT
-225.435 -17.944 L
-225.435 -17.694 -225.654 -17.694 QT
-225.982 -17.694 L
-226.216 -17.694 -226.216 -17.944 QT
-226.216 -19.35 -226.998 -20.209 QT
-227.779 -21.069 -229.201 -21.069 QT
-230.404 -21.069 -231.294 -20.624 QT
-232.185 -20.178 -232.185 -19.084 QT
-232.185 -18.334 -231.544 -17.85 QT
-230.904 -17.366 -230.044 -17.147 QT
-228.216 -16.819 L
-227.294 -16.6 -226.498 -16.1 QT
-225.701 -15.6 -225.232 -14.834 QT
-224.763 -14.069 -224.763 -13.1 QT
-224.763 -12.131 -225.099 -11.413 QT
-225.435 -10.694 -226.037 -10.217 QT
-226.638 -9.741 -227.458 -9.522 QT
-228.279 -9.303 -229.169 -9.303 QT
-230.857 -9.303 -232.06 -10.428 QT
-233.044 -9.366 L
-233.044 -9.303 -233.185 -9.303 QT
-233.341 -9.303 L
-233.591 -9.303 -233.591 -9.522 QT
cp
f
GR
GS
[0.75 0 0 0.75 221.25021 25.22855] CT
N
-217.245 -9.303 M
-218.87 -9.303 -220.206 -10.147 QT
-221.542 -10.991 -222.307 -12.413 QT
-223.073 -13.834 -223.073 -15.428 QT
-223.073 -17.022 -222.315 -18.483 QT
-221.557 -19.944 -220.213 -20.827 QT
-218.87 -21.709 -217.245 -21.709 QT
-215.651 -21.709 -214.354 -21.084 QT
-213.057 -20.459 -213.057 -19.053 QT
-213.057 -18.522 -213.432 -18.131 QT
-213.807 -17.741 -214.354 -17.741 QT
-214.885 -17.741 -215.268 -18.131 QT
-215.651 -18.522 -215.651 -19.053 QT
-215.651 -19.522 -215.346 -19.874 QT
-215.042 -20.225 -214.588 -20.319 QT
-215.526 -20.913 -217.213 -20.913 QT
-218.51 -20.913 -219.299 -20.053 QT
-220.088 -19.194 -220.401 -17.928 QT
-220.713 -16.663 -220.713 -15.428 QT
-220.713 -14.116 -220.331 -12.897 QT
-219.948 -11.678 -219.081 -10.881 QT
-218.213 -10.084 -216.917 -10.084 QT
-215.635 -10.084 -214.737 -10.874 QT
-213.838 -11.663 -213.51 -12.928 QT
-213.51 -13.084 -213.292 -13.084 QT
-212.963 -13.084 L
-212.885 -13.084 -212.823 -13.006 QT
-212.76 -12.928 -212.76 -12.85 QT
-212.76 -12.772 L
-213.167 -11.163 -214.377 -10.233 QT
-215.588 -9.303 -217.245 -9.303 QT
cp
f
GR
GS
[0.75 0 0 0.75 221.25021 25.22855] CT
N
-205.362 -9.303 M
-206.987 -9.303 -208.369 -10.124 QT
-209.752 -10.944 -210.557 -12.327 QT
-211.362 -13.709 -211.362 -15.35 QT
-211.362 -16.584 -210.916 -17.733 QT
-210.471 -18.881 -209.651 -19.788 QT
-208.83 -20.694 -207.737 -21.202 QT
-206.643 -21.709 -205.362 -21.709 QT
-203.705 -21.709 -202.338 -20.827 QT
-200.971 -19.944 -200.182 -18.475 QT
-199.393 -17.006 -199.393 -15.35 QT
-199.393 -13.725 -200.197 -12.334 QT
-201.002 -10.944 -202.377 -10.124 QT
-203.752 -9.303 -205.362 -9.303 QT
cp
-205.362 -10.084 M
-203.205 -10.084 -202.479 -11.655 QT
-201.752 -13.225 -201.752 -15.647 QT
-201.752 -17.006 -201.893 -17.897 QT
-202.033 -18.788 -202.533 -19.522 QT
-202.83 -19.959 -203.299 -20.295 QT
-203.768 -20.631 -204.291 -20.811 QT
-204.815 -20.991 -205.362 -20.991 QT
-206.205 -20.991 -206.963 -20.608 QT
-207.721 -20.225 -208.221 -19.522 QT
-208.721 -18.756 -208.862 -17.834 QT
-209.002 -16.913 -209.002 -15.647 QT
-209.002 -14.131 -208.737 -12.928 QT
-208.471 -11.725 -207.674 -10.905 QT
-206.877 -10.084 -205.362 -10.084 QT
cp
f
GR
GS
[0.75 0 0 0.75 221.25021 25.22855] CT
N
-195.872 -12.819 M
-195.872 -18.772 L
-195.872 -19.506 -196.083 -19.827 QT
-196.294 -20.147 -196.708 -20.217 QT
-197.122 -20.288 -197.981 -20.288 QT
-197.981 -21.241 L
-193.888 -21.538 L
-193.888 -12.819 L
-193.888 -11.756 -193.739 -11.17 QT
-193.591 -10.584 -193.091 -10.295 QT
-192.591 -10.006 -191.513 -10.006 QT
-190.059 -10.006 -189.208 -11.217 QT
-188.356 -12.428 -188.356 -13.975 QT
-188.356 -18.772 L
-188.356 -19.506 -188.575 -19.827 QT
-188.794 -20.147 -189.2 -20.217 QT
-189.606 -20.288 -190.466 -20.288 QT
-190.466 -21.241 L
-186.388 -21.538 L
-186.388 -12.053 L
-186.388 -11.334 -186.169 -11.014 QT
-185.95 -10.694 -185.544 -10.624 QT
-185.138 -10.553 -184.278 -10.553 QT
-184.278 -9.6 L
-188.278 -9.303 L
-188.278 -11.584 L
-188.778 -10.569 -189.669 -9.936 QT
-190.559 -9.303 -191.653 -9.303 QT
-193.591 -9.303 -194.731 -10.124 QT
-195.872 -10.944 -195.872 -12.819 QT
cp
f
GR
GS
[0.75 0 0 0.75 221.25021 25.22855] CT
N
-183.166 -9.6 M
-183.166 -10.553 L
-182.229 -10.553 -181.643 -10.694 QT
-181.057 -10.834 -181.057 -11.413 QT
-181.057 -18.772 L
-181.057 -19.506 -181.268 -19.827 QT
-181.479 -20.147 -181.893 -20.217 QT
-182.307 -20.288 -183.166 -20.288 QT
-183.166 -21.241 L
-179.245 -21.538 L
-179.245 -18.897 L
-178.698 -20.053 -177.635 -20.795 QT
-176.573 -21.538 -175.323 -21.538 QT
-173.463 -21.538 -172.518 -20.639 QT
-171.573 -19.741 -171.573 -17.897 QT
-171.573 -11.413 L
-171.573 -10.834 -170.979 -10.694 QT
-170.385 -10.553 -169.463 -10.553 QT
-169.463 -9.6 L
-175.651 -9.6 L
-175.651 -10.553 L
-174.729 -10.553 -174.135 -10.694 QT
-173.541 -10.834 -173.541 -11.413 QT
-173.541 -17.819 L
-173.541 -19.131 -173.924 -19.983 QT
-174.307 -20.834 -175.479 -20.834 QT
-177.057 -20.834 -178.065 -19.584 QT
-179.073 -18.334 -179.073 -16.725 QT
-179.073 -11.413 L
-179.073 -10.834 -178.479 -10.694 QT
-177.885 -10.553 -176.979 -10.553 QT
-176.979 -9.6 L
-183.166 -9.6 L
cp
f
GR
GS
[0.75 0 0 0.75 221.25021 25.22855] CT
N
-167.139 -12.85 M
-167.139 -20.288 L
-169.374 -20.288 L
-169.374 -20.991 L
-167.608 -20.991 -166.78 -22.639 QT
-165.952 -24.288 -165.952 -26.209 QT
-165.17 -26.209 L
-165.17 -21.241 L
-161.358 -21.241 L
-161.358 -20.288 L
-165.17 -20.288 L
-165.17 -12.897 L
-165.17 -11.772 -164.795 -10.928 QT
-164.42 -10.084 -163.436 -10.084 QT
-162.514 -10.084 -162.108 -10.975 QT
-161.702 -11.866 -161.702 -12.897 QT
-161.702 -14.491 L
-160.92 -14.491 L
-160.92 -12.85 L
-160.92 -12.006 -161.233 -11.178 QT
-161.545 -10.35 -162.155 -9.827 QT
-162.764 -9.303 -163.624 -9.303 QT
-165.249 -9.303 -166.194 -10.272 QT
-167.139 -11.241 -167.139 -12.85 QT
cp
f
GR
GS
[0.75 0 0 0.75 221.25021 25.22855] CT
N
-152.8 -9.303 M
-154.441 -9.303 -155.816 -10.163 QT
-157.191 -11.022 -157.98 -12.467 QT
-158.769 -13.913 -158.769 -15.522 QT
-158.769 -17.1 -158.05 -18.522 QT
-157.331 -19.944 -156.042 -20.827 QT
-154.753 -21.709 -153.175 -21.709 QT
-151.941 -21.709 -151.027 -21.288 QT
-150.113 -20.866 -149.519 -20.131 QT
-148.925 -19.397 -148.62 -18.397 QT
-148.316 -17.397 -148.316 -16.194 QT
-148.316 -15.834 -148.597 -15.834 QT
-156.409 -15.834 L
-156.409 -15.553 L
-156.409 -13.303 -155.503 -11.694 QT
-154.597 -10.084 -152.55 -10.084 QT
-151.722 -10.084 -151.019 -10.452 QT
-150.316 -10.819 -149.792 -11.483 QT
-149.269 -12.147 -149.097 -12.897 QT
-149.066 -12.991 -148.995 -13.061 QT
-148.925 -13.131 -148.831 -13.131 QT
-148.597 -13.131 L
-148.316 -13.131 -148.316 -12.788 QT
-148.691 -11.256 -149.956 -10.28 QT
-151.222 -9.303 -152.8 -9.303 QT
cp
-156.378 -16.506 M
-150.222 -16.506 L
-150.222 -17.522 -150.503 -18.561 QT
-150.784 -19.6 -151.448 -20.295 QT
-152.113 -20.991 -153.175 -20.991 QT
-154.706 -20.991 -155.542 -19.561 QT
-156.378 -18.131 -156.378 -16.506 QT
cp
f
GR
GS
[0.75 0 0 0.75 221.25021 25.22855] CT
N
-141.073 -9.303 M
-142.667 -9.303 -143.987 -10.163 QT
-145.308 -11.022 -146.042 -12.436 QT
-146.776 -13.85 -146.776 -15.428 QT
-146.776 -17.069 -145.979 -18.467 QT
-145.183 -19.866 -143.808 -20.702 QT
-142.433 -21.538 -140.792 -21.538 QT
-139.792 -21.538 -138.909 -21.116 QT
-138.026 -20.694 -137.386 -19.959 QT
-137.386 -25.584 L
-137.386 -26.303 -137.604 -26.624 QT
-137.823 -26.944 -138.222 -27.022 QT
-138.62 -27.1 -139.479 -27.1 QT
-139.479 -28.038 L
-135.479 -28.334 L
-135.479 -12.053 L
-135.479 -11.334 -135.269 -11.014 QT
-135.058 -10.694 -134.651 -10.624 QT
-134.245 -10.553 -133.386 -10.553 QT
-133.386 -9.6 L
-137.464 -9.303 L
-137.464 -10.991 L
-138.167 -10.194 -139.128 -9.749 QT
-140.089 -9.303 -141.073 -9.303 QT
cp
-143.823 -11.944 M
-143.37 -11.069 -142.597 -10.538 QT
-141.823 -10.006 -140.917 -10.006 QT
-139.792 -10.006 -138.854 -10.655 QT
-137.917 -11.303 -137.464 -12.334 QT
-137.464 -18.803 L
-137.776 -19.397 -138.261 -19.866 QT
-138.745 -20.334 -139.347 -20.584 QT
-139.948 -20.834 -140.62 -20.834 QT
-142.026 -20.834 -142.886 -20.038 QT
-143.745 -19.241 -144.081 -17.999 QT
-144.417 -16.756 -144.417 -15.397 QT
-144.417 -14.319 -144.308 -13.514 QT
-144.198 -12.709 -143.823 -11.944 QT
cp
f
GR
GS
[0.75 0 0 0.75 221.25021 25.22855] CT
N
-123.166 -9.6 M
-123.166 -10.553 L
-122.229 -10.553 -121.643 -10.694 QT
-121.057 -10.834 -121.057 -11.413 QT
-121.057 -25.584 L
-121.057 -26.303 -121.268 -26.624 QT
-121.479 -26.944 -121.893 -27.022 QT
-122.307 -27.1 -123.166 -27.1 QT
-123.166 -28.038 L
-119.151 -28.334 L
-119.151 -19.053 L
-118.588 -20.178 -117.573 -20.858 QT
-116.557 -21.538 -115.323 -21.538 QT
-113.463 -21.538 -112.518 -20.639 QT
-111.573 -19.741 -111.573 -17.897 QT
-111.573 -11.413 L
-111.573 -10.834 -110.979 -10.694 QT
-110.385 -10.553 -109.463 -10.553 QT
-109.463 -9.6 L
-115.651 -9.6 L
-115.651 -10.553 L
-114.729 -10.553 -114.135 -10.694 QT
-113.541 -10.834 -113.541 -11.413 QT
-113.541 -17.819 L
-113.541 -19.131 -113.924 -19.983 QT
-114.307 -20.834 -115.479 -20.834 QT
-117.057 -20.834 -118.065 -19.584 QT
-119.073 -18.334 -119.073 -16.725 QT
-119.073 -11.413 L
-119.073 -10.834 -118.479 -10.694 QT
-117.885 -10.553 -116.979 -10.553 QT
-116.979 -9.6 L
-123.166 -9.6 L
cp
f
GR
GS
[0.75 0 0 0.75 221.25021 25.22855] CT
N
-102.398 -9.303 M
-104.023 -9.303 -105.406 -10.124 QT
-106.789 -10.944 -107.594 -12.327 QT
-108.398 -13.709 -108.398 -15.35 QT
-108.398 -16.584 -107.953 -17.733 QT
-107.508 -18.881 -106.687 -19.788 QT
-105.867 -20.694 -104.773 -21.202 QT
-103.68 -21.709 -102.398 -21.709 QT
-100.742 -21.709 -99.375 -20.827 QT
-98.008 -19.944 -97.219 -18.475 QT
-96.43 -17.006 -96.43 -15.35 QT
-96.43 -13.725 -97.234 -12.334 QT
-98.039 -10.944 -99.414 -10.124 QT
-100.789 -9.303 -102.398 -9.303 QT
cp
-102.398 -10.084 M
-100.242 -10.084 -99.516 -11.655 QT
-98.789 -13.225 -98.789 -15.647 QT
-98.789 -17.006 -98.93 -17.897 QT
-99.07 -18.788 -99.57 -19.522 QT
-99.867 -19.959 -100.336 -20.295 QT
-100.805 -20.631 -101.328 -20.811 QT
-101.851 -20.991 -102.398 -20.991 QT
-103.242 -20.991 -104 -20.608 QT
-104.758 -20.225 -105.258 -19.522 QT
-105.758 -18.756 -105.898 -17.834 QT
-106.039 -16.913 -106.039 -15.647 QT
-106.039 -14.131 -105.773 -12.928 QT
-105.508 -11.725 -104.711 -10.905 QT
-103.914 -10.084 -102.398 -10.084 QT
cp
f
GR
GS
[0.75 0 0 0.75 221.25021 25.22855] CT
N
-89.962 -9.6 M
-93.899 -19.522 L
-94.149 -20.022 -94.673 -20.155 QT
-95.196 -20.288 -96.04 -20.288 QT
-96.04 -21.241 L
-90.368 -21.241 L
-90.368 -20.288 L
-91.884 -20.288 -91.884 -19.647 QT
-91.884 -19.538 -91.868 -19.491 QT
-88.837 -11.866 L
-86.103 -18.756 L
-86.024 -18.959 -86.024 -19.178 QT
-86.024 -19.694 -86.415 -19.991 QT
-86.806 -20.288 -87.321 -20.288 QT
-87.321 -21.241 L
-82.837 -21.241 L
-82.837 -20.288 L
-83.681 -20.288 -84.306 -19.905 QT
-84.931 -19.522 -85.274 -18.772 QT
-88.915 -9.6 L
-89.009 -9.303 -89.337 -9.303 QT
-89.54 -9.303 L
-89.868 -9.303 -89.962 -9.6 QT
cp
f
GR
GS
[0.75 0 0 0.75 221.25021 25.22855] CT
N
-76.504 -9.303 M
-78.144 -9.303 -79.519 -10.163 QT
-80.894 -11.022 -81.683 -12.467 QT
-82.472 -13.913 -82.472 -15.522 QT
-82.472 -17.1 -81.754 -18.522 QT
-81.035 -19.944 -79.746 -20.827 QT
-78.457 -21.709 -76.879 -21.709 QT
-75.644 -21.709 -74.73 -21.288 QT
-73.816 -20.866 -73.222 -20.131 QT
-72.629 -19.397 -72.324 -18.397 QT
-72.019 -17.397 -72.019 -16.194 QT
-72.019 -15.834 -72.3 -15.834 QT
-80.113 -15.834 L
-80.113 -15.553 L
-80.113 -13.303 -79.207 -11.694 QT
-78.3 -10.084 -76.254 -10.084 QT
-75.425 -10.084 -74.722 -10.452 QT
-74.019 -10.819 -73.496 -11.483 QT
-72.972 -12.147 -72.8 -12.897 QT
-72.769 -12.991 -72.699 -13.061 QT
-72.629 -13.131 -72.535 -13.131 QT
-72.3 -13.131 L
-72.019 -13.131 -72.019 -12.788 QT
-72.394 -11.256 -73.66 -10.28 QT
-74.925 -9.303 -76.504 -9.303 QT
cp
-80.082 -16.506 M
-73.925 -16.506 L
-73.925 -17.522 -74.207 -18.561 QT
-74.488 -19.6 -75.152 -20.295 QT
-75.816 -20.991 -76.879 -20.991 QT
-78.41 -20.991 -79.246 -19.561 QT
-80.082 -18.131 -80.082 -16.506 QT
cp
f
GR
GS
[0.75 0 0 0.75 221.25021 25.22855] CT
N
-70.667 -9.6 M
-70.667 -10.553 L
-69.746 -10.553 -69.152 -10.694 QT
-68.558 -10.834 -68.558 -11.413 QT
-68.558 -18.772 L
-68.558 -19.506 -68.777 -19.827 QT
-68.996 -20.147 -69.402 -20.217 QT
-69.808 -20.288 -70.667 -20.288 QT
-70.667 -21.241 L
-66.808 -21.538 L
-66.808 -18.897 L
-66.371 -20.069 -65.566 -20.803 QT
-64.761 -21.538 -63.621 -21.538 QT
-62.808 -21.538 -62.175 -21.061 QT
-61.542 -20.584 -61.542 -19.803 QT
-61.542 -19.319 -61.894 -18.952 QT
-62.246 -18.584 -62.761 -18.584 QT
-63.261 -18.584 -63.621 -18.944 QT
-63.98 -19.303 -63.98 -19.803 QT
-63.98 -20.522 -63.464 -20.834 QT
-63.621 -20.834 L
-64.714 -20.834 -65.402 -20.045 QT
-66.089 -19.256 -66.386 -18.077 QT
-66.683 -16.897 -66.683 -15.834 QT
-66.683 -11.413 L
-66.683 -10.553 -64.058 -10.553 QT
-64.058 -9.6 L
-70.667 -9.6 L
cp
f
GR
GS
[0.75 0 0 0.75 221.25021 25.22855] CT
N
-50.959 -12.256 M
-50.959 -13.866 -49.693 -14.874 QT
-48.428 -15.881 -46.654 -16.295 QT
-44.881 -16.709 -43.287 -16.709 QT
-43.287 -17.819 L
-43.287 -18.584 -43.631 -19.319 QT
-43.975 -20.053 -44.615 -20.522 QT
-45.256 -20.991 -46.037 -20.991 QT
-47.834 -20.991 -48.772 -20.194 QT
-48.256 -20.194 -47.92 -19.803 QT
-47.584 -19.413 -47.584 -18.897 QT
-47.584 -18.35 -47.967 -17.967 QT
-48.35 -17.584 -48.865 -17.584 QT
-49.412 -17.584 -49.795 -17.967 QT
-50.178 -18.35 -50.178 -18.897 QT
-50.178 -20.319 -48.889 -21.014 QT
-47.6 -21.709 -46.037 -21.709 QT
-44.943 -21.709 -43.834 -21.241 QT
-42.725 -20.772 -42.022 -19.897 QT
-41.318 -19.022 -41.318 -17.866 QT
-41.318 -11.788 L
-41.318 -11.256 -41.092 -10.819 QT
-40.865 -10.381 -40.397 -10.381 QT
-39.943 -10.381 -39.725 -10.827 QT
-39.506 -11.272 -39.506 -11.788 QT
-39.506 -13.522 L
-38.725 -13.522 L
-38.725 -11.788 L
-38.725 -11.178 -39.037 -10.631 QT
-39.35 -10.084 -39.889 -9.764 QT
-40.428 -9.444 -41.037 -9.444 QT
-41.834 -9.444 -42.404 -10.053 QT
-42.975 -10.663 -43.053 -11.506 QT
-43.553 -10.491 -44.522 -9.897 QT
-45.49 -9.303 -46.6 -9.303 QT
-47.631 -9.303 -48.631 -9.6 QT
-49.631 -9.897 -50.295 -10.553 QT
-50.959 -11.209 -50.959 -12.256 QT
cp
-48.772 -12.256 M
-48.772 -11.303 -48.068 -10.655 QT
-47.365 -10.006 -46.428 -10.006 QT
-45.553 -10.006 -44.842 -10.444 QT
-44.131 -10.881 -43.709 -11.631 QT
-43.287 -12.381 -43.287 -13.209 QT
-43.287 -16.022 L
-44.506 -16.022 -45.795 -15.616 QT
-47.084 -15.209 -47.928 -14.358 QT
-48.772 -13.506 -48.772 -12.256 QT
cp
f
GR
GS
[0.75 0 0 0.75 221.25021 25.22855] CT
N
-35.891 -9.6 M
-35.891 -25.584 L
-35.891 -26.303 -36.11 -26.624 QT
-36.329 -26.944 -36.735 -27.022 QT
-37.141 -27.1 -38.001 -27.1 QT
-38.001 -28.038 L
-34.016 -28.334 L
-34.016 -19.881 L
-33.563 -20.381 -32.962 -20.756 QT
-32.36 -21.131 -31.673 -21.334 QT
-30.985 -21.538 -30.282 -21.538 QT
-29.063 -21.538 -28.032 -21.045 QT
-27.001 -20.553 -26.235 -19.694 QT
-25.469 -18.834 -25.04 -17.725 QT
-24.61 -16.616 -24.61 -15.428 QT
-24.61 -13.788 -25.407 -12.381 QT
-26.204 -10.975 -27.579 -10.139 QT
-28.954 -9.303 -30.61 -9.303 QT
-31.641 -9.303 -32.602 -9.827 QT
-33.563 -10.35 -34.188 -11.225 QT
-35.11 -9.6 L
-35.891 -9.6 L
cp
-33.938 -12.256 M
-33.485 -11.256 -32.641 -10.631 QT
-31.798 -10.006 -30.766 -10.006 QT
-29.376 -10.006 -28.509 -10.811 QT
-27.641 -11.616 -27.298 -12.842 QT
-26.954 -14.069 -26.954 -15.428 QT
-26.954 -17.709 -27.548 -18.897 QT
-27.813 -19.428 -28.266 -19.874 QT
-28.719 -20.319 -29.282 -20.577 QT
-29.844 -20.834 -30.469 -20.834 QT
-31.548 -20.834 -32.469 -20.256 QT
-33.391 -19.678 -33.938 -18.725 QT
-33.938 -12.256 L
cp
f
GR
GS
[0.75 0 0 0.75 221.25021 25.22855] CT
N
-22.998 -9.522 M
-22.998 -13.928 L
-22.998 -14.131 -22.748 -14.131 QT
-22.42 -14.131 L
-22.264 -14.131 -22.217 -13.928 QT
-21.467 -10.006 -18.576 -10.006 QT
-17.295 -10.006 -16.436 -10.584 QT
-15.576 -11.163 -15.576 -12.381 QT
-15.576 -13.256 -16.248 -13.866 QT
-16.92 -14.475 -17.842 -14.709 QT
-19.639 -15.053 L
-20.561 -15.256 -21.303 -15.663 QT
-22.045 -16.069 -22.522 -16.749 QT
-22.998 -17.428 -22.998 -18.334 QT
-22.998 -19.522 -22.366 -20.28 QT
-21.733 -21.038 -20.733 -21.374 QT
-19.733 -21.709 -18.576 -21.709 QT
-17.186 -21.709 -16.17 -20.959 QT
-15.389 -21.631 L
-15.389 -21.709 -15.248 -21.709 QT
-15.061 -21.709 L
-14.983 -21.709 -14.912 -21.631 QT
-14.842 -21.553 -14.842 -21.475 QT
-14.842 -17.944 L
-14.842 -17.694 -15.061 -17.694 QT
-15.389 -17.694 L
-15.623 -17.694 -15.623 -17.944 QT
-15.623 -19.35 -16.405 -20.209 QT
-17.186 -21.069 -18.608 -21.069 QT
-19.811 -21.069 -20.701 -20.624 QT
-21.592 -20.178 -21.592 -19.084 QT
-21.592 -18.334 -20.951 -17.85 QT
-20.311 -17.366 -19.451 -17.147 QT
-17.623 -16.819 L
-16.701 -16.6 -15.905 -16.1 QT
-15.108 -15.6 -14.639 -14.834 QT
-14.17 -14.069 -14.17 -13.1 QT
-14.17 -12.131 -14.506 -11.413 QT
-14.842 -10.694 -15.444 -10.217 QT
-16.045 -9.741 -16.866 -9.522 QT
-17.686 -9.303 -18.576 -9.303 QT
-20.264 -9.303 -21.467 -10.428 QT
-22.451 -9.366 L
-22.451 -9.303 -22.592 -9.303 QT
-22.748 -9.303 L
-22.998 -9.303 -22.998 -9.522 QT
cp
f
GR
GS
[0.75 0 0 0.75 221.25021 25.22855] CT
N
-6.62 -9.303 M
-8.245 -9.303 -9.628 -10.124 QT
-11.011 -10.944 -11.816 -12.327 QT
-12.62 -13.709 -12.62 -15.35 QT
-12.62 -16.584 -12.175 -17.733 QT
-11.73 -18.881 -10.91 -19.788 QT
-10.089 -20.694 -8.995 -21.202 QT
-7.902 -21.709 -6.62 -21.709 QT
-4.964 -21.709 -3.597 -20.827 QT
-2.23 -19.944 -1.441 -18.475 QT
-0.652 -17.006 -0.652 -15.35 QT
-0.652 -13.725 -1.456 -12.334 QT
-2.261 -10.944 -3.636 -10.124 QT
-5.011 -9.303 -6.62 -9.303 QT
cp
-6.62 -10.084 M
-4.464 -10.084 -3.738 -11.655 QT
-3.011 -13.225 -3.011 -15.647 QT
-3.011 -17.006 -3.152 -17.897 QT
-3.292 -18.788 -3.792 -19.522 QT
-4.089 -19.959 -4.558 -20.295 QT
-5.027 -20.631 -5.55 -20.811 QT
-6.074 -20.991 -6.62 -20.991 QT
-7.464 -20.991 -8.222 -20.608 QT
-8.98 -20.225 -9.48 -19.522 QT
-9.98 -18.756 -10.12 -17.834 QT
-10.261 -16.913 -10.261 -15.647 QT
-10.261 -14.131 -9.995 -12.928 QT
-9.73 -11.725 -8.933 -10.905 QT
-8.136 -10.084 -6.62 -10.084 QT
cp
f
GR
GS
[0.75 0 0 0.75 221.25021 25.22855] CT
N
0.791 -9.6 M
0.791 -10.553 L
1.713 -10.553 2.307 -10.694 QT
2.9 -10.834 2.9 -11.413 QT
2.9 -25.584 L
2.9 -26.303 2.682 -26.624 QT
2.463 -26.944 2.057 -27.022 QT
1.65 -27.1 0.791 -27.1 QT
0.791 -28.038 L
4.807 -28.334 L
4.807 -11.413 L
4.807 -10.834 5.4 -10.694 QT
5.994 -10.553 6.9 -10.553 QT
6.9 -9.6 L
0.791 -9.6 L
cp
f
GR
GS
[0.75 0 0 0.75 221.25021 25.22855] CT
N
10.277 -12.819 M
10.277 -18.772 L
10.277 -19.506 10.066 -19.827 QT
9.855 -20.147 9.441 -20.217 QT
9.027 -20.288 8.167 -20.288 QT
8.167 -21.241 L
12.261 -21.538 L
12.261 -12.819 L
12.261 -11.756 12.409 -11.17 QT
12.558 -10.584 13.058 -10.295 QT
13.558 -10.006 14.636 -10.006 QT
16.089 -10.006 16.941 -11.217 QT
17.792 -12.428 17.792 -13.975 QT
17.792 -18.772 L
17.792 -19.506 17.573 -19.827 QT
17.355 -20.147 16.948 -20.217 QT
16.542 -20.288 15.683 -20.288 QT
15.683 -21.241 L
19.761 -21.538 L
19.761 -12.053 L
19.761 -11.334 19.98 -11.014 QT
20.198 -10.694 20.605 -10.624 QT
21.011 -10.553 21.87 -10.553 QT
21.87 -9.6 L
17.87 -9.303 L
17.87 -11.584 L
17.37 -10.569 16.48 -9.936 QT
15.589 -9.303 14.495 -9.303 QT
12.558 -9.303 11.417 -10.124 QT
10.277 -10.944 10.277 -12.819 QT
cp
f
GR
GS
[0.75 0 0 0.75 221.25021 25.22855] CT
N
24.935 -12.85 M
24.935 -20.288 L
22.701 -20.288 L
22.701 -20.991 L
24.466 -20.991 25.295 -22.639 QT
26.123 -24.288 26.123 -26.209 QT
26.904 -26.209 L
26.904 -21.241 L
30.716 -21.241 L
30.716 -20.288 L
26.904 -20.288 L
26.904 -12.897 L
26.904 -11.772 27.279 -10.928 QT
27.654 -10.084 28.638 -10.084 QT
29.56 -10.084 29.966 -10.975 QT
30.373 -11.866 30.373 -12.897 QT
30.373 -14.491 L
31.154 -14.491 L
31.154 -12.85 L
31.154 -12.006 30.841 -11.178 QT
30.529 -10.35 29.92 -9.827 QT
29.31 -9.303 28.451 -9.303 QT
26.826 -9.303 25.881 -10.272 QT
24.935 -11.241 24.935 -12.85 QT
cp
f
GR
GS
[0.75 0 0 0.75 221.25021 25.22855] CT
N
39.274 -9.303 M
37.634 -9.303 36.259 -10.163 QT
34.884 -11.022 34.095 -12.467 QT
33.306 -13.913 33.306 -15.522 QT
33.306 -17.1 34.024 -18.522 QT
34.743 -19.944 36.032 -20.827 QT
37.321 -21.709 38.899 -21.709 QT
40.134 -21.709 41.048 -21.288 QT
41.962 -20.866 42.556 -20.131 QT
43.149 -19.397 43.454 -18.397 QT
43.759 -17.397 43.759 -16.194 QT
43.759 -15.834 43.478 -15.834 QT
35.665 -15.834 L
35.665 -15.553 L
35.665 -13.303 36.571 -11.694 QT
37.478 -10.084 39.524 -10.084 QT
40.353 -10.084 41.056 -10.452 QT
41.759 -10.819 42.282 -11.483 QT
42.806 -12.147 42.978 -12.897 QT
43.009 -12.991 43.079 -13.061 QT
43.149 -13.131 43.243 -13.131 QT
43.478 -13.131 L
43.759 -13.131 43.759 -12.788 QT
43.384 -11.256 42.118 -10.28 QT
40.853 -9.303 39.274 -9.303 QT
cp
35.696 -16.506 M
41.853 -16.506 L
41.853 -17.522 41.571 -18.561 QT
41.29 -19.6 40.626 -20.295 QT
39.962 -20.991 38.899 -20.991 QT
37.368 -20.991 36.532 -19.561 QT
35.696 -18.131 35.696 -16.506 QT
cp
f
GR
GS
[0.75 0 0 0.75 221.25021 25.22855] CT
N
54.374 -12.256 M
54.374 -13.866 55.64 -14.874 QT
56.906 -15.881 58.679 -16.295 QT
60.453 -16.709 62.046 -16.709 QT
62.046 -17.819 L
62.046 -18.584 61.703 -19.319 QT
61.359 -20.053 60.718 -20.522 QT
60.078 -20.991 59.296 -20.991 QT
57.499 -20.991 56.562 -20.194 QT
57.078 -20.194 57.414 -19.803 QT
57.749 -19.413 57.749 -18.897 QT
57.749 -18.35 57.367 -17.967 QT
56.984 -17.584 56.468 -17.584 QT
55.921 -17.584 55.539 -17.967 QT
55.156 -18.35 55.156 -18.897 QT
55.156 -20.319 56.445 -21.014 QT
57.734 -21.709 59.296 -21.709 QT
60.39 -21.709 61.499 -21.241 QT
62.609 -20.772 63.312 -19.897 QT
64.015 -19.022 64.015 -17.866 QT
64.015 -11.788 L
64.015 -11.256 64.242 -10.819 QT
64.468 -10.381 64.937 -10.381 QT
65.39 -10.381 65.609 -10.827 QT
65.828 -11.272 65.828 -11.788 QT
65.828 -13.522 L
66.609 -13.522 L
66.609 -11.788 L
66.609 -11.178 66.296 -10.631 QT
65.984 -10.084 65.445 -9.764 QT
64.906 -9.444 64.296 -9.444 QT
63.499 -9.444 62.929 -10.053 QT
62.359 -10.663 62.281 -11.506 QT
61.781 -10.491 60.812 -9.897 QT
59.843 -9.303 58.734 -9.303 QT
57.703 -9.303 56.703 -9.6 QT
55.703 -9.897 55.039 -10.553 QT
54.374 -11.209 54.374 -12.256 QT
cp
56.562 -12.256 M
56.562 -11.303 57.265 -10.655 QT
57.968 -10.006 58.906 -10.006 QT
59.781 -10.006 60.492 -10.444 QT
61.203 -10.881 61.624 -11.631 QT
62.046 -12.381 62.046 -13.209 QT
62.046 -16.022 L
60.828 -16.022 59.539 -15.616 QT
58.249 -15.209 57.406 -14.358 QT
56.562 -13.506 56.562 -12.256 QT
cp
f
GR
GS
[0.75 0 0 0.75 221.25021 25.22855] CT
N
73.348 -9.303 M
71.723 -9.303 70.388 -10.147 QT
69.052 -10.991 68.286 -12.413 QT
67.52 -13.834 67.52 -15.428 QT
67.52 -17.022 68.278 -18.483 QT
69.036 -19.944 70.38 -20.827 QT
71.723 -21.709 73.348 -21.709 QT
74.942 -21.709 76.239 -21.084 QT
77.536 -20.459 77.536 -19.053 QT
77.536 -18.522 77.161 -18.131 QT
76.786 -17.741 76.239 -17.741 QT
75.708 -17.741 75.325 -18.131 QT
74.942 -18.522 74.942 -19.053 QT
74.942 -19.522 75.247 -19.874 QT
75.552 -20.225 76.005 -20.319 QT
75.067 -20.913 73.38 -20.913 QT
72.083 -20.913 71.294 -20.053 QT
70.505 -19.194 70.192 -17.928 QT
69.88 -16.663 69.88 -15.428 QT
69.88 -14.116 70.263 -12.897 QT
70.645 -11.678 71.513 -10.881 QT
72.38 -10.084 73.677 -10.084 QT
74.958 -10.084 75.856 -10.874 QT
76.755 -11.663 77.083 -12.928 QT
77.083 -13.084 77.302 -13.084 QT
77.63 -13.084 L
77.708 -13.084 77.77 -13.006 QT
77.833 -12.928 77.833 -12.85 QT
77.833 -12.772 L
77.427 -11.163 76.216 -10.233 QT
75.005 -9.303 73.348 -9.303 QT
cp
f
GR
GS
[0.75 0 0 0.75 221.25021 25.22855] CT
N
85.2 -9.303 M
83.575 -9.303 82.239 -10.147 QT
80.903 -10.991 80.138 -12.413 QT
79.372 -13.834 79.372 -15.428 QT
79.372 -17.022 80.13 -18.483 QT
80.888 -19.944 82.232 -20.827 QT
83.575 -21.709 85.2 -21.709 QT
86.794 -21.709 88.091 -21.084 QT
89.388 -20.459 89.388 -19.053 QT
89.388 -18.522 89.013 -18.131 QT
88.638 -17.741 88.091 -17.741 QT
87.56 -17.741 87.177 -18.131 QT
86.794 -18.522 86.794 -19.053 QT
86.794 -19.522 87.099 -19.874 QT
87.403 -20.225 87.857 -20.319 QT
86.919 -20.913 85.232 -20.913 QT
83.935 -20.913 83.146 -20.053 QT
82.357 -19.194 82.044 -17.928 QT
81.732 -16.663 81.732 -15.428 QT
81.732 -14.116 82.114 -12.897 QT
82.497 -11.678 83.364 -10.881 QT
84.232 -10.084 85.528 -10.084 QT
86.81 -10.084 87.708 -10.874 QT
88.607 -11.663 88.935 -12.928 QT
88.935 -13.084 89.153 -13.084 QT
89.482 -13.084 L
89.56 -13.084 89.622 -13.006 QT
89.685 -12.928 89.685 -12.85 QT
89.685 -12.772 L
89.278 -11.163 88.068 -10.233 QT
86.857 -9.303 85.2 -9.303 QT
cp
f
GR
GS
[0.75 0 0 0.75 221.25021 25.22855] CT
N
97.052 -9.303 M
95.412 -9.303 94.037 -10.163 QT
92.662 -11.022 91.872 -12.467 QT
91.083 -13.913 91.083 -15.522 QT
91.083 -17.1 91.802 -18.522 QT
92.521 -19.944 93.81 -20.827 QT
95.099 -21.709 96.677 -21.709 QT
97.912 -21.709 98.826 -21.288 QT
99.74 -20.866 100.333 -20.131 QT
100.927 -19.397 101.232 -18.397 QT
101.537 -17.397 101.537 -16.194 QT
101.537 -15.834 101.255 -15.834 QT
93.443 -15.834 L
93.443 -15.553 L
93.443 -13.303 94.349 -11.694 QT
95.255 -10.084 97.302 -10.084 QT
98.13 -10.084 98.833 -10.452 QT
99.537 -10.819 100.06 -11.483 QT
100.583 -12.147 100.755 -12.897 QT
100.787 -12.991 100.857 -13.061 QT
100.927 -13.131 101.021 -13.131 QT
101.255 -13.131 L
101.537 -13.131 101.537 -12.788 QT
101.162 -11.256 99.896 -10.28 QT
98.63 -9.303 97.052 -9.303 QT
cp
93.474 -16.506 M
99.63 -16.506 L
99.63 -17.522 99.349 -18.561 QT
99.068 -19.6 98.404 -20.295 QT
97.74 -20.991 96.677 -20.991 QT
95.146 -20.991 94.31 -19.561 QT
93.474 -18.131 93.474 -16.506 QT
cp
f
GR
GS
[0.75 0 0 0.75 221.25021 25.22855] CT
N
103.013 -9.6 M
103.013 -10.553 L
103.935 -10.553 104.529 -10.694 QT
105.123 -10.834 105.123 -11.413 QT
105.123 -25.584 L
105.123 -26.303 104.904 -26.624 QT
104.685 -26.944 104.279 -27.022 QT
103.873 -27.1 103.013 -27.1 QT
103.013 -28.038 L
107.029 -28.334 L
107.029 -11.413 L
107.029 -10.834 107.623 -10.694 QT
108.217 -10.553 109.123 -10.553 QT
109.123 -9.6 L
103.013 -9.6 L
cp
f
GR
GS
[0.75 0 0 0.75 221.25021 25.22855] CT
N
116.311 -9.303 M
114.671 -9.303 113.296 -10.163 QT
111.921 -11.022 111.132 -12.467 QT
110.343 -13.913 110.343 -15.522 QT
110.343 -17.1 111.061 -18.522 QT
111.78 -19.944 113.069 -20.827 QT
114.358 -21.709 115.936 -21.709 QT
117.171 -21.709 118.085 -21.288 QT
118.999 -20.866 119.593 -20.131 QT
120.186 -19.397 120.491 -18.397 QT
120.796 -17.397 120.796 -16.194 QT
120.796 -15.834 120.515 -15.834 QT
112.702 -15.834 L
112.702 -15.553 L
112.702 -13.303 113.608 -11.694 QT
114.515 -10.084 116.561 -10.084 QT
117.39 -10.084 118.093 -10.452 QT
118.796 -10.819 119.319 -11.483 QT
119.843 -12.147 120.015 -12.897 QT
120.046 -12.991 120.116 -13.061 QT
120.186 -13.131 120.28 -13.131 QT
120.515 -13.131 L
120.796 -13.131 120.796 -12.788 QT
120.421 -11.256 119.155 -10.28 QT
117.89 -9.303 116.311 -9.303 QT
cp
112.733 -16.506 M
118.89 -16.506 L
118.89 -17.522 118.608 -18.561 QT
118.327 -19.6 117.663 -20.295 QT
116.999 -20.991 115.936 -20.991 QT
114.405 -20.991 113.569 -19.561 QT
112.733 -18.131 112.733 -16.506 QT
cp
f
GR
GS
[0.75 0 0 0.75 221.25021 25.22855] CT
N
122.148 -9.6 M
122.148 -10.553 L
123.07 -10.553 123.663 -10.694 QT
124.257 -10.834 124.257 -11.413 QT
124.257 -18.772 L
124.257 -19.506 124.038 -19.827 QT
123.82 -20.147 123.413 -20.217 QT
123.007 -20.288 122.148 -20.288 QT
122.148 -21.241 L
126.007 -21.538 L
126.007 -18.897 L
126.445 -20.069 127.249 -20.803 QT
128.054 -21.538 129.195 -21.538 QT
130.007 -21.538 130.64 -21.061 QT
131.273 -20.584 131.273 -19.803 QT
131.273 -19.319 130.921 -18.952 QT
130.57 -18.584 130.054 -18.584 QT
129.554 -18.584 129.195 -18.944 QT
128.835 -19.303 128.835 -19.803 QT
128.835 -20.522 129.351 -20.834 QT
129.195 -20.834 L
128.101 -20.834 127.413 -20.045 QT
126.726 -19.256 126.429 -18.077 QT
126.132 -16.897 126.132 -15.834 QT
126.132 -11.413 L
126.132 -10.553 128.757 -10.553 QT
128.757 -9.6 L
122.148 -9.6 L
cp
f
GR
GS
[0.75 0 0 0.75 221.25021 25.22855] CT
N
132.967 -12.256 M
132.967 -13.866 134.233 -14.874 QT
135.498 -15.881 137.272 -16.295 QT
139.045 -16.709 140.639 -16.709 QT
140.639 -17.819 L
140.639 -18.584 140.295 -19.319 QT
139.952 -20.053 139.311 -20.522 QT
138.67 -20.991 137.889 -20.991 QT
136.092 -20.991 135.155 -20.194 QT
135.67 -20.194 136.006 -19.803 QT
136.342 -19.413 136.342 -18.897 QT
136.342 -18.35 135.959 -17.967 QT
135.577 -17.584 135.061 -17.584 QT
134.514 -17.584 134.131 -17.967 QT
133.748 -18.35 133.748 -18.897 QT
133.748 -20.319 135.037 -21.014 QT
136.327 -21.709 137.889 -21.709 QT
138.983 -21.709 140.092 -21.241 QT
141.202 -20.772 141.905 -19.897 QT
142.608 -19.022 142.608 -17.866 QT
142.608 -11.788 L
142.608 -11.256 142.834 -10.819 QT
143.061 -10.381 143.53 -10.381 QT
143.983 -10.381 144.202 -10.827 QT
144.42 -11.272 144.42 -11.788 QT
144.42 -13.522 L
145.202 -13.522 L
145.202 -11.788 L
145.202 -11.178 144.889 -10.631 QT
144.577 -10.084 144.037 -9.764 QT
143.498 -9.444 142.889 -9.444 QT
142.092 -9.444 141.522 -10.053 QT
140.952 -10.663 140.873 -11.506 QT
140.373 -10.491 139.405 -9.897 QT
138.436 -9.303 137.327 -9.303 QT
136.295 -9.303 135.295 -9.6 QT
134.295 -9.897 133.631 -10.553 QT
132.967 -11.209 132.967 -12.256 QT
cp
135.155 -12.256 M
135.155 -11.303 135.858 -10.655 QT
136.561 -10.006 137.498 -10.006 QT
138.373 -10.006 139.084 -10.444 QT
139.795 -10.881 140.217 -11.631 QT
140.639 -12.381 140.639 -13.209 QT
140.639 -16.022 L
139.42 -16.022 138.131 -15.616 QT
136.842 -15.209 135.998 -14.358 QT
135.155 -13.506 135.155 -12.256 QT
cp
f
GR
GS
[0.75 0 0 0.75 221.25021 25.22855] CT
N
147.972 -12.85 M
147.972 -20.288 L
145.738 -20.288 L
145.738 -20.991 L
147.504 -20.991 148.332 -22.639 QT
149.16 -24.288 149.16 -26.209 QT
149.941 -26.209 L
149.941 -21.241 L
153.754 -21.241 L
153.754 -20.288 L
149.941 -20.288 L
149.941 -12.897 L
149.941 -11.772 150.316 -10.928 QT
150.691 -10.084 151.676 -10.084 QT
152.597 -10.084 153.004 -10.975 QT
153.41 -11.866 153.41 -12.897 QT
153.41 -14.491 L
154.191 -14.491 L
154.191 -12.85 L
154.191 -12.006 153.879 -11.178 QT
153.566 -10.35 152.957 -9.827 QT
152.347 -9.303 151.488 -9.303 QT
149.863 -9.303 148.918 -10.272 QT
147.972 -11.241 147.972 -12.85 QT
cp
f
GR
GS
[0.75 0 0 0.75 221.25021 25.22855] CT
N
156.421 -9.6 M
156.421 -10.553 L
157.343 -10.553 157.937 -10.694 QT
158.53 -10.834 158.53 -11.413 QT
158.53 -18.772 L
158.53 -19.819 158.132 -20.053 QT
157.733 -20.288 156.546 -20.288 QT
156.546 -21.241 L
160.437 -21.538 L
160.437 -11.413 L
160.437 -10.834 160.944 -10.694 QT
161.452 -10.553 162.312 -10.553 QT
162.312 -9.6 L
156.421 -9.6 L
cp
157.577 -26.178 M
157.577 -26.772 158.022 -27.217 QT
158.468 -27.663 159.046 -27.663 QT
159.437 -27.663 159.788 -27.467 QT
160.14 -27.272 160.335 -26.913 QT
160.53 -26.553 160.53 -26.178 QT
160.53 -25.584 160.085 -25.139 QT
159.64 -24.694 159.046 -24.694 QT
158.468 -24.694 158.022 -25.139 QT
157.577 -25.584 157.577 -26.178 QT
cp
f
GR
GS
[0.75 0 0 0.75 221.25021 25.22855] CT
N
169.75 -9.303 M
168.125 -9.303 166.742 -10.124 QT
165.36 -10.944 164.555 -12.327 QT
163.75 -13.709 163.75 -15.35 QT
163.75 -16.584 164.196 -17.733 QT
164.641 -18.881 165.461 -19.788 QT
166.281 -20.694 167.375 -21.202 QT
168.469 -21.709 169.75 -21.709 QT
171.406 -21.709 172.774 -20.827 QT
174.141 -19.944 174.93 -18.475 QT
175.719 -17.006 175.719 -15.35 QT
175.719 -13.725 174.914 -12.334 QT
174.11 -10.944 172.735 -10.124 QT
171.36 -9.303 169.75 -9.303 QT
cp
169.75 -10.084 M
171.906 -10.084 172.633 -11.655 QT
173.36 -13.225 173.36 -15.647 QT
173.36 -17.006 173.219 -17.897 QT
173.078 -18.788 172.578 -19.522 QT
172.281 -19.959 171.813 -20.295 QT
171.344 -20.631 170.821 -20.811 QT
170.297 -20.991 169.75 -20.991 QT
168.906 -20.991 168.149 -20.608 QT
167.391 -20.225 166.891 -19.522 QT
166.391 -18.756 166.25 -17.834 QT
166.11 -16.913 166.11 -15.647 QT
166.11 -14.131 166.375 -12.928 QT
166.641 -11.725 167.438 -10.905 QT
168.235 -10.084 169.75 -10.084 QT
cp
f
GR
GS
[0.75 0 0 0.75 221.25021 25.22855] CT
N
177.13 -9.6 M
177.13 -10.553 L
178.068 -10.553 178.654 -10.694 QT
179.24 -10.834 179.24 -11.413 QT
179.24 -18.772 L
179.24 -19.506 179.029 -19.827 QT
178.818 -20.147 178.404 -20.217 QT
177.99 -20.288 177.13 -20.288 QT
177.13 -21.241 L
181.052 -21.538 L
181.052 -18.897 L
181.599 -20.053 182.662 -20.795 QT
183.724 -21.538 184.974 -21.538 QT
186.834 -21.538 187.779 -20.639 QT
188.724 -19.741 188.724 -17.897 QT
188.724 -11.413 L
188.724 -10.834 189.318 -10.694 QT
189.912 -10.553 190.834 -10.553 QT
190.834 -9.6 L
184.646 -9.6 L
184.646 -10.553 L
185.568 -10.553 186.162 -10.694 QT
186.755 -10.834 186.755 -11.413 QT
186.755 -17.819 L
186.755 -19.131 186.373 -19.983 QT
185.99 -20.834 184.818 -20.834 QT
183.24 -20.834 182.232 -19.584 QT
181.224 -18.334 181.224 -16.725 QT
181.224 -11.413 L
181.224 -10.834 181.818 -10.694 QT
182.412 -10.553 183.318 -10.553 QT
183.318 -9.6 L
177.13 -9.6 L
cp
f
GR
GS
[0.75 0 0 0.75 221.25021 25.22855] CT
N
200.865 -9.6 M
200.865 -10.553 L
201.787 -10.553 202.381 -10.694 QT
202.975 -10.834 202.975 -11.413 QT
202.975 -18.772 L
202.975 -19.819 202.576 -20.053 QT
202.178 -20.288 200.99 -20.288 QT
200.99 -21.241 L
204.881 -21.538 L
204.881 -11.413 L
204.881 -10.834 205.389 -10.694 QT
205.897 -10.553 206.756 -10.553 QT
206.756 -9.6 L
200.865 -9.6 L
cp
202.022 -26.178 M
202.022 -26.772 202.467 -27.217 QT
202.912 -27.663 203.49 -27.663 QT
203.881 -27.663 204.233 -27.467 QT
204.584 -27.272 204.78 -26.913 QT
204.975 -26.553 204.975 -26.178 QT
204.975 -25.584 204.53 -25.139 QT
204.084 -24.694 203.49 -24.694 QT
202.912 -24.694 202.467 -25.139 QT
202.022 -25.584 202.022 -26.178 QT
cp
f
GR
GS
[0.75 0 0 0.75 221.25021 25.22855] CT
N
208.242 -9.6 M
208.242 -10.553 L
209.179 -10.553 209.765 -10.694 QT
210.351 -10.834 210.351 -11.413 QT
210.351 -18.772 L
210.351 -19.506 210.14 -19.827 QT
209.929 -20.147 209.515 -20.217 QT
209.101 -20.288 208.242 -20.288 QT
208.242 -21.241 L
212.163 -21.538 L
212.163 -18.897 L
212.71 -20.053 213.773 -20.795 QT
214.835 -21.538 216.085 -21.538 QT
217.945 -21.538 218.89 -20.639 QT
219.835 -19.741 219.835 -17.897 QT
219.835 -11.413 L
219.835 -10.834 220.429 -10.694 QT
221.023 -10.553 221.945 -10.553 QT
221.945 -9.6 L
215.757 -9.6 L
215.757 -10.553 L
216.679 -10.553 217.273 -10.694 QT
217.867 -10.834 217.867 -11.413 QT
217.867 -17.819 L
217.867 -19.131 217.484 -19.983 QT
217.101 -20.834 215.929 -20.834 QT
214.351 -20.834 213.343 -19.584 QT
212.335 -18.334 212.335 -16.725 QT
212.335 -11.413 L
212.335 -10.834 212.929 -10.694 QT
213.523 -10.553 214.429 -10.553 QT
214.429 -9.6 L
208.242 -9.6 L
cp
f
GR
GS
[0.75 0 0 0.75 221.25021 25.22855] CT
N
222.963 -4.366 M
222.963 -5.303 L
223.885 -5.303 224.478 -5.459 QT
225.072 -5.616 225.072 -6.178 QT
225.072 -19.178 L
225.072 -19.928 224.541 -20.108 QT
224.01 -20.288 222.963 -20.288 QT
222.963 -21.241 L
226.947 -21.538 L
226.947 -19.85 L
227.697 -20.678 228.674 -21.108 QT
229.65 -21.538 230.76 -21.538 QT
232.353 -21.538 233.635 -20.67 QT
234.916 -19.803 235.635 -18.397 QT
236.353 -16.991 236.353 -15.428 QT
236.353 -13.788 235.556 -12.381 QT
234.76 -10.975 233.385 -10.139 QT
232.01 -9.303 230.353 -9.303 QT
228.385 -9.303 227.025 -10.897 QT
227.025 -6.178 L
227.025 -5.616 227.627 -5.459 QT
228.228 -5.303 229.135 -5.303 QT
229.135 -4.366 L
222.963 -4.366 L
cp
227.025 -12.225 M
227.51 -11.256 228.353 -10.631 QT
229.197 -10.006 230.197 -10.006 QT
231.135 -10.006 231.853 -10.506 QT
232.572 -11.006 233.056 -11.85 QT
233.541 -12.694 233.775 -13.624 QT
234.01 -14.553 234.01 -15.428 QT
234.01 -16.506 233.619 -17.764 QT
233.228 -19.022 232.431 -19.889 QT
231.635 -20.756 230.494 -20.756 QT
229.4 -20.756 228.486 -20.194 QT
227.572 -19.631 227.025 -18.678 QT
227.025 -12.225 L
cp
f
GR
GS
[0.75 0 0 0.75 221.25021 25.22855] CT
N
239.981 -12.819 M
239.981 -18.772 L
239.981 -19.506 239.77 -19.827 QT
239.559 -20.147 239.145 -20.217 QT
238.731 -20.288 237.871 -20.288 QT
237.871 -21.241 L
241.965 -21.538 L
241.965 -12.819 L
241.965 -11.756 242.114 -11.17 QT
242.262 -10.584 242.762 -10.295 QT
243.262 -10.006 244.34 -10.006 QT
245.793 -10.006 246.645 -11.217 QT
247.496 -12.428 247.496 -13.975 QT
247.496 -18.772 L
247.496 -19.506 247.278 -19.827 QT
247.059 -20.147 246.653 -20.217 QT
246.246 -20.288 245.387 -20.288 QT
245.387 -21.241 L
249.465 -21.538 L
249.465 -12.053 L
249.465 -11.334 249.684 -11.014 QT
249.903 -10.694 250.309 -10.624 QT
250.715 -10.553 251.574 -10.553 QT
251.574 -9.6 L
247.574 -9.303 L
247.574 -11.584 L
247.074 -10.569 246.184 -9.936 QT
245.293 -9.303 244.199 -9.303 QT
242.262 -9.303 241.121 -10.124 QT
239.981 -10.944 239.981 -12.819 QT
cp
f
GR
GS
[0.75 0 0 0.75 221.25021 25.22855] CT
N
254.639 -12.85 M
254.639 -20.288 L
252.405 -20.288 L
252.405 -20.991 L
254.171 -20.991 254.999 -22.639 QT
255.827 -24.288 255.827 -26.209 QT
256.608 -26.209 L
256.608 -21.241 L
260.421 -21.241 L
260.421 -20.288 L
256.608 -20.288 L
256.608 -12.897 L
256.608 -11.772 256.983 -10.928 QT
257.358 -10.084 258.342 -10.084 QT
259.264 -10.084 259.671 -10.975 QT
260.077 -11.866 260.077 -12.897 QT
260.077 -14.491 L
260.858 -14.491 L
260.858 -12.85 L
260.858 -12.006 260.546 -11.178 QT
260.233 -10.35 259.624 -9.827 QT
259.014 -9.303 258.155 -9.303 QT
256.53 -9.303 255.585 -10.272 QT
254.639 -11.241 254.639 -12.85 QT
cp
f
GR
GS
[0.75 0 0 0.75 0 0.5] CT
0.2 0.702 0.2 RC
1 LJ
0.667 LW
N
94.091 141.383 M
114.182 153.511 L
134.273 165.639 L
154.364 177.766 L
174.455 189.894 L
194.545 202.022 L
214.636 214.149 L
234.727 226.277 L
254.818 238.404 L
274.909 250.532 L
295 262.66 L
315.091 274.787 L
335.182 286.915 L
355.273 299.043 L
375.364 311.17 L
395.455 323.298 L
415.545 335.426 L
435.636 347.553 L
455.727 359.681 L
475.818 371.809 L
495.909 383.936 L
S
GR
GS
[0.75 0 0 0.75 0 0.5] CT
1 LJ
0.667 LW
N
94.091 390 M
114.182 390 L
134.273 390 L
154.364 390 L
174.455 390 L
194.545 390 L
214.636 390 L
234.727 390 L
254.818 390 L
274.909 390 L
295 390 L
315.091 390 L
335.182 390 L
355.273 390 L
375.364 390 L
395.455 390 L
415.545 390 L
435.636 390 L
455.727 390 L
475.818 390 L
495.909 390 L
S
GR
GS
[0.75 0 0 0.75 0 0.5] CT
0 0 1 RC
1 LJ
0.667 LW
N
94.091 90.455 M
114.182 119.407 L
134.273 148.162 L
154.364 176.64 L
174.455 204.714 L
194.545 232.169 L
214.636 258.615 L
234.727 283.299 L
254.818 304.679 L
274.909 319.673 L
295 323.791 L
315.091 315.214 L
335.182 297.404 L
355.273 274.56 L
375.364 249.108 L
395.455 222.232 L
415.545 194.517 L
435.636 166.276 L
455.727 137.685 L
475.818 189.97 L
495.909 323.323 L
S
GR
GS
[0.75 0 0 0.75 0 0.5] CT
0.6 0.2 0.2 RC
1 LJ
0.667 LW
N
94.091 144.443 M
114.182 156.421 L
134.273 168.4 L
154.364 180.378 L
174.455 192.356 L
194.545 204.335 L
214.636 216.313 L
234.727 228.292 L
254.818 240.27 L
274.909 252.248 L
295 264.227 L
315.091 276.205 L
335.182 288.184 L
355.273 300.162 L
375.364 312.14 L
395.455 324.119 L
415.545 336.097 L
435.636 348.076 L
455.727 360.054 L
475.818 372.032 L
495.909 384.011 L
S
GR
GS
[0.75 0 0 0.75 0 0.5] CT
1 GC
N
505 158 M
505 50 L
381 50 L
381 158 L
cp
f
GR
GS
[0.75 0 0 0.75 320.86361 49.11029] CT
N
0.672 5.12 M
0.672 4.386 L
2.547 4.386 2.984 3.136 QT
7.391 -9.693 L
7.453 -9.911 7.734 -9.911 QT
8 -9.911 L
8.281 -9.911 8.344 -9.693 QT
12.938 3.714 L
13.141 4.151 13.688 4.268 QT
14.234 4.386 15.047 4.386 QT
15.047 5.12 L
9.203 5.12 L
9.203 4.386 L
10.938 4.386 10.938 3.823 QT
10.938 3.714 L
9.797 0.432 L
4.703 0.432 L
3.766 3.136 L
3.75 3.214 3.75 3.354 QT
3.75 3.886 4.242 4.136 QT
4.734 4.386 5.313 4.386 QT
5.313 5.12 L
0.672 5.12 L
cp
4.953 -0.302 M
9.563 -0.302 L
7.25 -7.005 L
4.953 -0.302 L
cp
f
GR
GS
[0.75 0 0 0.75 320.86361 49.11029] CT
N
16.578 6.761 M
16.578 6.011 17.125 5.456 QT
17.672 4.901 18.422 4.651 QT
18 4.339 17.781 3.854 QT
17.563 3.37 17.563 2.839 QT
17.563 1.854 18.188 1.089 QT
17.219 0.151 17.219 -1.068 QT
17.219 -1.724 17.5 -2.302 QT
17.781 -2.88 18.289 -3.302 QT
18.797 -3.724 19.406 -3.943 QT
20.016 -4.161 20.672 -4.161 QT
21.922 -4.161 22.906 -3.427 QT
23.344 -3.896 23.93 -4.146 QT
24.516 -4.396 25.156 -4.396 QT
25.609 -4.396 25.898 -4.075 QT
26.188 -3.755 26.188 -3.302 QT
26.188 -3.036 25.992 -2.841 QT
25.797 -2.646 25.531 -2.646 QT
25.266 -2.646 25.07 -2.841 QT
24.875 -3.036 24.875 -3.302 QT
24.875 -3.693 25.141 -3.849 QT
24.047 -3.849 23.266 -3.099 QT
23.656 -2.708 23.883 -2.161 QT
24.109 -1.614 24.109 -1.068 QT
24.109 -0.177 23.617 0.534 QT
23.125 1.245 22.32 1.636 QT
21.516 2.026 20.672 2.026 QT
19.516 2.026 18.563 1.401 QT
18.266 1.823 18.266 2.323 QT
18.266 2.886 18.633 3.3 QT
19 3.714 19.547 3.714 QT
21.266 3.714 L
22.516 3.714 23.523 3.94 QT
24.531 4.167 25.211 4.846 QT
25.891 5.526 25.891 6.761 QT
25.891 7.682 25.117 8.292 QT
24.344 8.901 23.258 9.175 QT
22.172 9.448 21.25 9.448 QT
20.313 9.448 19.227 9.175 QT
18.141 8.901 17.359 8.292 QT
16.578 7.682 16.578 6.761 QT
cp
17.766 6.761 M
17.766 7.464 18.336 7.94 QT
18.906 8.417 19.719 8.651 QT
20.531 8.886 21.25 8.886 QT
21.953 8.886 22.766 8.651 QT
23.578 8.417 24.148 7.94 QT
24.719 7.464 24.719 6.761 QT
24.719 5.667 23.711 5.339 QT
22.703 5.011 21.266 5.011 QT
19.547 5.011 L
19.063 5.011 18.656 5.245 QT
18.25 5.479 18.008 5.893 QT
17.766 6.307 17.766 6.761 QT
cp
20.672 1.464 M
22.453 1.464 22.453 -1.068 QT
22.453 -2.177 22.07 -2.888 QT
21.688 -3.599 20.672 -3.599 QT
19.641 -3.599 19.258 -2.888 QT
18.875 -2.177 18.875 -1.068 QT
18.875 -0.38 19.023 0.182 QT
19.172 0.745 19.563 1.104 QT
19.953 1.464 20.672 1.464 QT
cp
f
GR
GS
[0.75 0 0 0.75 320.86361 49.11029] CT
N
31.901 5.354 M
30.62 5.354 29.55 4.682 QT
28.479 4.011 27.862 2.886 QT
27.245 1.761 27.245 0.511 QT
27.245 -0.708 27.807 -1.818 QT
28.37 -2.927 29.37 -3.607 QT
30.37 -4.286 31.604 -4.286 QT
32.557 -4.286 33.276 -3.966 QT
33.995 -3.646 34.456 -3.075 QT
34.917 -2.505 35.151 -1.724 QT
35.385 -0.943 35.385 -0.005 QT
35.385 0.276 35.167 0.276 QT
29.089 0.276 L
29.089 0.495 L
29.089 2.245 29.792 3.495 QT
30.495 4.745 32.089 4.745 QT
32.729 4.745 33.276 4.456 QT
33.823 4.167 34.229 3.651 QT
34.635 3.136 34.776 2.557 QT
34.792 2.479 34.854 2.425 QT
34.917 2.37 34.979 2.37 QT
35.167 2.37 L
35.385 2.37 35.385 2.636 QT
35.089 3.823 34.104 4.589 QT
33.12 5.354 31.901 5.354 QT
cp
29.104 -0.255 M
33.901 -0.255 L
33.901 -1.036 33.675 -1.849 QT
33.448 -2.661 32.94 -3.2 QT
32.432 -3.739 31.604 -3.739 QT
30.417 -3.739 29.76 -2.63 QT
29.104 -1.521 29.104 -0.255 QT
cp
f
GR
GS
[0.75 0 0 0.75 320.86361 49.11029] CT
N
36.773 5.12 M
36.773 4.386 L
37.492 4.386 37.953 4.268 QT
38.414 4.151 38.414 3.714 QT
38.414 -2.021 L
38.414 -2.583 38.242 -2.833 QT
38.07 -3.083 37.758 -3.138 QT
37.445 -3.193 36.773 -3.193 QT
36.773 -3.927 L
39.82 -4.161 L
39.82 -2.114 L
40.242 -3.005 41.07 -3.583 QT
41.898 -4.161 42.867 -4.161 QT
44.32 -4.161 45.054 -3.466 QT
45.789 -2.771 45.789 -1.333 QT
45.789 3.714 L
45.789 4.151 46.25 4.268 QT
46.711 4.386 47.429 4.386 QT
47.429 5.12 L
42.617 5.12 L
42.617 4.386 L
43.336 4.386 43.797 4.268 QT
44.258 4.151 44.258 3.714 QT
44.258 -1.271 L
44.258 -2.286 43.961 -2.95 QT
43.664 -3.614 42.742 -3.614 QT
41.523 -3.614 40.734 -2.638 QT
39.945 -1.661 39.945 -0.427 QT
39.945 3.714 L
39.945 4.151 40.414 4.268 QT
40.883 4.386 41.586 4.386 QT
41.586 5.12 L
36.773 5.12 L
cp
f
GR
GS
[0.75 0 0 0.75 320.86361 49.11029] CT
N
49.548 2.604 M
49.548 -3.193 L
47.814 -3.193 L
47.814 -3.739 L
49.189 -3.739 49.829 -5.021 QT
50.47 -6.302 50.47 -7.802 QT
51.079 -7.802 L
51.079 -3.927 L
54.048 -3.927 L
54.048 -3.193 L
51.079 -3.193 L
51.079 2.557 L
51.079 3.432 51.368 4.089 QT
51.657 4.745 52.423 4.745 QT
53.142 4.745 53.462 4.05 QT
53.782 3.354 53.782 2.557 QT
53.782 1.323 L
54.376 1.323 L
54.376 2.604 L
54.376 3.261 54.134 3.901 QT
53.892 4.542 53.423 4.948 QT
52.954 5.354 52.282 5.354 QT
51.017 5.354 50.282 4.604 QT
49.548 3.854 49.548 2.604 QT
cp
f
GR
GS
[0.75 0 0 0.75 320.86361 49.11029] CT
N
64.768 5.12 M
64.768 4.386 L
67.393 4.386 67.393 3.714 QT
67.393 -7.302 L
66.299 -6.786 64.643 -6.786 QT
64.643 -7.521 L
67.221 -7.521 68.534 -8.864 QT
68.831 -8.864 L
68.893 -8.864 68.963 -8.81 QT
69.034 -8.755 69.034 -8.677 QT
69.034 3.714 L
69.034 4.386 71.659 4.386 QT
71.659 5.12 L
64.768 5.12 L
cp
f
GR
GS
[0.75 0 0 0.75 0 0.5] CT
0.2 0.702 0.2 RC
1 LJ
0.667 LW
N
384.985 64.814 M
424.83 64.814 L
S
GR
GS
[0.75 0 0 0.75 320.86361 68.70343] CT
N
/f-597267615{0.672 5.12 M
0.672 4.386 L
2.547 4.386 2.984 3.136 QT
7.391 -9.693 L
7.453 -9.911 7.734 -9.911 QT
8 -9.911 L
8.281 -9.911 8.344 -9.693 QT
12.938 3.714 L
13.141 4.151 13.688 4.268 QT
14.234 4.386 15.047 4.386 QT
15.047 5.12 L
9.203 5.12 L
9.203 4.386 L
10.938 4.386 10.938 3.823 QT
10.938 3.714 L
9.797 0.432 L
4.703 0.432 L
3.766 3.136 L
3.75 3.214 3.75 3.354 QT
3.75 3.886 4.242 4.136 QT
4.734 4.386 5.313 4.386 QT
5.313 5.12 L
0.672 5.12 L
cp
4.953 -0.302 M
9.563 -0.302 L
7.25 -7.005 L
4.953 -0.302 L
cp}def
f-597267615
f
GR
GS
[0.75 0 0 0.75 320.86361 68.70343] CT
N
/f-745240314{16.578 6.761 M
16.578 6.011 17.125 5.456 QT
17.672 4.901 18.422 4.651 QT
18 4.339 17.781 3.854 QT
17.563 3.37 17.563 2.839 QT
17.563 1.854 18.188 1.089 QT
17.219 0.151 17.219 -1.068 QT
17.219 -1.724 17.5 -2.302 QT
17.781 -2.88 18.289 -3.302 QT
18.797 -3.724 19.406 -3.943 QT
20.016 -4.161 20.672 -4.161 QT
21.922 -4.161 22.906 -3.427 QT
23.344 -3.896 23.93 -4.146 QT
24.516 -4.396 25.156 -4.396 QT
25.609 -4.396 25.898 -4.075 QT
26.188 -3.755 26.188 -3.302 QT
26.188 -3.036 25.992 -2.841 QT
25.797 -2.646 25.531 -2.646 QT
25.266 -2.646 25.07 -2.841 QT
24.875 -3.036 24.875 -3.302 QT
24.875 -3.693 25.141 -3.849 QT
24.047 -3.849 23.266 -3.099 QT
23.656 -2.708 23.883 -2.161 QT
24.109 -1.614 24.109 -1.068 QT
24.109 -0.177 23.617 0.534 QT
23.125 1.245 22.32 1.636 QT
21.516 2.026 20.672 2.026 QT
19.516 2.026 18.563 1.401 QT
18.266 1.823 18.266 2.323 QT
18.266 2.886 18.633 3.3 QT
19 3.714 19.547 3.714 QT
21.266 3.714 L
22.516 3.714 23.523 3.94 QT
24.531 4.167 25.211 4.846 QT
25.891 5.526 25.891 6.761 QT
25.891 7.682 25.117 8.292 QT
24.344 8.901 23.258 9.175 QT
22.172 9.448 21.25 9.448 QT
20.313 9.448 19.227 9.175 QT
18.141 8.901 17.359 8.292 QT
16.578 7.682 16.578 6.761 QT
cp
17.766 6.761 M
17.766 7.464 18.336 7.94 QT
18.906 8.417 19.719 8.651 QT
20.531 8.886 21.25 8.886 QT
21.953 8.886 22.766 8.651 QT
23.578 8.417 24.148 7.94 QT
24.719 7.464 24.719 6.761 QT
24.719 5.667 23.711 5.339 QT
22.703 5.011 21.266 5.011 QT
19.547 5.011 L
19.063 5.011 18.656 5.245 QT
18.25 5.479 18.008 5.893 QT
17.766 6.307 17.766 6.761 QT
cp
20.672 1.464 M
22.453 1.464 22.453 -1.068 QT
22.453 -2.177 22.07 -2.888 QT
21.688 -3.599 20.672 -3.599 QT
19.641 -3.599 19.258 -2.888 QT
18.875 -2.177 18.875 -1.068 QT
18.875 -0.38 19.023 0.182 QT
19.172 0.745 19.563 1.104 QT
19.953 1.464 20.672 1.464 QT
cp}def
f-745240314
f
GR
GS
[0.75 0 0 0.75 320.86361 68.70343] CT
N
/f1964844890{31.901 5.354 M
30.62 5.354 29.55 4.682 QT
28.479 4.011 27.862 2.886 QT
27.245 1.761 27.245 0.511 QT
27.245 -0.708 27.807 -1.818 QT
28.37 -2.927 29.37 -3.607 QT
30.37 -4.286 31.604 -4.286 QT
32.557 -4.286 33.276 -3.966 QT
33.995 -3.646 34.456 -3.075 QT
34.917 -2.505 35.151 -1.724 QT
35.385 -0.943 35.385 -0.005 QT
35.385 0.276 35.167 0.276 QT
29.089 0.276 L
29.089 0.495 L
29.089 2.245 29.792 3.495 QT
30.495 4.745 32.089 4.745 QT
32.729 4.745 33.276 4.456 QT
33.823 4.167 34.229 3.651 QT
34.635 3.136 34.776 2.557 QT
34.792 2.479 34.854 2.425 QT
34.917 2.37 34.979 2.37 QT
35.167 2.37 L
35.385 2.37 35.385 2.636 QT
35.089 3.823 34.104 4.589 QT
33.12 5.354 31.901 5.354 QT
cp
29.104 -0.255 M
33.901 -0.255 L
33.901 -1.036 33.675 -1.849 QT
33.448 -2.661 32.94 -3.2 QT
32.432 -3.739 31.604 -3.739 QT
30.417 -3.739 29.76 -2.63 QT
29.104 -1.521 29.104 -0.255 QT
cp}def
f1964844890
f
GR
GS
[0.75 0 0 0.75 320.86361 68.70343] CT
N
/f1881606250{36.773 5.12 M
36.773 4.386 L
37.492 4.386 37.953 4.268 QT
38.414 4.151 38.414 3.714 QT
38.414 -2.021 L
38.414 -2.583 38.242 -2.833 QT
38.07 -3.083 37.758 -3.138 QT
37.445 -3.193 36.773 -3.193 QT
36.773 -3.927 L
39.82 -4.161 L
39.82 -2.114 L
40.242 -3.005 41.07 -3.583 QT
41.898 -4.161 42.867 -4.161 QT
44.32 -4.161 45.054 -3.466 QT
45.789 -2.771 45.789 -1.333 QT
45.789 3.714 L
45.789 4.151 46.25 4.268 QT
46.711 4.386 47.429 4.386 QT
47.429 5.12 L
42.617 5.12 L
42.617 4.386 L
43.336 4.386 43.797 4.268 QT
44.258 4.151 44.258 3.714 QT
44.258 -1.271 L
44.258 -2.286 43.961 -2.95 QT
43.664 -3.614 42.742 -3.614 QT
41.523 -3.614 40.734 -2.638 QT
39.945 -1.661 39.945 -0.427 QT
39.945 3.714 L
39.945 4.151 40.414 4.268 QT
40.883 4.386 41.586 4.386 QT
41.586 5.12 L
36.773 5.12 L
cp}def
f1881606250
f
GR
GS
[0.75 0 0 0.75 320.86361 68.70343] CT
N
/f-1218143468{49.548 2.604 M
49.548 -3.193 L
47.814 -3.193 L
47.814 -3.739 L
49.189 -3.739 49.829 -5.021 QT
50.47 -6.302 50.47 -7.802 QT
51.079 -7.802 L
51.079 -3.927 L
54.048 -3.927 L
54.048 -3.193 L
51.079 -3.193 L
51.079 2.557 L
51.079 3.432 51.368 4.089 QT
51.657 4.745 52.423 4.745 QT
53.142 4.745 53.462 4.05 QT
53.782 3.354 53.782 2.557 QT
53.782 1.323 L
54.376 1.323 L
54.376 2.604 L
54.376 3.261 54.134 3.901 QT
53.892 4.542 53.423 4.948 QT
52.954 5.354 52.282 5.354 QT
51.017 5.354 50.282 4.604 QT
49.548 3.854 49.548 2.604 QT
cp}def
f-1218143468
f
GR
GS
[0.75 0 0 0.75 320.86361 68.70343] CT
N
/f-1429999007{63.862 5.12 M
63.862 4.557 L
63.862 4.511 63.909 4.448 QT
67.159 0.839 L
67.909 0.026 68.37 -0.513 QT
68.831 -1.052 69.276 -1.763 QT
69.721 -2.474 69.987 -3.2 QT
70.252 -3.927 70.252 -4.755 QT
70.252 -5.614 69.932 -6.404 QT
69.612 -7.193 68.979 -7.661 QT
68.346 -8.13 67.456 -8.13 QT
66.549 -8.13 65.823 -7.583 QT
65.096 -7.036 64.799 -6.161 QT
64.877 -6.177 65.018 -6.177 QT
65.487 -6.177 65.823 -5.864 QT
66.159 -5.552 66.159 -5.036 QT
66.159 -4.568 65.823 -4.232 QT
65.487 -3.896 65.018 -3.896 QT
64.534 -3.896 64.198 -4.239 QT
63.862 -4.583 63.862 -5.036 QT
63.862 -5.833 64.159 -6.521 QT
64.456 -7.208 65.018 -7.747 QT
65.581 -8.286 66.276 -8.575 QT
66.971 -8.864 67.768 -8.864 QT
68.971 -8.864 70.002 -8.357 QT
71.034 -7.849 71.643 -6.919 QT
72.252 -5.989 72.252 -4.755 QT
72.252 -3.849 71.854 -3.029 QT
71.456 -2.208 70.831 -1.536 QT
70.206 -0.864 69.229 -0.013 QT
68.252 0.839 67.94 1.136 QT
65.565 3.417 L
67.581 3.417 L
69.065 3.417 70.065 3.393 QT
71.065 3.37 71.127 3.307 QT
71.377 3.042 71.627 1.37 QT
72.252 1.37 L
71.659 5.12 L
63.862 5.12 L
cp}def
f-1429999007
f
GR
GS
[0.75 0 0 0.75 0 0.5] CT
1 LJ
0.667 LW
N
384.985 90.938 M
424.83 90.938 L
S
GR
GS
[0.75 0 0 0.75 320.86361 88.29657] CT
N
f-597267615
f
GR
GS
[0.75 0 0 0.75 320.86361 88.29657] CT
N
f-745240314
f
GR
GS
[0.75 0 0 0.75 320.86361 88.29657] CT
N
f1964844890
f
GR
GS
[0.75 0 0 0.75 320.86361 88.29657] CT
N
f1881606250
f
GR
GS
[0.75 0 0 0.75 320.86361 88.29657] CT
N
f-1218143468
f
GR
GS
[0.75 0 0 0.75 320.86361 88.29657] CT
N
/f300774680{64.815 3.495 M
65.299 4.214 66.135 4.565 QT
66.971 4.917 67.924 4.917 QT
69.143 4.917 69.659 3.878 QT
70.174 2.839 70.174 1.511 QT
70.174 0.917 70.065 0.323 QT
69.956 -0.271 69.698 -0.786 QT
69.44 -1.302 68.995 -1.607 QT
68.549 -1.911 67.909 -1.911 QT
66.502 -1.911 L
66.315 -1.911 66.315 -2.114 QT
66.315 -2.286 L
66.315 -2.458 66.502 -2.458 QT
67.659 -2.552 L
68.409 -2.552 68.893 -3.107 QT
69.377 -3.661 69.604 -4.45 QT
69.831 -5.239 69.831 -5.958 QT
69.831 -6.974 69.362 -7.614 QT
68.893 -8.255 67.924 -8.255 QT
67.127 -8.255 66.393 -7.958 QT
65.659 -7.661 65.237 -7.036 QT
65.284 -7.052 65.307 -7.06 QT
65.331 -7.068 65.377 -7.068 QT
65.846 -7.068 66.166 -6.739 QT
66.487 -6.411 66.487 -5.943 QT
66.487 -5.489 66.166 -5.161 QT
65.846 -4.833 65.377 -4.833 QT
64.924 -4.833 64.596 -5.161 QT
64.268 -5.489 64.268 -5.943 QT
64.268 -6.849 64.807 -7.513 QT
65.346 -8.177 66.206 -8.521 QT
67.065 -8.864 67.924 -8.864 QT
68.565 -8.864 69.268 -8.677 QT
69.971 -8.489 70.549 -8.138 QT
71.127 -7.786 71.487 -7.232 QT
71.846 -6.677 71.846 -5.958 QT
71.846 -5.083 71.456 -4.333 QT
71.065 -3.583 70.377 -3.044 QT
69.69 -2.505 68.862 -2.239 QT
69.784 -2.052 70.604 -1.544 QT
71.424 -1.036 71.916 -0.232 QT
72.409 0.573 72.409 1.495 QT
72.409 2.651 71.776 3.589 QT
71.143 4.526 70.104 5.057 QT
69.065 5.589 67.924 5.589 QT
66.94 5.589 65.948 5.214 QT
64.956 4.839 64.323 4.089 QT
63.69 3.339 63.69 2.292 QT
63.69 1.761 64.041 1.417 QT
64.393 1.073 64.924 1.073 QT
65.252 1.073 65.534 1.229 QT
65.815 1.386 65.979 1.675 QT
66.143 1.964 66.143 2.292 QT
66.143 2.807 65.784 3.151 QT
65.424 3.495 64.924 3.495 QT
64.815 3.495 L
cp}def
f300774680
f
GR
GS
[0.75 0 0 0.75 0 0.5] CT
0 0 1 RC
1 LJ
0.667 LW
N
384.985 117.062 M
424.83 117.062 L
S
GR
GS
[0.75 0 0 0.75 320.86361 107.88971] CT
N
f-597267615
f
GR
GS
[0.75 0 0 0.75 320.86361 107.88971] CT
N
f-745240314
f
GR
GS
[0.75 0 0 0.75 320.86361 107.88971] CT
N
f1964844890
f
GR
GS
[0.75 0 0 0.75 320.86361 107.88971] CT
N
f1881606250
f
GR
GS
[0.75 0 0 0.75 320.86361 107.88971] CT
N
f-1218143468
f
GR
GS
[0.75 0 0 0.75 320.86361 107.88971] CT
N
/f-1674298674{63.393 1.651 M
63.393 0.917 L
69.893 -8.771 L
69.956 -8.864 70.112 -8.864 QT
70.409 -8.864 L
70.643 -8.864 70.643 -8.63 QT
70.643 0.917 L
72.706 0.917 L
72.706 1.651 L
70.643 1.651 L
70.643 3.714 L
70.643 4.151 71.26 4.268 QT
71.877 4.386 72.69 4.386 QT
72.69 5.12 L
66.909 5.12 L
66.909 4.386 L
67.721 4.386 68.331 4.268 QT
68.94 4.151 68.94 3.714 QT
68.94 1.651 L
63.393 1.651 L
cp
64.096 0.917 M
69.065 0.917 L
69.065 -6.521 L
64.096 0.917 L
cp}def
f-1674298674
f
GR
GS
[0.75 0 0 0.75 0 0.5] CT
0.6 0.2 0.2 RC
1 LJ
0.667 LW
N
384.985 143.186 M
424.83 143.186 L
S
GR
GS
[0.75 0 0 0.75 0 0.5] CT
0.149 GC
10.0 ML
0.667 LW
N
381 158 M
381 50 L
505 50 L
505 158 L
cp
S
GR
%%Trailer
%%Pages: 1
%%EOF
