%!PS-Adobe-3.0 EPSF-3.0
%%Creator: (MATLAB, The Mathworks, Inc. Version 9.12.0.2529717 \(R2022a\) Update 8. Operating System: Linux)
%%Title: plots/Example3_rz_dot.eps
%%CreationDate: 2024-06-25T02:56:07
%%Pages: (atend)
%%BoundingBox:    14     3   381   311
%%LanguageLevel: 3
%%EndComments
%%BeginProlog
%%BeginResource: procset (Apache XML Graphics Std ProcSet) 1.2 0
%%Version: 1.2 0
%%Copyright: (Copyright 2001-2003,2010 The Apache Software Foundation. License terms: http://www.apache.org/licenses/LICENSE-2.0)
/bd{bind def}bind def
/ld{load def}bd
/GR/grestore ld
/GS/gsave ld
/RM/rmoveto ld
/C/curveto ld
/t/show ld
/L/lineto ld
/ML/setmiterlimit ld
/CT/concat ld
/f/fill ld
/N/newpath ld
/S/stroke ld
/CC/setcmykcolor ld
/A/ashow ld
/cp/closepath ld
/RC/setrgbcolor ld
/LJ/setlinejoin ld
/GC/setgray ld
/LW/setlinewidth ld
/M/moveto ld
/re {4 2 roll M
1 index 0 rlineto
0 exch rlineto
neg 0 rlineto
cp } bd
/_ctm matrix def
/_tm matrix def
/BT { _ctm currentmatrix pop matrix _tm copy pop 0 0 moveto } bd
/ET { _ctm setmatrix } bd
/iTm { _ctm setmatrix _tm concat } bd
/Tm { _tm astore pop iTm 0 0 moveto } bd
/ux 0.0 def
/uy 0.0 def
/F {
  /Tp exch def
  /Tf exch def
  Tf findfont Tp scalefont setfont
  /cf Tf def  /cs Tp def
} bd
/ULS {currentpoint /uy exch def /ux exch def} bd
/ULE {
  /Tcx currentpoint pop def
  gsave
  newpath
  cf findfont cs scalefont dup
  /FontMatrix get 0 get /Ts exch def /FontInfo get dup
  /UnderlinePosition get Ts mul /To exch def
  /UnderlineThickness get Ts mul /Tt exch def
  ux uy To add moveto  Tcx uy To add lineto
  Tt setlinewidth stroke
  grestore
} bd
/OLE {
  /Tcx currentpoint pop def
  gsave
  newpath
  cf findfont cs scalefont dup
  /FontMatrix get 0 get /Ts exch def /FontInfo get dup
  /UnderlinePosition get Ts mul /To exch def
  /UnderlineThickness get Ts mul /Tt exch def
  ux uy To add cs add moveto Tcx uy To add cs add lineto
  Tt setlinewidth stroke
  grestore
} bd
/SOE {
  /Tcx currentpoint pop def
  gsave
  newpath
  cf findfont cs scalefont dup
  /FontMatrix get 0 get /Ts exch def /FontInfo get dup
  /UnderlinePosition get Ts mul /To exch def
  /UnderlineThickness get Ts mul /Tt exch def
  ux uy To add cs 10 mul 26 idiv add moveto Tcx uy To add cs 10 mul 26 idiv add lineto
  Tt setlinewidth stroke
  grestore
} bd
/QT {
/Y22 exch store
/X22 exch store
/Y21 exch store
/X21 exch store
currentpoint
/Y21 load 2 mul add 3 div exch
/X21 load 2 mul add 3 div exch
/X21 load 2 mul /X22 load add 3 div
/Y21 load 2 mul /Y22 load add 3 div
/X22 load /Y22 load curveto
} bd
/SSPD {
dup length /d exch dict def
{
/v exch def
/k exch def
currentpagedevice k known {
/cpdv currentpagedevice k get def
v cpdv ne {
/upd false def
/nullv v type /nulltype eq def
/nullcpdv cpdv type /nulltype eq def
nullv nullcpdv or
{
/upd true def
} {
/sametype v type cpdv type eq def
sametype {
v type /arraytype eq {
/vlen v length def
/cpdvlen cpdv length def
vlen cpdvlen eq {
0 1 vlen 1 sub {
/i exch def
/obj v i get def
/cpdobj cpdv i get def
obj cpdobj ne {
/upd true def
exit
} if
} for
} {
/upd true def
} ifelse
} {
v type /dicttype eq {
v {
/dv exch def
/dk exch def
/cpddv cpdv dk get def
dv cpddv ne {
/upd true def
exit
} if
} forall
} {
/upd true def
} ifelse
} ifelse
} if
} ifelse
upd true eq {
d k v put
} if
} if
} if
} forall
d length 0 gt {
d setpagedevice
} if
} bd
/RE { % /NewFontName [NewEncodingArray] /FontName RE -
  findfont dup length dict begin
  {
    1 index /FID ne
    {def} {pop pop} ifelse
  } forall
  /Encoding exch def
  /FontName 1 index def
  currentdict definefont pop
  end
} bind def
%%EndResource
%%BeginResource: procset (Apache XML Graphics EPS ProcSet) 1.0 0
%%Version: 1.0 0
%%Copyright: (Copyright 2002-2003 The Apache Software Foundation. License terms: http://www.apache.org/licenses/LICENSE-2.0)
/BeginEPSF { %def
/b4_Inc_state save def         % Save state for cleanup
/dict_count countdictstack def % Count objects on dict stack
/op_count count 1 sub def      % Count objects on operand stack
userdict begin                 % Push userdict on dict stack
/showpage { } def              % Redefine showpage, { } = null proc
0 setgray 0 setlinecap         % Prepare graphics state
1 setlinewidth 0 setlinejoin
10 setmiterlimit [ ] 0 setdash newpath
/languagelevel where           % If level not equal to 1 then
{pop languagelevel             % set strokeadjust and
1 ne                           % overprint to their defaults.
{false setstrokeadjust false setoverprint
} if
} if
} bd
/EndEPSF { %def
count op_count sub {pop} repeat            % Clean up stacks
countdictstack dict_count sub {end} repeat
b4_Inc_state restore
} bd
%%EndResource
%FOPBeginFontDict
%%IncludeResource: font Courier-Oblique
%%IncludeResource: font Courier-BoldOblique
%%IncludeResource: font Courier-Bold
%%IncludeResource: font ZapfDingbats
%%IncludeResource: font Symbol
%%IncludeResource: font Helvetica
%%IncludeResource: font Helvetica-Oblique
%%IncludeResource: font Helvetica-Bold
%%IncludeResource: font Helvetica-BoldOblique
%%IncludeResource: font Times-Roman
%%IncludeResource: font Times-Italic
%%IncludeResource: font Times-Bold
%%IncludeResource: font Times-BoldItalic
%%IncludeResource: font Courier
%FOPEndFontDict
%%BeginResource: encoding WinAnsiEncoding
/WinAnsiEncoding [
/.notdef /.notdef /.notdef /.notdef /.notdef
/.notdef /.notdef /.notdef /.notdef /.notdef
/.notdef /.notdef /.notdef /.notdef /.notdef
/.notdef /.notdef /.notdef /.notdef /.notdef
/.notdef /.notdef /.notdef /.notdef /.notdef
/.notdef /.notdef /.notdef /.notdef /.notdef
/.notdef /.notdef /space /exclam /quotedbl
/numbersign /dollar /percent /ampersand /quotesingle
/parenleft /parenright /asterisk /plus /comma
/hyphen /period /slash /zero /one
/two /three /four /five /six
/seven /eight /nine /colon /semicolon
/less /equal /greater /question /at
/A /B /C /D /E
/F /G /H /I /J
/K /L /M /N /O
/P /Q /R /S /T
/U /V /W /X /Y
/Z /bracketleft /backslash /bracketright /asciicircum
/underscore /quoteleft /a /b /c
/d /e /f /g /h
/i /j /k /l /m
/n /o /p /q /r
/s /t /u /v /w
/x /y /z /braceleft /bar
/braceright /asciitilde /bullet /Euro /bullet
/quotesinglbase /florin /quotedblbase /ellipsis /dagger
/daggerdbl /circumflex /perthousand /Scaron /guilsinglleft
/OE /bullet /Zcaron /bullet /bullet
/quoteleft /quoteright /quotedblleft /quotedblright /bullet
/endash /emdash /asciitilde /trademark /scaron
/guilsinglright /oe /bullet /zcaron /Ydieresis
/space /exclamdown /cent /sterling /currency
/yen /brokenbar /section /dieresis /copyright
/ordfeminine /guillemotleft /logicalnot /sfthyphen /registered
/macron /degree /plusminus /twosuperior /threesuperior
/acute /mu /paragraph /middot /cedilla
/onesuperior /ordmasculine /guillemotright /onequarter /onehalf
/threequarters /questiondown /Agrave /Aacute /Acircumflex
/Atilde /Adieresis /Aring /AE /Ccedilla
/Egrave /Eacute /Ecircumflex /Edieresis /Igrave
/Iacute /Icircumflex /Idieresis /Eth /Ntilde
/Ograve /Oacute /Ocircumflex /Otilde /Odieresis
/multiply /Oslash /Ugrave /Uacute /Ucircumflex
/Udieresis /Yacute /Thorn /germandbls /agrave
/aacute /acircumflex /atilde /adieresis /aring
/ae /ccedilla /egrave /eacute /ecircumflex
/edieresis /igrave /iacute /icircumflex /idieresis
/eth /ntilde /ograve /oacute /ocircumflex
/otilde /odieresis /divide /oslash /ugrave
/uacute /ucircumflex /udieresis /yacute /thorn
/ydieresis
] def
%%EndResource
%FOPBeginFontReencode
/Courier-Oblique findfont
dup length dict begin
  {1 index /FID ne {def} {pop pop} ifelse} forall
  /Encoding WinAnsiEncoding def
  currentdict
end
/Courier-Oblique exch definefont pop
/Courier-BoldOblique findfont
dup length dict begin
  {1 index /FID ne {def} {pop pop} ifelse} forall
  /Encoding WinAnsiEncoding def
  currentdict
end
/Courier-BoldOblique exch definefont pop
/Courier-Bold findfont
dup length dict begin
  {1 index /FID ne {def} {pop pop} ifelse} forall
  /Encoding WinAnsiEncoding def
  currentdict
end
/Courier-Bold exch definefont pop
/Helvetica findfont
dup length dict begin
  {1 index /FID ne {def} {pop pop} ifelse} forall
  /Encoding WinAnsiEncoding def
  currentdict
end
/Helvetica exch definefont pop
/Helvetica-Oblique findfont
dup length dict begin
  {1 index /FID ne {def} {pop pop} ifelse} forall
  /Encoding WinAnsiEncoding def
  currentdict
end
/Helvetica-Oblique exch definefont pop
/Helvetica-Bold findfont
dup length dict begin
  {1 index /FID ne {def} {pop pop} ifelse} forall
  /Encoding WinAnsiEncoding def
  currentdict
end
/Helvetica-Bold exch definefont pop
/Helvetica-BoldOblique findfont
dup length dict begin
  {1 index /FID ne {def} {pop pop} ifelse} forall
  /Encoding WinAnsiEncoding def
  currentdict
end
/Helvetica-BoldOblique exch definefont pop
/Times-Roman findfont
dup length dict begin
  {1 index /FID ne {def} {pop pop} ifelse} forall
  /Encoding WinAnsiEncoding def
  currentdict
end
/Times-Roman exch definefont pop
/Times-Italic findfont
dup length dict begin
  {1 index /FID ne {def} {pop pop} ifelse} forall
  /Encoding WinAnsiEncoding def
  currentdict
end
/Times-Italic exch definefont pop
/Times-Bold findfont
dup length dict begin
  {1 index /FID ne {def} {pop pop} ifelse} forall
  /Encoding WinAnsiEncoding def
  currentdict
end
/Times-Bold exch definefont pop
/Times-BoldItalic findfont
dup length dict begin
  {1 index /FID ne {def} {pop pop} ifelse} forall
  /Encoding WinAnsiEncoding def
  currentdict
end
/Times-BoldItalic exch definefont pop
/Courier findfont
dup length dict begin
  {1 index /FID ne {def} {pop pop} ifelse} forall
  /Encoding WinAnsiEncoding def
  currentdict
end
/Courier exch definefont pop
%FOPEndFontReencode
%%EndProlog
%%Page: 1 1
%%PageBoundingBox: 0 0 420 315
%%BeginPageSetup
N
   14     3 M
  395     3 L
  395   314 L
   14   314 L
cp
clip
[1 0 0 -1 0 315] CT
%%EndPageSetup
GS
[0.75 0 0 0.75 0 0] CT
1 GC
N
0 0 560 420 re
f
GR
GS
[0.75 0 0 0.75 0 0] CT
1 GC
N
0 0 560 420 re
f
GR
GS
[0.75 0 0 0.75 0 0] CT
1 GC
N
73 359 M
507 359 L
507 39 L
73 39 L
cp
f
GR
GS
[0.75 0 0 0.75 0 0] CT
0.873 GC
1 LJ
0.667 LW
N
73 359 M
73 39 L
S
GR
GS
[0.75 0 0 0.75 0 0] CT
0.873 GC
1 LJ
0.667 LW
N
156.462 359 M
156.462 39 L
S
GR
GS
[0.75 0 0 0.75 0 0] CT
0.873 GC
1 LJ
0.667 LW
N
239.923 359 M
239.923 39 L
S
GR
GS
[0.75 0 0 0.75 0 0] CT
0.873 GC
1 LJ
0.667 LW
N
323.385 359 M
323.385 39 L
S
GR
GS
[0.75 0 0 0.75 0 0] CT
0.873 GC
1 LJ
0.667 LW
N
406.846 359 M
406.846 39 L
S
GR
GS
[0.75 0 0 0.75 0 0] CT
0.873 GC
1 LJ
0.667 LW
N
490.308 359 M
490.308 39 L
S
GR
GS
[0.75 0 0 0.75 0 0] CT
0.873 GC
1 LJ
0.667 LW
N
507 359 M
73 359 L
S
GR
GS
[0.75 0 0 0.75 0 0] CT
0.873 GC
1 LJ
0.667 LW
N
507 313.286 M
73 313.286 L
S
GR
GS
[0.75 0 0 0.75 0 0] CT
0.873 GC
1 LJ
0.667 LW
N
507 267.571 M
73 267.571 L
S
GR
GS
[0.75 0 0 0.75 0 0] CT
0.873 GC
1 LJ
0.667 LW
N
507 221.857 M
73 221.857 L
S
GR
GS
[0.75 0 0 0.75 0 0] CT
0.873 GC
1 LJ
0.667 LW
N
507 176.143 M
73 176.143 L
S
GR
GS
[0.75 0 0 0.75 0 0] CT
0.873 GC
1 LJ
0.667 LW
N
507 130.429 M
73 130.429 L
S
GR
GS
[0.75 0 0 0.75 0 0] CT
0.873 GC
1 LJ
0.667 LW
N
507 84.714 M
73 84.714 L
S
GR
GS
[0.75 0 0 0.75 0 0] CT
0.873 GC
1 LJ
0.667 LW
N
507 39 M
73 39 L
S
GR
GS
[0.75 0 0 0.75 0 0] CT
0.149 GC
2 setlinecap
1 LJ
0.667 LW
N
73 359 M
507 359 L
S
GR
GS
[0.75 0 0 0.75 0 0] CT
0.149 GC
2 setlinecap
1 LJ
0.667 LW
N
73 359 M
73 354.66 L
S
GR
GS
[0.75 0 0 0.75 0 0] CT
0.149 GC
2 setlinecap
1 LJ
0.667 LW
N
156.462 359 M
156.462 354.66 L
S
GR
GS
[0.75 0 0 0.75 0 0] CT
0.149 GC
2 setlinecap
1 LJ
0.667 LW
N
239.923 359 M
239.923 354.66 L
S
GR
GS
[0.75 0 0 0.75 0 0] CT
0.149 GC
2 setlinecap
1 LJ
0.667 LW
N
323.385 359 M
323.385 354.66 L
S
GR
GS
[0.75 0 0 0.75 0 0] CT
0.149 GC
2 setlinecap
1 LJ
0.667 LW
N
406.846 359 M
406.846 354.66 L
S
GR
GS
[0.75 0 0 0.75 0 0] CT
0.149 GC
2 setlinecap
1 LJ
0.667 LW
N
490.308 359 M
490.308 354.66 L
S
GR
GS
[0.75 0 0 0.75 54.75 273.25001] CT
0.149 GC
/Helvetica 13.333 F
GS
[1 0 0 1 0 0] CT
-4 15 moveto 
1 -1 scale
(0) t 
GR
GR
GS
[0.75 0 0 0.75 117.34615 273.25001] CT
0.149 GC
/Helvetica 13.333 F
GS
[1 0 0 1 0 0] CT
-4 15 moveto 
1 -1 scale
(5) t 
GR
GR
GS
[0.75 0 0 0.75 179.94231 273.25001] CT
0.149 GC
/Helvetica 13.333 F
GS
[1 0 0 1 0 0] CT
-8 15 moveto 
1 -1 scale
(10) t 
GR
GR
GS
[0.75 0 0 0.75 242.53846 273.25001] CT
0.149 GC
/Helvetica 13.333 F
GS
[1 0 0 1 0 0] CT
-8 15 moveto 
1 -1 scale
(15) t 
GR
GR
GS
[0.75 0 0 0.75 305.13462 273.25001] CT
0.149 GC
/Helvetica 13.333 F
GS
[1 0 0 1 0 0] CT
-8 15 moveto 
1 -1 scale
(20) t 
GR
GR
GS
[0.75 0 0 0.75 367.73076 273.25001] CT
0.149 GC
/Helvetica 13.333 F
GS
[1 0 0 1 0 0] CT
-8 15 moveto 
1 -1 scale
(25) t 
GR
GR
GS
[0.75 0 0 0.75 217.50016 288.49999] CT
0.149 GC
N
-74.637 22.296 M
-74.637 21.859 -74.544 21.484 QT
-72.45 13.156 L
-75.497 13.156 L
-75.794 13.156 -75.794 12.781 QT
-75.684 12.14 -75.419 12.14 QT
-72.2 12.14 L
-71.044 7.406 L
-70.919 7.031 -70.583 6.757 QT
-70.247 6.484 -69.825 6.484 QT
-69.45 6.484 -69.2 6.702 QT
-68.95 6.921 -68.95 7.296 QT
-68.95 7.374 -68.958 7.429 QT
-68.965 7.484 -68.981 7.531 QT
-70.153 12.14 L
-67.153 12.14 L
-66.856 12.14 -66.856 12.515 QT
-66.872 12.593 -66.919 12.765 QT
-66.965 12.937 -67.036 13.046 QT
-67.106 13.156 -67.247 13.156 QT
-70.403 13.156 L
-72.481 21.546 L
-72.7 22.359 -72.7 22.952 QT
-72.7 24.202 -71.84 24.202 QT
-70.575 24.202 -69.59 23.007 QT
-68.606 21.812 -68.075 20.374 QT
-67.965 20.202 -67.856 20.202 QT
-67.497 20.202 L
-67.387 20.202 -67.317 20.281 QT
-67.247 20.359 -67.247 20.468 QT
-67.247 20.515 -67.278 20.546 QT
-67.903 22.296 -69.122 23.632 QT
-70.34 24.968 -71.919 24.968 QT
-73.059 24.968 -73.848 24.218 QT
-74.637 23.468 -74.637 22.296 QT
cp
f
GR
GS
[0.75 0 0 0.75 217.50016 288.49999] CT
0.149 GC
N
-63.576 22.562 M
-63.576 22.015 -63.342 21.421 QT
-60.998 15.187 L
-60.623 14.124 -60.623 13.437 QT
-60.623 12.577 -61.248 12.577 QT
-62.404 12.577 -63.146 13.757 QT
-63.889 14.937 -64.248 16.406 QT
-64.295 16.577 -64.482 16.577 QT
-64.826 16.577 L
-65.06 16.577 -65.06 16.312 QT
-65.06 16.234 L
-64.592 14.499 -63.631 13.163 QT
-62.67 11.827 -61.201 11.827 QT
-60.17 11.827 -59.451 12.507 QT
-58.732 13.187 -58.732 14.234 QT
-58.732 14.765 -58.967 15.359 QT
-61.326 21.593 L
-61.717 22.562 -61.717 23.343 QT
-61.717 24.202 -61.06 24.202 QT
-59.92 24.202 -59.162 22.991 QT
-58.404 21.781 -58.092 20.374 QT
-58.045 20.202 -57.873 20.202 QT
-57.514 20.202 L
-57.404 20.202 -57.334 20.281 QT
-57.264 20.359 -57.264 20.468 QT
-57.264 20.484 -57.295 20.546 QT
-57.685 22.187 -58.67 23.577 QT
-59.654 24.968 -61.107 24.968 QT
-62.139 24.968 -62.857 24.265 QT
-63.576 23.562 -63.576 22.562 QT
cp
-60.31 7.062 M
-60.31 6.452 -59.795 5.96 QT
-59.279 5.468 -58.67 5.468 QT
-58.185 5.468 -57.865 5.773 QT
-57.545 6.077 -57.545 6.546 QT
-57.545 7.187 -58.06 7.679 QT
-58.576 8.171 -59.201 8.171 QT
-59.67 8.171 -59.99 7.851 QT
-60.31 7.531 -60.31 7.062 QT
cp
f
GR
GS
[0.75 0 0 0.75 217.50016 288.49999] CT
0.149 GC
N
-53.502 24.14 M
-53.502 23.968 -53.47 23.89 QT
-51.298 15.234 L
-51.095 14.437 -51.095 13.827 QT
-51.095 12.577 -51.939 12.577 QT
-52.845 12.577 -53.283 13.663 QT
-53.72 14.749 -54.142 16.406 QT
-54.142 16.484 -54.22 16.531 QT
-54.298 16.577 -54.377 16.577 QT
-54.72 16.577 L
-54.814 16.577 -54.884 16.476 QT
-54.955 16.374 -54.955 16.281 QT
-54.642 15.031 -54.353 14.148 QT
-54.064 13.265 -53.447 12.546 QT
-52.83 11.827 -51.908 11.827 QT
-50.83 11.827 -49.994 12.515 QT
-49.158 13.202 -49.158 14.265 QT
-48.283 13.124 -47.127 12.476 QT
-45.97 11.827 -44.658 11.827 QT
-43.283 11.827 -42.291 12.531 QT
-41.298 13.234 -41.298 14.515 QT
-40.408 13.249 -39.205 12.538 QT
-38.002 11.827 -36.595 11.827 QT
-35.095 11.827 -34.181 12.64 QT
-33.267 13.452 -33.267 14.952 QT
-33.267 16.14 -33.798 17.827 QT
-34.33 19.515 -35.111 21.593 QT
-35.533 22.593 -35.533 23.343 QT
-35.533 24.202 -34.845 24.202 QT
-33.72 24.202 -32.97 22.984 QT
-32.22 21.765 -31.908 20.374 QT
-31.814 20.202 -31.658 20.202 QT
-31.33 20.202 L
-31.205 20.202 -31.127 20.281 QT
-31.048 20.359 -31.048 20.468 QT
-31.048 20.484 -31.08 20.546 QT
-31.486 22.187 -32.47 23.577 QT
-33.455 24.968 -34.923 24.968 QT
-35.939 24.968 -36.658 24.265 QT
-37.377 23.562 -37.377 22.562 QT
-37.377 22.046 -37.142 21.421 QT
-36.33 19.249 -35.783 17.531 QT
-35.236 15.812 -35.236 14.515 QT
-35.236 13.702 -35.556 13.14 QT
-35.877 12.577 -36.642 12.577 QT
-38.236 12.577 -39.392 13.546 QT
-40.548 14.515 -41.408 16.109 QT
-41.455 16.406 -41.486 16.562 QT
-43.361 23.999 L
-43.455 24.406 -43.806 24.687 QT
-44.158 24.968 -44.58 24.968 QT
-44.923 24.968 -45.181 24.741 QT
-45.439 24.515 -45.439 24.14 QT
-45.439 23.968 -45.408 23.89 QT
-43.564 16.499 L
-43.267 15.312 -43.267 14.515 QT
-43.267 13.702 -43.595 13.14 QT
-43.923 12.577 -44.72 12.577 QT
-45.783 12.577 -46.673 13.046 QT
-47.564 13.515 -48.228 14.281 QT
-48.892 15.046 -49.455 16.109 QT
-51.423 23.999 L
-51.517 24.406 -51.861 24.687 QT
-52.205 24.968 -52.642 24.968 QT
-52.986 24.968 -53.244 24.741 QT
-53.502 24.515 -53.502 24.14 QT
cp
f
GR
GS
[0.75 0 0 0.75 217.50016 288.49999] CT
0.149 GC
N
-24.153 24.968 M
-25.528 24.968 -26.575 24.241 QT
-27.621 23.515 -28.161 22.296 QT
-28.7 21.077 -28.7 19.718 QT
-28.7 17.64 -27.661 15.82 QT
-26.621 13.999 -24.84 12.913 QT
-23.059 11.827 -21.012 11.827 QT
-19.778 11.827 -18.848 12.468 QT
-17.918 13.109 -17.918 14.312 QT
-17.918 15.984 -19.246 16.796 QT
-20.575 17.609 -22.246 17.804 QT
-23.918 17.999 -25.95 17.999 QT
-26.028 17.999 L
-26.496 19.734 -26.496 20.952 QT
-26.496 22.249 -25.903 23.226 QT
-25.309 24.202 -24.09 24.202 QT
-22.356 24.202 -20.77 23.406 QT
-19.184 22.609 -18.168 21.218 QT
-18.09 21.124 -17.95 21.124 QT
-17.809 21.124 -17.661 21.288 QT
-17.512 21.452 -17.512 21.593 QT
-17.512 21.702 -17.559 21.765 QT
-18.621 23.249 -20.418 24.109 QT
-22.215 24.968 -24.153 24.968 QT
cp
-25.856 17.249 M
-24.168 17.249 -22.739 17.093 QT
-21.309 16.937 -20.153 16.304 QT
-18.996 15.671 -18.996 14.343 QT
-18.996 13.812 -19.293 13.406 QT
-19.59 12.999 -20.067 12.788 QT
-20.543 12.577 -21.043 12.577 QT
-22.278 12.577 -23.262 13.241 QT
-24.246 13.906 -24.887 14.976 QT
-25.528 16.046 -25.856 17.249 QT
cp
f
GR
GS
[0.75 0 0 0.75 217.50016 288.49999] CT
0.149 GC
N
-13.807 22.874 M
-13.026 24.202 -10.666 24.202 QT
-9.651 24.202 -8.729 23.851 QT
-7.807 23.499 -7.205 22.812 QT
-6.604 22.124 -6.604 21.124 QT
-6.604 20.374 -7.143 19.898 QT
-7.682 19.421 -8.463 19.249 QT
-10.041 18.937 L
-11.104 18.671 -11.799 17.929 QT
-12.494 17.187 -12.494 16.14 QT
-12.494 14.859 -11.799 13.866 QT
-11.104 12.874 -9.955 12.351 QT
-8.807 11.827 -7.572 11.827 QT
-6.26 11.827 -5.213 12.452 QT
-4.166 13.077 -4.166 14.312 QT
-4.166 14.984 -4.541 15.491 QT
-4.916 15.999 -5.588 15.999 QT
-5.979 15.999 -6.252 15.749 QT
-6.526 15.499 -6.526 15.124 QT
-6.526 14.781 -6.33 14.46 QT
-6.135 14.14 -5.822 13.952 QT
-5.51 13.765 -5.166 13.765 QT
-5.416 13.14 -6.119 12.859 QT
-6.822 12.577 -7.635 12.577 QT
-8.369 12.577 -9.104 12.874 QT
-9.838 13.171 -10.283 13.741 QT
-10.729 14.312 -10.729 15.093 QT
-10.729 15.624 -10.362 16.015 QT
-9.994 16.406 -9.447 16.577 QT
-7.776 16.921 L
-6.963 17.093 -6.291 17.523 QT
-5.619 17.952 -5.229 18.616 QT
-4.838 19.281 -4.838 20.124 QT
-4.838 21.202 -5.44 22.249 QT
-6.041 23.296 -6.916 23.921 QT
-8.463 24.968 -10.697 24.968 QT
-12.244 24.968 -13.533 24.257 QT
-14.822 23.546 -14.822 22.14 QT
-14.822 21.359 -14.362 20.773 QT
-13.901 20.187 -13.104 20.187 QT
-12.635 20.187 -12.322 20.468 QT
-12.01 20.749 -12.01 21.218 QT
-12.01 21.874 -12.502 22.374 QT
-12.994 22.874 -13.666 22.874 QT
-13.807 22.874 L
cp
f
GR
GS
[0.75 0 0 0.75 217.50016 288.49999] CT
0.149 GC
N
2.474 24.968 M
0.646 24.968 -0.408 23.585 QT
-1.463 22.202 -1.463 20.327 QT
-1.463 18.468 -0.502 16.468 QT
0.459 14.468 2.092 13.148 QT
3.724 11.827 5.615 11.827 QT
6.474 11.827 7.154 12.296 QT
7.834 12.765 8.224 13.562 QT
8.537 12.406 9.49 12.406 QT
9.865 12.406 10.107 12.624 QT
10.349 12.843 10.349 13.218 QT
10.349 13.296 10.349 13.343 QT
10.349 13.39 10.334 13.437 QT
8.303 21.546 L
8.099 22.406 8.099 22.952 QT
8.099 24.202 8.943 24.202 QT
9.849 24.202 10.326 23.046 QT
10.803 21.89 11.115 20.374 QT
11.178 20.202 11.349 20.202 QT
11.709 20.202 L
11.818 20.202 11.888 20.304 QT
11.959 20.406 11.959 20.484 QT
11.443 22.515 10.842 23.741 QT
10.24 24.968 8.881 24.968 QT
7.912 24.968 7.162 24.39 QT
6.412 23.812 6.224 22.874 QT
4.349 24.968 2.474 24.968 QT
cp
2.49 24.202 M
3.553 24.202 4.529 23.413 QT
5.506 22.624 6.224 21.562 QT
6.256 21.546 6.256 21.484 QT
7.803 15.187 L
7.834 15.093 L
7.662 14.062 7.092 13.32 QT
6.521 12.577 5.537 12.577 QT
4.568 12.577 3.724 13.374 QT
2.881 14.171 2.303 15.265 QT
1.74 16.421 1.217 18.452 QT
0.693 20.484 0.693 21.593 QT
0.693 22.593 1.131 23.398 QT
1.568 24.202 2.49 24.202 QT
cp
f
GR
GS
[0.75 0 0 0.75 217.50016 288.49999] CT
0.149 GC
N
15.167 24.14 M
15.167 23.968 15.198 23.89 QT
17.37 15.234 L
17.573 14.437 17.573 13.827 QT
17.573 12.577 16.73 12.577 QT
15.823 12.577 15.386 13.663 QT
14.948 14.749 14.527 16.406 QT
14.527 16.484 14.448 16.531 QT
14.37 16.577 14.292 16.577 QT
13.948 16.577 L
13.855 16.577 13.784 16.476 QT
13.714 16.374 13.714 16.281 QT
14.027 15.031 14.316 14.148 QT
14.605 13.265 15.222 12.546 QT
15.839 11.827 16.761 11.827 QT
17.839 11.827 18.675 12.515 QT
19.511 13.202 19.511 14.265 QT
20.386 13.124 21.542 12.476 QT
22.698 11.827 24.011 11.827 QT
25.386 11.827 26.378 12.531 QT
27.37 13.234 27.37 14.515 QT
28.261 13.249 29.464 12.538 QT
30.667 11.827 32.073 11.827 QT
33.573 11.827 34.487 12.64 QT
35.402 13.452 35.402 14.952 QT
35.402 16.14 34.87 17.827 QT
34.339 19.515 33.558 21.593 QT
33.136 22.593 33.136 23.343 QT
33.136 24.202 33.823 24.202 QT
34.948 24.202 35.698 22.984 QT
36.448 21.765 36.761 20.374 QT
36.855 20.202 37.011 20.202 QT
37.339 20.202 L
37.464 20.202 37.542 20.281 QT
37.62 20.359 37.62 20.468 QT
37.62 20.484 37.589 20.546 QT
37.183 22.187 36.198 23.577 QT
35.214 24.968 33.745 24.968 QT
32.73 24.968 32.011 24.265 QT
31.292 23.562 31.292 22.562 QT
31.292 22.046 31.527 21.421 QT
32.339 19.249 32.886 17.531 QT
33.433 15.812 33.433 14.515 QT
33.433 13.702 33.112 13.14 QT
32.792 12.577 32.027 12.577 QT
30.433 12.577 29.277 13.546 QT
28.12 14.515 27.261 16.109 QT
27.214 16.406 27.183 16.562 QT
25.308 23.999 L
25.214 24.406 24.862 24.687 QT
24.511 24.968 24.089 24.968 QT
23.745 24.968 23.487 24.741 QT
23.23 24.515 23.23 24.14 QT
23.23 23.968 23.261 23.89 QT
25.105 16.499 L
25.402 15.312 25.402 14.515 QT
25.402 13.702 25.073 13.14 QT
24.745 12.577 23.948 12.577 QT
22.886 12.577 21.995 13.046 QT
21.105 13.515 20.441 14.281 QT
19.777 15.046 19.214 16.109 QT
17.245 23.999 L
17.152 24.406 16.808 24.687 QT
16.464 24.968 16.027 24.968 QT
15.683 24.968 15.425 24.741 QT
15.167 24.515 15.167 24.14 QT
cp
f
GR
GS
[0.75 0 0 0.75 217.50016 288.49999] CT
0.149 GC
N
37.969 30.265 M
37.703 30.265 37.703 29.89 QT
37.797 29.249 38.078 29.249 QT
38.985 29.249 39.344 29.093 QT
39.703 28.937 39.907 28.265 QT
43.172 15.202 L
43.391 14.671 43.391 13.827 QT
43.391 12.577 42.547 12.577 QT
41.641 12.577 41.196 13.663 QT
40.75 14.749 40.344 16.406 QT
40.344 16.577 40.11 16.577 QT
39.766 16.577 L
39.688 16.577 39.602 16.476 QT
39.516 16.374 39.516 16.281 QT
39.828 15.031 40.125 14.148 QT
40.422 13.265 41.032 12.546 QT
41.641 11.827 42.563 11.827 QT
43.563 11.827 44.313 12.382 QT
45.063 12.937 45.266 13.906 QT
46.063 12.984 47.024 12.406 QT
47.985 11.827 49.016 11.827 QT
50.235 11.827 51.133 12.476 QT
52.032 13.124 52.485 14.179 QT
52.938 15.234 52.938 16.452 QT
52.938 18.327 51.977 20.32 QT
51.016 22.312 49.383 23.64 QT
47.75 24.968 45.875 24.968 QT
45.032 24.968 44.344 24.484 QT
43.657 23.999 43.282 23.218 QT
41.953 28.374 L
41.891 28.796 41.875 28.874 QT
41.875 29.249 43.782 29.249 QT
44.078 29.249 44.078 29.624 QT
43.985 29.999 43.922 30.132 QT
43.86 30.265 43.594 30.265 QT
37.969 30.265 L
cp
45.907 24.202 M
46.922 24.202 47.782 23.374 QT
48.641 22.546 49.188 21.515 QT
49.578 20.734 49.922 19.609 QT
50.266 18.484 50.524 17.21 QT
50.782 15.937 50.782 15.187 QT
50.782 14.515 50.602 13.937 QT
50.422 13.359 50.024 12.968 QT
49.625 12.577 48.953 12.577 QT
47.891 12.577 46.953 13.335 QT
46.016 14.093 45.25 15.202 QT
45.25 15.312 L
43.641 21.702 L
43.844 22.749 44.407 23.476 QT
44.969 24.202 45.907 24.202 QT
cp
f
GR
GS
[0.75 0 0 0.75 217.50016 288.49999] CT
0.149 GC
N
54.727 22.296 M
54.727 22.202 54.743 22.031 QT
54.759 21.859 54.782 21.702 QT
54.806 21.546 54.806 21.452 QT
58.399 7.093 L
58.509 6.593 58.54 6.312 QT
58.54 5.843 56.665 5.843 QT
56.384 5.843 56.384 5.468 QT
56.399 5.39 56.446 5.21 QT
56.493 5.031 56.571 4.929 QT
56.649 4.827 56.79 4.827 QT
60.696 4.515 L
61.056 4.515 61.056 4.89 QT
56.868 21.562 L
56.665 22.031 56.665 22.952 QT
56.665 24.202 57.509 24.202 QT
58.399 24.202 58.845 23.093 QT
59.29 21.984 59.649 20.374 QT
59.712 20.202 59.884 20.202 QT
60.227 20.202 L
60.337 20.202 60.415 20.296 QT
60.493 20.39 60.493 20.484 QT
60.165 21.89 59.884 22.702 QT
59.602 23.515 58.993 24.241 QT
58.384 24.968 57.446 24.968 QT
56.29 24.968 55.509 24.218 QT
54.727 23.468 54.727 22.296 QT
cp
f
GR
GS
[0.75 0 0 0.75 217.50016 288.49999] CT
0.149 GC
N
68.604 24.968 M
67.229 24.968 66.182 24.241 QT
65.135 23.515 64.596 22.296 QT
64.057 21.077 64.057 19.718 QT
64.057 17.64 65.096 15.82 QT
66.135 13.999 67.916 12.913 QT
69.698 11.827 71.745 11.827 QT
72.979 11.827 73.909 12.468 QT
74.838 13.109 74.838 14.312 QT
74.838 15.984 73.51 16.796 QT
72.182 17.609 70.51 17.804 QT
68.838 17.999 66.807 17.999 QT
66.729 17.999 L
66.26 19.734 66.26 20.952 QT
66.26 22.249 66.854 23.226 QT
67.448 24.202 68.666 24.202 QT
70.401 24.202 71.987 23.406 QT
73.573 22.609 74.588 21.218 QT
74.666 21.124 74.807 21.124 QT
74.948 21.124 75.096 21.288 QT
75.245 21.452 75.245 21.593 QT
75.245 21.702 75.198 21.765 QT
74.135 23.249 72.338 24.109 QT
70.541 24.968 68.604 24.968 QT
cp
66.901 17.249 M
68.588 17.249 70.018 17.093 QT
71.448 16.937 72.604 16.304 QT
73.76 15.671 73.76 14.343 QT
73.76 13.812 73.463 13.406 QT
73.166 12.999 72.69 12.788 QT
72.213 12.577 71.713 12.577 QT
70.479 12.577 69.495 13.241 QT
68.51 13.906 67.87 14.976 QT
67.229 16.046 66.901 17.249 QT
cp
f
GR
GS
[0.75 0 0 0.75 0 0] CT
0.149 GC
2 setlinecap
1 LJ
0.667 LW
N
73 359 M
73 39 L
S
GR
GS
[0.75 0 0 0.75 0 0] CT
0.149 GC
2 setlinecap
1 LJ
0.667 LW
N
73 359 M
77.34 359 L
S
GR
GS
[0.75 0 0 0.75 0 0] CT
0.149 GC
2 setlinecap
1 LJ
0.667 LW
N
73 313.286 M
77.34 313.286 L
S
GR
GS
[0.75 0 0 0.75 0 0] CT
0.149 GC
2 setlinecap
1 LJ
0.667 LW
N
73 267.571 M
77.34 267.571 L
S
GR
GS
[0.75 0 0 0.75 0 0] CT
0.149 GC
2 setlinecap
1 LJ
0.667 LW
N
73 221.857 M
77.34 221.857 L
S
GR
GS
[0.75 0 0 0.75 0 0] CT
0.149 GC
2 setlinecap
1 LJ
0.667 LW
N
73 176.143 M
77.34 176.143 L
S
GR
GS
[0.75 0 0 0.75 0 0] CT
0.149 GC
2 setlinecap
1 LJ
0.667 LW
N
73 130.429 M
77.34 130.429 L
S
GR
GS
[0.75 0 0 0.75 0 0] CT
0.149 GC
2 setlinecap
1 LJ
0.667 LW
N
73 84.714 M
77.34 84.714 L
S
GR
GS
[0.75 0 0 0.75 0 0] CT
0.149 GC
2 setlinecap
1 LJ
0.667 LW
N
73 39 M
77.34 39 L
S
GR
GS
[0.75 0 0 0.75 50.75 269.25] CT
0.149 GC
/Helvetica 13.333 F
GS
[1 0 0 1 0 0] CT
-12 5.5 moveto 
1 -1 scale
(-4) t 
GR
GR
GS
[0.75 0 0 0.75 50.75 234.96428] CT
0.149 GC
/Helvetica 13.333 F
GS
[1 0 0 1 0 0] CT
-12 5.5 moveto 
1 -1 scale
(-3) t 
GR
GR
GS
[0.75 0 0 0.75 50.75 200.67858] CT
0.149 GC
/Helvetica 13.333 F
GS
[1 0 0 1 0 0] CT
-12 5.5 moveto 
1 -1 scale
(-2) t 
GR
GR
GS
[0.75 0 0 0.75 50.75 166.39286] CT
0.149 GC
/Helvetica 13.333 F
GS
[1 0 0 1 0 0] CT
-12 5.5 moveto 
1 -1 scale
(-1) t 
GR
GR
GS
[0.75 0 0 0.75 50.75 132.10714] CT
0.149 GC
/Helvetica 13.333 F
GS
[1 0 0 1 0 0] CT
-8 5.5 moveto 
1 -1 scale
(0) t 
GR
GR
GS
[0.75 0 0 0.75 50.75 97.82143] CT
0.149 GC
/Helvetica 13.333 F
GS
[1 0 0 1 0 0] CT
-8 5.5 moveto 
1 -1 scale
(1) t 
GR
GR
GS
[0.75 0 0 0.75 50.75 63.53572] CT
0.149 GC
/Helvetica 13.333 F
GS
[1 0 0 1 0 0] CT
-8 5.5 moveto 
1 -1 scale
(2) t 
GR
GR
GS
[0.75 0 0 0.75 50.75 29.25] CT
0.149 GC
/Helvetica 13.333 F
GS
[1 0 0 1 0 0] CT
-8 5.5 moveto 
1 -1 scale
(3) t 
GR
GR
GS
[0 -0.75 0.75 0 38.75 149.24989] CT
0.149 GC
N
-40.793 -28.357 M
-40.793 -28.998 -40.308 -29.482 QT
-39.824 -29.966 -39.199 -29.966 QT
-38.793 -29.966 -38.41 -29.748 QT
-38.027 -29.529 -37.816 -29.146 QT
-37.605 -28.763 -37.605 -28.357 QT
-37.605 -27.732 -38.074 -27.255 QT
-38.543 -26.779 -39.199 -26.779 QT
-39.824 -26.779 -40.308 -27.255 QT
-40.793 -27.732 -40.793 -28.357 QT
cp
f
GR
GS
[0 -0.75 0.75 0 38.75 149.24989] CT
0.149 GC
N
-45.576 -11.06 M
-45.576 -11.232 -45.545 -11.31 QT
-43.373 -19.966 L
-43.17 -20.763 -43.17 -21.373 QT
-43.17 -22.623 -44.014 -22.623 QT
-44.92 -22.623 -45.357 -21.537 QT
-45.795 -20.451 -46.217 -18.794 QT
-46.217 -18.716 -46.295 -18.669 QT
-46.373 -18.623 -46.451 -18.623 QT
-46.795 -18.623 L
-46.889 -18.623 -46.959 -18.724 QT
-47.029 -18.826 -47.029 -18.919 QT
-46.717 -20.169 -46.428 -21.052 QT
-46.139 -21.935 -45.521 -22.654 QT
-44.904 -23.373 -43.982 -23.373 QT
-42.982 -23.373 -42.224 -22.794 QT
-41.467 -22.216 -41.279 -21.263 QT
-40.545 -22.232 -39.607 -22.802 QT
-38.67 -23.373 -37.545 -23.373 QT
-36.623 -23.373 -35.92 -22.834 QT
-35.217 -22.294 -35.217 -21.373 QT
-35.217 -20.638 -35.678 -20.091 QT
-36.139 -19.544 -36.904 -19.544 QT
-37.373 -19.544 -37.693 -19.841 QT
-38.014 -20.138 -38.014 -20.607 QT
-38.014 -21.232 -37.545 -21.74 QT
-37.076 -22.248 -36.467 -22.248 QT
-36.935 -22.623 -37.607 -22.623 QT
-38.842 -22.623 -39.764 -21.74 QT
-40.685 -20.857 -41.42 -19.498 QT
-43.498 -11.201 L
-43.592 -10.794 -43.935 -10.513 QT
-44.279 -10.232 -44.717 -10.232 QT
-45.06 -10.232 -45.318 -10.459 QT
-45.576 -10.685 -45.576 -11.06 QT
cp
f
GR
GS
[0 -0.75 0.75 0 38.75 149.24989] CT
0.149 GC
N
-33.545 -5.926 M
-33.717 -5.926 -33.717 -6.113 QT
-33.717 -6.223 -33.67 -6.27 QT
-33.108 -7.238 -32.311 -8.121 QT
-31.514 -9.004 -30.506 -9.918 QT
-29.498 -10.832 -28.483 -11.738 QT
-27.467 -12.645 -26.826 -13.363 QT
-26.905 -13.363 L
-27.373 -13.363 -28.264 -13.66 QT
-29.155 -13.957 -29.67 -13.957 QT
-30.217 -13.957 -30.74 -13.715 QT
-31.264 -13.473 -31.405 -12.973 QT
-31.436 -12.816 -31.576 -12.816 QT
-31.826 -12.816 L
-31.998 -12.816 -31.998 -13.035 QT
-31.998 -13.098 L
-31.826 -13.707 -31.451 -14.238 QT
-31.076 -14.77 -30.53 -15.105 QT
-29.983 -15.441 -29.389 -15.441 QT
-28.967 -15.441 -28.694 -15.254 QT
-28.42 -15.066 -28.045 -14.66 QT
-27.67 -14.254 -27.444 -14.082 QT
-27.217 -13.91 -26.858 -13.91 QT
-26.405 -13.91 -26.037 -14.332 QT
-25.67 -14.754 -25.311 -15.379 QT
-25.248 -15.441 -25.17 -15.441 QT
-24.92 -15.441 L
-24.842 -15.441 -24.795 -15.387 QT
-24.748 -15.332 -24.748 -15.254 QT
-24.748 -15.191 -24.795 -15.129 QT
-25.358 -14.145 -26.108 -13.301 QT
-26.858 -12.457 -28.076 -11.363 QT
-29.295 -10.27 -30.131 -9.52 QT
-30.967 -8.77 -31.701 -7.973 QT
-31.53 -8.004 -31.248 -8.004 QT
-30.748 -8.004 -29.858 -7.715 QT
-28.967 -7.426 -28.483 -7.426 QT
-27.967 -7.426 -27.428 -7.652 QT
-26.889 -7.879 -26.506 -8.285 QT
-26.123 -8.691 -25.983 -9.223 QT
-25.936 -9.363 -25.826 -9.363 QT
-25.561 -9.363 L
-25.483 -9.363 -25.428 -9.301 QT
-25.373 -9.238 -25.373 -9.16 QT
-25.373 -9.145 -25.405 -9.098 QT
-25.592 -8.301 -26.076 -7.582 QT
-26.561 -6.863 -27.264 -6.395 QT
-27.967 -5.926 -28.764 -5.926 QT
-29.155 -5.926 -29.436 -6.113 QT
-29.717 -6.301 -30.092 -6.699 QT
-30.467 -7.098 -30.701 -7.277 QT
-30.936 -7.457 -31.28 -7.457 QT
-32.326 -7.457 -33.155 -5.988 QT
-33.217 -5.926 -33.295 -5.926 QT
-33.545 -5.926 L
cp
f
GR
GS
[0 -0.75 0.75 0 38.75 149.24989] CT
0.149 GC
N
-19.236 -3.31 M
-19.236 -32.31 L
-15.267 -32.31 L
-15.267 -31.154 L
-18.064 -31.154 L
-18.064 -4.466 L
-15.267 -4.466 L
-15.267 -3.31 L
-19.236 -3.31 L
cp
f
GR
GS
[0 -0.75 0.75 0 38.75 149.24989] CT
0.149 GC
N
-12.275 -11.06 M
-12.275 -11.232 -12.244 -11.31 QT
-10.072 -19.966 L
-9.869 -20.763 -9.869 -21.373 QT
-9.869 -22.623 -10.713 -22.623 QT
-11.619 -22.623 -12.056 -21.537 QT
-12.494 -20.451 -12.916 -18.794 QT
-12.916 -18.716 -12.994 -18.669 QT
-13.072 -18.623 -13.15 -18.623 QT
-13.494 -18.623 L
-13.588 -18.623 -13.658 -18.724 QT
-13.728 -18.826 -13.728 -18.919 QT
-13.416 -20.169 -13.127 -21.052 QT
-12.838 -21.935 -12.22 -22.654 QT
-11.603 -23.373 -10.681 -23.373 QT
-9.603 -23.373 -8.767 -22.685 QT
-7.931 -21.998 -7.931 -20.935 QT
-7.056 -22.076 -5.9 -22.724 QT
-4.744 -23.373 -3.431 -23.373 QT
-2.056 -23.373 -1.064 -22.669 QT
-0.072 -21.966 -0.072 -20.685 QT
0.819 -21.951 2.022 -22.662 QT
3.225 -23.373 4.631 -23.373 QT
6.131 -23.373 7.045 -22.56 QT
7.959 -21.748 7.959 -20.248 QT
7.959 -19.06 7.428 -17.373 QT
6.897 -15.685 6.115 -13.607 QT
5.694 -12.607 5.694 -11.857 QT
5.694 -10.998 6.381 -10.998 QT
7.506 -10.998 8.256 -12.216 QT
9.006 -13.435 9.319 -14.826 QT
9.412 -14.998 9.569 -14.998 QT
9.897 -14.998 L
10.022 -14.998 10.1 -14.919 QT
10.178 -14.841 10.178 -14.732 QT
10.178 -14.716 10.147 -14.654 QT
9.74 -13.013 8.756 -11.623 QT
7.772 -10.232 6.303 -10.232 QT
5.287 -10.232 4.569 -10.935 QT
3.85 -11.638 3.85 -12.638 QT
3.85 -13.154 4.084 -13.779 QT
4.897 -15.951 5.444 -17.669 QT
5.99 -19.388 5.99 -20.685 QT
5.99 -21.498 5.67 -22.06 QT
5.35 -22.623 4.584 -22.623 QT
2.99 -22.623 1.834 -21.654 QT
0.678 -20.685 -0.181 -19.091 QT
-0.228 -18.794 -0.26 -18.638 QT
-2.135 -11.201 L
-2.228 -10.794 -2.58 -10.513 QT
-2.931 -10.232 -3.353 -10.232 QT
-3.697 -10.232 -3.955 -10.459 QT
-4.213 -10.685 -4.213 -11.06 QT
-4.213 -11.232 -4.181 -11.31 QT
-2.338 -18.701 L
-2.041 -19.888 -2.041 -20.685 QT
-2.041 -21.498 -2.369 -22.06 QT
-2.697 -22.623 -3.494 -22.623 QT
-4.556 -22.623 -5.447 -22.154 QT
-6.338 -21.685 -7.002 -20.919 QT
-7.666 -20.154 -8.228 -19.091 QT
-10.197 -11.201 L
-10.291 -10.794 -10.635 -10.513 QT
-10.978 -10.232 -11.416 -10.232 QT
-11.76 -10.232 -12.017 -10.459 QT
-12.275 -10.685 -12.275 -11.06 QT
cp
f
GR
GS
[0 -0.75 0.75 0 38.75 149.24989] CT
0.149 GC
N
12.871 -3.888 M
12.871 -3.982 12.902 -3.998 QT
22.98 -31.951 L
23.042 -32.123 23.183 -32.216 QT
23.324 -32.31 23.511 -32.31 QT
23.761 -32.31 23.925 -32.154 QT
24.089 -31.998 24.089 -31.732 QT
24.089 -31.623 L
14.011 -3.669 L
13.839 -3.31 13.449 -3.31 QT
13.214 -3.31 13.042 -3.482 QT
12.871 -3.654 12.871 -3.888 QT
cp
f
GR
GS
[0 -0.75 0.75 0 38.75 149.24989] CT
0.149 GC
N
28.428 -12.326 M
29.209 -10.998 31.569 -10.998 QT
32.584 -10.998 33.506 -11.349 QT
34.428 -11.701 35.029 -12.388 QT
35.631 -13.076 35.631 -14.076 QT
35.631 -14.826 35.092 -15.302 QT
34.553 -15.779 33.772 -15.951 QT
32.194 -16.263 L
31.131 -16.529 30.436 -17.271 QT
29.74 -18.013 29.74 -19.06 QT
29.74 -20.341 30.436 -21.334 QT
31.131 -22.326 32.279 -22.849 QT
33.428 -23.373 34.662 -23.373 QT
35.975 -23.373 37.022 -22.748 QT
38.069 -22.123 38.069 -20.888 QT
38.069 -20.216 37.694 -19.709 QT
37.319 -19.201 36.647 -19.201 QT
36.256 -19.201 35.983 -19.451 QT
35.709 -19.701 35.709 -20.076 QT
35.709 -20.419 35.904 -20.74 QT
36.1 -21.06 36.412 -21.248 QT
36.725 -21.435 37.069 -21.435 QT
36.819 -22.06 36.115 -22.341 QT
35.412 -22.623 34.6 -22.623 QT
33.865 -22.623 33.131 -22.326 QT
32.397 -22.029 31.951 -21.459 QT
31.506 -20.888 31.506 -20.107 QT
31.506 -19.576 31.873 -19.185 QT
32.24 -18.794 32.787 -18.623 QT
34.459 -18.279 L
35.272 -18.107 35.944 -17.677 QT
36.615 -17.248 37.006 -16.584 QT
37.397 -15.919 37.397 -15.076 QT
37.397 -13.998 36.795 -12.951 QT
36.194 -11.904 35.319 -11.279 QT
33.772 -10.232 31.537 -10.232 QT
29.99 -10.232 28.701 -10.943 QT
27.412 -11.654 27.412 -13.06 QT
27.412 -13.841 27.873 -14.427 QT
28.334 -15.013 29.131 -15.013 QT
29.6 -15.013 29.912 -14.732 QT
30.225 -14.451 30.225 -13.982 QT
30.225 -13.326 29.733 -12.826 QT
29.24 -12.326 28.569 -12.326 QT
28.428 -12.326 L
cp
f
GR
GS
[0 -0.75 0.75 0 38.75 149.24989] CT
0.149 GC
N
40.303 -3.31 M
40.303 -4.466 L
43.115 -4.466 L
43.115 -31.154 L
40.303 -31.154 L
40.303 -32.31 L
44.272 -32.31 L
44.272 -3.31 L
40.303 -3.31 L
cp
f
GR
GS
[0.75 0 0 0.75 217.50021 25.5] CT
N
-84.982 -9.303 M
-91.341 -26.241 L
-91.575 -26.803 -92.247 -26.952 QT
-92.919 -27.1 -93.966 -27.1 QT
-93.966 -28.038 L
-86.544 -28.038 L
-86.544 -27.1 L
-88.779 -27.1 -88.779 -26.397 QT
-88.779 -26.35 -88.771 -26.319 QT
-88.763 -26.288 -88.763 -26.241 QT
-83.575 -12.459 L
-78.685 -25.506 L
-78.638 -25.6 -78.638 -25.834 QT
-78.638 -26.491 -79.239 -26.795 QT
-79.841 -27.1 -80.607 -27.1 QT
-80.607 -28.038 L
-74.779 -28.038 L
-74.779 -27.1 L
-75.794 -27.1 -76.56 -26.725 QT
-77.325 -26.35 -77.654 -25.506 QT
-83.763 -9.303 L
-83.841 -9.006 -84.2 -9.006 QT
-84.544 -9.006 L
-84.904 -9.006 -84.982 -9.303 QT
cp
f
GR
GS
[0.75 0 0 0.75 217.50021 25.5] CT
N
-69.985 -9.303 M
-71.626 -9.303 -73.001 -10.163 QT
-74.376 -11.022 -75.165 -12.467 QT
-75.954 -13.913 -75.954 -15.522 QT
-75.954 -17.1 -75.235 -18.522 QT
-74.516 -19.944 -73.227 -20.827 QT
-71.938 -21.709 -70.36 -21.709 QT
-69.126 -21.709 -68.212 -21.288 QT
-67.298 -20.866 -66.704 -20.131 QT
-66.11 -19.397 -65.805 -18.397 QT
-65.501 -17.397 -65.501 -16.194 QT
-65.501 -15.834 -65.782 -15.834 QT
-73.594 -15.834 L
-73.594 -15.553 L
-73.594 -13.303 -72.688 -11.694 QT
-71.782 -10.084 -69.735 -10.084 QT
-68.907 -10.084 -68.204 -10.452 QT
-67.501 -10.819 -66.977 -11.483 QT
-66.454 -12.147 -66.282 -12.897 QT
-66.251 -12.991 -66.18 -13.061 QT
-66.11 -13.131 -66.016 -13.131 QT
-65.782 -13.131 L
-65.501 -13.131 -65.501 -12.788 QT
-65.876 -11.256 -67.141 -10.28 QT
-68.407 -9.303 -69.985 -9.303 QT
cp
-73.563 -16.506 M
-67.407 -16.506 L
-67.407 -17.522 -67.688 -18.561 QT
-67.969 -19.6 -68.634 -20.295 QT
-69.298 -20.991 -70.36 -20.991 QT
-71.891 -20.991 -72.727 -19.561 QT
-73.563 -18.131 -73.563 -16.506 QT
cp
f
GR
GS
[0.75 0 0 0.75 217.50021 25.5] CT
N
-64.149 -9.6 M
-64.149 -10.553 L
-63.227 -10.553 -62.633 -10.694 QT
-62.04 -10.834 -62.04 -11.413 QT
-62.04 -18.772 L
-62.04 -19.506 -62.258 -19.827 QT
-62.477 -20.147 -62.883 -20.217 QT
-63.29 -20.288 -64.149 -20.288 QT
-64.149 -21.241 L
-60.29 -21.538 L
-60.29 -18.897 L
-59.852 -20.069 -59.047 -20.803 QT
-58.243 -21.538 -57.102 -21.538 QT
-56.29 -21.538 -55.657 -21.061 QT
-55.024 -20.584 -55.024 -19.803 QT
-55.024 -19.319 -55.375 -18.952 QT
-55.727 -18.584 -56.243 -18.584 QT
-56.743 -18.584 -57.102 -18.944 QT
-57.461 -19.303 -57.461 -19.803 QT
-57.461 -20.522 -56.946 -20.834 QT
-57.102 -20.834 L
-58.196 -20.834 -58.883 -20.045 QT
-59.571 -19.256 -59.868 -18.077 QT
-60.165 -16.897 -60.165 -15.834 QT
-60.165 -11.413 L
-60.165 -10.553 -57.54 -10.553 QT
-57.54 -9.6 L
-64.149 -9.6 L
cp
f
GR
GS
[0.75 0 0 0.75 217.50021 25.5] CT
N
-51.658 -12.85 M
-51.658 -20.288 L
-53.892 -20.288 L
-53.892 -20.991 L
-52.126 -20.991 -51.298 -22.639 QT
-50.47 -24.288 -50.47 -26.209 QT
-49.689 -26.209 L
-49.689 -21.241 L
-45.876 -21.241 L
-45.876 -20.288 L
-49.689 -20.288 L
-49.689 -12.897 L
-49.689 -11.772 -49.314 -10.928 QT
-48.939 -10.084 -47.954 -10.084 QT
-47.033 -10.084 -46.626 -10.975 QT
-46.22 -11.866 -46.22 -12.897 QT
-46.22 -14.491 L
-45.439 -14.491 L
-45.439 -12.85 L
-45.439 -12.006 -45.751 -11.178 QT
-46.064 -10.35 -46.673 -9.827 QT
-47.283 -9.303 -48.142 -9.303 QT
-49.767 -9.303 -50.712 -10.272 QT
-51.658 -11.241 -51.658 -12.85 QT
cp
f
GR
GS
[0.75 0 0 0.75 217.50021 25.5] CT
N
-43.209 -9.6 M
-43.209 -10.553 L
-42.287 -10.553 -41.693 -10.694 QT
-41.1 -10.834 -41.1 -11.413 QT
-41.1 -18.772 L
-41.1 -19.819 -41.498 -20.053 QT
-41.897 -20.288 -43.084 -20.288 QT
-43.084 -21.241 L
-39.193 -21.538 L
-39.193 -11.413 L
-39.193 -10.834 -38.686 -10.694 QT
-38.178 -10.553 -37.318 -10.553 QT
-37.318 -9.6 L
-43.209 -9.6 L
cp
-42.053 -26.178 M
-42.053 -26.772 -41.607 -27.217 QT
-41.162 -27.663 -40.584 -27.663 QT
-40.193 -27.663 -39.842 -27.467 QT
-39.49 -27.272 -39.295 -26.913 QT
-39.1 -26.553 -39.1 -26.178 QT
-39.1 -25.584 -39.545 -25.139 QT
-39.99 -24.694 -40.584 -24.694 QT
-41.162 -24.694 -41.607 -25.139 QT
-42.053 -25.584 -42.053 -26.178 QT
cp
f
GR
GS
[0.75 0 0 0.75 217.50021 25.5] CT
N
-29.911 -9.303 M
-31.536 -9.303 -32.872 -10.147 QT
-34.208 -10.991 -34.973 -12.413 QT
-35.739 -13.834 -35.739 -15.428 QT
-35.739 -17.022 -34.981 -18.483 QT
-34.223 -19.944 -32.88 -20.827 QT
-31.536 -21.709 -29.911 -21.709 QT
-28.317 -21.709 -27.02 -21.084 QT
-25.723 -20.459 -25.723 -19.053 QT
-25.723 -18.522 -26.098 -18.131 QT
-26.473 -17.741 -27.02 -17.741 QT
-27.552 -17.741 -27.934 -18.131 QT
-28.317 -18.522 -28.317 -19.053 QT
-28.317 -19.522 -28.013 -19.874 QT
-27.708 -20.225 -27.255 -20.319 QT
-28.192 -20.913 -29.88 -20.913 QT
-31.177 -20.913 -31.966 -20.053 QT
-32.755 -19.194 -33.067 -17.928 QT
-33.38 -16.663 -33.38 -15.428 QT
-33.38 -14.116 -32.997 -12.897 QT
-32.614 -11.678 -31.747 -10.881 QT
-30.88 -10.084 -29.583 -10.084 QT
-28.302 -10.084 -27.403 -10.874 QT
-26.505 -11.663 -26.177 -12.928 QT
-26.177 -13.084 -25.958 -13.084 QT
-25.63 -13.084 L
-25.552 -13.084 -25.489 -13.006 QT
-25.427 -12.928 -25.427 -12.85 QT
-25.427 -12.772 L
-25.833 -11.163 -27.044 -10.233 QT
-28.255 -9.303 -29.911 -9.303 QT
cp
f
GR
GS
[0.75 0 0 0.75 217.50021 25.5] CT
N
-23.7 -12.256 M
-23.7 -13.866 -22.434 -14.874 QT
-21.168 -15.881 -19.395 -16.295 QT
-17.622 -16.709 -16.028 -16.709 QT
-16.028 -17.819 L
-16.028 -18.584 -16.372 -19.319 QT
-16.715 -20.053 -17.356 -20.522 QT
-17.997 -20.991 -18.778 -20.991 QT
-20.575 -20.991 -21.512 -20.194 QT
-20.997 -20.194 -20.661 -19.803 QT
-20.325 -19.413 -20.325 -18.897 QT
-20.325 -18.35 -20.708 -17.967 QT
-21.09 -17.584 -21.606 -17.584 QT
-22.153 -17.584 -22.536 -17.967 QT
-22.918 -18.35 -22.918 -18.897 QT
-22.918 -20.319 -21.629 -21.014 QT
-20.34 -21.709 -18.778 -21.709 QT
-17.684 -21.709 -16.575 -21.241 QT
-15.465 -20.772 -14.762 -19.897 QT
-14.059 -19.022 -14.059 -17.866 QT
-14.059 -11.788 L
-14.059 -11.256 -13.833 -10.819 QT
-13.606 -10.381 -13.137 -10.381 QT
-12.684 -10.381 -12.465 -10.827 QT
-12.247 -11.272 -12.247 -11.788 QT
-12.247 -13.522 L
-11.465 -13.522 L
-11.465 -11.788 L
-11.465 -11.178 -11.778 -10.631 QT
-12.09 -10.084 -12.629 -9.764 QT
-13.168 -9.444 -13.778 -9.444 QT
-14.575 -9.444 -15.145 -10.053 QT
-15.715 -10.663 -15.793 -11.506 QT
-16.293 -10.491 -17.262 -9.897 QT
-18.231 -9.303 -19.34 -9.303 QT
-20.372 -9.303 -21.372 -9.6 QT
-22.372 -9.897 -23.036 -10.553 QT
-23.7 -11.209 -23.7 -12.256 QT
cp
-21.512 -12.256 M
-21.512 -11.303 -20.809 -10.655 QT
-20.106 -10.006 -19.168 -10.006 QT
-18.293 -10.006 -17.583 -10.444 QT
-16.872 -10.881 -16.45 -11.631 QT
-16.028 -12.381 -16.028 -13.209 QT
-16.028 -16.022 L
-17.247 -16.022 -18.536 -15.616 QT
-19.825 -15.209 -20.668 -14.358 QT
-21.512 -13.506 -21.512 -12.256 QT
cp
f
GR
GS
[0.75 0 0 0.75 217.50021 25.5] CT
N
-10.616 -9.6 M
-10.616 -10.553 L
-9.694 -10.553 -9.101 -10.694 QT
-8.507 -10.834 -8.507 -11.413 QT
-8.507 -25.584 L
-8.507 -26.303 -8.726 -26.624 QT
-8.944 -26.944 -9.351 -27.022 QT
-9.757 -27.1 -10.616 -27.1 QT
-10.616 -28.038 L
-6.601 -28.334 L
-6.601 -11.413 L
-6.601 -10.834 -6.007 -10.694 QT
-5.413 -10.553 -4.507 -10.553 QT
-4.507 -9.6 L
-10.616 -9.6 L
cp
f
GR
GS
[0.75 0 0 0.75 217.50021 25.5] CT
N
11.446 -9.6 M
7.508 -19.522 L
7.258 -20.022 6.735 -20.155 QT
6.211 -20.288 5.367 -20.288 QT
5.367 -21.241 L
11.039 -21.241 L
11.039 -20.288 L
9.524 -20.288 9.524 -19.647 QT
9.524 -19.538 9.539 -19.491 QT
12.571 -11.866 L
15.305 -18.756 L
15.383 -18.959 15.383 -19.178 QT
15.383 -19.694 14.992 -19.991 QT
14.602 -20.288 14.086 -20.288 QT
14.086 -21.241 L
18.571 -21.241 L
18.571 -20.288 L
17.727 -20.288 17.102 -19.905 QT
16.477 -19.522 16.133 -18.772 QT
12.492 -9.6 L
12.399 -9.303 12.071 -9.303 QT
11.867 -9.303 L
11.539 -9.303 11.446 -9.6 QT
cp
f
GR
GS
[0.75 0 0 0.75 217.50021 25.5] CT
N
24.904 -9.303 M
23.263 -9.303 21.888 -10.163 QT
20.513 -11.022 19.724 -12.467 QT
18.935 -13.913 18.935 -15.522 QT
18.935 -17.1 19.654 -18.522 QT
20.373 -19.944 21.662 -20.827 QT
22.951 -21.709 24.529 -21.709 QT
25.763 -21.709 26.677 -21.288 QT
27.591 -20.866 28.185 -20.131 QT
28.779 -19.397 29.084 -18.397 QT
29.388 -17.397 29.388 -16.194 QT
29.388 -15.834 29.107 -15.834 QT
21.295 -15.834 L
21.295 -15.553 L
21.295 -13.303 22.201 -11.694 QT
23.107 -10.084 25.154 -10.084 QT
25.982 -10.084 26.685 -10.452 QT
27.388 -10.819 27.912 -11.483 QT
28.435 -12.147 28.607 -12.897 QT
28.638 -12.991 28.709 -13.061 QT
28.779 -13.131 28.873 -13.131 QT
29.107 -13.131 L
29.388 -13.131 29.388 -12.788 QT
29.013 -11.256 27.748 -10.28 QT
26.482 -9.303 24.904 -9.303 QT
cp
21.326 -16.506 M
27.482 -16.506 L
27.482 -17.522 27.201 -18.561 QT
26.92 -19.6 26.255 -20.295 QT
25.591 -20.991 24.529 -20.991 QT
22.998 -20.991 22.162 -19.561 QT
21.326 -18.131 21.326 -16.506 QT
cp
f
GR
GS
[0.75 0 0 0.75 217.50021 25.5] CT
N
30.865 -9.6 M
30.865 -10.553 L
31.787 -10.553 32.381 -10.694 QT
32.975 -10.834 32.975 -11.413 QT
32.975 -25.584 L
32.975 -26.303 32.756 -26.624 QT
32.537 -26.944 32.131 -27.022 QT
31.725 -27.1 30.865 -27.1 QT
30.865 -28.038 L
34.881 -28.334 L
34.881 -11.413 L
34.881 -10.834 35.475 -10.694 QT
36.068 -10.553 36.975 -10.553 QT
36.975 -9.6 L
30.865 -9.6 L
cp
f
GR
GS
[0.75 0 0 0.75 217.50021 25.5] CT
N
44.194 -9.303 M
42.569 -9.303 41.187 -10.124 QT
39.804 -10.944 38.999 -12.327 QT
38.194 -13.709 38.194 -15.35 QT
38.194 -16.584 38.64 -17.733 QT
39.085 -18.881 39.905 -19.788 QT
40.726 -20.694 41.819 -21.202 QT
42.913 -21.709 44.194 -21.709 QT
45.851 -21.709 47.218 -20.827 QT
48.585 -19.944 49.374 -18.475 QT
50.163 -17.006 50.163 -15.35 QT
50.163 -13.725 49.359 -12.334 QT
48.554 -10.944 47.179 -10.124 QT
45.804 -9.303 44.194 -9.303 QT
cp
44.194 -10.084 M
46.351 -10.084 47.077 -11.655 QT
47.804 -13.225 47.804 -15.647 QT
47.804 -17.006 47.663 -17.897 QT
47.523 -18.788 47.023 -19.522 QT
46.726 -19.959 46.257 -20.295 QT
45.788 -20.631 45.265 -20.811 QT
44.741 -20.991 44.194 -20.991 QT
43.351 -20.991 42.593 -20.608 QT
41.835 -20.225 41.335 -19.522 QT
40.835 -18.756 40.694 -17.834 QT
40.554 -16.913 40.554 -15.647 QT
40.554 -14.131 40.819 -12.928 QT
41.085 -11.725 41.882 -10.905 QT
42.679 -10.084 44.194 -10.084 QT
cp
f
GR
GS
[0.75 0 0 0.75 217.50021 25.5] CT
N
58.237 -9.303 M
56.612 -9.303 55.276 -10.147 QT
53.94 -10.991 53.175 -12.413 QT
52.409 -13.834 52.409 -15.428 QT
52.409 -17.022 53.167 -18.483 QT
53.925 -19.944 55.269 -20.827 QT
56.612 -21.709 58.237 -21.709 QT
59.831 -21.709 61.128 -21.084 QT
62.425 -20.459 62.425 -19.053 QT
62.425 -18.522 62.05 -18.131 QT
61.675 -17.741 61.128 -17.741 QT
60.597 -17.741 60.214 -18.131 QT
59.831 -18.522 59.831 -19.053 QT
59.831 -19.522 60.136 -19.874 QT
60.44 -20.225 60.894 -20.319 QT
59.956 -20.913 58.269 -20.913 QT
56.972 -20.913 56.183 -20.053 QT
55.394 -19.194 55.081 -17.928 QT
54.769 -16.663 54.769 -15.428 QT
54.769 -14.116 55.151 -12.897 QT
55.534 -11.678 56.401 -10.881 QT
57.269 -10.084 58.565 -10.084 QT
59.847 -10.084 60.745 -10.874 QT
61.644 -11.663 61.972 -12.928 QT
61.972 -13.084 62.19 -13.084 QT
62.519 -13.084 L
62.597 -13.084 62.659 -13.006 QT
62.722 -12.928 62.722 -12.85 QT
62.722 -12.772 L
62.315 -11.163 61.105 -10.233 QT
59.894 -9.303 58.237 -9.303 QT
cp
f
GR
GS
[0.75 0 0 0.75 217.50021 25.5] CT
N
64.199 -9.6 M
64.199 -10.553 L
65.12 -10.553 65.714 -10.694 QT
66.308 -10.834 66.308 -11.413 QT
66.308 -18.772 L
66.308 -19.819 65.91 -20.053 QT
65.511 -20.288 64.324 -20.288 QT
64.324 -21.241 L
68.214 -21.538 L
68.214 -11.413 L
68.214 -10.834 68.722 -10.694 QT
69.23 -10.553 70.089 -10.553 QT
70.089 -9.6 L
64.199 -9.6 L
cp
65.355 -26.178 M
65.355 -26.772 65.8 -27.217 QT
66.245 -27.663 66.824 -27.663 QT
67.214 -27.663 67.566 -27.467 QT
67.917 -27.272 68.113 -26.913 QT
68.308 -26.553 68.308 -26.178 QT
68.308 -25.584 67.863 -25.139 QT
67.417 -24.694 66.824 -24.694 QT
66.245 -24.694 65.8 -25.139 QT
65.355 -25.584 65.355 -26.178 QT
cp
f
GR
GS
[0.75 0 0 0.75 217.50021 25.5] CT
N
73.528 -12.85 M
73.528 -20.288 L
71.294 -20.288 L
71.294 -20.991 L
73.059 -20.991 73.887 -22.639 QT
74.715 -24.288 74.715 -26.209 QT
75.497 -26.209 L
75.497 -21.241 L
79.309 -21.241 L
79.309 -20.288 L
75.497 -20.288 L
75.497 -12.897 L
75.497 -11.772 75.872 -10.928 QT
76.247 -10.084 77.231 -10.084 QT
78.153 -10.084 78.559 -10.975 QT
78.965 -11.866 78.965 -12.897 QT
78.965 -14.491 L
79.747 -14.491 L
79.747 -12.85 L
79.747 -12.006 79.434 -11.178 QT
79.122 -10.35 78.512 -9.827 QT
77.903 -9.303 77.044 -9.303 QT
75.419 -9.303 74.473 -10.272 QT
73.528 -11.241 73.528 -12.85 QT
cp
f
GR
GS
[0.75 0 0 0.75 217.50021 25.5] CT
N
82.267 -5.163 M
82.783 -4.756 83.408 -4.756 QT
85.095 -4.756 86.189 -7.334 QT
87.111 -9.6 L
83.064 -19.522 L
82.814 -20.022 82.298 -20.155 QT
81.783 -20.288 80.923 -20.288 QT
80.923 -21.241 L
86.595 -21.241 L
86.595 -20.288 L
85.095 -20.288 85.095 -19.647 QT
85.095 -19.538 85.126 -19.491 QT
88.126 -12.1 L
90.829 -18.756 L
90.908 -18.959 90.908 -19.209 QT
90.908 -19.538 90.736 -19.78 QT
90.564 -20.022 90.275 -20.155 QT
89.986 -20.288 89.642 -20.288 QT
89.642 -21.241 L
94.126 -21.241 L
94.126 -20.288 L
93.283 -20.288 92.658 -19.905 QT
92.033 -19.522 91.689 -18.772 QT
87.033 -7.334 L
86.658 -6.459 86.165 -5.733 QT
85.673 -5.006 84.962 -4.538 QT
84.251 -4.069 83.408 -4.069 QT
82.408 -4.069 81.665 -4.717 QT
80.923 -5.366 80.923 -6.334 QT
80.923 -6.834 81.267 -7.178 QT
81.611 -7.522 82.111 -7.522 QT
82.454 -7.522 82.72 -7.366 QT
82.986 -7.209 83.142 -6.952 QT
83.298 -6.694 83.298 -6.334 QT
83.298 -5.897 83.009 -5.553 QT
82.72 -5.209 82.267 -5.163 QT
cp
f
GR
GS
[0.75 0 0 0.75 0 0] CT
0.2 0.702 0.2 RC
1 LJ
0.667 LW
N
89.692 176.143 M
106.385 156.528 L
123.077 145.121 L
139.769 141.924 L
156.462 145.495 L
173.154 154.394 L
189.846 168.62 L
206.538 188.174 L
223.231 213.056 L
239.923 238.654 L
256.615 260.358 L
273.308 278.166 L
290 292.08 L
306.692 302.099 L
323.385 308.224 L
340.077 310.453 L
356.769 308.788 L
373.462 303.228 L
390.154 293.773 L
406.846 280.424 L
423.538 263.18 L
440.231 242.041 L
456.923 219.836 L
473.615 199.393 L
490.308 180.714 L
S
GR
GS
[0.75 0 0 0.75 0 0] CT
1 LJ
0.667 LW
N
89.692 176.143 M
106.385 156.162 L
123.077 140.477 L
139.769 129.087 L
156.462 123.433 L
173.154 124.956 L
189.846 133.655 L
206.538 149.531 L
223.231 172.583 L
239.923 200.139 L
256.615 229.525 L
273.308 256.907 L
290 278.452 L
306.692 294.16 L
323.385 305.06 L
340.077 312.179 L
356.769 315.52 L
373.462 315.08 L
390.154 310.861 L
406.846 302.862 L
423.538 291.084 L
440.231 275.526 L
456.923 253.359 L
473.615 221.755 L
490.308 180.714 L
S
GR
GS
[0.75 0 0 0.75 0 0] CT
0 0 1 RC
1 LJ
0.667 LW
N
89.692 176.143 M
106.385 138.039 L
123.077 108.329 L
139.769 87.013 L
156.462 74.09 L
173.154 69.561 L
189.846 73.425 L
206.538 85.683 L
223.231 106.334 L
239.923 138.053 L
256.615 176.309 L
273.308 213.901 L
290 248.836 L
306.692 279.118 L
323.385 303.72 L
340.077 321.612 L
356.769 332.794 L
373.462 337.268 L
390.154 335.031 L
406.846 326.086 L
423.538 310.43 L
440.231 288.065 L
456.923 258.991 L
473.615 223.208 L
490.308 180.714 L
S
GR
GS
[0.75 0 0 0.75 0 0] CT
0.6 0.2 0.2 RC
1 LJ
0.667 LW
N
89.692 176.143 M
106.385 178.882 L
123.077 181.745 L
139.769 184.732 L
156.462 187.843 L
173.154 191.078 L
189.846 194.437 L
206.538 197.919 L
223.231 201.526 L
239.923 205.256 L
256.615 209.111 L
273.308 213.089 L
290 217.191 L
306.692 220.755 L
323.385 223.118 L
340.077 224.281 L
356.769 224.243 L
373.462 223.004 L
390.154 220.565 L
406.846 216.925 L
423.538 212.084 L
440.231 206.042 L
456.923 198.8 L
473.615 190.358 L
490.308 180.714 L
S
GR
GS
[0.75 0 0 0.75 0 0] CT
1 GC
N
496 158 M
496 50 L
372 50 L
372 158 L
cp
f
GR
GS
[0.75 0 0 0.75 314.11361 48.61029] CT
N
0.672 5.12 M
0.672 4.386 L
2.547 4.386 2.984 3.136 QT
7.391 -9.693 L
7.453 -9.911 7.734 -9.911 QT
8 -9.911 L
8.281 -9.911 8.344 -9.693 QT
12.938 3.714 L
13.141 4.151 13.688 4.268 QT
14.234 4.386 15.047 4.386 QT
15.047 5.12 L
9.203 5.12 L
9.203 4.386 L
10.938 4.386 10.938 3.823 QT
10.938 3.714 L
9.797 0.432 L
4.703 0.432 L
3.766 3.136 L
3.75 3.214 3.75 3.354 QT
3.75 3.886 4.242 4.136 QT
4.734 4.386 5.313 4.386 QT
5.313 5.12 L
0.672 5.12 L
cp
4.953 -0.302 M
9.563 -0.302 L
7.25 -7.005 L
4.953 -0.302 L
cp
f
GR
GS
[0.75 0 0 0.75 314.11361 48.61029] CT
N
16.578 6.761 M
16.578 6.011 17.125 5.456 QT
17.672 4.901 18.422 4.651 QT
18 4.339 17.781 3.854 QT
17.563 3.37 17.563 2.839 QT
17.563 1.854 18.188 1.089 QT
17.219 0.151 17.219 -1.068 QT
17.219 -1.724 17.5 -2.302 QT
17.781 -2.88 18.289 -3.302 QT
18.797 -3.724 19.406 -3.943 QT
20.016 -4.161 20.672 -4.161 QT
21.922 -4.161 22.906 -3.427 QT
23.344 -3.896 23.93 -4.146 QT
24.516 -4.396 25.156 -4.396 QT
25.609 -4.396 25.898 -4.075 QT
26.188 -3.755 26.188 -3.302 QT
26.188 -3.036 25.992 -2.841 QT
25.797 -2.646 25.531 -2.646 QT
25.266 -2.646 25.07 -2.841 QT
24.875 -3.036 24.875 -3.302 QT
24.875 -3.693 25.141 -3.849 QT
24.047 -3.849 23.266 -3.099 QT
23.656 -2.708 23.883 -2.161 QT
24.109 -1.614 24.109 -1.068 QT
24.109 -0.177 23.617 0.534 QT
23.125 1.245 22.32 1.636 QT
21.516 2.026 20.672 2.026 QT
19.516 2.026 18.563 1.401 QT
18.266 1.823 18.266 2.323 QT
18.266 2.886 18.633 3.3 QT
19 3.714 19.547 3.714 QT
21.266 3.714 L
22.516 3.714 23.523 3.94 QT
24.531 4.167 25.211 4.846 QT
25.891 5.526 25.891 6.761 QT
25.891 7.682 25.117 8.292 QT
24.344 8.901 23.258 9.175 QT
22.172 9.448 21.25 9.448 QT
20.313 9.448 19.227 9.175 QT
18.141 8.901 17.359 8.292 QT
16.578 7.682 16.578 6.761 QT
cp
17.766 6.761 M
17.766 7.464 18.336 7.94 QT
18.906 8.417 19.719 8.651 QT
20.531 8.886 21.25 8.886 QT
21.953 8.886 22.766 8.651 QT
23.578 8.417 24.148 7.94 QT
24.719 7.464 24.719 6.761 QT
24.719 5.667 23.711 5.339 QT
22.703 5.011 21.266 5.011 QT
19.547 5.011 L
19.063 5.011 18.656 5.245 QT
18.25 5.479 18.008 5.893 QT
17.766 6.307 17.766 6.761 QT
cp
20.672 1.464 M
22.453 1.464 22.453 -1.068 QT
22.453 -2.177 22.07 -2.888 QT
21.688 -3.599 20.672 -3.599 QT
19.641 -3.599 19.258 -2.888 QT
18.875 -2.177 18.875 -1.068 QT
18.875 -0.38 19.023 0.182 QT
19.172 0.745 19.563 1.104 QT
19.953 1.464 20.672 1.464 QT
cp
f
GR
GS
[0.75 0 0 0.75 314.11361 48.61029] CT
N
31.901 5.354 M
30.62 5.354 29.55 4.682 QT
28.479 4.011 27.862 2.886 QT
27.245 1.761 27.245 0.511 QT
27.245 -0.708 27.807 -1.818 QT
28.37 -2.927 29.37 -3.607 QT
30.37 -4.286 31.604 -4.286 QT
32.557 -4.286 33.276 -3.966 QT
33.995 -3.646 34.456 -3.075 QT
34.917 -2.505 35.151 -1.724 QT
35.385 -0.943 35.385 -0.005 QT
35.385 0.276 35.167 0.276 QT
29.089 0.276 L
29.089 0.495 L
29.089 2.245 29.792 3.495 QT
30.495 4.745 32.089 4.745 QT
32.729 4.745 33.276 4.456 QT
33.823 4.167 34.229 3.651 QT
34.635 3.136 34.776 2.557 QT
34.792 2.479 34.854 2.425 QT
34.917 2.37 34.979 2.37 QT
35.167 2.37 L
35.385 2.37 35.385 2.636 QT
35.089 3.823 34.104 4.589 QT
33.12 5.354 31.901 5.354 QT
cp
29.104 -0.255 M
33.901 -0.255 L
33.901 -1.036 33.675 -1.849 QT
33.448 -2.661 32.94 -3.2 QT
32.432 -3.739 31.604 -3.739 QT
30.417 -3.739 29.76 -2.63 QT
29.104 -1.521 29.104 -0.255 QT
cp
f
GR
GS
[0.75 0 0 0.75 314.11361 48.61029] CT
N
36.773 5.12 M
36.773 4.386 L
37.492 4.386 37.953 4.268 QT
38.414 4.151 38.414 3.714 QT
38.414 -2.021 L
38.414 -2.583 38.242 -2.833 QT
38.07 -3.083 37.758 -3.138 QT
37.445 -3.193 36.773 -3.193 QT
36.773 -3.927 L
39.82 -4.161 L
39.82 -2.114 L
40.242 -3.005 41.07 -3.583 QT
41.898 -4.161 42.867 -4.161 QT
44.32 -4.161 45.054 -3.466 QT
45.789 -2.771 45.789 -1.333 QT
45.789 3.714 L
45.789 4.151 46.25 4.268 QT
46.711 4.386 47.429 4.386 QT
47.429 5.12 L
42.617 5.12 L
42.617 4.386 L
43.336 4.386 43.797 4.268 QT
44.258 4.151 44.258 3.714 QT
44.258 -1.271 L
44.258 -2.286 43.961 -2.95 QT
43.664 -3.614 42.742 -3.614 QT
41.523 -3.614 40.734 -2.638 QT
39.945 -1.661 39.945 -0.427 QT
39.945 3.714 L
39.945 4.151 40.414 4.268 QT
40.883 4.386 41.586 4.386 QT
41.586 5.12 L
36.773 5.12 L
cp
f
GR
GS
[0.75 0 0 0.75 314.11361 48.61029] CT
N
49.548 2.604 M
49.548 -3.193 L
47.814 -3.193 L
47.814 -3.739 L
49.189 -3.739 49.829 -5.021 QT
50.47 -6.302 50.47 -7.802 QT
51.079 -7.802 L
51.079 -3.927 L
54.048 -3.927 L
54.048 -3.193 L
51.079 -3.193 L
51.079 2.557 L
51.079 3.432 51.368 4.089 QT
51.657 4.745 52.423 4.745 QT
53.142 4.745 53.462 4.05 QT
53.782 3.354 53.782 2.557 QT
53.782 1.323 L
54.376 1.323 L
54.376 2.604 L
54.376 3.261 54.134 3.901 QT
53.892 4.542 53.423 4.948 QT
52.954 5.354 52.282 5.354 QT
51.017 5.354 50.282 4.604 QT
49.548 3.854 49.548 2.604 QT
cp
f
GR
GS
[0.75 0 0 0.75 314.11361 48.61029] CT
N
64.768 5.12 M
64.768 4.386 L
67.393 4.386 67.393 3.714 QT
67.393 -7.302 L
66.299 -6.786 64.643 -6.786 QT
64.643 -7.521 L
67.221 -7.521 68.534 -8.864 QT
68.831 -8.864 L
68.893 -8.864 68.963 -8.81 QT
69.034 -8.755 69.034 -8.677 QT
69.034 3.714 L
69.034 4.386 71.659 4.386 QT
71.659 5.12 L
64.768 5.12 L
cp
f
GR
GS
[0.75 0 0 0.75 0 0] CT
0.2 0.702 0.2 RC
1 LJ
0.667 LW
N
375.985 64.814 M
415.83 64.814 L
S
GR
GS
[0.75 0 0 0.75 314.11361 68.20343] CT
N
/f-597267615{0.672 5.12 M
0.672 4.386 L
2.547 4.386 2.984 3.136 QT
7.391 -9.693 L
7.453 -9.911 7.734 -9.911 QT
8 -9.911 L
8.281 -9.911 8.344 -9.693 QT
12.938 3.714 L
13.141 4.151 13.688 4.268 QT
14.234 4.386 15.047 4.386 QT
15.047 5.12 L
9.203 5.12 L
9.203 4.386 L
10.938 4.386 10.938 3.823 QT
10.938 3.714 L
9.797 0.432 L
4.703 0.432 L
3.766 3.136 L
3.75 3.214 3.75 3.354 QT
3.75 3.886 4.242 4.136 QT
4.734 4.386 5.313 4.386 QT
5.313 5.12 L
0.672 5.12 L
cp
4.953 -0.302 M
9.563 -0.302 L
7.25 -7.005 L
4.953 -0.302 L
cp}def
f-597267615
f
GR
GS
[0.75 0 0 0.75 314.11361 68.20343] CT
N
/f-745240314{16.578 6.761 M
16.578 6.011 17.125 5.456 QT
17.672 4.901 18.422 4.651 QT
18 4.339 17.781 3.854 QT
17.563 3.37 17.563 2.839 QT
17.563 1.854 18.188 1.089 QT
17.219 0.151 17.219 -1.068 QT
17.219 -1.724 17.5 -2.302 QT
17.781 -2.88 18.289 -3.302 QT
18.797 -3.724 19.406 -3.943 QT
20.016 -4.161 20.672 -4.161 QT
21.922 -4.161 22.906 -3.427 QT
23.344 -3.896 23.93 -4.146 QT
24.516 -4.396 25.156 -4.396 QT
25.609 -4.396 25.898 -4.075 QT
26.188 -3.755 26.188 -3.302 QT
26.188 -3.036 25.992 -2.841 QT
25.797 -2.646 25.531 -2.646 QT
25.266 -2.646 25.07 -2.841 QT
24.875 -3.036 24.875 -3.302 QT
24.875 -3.693 25.141 -3.849 QT
24.047 -3.849 23.266 -3.099 QT
23.656 -2.708 23.883 -2.161 QT
24.109 -1.614 24.109 -1.068 QT
24.109 -0.177 23.617 0.534 QT
23.125 1.245 22.32 1.636 QT
21.516 2.026 20.672 2.026 QT
19.516 2.026 18.563 1.401 QT
18.266 1.823 18.266 2.323 QT
18.266 2.886 18.633 3.3 QT
19 3.714 19.547 3.714 QT
21.266 3.714 L
22.516 3.714 23.523 3.94 QT
24.531 4.167 25.211 4.846 QT
25.891 5.526 25.891 6.761 QT
25.891 7.682 25.117 8.292 QT
24.344 8.901 23.258 9.175 QT
22.172 9.448 21.25 9.448 QT
20.313 9.448 19.227 9.175 QT
18.141 8.901 17.359 8.292 QT
16.578 7.682 16.578 6.761 QT
cp
17.766 6.761 M
17.766 7.464 18.336 7.94 QT
18.906 8.417 19.719 8.651 QT
20.531 8.886 21.25 8.886 QT
21.953 8.886 22.766 8.651 QT
23.578 8.417 24.148 7.94 QT
24.719 7.464 24.719 6.761 QT
24.719 5.667 23.711 5.339 QT
22.703 5.011 21.266 5.011 QT
19.547 5.011 L
19.063 5.011 18.656 5.245 QT
18.25 5.479 18.008 5.893 QT
17.766 6.307 17.766 6.761 QT
cp
20.672 1.464 M
22.453 1.464 22.453 -1.068 QT
22.453 -2.177 22.07 -2.888 QT
21.688 -3.599 20.672 -3.599 QT
19.641 -3.599 19.258 -2.888 QT
18.875 -2.177 18.875 -1.068 QT
18.875 -0.38 19.023 0.182 QT
19.172 0.745 19.563 1.104 QT
19.953 1.464 20.672 1.464 QT
cp}def
f-745240314
f
GR
GS
[0.75 0 0 0.75 314.11361 68.20343] CT
N
/f1964844890{31.901 5.354 M
30.62 5.354 29.55 4.682 QT
28.479 4.011 27.862 2.886 QT
27.245 1.761 27.245 0.511 QT
27.245 -0.708 27.807 -1.818 QT
28.37 -2.927 29.37 -3.607 QT
30.37 -4.286 31.604 -4.286 QT
32.557 -4.286 33.276 -3.966 QT
33.995 -3.646 34.456 -3.075 QT
34.917 -2.505 35.151 -1.724 QT
35.385 -0.943 35.385 -0.005 QT
35.385 0.276 35.167 0.276 QT
29.089 0.276 L
29.089 0.495 L
29.089 2.245 29.792 3.495 QT
30.495 4.745 32.089 4.745 QT
32.729 4.745 33.276 4.456 QT
33.823 4.167 34.229 3.651 QT
34.635 3.136 34.776 2.557 QT
34.792 2.479 34.854 2.425 QT
34.917 2.37 34.979 2.37 QT
35.167 2.37 L
35.385 2.37 35.385 2.636 QT
35.089 3.823 34.104 4.589 QT
33.12 5.354 31.901 5.354 QT
cp
29.104 -0.255 M
33.901 -0.255 L
33.901 -1.036 33.675 -1.849 QT
33.448 -2.661 32.94 -3.2 QT
32.432 -3.739 31.604 -3.739 QT
30.417 -3.739 29.76 -2.63 QT
29.104 -1.521 29.104 -0.255 QT
cp}def
f1964844890
f
GR
GS
[0.75 0 0 0.75 314.11361 68.20343] CT
N
/f1881606250{36.773 5.12 M
36.773 4.386 L
37.492 4.386 37.953 4.268 QT
38.414 4.151 38.414 3.714 QT
38.414 -2.021 L
38.414 -2.583 38.242 -2.833 QT
38.07 -3.083 37.758 -3.138 QT
37.445 -3.193 36.773 -3.193 QT
36.773 -3.927 L
39.82 -4.161 L
39.82 -2.114 L
40.242 -3.005 41.07 -3.583 QT
41.898 -4.161 42.867 -4.161 QT
44.32 -4.161 45.054 -3.466 QT
45.789 -2.771 45.789 -1.333 QT
45.789 3.714 L
45.789 4.151 46.25 4.268 QT
46.711 4.386 47.429 4.386 QT
47.429 5.12 L
42.617 5.12 L
42.617 4.386 L
43.336 4.386 43.797 4.268 QT
44.258 4.151 44.258 3.714 QT
44.258 -1.271 L
44.258 -2.286 43.961 -2.95 QT
43.664 -3.614 42.742 -3.614 QT
41.523 -3.614 40.734 -2.638 QT
39.945 -1.661 39.945 -0.427 QT
39.945 3.714 L
39.945 4.151 40.414 4.268 QT
40.883 4.386 41.586 4.386 QT
41.586 5.12 L
36.773 5.12 L
cp}def
f1881606250
f
GR
GS
[0.75 0 0 0.75 314.11361 68.20343] CT
N
/f-1218143468{49.548 2.604 M
49.548 -3.193 L
47.814 -3.193 L
47.814 -3.739 L
49.189 -3.739 49.829 -5.021 QT
50.47 -6.302 50.47 -7.802 QT
51.079 -7.802 L
51.079 -3.927 L
54.048 -3.927 L
54.048 -3.193 L
51.079 -3.193 L
51.079 2.557 L
51.079 3.432 51.368 4.089 QT
51.657 4.745 52.423 4.745 QT
53.142 4.745 53.462 4.05 QT
53.782 3.354 53.782 2.557 QT
53.782 1.323 L
54.376 1.323 L
54.376 2.604 L
54.376 3.261 54.134 3.901 QT
53.892 4.542 53.423 4.948 QT
52.954 5.354 52.282 5.354 QT
51.017 5.354 50.282 4.604 QT
49.548 3.854 49.548 2.604 QT
cp}def
f-1218143468
f
GR
GS
[0.75 0 0 0.75 314.11361 68.20343] CT
N
/f-1429999007{63.862 5.12 M
63.862 4.557 L
63.862 4.511 63.909 4.448 QT
67.159 0.839 L
67.909 0.026 68.37 -0.513 QT
68.831 -1.052 69.276 -1.763 QT
69.721 -2.474 69.987 -3.2 QT
70.252 -3.927 70.252 -4.755 QT
70.252 -5.614 69.932 -6.404 QT
69.612 -7.193 68.979 -7.661 QT
68.346 -8.13 67.456 -8.13 QT
66.549 -8.13 65.823 -7.583 QT
65.096 -7.036 64.799 -6.161 QT
64.877 -6.177 65.018 -6.177 QT
65.487 -6.177 65.823 -5.864 QT
66.159 -5.552 66.159 -5.036 QT
66.159 -4.568 65.823 -4.232 QT
65.487 -3.896 65.018 -3.896 QT
64.534 -3.896 64.198 -4.239 QT
63.862 -4.583 63.862 -5.036 QT
63.862 -5.833 64.159 -6.521 QT
64.456 -7.208 65.018 -7.747 QT
65.581 -8.286 66.276 -8.575 QT
66.971 -8.864 67.768 -8.864 QT
68.971 -8.864 70.002 -8.357 QT
71.034 -7.849 71.643 -6.919 QT
72.252 -5.989 72.252 -4.755 QT
72.252 -3.849 71.854 -3.029 QT
71.456 -2.208 70.831 -1.536 QT
70.206 -0.864 69.229 -0.013 QT
68.252 0.839 67.94 1.136 QT
65.565 3.417 L
67.581 3.417 L
69.065 3.417 70.065 3.393 QT
71.065 3.37 71.127 3.307 QT
71.377 3.042 71.627 1.37 QT
72.252 1.37 L
71.659 5.12 L
63.862 5.12 L
cp}def
f-1429999007
f
GR
GS
[0.75 0 0 0.75 0 0] CT
1 LJ
0.667 LW
N
375.985 90.938 M
415.83 90.938 L
S
GR
GS
[0.75 0 0 0.75 314.11361 87.79657] CT
N
f-597267615
f
GR
GS
[0.75 0 0 0.75 314.11361 87.79657] CT
N
f-745240314
f
GR
GS
[0.75 0 0 0.75 314.11361 87.79657] CT
N
f1964844890
f
GR
GS
[0.75 0 0 0.75 314.11361 87.79657] CT
N
f1881606250
f
GR
GS
[0.75 0 0 0.75 314.11361 87.79657] CT
N
f-1218143468
f
GR
GS
[0.75 0 0 0.75 314.11361 87.79657] CT
N
/f300774680{64.815 3.495 M
65.299 4.214 66.135 4.565 QT
66.971 4.917 67.924 4.917 QT
69.143 4.917 69.659 3.878 QT
70.174 2.839 70.174 1.511 QT
70.174 0.917 70.065 0.323 QT
69.956 -0.271 69.698 -0.786 QT
69.44 -1.302 68.995 -1.607 QT
68.549 -1.911 67.909 -1.911 QT
66.502 -1.911 L
66.315 -1.911 66.315 -2.114 QT
66.315 -2.286 L
66.315 -2.458 66.502 -2.458 QT
67.659 -2.552 L
68.409 -2.552 68.893 -3.107 QT
69.377 -3.661 69.604 -4.45 QT
69.831 -5.239 69.831 -5.958 QT
69.831 -6.974 69.362 -7.614 QT
68.893 -8.255 67.924 -8.255 QT
67.127 -8.255 66.393 -7.958 QT
65.659 -7.661 65.237 -7.036 QT
65.284 -7.052 65.307 -7.06 QT
65.331 -7.068 65.377 -7.068 QT
65.846 -7.068 66.166 -6.739 QT
66.487 -6.411 66.487 -5.943 QT
66.487 -5.489 66.166 -5.161 QT
65.846 -4.833 65.377 -4.833 QT
64.924 -4.833 64.596 -5.161 QT
64.268 -5.489 64.268 -5.943 QT
64.268 -6.849 64.807 -7.513 QT
65.346 -8.177 66.206 -8.521 QT
67.065 -8.864 67.924 -8.864 QT
68.565 -8.864 69.268 -8.677 QT
69.971 -8.489 70.549 -8.138 QT
71.127 -7.786 71.487 -7.232 QT
71.846 -6.677 71.846 -5.958 QT
71.846 -5.083 71.456 -4.333 QT
71.065 -3.583 70.377 -3.044 QT
69.69 -2.505 68.862 -2.239 QT
69.784 -2.052 70.604 -1.544 QT
71.424 -1.036 71.916 -0.232 QT
72.409 0.573 72.409 1.495 QT
72.409 2.651 71.776 3.589 QT
71.143 4.526 70.104 5.057 QT
69.065 5.589 67.924 5.589 QT
66.94 5.589 65.948 5.214 QT
64.956 4.839 64.323 4.089 QT
63.69 3.339 63.69 2.292 QT
63.69 1.761 64.041 1.417 QT
64.393 1.073 64.924 1.073 QT
65.252 1.073 65.534 1.229 QT
65.815 1.386 65.979 1.675 QT
66.143 1.964 66.143 2.292 QT
66.143 2.807 65.784 3.151 QT
65.424 3.495 64.924 3.495 QT
64.815 3.495 L
cp}def
f300774680
f
GR
GS
[0.75 0 0 0.75 0 0] CT
0 0 1 RC
1 LJ
0.667 LW
N
375.985 117.062 M
415.83 117.062 L
S
GR
GS
[0.75 0 0 0.75 314.11361 107.38971] CT
N
f-597267615
f
GR
GS
[0.75 0 0 0.75 314.11361 107.38971] CT
N
f-745240314
f
GR
GS
[0.75 0 0 0.75 314.11361 107.38971] CT
N
f1964844890
f
GR
GS
[0.75 0 0 0.75 314.11361 107.38971] CT
N
f1881606250
f
GR
GS
[0.75 0 0 0.75 314.11361 107.38971] CT
N
f-1218143468
f
GR
GS
[0.75 0 0 0.75 314.11361 107.38971] CT
N
/f-1674298674{63.393 1.651 M
63.393 0.917 L
69.893 -8.771 L
69.956 -8.864 70.112 -8.864 QT
70.409 -8.864 L
70.643 -8.864 70.643 -8.63 QT
70.643 0.917 L
72.706 0.917 L
72.706 1.651 L
70.643 1.651 L
70.643 3.714 L
70.643 4.151 71.26 4.268 QT
71.877 4.386 72.69 4.386 QT
72.69 5.12 L
66.909 5.12 L
66.909 4.386 L
67.721 4.386 68.331 4.268 QT
68.94 4.151 68.94 3.714 QT
68.94 1.651 L
63.393 1.651 L
cp
64.096 0.917 M
69.065 0.917 L
69.065 -6.521 L
64.096 0.917 L
cp}def
f-1674298674
f
GR
GS
[0.75 0 0 0.75 0 0] CT
0.6 0.2 0.2 RC
1 LJ
0.667 LW
N
375.985 143.186 M
415.83 143.186 L
S
GR
GS
[0.75 0 0 0.75 0 0] CT
0.149 GC
10.0 ML
0.667 LW
N
372 158 M
372 50 L
496 50 L
496 158 L
cp
S
GR
%%Trailer
%%Pages: 1
%%EOF
