%!PS-Adobe-3.0 EPSF-3.0
%%Creator: (MATLAB, The Mathworks, Inc. Version 9.12.0.2529717 \(R2022a\) Update 8. Operating System: Linux)
%%Title: plots/Example2_ry.eps
%%CreationDate: 2024-05-27T22:59:56
%%Pages: (atend)
%%BoundingBox:     9     2   392   335
%%LanguageLevel: 3
%%EndComments
%%BeginProlog
%%BeginResource: procset (Apache XML Graphics Std ProcSet) 1.2 0
%%Version: 1.2 0
%%Copyright: (Copyright 2001-2003,2010 The Apache Software Foundation. License terms: http://www.apache.org/licenses/LICENSE-2.0)
/bd{bind def}bind def
/ld{load def}bd
/GR/grestore ld
/GS/gsave ld
/RM/rmoveto ld
/C/curveto ld
/t/show ld
/L/lineto ld
/ML/setmiterlimit ld
/CT/concat ld
/f/fill ld
/N/newpath ld
/S/stroke ld
/CC/setcmykcolor ld
/A/ashow ld
/cp/closepath ld
/RC/setrgbcolor ld
/LJ/setlinejoin ld
/GC/setgray ld
/LW/setlinewidth ld
/M/moveto ld
/re {4 2 roll M
1 index 0 rlineto
0 exch rlineto
neg 0 rlineto
cp } bd
/_ctm matrix def
/_tm matrix def
/BT { _ctm currentmatrix pop matrix _tm copy pop 0 0 moveto } bd
/ET { _ctm setmatrix } bd
/iTm { _ctm setmatrix _tm concat } bd
/Tm { _tm astore pop iTm 0 0 moveto } bd
/ux 0.0 def
/uy 0.0 def
/F {
  /Tp exch def
  /Tf exch def
  Tf findfont Tp scalefont setfont
  /cf Tf def  /cs Tp def
} bd
/ULS {currentpoint /uy exch def /ux exch def} bd
/ULE {
  /Tcx currentpoint pop def
  gsave
  newpath
  cf findfont cs scalefont dup
  /FontMatrix get 0 get /Ts exch def /FontInfo get dup
  /UnderlinePosition get Ts mul /To exch def
  /UnderlineThickness get Ts mul /Tt exch def
  ux uy To add moveto  Tcx uy To add lineto
  Tt setlinewidth stroke
  grestore
} bd
/OLE {
  /Tcx currentpoint pop def
  gsave
  newpath
  cf findfont cs scalefont dup
  /FontMatrix get 0 get /Ts exch def /FontInfo get dup
  /UnderlinePosition get Ts mul /To exch def
  /UnderlineThickness get Ts mul /Tt exch def
  ux uy To add cs add moveto Tcx uy To add cs add lineto
  Tt setlinewidth stroke
  grestore
} bd
/SOE {
  /Tcx currentpoint pop def
  gsave
  newpath
  cf findfont cs scalefont dup
  /FontMatrix get 0 get /Ts exch def /FontInfo get dup
  /UnderlinePosition get Ts mul /To exch def
  /UnderlineThickness get Ts mul /Tt exch def
  ux uy To add cs 10 mul 26 idiv add moveto Tcx uy To add cs 10 mul 26 idiv add lineto
  Tt setlinewidth stroke
  grestore
} bd
/QT {
/Y22 exch store
/X22 exch store
/Y21 exch store
/X21 exch store
currentpoint
/Y21 load 2 mul add 3 div exch
/X21 load 2 mul add 3 div exch
/X21 load 2 mul /X22 load add 3 div
/Y21 load 2 mul /Y22 load add 3 div
/X22 load /Y22 load curveto
} bd
/SSPD {
dup length /d exch dict def
{
/v exch def
/k exch def
currentpagedevice k known {
/cpdv currentpagedevice k get def
v cpdv ne {
/upd false def
/nullv v type /nulltype eq def
/nullcpdv cpdv type /nulltype eq def
nullv nullcpdv or
{
/upd true def
} {
/sametype v type cpdv type eq def
sametype {
v type /arraytype eq {
/vlen v length def
/cpdvlen cpdv length def
vlen cpdvlen eq {
0 1 vlen 1 sub {
/i exch def
/obj v i get def
/cpdobj cpdv i get def
obj cpdobj ne {
/upd true def
exit
} if
} for
} {
/upd true def
} ifelse
} {
v type /dicttype eq {
v {
/dv exch def
/dk exch def
/cpddv cpdv dk get def
dv cpddv ne {
/upd true def
exit
} if
} forall
} {
/upd true def
} ifelse
} ifelse
} if
} ifelse
upd true eq {
d k v put
} if
} if
} if
} forall
d length 0 gt {
d setpagedevice
} if
} bd
/RE { % /NewFontName [NewEncodingArray] /FontName RE -
  findfont dup length dict begin
  {
    1 index /FID ne
    {def} {pop pop} ifelse
  } forall
  /Encoding exch def
  /FontName 1 index def
  currentdict definefont pop
  end
} bind def
%%EndResource
%%BeginResource: procset (Apache XML Graphics EPS ProcSet) 1.0 0
%%Version: 1.0 0
%%Copyright: (Copyright 2002-2003 The Apache Software Foundation. License terms: http://www.apache.org/licenses/LICENSE-2.0)
/BeginEPSF { %def
/b4_Inc_state save def         % Save state for cleanup
/dict_count countdictstack def % Count objects on dict stack
/op_count count 1 sub def      % Count objects on operand stack
userdict begin                 % Push userdict on dict stack
/showpage { } def              % Redefine showpage, { } = null proc
0 setgray 0 setlinecap         % Prepare graphics state
1 setlinewidth 0 setlinejoin
10 setmiterlimit [ ] 0 setdash newpath
/languagelevel where           % If level not equal to 1 then
{pop languagelevel             % set strokeadjust and
1 ne                           % overprint to their defaults.
{false setstrokeadjust false setoverprint
} if
} if
} bd
/EndEPSF { %def
count op_count sub {pop} repeat            % Clean up stacks
countdictstack dict_count sub {end} repeat
b4_Inc_state restore
} bd
%%EndResource
%FOPBeginFontDict
%%IncludeResource: font Courier-Oblique
%%IncludeResource: font Courier-BoldOblique
%%IncludeResource: font Courier-Bold
%%IncludeResource: font ZapfDingbats
%%IncludeResource: font Symbol
%%IncludeResource: font Helvetica
%%IncludeResource: font Helvetica-Oblique
%%IncludeResource: font Helvetica-Bold
%%IncludeResource: font Helvetica-BoldOblique
%%IncludeResource: font Times-Roman
%%IncludeResource: font Times-Italic
%%IncludeResource: font Times-Bold
%%IncludeResource: font Times-BoldItalic
%%IncludeResource: font Courier
%FOPEndFontDict
%%BeginResource: encoding WinAnsiEncoding
/WinAnsiEncoding [
/.notdef /.notdef /.notdef /.notdef /.notdef
/.notdef /.notdef /.notdef /.notdef /.notdef
/.notdef /.notdef /.notdef /.notdef /.notdef
/.notdef /.notdef /.notdef /.notdef /.notdef
/.notdef /.notdef /.notdef /.notdef /.notdef
/.notdef /.notdef /.notdef /.notdef /.notdef
/.notdef /.notdef /space /exclam /quotedbl
/numbersign /dollar /percent /ampersand /quotesingle
/parenleft /parenright /asterisk /plus /comma
/hyphen /period /slash /zero /one
/two /three /four /five /six
/seven /eight /nine /colon /semicolon
/less /equal /greater /question /at
/A /B /C /D /E
/F /G /H /I /J
/K /L /M /N /O
/P /Q /R /S /T
/U /V /W /X /Y
/Z /bracketleft /backslash /bracketright /asciicircum
/underscore /quoteleft /a /b /c
/d /e /f /g /h
/i /j /k /l /m
/n /o /p /q /r
/s /t /u /v /w
/x /y /z /braceleft /bar
/braceright /asciitilde /bullet /Euro /bullet
/quotesinglbase /florin /quotedblbase /ellipsis /dagger
/daggerdbl /circumflex /perthousand /Scaron /guilsinglleft
/OE /bullet /Zcaron /bullet /bullet
/quoteleft /quoteright /quotedblleft /quotedblright /bullet
/endash /emdash /asciitilde /trademark /scaron
/guilsinglright /oe /bullet /zcaron /Ydieresis
/space /exclamdown /cent /sterling /currency
/yen /brokenbar /section /dieresis /copyright
/ordfeminine /guillemotleft /logicalnot /sfthyphen /registered
/macron /degree /plusminus /twosuperior /threesuperior
/acute /mu /paragraph /middot /cedilla
/onesuperior /ordmasculine /guillemotright /onequarter /onehalf
/threequarters /questiondown /Agrave /Aacute /Acircumflex
/Atilde /Adieresis /Aring /AE /Ccedilla
/Egrave /Eacute /Ecircumflex /Edieresis /Igrave
/Iacute /Icircumflex /Idieresis /Eth /Ntilde
/Ograve /Oacute /Ocircumflex /Otilde /Odieresis
/multiply /Oslash /Ugrave /Uacute /Ucircumflex
/Udieresis /Yacute /Thorn /germandbls /agrave
/aacute /acircumflex /atilde /adieresis /aring
/ae /ccedilla /egrave /eacute /ecircumflex
/edieresis /igrave /iacute /icircumflex /idieresis
/eth /ntilde /ograve /oacute /ocircumflex
/otilde /odieresis /divide /oslash /ugrave
/uacute /ucircumflex /udieresis /yacute /thorn
/ydieresis
] def
%%EndResource
%FOPBeginFontReencode
/Courier-Oblique findfont
dup length dict begin
  {1 index /FID ne {def} {pop pop} ifelse} forall
  /Encoding WinAnsiEncoding def
  currentdict
end
/Courier-Oblique exch definefont pop
/Courier-BoldOblique findfont
dup length dict begin
  {1 index /FID ne {def} {pop pop} ifelse} forall
  /Encoding WinAnsiEncoding def
  currentdict
end
/Courier-BoldOblique exch definefont pop
/Courier-Bold findfont
dup length dict begin
  {1 index /FID ne {def} {pop pop} ifelse} forall
  /Encoding WinAnsiEncoding def
  currentdict
end
/Courier-Bold exch definefont pop
/Helvetica findfont
dup length dict begin
  {1 index /FID ne {def} {pop pop} ifelse} forall
  /Encoding WinAnsiEncoding def
  currentdict
end
/Helvetica exch definefont pop
/Helvetica-Oblique findfont
dup length dict begin
  {1 index /FID ne {def} {pop pop} ifelse} forall
  /Encoding WinAnsiEncoding def
  currentdict
end
/Helvetica-Oblique exch definefont pop
/Helvetica-Bold findfont
dup length dict begin
  {1 index /FID ne {def} {pop pop} ifelse} forall
  /Encoding WinAnsiEncoding def
  currentdict
end
/Helvetica-Bold exch definefont pop
/Helvetica-BoldOblique findfont
dup length dict begin
  {1 index /FID ne {def} {pop pop} ifelse} forall
  /Encoding WinAnsiEncoding def
  currentdict
end
/Helvetica-BoldOblique exch definefont pop
/Times-Roman findfont
dup length dict begin
  {1 index /FID ne {def} {pop pop} ifelse} forall
  /Encoding WinAnsiEncoding def
  currentdict
end
/Times-Roman exch definefont pop
/Times-Italic findfont
dup length dict begin
  {1 index /FID ne {def} {pop pop} ifelse} forall
  /Encoding WinAnsiEncoding def
  currentdict
end
/Times-Italic exch definefont pop
/Times-Bold findfont
dup length dict begin
  {1 index /FID ne {def} {pop pop} ifelse} forall
  /Encoding WinAnsiEncoding def
  currentdict
end
/Times-Bold exch definefont pop
/Times-BoldItalic findfont
dup length dict begin
  {1 index /FID ne {def} {pop pop} ifelse} forall
  /Encoding WinAnsiEncoding def
  currentdict
end
/Times-BoldItalic exch definefont pop
/Courier findfont
dup length dict begin
  {1 index /FID ne {def} {pop pop} ifelse} forall
  /Encoding WinAnsiEncoding def
  currentdict
end
/Courier exch definefont pop
%FOPEndFontReencode
%%EndProlog
%%Page: 1 1
%%PageBoundingBox: 0 0 428 338
%%BeginPageSetup
N
    9     2 M
  401     2 L
  401   337 L
    9   337 L
cp
clip
[1 0 0 -1 0 338] CT
%%EndPageSetup
GS
[0.75 0 0 0.75 0 0.5] CT
N
0 0 M
570 0 L
570 450 L
0 450 L
0 0 L
cp
clip
1 GC
N
0 0 570 450 re
f
GR
GS
[0.75 0 0 0.75 0 0.5] CT
1 GC
N
0 0 570 450 re
f
GR
GS
[0.75 0 0 0.75 0 0.5] CT
1 GC
N
74 390 M
516 390 L
516 38 L
74 38 L
cp
f
GR
GS
[0.75 0 0 0.75 0 0.5] CT
0.873 GC
1 LJ
0.667 LW
N
74 390 M
74 38 L
S
GR
GS
[0.75 0 0 0.75 0 0.5] CT
0.873 GC
1 LJ
0.667 LW
N
114.182 390 M
114.182 38 L
S
GR
GS
[0.75 0 0 0.75 0 0.5] CT
0.873 GC
1 LJ
0.667 LW
N
154.364 390 M
154.364 38 L
S
GR
GS
[0.75 0 0 0.75 0 0.5] CT
0.873 GC
1 LJ
0.667 LW
N
194.545 390 M
194.545 38 L
S
GR
GS
[0.75 0 0 0.75 0 0.5] CT
0.873 GC
1 LJ
0.667 LW
N
234.727 390 M
234.727 38 L
S
GR
GS
[0.75 0 0 0.75 0 0.5] CT
0.873 GC
1 LJ
0.667 LW
N
274.909 390 M
274.909 38 L
S
GR
GS
[0.75 0 0 0.75 0 0.5] CT
0.873 GC
1 LJ
0.667 LW
N
315.091 390 M
315.091 38 L
S
GR
GS
[0.75 0 0 0.75 0 0.5] CT
0.873 GC
1 LJ
0.667 LW
N
355.273 390 M
355.273 38 L
S
GR
GS
[0.75 0 0 0.75 0 0.5] CT
0.873 GC
1 LJ
0.667 LW
N
395.455 390 M
395.455 38 L
S
GR
GS
[0.75 0 0 0.75 0 0.5] CT
0.873 GC
1 LJ
0.667 LW
N
435.636 390 M
435.636 38 L
S
GR
GS
[0.75 0 0 0.75 0 0.5] CT
0.873 GC
1 LJ
0.667 LW
N
475.818 390 M
475.818 38 L
S
GR
GS
[0.75 0 0 0.75 0 0.5] CT
0.873 GC
1 LJ
0.667 LW
N
516 390 M
516 38 L
S
GR
GS
[0.75 0 0 0.75 0 0.5] CT
0.873 GC
1 LJ
0.667 LW
N
516 390 M
74 390 L
S
GR
GS
[0.75 0 0 0.75 0 0.5] CT
0.873 GC
1 LJ
0.667 LW
N
516 339.714 M
74 339.714 L
S
GR
GS
[0.75 0 0 0.75 0 0.5] CT
0.873 GC
1 LJ
0.667 LW
N
516 289.429 M
74 289.429 L
S
GR
GS
[0.75 0 0 0.75 0 0.5] CT
0.873 GC
1 LJ
0.667 LW
N
516 239.143 M
74 239.143 L
S
GR
GS
[0.75 0 0 0.75 0 0.5] CT
0.873 GC
1 LJ
0.667 LW
N
516 188.857 M
74 188.857 L
S
GR
GS
[0.75 0 0 0.75 0 0.5] CT
0.873 GC
1 LJ
0.667 LW
N
516 138.571 M
74 138.571 L
S
GR
GS
[0.75 0 0 0.75 0 0.5] CT
0.873 GC
1 LJ
0.667 LW
N
516 88.286 M
74 88.286 L
S
GR
GS
[0.75 0 0 0.75 0 0.5] CT
0.873 GC
1 LJ
0.667 LW
N
516 38 M
74 38 L
S
GR
GS
[0.75 0 0 0.75 0 0.5] CT
0.149 GC
2 setlinecap
1 LJ
0.667 LW
N
74 390 M
516 390 L
S
GR
GS
[0.75 0 0 0.75 0 0.5] CT
0.149 GC
2 setlinecap
1 LJ
0.667 LW
N
74 390 M
74 385.58 L
S
GR
GS
[0.75 0 0 0.75 0 0.5] CT
0.149 GC
2 setlinecap
1 LJ
0.667 LW
N
114.182 390 M
114.182 385.58 L
S
GR
GS
[0.75 0 0 0.75 0 0.5] CT
0.149 GC
2 setlinecap
1 LJ
0.667 LW
N
154.364 390 M
154.364 385.58 L
S
GR
GS
[0.75 0 0 0.75 0 0.5] CT
0.149 GC
2 setlinecap
1 LJ
0.667 LW
N
194.545 390 M
194.545 385.58 L
S
GR
GS
[0.75 0 0 0.75 0 0.5] CT
0.149 GC
2 setlinecap
1 LJ
0.667 LW
N
234.727 390 M
234.727 385.58 L
S
GR
GS
[0.75 0 0 0.75 0 0.5] CT
0.149 GC
2 setlinecap
1 LJ
0.667 LW
N
274.909 390 M
274.909 385.58 L
S
GR
GS
[0.75 0 0 0.75 0 0.5] CT
0.149 GC
2 setlinecap
1 LJ
0.667 LW
N
315.091 390 M
315.091 385.58 L
S
GR
GS
[0.75 0 0 0.75 0 0.5] CT
0.149 GC
2 setlinecap
1 LJ
0.667 LW
N
355.273 390 M
355.273 385.58 L
S
GR
GS
[0.75 0 0 0.75 0 0.5] CT
0.149 GC
2 setlinecap
1 LJ
0.667 LW
N
395.455 390 M
395.455 385.58 L
S
GR
GS
[0.75 0 0 0.75 0 0.5] CT
0.149 GC
2 setlinecap
1 LJ
0.667 LW
N
435.636 390 M
435.636 385.58 L
S
GR
GS
[0.75 0 0 0.75 0 0.5] CT
0.149 GC
2 setlinecap
1 LJ
0.667 LW
N
475.818 390 M
475.818 385.58 L
S
GR
GS
[0.75 0 0 0.75 0 0.5] CT
0.149 GC
2 setlinecap
1 LJ
0.667 LW
N
516 390 M
516 385.58 L
S
GR
GS
[0.75 0 0 0.75 55.5 297.00001] CT
0.149 GC
/Helvetica 13.333 F
GS
[1 0 0 1 0 0] CT
-4 15 moveto 
1 -1 scale
(0) t 
GR
GR
GS
[0.75 0 0 0.75 85.63636 297.00001] CT
0.149 GC
/Helvetica 13.333 F
GS
[1 0 0 1 0 0] CT
-4 15 moveto 
1 -1 scale
(2) t 
GR
GR
GS
[0.75 0 0 0.75 115.77272 297.00001] CT
0.149 GC
/Helvetica 13.333 F
GS
[1 0 0 1 0 0] CT
-4 15 moveto 
1 -1 scale
(4) t 
GR
GR
GS
[0.75 0 0 0.75 145.90909 297.00001] CT
0.149 GC
/Helvetica 13.333 F
GS
[1 0 0 1 0 0] CT
-4 15 moveto 
1 -1 scale
(6) t 
GR
GR
GS
[0.75 0 0 0.75 176.04546 297.00001] CT
0.149 GC
/Helvetica 13.333 F
GS
[1 0 0 1 0 0] CT
-4 15 moveto 
1 -1 scale
(8) t 
GR
GR
GS
[0.75 0 0 0.75 206.18182 297.00001] CT
0.149 GC
/Helvetica 13.333 F
GS
[1 0 0 1 0 0] CT
-8 15 moveto 
1 -1 scale
(10) t 
GR
GR
GS
[0.75 0 0 0.75 236.31818 297.00001] CT
0.149 GC
/Helvetica 13.333 F
GS
[1 0 0 1 0 0] CT
-8 15 moveto 
1 -1 scale
(12) t 
GR
GR
GS
[0.75 0 0 0.75 266.45455 297.00001] CT
0.149 GC
/Helvetica 13.333 F
GS
[1 0 0 1 0 0] CT
-8 15 moveto 
1 -1 scale
(14) t 
GR
GR
GS
[0.75 0 0 0.75 296.59092 297.00001] CT
0.149 GC
/Helvetica 13.333 F
GS
[1 0 0 1 0 0] CT
-8 15 moveto 
1 -1 scale
(16) t 
GR
GR
GS
[0.75 0 0 0.75 326.72726 297.00001] CT
0.149 GC
/Helvetica 13.333 F
GS
[1 0 0 1 0 0] CT
-8 15 moveto 
1 -1 scale
(18) t 
GR
GR
GS
[0.75 0 0 0.75 356.86363 297.00001] CT
0.149 GC
/Helvetica 13.333 F
GS
[1 0 0 1 0 0] CT
-8 15 moveto 
1 -1 scale
(20) t 
GR
GR
GS
[0.75 0 0 0.75 387 297.00001] CT
0.149 GC
/Helvetica 13.333 F
GS
[1 0 0 1 0 0] CT
-8 15 moveto 
1 -1 scale
(22) t 
GR
GR
GS
[0.75 0 0 0.75 221.25016 311.49999] CT
0.149 GC
N
-43.282 22.296 M
-43.282 21.859 -43.188 21.484 QT
-41.095 13.156 L
-44.142 13.156 L
-44.438 13.156 -44.438 12.781 QT
-44.329 12.14 -44.063 12.14 QT
-40.845 12.14 L
-39.688 7.406 L
-39.563 7.031 -39.227 6.757 QT
-38.892 6.484 -38.47 6.484 QT
-38.095 6.484 -37.845 6.702 QT
-37.595 6.921 -37.595 7.296 QT
-37.595 7.374 -37.602 7.429 QT
-37.61 7.484 -37.626 7.531 QT
-38.798 12.14 L
-35.798 12.14 L
-35.501 12.14 -35.501 12.515 QT
-35.517 12.593 -35.563 12.765 QT
-35.61 12.937 -35.681 13.046 QT
-35.751 13.156 -35.892 13.156 QT
-39.048 13.156 L
-41.126 21.546 L
-41.345 22.359 -41.345 22.952 QT
-41.345 24.202 -40.485 24.202 QT
-39.22 24.202 -38.235 23.007 QT
-37.251 21.812 -36.72 20.374 QT
-36.61 20.202 -36.501 20.202 QT
-36.142 20.202 L
-36.032 20.202 -35.962 20.281 QT
-35.892 20.359 -35.892 20.468 QT
-35.892 20.515 -35.923 20.546 QT
-36.548 22.296 -37.767 23.632 QT
-38.985 24.968 -40.563 24.968 QT
-41.704 24.968 -42.493 24.218 QT
-43.282 23.468 -43.282 22.296 QT
cp
f
GR
GS
[0.75 0 0 0.75 221.25016 311.49999] CT
0.149 GC
N
-32.221 22.562 M
-32.221 22.015 -31.986 21.421 QT
-29.643 15.187 L
-29.268 14.124 -29.268 13.437 QT
-29.268 12.577 -29.893 12.577 QT
-31.049 12.577 -31.791 13.757 QT
-32.533 14.937 -32.893 16.406 QT
-32.94 16.577 -33.127 16.577 QT
-33.471 16.577 L
-33.705 16.577 -33.705 16.312 QT
-33.705 16.234 L
-33.236 14.499 -32.276 13.163 QT
-31.315 11.827 -29.846 11.827 QT
-28.815 11.827 -28.096 12.507 QT
-27.377 13.187 -27.377 14.234 QT
-27.377 14.765 -27.611 15.359 QT
-29.971 21.593 L
-30.361 22.562 -30.361 23.343 QT
-30.361 24.202 -29.705 24.202 QT
-28.565 24.202 -27.807 22.991 QT
-27.049 21.781 -26.736 20.374 QT
-26.69 20.202 -26.518 20.202 QT
-26.158 20.202 L
-26.049 20.202 -25.979 20.281 QT
-25.908 20.359 -25.908 20.468 QT
-25.908 20.484 -25.94 20.546 QT
-26.33 22.187 -27.315 23.577 QT
-28.299 24.968 -29.752 24.968 QT
-30.783 24.968 -31.502 24.265 QT
-32.221 23.562 -32.221 22.562 QT
cp
-28.955 7.062 M
-28.955 6.452 -28.44 5.96 QT
-27.924 5.468 -27.315 5.468 QT
-26.83 5.468 -26.51 5.773 QT
-26.19 6.077 -26.19 6.546 QT
-26.19 7.187 -26.705 7.679 QT
-27.221 8.171 -27.846 8.171 QT
-28.315 8.171 -28.635 7.851 QT
-28.955 7.531 -28.955 7.062 QT
cp
f
GR
GS
[0.75 0 0 0.75 221.25016 311.49999] CT
0.149 GC
N
-22.146 24.14 M
-22.146 23.968 -22.115 23.89 QT
-19.943 15.234 L
-19.74 14.437 -19.74 13.827 QT
-19.74 12.577 -20.584 12.577 QT
-21.49 12.577 -21.928 13.663 QT
-22.365 14.749 -22.787 16.406 QT
-22.787 16.484 -22.865 16.531 QT
-22.943 16.577 -23.021 16.577 QT
-23.365 16.577 L
-23.459 16.577 -23.529 16.476 QT
-23.599 16.374 -23.599 16.281 QT
-23.287 15.031 -22.998 14.148 QT
-22.709 13.265 -22.092 12.546 QT
-21.474 11.827 -20.553 11.827 QT
-19.474 11.827 -18.639 12.515 QT
-17.803 13.202 -17.803 14.265 QT
-16.928 13.124 -15.771 12.476 QT
-14.615 11.827 -13.303 11.827 QT
-11.928 11.827 -10.935 12.531 QT
-9.943 13.234 -9.943 14.515 QT
-9.053 13.249 -7.849 12.538 QT
-6.646 11.827 -5.24 11.827 QT
-3.74 11.827 -2.826 12.64 QT
-1.912 13.452 -1.912 14.952 QT
-1.912 16.14 -2.443 17.827 QT
-2.974 19.515 -3.756 21.593 QT
-4.178 22.593 -4.178 23.343 QT
-4.178 24.202 -3.49 24.202 QT
-2.365 24.202 -1.615 22.984 QT
-0.865 21.765 -0.553 20.374 QT
-0.459 20.202 -0.303 20.202 QT
0.026 20.202 L
0.151 20.202 0.229 20.281 QT
0.307 20.359 0.307 20.468 QT
0.307 20.484 0.276 20.546 QT
-0.131 22.187 -1.115 23.577 QT
-2.099 24.968 -3.568 24.968 QT
-4.584 24.968 -5.303 24.265 QT
-6.021 23.562 -6.021 22.562 QT
-6.021 22.046 -5.787 21.421 QT
-4.974 19.249 -4.428 17.531 QT
-3.881 15.812 -3.881 14.515 QT
-3.881 13.702 -4.201 13.14 QT
-4.521 12.577 -5.287 12.577 QT
-6.881 12.577 -8.037 13.546 QT
-9.193 14.515 -10.053 16.109 QT
-10.099 16.406 -10.131 16.562 QT
-12.006 23.999 L
-12.099 24.406 -12.451 24.687 QT
-12.803 24.968 -13.224 24.968 QT
-13.568 24.968 -13.826 24.741 QT
-14.084 24.515 -14.084 24.14 QT
-14.084 23.968 -14.053 23.89 QT
-12.209 16.499 L
-11.912 15.312 -11.912 14.515 QT
-11.912 13.702 -12.24 13.14 QT
-12.568 12.577 -13.365 12.577 QT
-14.428 12.577 -15.318 13.046 QT
-16.209 13.515 -16.873 14.281 QT
-17.537 15.046 -18.099 16.109 QT
-20.068 23.999 L
-20.162 24.406 -20.506 24.687 QT
-20.849 24.968 -21.287 24.968 QT
-21.631 24.968 -21.889 24.741 QT
-22.146 24.515 -22.146 24.14 QT
cp
f
GR
GS
[0.75 0 0 0.75 221.25016 311.49999] CT
0.149 GC
N
7.202 24.968 M
5.827 24.968 4.781 24.241 QT
3.734 23.515 3.195 22.296 QT
2.656 21.077 2.656 19.718 QT
2.656 17.64 3.695 15.82 QT
4.734 13.999 6.515 12.913 QT
8.296 11.827 10.343 11.827 QT
11.577 11.827 12.507 12.468 QT
13.437 13.109 13.437 14.312 QT
13.437 15.984 12.109 16.796 QT
10.781 17.609 9.109 17.804 QT
7.437 17.999 5.406 17.999 QT
5.327 17.999 L
4.859 19.734 4.859 20.952 QT
4.859 22.249 5.452 23.226 QT
6.046 24.202 7.265 24.202 QT
8.999 24.202 10.585 23.406 QT
12.171 22.609 13.187 21.218 QT
13.265 21.124 13.406 21.124 QT
13.546 21.124 13.695 21.288 QT
13.843 21.452 13.843 21.593 QT
13.843 21.702 13.796 21.765 QT
12.734 23.249 10.937 24.109 QT
9.14 24.968 7.202 24.968 QT
cp
5.499 17.249 M
7.187 17.249 8.617 17.093 QT
10.046 16.937 11.202 16.304 QT
12.359 15.671 12.359 14.343 QT
12.359 13.812 12.062 13.406 QT
11.765 12.999 11.288 12.788 QT
10.812 12.577 10.312 12.577 QT
9.077 12.577 8.093 13.241 QT
7.109 13.906 6.468 14.976 QT
5.827 16.046 5.499 17.249 QT
cp
f
GR
GS
[0.75 0 0 0.75 221.25016 311.49999] CT
0.149 GC
N
18.455 31.89 M
18.455 2.89 L
22.423 2.89 L
22.423 4.046 L
19.626 4.046 L
19.626 30.734 L
22.423 30.734 L
22.423 31.89 L
18.455 31.89 L
cp
f
GR
GS
[0.75 0 0 0.75 221.25016 311.49999] CT
0.149 GC
N
25.697 22.874 M
26.478 24.202 28.837 24.202 QT
29.853 24.202 30.775 23.851 QT
31.697 23.499 32.298 22.812 QT
32.9 22.124 32.9 21.124 QT
32.9 20.374 32.361 19.898 QT
31.822 19.421 31.04 19.249 QT
29.462 18.937 L
28.4 18.671 27.704 17.929 QT
27.009 17.187 27.009 16.14 QT
27.009 14.859 27.704 13.866 QT
28.4 12.874 29.548 12.351 QT
30.697 11.827 31.931 11.827 QT
33.243 11.827 34.29 12.452 QT
35.337 13.077 35.337 14.312 QT
35.337 14.984 34.962 15.491 QT
34.587 15.999 33.915 15.999 QT
33.525 15.999 33.251 15.749 QT
32.978 15.499 32.978 15.124 QT
32.978 14.781 33.173 14.46 QT
33.368 14.14 33.681 13.952 QT
33.993 13.765 34.337 13.765 QT
34.087 13.14 33.384 12.859 QT
32.681 12.577 31.868 12.577 QT
31.134 12.577 30.4 12.874 QT
29.665 13.171 29.22 13.741 QT
28.775 14.312 28.775 15.093 QT
28.775 15.624 29.142 16.015 QT
29.509 16.406 30.056 16.577 QT
31.728 16.921 L
32.54 17.093 33.212 17.523 QT
33.884 17.952 34.275 18.616 QT
34.665 19.281 34.665 20.124 QT
34.665 21.202 34.064 22.249 QT
33.462 23.296 32.587 23.921 QT
31.04 24.968 28.806 24.968 QT
27.259 24.968 25.97 24.257 QT
24.681 23.546 24.681 22.14 QT
24.681 21.359 25.142 20.773 QT
25.603 20.187 26.4 20.187 QT
26.868 20.187 27.181 20.468 QT
27.493 20.749 27.493 21.218 QT
27.493 21.874 27.001 22.374 QT
26.509 22.874 25.837 22.874 QT
25.697 22.874 L
cp
f
GR
GS
[0.75 0 0 0.75 221.25016 311.49999] CT
0.149 GC
N
37.572 31.89 M
37.572 30.734 L
40.384 30.734 L
40.384 4.046 L
37.572 4.046 L
37.572 2.89 L
41.54 2.89 L
41.54 31.89 L
37.572 31.89 L
cp
f
GR
GS
[0.75 0 0 0.75 0 0.5] CT
0.149 GC
2 setlinecap
1 LJ
0.667 LW
N
74 390 M
74 38 L
S
GR
GS
[0.75 0 0 0.75 0 0.5] CT
0.149 GC
2 setlinecap
1 LJ
0.667 LW
N
74 390 M
78.42 390 L
S
GR
GS
[0.75 0 0 0.75 0 0.5] CT
0.149 GC
2 setlinecap
1 LJ
0.667 LW
N
74 339.714 M
78.42 339.714 L
S
GR
GS
[0.75 0 0 0.75 0 0.5] CT
0.149 GC
2 setlinecap
1 LJ
0.667 LW
N
74 289.429 M
78.42 289.429 L
S
GR
GS
[0.75 0 0 0.75 0 0.5] CT
0.149 GC
2 setlinecap
1 LJ
0.667 LW
N
74 239.143 M
78.42 239.143 L
S
GR
GS
[0.75 0 0 0.75 0 0.5] CT
0.149 GC
2 setlinecap
1 LJ
0.667 LW
N
74 188.857 M
78.42 188.857 L
S
GR
GS
[0.75 0 0 0.75 0 0.5] CT
0.149 GC
2 setlinecap
1 LJ
0.667 LW
N
74 138.571 M
78.42 138.571 L
S
GR
GS
[0.75 0 0 0.75 0 0.5] CT
0.149 GC
2 setlinecap
1 LJ
0.667 LW
N
74 88.286 M
78.42 88.286 L
S
GR
GS
[0.75 0 0 0.75 0 0.5] CT
0.149 GC
2 setlinecap
1 LJ
0.667 LW
N
74 38 M
78.42 38 L
S
GR
GS
[0.75 0 0 0.75 51.5 293] CT
0.149 GC
/Helvetica 13.333 F
GS
[1 0 0 1 0 0] CT
-20 5.5 moveto 
1 -1 scale
(-60) t 
GR
GR
GS
[0.75 0 0 0.75 51.5 255.28572] CT
0.149 GC
/Helvetica 13.333 F
GS
[1 0 0 1 0 0] CT
-20 5.5 moveto 
1 -1 scale
(-40) t 
GR
GR
GS
[0.75 0 0 0.75 51.5 217.57142] CT
0.149 GC
/Helvetica 13.333 F
GS
[1 0 0 1 0 0] CT
-20 5.5 moveto 
1 -1 scale
(-20) t 
GR
GR
GS
[0.75 0 0 0.75 51.5 179.85714] CT
0.149 GC
/Helvetica 13.333 F
GS
[1 0 0 1 0 0] CT
-8 5.5 moveto 
1 -1 scale
(0) t 
GR
GR
GS
[0.75 0 0 0.75 51.5 142.14286] CT
0.149 GC
/Helvetica 13.333 F
GS
[1 0 0 1 0 0] CT
-16 5.5 moveto 
1 -1 scale
(20) t 
GR
GR
GS
[0.75 0 0 0.75 51.5 104.42857] CT
0.149 GC
/Helvetica 13.333 F
GS
[1 0 0 1 0 0] CT
-16 5.5 moveto 
1 -1 scale
(40) t 
GR
GR
GS
[0.75 0 0 0.75 51.5 66.71428] CT
0.149 GC
/Helvetica 13.333 F
GS
[1 0 0 1 0 0] CT
-16 5.5 moveto 
1 -1 scale
(60) t 
GR
GR
GS
[0.75 0 0 0.75 51.5 29] CT
0.149 GC
/Helvetica 13.333 F
GS
[1 0 0 1 0 0] CT
-16 5.5 moveto 
1 -1 scale
(80) t 
GR
GR
GS
[0 -0.75 0.75 0 33.5 160.99987] CT
0.149 GC
N
-31.544 -11.06 M
-31.544 -11.232 -31.512 -11.31 QT
-29.34 -19.966 L
-29.137 -20.763 -29.137 -21.373 QT
-29.137 -22.623 -29.981 -22.623 QT
-30.887 -22.623 -31.325 -21.537 QT
-31.762 -20.451 -32.184 -18.794 QT
-32.184 -18.716 -32.262 -18.669 QT
-32.34 -18.623 -32.419 -18.623 QT
-32.762 -18.623 L
-32.856 -18.623 -32.926 -18.724 QT
-32.997 -18.826 -32.997 -18.919 QT
-32.684 -20.169 -32.395 -21.052 QT
-32.106 -21.935 -31.489 -22.654 QT
-30.872 -23.373 -29.95 -23.373 QT
-28.95 -23.373 -28.192 -22.794 QT
-27.434 -22.216 -27.247 -21.263 QT
-26.512 -22.232 -25.575 -22.802 QT
-24.637 -23.373 -23.512 -23.373 QT
-22.59 -23.373 -21.887 -22.834 QT
-21.184 -22.294 -21.184 -21.373 QT
-21.184 -20.638 -21.645 -20.091 QT
-22.106 -19.544 -22.872 -19.544 QT
-23.34 -19.544 -23.661 -19.841 QT
-23.981 -20.138 -23.981 -20.607 QT
-23.981 -21.232 -23.512 -21.74 QT
-23.044 -22.248 -22.434 -22.248 QT
-22.903 -22.623 -23.575 -22.623 QT
-24.809 -22.623 -25.731 -21.74 QT
-26.653 -20.857 -27.387 -19.498 QT
-29.465 -11.201 L
-29.559 -10.794 -29.903 -10.513 QT
-30.247 -10.232 -30.684 -10.232 QT
-31.028 -10.232 -31.286 -10.459 QT
-31.544 -10.685 -31.544 -11.06 QT
cp
f
GR
GS
[0 -0.75 0.75 0 33.5 160.99987] CT
0.149 GC
N
-18.778 -3.16 M
-18.341 -2.395 -17.247 -2.395 QT
-16.247 -2.395 -15.521 -3.09 QT
-14.794 -3.785 -14.349 -4.777 QT
-13.903 -5.77 -13.653 -6.801 QT
-14.591 -5.926 -15.669 -5.926 QT
-16.497 -5.926 -17.083 -6.215 QT
-17.669 -6.504 -17.997 -7.074 QT
-18.325 -7.645 -18.325 -8.441 QT
-18.325 -9.129 -18.138 -9.855 QT
-17.95 -10.582 -17.614 -11.465 QT
-17.278 -12.348 -17.044 -13.004 QT
-16.763 -13.785 -16.763 -14.27 QT
-16.763 -14.895 -17.216 -14.895 QT
-18.06 -14.895 -18.591 -14.043 QT
-19.122 -13.191 -19.388 -12.129 QT
-19.419 -11.988 -19.56 -11.988 QT
-19.81 -11.988 L
-19.981 -11.988 -19.981 -12.191 QT
-19.981 -12.254 L
-19.638 -13.504 -18.942 -14.473 QT
-18.247 -15.441 -17.185 -15.441 QT
-16.435 -15.441 -15.919 -14.949 QT
-15.403 -14.457 -15.403 -13.691 QT
-15.403 -13.301 -15.575 -12.879 QT
-15.669 -12.613 -15.997 -11.754 QT
-16.325 -10.895 -16.497 -10.332 QT
-16.669 -9.77 -16.778 -9.223 QT
-16.888 -8.676 -16.888 -8.145 QT
-16.888 -7.441 -16.591 -6.957 QT
-16.294 -6.473 -15.653 -6.473 QT
-14.356 -6.473 -13.31 -8.066 QT
-11.731 -14.535 L
-11.653 -14.816 -11.396 -15.012 QT
-11.138 -15.207 -10.841 -15.207 QT
-10.591 -15.207 -10.396 -15.043 QT
-10.2 -14.879 -10.2 -14.613 QT
-10.2 -14.504 -10.231 -14.457 QT
-12.31 -6.098 L
-12.591 -5.02 -13.325 -4.035 QT
-14.06 -3.051 -15.099 -2.449 QT
-16.138 -1.848 -17.278 -1.848 QT
-17.81 -1.848 -18.349 -2.059 QT
-18.888 -2.27 -19.216 -2.691 QT
-19.544 -3.113 -19.544 -3.676 QT
-19.544 -4.254 -19.2 -4.676 QT
-18.856 -5.098 -18.294 -5.098 QT
-17.966 -5.098 -17.731 -4.887 QT
-17.497 -4.676 -17.497 -4.332 QT
-17.497 -3.848 -17.856 -3.488 QT
-18.216 -3.129 -18.7 -3.129 QT
-18.716 -3.145 -18.739 -3.152 QT
-18.763 -3.16 -18.778 -3.16 QT
cp
f
GR
GS
[0 -0.75 0.75 0 33.5 160.99987] CT
0.149 GC
N
-4.852 -3.31 M
-4.852 -32.31 L
-0.883 -32.31 L
-0.883 -31.154 L
-3.68 -31.154 L
-3.68 -4.466 L
-0.883 -4.466 L
-0.883 -3.31 L
-4.852 -3.31 L
cp
f
GR
GS
[0 -0.75 0.75 0 33.5 160.99987] CT
0.149 GC
N
2.109 -11.06 M
2.109 -11.232 2.14 -11.31 QT
4.312 -19.966 L
4.515 -20.763 4.515 -21.373 QT
4.515 -22.623 3.672 -22.623 QT
2.765 -22.623 2.328 -21.537 QT
1.89 -20.451 1.468 -18.794 QT
1.468 -18.716 1.39 -18.669 QT
1.312 -18.623 1.234 -18.623 QT
0.89 -18.623 L
0.797 -18.623 0.726 -18.724 QT
0.656 -18.826 0.656 -18.919 QT
0.968 -20.169 1.257 -21.052 QT
1.547 -21.935 2.164 -22.654 QT
2.781 -23.373 3.703 -23.373 QT
4.781 -23.373 5.617 -22.685 QT
6.453 -21.998 6.453 -20.935 QT
7.328 -22.076 8.484 -22.724 QT
9.64 -23.373 10.953 -23.373 QT
12.328 -23.373 13.32 -22.669 QT
14.312 -21.966 14.312 -20.685 QT
15.203 -21.951 16.406 -22.662 QT
17.609 -23.373 19.015 -23.373 QT
20.515 -23.373 21.429 -22.56 QT
22.343 -21.748 22.343 -20.248 QT
22.343 -19.06 21.812 -17.373 QT
21.281 -15.685 20.5 -13.607 QT
20.078 -12.607 20.078 -11.857 QT
20.078 -10.998 20.765 -10.998 QT
21.89 -10.998 22.64 -12.216 QT
23.39 -13.435 23.703 -14.826 QT
23.797 -14.998 23.953 -14.998 QT
24.281 -14.998 L
24.406 -14.998 24.484 -14.919 QT
24.562 -14.841 24.562 -14.732 QT
24.562 -14.716 24.531 -14.654 QT
24.125 -13.013 23.14 -11.623 QT
22.156 -10.232 20.687 -10.232 QT
19.672 -10.232 18.953 -10.935 QT
18.234 -11.638 18.234 -12.638 QT
18.234 -13.154 18.468 -13.779 QT
19.281 -15.951 19.828 -17.669 QT
20.375 -19.388 20.375 -20.685 QT
20.375 -21.498 20.054 -22.06 QT
19.734 -22.623 18.968 -22.623 QT
17.375 -22.623 16.218 -21.654 QT
15.062 -20.685 14.203 -19.091 QT
14.156 -18.794 14.125 -18.638 QT
12.25 -11.201 L
12.156 -10.794 11.804 -10.513 QT
11.453 -10.232 11.031 -10.232 QT
10.687 -10.232 10.429 -10.459 QT
10.172 -10.685 10.172 -11.06 QT
10.172 -11.232 10.203 -11.31 QT
12.047 -18.701 L
12.343 -19.888 12.343 -20.685 QT
12.343 -21.498 12.015 -22.06 QT
11.687 -22.623 10.89 -22.623 QT
9.828 -22.623 8.937 -22.154 QT
8.047 -21.685 7.382 -20.919 QT
6.718 -20.154 6.156 -19.091 QT
4.187 -11.201 L
4.093 -10.794 3.75 -10.513 QT
3.406 -10.232 2.968 -10.232 QT
2.625 -10.232 2.367 -10.459 QT
2.109 -10.685 2.109 -11.06 QT
cp
f
GR
GS
[0 -0.75 0.75 0 33.5 160.99987] CT
0.149 GC
N
26.27 -3.31 M
26.27 -4.466 L
29.083 -4.466 L
29.083 -31.154 L
26.27 -31.154 L
26.27 -32.31 L
30.239 -32.31 L
30.239 -3.31 L
26.27 -3.31 L
cp
f
GR
GS
[0.75 0 0 0.75 221.25021 25.22857] CT
N
-103.172 -9.6 M
-103.172 -10.553 L
-100.391 -10.553 -100.391 -11.413 QT
-100.391 -26.241 L
-100.391 -27.1 -103.172 -27.1 QT
-103.172 -28.038 L
-94.422 -28.038 L
-94.422 -27.1 L
-97.875 -27.1 -97.875 -26.241 QT
-97.875 -11.413 L
-97.875 -10.819 -97.539 -10.686 QT
-97.203 -10.553 -96.5 -10.553 QT
-94.422 -10.553 L
-92.391 -10.553 -91.297 -11.288 QT
-90.203 -12.022 -89.75 -13.295 QT
-89.297 -14.569 -89.063 -16.678 QT
-88.281 -16.678 L
-89.031 -9.6 L
-103.172 -9.6 L
cp
f
GR
GS
[0.75 0 0 0.75 221.25021 25.22857] CT
N
-86.255 -12.256 M
-86.255 -13.866 -84.99 -14.874 QT
-83.724 -15.881 -81.951 -16.295 QT
-80.177 -16.709 -78.583 -16.709 QT
-78.583 -17.819 L
-78.583 -18.584 -78.927 -19.319 QT
-79.271 -20.053 -79.912 -20.522 QT
-80.552 -20.991 -81.333 -20.991 QT
-83.13 -20.991 -84.068 -20.194 QT
-83.552 -20.194 -83.216 -19.803 QT
-82.88 -19.413 -82.88 -18.897 QT
-82.88 -18.35 -83.263 -17.967 QT
-83.646 -17.584 -84.162 -17.584 QT
-84.708 -17.584 -85.091 -17.967 QT
-85.474 -18.35 -85.474 -18.897 QT
-85.474 -20.319 -84.185 -21.014 QT
-82.896 -21.709 -81.333 -21.709 QT
-80.24 -21.709 -79.13 -21.241 QT
-78.021 -20.772 -77.318 -19.897 QT
-76.615 -19.022 -76.615 -17.866 QT
-76.615 -11.788 L
-76.615 -11.256 -76.388 -10.819 QT
-76.162 -10.381 -75.693 -10.381 QT
-75.24 -10.381 -75.021 -10.827 QT
-74.802 -11.272 -74.802 -11.788 QT
-74.802 -13.522 L
-74.021 -13.522 L
-74.021 -11.788 L
-74.021 -11.178 -74.333 -10.631 QT
-74.646 -10.084 -75.185 -9.764 QT
-75.724 -9.444 -76.333 -9.444 QT
-77.13 -9.444 -77.701 -10.053 QT
-78.271 -10.663 -78.349 -11.506 QT
-78.849 -10.491 -79.818 -9.897 QT
-80.787 -9.303 -81.896 -9.303 QT
-82.927 -9.303 -83.927 -9.6 QT
-84.927 -9.897 -85.591 -10.553 QT
-86.255 -11.209 -86.255 -12.256 QT
cp
-84.068 -12.256 M
-84.068 -11.303 -83.365 -10.655 QT
-82.662 -10.006 -81.724 -10.006 QT
-80.849 -10.006 -80.138 -10.444 QT
-79.427 -10.881 -79.005 -11.631 QT
-78.583 -12.381 -78.583 -13.209 QT
-78.583 -16.022 L
-79.802 -16.022 -81.091 -15.616 QT
-82.38 -15.209 -83.224 -14.358 QT
-84.068 -13.506 -84.068 -12.256 QT
cp
f
GR
GS
[0.75 0 0 0.75 221.25021 25.22857] CT
N
-71.25 -12.85 M
-71.25 -20.288 L
-73.484 -20.288 L
-73.484 -20.991 L
-71.719 -20.991 -70.891 -22.639 QT
-70.063 -24.288 -70.063 -26.209 QT
-69.281 -26.209 L
-69.281 -21.241 L
-65.469 -21.241 L
-65.469 -20.288 L
-69.281 -20.288 L
-69.281 -12.897 L
-69.281 -11.772 -68.906 -10.928 QT
-68.531 -10.084 -67.547 -10.084 QT
-66.625 -10.084 -66.219 -10.975 QT
-65.813 -11.866 -65.813 -12.897 QT
-65.813 -14.491 L
-65.031 -14.491 L
-65.031 -12.85 L
-65.031 -12.006 -65.344 -11.178 QT
-65.656 -10.35 -66.266 -9.827 QT
-66.875 -9.303 -67.734 -9.303 QT
-69.359 -9.303 -70.305 -10.272 QT
-71.25 -11.241 -71.25 -12.85 QT
cp
f
GR
GS
[0.75 0 0 0.75 221.25021 25.22857] CT
N
-56.911 -9.303 M
-58.552 -9.303 -59.927 -10.163 QT
-61.302 -11.022 -62.091 -12.467 QT
-62.88 -13.913 -62.88 -15.522 QT
-62.88 -17.1 -62.161 -18.522 QT
-61.442 -19.944 -60.153 -20.827 QT
-58.864 -21.709 -57.286 -21.709 QT
-56.052 -21.709 -55.138 -21.288 QT
-54.223 -20.866 -53.63 -20.131 QT
-53.036 -19.397 -52.731 -18.397 QT
-52.427 -17.397 -52.427 -16.194 QT
-52.427 -15.834 -52.708 -15.834 QT
-60.52 -15.834 L
-60.52 -15.553 L
-60.52 -13.303 -59.614 -11.694 QT
-58.708 -10.084 -56.661 -10.084 QT
-55.833 -10.084 -55.13 -10.452 QT
-54.427 -10.819 -53.903 -11.483 QT
-53.38 -12.147 -53.208 -12.897 QT
-53.177 -12.991 -53.106 -13.061 QT
-53.036 -13.131 -52.942 -13.131 QT
-52.708 -13.131 L
-52.427 -13.131 -52.427 -12.788 QT
-52.802 -11.256 -54.067 -10.28 QT
-55.333 -9.303 -56.911 -9.303 QT
cp
-60.489 -16.506 M
-54.333 -16.506 L
-54.333 -17.522 -54.614 -18.561 QT
-54.895 -19.6 -55.559 -20.295 QT
-56.223 -20.991 -57.286 -20.991 QT
-58.817 -20.991 -59.653 -19.561 QT
-60.489 -18.131 -60.489 -16.506 QT
cp
f
GR
GS
[0.75 0 0 0.75 221.25021 25.22857] CT
N
-51.075 -9.6 M
-51.075 -10.553 L
-50.153 -10.553 -49.559 -10.694 QT
-48.965 -10.834 -48.965 -11.413 QT
-48.965 -18.772 L
-48.965 -19.506 -49.184 -19.827 QT
-49.403 -20.147 -49.809 -20.217 QT
-50.215 -20.288 -51.075 -20.288 QT
-51.075 -21.241 L
-47.215 -21.538 L
-47.215 -18.897 L
-46.778 -20.069 -45.973 -20.803 QT
-45.168 -21.538 -44.028 -21.538 QT
-43.215 -21.538 -42.583 -21.061 QT
-41.95 -20.584 -41.95 -19.803 QT
-41.95 -19.319 -42.301 -18.952 QT
-42.653 -18.584 -43.168 -18.584 QT
-43.668 -18.584 -44.028 -18.944 QT
-44.387 -19.303 -44.387 -19.803 QT
-44.387 -20.522 -43.872 -20.834 QT
-44.028 -20.834 L
-45.122 -20.834 -45.809 -20.045 QT
-46.497 -19.256 -46.793 -18.077 QT
-47.09 -16.897 -47.09 -15.834 QT
-47.09 -11.413 L
-47.09 -10.553 -44.465 -10.553 QT
-44.465 -9.6 L
-51.075 -9.6 L
cp
f
GR
GS
[0.75 0 0 0.75 221.25021 25.22857] CT
N
-40.255 -12.256 M
-40.255 -13.866 -38.99 -14.874 QT
-37.724 -15.881 -35.951 -16.295 QT
-34.177 -16.709 -32.583 -16.709 QT
-32.583 -17.819 L
-32.583 -18.584 -32.927 -19.319 QT
-33.271 -20.053 -33.912 -20.522 QT
-34.552 -20.991 -35.333 -20.991 QT
-37.13 -20.991 -38.068 -20.194 QT
-37.552 -20.194 -37.216 -19.803 QT
-36.88 -19.413 -36.88 -18.897 QT
-36.88 -18.35 -37.263 -17.967 QT
-37.646 -17.584 -38.162 -17.584 QT
-38.708 -17.584 -39.091 -17.967 QT
-39.474 -18.35 -39.474 -18.897 QT
-39.474 -20.319 -38.185 -21.014 QT
-36.896 -21.709 -35.333 -21.709 QT
-34.24 -21.709 -33.13 -21.241 QT
-32.021 -20.772 -31.318 -19.897 QT
-30.615 -19.022 -30.615 -17.866 QT
-30.615 -11.788 L
-30.615 -11.256 -30.388 -10.819 QT
-30.162 -10.381 -29.693 -10.381 QT
-29.24 -10.381 -29.021 -10.827 QT
-28.802 -11.272 -28.802 -11.788 QT
-28.802 -13.522 L
-28.021 -13.522 L
-28.021 -11.788 L
-28.021 -11.178 -28.333 -10.631 QT
-28.646 -10.084 -29.185 -9.764 QT
-29.724 -9.444 -30.333 -9.444 QT
-31.13 -9.444 -31.701 -10.053 QT
-32.271 -10.663 -32.349 -11.506 QT
-32.849 -10.491 -33.818 -9.897 QT
-34.787 -9.303 -35.896 -9.303 QT
-36.927 -9.303 -37.927 -9.6 QT
-38.927 -9.897 -39.591 -10.553 QT
-40.255 -11.209 -40.255 -12.256 QT
cp
-38.068 -12.256 M
-38.068 -11.303 -37.365 -10.655 QT
-36.662 -10.006 -35.724 -10.006 QT
-34.849 -10.006 -34.138 -10.444 QT
-33.427 -10.881 -33.005 -11.631 QT
-32.583 -12.381 -32.583 -13.209 QT
-32.583 -16.022 L
-33.802 -16.022 -35.091 -15.616 QT
-36.38 -15.209 -37.224 -14.358 QT
-38.068 -13.506 -38.068 -12.256 QT
cp
f
GR
GS
[0.75 0 0 0.75 221.25021 25.22857] CT
N
-27.172 -9.6 M
-27.172 -10.553 L
-26.25 -10.553 -25.656 -10.694 QT
-25.063 -10.834 -25.063 -11.413 QT
-25.063 -25.584 L
-25.063 -26.303 -25.281 -26.624 QT
-25.5 -26.944 -25.906 -27.022 QT
-26.313 -27.1 -27.172 -27.1 QT
-27.172 -28.038 L
-23.156 -28.334 L
-23.156 -11.413 L
-23.156 -10.834 -22.563 -10.694 QT
-21.969 -10.553 -21.063 -10.553 QT
-21.063 -9.6 L
-27.172 -9.6 L
cp
f
GR
GS
[0.75 0 0 0.75 221.25021 25.22857] CT
N
-8.954 -12.85 M
-8.954 -20.288 L
-11.188 -20.288 L
-11.188 -20.991 L
-9.422 -20.991 -8.594 -22.639 QT
-7.766 -24.288 -7.766 -26.209 QT
-6.985 -26.209 L
-6.985 -21.241 L
-3.172 -21.241 L
-3.172 -20.288 L
-6.985 -20.288 L
-6.985 -12.897 L
-6.985 -11.772 -6.61 -10.928 QT
-6.235 -10.084 -5.251 -10.084 QT
-4.329 -10.084 -3.922 -10.975 QT
-3.516 -11.866 -3.516 -12.897 QT
-3.516 -14.491 L
-2.735 -14.491 L
-2.735 -12.85 L
-2.735 -12.006 -3.047 -11.178 QT
-3.36 -10.35 -3.969 -9.827 QT
-4.579 -9.303 -5.438 -9.303 QT
-7.063 -9.303 -8.008 -10.272 QT
-8.954 -11.241 -8.954 -12.85 QT
cp
f
GR
GS
[0.75 0 0 0.75 221.25021 25.22857] CT
N
-0.63 -9.6 M
-0.63 -10.553 L
0.292 -10.553 0.885 -10.694 QT
1.479 -10.834 1.479 -11.413 QT
1.479 -18.772 L
1.479 -19.506 1.26 -19.827 QT
1.042 -20.147 0.635 -20.217 QT
0.229 -20.288 -0.63 -20.288 QT
-0.63 -21.241 L
3.229 -21.538 L
3.229 -18.897 L
3.667 -20.069 4.471 -20.803 QT
5.276 -21.538 6.417 -21.538 QT
7.229 -21.538 7.862 -21.061 QT
8.495 -20.584 8.495 -19.803 QT
8.495 -19.319 8.143 -18.952 QT
7.792 -18.584 7.276 -18.584 QT
6.776 -18.584 6.417 -18.944 QT
6.057 -19.303 6.057 -19.803 QT
6.057 -20.522 6.573 -20.834 QT
6.417 -20.834 L
5.323 -20.834 4.635 -20.045 QT
3.948 -19.256 3.651 -18.077 QT
3.354 -16.897 3.354 -15.834 QT
3.354 -11.413 L
3.354 -10.553 5.979 -10.553 QT
5.979 -9.6 L
-0.63 -9.6 L
cp
f
GR
GS
[0.75 0 0 0.75 221.25021 25.22857] CT
N
10.189 -12.256 M
10.189 -13.866 11.455 -14.874 QT
12.72 -15.881 14.494 -16.295 QT
16.267 -16.709 17.861 -16.709 QT
17.861 -17.819 L
17.861 -18.584 17.517 -19.319 QT
17.174 -20.053 16.533 -20.522 QT
15.892 -20.991 15.111 -20.991 QT
13.314 -20.991 12.377 -20.194 QT
12.892 -20.194 13.228 -19.803 QT
13.564 -19.413 13.564 -18.897 QT
13.564 -18.35 13.181 -17.967 QT
12.799 -17.584 12.283 -17.584 QT
11.736 -17.584 11.353 -17.967 QT
10.97 -18.35 10.97 -18.897 QT
10.97 -20.319 12.26 -21.014 QT
13.549 -21.709 15.111 -21.709 QT
16.205 -21.709 17.314 -21.241 QT
18.424 -20.772 19.127 -19.897 QT
19.83 -19.022 19.83 -17.866 QT
19.83 -11.788 L
19.83 -11.256 20.056 -10.819 QT
20.283 -10.381 20.752 -10.381 QT
21.205 -10.381 21.424 -10.827 QT
21.642 -11.272 21.642 -11.788 QT
21.642 -13.522 L
22.424 -13.522 L
22.424 -11.788 L
22.424 -11.178 22.111 -10.631 QT
21.799 -10.084 21.26 -9.764 QT
20.721 -9.444 20.111 -9.444 QT
19.314 -9.444 18.744 -10.053 QT
18.174 -10.663 18.096 -11.506 QT
17.596 -10.491 16.627 -9.897 QT
15.658 -9.303 14.549 -9.303 QT
13.517 -9.303 12.517 -9.6 QT
11.517 -9.897 10.853 -10.553 QT
10.189 -11.209 10.189 -12.256 QT
cp
12.377 -12.256 M
12.377 -11.303 13.08 -10.655 QT
13.783 -10.006 14.72 -10.006 QT
15.595 -10.006 16.306 -10.444 QT
17.017 -10.881 17.439 -11.631 QT
17.861 -12.381 17.861 -13.209 QT
17.861 -16.022 L
16.642 -16.022 15.353 -15.616 QT
14.064 -15.209 13.22 -14.358 QT
12.377 -13.506 12.377 -12.256 QT
cp
f
GR
GS
[0.75 0 0 0.75 221.25021 25.22857] CT
N
24.473 -5.069 M
25.082 -4.756 25.863 -4.756 QT
26.926 -4.756 27.348 -5.85 QT
27.77 -6.944 27.77 -8.209 QT
27.77 -18.772 L
27.77 -19.506 27.504 -19.827 QT
27.238 -20.147 26.785 -20.217 QT
26.332 -20.288 25.442 -20.288 QT
25.442 -21.241 L
29.645 -21.538 L
29.645 -8.084 L
29.645 -7.038 29.129 -6.108 QT
28.613 -5.178 27.731 -4.624 QT
26.848 -4.069 25.817 -4.069 QT
24.645 -4.069 23.692 -4.647 QT
22.738 -5.225 22.738 -6.272 QT
22.738 -6.803 23.121 -7.186 QT
23.504 -7.569 24.035 -7.569 QT
24.567 -7.569 24.942 -7.186 QT
25.317 -6.803 25.317 -6.272 QT
25.317 -5.866 25.09 -5.522 QT
24.863 -5.178 24.473 -5.069 QT
cp
26.676 -26.178 M
26.676 -26.772 27.129 -27.217 QT
27.582 -27.663 28.176 -27.663 QT
28.535 -27.663 28.895 -27.467 QT
29.254 -27.272 29.449 -26.913 QT
29.645 -26.553 29.645 -26.178 QT
29.645 -25.584 29.215 -25.139 QT
28.785 -24.694 28.176 -24.694 QT
27.582 -24.694 27.129 -25.139 QT
26.676 -25.584 26.676 -26.178 QT
cp
f
GR
GS
[0.75 0 0 0.75 221.25021 25.22857] CT
N
38.793 -9.303 M
37.152 -9.303 35.777 -10.163 QT
34.402 -11.022 33.613 -12.467 QT
32.824 -13.913 32.824 -15.522 QT
32.824 -17.1 33.543 -18.522 QT
34.262 -19.944 35.551 -20.827 QT
36.84 -21.709 38.418 -21.709 QT
39.652 -21.709 40.566 -21.288 QT
41.48 -20.866 42.074 -20.131 QT
42.668 -19.397 42.973 -18.397 QT
43.277 -17.397 43.277 -16.194 QT
43.277 -15.834 42.996 -15.834 QT
35.184 -15.834 L
35.184 -15.553 L
35.184 -13.303 36.09 -11.694 QT
36.996 -10.084 39.043 -10.084 QT
39.871 -10.084 40.574 -10.452 QT
41.277 -10.819 41.801 -11.483 QT
42.324 -12.147 42.496 -12.897 QT
42.527 -12.991 42.598 -13.061 QT
42.668 -13.131 42.762 -13.131 QT
42.996 -13.131 L
43.277 -13.131 43.277 -12.788 QT
42.902 -11.256 41.637 -10.28 QT
40.371 -9.303 38.793 -9.303 QT
cp
35.215 -16.506 M
41.371 -16.506 L
41.371 -17.522 41.09 -18.561 QT
40.809 -19.6 40.144 -20.295 QT
39.48 -20.991 38.418 -20.991 QT
36.887 -20.991 36.051 -19.561 QT
35.215 -18.131 35.215 -16.506 QT
cp
f
GR
GS
[0.75 0 0 0.75 221.25021 25.22857] CT
N
50.645 -9.303 M
49.02 -9.303 47.684 -10.147 QT
46.348 -10.991 45.582 -12.413 QT
44.817 -13.834 44.817 -15.428 QT
44.817 -17.022 45.574 -18.483 QT
46.332 -19.944 47.676 -20.827 QT
49.02 -21.709 50.645 -21.709 QT
52.238 -21.709 53.535 -21.084 QT
54.832 -20.459 54.832 -19.053 QT
54.832 -18.522 54.457 -18.131 QT
54.082 -17.741 53.535 -17.741 QT
53.004 -17.741 52.621 -18.131 QT
52.238 -18.522 52.238 -19.053 QT
52.238 -19.522 52.543 -19.874 QT
52.848 -20.225 53.301 -20.319 QT
52.363 -20.913 50.676 -20.913 QT
49.379 -20.913 48.59 -20.053 QT
47.801 -19.194 47.488 -17.928 QT
47.176 -16.663 47.176 -15.428 QT
47.176 -14.116 47.559 -12.897 QT
47.942 -11.678 48.809 -10.881 QT
49.676 -10.084 50.973 -10.084 QT
52.254 -10.084 53.153 -10.874 QT
54.051 -11.663 54.379 -12.928 QT
54.379 -13.084 54.598 -13.084 QT
54.926 -13.084 L
55.004 -13.084 55.067 -13.006 QT
55.129 -12.928 55.129 -12.85 QT
55.129 -12.772 L
54.723 -11.163 53.512 -10.233 QT
52.301 -9.303 50.645 -9.303 QT
cp
f
GR
GS
[0.75 0 0 0.75 221.25021 25.22857] CT
N
58.528 -12.85 M
58.528 -20.288 L
56.293 -20.288 L
56.293 -20.991 L
58.059 -20.991 58.887 -22.639 QT
59.715 -24.288 59.715 -26.209 QT
60.497 -26.209 L
60.497 -21.241 L
64.309 -21.241 L
64.309 -20.288 L
60.497 -20.288 L
60.497 -12.897 L
60.497 -11.772 60.872 -10.928 QT
61.247 -10.084 62.231 -10.084 QT
63.153 -10.084 63.559 -10.975 QT
63.965 -11.866 63.965 -12.897 QT
63.965 -14.491 L
64.747 -14.491 L
64.747 -12.85 L
64.747 -12.006 64.434 -11.178 QT
64.122 -10.35 63.512 -9.827 QT
62.903 -9.303 62.043 -9.303 QT
60.418 -9.303 59.473 -10.272 QT
58.528 -11.241 58.528 -12.85 QT
cp
f
GR
GS
[0.75 0 0 0.75 221.25021 25.22857] CT
N
72.898 -9.303 M
71.273 -9.303 69.89 -10.124 QT
68.508 -10.944 67.703 -12.327 QT
66.898 -13.709 66.898 -15.35 QT
66.898 -16.584 67.344 -17.733 QT
67.789 -18.881 68.609 -19.788 QT
69.429 -20.694 70.523 -21.202 QT
71.617 -21.709 72.898 -21.709 QT
74.554 -21.709 75.922 -20.827 QT
77.289 -19.944 78.078 -18.475 QT
78.867 -17.006 78.867 -15.35 QT
78.867 -13.725 78.062 -12.334 QT
77.258 -10.944 75.883 -10.124 QT
74.508 -9.303 72.898 -9.303 QT
cp
72.898 -10.084 M
75.054 -10.084 75.781 -11.655 QT
76.508 -13.225 76.508 -15.647 QT
76.508 -17.006 76.367 -17.897 QT
76.226 -18.788 75.726 -19.522 QT
75.429 -19.959 74.961 -20.295 QT
74.492 -20.631 73.969 -20.811 QT
73.445 -20.991 72.898 -20.991 QT
72.054 -20.991 71.297 -20.608 QT
70.539 -20.225 70.039 -19.522 QT
69.539 -18.756 69.398 -17.834 QT
69.258 -16.913 69.258 -15.647 QT
69.258 -14.131 69.523 -12.928 QT
69.789 -11.725 70.586 -10.905 QT
71.383 -10.084 72.898 -10.084 QT
cp
f
GR
GS
[0.75 0 0 0.75 221.25021 25.22857] CT
N
80.185 -9.6 M
80.185 -10.553 L
81.107 -10.553 81.7 -10.694 QT
82.294 -10.834 82.294 -11.413 QT
82.294 -18.772 L
82.294 -19.506 82.075 -19.827 QT
81.857 -20.147 81.45 -20.217 QT
81.044 -20.288 80.185 -20.288 QT
80.185 -21.241 L
84.044 -21.538 L
84.044 -18.897 L
84.482 -20.069 85.286 -20.803 QT
86.091 -21.538 87.232 -21.538 QT
88.044 -21.538 88.677 -21.061 QT
89.31 -20.584 89.31 -19.803 QT
89.31 -19.319 88.958 -18.952 QT
88.607 -18.584 88.091 -18.584 QT
87.591 -18.584 87.232 -18.944 QT
86.872 -19.303 86.872 -19.803 QT
86.872 -20.522 87.388 -20.834 QT
87.232 -20.834 L
86.138 -20.834 85.45 -20.045 QT
84.763 -19.256 84.466 -18.077 QT
84.169 -16.897 84.169 -15.834 QT
84.169 -11.413 L
84.169 -10.553 86.794 -10.553 QT
86.794 -9.6 L
80.185 -9.6 L
cp
f
GR
GS
[0.75 0 0 0.75 221.25021 25.22857] CT
N
91.785 -5.163 M
92.301 -4.756 92.926 -4.756 QT
94.614 -4.756 95.707 -7.334 QT
96.629 -9.6 L
92.582 -19.522 L
92.332 -20.022 91.817 -20.155 QT
91.301 -20.288 90.442 -20.288 QT
90.442 -21.241 L
96.114 -21.241 L
96.114 -20.288 L
94.614 -20.288 94.614 -19.647 QT
94.614 -19.538 94.645 -19.491 QT
97.645 -12.1 L
100.348 -18.756 L
100.426 -18.959 100.426 -19.209 QT
100.426 -19.538 100.254 -19.78 QT
100.082 -20.022 99.793 -20.155 QT
99.504 -20.288 99.16 -20.288 QT
99.16 -21.241 L
103.645 -21.241 L
103.645 -20.288 L
102.801 -20.288 102.176 -19.905 QT
101.551 -19.522 101.207 -18.772 QT
96.551 -7.334 L
96.176 -6.459 95.684 -5.733 QT
95.192 -5.006 94.481 -4.538 QT
93.77 -4.069 92.926 -4.069 QT
91.926 -4.069 91.184 -4.717 QT
90.442 -5.366 90.442 -6.334 QT
90.442 -6.834 90.785 -7.178 QT
91.129 -7.522 91.629 -7.522 QT
91.973 -7.522 92.239 -7.366 QT
92.504 -7.209 92.66 -6.952 QT
92.817 -6.694 92.817 -6.334 QT
92.817 -5.897 92.528 -5.553 QT
92.239 -5.209 91.785 -5.163 QT
cp
f
GR
GS
[0.75 0 0 0.75 0 0.5] CT
0.2 0.702 0.2 RC
1 LJ
0.667 LW
N
94.091 339.714 M
114.182 339.134 L
134.273 337.42 L
154.364 334.631 L
174.455 330.822 L
194.545 326.05 L
214.636 320.372 L
234.727 313.845 L
254.818 306.524 L
274.909 298.468 L
295 289.731 L
315.091 280.372 L
335.182 270.446 L
355.273 260.01 L
375.364 249.122 L
395.455 237.836 L
415.545 226.211 L
435.636 214.303 L
455.727 202.169 L
475.818 189.864 L
495.909 177.446 L
S
GR
GS
[0.75 0 0 0.75 0 0.5] CT
1 LJ
0.667 LW
N
94.091 138.571 M
114.182 138.4 L
134.273 137.895 L
154.364 137.072 L
174.455 135.949 L
194.545 134.541 L
214.636 132.866 L
234.727 130.941 L
254.818 128.782 L
274.909 126.405 L
295 123.828 L
315.091 121.067 L
335.182 118.14 L
355.273 115.062 L
375.364 111.85 L
395.455 108.521 L
415.545 105.092 L
435.636 101.58 L
455.727 98 L
475.818 94.371 L
495.909 90.708 L
S
GR
GS
[0.75 0 0 0.75 0 0.5] CT
0 0 1 RC
1 LJ
0.667 LW
N
94.091 63.143 M
114.182 63.389 L
134.273 64.117 L
154.364 65.3 L
174.455 66.917 L
194.545 68.943 L
214.636 71.353 L
234.727 74.123 L
254.818 77.231 L
274.909 80.65 L
295 84.359 L
315.091 88.331 L
335.182 92.545 L
355.273 96.974 L
375.364 101.596 L
395.455 106.386 L
415.545 111.32 L
435.636 116.375 L
455.727 121.526 L
475.818 126.748 L
495.909 132.019 L
S
GR
GS
[0.75 0 0 0.75 0 0.5] CT
0.6 0.2 0.2 RC
1 LJ
0.667 LW
N
94.091 364.857 M
114.182 364.193 L
134.273 362.233 L
154.364 359.042 L
174.455 354.685 L
194.545 349.227 L
214.636 342.732 L
234.727 335.265 L
254.818 326.892 L
274.909 317.676 L
295 307.682 L
315.091 296.976 L
335.182 285.622 L
355.273 273.685 L
375.364 261.229 L
395.455 248.321 L
415.545 235.023 L
435.636 221.401 L
455.727 207.521 L
475.818 193.446 L
495.909 179.241 L
S
GR
GS
[0.75 0 0 0.75 0 0.5] CT
1 GC
N
505 158 M
505 50 L
381 50 L
381 158 L
cp
f
GR
GS
[0.75 0 0 0.75 320.86361 49.11029] CT
N
0.672 5.12 M
0.672 4.386 L
2.547 4.386 2.984 3.136 QT
7.391 -9.693 L
7.453 -9.911 7.734 -9.911 QT
8 -9.911 L
8.281 -9.911 8.344 -9.693 QT
12.938 3.714 L
13.141 4.151 13.688 4.268 QT
14.234 4.386 15.047 4.386 QT
15.047 5.12 L
9.203 5.12 L
9.203 4.386 L
10.938 4.386 10.938 3.823 QT
10.938 3.714 L
9.797 0.432 L
4.703 0.432 L
3.766 3.136 L
3.75 3.214 3.75 3.354 QT
3.75 3.886 4.242 4.136 QT
4.734 4.386 5.313 4.386 QT
5.313 5.12 L
0.672 5.12 L
cp
4.953 -0.302 M
9.563 -0.302 L
7.25 -7.005 L
4.953 -0.302 L
cp
f
GR
GS
[0.75 0 0 0.75 320.86361 49.11029] CT
N
16.578 6.761 M
16.578 6.011 17.125 5.456 QT
17.672 4.901 18.422 4.651 QT
18 4.339 17.781 3.854 QT
17.563 3.37 17.563 2.839 QT
17.563 1.854 18.188 1.089 QT
17.219 0.151 17.219 -1.068 QT
17.219 -1.724 17.5 -2.302 QT
17.781 -2.88 18.289 -3.302 QT
18.797 -3.724 19.406 -3.943 QT
20.016 -4.161 20.672 -4.161 QT
21.922 -4.161 22.906 -3.427 QT
23.344 -3.896 23.93 -4.146 QT
24.516 -4.396 25.156 -4.396 QT
25.609 -4.396 25.898 -4.075 QT
26.188 -3.755 26.188 -3.302 QT
26.188 -3.036 25.992 -2.841 QT
25.797 -2.646 25.531 -2.646 QT
25.266 -2.646 25.07 -2.841 QT
24.875 -3.036 24.875 -3.302 QT
24.875 -3.693 25.141 -3.849 QT
24.047 -3.849 23.266 -3.099 QT
23.656 -2.708 23.883 -2.161 QT
24.109 -1.614 24.109 -1.068 QT
24.109 -0.177 23.617 0.534 QT
23.125 1.245 22.32 1.636 QT
21.516 2.026 20.672 2.026 QT
19.516 2.026 18.563 1.401 QT
18.266 1.823 18.266 2.323 QT
18.266 2.886 18.633 3.3 QT
19 3.714 19.547 3.714 QT
21.266 3.714 L
22.516 3.714 23.523 3.94 QT
24.531 4.167 25.211 4.846 QT
25.891 5.526 25.891 6.761 QT
25.891 7.682 25.117 8.292 QT
24.344 8.901 23.258 9.175 QT
22.172 9.448 21.25 9.448 QT
20.313 9.448 19.227 9.175 QT
18.141 8.901 17.359 8.292 QT
16.578 7.682 16.578 6.761 QT
cp
17.766 6.761 M
17.766 7.464 18.336 7.94 QT
18.906 8.417 19.719 8.651 QT
20.531 8.886 21.25 8.886 QT
21.953 8.886 22.766 8.651 QT
23.578 8.417 24.148 7.94 QT
24.719 7.464 24.719 6.761 QT
24.719 5.667 23.711 5.339 QT
22.703 5.011 21.266 5.011 QT
19.547 5.011 L
19.063 5.011 18.656 5.245 QT
18.25 5.479 18.008 5.893 QT
17.766 6.307 17.766 6.761 QT
cp
20.672 1.464 M
22.453 1.464 22.453 -1.068 QT
22.453 -2.177 22.07 -2.888 QT
21.688 -3.599 20.672 -3.599 QT
19.641 -3.599 19.258 -2.888 QT
18.875 -2.177 18.875 -1.068 QT
18.875 -0.38 19.023 0.182 QT
19.172 0.745 19.563 1.104 QT
19.953 1.464 20.672 1.464 QT
cp
f
GR
GS
[0.75 0 0 0.75 320.86361 49.11029] CT
N
31.901 5.354 M
30.62 5.354 29.55 4.682 QT
28.479 4.011 27.862 2.886 QT
27.245 1.761 27.245 0.511 QT
27.245 -0.708 27.807 -1.818 QT
28.37 -2.927 29.37 -3.607 QT
30.37 -4.286 31.604 -4.286 QT
32.557 -4.286 33.276 -3.966 QT
33.995 -3.646 34.456 -3.075 QT
34.917 -2.505 35.151 -1.724 QT
35.385 -0.943 35.385 -0.005 QT
35.385 0.276 35.167 0.276 QT
29.089 0.276 L
29.089 0.495 L
29.089 2.245 29.792 3.495 QT
30.495 4.745 32.089 4.745 QT
32.729 4.745 33.276 4.456 QT
33.823 4.167 34.229 3.651 QT
34.635 3.136 34.776 2.557 QT
34.792 2.479 34.854 2.425 QT
34.917 2.37 34.979 2.37 QT
35.167 2.37 L
35.385 2.37 35.385 2.636 QT
35.089 3.823 34.104 4.589 QT
33.12 5.354 31.901 5.354 QT
cp
29.104 -0.255 M
33.901 -0.255 L
33.901 -1.036 33.675 -1.849 QT
33.448 -2.661 32.94 -3.2 QT
32.432 -3.739 31.604 -3.739 QT
30.417 -3.739 29.76 -2.63 QT
29.104 -1.521 29.104 -0.255 QT
cp
f
GR
GS
[0.75 0 0 0.75 320.86361 49.11029] CT
N
36.773 5.12 M
36.773 4.386 L
37.492 4.386 37.953 4.268 QT
38.414 4.151 38.414 3.714 QT
38.414 -2.021 L
38.414 -2.583 38.242 -2.833 QT
38.07 -3.083 37.758 -3.138 QT
37.445 -3.193 36.773 -3.193 QT
36.773 -3.927 L
39.82 -4.161 L
39.82 -2.114 L
40.242 -3.005 41.07 -3.583 QT
41.898 -4.161 42.867 -4.161 QT
44.32 -4.161 45.054 -3.466 QT
45.789 -2.771 45.789 -1.333 QT
45.789 3.714 L
45.789 4.151 46.25 4.268 QT
46.711 4.386 47.429 4.386 QT
47.429 5.12 L
42.617 5.12 L
42.617 4.386 L
43.336 4.386 43.797 4.268 QT
44.258 4.151 44.258 3.714 QT
44.258 -1.271 L
44.258 -2.286 43.961 -2.95 QT
43.664 -3.614 42.742 -3.614 QT
41.523 -3.614 40.734 -2.638 QT
39.945 -1.661 39.945 -0.427 QT
39.945 3.714 L
39.945 4.151 40.414 4.268 QT
40.883 4.386 41.586 4.386 QT
41.586 5.12 L
36.773 5.12 L
cp
f
GR
GS
[0.75 0 0 0.75 320.86361 49.11029] CT
N
49.548 2.604 M
49.548 -3.193 L
47.814 -3.193 L
47.814 -3.739 L
49.189 -3.739 49.829 -5.021 QT
50.47 -6.302 50.47 -7.802 QT
51.079 -7.802 L
51.079 -3.927 L
54.048 -3.927 L
54.048 -3.193 L
51.079 -3.193 L
51.079 2.557 L
51.079 3.432 51.368 4.089 QT
51.657 4.745 52.423 4.745 QT
53.142 4.745 53.462 4.05 QT
53.782 3.354 53.782 2.557 QT
53.782 1.323 L
54.376 1.323 L
54.376 2.604 L
54.376 3.261 54.134 3.901 QT
53.892 4.542 53.423 4.948 QT
52.954 5.354 52.282 5.354 QT
51.017 5.354 50.282 4.604 QT
49.548 3.854 49.548 2.604 QT
cp
f
GR
GS
[0.75 0 0 0.75 320.86361 49.11029] CT
N
64.768 5.12 M
64.768 4.386 L
67.393 4.386 67.393 3.714 QT
67.393 -7.302 L
66.299 -6.786 64.643 -6.786 QT
64.643 -7.521 L
67.221 -7.521 68.534 -8.864 QT
68.831 -8.864 L
68.893 -8.864 68.963 -8.81 QT
69.034 -8.755 69.034 -8.677 QT
69.034 3.714 L
69.034 4.386 71.659 4.386 QT
71.659 5.12 L
64.768 5.12 L
cp
f
GR
GS
[0.75 0 0 0.75 0 0.5] CT
0.2 0.702 0.2 RC
1 LJ
0.667 LW
N
384.985 64.814 M
424.83 64.814 L
S
GR
GS
[0.75 0 0 0.75 320.86361 68.70343] CT
N
/f-597267615{0.672 5.12 M
0.672 4.386 L
2.547 4.386 2.984 3.136 QT
7.391 -9.693 L
7.453 -9.911 7.734 -9.911 QT
8 -9.911 L
8.281 -9.911 8.344 -9.693 QT
12.938 3.714 L
13.141 4.151 13.688 4.268 QT
14.234 4.386 15.047 4.386 QT
15.047 5.12 L
9.203 5.12 L
9.203 4.386 L
10.938 4.386 10.938 3.823 QT
10.938 3.714 L
9.797 0.432 L
4.703 0.432 L
3.766 3.136 L
3.75 3.214 3.75 3.354 QT
3.75 3.886 4.242 4.136 QT
4.734 4.386 5.313 4.386 QT
5.313 5.12 L
0.672 5.12 L
cp
4.953 -0.302 M
9.563 -0.302 L
7.25 -7.005 L
4.953 -0.302 L
cp}def
f-597267615
f
GR
GS
[0.75 0 0 0.75 320.86361 68.70343] CT
N
/f-745240314{16.578 6.761 M
16.578 6.011 17.125 5.456 QT
17.672 4.901 18.422 4.651 QT
18 4.339 17.781 3.854 QT
17.563 3.37 17.563 2.839 QT
17.563 1.854 18.188 1.089 QT
17.219 0.151 17.219 -1.068 QT
17.219 -1.724 17.5 -2.302 QT
17.781 -2.88 18.289 -3.302 QT
18.797 -3.724 19.406 -3.943 QT
20.016 -4.161 20.672 -4.161 QT
21.922 -4.161 22.906 -3.427 QT
23.344 -3.896 23.93 -4.146 QT
24.516 -4.396 25.156 -4.396 QT
25.609 -4.396 25.898 -4.075 QT
26.188 -3.755 26.188 -3.302 QT
26.188 -3.036 25.992 -2.841 QT
25.797 -2.646 25.531 -2.646 QT
25.266 -2.646 25.07 -2.841 QT
24.875 -3.036 24.875 -3.302 QT
24.875 -3.693 25.141 -3.849 QT
24.047 -3.849 23.266 -3.099 QT
23.656 -2.708 23.883 -2.161 QT
24.109 -1.614 24.109 -1.068 QT
24.109 -0.177 23.617 0.534 QT
23.125 1.245 22.32 1.636 QT
21.516 2.026 20.672 2.026 QT
19.516 2.026 18.563 1.401 QT
18.266 1.823 18.266 2.323 QT
18.266 2.886 18.633 3.3 QT
19 3.714 19.547 3.714 QT
21.266 3.714 L
22.516 3.714 23.523 3.94 QT
24.531 4.167 25.211 4.846 QT
25.891 5.526 25.891 6.761 QT
25.891 7.682 25.117 8.292 QT
24.344 8.901 23.258 9.175 QT
22.172 9.448 21.25 9.448 QT
20.313 9.448 19.227 9.175 QT
18.141 8.901 17.359 8.292 QT
16.578 7.682 16.578 6.761 QT
cp
17.766 6.761 M
17.766 7.464 18.336 7.94 QT
18.906 8.417 19.719 8.651 QT
20.531 8.886 21.25 8.886 QT
21.953 8.886 22.766 8.651 QT
23.578 8.417 24.148 7.94 QT
24.719 7.464 24.719 6.761 QT
24.719 5.667 23.711 5.339 QT
22.703 5.011 21.266 5.011 QT
19.547 5.011 L
19.063 5.011 18.656 5.245 QT
18.25 5.479 18.008 5.893 QT
17.766 6.307 17.766 6.761 QT
cp
20.672 1.464 M
22.453 1.464 22.453 -1.068 QT
22.453 -2.177 22.07 -2.888 QT
21.688 -3.599 20.672 -3.599 QT
19.641 -3.599 19.258 -2.888 QT
18.875 -2.177 18.875 -1.068 QT
18.875 -0.38 19.023 0.182 QT
19.172 0.745 19.563 1.104 QT
19.953 1.464 20.672 1.464 QT
cp}def
f-745240314
f
GR
GS
[0.75 0 0 0.75 320.86361 68.70343] CT
N
/f1964844890{31.901 5.354 M
30.62 5.354 29.55 4.682 QT
28.479 4.011 27.862 2.886 QT
27.245 1.761 27.245 0.511 QT
27.245 -0.708 27.807 -1.818 QT
28.37 -2.927 29.37 -3.607 QT
30.37 -4.286 31.604 -4.286 QT
32.557 -4.286 33.276 -3.966 QT
33.995 -3.646 34.456 -3.075 QT
34.917 -2.505 35.151 -1.724 QT
35.385 -0.943 35.385 -0.005 QT
35.385 0.276 35.167 0.276 QT
29.089 0.276 L
29.089 0.495 L
29.089 2.245 29.792 3.495 QT
30.495 4.745 32.089 4.745 QT
32.729 4.745 33.276 4.456 QT
33.823 4.167 34.229 3.651 QT
34.635 3.136 34.776 2.557 QT
34.792 2.479 34.854 2.425 QT
34.917 2.37 34.979 2.37 QT
35.167 2.37 L
35.385 2.37 35.385 2.636 QT
35.089 3.823 34.104 4.589 QT
33.12 5.354 31.901 5.354 QT
cp
29.104 -0.255 M
33.901 -0.255 L
33.901 -1.036 33.675 -1.849 QT
33.448 -2.661 32.94 -3.2 QT
32.432 -3.739 31.604 -3.739 QT
30.417 -3.739 29.76 -2.63 QT
29.104 -1.521 29.104 -0.255 QT
cp}def
f1964844890
f
GR
GS
[0.75 0 0 0.75 320.86361 68.70343] CT
N
/f1881606250{36.773 5.12 M
36.773 4.386 L
37.492 4.386 37.953 4.268 QT
38.414 4.151 38.414 3.714 QT
38.414 -2.021 L
38.414 -2.583 38.242 -2.833 QT
38.07 -3.083 37.758 -3.138 QT
37.445 -3.193 36.773 -3.193 QT
36.773 -3.927 L
39.82 -4.161 L
39.82 -2.114 L
40.242 -3.005 41.07 -3.583 QT
41.898 -4.161 42.867 -4.161 QT
44.32 -4.161 45.054 -3.466 QT
45.789 -2.771 45.789 -1.333 QT
45.789 3.714 L
45.789 4.151 46.25 4.268 QT
46.711 4.386 47.429 4.386 QT
47.429 5.12 L
42.617 5.12 L
42.617 4.386 L
43.336 4.386 43.797 4.268 QT
44.258 4.151 44.258 3.714 QT
44.258 -1.271 L
44.258 -2.286 43.961 -2.95 QT
43.664 -3.614 42.742 -3.614 QT
41.523 -3.614 40.734 -2.638 QT
39.945 -1.661 39.945 -0.427 QT
39.945 3.714 L
39.945 4.151 40.414 4.268 QT
40.883 4.386 41.586 4.386 QT
41.586 5.12 L
36.773 5.12 L
cp}def
f1881606250
f
GR
GS
[0.75 0 0 0.75 320.86361 68.70343] CT
N
/f-1218143468{49.548 2.604 M
49.548 -3.193 L
47.814 -3.193 L
47.814 -3.739 L
49.189 -3.739 49.829 -5.021 QT
50.47 -6.302 50.47 -7.802 QT
51.079 -7.802 L
51.079 -3.927 L
54.048 -3.927 L
54.048 -3.193 L
51.079 -3.193 L
51.079 2.557 L
51.079 3.432 51.368 4.089 QT
51.657 4.745 52.423 4.745 QT
53.142 4.745 53.462 4.05 QT
53.782 3.354 53.782 2.557 QT
53.782 1.323 L
54.376 1.323 L
54.376 2.604 L
54.376 3.261 54.134 3.901 QT
53.892 4.542 53.423 4.948 QT
52.954 5.354 52.282 5.354 QT
51.017 5.354 50.282 4.604 QT
49.548 3.854 49.548 2.604 QT
cp}def
f-1218143468
f
GR
GS
[0.75 0 0 0.75 320.86361 68.70343] CT
N
/f-1429999007{63.862 5.12 M
63.862 4.557 L
63.862 4.511 63.909 4.448 QT
67.159 0.839 L
67.909 0.026 68.37 -0.513 QT
68.831 -1.052 69.276 -1.763 QT
69.721 -2.474 69.987 -3.2 QT
70.252 -3.927 70.252 -4.755 QT
70.252 -5.614 69.932 -6.404 QT
69.612 -7.193 68.979 -7.661 QT
68.346 -8.13 67.456 -8.13 QT
66.549 -8.13 65.823 -7.583 QT
65.096 -7.036 64.799 -6.161 QT
64.877 -6.177 65.018 -6.177 QT
65.487 -6.177 65.823 -5.864 QT
66.159 -5.552 66.159 -5.036 QT
66.159 -4.568 65.823 -4.232 QT
65.487 -3.896 65.018 -3.896 QT
64.534 -3.896 64.198 -4.239 QT
63.862 -4.583 63.862 -5.036 QT
63.862 -5.833 64.159 -6.521 QT
64.456 -7.208 65.018 -7.747 QT
65.581 -8.286 66.276 -8.575 QT
66.971 -8.864 67.768 -8.864 QT
68.971 -8.864 70.002 -8.357 QT
71.034 -7.849 71.643 -6.919 QT
72.252 -5.989 72.252 -4.755 QT
72.252 -3.849 71.854 -3.029 QT
71.456 -2.208 70.831 -1.536 QT
70.206 -0.864 69.229 -0.013 QT
68.252 0.839 67.94 1.136 QT
65.565 3.417 L
67.581 3.417 L
69.065 3.417 70.065 3.393 QT
71.065 3.37 71.127 3.307 QT
71.377 3.042 71.627 1.37 QT
72.252 1.37 L
71.659 5.12 L
63.862 5.12 L
cp}def
f-1429999007
f
GR
GS
[0.75 0 0 0.75 0 0.5] CT
1 LJ
0.667 LW
N
384.985 90.938 M
424.83 90.938 L
S
GR
GS
[0.75 0 0 0.75 320.86361 88.29657] CT
N
f-597267615
f
GR
GS
[0.75 0 0 0.75 320.86361 88.29657] CT
N
f-745240314
f
GR
GS
[0.75 0 0 0.75 320.86361 88.29657] CT
N
f1964844890
f
GR
GS
[0.75 0 0 0.75 320.86361 88.29657] CT
N
f1881606250
f
GR
GS
[0.75 0 0 0.75 320.86361 88.29657] CT
N
f-1218143468
f
GR
GS
[0.75 0 0 0.75 320.86361 88.29657] CT
N
/f300774680{64.815 3.495 M
65.299 4.214 66.135 4.565 QT
66.971 4.917 67.924 4.917 QT
69.143 4.917 69.659 3.878 QT
70.174 2.839 70.174 1.511 QT
70.174 0.917 70.065 0.323 QT
69.956 -0.271 69.698 -0.786 QT
69.44 -1.302 68.995 -1.607 QT
68.549 -1.911 67.909 -1.911 QT
66.502 -1.911 L
66.315 -1.911 66.315 -2.114 QT
66.315 -2.286 L
66.315 -2.458 66.502 -2.458 QT
67.659 -2.552 L
68.409 -2.552 68.893 -3.107 QT
69.377 -3.661 69.604 -4.45 QT
69.831 -5.239 69.831 -5.958 QT
69.831 -6.974 69.362 -7.614 QT
68.893 -8.255 67.924 -8.255 QT
67.127 -8.255 66.393 -7.958 QT
65.659 -7.661 65.237 -7.036 QT
65.284 -7.052 65.307 -7.06 QT
65.331 -7.068 65.377 -7.068 QT
65.846 -7.068 66.166 -6.739 QT
66.487 -6.411 66.487 -5.943 QT
66.487 -5.489 66.166 -5.161 QT
65.846 -4.833 65.377 -4.833 QT
64.924 -4.833 64.596 -5.161 QT
64.268 -5.489 64.268 -5.943 QT
64.268 -6.849 64.807 -7.513 QT
65.346 -8.177 66.206 -8.521 QT
67.065 -8.864 67.924 -8.864 QT
68.565 -8.864 69.268 -8.677 QT
69.971 -8.489 70.549 -8.138 QT
71.127 -7.786 71.487 -7.232 QT
71.846 -6.677 71.846 -5.958 QT
71.846 -5.083 71.456 -4.333 QT
71.065 -3.583 70.377 -3.044 QT
69.69 -2.505 68.862 -2.239 QT
69.784 -2.052 70.604 -1.544 QT
71.424 -1.036 71.916 -0.232 QT
72.409 0.573 72.409 1.495 QT
72.409 2.651 71.776 3.589 QT
71.143 4.526 70.104 5.057 QT
69.065 5.589 67.924 5.589 QT
66.94 5.589 65.948 5.214 QT
64.956 4.839 64.323 4.089 QT
63.69 3.339 63.69 2.292 QT
63.69 1.761 64.041 1.417 QT
64.393 1.073 64.924 1.073 QT
65.252 1.073 65.534 1.229 QT
65.815 1.386 65.979 1.675 QT
66.143 1.964 66.143 2.292 QT
66.143 2.807 65.784 3.151 QT
65.424 3.495 64.924 3.495 QT
64.815 3.495 L
cp}def
f300774680
f
GR
GS
[0.75 0 0 0.75 0 0.5] CT
0 0 1 RC
1 LJ
0.667 LW
N
384.985 117.062 M
424.83 117.062 L
S
GR
GS
[0.75 0 0 0.75 320.86361 107.88971] CT
N
f-597267615
f
GR
GS
[0.75 0 0 0.75 320.86361 107.88971] CT
N
f-745240314
f
GR
GS
[0.75 0 0 0.75 320.86361 107.88971] CT
N
f1964844890
f
GR
GS
[0.75 0 0 0.75 320.86361 107.88971] CT
N
f1881606250
f
GR
GS
[0.75 0 0 0.75 320.86361 107.88971] CT
N
f-1218143468
f
GR
GS
[0.75 0 0 0.75 320.86361 107.88971] CT
N
/f-1674298674{63.393 1.651 M
63.393 0.917 L
69.893 -8.771 L
69.956 -8.864 70.112 -8.864 QT
70.409 -8.864 L
70.643 -8.864 70.643 -8.63 QT
70.643 0.917 L
72.706 0.917 L
72.706 1.651 L
70.643 1.651 L
70.643 3.714 L
70.643 4.151 71.26 4.268 QT
71.877 4.386 72.69 4.386 QT
72.69 5.12 L
66.909 5.12 L
66.909 4.386 L
67.721 4.386 68.331 4.268 QT
68.94 4.151 68.94 3.714 QT
68.94 1.651 L
63.393 1.651 L
cp
64.096 0.917 M
69.065 0.917 L
69.065 -6.521 L
64.096 0.917 L
cp}def
f-1674298674
f
GR
GS
[0.75 0 0 0.75 0 0.5] CT
0.6 0.2 0.2 RC
1 LJ
0.667 LW
N
384.985 143.186 M
424.83 143.186 L
S
GR
GS
[0.75 0 0 0.75 0 0.5] CT
0.149 GC
10.0 ML
0.667 LW
N
381 158 M
381 50 L
505 50 L
505 158 L
cp
S
GR
%%Trailer
%%Pages: 1
%%EOF
