-18.09017,1
-17.44498,2
-17.44498,3
-17.44498,4
-17.44498,5
-17.44498,6
-17.44498,7
-17.44498,8
-17.44498,9
-17.44498,10
-17.44498,11
-17.44498,12
-17.44498,13
-17.44498,14
-17.44498,15
-17.44498,16
-17.44498,17
-17.44498,18
-17.44498,19
-17.44498,20
-17.44498,21
-17.44498,22
-17.44498,23
-17.38248,24
-17.28873,25
-17.28873,26
-17.28873,27
-16.50706,28
-16.18090,29
-16.01279,30
-16.01279,31
-15.92541,32
-15.92541,33
-15.92541,34
-15.55062,35
-15.42188,36
-14.36256,37
-13.87748,38
-13.87748,39
-13.87748,40
-13.87748,41
-13.87748,42
-13.87748,43
-13.87748,44
-13.87748,45
-13.87748,46
-13.87748,47
-13.37798,48
-13.24387,49
-13.24387,50
-13.24387,51
-13.24387,52
-13.24387,53
-13.24387,54
-13.24387,55
-12.74032,56
-12.65587,57
-12.32019,58
-12.21011,59
-12.21011,60
-12.21011,61
-12.19903,62
-11.89943,63
-11.61903,64
-11.37875,65
-11.21926,66
-11.09685,67
-11.07343,68
-10.99577,69
-10.99577,70
-10.98987,71
-10.90149,72
-10.70683,74
-10.60255,75
-10.60255,76
-10.60255,77
-10.60255,79
-10.60255,80
-10.56781,82
-10.15224,83
-10.15224,85
-10.12937,87
-10.12850,88
-10.11245,91
-10.10082,93
-10.09514,96
-10.05319,97
-10.03397,99
-10.01311,101
-9.98019,103
-9.86178,105
-9.82764,107
-9.81512,110
-9.80660,112
-9.74659,114
-9.71096,117
-9.71096,119
-9.62154,122
-9.53021,124
-9.47862,128
-9.44272,131
-9.39237,135
-9.34454,138
-9.31565,141
-9.07815,144
-9.00880,146
-9.00880,149
-8.88453,151
-8.81899,154
-8.75925,157
-8.71656,159
-8.69511,164
-8.63999,168
-8.59966,171
-8.51896,174
-8.44642,177
-8.39264,180
-8.31318,182
-8.28899,185
-8.26281,188
-8.21917,190
-8.16526,193
-8.14086,195
-8.11028,198
-8.04601,202
-7.98142,205
-7.92255,207
-7.87082,210
-7.84417,212
-7.83236,215
-7.81885,217
-7.79393,220
-7.74429,222
-7.70466,225
-7.69046,227
-7.63735,230
-7.61584,232
-7.60312,253
-7.60312,254
-7.60312,255
-7.60312,256
-7.60312,257
-7.60312,258
-7.60312,259
-7.60312,260
-7.60312,261
-7.60312,262
-7.60312,263
-7.60312,264
-7.60312,265
-7.60312,266
-7.60312,267
-7.60312,268
-7.60312,269
-7.60312,270
-7.60312,271
-7.60312,272
-7.60312,273
-7.60312,274
-7.60312,275
-7.60312,276
-7.60312,277
-7.60312,278
-7.60312,279
-7.60312,280
-7.60312,281
-7.60312,282
-7.60312,283
-7.60312,284
-7.60312,285
-7.60312,286
-7.60312,287
-7.60312,288
-7.60312,289
-7.60312,290
-7.60312,291
-7.60312,293
-7.60312,294
-7.60312,295
-7.60312,297
-7.60312,298
-7.60312,299
