%!PS-Adobe-3.0 EPSF-3.0
%%Creator: (MATLAB, The Mathworks, Inc. Version 9.12.0.2529717 \(R2022a\) Update 8. Operating System: Linux)
%%Title: plots/Example7a_rz.eps
%%CreationDate: 2024-07-04T10:29:37
%%Pages: (atend)
%%BoundingBox:    12     3   383   311
%%LanguageLevel: 3
%%EndComments
%%BeginProlog
%%BeginResource: procset (Apache XML Graphics Std ProcSet) 1.2 0
%%Version: 1.2 0
%%Copyright: (Copyright 2001-2003,2010 The Apache Software Foundation. License terms: http://www.apache.org/licenses/LICENSE-2.0)
/bd{bind def}bind def
/ld{load def}bd
/GR/grestore ld
/GS/gsave ld
/RM/rmoveto ld
/C/curveto ld
/t/show ld
/L/lineto ld
/ML/setmiterlimit ld
/CT/concat ld
/f/fill ld
/N/newpath ld
/S/stroke ld
/CC/setcmykcolor ld
/A/ashow ld
/cp/closepath ld
/RC/setrgbcolor ld
/LJ/setlinejoin ld
/GC/setgray ld
/LW/setlinewidth ld
/M/moveto ld
/re {4 2 roll M
1 index 0 rlineto
0 exch rlineto
neg 0 rlineto
cp } bd
/_ctm matrix def
/_tm matrix def
/BT { _ctm currentmatrix pop matrix _tm copy pop 0 0 moveto } bd
/ET { _ctm setmatrix } bd
/iTm { _ctm setmatrix _tm concat } bd
/Tm { _tm astore pop iTm 0 0 moveto } bd
/ux 0.0 def
/uy 0.0 def
/F {
  /Tp exch def
  /Tf exch def
  Tf findfont Tp scalefont setfont
  /cf Tf def  /cs Tp def
} bd
/ULS {currentpoint /uy exch def /ux exch def} bd
/ULE {
  /Tcx currentpoint pop def
  gsave
  newpath
  cf findfont cs scalefont dup
  /FontMatrix get 0 get /Ts exch def /FontInfo get dup
  /UnderlinePosition get Ts mul /To exch def
  /UnderlineThickness get Ts mul /Tt exch def
  ux uy To add moveto  Tcx uy To add lineto
  Tt setlinewidth stroke
  grestore
} bd
/OLE {
  /Tcx currentpoint pop def
  gsave
  newpath
  cf findfont cs scalefont dup
  /FontMatrix get 0 get /Ts exch def /FontInfo get dup
  /UnderlinePosition get Ts mul /To exch def
  /UnderlineThickness get Ts mul /Tt exch def
  ux uy To add cs add moveto Tcx uy To add cs add lineto
  Tt setlinewidth stroke
  grestore
} bd
/SOE {
  /Tcx currentpoint pop def
  gsave
  newpath
  cf findfont cs scalefont dup
  /FontMatrix get 0 get /Ts exch def /FontInfo get dup
  /UnderlinePosition get Ts mul /To exch def
  /UnderlineThickness get Ts mul /Tt exch def
  ux uy To add cs 10 mul 26 idiv add moveto Tcx uy To add cs 10 mul 26 idiv add lineto
  Tt setlinewidth stroke
  grestore
} bd
/QT {
/Y22 exch store
/X22 exch store
/Y21 exch store
/X21 exch store
currentpoint
/Y21 load 2 mul add 3 div exch
/X21 load 2 mul add 3 div exch
/X21 load 2 mul /X22 load add 3 div
/Y21 load 2 mul /Y22 load add 3 div
/X22 load /Y22 load curveto
} bd
/SSPD {
dup length /d exch dict def
{
/v exch def
/k exch def
currentpagedevice k known {
/cpdv currentpagedevice k get def
v cpdv ne {
/upd false def
/nullv v type /nulltype eq def
/nullcpdv cpdv type /nulltype eq def
nullv nullcpdv or
{
/upd true def
} {
/sametype v type cpdv type eq def
sametype {
v type /arraytype eq {
/vlen v length def
/cpdvlen cpdv length def
vlen cpdvlen eq {
0 1 vlen 1 sub {
/i exch def
/obj v i get def
/cpdobj cpdv i get def
obj cpdobj ne {
/upd true def
exit
} if
} for
} {
/upd true def
} ifelse
} {
v type /dicttype eq {
v {
/dv exch def
/dk exch def
/cpddv cpdv dk get def
dv cpddv ne {
/upd true def
exit
} if
} forall
} {
/upd true def
} ifelse
} ifelse
} if
} ifelse
upd true eq {
d k v put
} if
} if
} if
} forall
d length 0 gt {
d setpagedevice
} if
} bd
/RE { % /NewFontName [NewEncodingArray] /FontName RE -
  findfont dup length dict begin
  {
    1 index /FID ne
    {def} {pop pop} ifelse
  } forall
  /Encoding exch def
  /FontName 1 index def
  currentdict definefont pop
  end
} bind def
%%EndResource
%%BeginResource: procset (Apache XML Graphics EPS ProcSet) 1.0 0
%%Version: 1.0 0
%%Copyright: (Copyright 2002-2003 The Apache Software Foundation. License terms: http://www.apache.org/licenses/LICENSE-2.0)
/BeginEPSF { %def
/b4_Inc_state save def         % Save state for cleanup
/dict_count countdictstack def % Count objects on dict stack
/op_count count 1 sub def      % Count objects on operand stack
userdict begin                 % Push userdict on dict stack
/showpage { } def              % Redefine showpage, { } = null proc
0 setgray 0 setlinecap         % Prepare graphics state
1 setlinewidth 0 setlinejoin
10 setmiterlimit [ ] 0 setdash newpath
/languagelevel where           % If level not equal to 1 then
{pop languagelevel             % set strokeadjust and
1 ne                           % overprint to their defaults.
{false setstrokeadjust false setoverprint
} if
} if
} bd
/EndEPSF { %def
count op_count sub {pop} repeat            % Clean up stacks
countdictstack dict_count sub {end} repeat
b4_Inc_state restore
} bd
%%EndResource
%FOPBeginFontDict
%%IncludeResource: font Courier-Oblique
%%IncludeResource: font Courier-BoldOblique
%%IncludeResource: font Courier-Bold
%%IncludeResource: font ZapfDingbats
%%IncludeResource: font Symbol
%%IncludeResource: font Helvetica
%%IncludeResource: font Helvetica-Oblique
%%IncludeResource: font Helvetica-Bold
%%IncludeResource: font Helvetica-BoldOblique
%%IncludeResource: font Times-Roman
%%IncludeResource: font Times-Italic
%%IncludeResource: font Times-Bold
%%IncludeResource: font Times-BoldItalic
%%IncludeResource: font Courier
%FOPEndFontDict
%%BeginResource: encoding WinAnsiEncoding
/WinAnsiEncoding [
/.notdef /.notdef /.notdef /.notdef /.notdef
/.notdef /.notdef /.notdef /.notdef /.notdef
/.notdef /.notdef /.notdef /.notdef /.notdef
/.notdef /.notdef /.notdef /.notdef /.notdef
/.notdef /.notdef /.notdef /.notdef /.notdef
/.notdef /.notdef /.notdef /.notdef /.notdef
/.notdef /.notdef /space /exclam /quotedbl
/numbersign /dollar /percent /ampersand /quotesingle
/parenleft /parenright /asterisk /plus /comma
/hyphen /period /slash /zero /one
/two /three /four /five /six
/seven /eight /nine /colon /semicolon
/less /equal /greater /question /at
/A /B /C /D /E
/F /G /H /I /J
/K /L /M /N /O
/P /Q /R /S /T
/U /V /W /X /Y
/Z /bracketleft /backslash /bracketright /asciicircum
/underscore /quoteleft /a /b /c
/d /e /f /g /h
/i /j /k /l /m
/n /o /p /q /r
/s /t /u /v /w
/x /y /z /braceleft /bar
/braceright /asciitilde /bullet /Euro /bullet
/quotesinglbase /florin /quotedblbase /ellipsis /dagger
/daggerdbl /circumflex /perthousand /Scaron /guilsinglleft
/OE /bullet /Zcaron /bullet /bullet
/quoteleft /quoteright /quotedblleft /quotedblright /bullet
/endash /emdash /asciitilde /trademark /scaron
/guilsinglright /oe /bullet /zcaron /Ydieresis
/space /exclamdown /cent /sterling /currency
/yen /brokenbar /section /dieresis /copyright
/ordfeminine /guillemotleft /logicalnot /sfthyphen /registered
/macron /degree /plusminus /twosuperior /threesuperior
/acute /mu /paragraph /middot /cedilla
/onesuperior /ordmasculine /guillemotright /onequarter /onehalf
/threequarters /questiondown /Agrave /Aacute /Acircumflex
/Atilde /Adieresis /Aring /AE /Ccedilla
/Egrave /Eacute /Ecircumflex /Edieresis /Igrave
/Iacute /Icircumflex /Idieresis /Eth /Ntilde
/Ograve /Oacute /Ocircumflex /Otilde /Odieresis
/multiply /Oslash /Ugrave /Uacute /Ucircumflex
/Udieresis /Yacute /Thorn /germandbls /agrave
/aacute /acircumflex /atilde /adieresis /aring
/ae /ccedilla /egrave /eacute /ecircumflex
/edieresis /igrave /iacute /icircumflex /idieresis
/eth /ntilde /ograve /oacute /ocircumflex
/otilde /odieresis /divide /oslash /ugrave
/uacute /ucircumflex /udieresis /yacute /thorn
/ydieresis
] def
%%EndResource
%FOPBeginFontReencode
/Courier-Oblique findfont
dup length dict begin
  {1 index /FID ne {def} {pop pop} ifelse} forall
  /Encoding WinAnsiEncoding def
  currentdict
end
/Courier-Oblique exch definefont pop
/Courier-BoldOblique findfont
dup length dict begin
  {1 index /FID ne {def} {pop pop} ifelse} forall
  /Encoding WinAnsiEncoding def
  currentdict
end
/Courier-BoldOblique exch definefont pop
/Courier-Bold findfont
dup length dict begin
  {1 index /FID ne {def} {pop pop} ifelse} forall
  /Encoding WinAnsiEncoding def
  currentdict
end
/Courier-Bold exch definefont pop
/Helvetica findfont
dup length dict begin
  {1 index /FID ne {def} {pop pop} ifelse} forall
  /Encoding WinAnsiEncoding def
  currentdict
end
/Helvetica exch definefont pop
/Helvetica-Oblique findfont
dup length dict begin
  {1 index /FID ne {def} {pop pop} ifelse} forall
  /Encoding WinAnsiEncoding def
  currentdict
end
/Helvetica-Oblique exch definefont pop
/Helvetica-Bold findfont
dup length dict begin
  {1 index /FID ne {def} {pop pop} ifelse} forall
  /Encoding WinAnsiEncoding def
  currentdict
end
/Helvetica-Bold exch definefont pop
/Helvetica-BoldOblique findfont
dup length dict begin
  {1 index /FID ne {def} {pop pop} ifelse} forall
  /Encoding WinAnsiEncoding def
  currentdict
end
/Helvetica-BoldOblique exch definefont pop
/Times-Roman findfont
dup length dict begin
  {1 index /FID ne {def} {pop pop} ifelse} forall
  /Encoding WinAnsiEncoding def
  currentdict
end
/Times-Roman exch definefont pop
/Times-Italic findfont
dup length dict begin
  {1 index /FID ne {def} {pop pop} ifelse} forall
  /Encoding WinAnsiEncoding def
  currentdict
end
/Times-Italic exch definefont pop
/Times-Bold findfont
dup length dict begin
  {1 index /FID ne {def} {pop pop} ifelse} forall
  /Encoding WinAnsiEncoding def
  currentdict
end
/Times-Bold exch definefont pop
/Times-BoldItalic findfont
dup length dict begin
  {1 index /FID ne {def} {pop pop} ifelse} forall
  /Encoding WinAnsiEncoding def
  currentdict
end
/Times-BoldItalic exch definefont pop
/Courier findfont
dup length dict begin
  {1 index /FID ne {def} {pop pop} ifelse} forall
  /Encoding WinAnsiEncoding def
  currentdict
end
/Courier exch definefont pop
%FOPEndFontReencode
%%EndProlog
%%Page: 1 1
%%PageBoundingBox: 0 0 420 315
%%BeginPageSetup
N
   12     3 M
  395     3 L
  395   314 L
   12   314 L
cp
clip
[1 0 0 -1 0 315] CT
%%EndPageSetup
GS
[0.75 0 0 0.75 0 0] CT
1 GC
N
0 0 560 420 re
f
GR
GS
[0.75 0 0 0.75 0 0] CT
1 GC
N
0 0 560 420 re
f
GR
GS
[0.75 0 0 0.75 0 0] CT
1 GC
N
73 359 M
507 359 L
507 39 L
73 39 L
cp
f
GR
GS
[0.75 0 0 0.75 0 0] CT
0.873 GC
1 LJ
0.667 LW
N
73 359 M
73 39 L
S
GR
GS
[0.75 0 0 0.75 0 0] CT
0.873 GC
1 LJ
0.667 LW
N
112.455 359 M
112.455 39 L
S
GR
GS
[0.75 0 0 0.75 0 0] CT
0.873 GC
1 LJ
0.667 LW
N
151.909 359 M
151.909 39 L
S
GR
GS
[0.75 0 0 0.75 0 0] CT
0.873 GC
1 LJ
0.667 LW
N
191.364 359 M
191.364 39 L
S
GR
GS
[0.75 0 0 0.75 0 0] CT
0.873 GC
1 LJ
0.667 LW
N
230.818 359 M
230.818 39 L
S
GR
GS
[0.75 0 0 0.75 0 0] CT
0.873 GC
1 LJ
0.667 LW
N
270.273 359 M
270.273 39 L
S
GR
GS
[0.75 0 0 0.75 0 0] CT
0.873 GC
1 LJ
0.667 LW
N
309.727 359 M
309.727 39 L
S
GR
GS
[0.75 0 0 0.75 0 0] CT
0.873 GC
1 LJ
0.667 LW
N
349.182 359 M
349.182 39 L
S
GR
GS
[0.75 0 0 0.75 0 0] CT
0.873 GC
1 LJ
0.667 LW
N
388.636 359 M
388.636 39 L
S
GR
GS
[0.75 0 0 0.75 0 0] CT
0.873 GC
1 LJ
0.667 LW
N
428.091 359 M
428.091 39 L
S
GR
GS
[0.75 0 0 0.75 0 0] CT
0.873 GC
1 LJ
0.667 LW
N
467.545 359 M
467.545 39 L
S
GR
GS
[0.75 0 0 0.75 0 0] CT
0.873 GC
1 LJ
0.667 LW
N
507 359 M
507 39 L
S
GR
GS
[0.75 0 0 0.75 0 0] CT
0.873 GC
1 LJ
0.667 LW
N
507 359 M
73 359 L
S
GR
GS
[0.75 0 0 0.75 0 0] CT
0.873 GC
1 LJ
0.667 LW
N
507 305.667 M
73 305.667 L
S
GR
GS
[0.75 0 0 0.75 0 0] CT
0.873 GC
1 LJ
0.667 LW
N
507 252.333 M
73 252.333 L
S
GR
GS
[0.75 0 0 0.75 0 0] CT
0.873 GC
1 LJ
0.667 LW
N
507 199 M
73 199 L
S
GR
GS
[0.75 0 0 0.75 0 0] CT
0.873 GC
1 LJ
0.667 LW
N
507 145.667 M
73 145.667 L
S
GR
GS
[0.75 0 0 0.75 0 0] CT
0.873 GC
1 LJ
0.667 LW
N
507 92.333 M
73 92.333 L
S
GR
GS
[0.75 0 0 0.75 0 0] CT
0.873 GC
1 LJ
0.667 LW
N
507 39 M
73 39 L
S
GR
GS
[0.75 0 0 0.75 0 0] CT
0.149 GC
2 setlinecap
1 LJ
0.667 LW
N
73 359 M
507 359 L
S
GR
GS
[0.75 0 0 0.75 0 0] CT
0.149 GC
2 setlinecap
1 LJ
0.667 LW
N
73 359 M
73 354.66 L
S
GR
GS
[0.75 0 0 0.75 0 0] CT
0.149 GC
2 setlinecap
1 LJ
0.667 LW
N
112.455 359 M
112.455 354.66 L
S
GR
GS
[0.75 0 0 0.75 0 0] CT
0.149 GC
2 setlinecap
1 LJ
0.667 LW
N
151.909 359 M
151.909 354.66 L
S
GR
GS
[0.75 0 0 0.75 0 0] CT
0.149 GC
2 setlinecap
1 LJ
0.667 LW
N
191.364 359 M
191.364 354.66 L
S
GR
GS
[0.75 0 0 0.75 0 0] CT
0.149 GC
2 setlinecap
1 LJ
0.667 LW
N
230.818 359 M
230.818 354.66 L
S
GR
GS
[0.75 0 0 0.75 0 0] CT
0.149 GC
2 setlinecap
1 LJ
0.667 LW
N
270.273 359 M
270.273 354.66 L
S
GR
GS
[0.75 0 0 0.75 0 0] CT
0.149 GC
2 setlinecap
1 LJ
0.667 LW
N
309.727 359 M
309.727 354.66 L
S
GR
GS
[0.75 0 0 0.75 0 0] CT
0.149 GC
2 setlinecap
1 LJ
0.667 LW
N
349.182 359 M
349.182 354.66 L
S
GR
GS
[0.75 0 0 0.75 0 0] CT
0.149 GC
2 setlinecap
1 LJ
0.667 LW
N
388.636 359 M
388.636 354.66 L
S
GR
GS
[0.75 0 0 0.75 0 0] CT
0.149 GC
2 setlinecap
1 LJ
0.667 LW
N
428.091 359 M
428.091 354.66 L
S
GR
GS
[0.75 0 0 0.75 0 0] CT
0.149 GC
2 setlinecap
1 LJ
0.667 LW
N
467.545 359 M
467.545 354.66 L
S
GR
GS
[0.75 0 0 0.75 0 0] CT
0.149 GC
2 setlinecap
1 LJ
0.667 LW
N
507 359 M
507 354.66 L
S
GR
GS
[0.75 0 0 0.75 54.75 273.25001] CT
0.149 GC
/Helvetica 13.333 F
GS
[1 0 0 1 0 0] CT
-4 15 moveto 
1 -1 scale
(0) t 
GR
GR
GS
[0.75 0 0 0.75 84.34091 273.25001] CT
0.149 GC
/Helvetica 13.333 F
GS
[1 0 0 1 0 0] CT
-4 15 moveto 
1 -1 scale
(1) t 
GR
GR
GS
[0.75 0 0 0.75 113.93182 273.25001] CT
0.149 GC
/Helvetica 13.333 F
GS
[1 0 0 1 0 0] CT
-4 15 moveto 
1 -1 scale
(2) t 
GR
GR
GS
[0.75 0 0 0.75 143.52272 273.25001] CT
0.149 GC
/Helvetica 13.333 F
GS
[1 0 0 1 0 0] CT
-4 15 moveto 
1 -1 scale
(3) t 
GR
GR
GS
[0.75 0 0 0.75 173.11363 273.25001] CT
0.149 GC
/Helvetica 13.333 F
GS
[1 0 0 1 0 0] CT
-4 15 moveto 
1 -1 scale
(4) t 
GR
GR
GS
[0.75 0 0 0.75 202.70455 273.25001] CT
0.149 GC
/Helvetica 13.333 F
GS
[1 0 0 1 0 0] CT
-4 15 moveto 
1 -1 scale
(5) t 
GR
GR
GS
[0.75 0 0 0.75 232.29545 273.25001] CT
0.149 GC
/Helvetica 13.333 F
GS
[1 0 0 1 0 0] CT
-4 15 moveto 
1 -1 scale
(6) t 
GR
GR
GS
[0.75 0 0 0.75 261.88637 273.25001] CT
0.149 GC
/Helvetica 13.333 F
GS
[1 0 0 1 0 0] CT
-4 15 moveto 
1 -1 scale
(7) t 
GR
GR
GS
[0.75 0 0 0.75 291.47726 273.25001] CT
0.149 GC
/Helvetica 13.333 F
GS
[1 0 0 1 0 0] CT
-4 15 moveto 
1 -1 scale
(8) t 
GR
GR
GS
[0.75 0 0 0.75 321.06818 273.25001] CT
0.149 GC
/Helvetica 13.333 F
GS
[1 0 0 1 0 0] CT
-4 15 moveto 
1 -1 scale
(9) t 
GR
GR
GS
[0.75 0 0 0.75 350.65908 273.25001] CT
0.149 GC
/Helvetica 13.333 F
GS
[1 0 0 1 0 0] CT
-8 15 moveto 
1 -1 scale
(10) t 
GR
GR
GS
[0.75 0 0 0.75 380.25 273.25001] CT
0.149 GC
/Helvetica 13.333 F
GS
[1 0 0 1 0 0] CT
-8 15 moveto 
1 -1 scale
(11) t 
GR
GR
GS
[0.75 0 0 0.75 217.50016 288.49999] CT
0.149 GC
N
-74.637 22.296 M
-74.637 21.859 -74.544 21.484 QT
-72.45 13.156 L
-75.497 13.156 L
-75.794 13.156 -75.794 12.781 QT
-75.684 12.14 -75.419 12.14 QT
-72.2 12.14 L
-71.044 7.406 L
-70.919 7.031 -70.583 6.757 QT
-70.247 6.484 -69.825 6.484 QT
-69.45 6.484 -69.2 6.702 QT
-68.95 6.921 -68.95 7.296 QT
-68.95 7.374 -68.958 7.429 QT
-68.965 7.484 -68.981 7.531 QT
-70.153 12.14 L
-67.153 12.14 L
-66.856 12.14 -66.856 12.515 QT
-66.872 12.593 -66.919 12.765 QT
-66.965 12.937 -67.036 13.046 QT
-67.106 13.156 -67.247 13.156 QT
-70.403 13.156 L
-72.481 21.546 L
-72.7 22.359 -72.7 22.952 QT
-72.7 24.202 -71.84 24.202 QT
-70.575 24.202 -69.59 23.007 QT
-68.606 21.812 -68.075 20.374 QT
-67.965 20.202 -67.856 20.202 QT
-67.497 20.202 L
-67.387 20.202 -67.317 20.281 QT
-67.247 20.359 -67.247 20.468 QT
-67.247 20.515 -67.278 20.546 QT
-67.903 22.296 -69.122 23.632 QT
-70.34 24.968 -71.919 24.968 QT
-73.059 24.968 -73.848 24.218 QT
-74.637 23.468 -74.637 22.296 QT
cp
f
GR
GS
[0.75 0 0 0.75 217.50016 288.49999] CT
0.149 GC
N
-63.576 22.562 M
-63.576 22.015 -63.342 21.421 QT
-60.998 15.187 L
-60.623 14.124 -60.623 13.437 QT
-60.623 12.577 -61.248 12.577 QT
-62.404 12.577 -63.146 13.757 QT
-63.889 14.937 -64.248 16.406 QT
-64.295 16.577 -64.482 16.577 QT
-64.826 16.577 L
-65.06 16.577 -65.06 16.312 QT
-65.06 16.234 L
-64.592 14.499 -63.631 13.163 QT
-62.67 11.827 -61.201 11.827 QT
-60.17 11.827 -59.451 12.507 QT
-58.732 13.187 -58.732 14.234 QT
-58.732 14.765 -58.967 15.359 QT
-61.326 21.593 L
-61.717 22.562 -61.717 23.343 QT
-61.717 24.202 -61.06 24.202 QT
-59.92 24.202 -59.162 22.991 QT
-58.404 21.781 -58.092 20.374 QT
-58.045 20.202 -57.873 20.202 QT
-57.514 20.202 L
-57.404 20.202 -57.334 20.281 QT
-57.264 20.359 -57.264 20.468 QT
-57.264 20.484 -57.295 20.546 QT
-57.685 22.187 -58.67 23.577 QT
-59.654 24.968 -61.107 24.968 QT
-62.139 24.968 -62.857 24.265 QT
-63.576 23.562 -63.576 22.562 QT
cp
-60.31 7.062 M
-60.31 6.452 -59.795 5.96 QT
-59.279 5.468 -58.67 5.468 QT
-58.185 5.468 -57.865 5.773 QT
-57.545 6.077 -57.545 6.546 QT
-57.545 7.187 -58.06 7.679 QT
-58.576 8.171 -59.201 8.171 QT
-59.67 8.171 -59.99 7.851 QT
-60.31 7.531 -60.31 7.062 QT
cp
f
GR
GS
[0.75 0 0 0.75 217.50016 288.49999] CT
0.149 GC
N
-53.502 24.14 M
-53.502 23.968 -53.47 23.89 QT
-51.298 15.234 L
-51.095 14.437 -51.095 13.827 QT
-51.095 12.577 -51.939 12.577 QT
-52.845 12.577 -53.283 13.663 QT
-53.72 14.749 -54.142 16.406 QT
-54.142 16.484 -54.22 16.531 QT
-54.298 16.577 -54.377 16.577 QT
-54.72 16.577 L
-54.814 16.577 -54.884 16.476 QT
-54.955 16.374 -54.955 16.281 QT
-54.642 15.031 -54.353 14.148 QT
-54.064 13.265 -53.447 12.546 QT
-52.83 11.827 -51.908 11.827 QT
-50.83 11.827 -49.994 12.515 QT
-49.158 13.202 -49.158 14.265 QT
-48.283 13.124 -47.127 12.476 QT
-45.97 11.827 -44.658 11.827 QT
-43.283 11.827 -42.291 12.531 QT
-41.298 13.234 -41.298 14.515 QT
-40.408 13.249 -39.205 12.538 QT
-38.002 11.827 -36.595 11.827 QT
-35.095 11.827 -34.181 12.64 QT
-33.267 13.452 -33.267 14.952 QT
-33.267 16.14 -33.798 17.827 QT
-34.33 19.515 -35.111 21.593 QT
-35.533 22.593 -35.533 23.343 QT
-35.533 24.202 -34.845 24.202 QT
-33.72 24.202 -32.97 22.984 QT
-32.22 21.765 -31.908 20.374 QT
-31.814 20.202 -31.658 20.202 QT
-31.33 20.202 L
-31.205 20.202 -31.127 20.281 QT
-31.048 20.359 -31.048 20.468 QT
-31.048 20.484 -31.08 20.546 QT
-31.486 22.187 -32.47 23.577 QT
-33.455 24.968 -34.923 24.968 QT
-35.939 24.968 -36.658 24.265 QT
-37.377 23.562 -37.377 22.562 QT
-37.377 22.046 -37.142 21.421 QT
-36.33 19.249 -35.783 17.531 QT
-35.236 15.812 -35.236 14.515 QT
-35.236 13.702 -35.556 13.14 QT
-35.877 12.577 -36.642 12.577 QT
-38.236 12.577 -39.392 13.546 QT
-40.548 14.515 -41.408 16.109 QT
-41.455 16.406 -41.486 16.562 QT
-43.361 23.999 L
-43.455 24.406 -43.806 24.687 QT
-44.158 24.968 -44.58 24.968 QT
-44.923 24.968 -45.181 24.741 QT
-45.439 24.515 -45.439 24.14 QT
-45.439 23.968 -45.408 23.89 QT
-43.564 16.499 L
-43.267 15.312 -43.267 14.515 QT
-43.267 13.702 -43.595 13.14 QT
-43.923 12.577 -44.72 12.577 QT
-45.783 12.577 -46.673 13.046 QT
-47.564 13.515 -48.228 14.281 QT
-48.892 15.046 -49.455 16.109 QT
-51.423 23.999 L
-51.517 24.406 -51.861 24.687 QT
-52.205 24.968 -52.642 24.968 QT
-52.986 24.968 -53.244 24.741 QT
-53.502 24.515 -53.502 24.14 QT
cp
f
GR
GS
[0.75 0 0 0.75 217.50016 288.49999] CT
0.149 GC
N
-24.153 24.968 M
-25.528 24.968 -26.575 24.241 QT
-27.621 23.515 -28.161 22.296 QT
-28.7 21.077 -28.7 19.718 QT
-28.7 17.64 -27.661 15.82 QT
-26.621 13.999 -24.84 12.913 QT
-23.059 11.827 -21.012 11.827 QT
-19.778 11.827 -18.848 12.468 QT
-17.918 13.109 -17.918 14.312 QT
-17.918 15.984 -19.246 16.796 QT
-20.575 17.609 -22.246 17.804 QT
-23.918 17.999 -25.95 17.999 QT
-26.028 17.999 L
-26.496 19.734 -26.496 20.952 QT
-26.496 22.249 -25.903 23.226 QT
-25.309 24.202 -24.09 24.202 QT
-22.356 24.202 -20.77 23.406 QT
-19.184 22.609 -18.168 21.218 QT
-18.09 21.124 -17.95 21.124 QT
-17.809 21.124 -17.661 21.288 QT
-17.512 21.452 -17.512 21.593 QT
-17.512 21.702 -17.559 21.765 QT
-18.621 23.249 -20.418 24.109 QT
-22.215 24.968 -24.153 24.968 QT
cp
-25.856 17.249 M
-24.168 17.249 -22.739 17.093 QT
-21.309 16.937 -20.153 16.304 QT
-18.996 15.671 -18.996 14.343 QT
-18.996 13.812 -19.293 13.406 QT
-19.59 12.999 -20.067 12.788 QT
-20.543 12.577 -21.043 12.577 QT
-22.278 12.577 -23.262 13.241 QT
-24.246 13.906 -24.887 14.976 QT
-25.528 16.046 -25.856 17.249 QT
cp
f
GR
GS
[0.75 0 0 0.75 217.50016 288.49999] CT
0.149 GC
N
-13.807 22.874 M
-13.026 24.202 -10.666 24.202 QT
-9.651 24.202 -8.729 23.851 QT
-7.807 23.499 -7.205 22.812 QT
-6.604 22.124 -6.604 21.124 QT
-6.604 20.374 -7.143 19.898 QT
-7.682 19.421 -8.463 19.249 QT
-10.041 18.937 L
-11.104 18.671 -11.799 17.929 QT
-12.494 17.187 -12.494 16.14 QT
-12.494 14.859 -11.799 13.866 QT
-11.104 12.874 -9.955 12.351 QT
-8.807 11.827 -7.572 11.827 QT
-6.26 11.827 -5.213 12.452 QT
-4.166 13.077 -4.166 14.312 QT
-4.166 14.984 -4.541 15.491 QT
-4.916 15.999 -5.588 15.999 QT
-5.979 15.999 -6.252 15.749 QT
-6.526 15.499 -6.526 15.124 QT
-6.526 14.781 -6.33 14.46 QT
-6.135 14.14 -5.822 13.952 QT
-5.51 13.765 -5.166 13.765 QT
-5.416 13.14 -6.119 12.859 QT
-6.822 12.577 -7.635 12.577 QT
-8.369 12.577 -9.104 12.874 QT
-9.838 13.171 -10.283 13.741 QT
-10.729 14.312 -10.729 15.093 QT
-10.729 15.624 -10.362 16.015 QT
-9.994 16.406 -9.447 16.577 QT
-7.776 16.921 L
-6.963 17.093 -6.291 17.523 QT
-5.619 17.952 -5.229 18.616 QT
-4.838 19.281 -4.838 20.124 QT
-4.838 21.202 -5.44 22.249 QT
-6.041 23.296 -6.916 23.921 QT
-8.463 24.968 -10.697 24.968 QT
-12.244 24.968 -13.533 24.257 QT
-14.822 23.546 -14.822 22.14 QT
-14.822 21.359 -14.362 20.773 QT
-13.901 20.187 -13.104 20.187 QT
-12.635 20.187 -12.322 20.468 QT
-12.01 20.749 -12.01 21.218 QT
-12.01 21.874 -12.502 22.374 QT
-12.994 22.874 -13.666 22.874 QT
-13.807 22.874 L
cp
f
GR
GS
[0.75 0 0 0.75 217.50016 288.49999] CT
0.149 GC
N
2.474 24.968 M
0.646 24.968 -0.408 23.585 QT
-1.463 22.202 -1.463 20.327 QT
-1.463 18.468 -0.502 16.468 QT
0.459 14.468 2.092 13.148 QT
3.724 11.827 5.615 11.827 QT
6.474 11.827 7.154 12.296 QT
7.834 12.765 8.224 13.562 QT
8.537 12.406 9.49 12.406 QT
9.865 12.406 10.107 12.624 QT
10.349 12.843 10.349 13.218 QT
10.349 13.296 10.349 13.343 QT
10.349 13.39 10.334 13.437 QT
8.303 21.546 L
8.099 22.406 8.099 22.952 QT
8.099 24.202 8.943 24.202 QT
9.849 24.202 10.326 23.046 QT
10.803 21.89 11.115 20.374 QT
11.178 20.202 11.349 20.202 QT
11.709 20.202 L
11.818 20.202 11.888 20.304 QT
11.959 20.406 11.959 20.484 QT
11.443 22.515 10.842 23.741 QT
10.24 24.968 8.881 24.968 QT
7.912 24.968 7.162 24.39 QT
6.412 23.812 6.224 22.874 QT
4.349 24.968 2.474 24.968 QT
cp
2.49 24.202 M
3.553 24.202 4.529 23.413 QT
5.506 22.624 6.224 21.562 QT
6.256 21.546 6.256 21.484 QT
7.803 15.187 L
7.834 15.093 L
7.662 14.062 7.092 13.32 QT
6.521 12.577 5.537 12.577 QT
4.568 12.577 3.724 13.374 QT
2.881 14.171 2.303 15.265 QT
1.74 16.421 1.217 18.452 QT
0.693 20.484 0.693 21.593 QT
0.693 22.593 1.131 23.398 QT
1.568 24.202 2.49 24.202 QT
cp
f
GR
GS
[0.75 0 0 0.75 217.50016 288.49999] CT
0.149 GC
N
15.167 24.14 M
15.167 23.968 15.198 23.89 QT
17.37 15.234 L
17.573 14.437 17.573 13.827 QT
17.573 12.577 16.73 12.577 QT
15.823 12.577 15.386 13.663 QT
14.948 14.749 14.527 16.406 QT
14.527 16.484 14.448 16.531 QT
14.37 16.577 14.292 16.577 QT
13.948 16.577 L
13.855 16.577 13.784 16.476 QT
13.714 16.374 13.714 16.281 QT
14.027 15.031 14.316 14.148 QT
14.605 13.265 15.222 12.546 QT
15.839 11.827 16.761 11.827 QT
17.839 11.827 18.675 12.515 QT
19.511 13.202 19.511 14.265 QT
20.386 13.124 21.542 12.476 QT
22.698 11.827 24.011 11.827 QT
25.386 11.827 26.378 12.531 QT
27.37 13.234 27.37 14.515 QT
28.261 13.249 29.464 12.538 QT
30.667 11.827 32.073 11.827 QT
33.573 11.827 34.487 12.64 QT
35.402 13.452 35.402 14.952 QT
35.402 16.14 34.87 17.827 QT
34.339 19.515 33.558 21.593 QT
33.136 22.593 33.136 23.343 QT
33.136 24.202 33.823 24.202 QT
34.948 24.202 35.698 22.984 QT
36.448 21.765 36.761 20.374 QT
36.855 20.202 37.011 20.202 QT
37.339 20.202 L
37.464 20.202 37.542 20.281 QT
37.62 20.359 37.62 20.468 QT
37.62 20.484 37.589 20.546 QT
37.183 22.187 36.198 23.577 QT
35.214 24.968 33.745 24.968 QT
32.73 24.968 32.011 24.265 QT
31.292 23.562 31.292 22.562 QT
31.292 22.046 31.527 21.421 QT
32.339 19.249 32.886 17.531 QT
33.433 15.812 33.433 14.515 QT
33.433 13.702 33.112 13.14 QT
32.792 12.577 32.027 12.577 QT
30.433 12.577 29.277 13.546 QT
28.12 14.515 27.261 16.109 QT
27.214 16.406 27.183 16.562 QT
25.308 23.999 L
25.214 24.406 24.862 24.687 QT
24.511 24.968 24.089 24.968 QT
23.745 24.968 23.487 24.741 QT
23.23 24.515 23.23 24.14 QT
23.23 23.968 23.261 23.89 QT
25.105 16.499 L
25.402 15.312 25.402 14.515 QT
25.402 13.702 25.073 13.14 QT
24.745 12.577 23.948 12.577 QT
22.886 12.577 21.995 13.046 QT
21.105 13.515 20.441 14.281 QT
19.777 15.046 19.214 16.109 QT
17.245 23.999 L
17.152 24.406 16.808 24.687 QT
16.464 24.968 16.027 24.968 QT
15.683 24.968 15.425 24.741 QT
15.167 24.515 15.167 24.14 QT
cp
f
GR
GS
[0.75 0 0 0.75 217.50016 288.49999] CT
0.149 GC
N
37.969 30.265 M
37.703 30.265 37.703 29.89 QT
37.797 29.249 38.078 29.249 QT
38.985 29.249 39.344 29.093 QT
39.703 28.937 39.907 28.265 QT
43.172 15.202 L
43.391 14.671 43.391 13.827 QT
43.391 12.577 42.547 12.577 QT
41.641 12.577 41.196 13.663 QT
40.75 14.749 40.344 16.406 QT
40.344 16.577 40.11 16.577 QT
39.766 16.577 L
39.688 16.577 39.602 16.476 QT
39.516 16.374 39.516 16.281 QT
39.828 15.031 40.125 14.148 QT
40.422 13.265 41.032 12.546 QT
41.641 11.827 42.563 11.827 QT
43.563 11.827 44.313 12.382 QT
45.063 12.937 45.266 13.906 QT
46.063 12.984 47.024 12.406 QT
47.985 11.827 49.016 11.827 QT
50.235 11.827 51.133 12.476 QT
52.032 13.124 52.485 14.179 QT
52.938 15.234 52.938 16.452 QT
52.938 18.327 51.977 20.32 QT
51.016 22.312 49.383 23.64 QT
47.75 24.968 45.875 24.968 QT
45.032 24.968 44.344 24.484 QT
43.657 23.999 43.282 23.218 QT
41.953 28.374 L
41.891 28.796 41.875 28.874 QT
41.875 29.249 43.782 29.249 QT
44.078 29.249 44.078 29.624 QT
43.985 29.999 43.922 30.132 QT
43.86 30.265 43.594 30.265 QT
37.969 30.265 L
cp
45.907 24.202 M
46.922 24.202 47.782 23.374 QT
48.641 22.546 49.188 21.515 QT
49.578 20.734 49.922 19.609 QT
50.266 18.484 50.524 17.21 QT
50.782 15.937 50.782 15.187 QT
50.782 14.515 50.602 13.937 QT
50.422 13.359 50.024 12.968 QT
49.625 12.577 48.953 12.577 QT
47.891 12.577 46.953 13.335 QT
46.016 14.093 45.25 15.202 QT
45.25 15.312 L
43.641 21.702 L
43.844 22.749 44.407 23.476 QT
44.969 24.202 45.907 24.202 QT
cp
f
GR
GS
[0.75 0 0 0.75 217.50016 288.49999] CT
0.149 GC
N
54.727 22.296 M
54.727 22.202 54.743 22.031 QT
54.759 21.859 54.782 21.702 QT
54.806 21.546 54.806 21.452 QT
58.399 7.093 L
58.509 6.593 58.54 6.312 QT
58.54 5.843 56.665 5.843 QT
56.384 5.843 56.384 5.468 QT
56.399 5.39 56.446 5.21 QT
56.493 5.031 56.571 4.929 QT
56.649 4.827 56.79 4.827 QT
60.696 4.515 L
61.056 4.515 61.056 4.89 QT
56.868 21.562 L
56.665 22.031 56.665 22.952 QT
56.665 24.202 57.509 24.202 QT
58.399 24.202 58.845 23.093 QT
59.29 21.984 59.649 20.374 QT
59.712 20.202 59.884 20.202 QT
60.227 20.202 L
60.337 20.202 60.415 20.296 QT
60.493 20.39 60.493 20.484 QT
60.165 21.89 59.884 22.702 QT
59.602 23.515 58.993 24.241 QT
58.384 24.968 57.446 24.968 QT
56.29 24.968 55.509 24.218 QT
54.727 23.468 54.727 22.296 QT
cp
f
GR
GS
[0.75 0 0 0.75 217.50016 288.49999] CT
0.149 GC
N
68.604 24.968 M
67.229 24.968 66.182 24.241 QT
65.135 23.515 64.596 22.296 QT
64.057 21.077 64.057 19.718 QT
64.057 17.64 65.096 15.82 QT
66.135 13.999 67.916 12.913 QT
69.698 11.827 71.745 11.827 QT
72.979 11.827 73.909 12.468 QT
74.838 13.109 74.838 14.312 QT
74.838 15.984 73.51 16.796 QT
72.182 17.609 70.51 17.804 QT
68.838 17.999 66.807 17.999 QT
66.729 17.999 L
66.26 19.734 66.26 20.952 QT
66.26 22.249 66.854 23.226 QT
67.448 24.202 68.666 24.202 QT
70.401 24.202 71.987 23.406 QT
73.573 22.609 74.588 21.218 QT
74.666 21.124 74.807 21.124 QT
74.948 21.124 75.096 21.288 QT
75.245 21.452 75.245 21.593 QT
75.245 21.702 75.198 21.765 QT
74.135 23.249 72.338 24.109 QT
70.541 24.968 68.604 24.968 QT
cp
66.901 17.249 M
68.588 17.249 70.018 17.093 QT
71.448 16.937 72.604 16.304 QT
73.76 15.671 73.76 14.343 QT
73.76 13.812 73.463 13.406 QT
73.166 12.999 72.69 12.788 QT
72.213 12.577 71.713 12.577 QT
70.479 12.577 69.495 13.241 QT
68.51 13.906 67.87 14.976 QT
67.229 16.046 66.901 17.249 QT
cp
f
GR
GS
[0.75 0 0 0.75 0 0] CT
0.149 GC
2 setlinecap
1 LJ
0.667 LW
N
73 359 M
73 39 L
S
GR
GS
[0.75 0 0 0.75 0 0] CT
0.149 GC
2 setlinecap
1 LJ
0.667 LW
N
73 359 M
77.34 359 L
S
GR
GS
[0.75 0 0 0.75 0 0] CT
0.149 GC
2 setlinecap
1 LJ
0.667 LW
N
73 305.667 M
77.34 305.667 L
S
GR
GS
[0.75 0 0 0.75 0 0] CT
0.149 GC
2 setlinecap
1 LJ
0.667 LW
N
73 252.333 M
77.34 252.333 L
S
GR
GS
[0.75 0 0 0.75 0 0] CT
0.149 GC
2 setlinecap
1 LJ
0.667 LW
N
73 199 M
77.34 199 L
S
GR
GS
[0.75 0 0 0.75 0 0] CT
0.149 GC
2 setlinecap
1 LJ
0.667 LW
N
73 145.667 M
77.34 145.667 L
S
GR
GS
[0.75 0 0 0.75 0 0] CT
0.149 GC
2 setlinecap
1 LJ
0.667 LW
N
73 92.333 M
77.34 92.333 L
S
GR
GS
[0.75 0 0 0.75 0 0] CT
0.149 GC
2 setlinecap
1 LJ
0.667 LW
N
73 39 M
77.34 39 L
S
GR
GS
[0.75 0 0 0.75 50.75 269.25] CT
0.149 GC
/Helvetica 13.333 F
GS
[1 0 0 1 0 0] CT
-16 5.5 moveto 
1 -1 scale
(20) t 
GR
GR
GS
[0.75 0 0 0.75 50.75 229.24999] CT
0.149 GC
/Helvetica 13.333 F
GS
[1 0 0 1 0 0] CT
-16 5.5 moveto 
1 -1 scale
(40) t 
GR
GR
GS
[0.75 0 0 0.75 50.75 189.25] CT
0.149 GC
/Helvetica 13.333 F
GS
[1 0 0 1 0 0] CT
-16 5.5 moveto 
1 -1 scale
(60) t 
GR
GR
GS
[0.75 0 0 0.75 50.75 149.25] CT
0.149 GC
/Helvetica 13.333 F
GS
[1 0 0 1 0 0] CT
-16 5.5 moveto 
1 -1 scale
(80) t 
GR
GR
GS
[0.75 0 0 0.75 50.75 109.25] CT
0.149 GC
/Helvetica 13.333 F
GS
[1 0 0 1 0 0] CT
-23 5.5 moveto 
1 -1 scale
(100) t 
GR
GR
GS
[0.75 0 0 0.75 50.75 69.25] CT
0.149 GC
/Helvetica 13.333 F
GS
[1 0 0 1 0 0] CT
-23 5.5 moveto 
1 -1 scale
(120) t 
GR
GR
GS
[0.75 0 0 0.75 50.75 29.25] CT
0.149 GC
/Helvetica 13.333 F
GS
[1 0 0 1 0 0] CT
-23 5.5 moveto 
1 -1 scale
(140) t 
GR
GR
GS
[0 -0.75 0.75 0 30.5 149.24987] CT
0.149 GC
N
-10.342 -11.06 M
-10.342 -11.232 -10.311 -11.31 QT
-8.139 -19.966 L
-7.936 -20.763 -7.936 -21.373 QT
-7.936 -22.623 -8.779 -22.623 QT
-9.686 -22.623 -10.123 -21.537 QT
-10.561 -20.451 -10.983 -18.794 QT
-10.983 -18.716 -11.061 -18.669 QT
-11.139 -18.623 -11.217 -18.623 QT
-11.561 -18.623 L
-11.654 -18.623 -11.725 -18.724 QT
-11.795 -18.826 -11.795 -18.919 QT
-11.483 -20.169 -11.194 -21.052 QT
-10.904 -21.935 -10.287 -22.654 QT
-9.67 -23.373 -8.748 -23.373 QT
-7.748 -23.373 -6.99 -22.794 QT
-6.233 -22.216 -6.045 -21.263 QT
-5.311 -22.232 -4.373 -22.802 QT
-3.436 -23.373 -2.311 -23.373 QT
-1.389 -23.373 -0.686 -22.834 QT
0.017 -22.294 0.017 -21.373 QT
0.017 -20.638 -0.444 -20.091 QT
-0.904 -19.544 -1.67 -19.544 QT
-2.139 -19.544 -2.459 -19.841 QT
-2.779 -20.138 -2.779 -20.607 QT
-2.779 -21.232 -2.311 -21.74 QT
-1.842 -22.248 -1.233 -22.248 QT
-1.701 -22.623 -2.373 -22.623 QT
-3.608 -22.623 -4.529 -21.74 QT
-5.451 -20.857 -6.186 -19.498 QT
-8.264 -11.201 L
-8.358 -10.794 -8.701 -10.513 QT
-9.045 -10.232 -9.483 -10.232 QT
-9.826 -10.232 -10.084 -10.459 QT
-10.342 -10.685 -10.342 -11.06 QT
cp
f
GR
GS
[0 -0.75 0.75 0 30.5 149.24987] CT
0.149 GC
N
1.689 -5.926 M
1.517 -5.926 1.517 -6.113 QT
1.517 -6.223 1.564 -6.27 QT
2.126 -7.238 2.923 -8.121 QT
3.72 -9.004 4.728 -9.918 QT
5.736 -10.832 6.751 -11.738 QT
7.767 -12.645 8.408 -13.363 QT
8.33 -13.363 L
7.861 -13.363 6.97 -13.66 QT
6.08 -13.957 5.564 -13.957 QT
5.017 -13.957 4.494 -13.715 QT
3.97 -13.473 3.83 -12.973 QT
3.798 -12.816 3.658 -12.816 QT
3.408 -12.816 L
3.236 -12.816 3.236 -13.035 QT
3.236 -13.098 L
3.408 -13.707 3.783 -14.238 QT
4.158 -14.77 4.705 -15.105 QT
5.251 -15.441 5.845 -15.441 QT
6.267 -15.441 6.54 -15.254 QT
6.814 -15.066 7.189 -14.66 QT
7.564 -14.254 7.79 -14.082 QT
8.017 -13.91 8.376 -13.91 QT
8.83 -13.91 9.197 -14.332 QT
9.564 -14.754 9.923 -15.379 QT
9.986 -15.441 10.064 -15.441 QT
10.314 -15.441 L
10.392 -15.441 10.439 -15.387 QT
10.486 -15.332 10.486 -15.254 QT
10.486 -15.191 10.439 -15.129 QT
9.876 -14.145 9.126 -13.301 QT
8.376 -12.457 7.158 -11.363 QT
5.939 -10.27 5.103 -9.52 QT
4.267 -8.77 3.533 -7.973 QT
3.705 -8.004 3.986 -8.004 QT
4.486 -8.004 5.376 -7.715 QT
6.267 -7.426 6.751 -7.426 QT
7.267 -7.426 7.806 -7.652 QT
8.345 -7.879 8.728 -8.285 QT
9.111 -8.691 9.251 -9.223 QT
9.298 -9.363 9.408 -9.363 QT
9.673 -9.363 L
9.751 -9.363 9.806 -9.301 QT
9.861 -9.238 9.861 -9.16 QT
9.861 -9.145 9.83 -9.098 QT
9.642 -8.301 9.158 -7.582 QT
8.673 -6.863 7.97 -6.395 QT
7.267 -5.926 6.47 -5.926 QT
6.08 -5.926 5.798 -6.113 QT
5.517 -6.301 5.142 -6.699 QT
4.767 -7.098 4.533 -7.277 QT
4.298 -7.457 3.955 -7.457 QT
2.908 -7.457 2.08 -5.988 QT
2.017 -5.926 1.939 -5.926 QT
1.689 -5.926 L
cp
f
GR
GS
[0.75 0 0 0.75 217.50021 25.5] CT
N
-98.019 -9.303 M
-104.378 -26.241 L
-104.612 -26.803 -105.284 -26.952 QT
-105.956 -27.1 -107.003 -27.1 QT
-107.003 -28.038 L
-99.581 -28.038 L
-99.581 -27.1 L
-101.816 -27.1 -101.816 -26.397 QT
-101.816 -26.35 -101.808 -26.319 QT
-101.8 -26.288 -101.8 -26.241 QT
-96.612 -12.459 L
-91.722 -25.506 L
-91.675 -25.6 -91.675 -25.834 QT
-91.675 -26.491 -92.276 -26.795 QT
-92.878 -27.1 -93.644 -27.1 QT
-93.644 -28.038 L
-87.816 -28.038 L
-87.816 -27.1 L
-88.831 -27.1 -89.597 -26.725 QT
-90.362 -26.35 -90.691 -25.506 QT
-96.8 -9.303 L
-96.878 -9.006 -97.237 -9.006 QT
-97.581 -9.006 L
-97.941 -9.006 -98.019 -9.303 QT
cp
f
GR
GS
[0.75 0 0 0.75 217.50021 25.5] CT
N
-83.022 -9.303 M
-84.663 -9.303 -86.038 -10.163 QT
-87.413 -11.022 -88.202 -12.467 QT
-88.991 -13.913 -88.991 -15.522 QT
-88.991 -17.1 -88.272 -18.522 QT
-87.553 -19.944 -86.264 -20.827 QT
-84.975 -21.709 -83.397 -21.709 QT
-82.163 -21.709 -81.249 -21.288 QT
-80.335 -20.866 -79.741 -20.131 QT
-79.147 -19.397 -78.842 -18.397 QT
-78.538 -17.397 -78.538 -16.194 QT
-78.538 -15.834 -78.819 -15.834 QT
-86.632 -15.834 L
-86.632 -15.553 L
-86.632 -13.303 -85.725 -11.694 QT
-84.819 -10.084 -82.772 -10.084 QT
-81.944 -10.084 -81.241 -10.452 QT
-80.538 -10.819 -80.014 -11.483 QT
-79.491 -12.147 -79.319 -12.897 QT
-79.288 -12.991 -79.217 -13.061 QT
-79.147 -13.131 -79.053 -13.131 QT
-78.819 -13.131 L
-78.538 -13.131 -78.538 -12.788 QT
-78.913 -11.256 -80.178 -10.28 QT
-81.444 -9.303 -83.022 -9.303 QT
cp
-86.6 -16.506 M
-80.444 -16.506 L
-80.444 -17.522 -80.725 -18.561 QT
-81.007 -19.6 -81.671 -20.295 QT
-82.335 -20.991 -83.397 -20.991 QT
-84.928 -20.991 -85.764 -19.561 QT
-86.6 -18.131 -86.6 -16.506 QT
cp
f
GR
GS
[0.75 0 0 0.75 217.50021 25.5] CT
N
-77.186 -9.6 M
-77.186 -10.553 L
-76.264 -10.553 -75.67 -10.694 QT
-75.077 -10.834 -75.077 -11.413 QT
-75.077 -18.772 L
-75.077 -19.506 -75.295 -19.827 QT
-75.514 -20.147 -75.92 -20.217 QT
-76.327 -20.288 -77.186 -20.288 QT
-77.186 -21.241 L
-73.327 -21.538 L
-73.327 -18.897 L
-72.889 -20.069 -72.084 -20.803 QT
-71.28 -21.538 -70.139 -21.538 QT
-69.327 -21.538 -68.694 -21.061 QT
-68.061 -20.584 -68.061 -19.803 QT
-68.061 -19.319 -68.412 -18.952 QT
-68.764 -18.584 -69.28 -18.584 QT
-69.78 -18.584 -70.139 -18.944 QT
-70.498 -19.303 -70.498 -19.803 QT
-70.498 -20.522 -69.983 -20.834 QT
-70.139 -20.834 L
-71.233 -20.834 -71.92 -20.045 QT
-72.608 -19.256 -72.905 -18.077 QT
-73.202 -16.897 -73.202 -15.834 QT
-73.202 -11.413 L
-73.202 -10.553 -70.577 -10.553 QT
-70.577 -9.6 L
-77.186 -9.6 L
cp
f
GR
GS
[0.75 0 0 0.75 217.50021 25.5] CT
N
-64.695 -12.85 M
-64.695 -20.288 L
-66.929 -20.288 L
-66.929 -20.991 L
-65.163 -20.991 -64.335 -22.639 QT
-63.507 -24.288 -63.507 -26.209 QT
-62.726 -26.209 L
-62.726 -21.241 L
-58.913 -21.241 L
-58.913 -20.288 L
-62.726 -20.288 L
-62.726 -12.897 L
-62.726 -11.772 -62.351 -10.928 QT
-61.976 -10.084 -60.991 -10.084 QT
-60.07 -10.084 -59.663 -10.975 QT
-59.257 -11.866 -59.257 -12.897 QT
-59.257 -14.491 L
-58.476 -14.491 L
-58.476 -12.85 L
-58.476 -12.006 -58.788 -11.178 QT
-59.101 -10.35 -59.71 -9.827 QT
-60.32 -9.303 -61.179 -9.303 QT
-62.804 -9.303 -63.749 -10.272 QT
-64.695 -11.241 -64.695 -12.85 QT
cp
f
GR
GS
[0.75 0 0 0.75 217.50021 25.5] CT
N
-56.246 -9.6 M
-56.246 -10.553 L
-55.324 -10.553 -54.73 -10.694 QT
-54.137 -10.834 -54.137 -11.413 QT
-54.137 -18.772 L
-54.137 -19.819 -54.535 -20.053 QT
-54.934 -20.288 -56.121 -20.288 QT
-56.121 -21.241 L
-52.23 -21.538 L
-52.23 -11.413 L
-52.23 -10.834 -51.723 -10.694 QT
-51.215 -10.553 -50.355 -10.553 QT
-50.355 -9.6 L
-56.246 -9.6 L
cp
-55.09 -26.178 M
-55.09 -26.772 -54.644 -27.217 QT
-54.199 -27.663 -53.621 -27.663 QT
-53.23 -27.663 -52.879 -27.467 QT
-52.527 -27.272 -52.332 -26.913 QT
-52.137 -26.553 -52.137 -26.178 QT
-52.137 -25.584 -52.582 -25.139 QT
-53.027 -24.694 -53.621 -24.694 QT
-54.199 -24.694 -54.644 -25.139 QT
-55.09 -25.584 -55.09 -26.178 QT
cp
f
GR
GS
[0.75 0 0 0.75 217.50021 25.5] CT
N
-42.948 -9.303 M
-44.573 -9.303 -45.909 -10.147 QT
-47.245 -10.991 -48.01 -12.413 QT
-48.776 -13.834 -48.776 -15.428 QT
-48.776 -17.022 -48.018 -18.483 QT
-47.26 -19.944 -45.917 -20.827 QT
-44.573 -21.709 -42.948 -21.709 QT
-41.354 -21.709 -40.057 -21.084 QT
-38.76 -20.459 -38.76 -19.053 QT
-38.76 -18.522 -39.135 -18.131 QT
-39.51 -17.741 -40.057 -17.741 QT
-40.589 -17.741 -40.971 -18.131 QT
-41.354 -18.522 -41.354 -19.053 QT
-41.354 -19.522 -41.05 -19.874 QT
-40.745 -20.225 -40.292 -20.319 QT
-41.229 -20.913 -42.917 -20.913 QT
-44.214 -20.913 -45.003 -20.053 QT
-45.792 -19.194 -46.104 -17.928 QT
-46.417 -16.663 -46.417 -15.428 QT
-46.417 -14.116 -46.034 -12.897 QT
-45.651 -11.678 -44.784 -10.881 QT
-43.917 -10.084 -42.62 -10.084 QT
-41.339 -10.084 -40.44 -10.874 QT
-39.542 -11.663 -39.214 -12.928 QT
-39.214 -13.084 -38.995 -13.084 QT
-38.667 -13.084 L
-38.589 -13.084 -38.526 -13.006 QT
-38.464 -12.928 -38.464 -12.85 QT
-38.464 -12.772 L
-38.87 -11.163 -40.081 -10.233 QT
-41.292 -9.303 -42.948 -9.303 QT
cp
f
GR
GS
[0.75 0 0 0.75 217.50021 25.5] CT
N
-36.737 -12.256 M
-36.737 -13.866 -35.471 -14.874 QT
-34.206 -15.881 -32.432 -16.295 QT
-30.659 -16.709 -29.065 -16.709 QT
-29.065 -17.819 L
-29.065 -18.584 -29.409 -19.319 QT
-29.752 -20.053 -30.393 -20.522 QT
-31.034 -20.991 -31.815 -20.991 QT
-33.612 -20.991 -34.549 -20.194 QT
-34.034 -20.194 -33.698 -19.803 QT
-33.362 -19.413 -33.362 -18.897 QT
-33.362 -18.35 -33.745 -17.967 QT
-34.127 -17.584 -34.643 -17.584 QT
-35.19 -17.584 -35.573 -17.967 QT
-35.956 -18.35 -35.956 -18.897 QT
-35.956 -20.319 -34.666 -21.014 QT
-33.377 -21.709 -31.815 -21.709 QT
-30.721 -21.709 -29.612 -21.241 QT
-28.502 -20.772 -27.799 -19.897 QT
-27.096 -19.022 -27.096 -17.866 QT
-27.096 -11.788 L
-27.096 -11.256 -26.87 -10.819 QT
-26.643 -10.381 -26.174 -10.381 QT
-25.721 -10.381 -25.502 -10.827 QT
-25.284 -11.272 -25.284 -11.788 QT
-25.284 -13.522 L
-24.502 -13.522 L
-24.502 -11.788 L
-24.502 -11.178 -24.815 -10.631 QT
-25.127 -10.084 -25.666 -9.764 QT
-26.206 -9.444 -26.815 -9.444 QT
-27.612 -9.444 -28.182 -10.053 QT
-28.752 -10.663 -28.831 -11.506 QT
-29.331 -10.491 -30.299 -9.897 QT
-31.268 -9.303 -32.377 -9.303 QT
-33.409 -9.303 -34.409 -9.6 QT
-35.409 -9.897 -36.073 -10.553 QT
-36.737 -11.209 -36.737 -12.256 QT
cp
-34.549 -12.256 M
-34.549 -11.303 -33.846 -10.655 QT
-33.143 -10.006 -32.206 -10.006 QT
-31.331 -10.006 -30.62 -10.444 QT
-29.909 -10.881 -29.487 -11.631 QT
-29.065 -12.381 -29.065 -13.209 QT
-29.065 -16.022 L
-30.284 -16.022 -31.573 -15.616 QT
-32.862 -15.209 -33.706 -14.358 QT
-34.549 -13.506 -34.549 -12.256 QT
cp
f
GR
GS
[0.75 0 0 0.75 217.50021 25.5] CT
N
-23.653 -9.6 M
-23.653 -10.553 L
-22.732 -10.553 -22.138 -10.694 QT
-21.544 -10.834 -21.544 -11.413 QT
-21.544 -25.584 L
-21.544 -26.303 -21.763 -26.624 QT
-21.982 -26.944 -22.388 -27.022 QT
-22.794 -27.1 -23.653 -27.1 QT
-23.653 -28.038 L
-19.638 -28.334 L
-19.638 -11.413 L
-19.638 -10.834 -19.044 -10.694 QT
-18.45 -10.553 -17.544 -10.553 QT
-17.544 -9.6 L
-23.653 -9.6 L
cp
f
GR
GS
[0.75 0 0 0.75 217.50021 25.5] CT
N
-5.435 -12.85 M
-5.435 -20.288 L
-7.67 -20.288 L
-7.67 -20.991 L
-5.904 -20.991 -5.076 -22.639 QT
-4.248 -24.288 -4.248 -26.209 QT
-3.466 -26.209 L
-3.466 -21.241 L
0.346 -21.241 L
0.346 -20.288 L
-3.466 -20.288 L
-3.466 -12.897 L
-3.466 -11.772 -3.091 -10.928 QT
-2.716 -10.084 -1.732 -10.084 QT
-0.81 -10.084 -0.404 -10.975 QT
0.002 -11.866 0.002 -12.897 QT
0.002 -14.491 L
0.784 -14.491 L
0.784 -12.85 L
0.784 -12.006 0.471 -11.178 QT
0.159 -10.35 -0.451 -9.827 QT
-1.06 -9.303 -1.92 -9.303 QT
-3.545 -9.303 -4.49 -10.272 QT
-5.435 -11.241 -5.435 -12.85 QT
cp
f
GR
GS
[0.75 0 0 0.75 217.50021 25.5] CT
N
2.888 -9.6 M
2.888 -10.553 L
3.81 -10.553 4.404 -10.694 QT
4.998 -10.834 4.998 -11.413 QT
4.998 -18.772 L
4.998 -19.506 4.779 -19.827 QT
4.56 -20.147 4.154 -20.217 QT
3.748 -20.288 2.888 -20.288 QT
2.888 -21.241 L
6.748 -21.538 L
6.748 -18.897 L
7.185 -20.069 7.99 -20.803 QT
8.795 -21.538 9.935 -21.538 QT
10.748 -21.538 11.38 -21.061 QT
12.013 -20.584 12.013 -19.803 QT
12.013 -19.319 11.662 -18.952 QT
11.31 -18.584 10.795 -18.584 QT
10.295 -18.584 9.935 -18.944 QT
9.576 -19.303 9.576 -19.803 QT
9.576 -20.522 10.091 -20.834 QT
9.935 -20.834 L
8.841 -20.834 8.154 -20.045 QT
7.466 -19.256 7.17 -18.077 QT
6.873 -16.897 6.873 -15.834 QT
6.873 -11.413 L
6.873 -10.553 9.498 -10.553 QT
9.498 -9.6 L
2.888 -9.6 L
cp
f
GR
GS
[0.75 0 0 0.75 217.50021 25.5] CT
N
13.708 -12.256 M
13.708 -13.866 14.973 -14.874 QT
16.239 -15.881 18.012 -16.295 QT
19.786 -16.709 21.38 -16.709 QT
21.38 -17.819 L
21.38 -18.584 21.036 -19.319 QT
20.692 -20.053 20.052 -20.522 QT
19.411 -20.991 18.63 -20.991 QT
16.833 -20.991 15.895 -20.194 QT
16.411 -20.194 16.747 -19.803 QT
17.083 -19.413 17.083 -18.897 QT
17.083 -18.35 16.7 -17.967 QT
16.317 -17.584 15.802 -17.584 QT
15.255 -17.584 14.872 -17.967 QT
14.489 -18.35 14.489 -18.897 QT
14.489 -20.319 15.778 -21.014 QT
17.067 -21.709 18.63 -21.709 QT
19.723 -21.709 20.833 -21.241 QT
21.942 -20.772 22.645 -19.897 QT
23.348 -19.022 23.348 -17.866 QT
23.348 -11.788 L
23.348 -11.256 23.575 -10.819 QT
23.802 -10.381 24.27 -10.381 QT
24.723 -10.381 24.942 -10.827 QT
25.161 -11.272 25.161 -11.788 QT
25.161 -13.522 L
25.942 -13.522 L
25.942 -11.788 L
25.942 -11.178 25.63 -10.631 QT
25.317 -10.084 24.778 -9.764 QT
24.239 -9.444 23.63 -9.444 QT
22.833 -9.444 22.262 -10.053 QT
21.692 -10.663 21.614 -11.506 QT
21.114 -10.491 20.145 -9.897 QT
19.177 -9.303 18.067 -9.303 QT
17.036 -9.303 16.036 -9.6 QT
15.036 -9.897 14.372 -10.553 QT
13.708 -11.209 13.708 -12.256 QT
cp
15.895 -12.256 M
15.895 -11.303 16.598 -10.655 QT
17.302 -10.006 18.239 -10.006 QT
19.114 -10.006 19.825 -10.444 QT
20.536 -10.881 20.958 -11.631 QT
21.38 -12.381 21.38 -13.209 QT
21.38 -16.022 L
20.161 -16.022 18.872 -15.616 QT
17.583 -15.209 16.739 -14.358 QT
15.895 -13.506 15.895 -12.256 QT
cp
f
GR
GS
[0.75 0 0 0.75 217.50021 25.5] CT
N
27.991 -5.069 M
28.601 -4.756 29.382 -4.756 QT
30.444 -4.756 30.866 -5.85 QT
31.288 -6.944 31.288 -8.209 QT
31.288 -18.772 L
31.288 -19.506 31.023 -19.827 QT
30.757 -20.147 30.304 -20.217 QT
29.851 -20.288 28.96 -20.288 QT
28.96 -21.241 L
33.163 -21.538 L
33.163 -8.084 L
33.163 -7.038 32.648 -6.108 QT
32.132 -5.178 31.249 -4.624 QT
30.366 -4.069 29.335 -4.069 QT
28.163 -4.069 27.21 -4.647 QT
26.257 -5.225 26.257 -6.272 QT
26.257 -6.803 26.64 -7.186 QT
27.023 -7.569 27.554 -7.569 QT
28.085 -7.569 28.46 -7.186 QT
28.835 -6.803 28.835 -6.272 QT
28.835 -5.866 28.609 -5.522 QT
28.382 -5.178 27.991 -5.069 QT
cp
30.194 -26.178 M
30.194 -26.772 30.648 -27.217 QT
31.101 -27.663 31.694 -27.663 QT
32.054 -27.663 32.413 -27.467 QT
32.773 -27.272 32.968 -26.913 QT
33.163 -26.553 33.163 -26.178 QT
33.163 -25.584 32.734 -25.139 QT
32.304 -24.694 31.694 -24.694 QT
31.101 -24.694 30.648 -25.139 QT
30.194 -25.584 30.194 -26.178 QT
cp
f
GR
GS
[0.75 0 0 0.75 217.50021 25.5] CT
N
42.311 -9.303 M
40.671 -9.303 39.296 -10.163 QT
37.921 -11.022 37.132 -12.467 QT
36.343 -13.913 36.343 -15.522 QT
36.343 -17.1 37.061 -18.522 QT
37.78 -19.944 39.069 -20.827 QT
40.358 -21.709 41.936 -21.709 QT
43.171 -21.709 44.085 -21.288 QT
44.999 -20.866 45.593 -20.131 QT
46.186 -19.397 46.491 -18.397 QT
46.796 -17.397 46.796 -16.194 QT
46.796 -15.834 46.515 -15.834 QT
38.702 -15.834 L
38.702 -15.553 L
38.702 -13.303 39.608 -11.694 QT
40.515 -10.084 42.561 -10.084 QT
43.39 -10.084 44.093 -10.452 QT
44.796 -10.819 45.319 -11.483 QT
45.843 -12.147 46.015 -12.897 QT
46.046 -12.991 46.116 -13.061 QT
46.186 -13.131 46.28 -13.131 QT
46.515 -13.131 L
46.796 -13.131 46.796 -12.788 QT
46.421 -11.256 45.155 -10.28 QT
43.89 -9.303 42.311 -9.303 QT
cp
38.733 -16.506 M
44.89 -16.506 L
44.89 -17.522 44.608 -18.561 QT
44.327 -19.6 43.663 -20.295 QT
42.999 -20.991 41.936 -20.991 QT
40.405 -20.991 39.569 -19.561 QT
38.733 -18.131 38.733 -16.506 QT
cp
f
GR
GS
[0.75 0 0 0.75 217.50021 25.5] CT
N
54.163 -9.303 M
52.538 -9.303 51.202 -10.147 QT
49.866 -10.991 49.101 -12.413 QT
48.335 -13.834 48.335 -15.428 QT
48.335 -17.022 49.093 -18.483 QT
49.851 -19.944 51.194 -20.827 QT
52.538 -21.709 54.163 -21.709 QT
55.757 -21.709 57.054 -21.084 QT
58.351 -20.459 58.351 -19.053 QT
58.351 -18.522 57.976 -18.131 QT
57.601 -17.741 57.054 -17.741 QT
56.523 -17.741 56.14 -18.131 QT
55.757 -18.522 55.757 -19.053 QT
55.757 -19.522 56.062 -19.874 QT
56.366 -20.225 56.819 -20.319 QT
55.882 -20.913 54.194 -20.913 QT
52.898 -20.913 52.109 -20.053 QT
51.319 -19.194 51.007 -17.928 QT
50.694 -16.663 50.694 -15.428 QT
50.694 -14.116 51.077 -12.897 QT
51.46 -11.678 52.327 -10.881 QT
53.194 -10.084 54.491 -10.084 QT
55.773 -10.084 56.671 -10.874 QT
57.569 -11.663 57.898 -12.928 QT
57.898 -13.084 58.116 -13.084 QT
58.444 -13.084 L
58.523 -13.084 58.585 -13.006 QT
58.648 -12.928 58.648 -12.85 QT
58.648 -12.772 L
58.241 -11.163 57.03 -10.233 QT
55.819 -9.303 54.163 -9.303 QT
cp
f
GR
GS
[0.75 0 0 0.75 217.50021 25.5] CT
N
62.046 -12.85 M
62.046 -20.288 L
59.812 -20.288 L
59.812 -20.991 L
61.578 -20.991 62.406 -22.639 QT
63.234 -24.288 63.234 -26.209 QT
64.015 -26.209 L
64.015 -21.241 L
67.828 -21.241 L
67.828 -20.288 L
64.015 -20.288 L
64.015 -12.897 L
64.015 -11.772 64.39 -10.928 QT
64.765 -10.084 65.749 -10.084 QT
66.671 -10.084 67.078 -10.975 QT
67.484 -11.866 67.484 -12.897 QT
67.484 -14.491 L
68.265 -14.491 L
68.265 -12.85 L
68.265 -12.006 67.953 -11.178 QT
67.64 -10.35 67.031 -9.827 QT
66.421 -9.303 65.562 -9.303 QT
63.937 -9.303 62.992 -10.272 QT
62.046 -11.241 62.046 -12.85 QT
cp
f
GR
GS
[0.75 0 0 0.75 217.50021 25.5] CT
N
76.417 -9.303 M
74.792 -9.303 73.409 -10.124 QT
72.026 -10.944 71.221 -12.327 QT
70.417 -13.709 70.417 -15.35 QT
70.417 -16.584 70.862 -17.733 QT
71.307 -18.881 72.128 -19.788 QT
72.948 -20.694 74.042 -21.202 QT
75.135 -21.709 76.417 -21.709 QT
78.073 -21.709 79.44 -20.827 QT
80.807 -19.944 81.596 -18.475 QT
82.385 -17.006 82.385 -15.35 QT
82.385 -13.725 81.581 -12.334 QT
80.776 -10.944 79.401 -10.124 QT
78.026 -9.303 76.417 -9.303 QT
cp
76.417 -10.084 M
78.573 -10.084 79.3 -11.655 QT
80.026 -13.225 80.026 -15.647 QT
80.026 -17.006 79.885 -17.897 QT
79.745 -18.788 79.245 -19.522 QT
78.948 -19.959 78.479 -20.295 QT
78.01 -20.631 77.487 -20.811 QT
76.964 -20.991 76.417 -20.991 QT
75.573 -20.991 74.815 -20.608 QT
74.057 -20.225 73.557 -19.522 QT
73.057 -18.756 72.917 -17.834 QT
72.776 -16.913 72.776 -15.647 QT
72.776 -14.131 73.042 -12.928 QT
73.307 -11.725 74.104 -10.905 QT
74.901 -10.084 76.417 -10.084 QT
cp
f
GR
GS
[0.75 0 0 0.75 217.50021 25.5] CT
N
83.703 -9.6 M
83.703 -10.553 L
84.625 -10.553 85.219 -10.694 QT
85.813 -10.834 85.813 -11.413 QT
85.813 -18.772 L
85.813 -19.506 85.594 -19.827 QT
85.375 -20.147 84.969 -20.217 QT
84.563 -20.288 83.703 -20.288 QT
83.703 -21.241 L
87.563 -21.538 L
87.563 -18.897 L
88 -20.069 88.805 -20.803 QT
89.609 -21.538 90.75 -21.538 QT
91.563 -21.538 92.195 -21.061 QT
92.828 -20.584 92.828 -19.803 QT
92.828 -19.319 92.477 -18.952 QT
92.125 -18.584 91.609 -18.584 QT
91.109 -18.584 90.75 -18.944 QT
90.391 -19.303 90.391 -19.803 QT
90.391 -20.522 90.906 -20.834 QT
90.75 -20.834 L
89.656 -20.834 88.969 -20.045 QT
88.281 -19.256 87.984 -18.077 QT
87.688 -16.897 87.688 -15.834 QT
87.688 -11.413 L
87.688 -10.553 90.313 -10.553 QT
90.313 -9.6 L
83.703 -9.6 L
cp
f
GR
GS
[0.75 0 0 0.75 217.50021 25.5] CT
N
95.304 -5.163 M
95.82 -4.756 96.445 -4.756 QT
98.132 -4.756 99.226 -7.334 QT
100.148 -9.6 L
96.101 -19.522 L
95.851 -20.022 95.335 -20.155 QT
94.82 -20.288 93.96 -20.288 QT
93.96 -21.241 L
99.632 -21.241 L
99.632 -20.288 L
98.132 -20.288 98.132 -19.647 QT
98.132 -19.538 98.163 -19.491 QT
101.163 -12.1 L
103.866 -18.756 L
103.945 -18.959 103.945 -19.209 QT
103.945 -19.538 103.773 -19.78 QT
103.601 -20.022 103.312 -20.155 QT
103.023 -20.288 102.679 -20.288 QT
102.679 -21.241 L
107.163 -21.241 L
107.163 -20.288 L
106.32 -20.288 105.695 -19.905 QT
105.07 -19.522 104.726 -18.772 QT
100.07 -7.334 L
99.695 -6.459 99.202 -5.733 QT
98.71 -5.006 97.999 -4.538 QT
97.288 -4.069 96.445 -4.069 QT
95.445 -4.069 94.702 -4.717 QT
93.96 -5.366 93.96 -6.334 QT
93.96 -6.834 94.304 -7.178 QT
94.648 -7.522 95.148 -7.522 QT
95.491 -7.522 95.757 -7.366 QT
96.023 -7.209 96.179 -6.952 QT
96.335 -6.694 96.335 -6.334 QT
96.335 -5.897 96.046 -5.553 QT
95.757 -5.209 95.304 -5.163 QT
cp
f
GR
GS
[0.75 0 0 0.75 0 0] CT
0.2 0.702 0.2 RC
1 LJ
0.667 LW
N
112.455 92.333 M
151.909 77.046 L
191.364 52.875 L
230.818 46.052 L
270.273 65.667 L
309.727 114.302 L
349.182 181.53 L
388.636 250.417 L
428.091 304.029 L
467.545 325.433 L
S
GR
GS
[0.75 0 0 0.75 0 0] CT
1 LJ
0.667 LW
N
112.455 119 M
151.909 101.046 L
191.364 65.667 L
230.818 48.546 L
270.273 65.667 L
309.727 111.367 L
349.182 173.543 L
388.636 236.868 L
428.091 286.018 L
467.545 305.667 L
S
GR
GS
[0.75 0 0 0.75 0 0] CT
0 0 1 RC
1 LJ
0.667 LW
N
112.455 225.667 M
151.909 227.761 L
191.364 233.631 L
230.818 242.446 L
270.273 253.377 L
309.727 265.595 L
349.182 278.272 L
388.636 290.577 L
428.091 300.833 L
467.545 305.667 L
S
GR
GS
[0.75 0 0 0.75 0 0] CT
0.6 0.2 0.2 RC
1 LJ
0.667 LW
N
112.455 252.333 M
151.909 255.42 L
191.364 263.818 L
230.818 275.806 L
270.273 289.665 L
309.727 303.671 L
349.182 316.104 L
388.636 325.243 L
428.091 330.215 L
467.545 331.844 L
S
GR
GS
[0.75 0 0 0.75 0 0] CT
1 GC
N
496 158 M
496 50 L
372 50 L
372 158 L
cp
f
GR
GS
[0.75 0 0 0.75 314.11361 48.61029] CT
N
0.672 5.12 M
0.672 4.386 L
2.547 4.386 2.984 3.136 QT
7.391 -9.693 L
7.453 -9.911 7.734 -9.911 QT
8 -9.911 L
8.281 -9.911 8.344 -9.693 QT
12.938 3.714 L
13.141 4.151 13.688 4.268 QT
14.234 4.386 15.047 4.386 QT
15.047 5.12 L
9.203 5.12 L
9.203 4.386 L
10.938 4.386 10.938 3.823 QT
10.938 3.714 L
9.797 0.432 L
4.703 0.432 L
3.766 3.136 L
3.75 3.214 3.75 3.354 QT
3.75 3.886 4.242 4.136 QT
4.734 4.386 5.313 4.386 QT
5.313 5.12 L
0.672 5.12 L
cp
4.953 -0.302 M
9.563 -0.302 L
7.25 -7.005 L
4.953 -0.302 L
cp
f
GR
GS
[0.75 0 0 0.75 314.11361 48.61029] CT
N
16.578 6.761 M
16.578 6.011 17.125 5.456 QT
17.672 4.901 18.422 4.651 QT
18 4.339 17.781 3.854 QT
17.563 3.37 17.563 2.839 QT
17.563 1.854 18.188 1.089 QT
17.219 0.151 17.219 -1.068 QT
17.219 -1.724 17.5 -2.302 QT
17.781 -2.88 18.289 -3.302 QT
18.797 -3.724 19.406 -3.943 QT
20.016 -4.161 20.672 -4.161 QT
21.922 -4.161 22.906 -3.427 QT
23.344 -3.896 23.93 -4.146 QT
24.516 -4.396 25.156 -4.396 QT
25.609 -4.396 25.898 -4.075 QT
26.188 -3.755 26.188 -3.302 QT
26.188 -3.036 25.992 -2.841 QT
25.797 -2.646 25.531 -2.646 QT
25.266 -2.646 25.07 -2.841 QT
24.875 -3.036 24.875 -3.302 QT
24.875 -3.693 25.141 -3.849 QT
24.047 -3.849 23.266 -3.099 QT
23.656 -2.708 23.883 -2.161 QT
24.109 -1.614 24.109 -1.068 QT
24.109 -0.177 23.617 0.534 QT
23.125 1.245 22.32 1.636 QT
21.516 2.026 20.672 2.026 QT
19.516 2.026 18.563 1.401 QT
18.266 1.823 18.266 2.323 QT
18.266 2.886 18.633 3.3 QT
19 3.714 19.547 3.714 QT
21.266 3.714 L
22.516 3.714 23.523 3.94 QT
24.531 4.167 25.211 4.846 QT
25.891 5.526 25.891 6.761 QT
25.891 7.682 25.117 8.292 QT
24.344 8.901 23.258 9.175 QT
22.172 9.448 21.25 9.448 QT
20.313 9.448 19.227 9.175 QT
18.141 8.901 17.359 8.292 QT
16.578 7.682 16.578 6.761 QT
cp
17.766 6.761 M
17.766 7.464 18.336 7.94 QT
18.906 8.417 19.719 8.651 QT
20.531 8.886 21.25 8.886 QT
21.953 8.886 22.766 8.651 QT
23.578 8.417 24.148 7.94 QT
24.719 7.464 24.719 6.761 QT
24.719 5.667 23.711 5.339 QT
22.703 5.011 21.266 5.011 QT
19.547 5.011 L
19.063 5.011 18.656 5.245 QT
18.25 5.479 18.008 5.893 QT
17.766 6.307 17.766 6.761 QT
cp
20.672 1.464 M
22.453 1.464 22.453 -1.068 QT
22.453 -2.177 22.07 -2.888 QT
21.688 -3.599 20.672 -3.599 QT
19.641 -3.599 19.258 -2.888 QT
18.875 -2.177 18.875 -1.068 QT
18.875 -0.38 19.023 0.182 QT
19.172 0.745 19.563 1.104 QT
19.953 1.464 20.672 1.464 QT
cp
f
GR
GS
[0.75 0 0 0.75 314.11361 48.61029] CT
N
31.901 5.354 M
30.62 5.354 29.55 4.682 QT
28.479 4.011 27.862 2.886 QT
27.245 1.761 27.245 0.511 QT
27.245 -0.708 27.807 -1.818 QT
28.37 -2.927 29.37 -3.607 QT
30.37 -4.286 31.604 -4.286 QT
32.557 -4.286 33.276 -3.966 QT
33.995 -3.646 34.456 -3.075 QT
34.917 -2.505 35.151 -1.724 QT
35.385 -0.943 35.385 -0.005 QT
35.385 0.276 35.167 0.276 QT
29.089 0.276 L
29.089 0.495 L
29.089 2.245 29.792 3.495 QT
30.495 4.745 32.089 4.745 QT
32.729 4.745 33.276 4.456 QT
33.823 4.167 34.229 3.651 QT
34.635 3.136 34.776 2.557 QT
34.792 2.479 34.854 2.425 QT
34.917 2.37 34.979 2.37 QT
35.167 2.37 L
35.385 2.37 35.385 2.636 QT
35.089 3.823 34.104 4.589 QT
33.12 5.354 31.901 5.354 QT
cp
29.104 -0.255 M
33.901 -0.255 L
33.901 -1.036 33.675 -1.849 QT
33.448 -2.661 32.94 -3.2 QT
32.432 -3.739 31.604 -3.739 QT
30.417 -3.739 29.76 -2.63 QT
29.104 -1.521 29.104 -0.255 QT
cp
f
GR
GS
[0.75 0 0 0.75 314.11361 48.61029] CT
N
36.773 5.12 M
36.773 4.386 L
37.492 4.386 37.953 4.268 QT
38.414 4.151 38.414 3.714 QT
38.414 -2.021 L
38.414 -2.583 38.242 -2.833 QT
38.07 -3.083 37.758 -3.138 QT
37.445 -3.193 36.773 -3.193 QT
36.773 -3.927 L
39.82 -4.161 L
39.82 -2.114 L
40.242 -3.005 41.07 -3.583 QT
41.898 -4.161 42.867 -4.161 QT
44.32 -4.161 45.054 -3.466 QT
45.789 -2.771 45.789 -1.333 QT
45.789 3.714 L
45.789 4.151 46.25 4.268 QT
46.711 4.386 47.429 4.386 QT
47.429 5.12 L
42.617 5.12 L
42.617 4.386 L
43.336 4.386 43.797 4.268 QT
44.258 4.151 44.258 3.714 QT
44.258 -1.271 L
44.258 -2.286 43.961 -2.95 QT
43.664 -3.614 42.742 -3.614 QT
41.523 -3.614 40.734 -2.638 QT
39.945 -1.661 39.945 -0.427 QT
39.945 3.714 L
39.945 4.151 40.414 4.268 QT
40.883 4.386 41.586 4.386 QT
41.586 5.12 L
36.773 5.12 L
cp
f
GR
GS
[0.75 0 0 0.75 314.11361 48.61029] CT
N
49.548 2.604 M
49.548 -3.193 L
47.814 -3.193 L
47.814 -3.739 L
49.189 -3.739 49.829 -5.021 QT
50.47 -6.302 50.47 -7.802 QT
51.079 -7.802 L
51.079 -3.927 L
54.048 -3.927 L
54.048 -3.193 L
51.079 -3.193 L
51.079 2.557 L
51.079 3.432 51.368 4.089 QT
51.657 4.745 52.423 4.745 QT
53.142 4.745 53.462 4.05 QT
53.782 3.354 53.782 2.557 QT
53.782 1.323 L
54.376 1.323 L
54.376 2.604 L
54.376 3.261 54.134 3.901 QT
53.892 4.542 53.423 4.948 QT
52.954 5.354 52.282 5.354 QT
51.017 5.354 50.282 4.604 QT
49.548 3.854 49.548 2.604 QT
cp
f
GR
GS
[0.75 0 0 0.75 314.11361 48.61029] CT
N
64.768 5.12 M
64.768 4.386 L
67.393 4.386 67.393 3.714 QT
67.393 -7.302 L
66.299 -6.786 64.643 -6.786 QT
64.643 -7.521 L
67.221 -7.521 68.534 -8.864 QT
68.831 -8.864 L
68.893 -8.864 68.963 -8.81 QT
69.034 -8.755 69.034 -8.677 QT
69.034 3.714 L
69.034 4.386 71.659 4.386 QT
71.659 5.12 L
64.768 5.12 L
cp
f
GR
GS
[0.75 0 0 0.75 0 0] CT
0.2 0.702 0.2 RC
1 LJ
0.667 LW
N
375.985 64.814 M
415.83 64.814 L
S
GR
GS
[0.75 0 0 0.75 314.11361 68.20343] CT
N
/f-597267615{0.672 5.12 M
0.672 4.386 L
2.547 4.386 2.984 3.136 QT
7.391 -9.693 L
7.453 -9.911 7.734 -9.911 QT
8 -9.911 L
8.281 -9.911 8.344 -9.693 QT
12.938 3.714 L
13.141 4.151 13.688 4.268 QT
14.234 4.386 15.047 4.386 QT
15.047 5.12 L
9.203 5.12 L
9.203 4.386 L
10.938 4.386 10.938 3.823 QT
10.938 3.714 L
9.797 0.432 L
4.703 0.432 L
3.766 3.136 L
3.75 3.214 3.75 3.354 QT
3.75 3.886 4.242 4.136 QT
4.734 4.386 5.313 4.386 QT
5.313 5.12 L
0.672 5.12 L
cp
4.953 -0.302 M
9.563 -0.302 L
7.25 -7.005 L
4.953 -0.302 L
cp}def
f-597267615
f
GR
GS
[0.75 0 0 0.75 314.11361 68.20343] CT
N
/f-745240314{16.578 6.761 M
16.578 6.011 17.125 5.456 QT
17.672 4.901 18.422 4.651 QT
18 4.339 17.781 3.854 QT
17.563 3.37 17.563 2.839 QT
17.563 1.854 18.188 1.089 QT
17.219 0.151 17.219 -1.068 QT
17.219 -1.724 17.5 -2.302 QT
17.781 -2.88 18.289 -3.302 QT
18.797 -3.724 19.406 -3.943 QT
20.016 -4.161 20.672 -4.161 QT
21.922 -4.161 22.906 -3.427 QT
23.344 -3.896 23.93 -4.146 QT
24.516 -4.396 25.156 -4.396 QT
25.609 -4.396 25.898 -4.075 QT
26.188 -3.755 26.188 -3.302 QT
26.188 -3.036 25.992 -2.841 QT
25.797 -2.646 25.531 -2.646 QT
25.266 -2.646 25.07 -2.841 QT
24.875 -3.036 24.875 -3.302 QT
24.875 -3.693 25.141 -3.849 QT
24.047 -3.849 23.266 -3.099 QT
23.656 -2.708 23.883 -2.161 QT
24.109 -1.614 24.109 -1.068 QT
24.109 -0.177 23.617 0.534 QT
23.125 1.245 22.32 1.636 QT
21.516 2.026 20.672 2.026 QT
19.516 2.026 18.563 1.401 QT
18.266 1.823 18.266 2.323 QT
18.266 2.886 18.633 3.3 QT
19 3.714 19.547 3.714 QT
21.266 3.714 L
22.516 3.714 23.523 3.94 QT
24.531 4.167 25.211 4.846 QT
25.891 5.526 25.891 6.761 QT
25.891 7.682 25.117 8.292 QT
24.344 8.901 23.258 9.175 QT
22.172 9.448 21.25 9.448 QT
20.313 9.448 19.227 9.175 QT
18.141 8.901 17.359 8.292 QT
16.578 7.682 16.578 6.761 QT
cp
17.766 6.761 M
17.766 7.464 18.336 7.94 QT
18.906 8.417 19.719 8.651 QT
20.531 8.886 21.25 8.886 QT
21.953 8.886 22.766 8.651 QT
23.578 8.417 24.148 7.94 QT
24.719 7.464 24.719 6.761 QT
24.719 5.667 23.711 5.339 QT
22.703 5.011 21.266 5.011 QT
19.547 5.011 L
19.063 5.011 18.656 5.245 QT
18.25 5.479 18.008 5.893 QT
17.766 6.307 17.766 6.761 QT
cp
20.672 1.464 M
22.453 1.464 22.453 -1.068 QT
22.453 -2.177 22.07 -2.888 QT
21.688 -3.599 20.672 -3.599 QT
19.641 -3.599 19.258 -2.888 QT
18.875 -2.177 18.875 -1.068 QT
18.875 -0.38 19.023 0.182 QT
19.172 0.745 19.563 1.104 QT
19.953 1.464 20.672 1.464 QT
cp}def
f-745240314
f
GR
GS
[0.75 0 0 0.75 314.11361 68.20343] CT
N
/f1964844890{31.901 5.354 M
30.62 5.354 29.55 4.682 QT
28.479 4.011 27.862 2.886 QT
27.245 1.761 27.245 0.511 QT
27.245 -0.708 27.807 -1.818 QT
28.37 -2.927 29.37 -3.607 QT
30.37 -4.286 31.604 -4.286 QT
32.557 -4.286 33.276 -3.966 QT
33.995 -3.646 34.456 -3.075 QT
34.917 -2.505 35.151 -1.724 QT
35.385 -0.943 35.385 -0.005 QT
35.385 0.276 35.167 0.276 QT
29.089 0.276 L
29.089 0.495 L
29.089 2.245 29.792 3.495 QT
30.495 4.745 32.089 4.745 QT
32.729 4.745 33.276 4.456 QT
33.823 4.167 34.229 3.651 QT
34.635 3.136 34.776 2.557 QT
34.792 2.479 34.854 2.425 QT
34.917 2.37 34.979 2.37 QT
35.167 2.37 L
35.385 2.37 35.385 2.636 QT
35.089 3.823 34.104 4.589 QT
33.12 5.354 31.901 5.354 QT
cp
29.104 -0.255 M
33.901 -0.255 L
33.901 -1.036 33.675 -1.849 QT
33.448 -2.661 32.94 -3.2 QT
32.432 -3.739 31.604 -3.739 QT
30.417 -3.739 29.76 -2.63 QT
29.104 -1.521 29.104 -0.255 QT
cp}def
f1964844890
f
GR
GS
[0.75 0 0 0.75 314.11361 68.20343] CT
N
/f1881606250{36.773 5.12 M
36.773 4.386 L
37.492 4.386 37.953 4.268 QT
38.414 4.151 38.414 3.714 QT
38.414 -2.021 L
38.414 -2.583 38.242 -2.833 QT
38.07 -3.083 37.758 -3.138 QT
37.445 -3.193 36.773 -3.193 QT
36.773 -3.927 L
39.82 -4.161 L
39.82 -2.114 L
40.242 -3.005 41.07 -3.583 QT
41.898 -4.161 42.867 -4.161 QT
44.32 -4.161 45.054 -3.466 QT
45.789 -2.771 45.789 -1.333 QT
45.789 3.714 L
45.789 4.151 46.25 4.268 QT
46.711 4.386 47.429 4.386 QT
47.429 5.12 L
42.617 5.12 L
42.617 4.386 L
43.336 4.386 43.797 4.268 QT
44.258 4.151 44.258 3.714 QT
44.258 -1.271 L
44.258 -2.286 43.961 -2.95 QT
43.664 -3.614 42.742 -3.614 QT
41.523 -3.614 40.734 -2.638 QT
39.945 -1.661 39.945 -0.427 QT
39.945 3.714 L
39.945 4.151 40.414 4.268 QT
40.883 4.386 41.586 4.386 QT
41.586 5.12 L
36.773 5.12 L
cp}def
f1881606250
f
GR
GS
[0.75 0 0 0.75 314.11361 68.20343] CT
N
/f-1218143468{49.548 2.604 M
49.548 -3.193 L
47.814 -3.193 L
47.814 -3.739 L
49.189 -3.739 49.829 -5.021 QT
50.47 -6.302 50.47 -7.802 QT
51.079 -7.802 L
51.079 -3.927 L
54.048 -3.927 L
54.048 -3.193 L
51.079 -3.193 L
51.079 2.557 L
51.079 3.432 51.368 4.089 QT
51.657 4.745 52.423 4.745 QT
53.142 4.745 53.462 4.05 QT
53.782 3.354 53.782 2.557 QT
53.782 1.323 L
54.376 1.323 L
54.376 2.604 L
54.376 3.261 54.134 3.901 QT
53.892 4.542 53.423 4.948 QT
52.954 5.354 52.282 5.354 QT
51.017 5.354 50.282 4.604 QT
49.548 3.854 49.548 2.604 QT
cp}def
f-1218143468
f
GR
GS
[0.75 0 0 0.75 314.11361 68.20343] CT
N
/f-1429999007{63.862 5.12 M
63.862 4.557 L
63.862 4.511 63.909 4.448 QT
67.159 0.839 L
67.909 0.026 68.37 -0.513 QT
68.831 -1.052 69.276 -1.763 QT
69.721 -2.474 69.987 -3.2 QT
70.252 -3.927 70.252 -4.755 QT
70.252 -5.614 69.932 -6.404 QT
69.612 -7.193 68.979 -7.661 QT
68.346 -8.13 67.456 -8.13 QT
66.549 -8.13 65.823 -7.583 QT
65.096 -7.036 64.799 -6.161 QT
64.877 -6.177 65.018 -6.177 QT
65.487 -6.177 65.823 -5.864 QT
66.159 -5.552 66.159 -5.036 QT
66.159 -4.568 65.823 -4.232 QT
65.487 -3.896 65.018 -3.896 QT
64.534 -3.896 64.198 -4.239 QT
63.862 -4.583 63.862 -5.036 QT
63.862 -5.833 64.159 -6.521 QT
64.456 -7.208 65.018 -7.747 QT
65.581 -8.286 66.276 -8.575 QT
66.971 -8.864 67.768 -8.864 QT
68.971 -8.864 70.002 -8.357 QT
71.034 -7.849 71.643 -6.919 QT
72.252 -5.989 72.252 -4.755 QT
72.252 -3.849 71.854 -3.029 QT
71.456 -2.208 70.831 -1.536 QT
70.206 -0.864 69.229 -0.013 QT
68.252 0.839 67.94 1.136 QT
65.565 3.417 L
67.581 3.417 L
69.065 3.417 70.065 3.393 QT
71.065 3.37 71.127 3.307 QT
71.377 3.042 71.627 1.37 QT
72.252 1.37 L
71.659 5.12 L
63.862 5.12 L
cp}def
f-1429999007
f
GR
GS
[0.75 0 0 0.75 0 0] CT
1 LJ
0.667 LW
N
375.985 90.938 M
415.83 90.938 L
S
GR
GS
[0.75 0 0 0.75 314.11361 87.79657] CT
N
f-597267615
f
GR
GS
[0.75 0 0 0.75 314.11361 87.79657] CT
N
f-745240314
f
GR
GS
[0.75 0 0 0.75 314.11361 87.79657] CT
N
f1964844890
f
GR
GS
[0.75 0 0 0.75 314.11361 87.79657] CT
N
f1881606250
f
GR
GS
[0.75 0 0 0.75 314.11361 87.79657] CT
N
f-1218143468
f
GR
GS
[0.75 0 0 0.75 314.11361 87.79657] CT
N
/f300774680{64.815 3.495 M
65.299 4.214 66.135 4.565 QT
66.971 4.917 67.924 4.917 QT
69.143 4.917 69.659 3.878 QT
70.174 2.839 70.174 1.511 QT
70.174 0.917 70.065 0.323 QT
69.956 -0.271 69.698 -0.786 QT
69.44 -1.302 68.995 -1.607 QT
68.549 -1.911 67.909 -1.911 QT
66.502 -1.911 L
66.315 -1.911 66.315 -2.114 QT
66.315 -2.286 L
66.315 -2.458 66.502 -2.458 QT
67.659 -2.552 L
68.409 -2.552 68.893 -3.107 QT
69.377 -3.661 69.604 -4.45 QT
69.831 -5.239 69.831 -5.958 QT
69.831 -6.974 69.362 -7.614 QT
68.893 -8.255 67.924 -8.255 QT
67.127 -8.255 66.393 -7.958 QT
65.659 -7.661 65.237 -7.036 QT
65.284 -7.052 65.307 -7.06 QT
65.331 -7.068 65.377 -7.068 QT
65.846 -7.068 66.166 -6.739 QT
66.487 -6.411 66.487 -5.943 QT
66.487 -5.489 66.166 -5.161 QT
65.846 -4.833 65.377 -4.833 QT
64.924 -4.833 64.596 -5.161 QT
64.268 -5.489 64.268 -5.943 QT
64.268 -6.849 64.807 -7.513 QT
65.346 -8.177 66.206 -8.521 QT
67.065 -8.864 67.924 -8.864 QT
68.565 -8.864 69.268 -8.677 QT
69.971 -8.489 70.549 -8.138 QT
71.127 -7.786 71.487 -7.232 QT
71.846 -6.677 71.846 -5.958 QT
71.846 -5.083 71.456 -4.333 QT
71.065 -3.583 70.377 -3.044 QT
69.69 -2.505 68.862 -2.239 QT
69.784 -2.052 70.604 -1.544 QT
71.424 -1.036 71.916 -0.232 QT
72.409 0.573 72.409 1.495 QT
72.409 2.651 71.776 3.589 QT
71.143 4.526 70.104 5.057 QT
69.065 5.589 67.924 5.589 QT
66.94 5.589 65.948 5.214 QT
64.956 4.839 64.323 4.089 QT
63.69 3.339 63.69 2.292 QT
63.69 1.761 64.041 1.417 QT
64.393 1.073 64.924 1.073 QT
65.252 1.073 65.534 1.229 QT
65.815 1.386 65.979 1.675 QT
66.143 1.964 66.143 2.292 QT
66.143 2.807 65.784 3.151 QT
65.424 3.495 64.924 3.495 QT
64.815 3.495 L
cp}def
f300774680
f
GR
GS
[0.75 0 0 0.75 0 0] CT
0 0 1 RC
1 LJ
0.667 LW
N
375.985 117.062 M
415.83 117.062 L
S
GR
GS
[0.75 0 0 0.75 314.11361 107.38971] CT
N
f-597267615
f
GR
GS
[0.75 0 0 0.75 314.11361 107.38971] CT
N
f-745240314
f
GR
GS
[0.75 0 0 0.75 314.11361 107.38971] CT
N
f1964844890
f
GR
GS
[0.75 0 0 0.75 314.11361 107.38971] CT
N
f1881606250
f
GR
GS
[0.75 0 0 0.75 314.11361 107.38971] CT
N
f-1218143468
f
GR
GS
[0.75 0 0 0.75 314.11361 107.38971] CT
N
/f-1674298674{63.393 1.651 M
63.393 0.917 L
69.893 -8.771 L
69.956 -8.864 70.112 -8.864 QT
70.409 -8.864 L
70.643 -8.864 70.643 -8.63 QT
70.643 0.917 L
72.706 0.917 L
72.706 1.651 L
70.643 1.651 L
70.643 3.714 L
70.643 4.151 71.26 4.268 QT
71.877 4.386 72.69 4.386 QT
72.69 5.12 L
66.909 5.12 L
66.909 4.386 L
67.721 4.386 68.331 4.268 QT
68.94 4.151 68.94 3.714 QT
68.94 1.651 L
63.393 1.651 L
cp
64.096 0.917 M
69.065 0.917 L
69.065 -6.521 L
64.096 0.917 L
cp}def
f-1674298674
f
GR
GS
[0.75 0 0 0.75 0 0] CT
0.6 0.2 0.2 RC
1 LJ
0.667 LW
N
375.985 143.186 M
415.83 143.186 L
S
GR
GS
[0.75 0 0 0.75 0 0] CT
0.149 GC
10.0 ML
0.667 LW
N
372 158 M
372 50 L
496 50 L
496 158 L
cp
S
GR
%%Trailer
%%Pages: 1
%%EOF
