%!PS-Adobe-3.0 EPSF-3.0
%%Creator: (MATLAB, The Mathworks, Inc. Version 9.12.0.2529717 \(R2022a\) Update 8. Operating System: Linux)
%%Title: ./optim_300.eps
%%CreationDate: 2024-07-07T17:07:11
%%Pages: (atend)
%%BoundingBox:    23    35   490   673
%%LanguageLevel: 3
%%EndComments
%%BeginProlog
%%BeginResource: procset (Apache XML Graphics Std ProcSet) 1.2 0
%%Version: 1.2 0
%%Copyright: (Copyright 2001-2003,2010 The Apache Software Foundation. License terms: http://www.apache.org/licenses/LICENSE-2.0)
/bd{bind def}bind def
/ld{load def}bd
/GR/grestore ld
/GS/gsave ld
/RM/rmoveto ld
/C/curveto ld
/t/show ld
/L/lineto ld
/ML/setmiterlimit ld
/CT/concat ld
/f/fill ld
/N/newpath ld
/S/stroke ld
/CC/setcmykcolor ld
/A/ashow ld
/cp/closepath ld
/RC/setrgbcolor ld
/LJ/setlinejoin ld
/GC/setgray ld
/LW/setlinewidth ld
/M/moveto ld
/re {4 2 roll M
1 index 0 rlineto
0 exch rlineto
neg 0 rlineto
cp } bd
/_ctm matrix def
/_tm matrix def
/BT { _ctm currentmatrix pop matrix _tm copy pop 0 0 moveto } bd
/ET { _ctm setmatrix } bd
/iTm { _ctm setmatrix _tm concat } bd
/Tm { _tm astore pop iTm 0 0 moveto } bd
/ux 0.0 def
/uy 0.0 def
/F {
  /Tp exch def
  /Tf exch def
  Tf findfont Tp scalefont setfont
  /cf Tf def  /cs Tp def
} bd
/ULS {currentpoint /uy exch def /ux exch def} bd
/ULE {
  /Tcx currentpoint pop def
  gsave
  newpath
  cf findfont cs scalefont dup
  /FontMatrix get 0 get /Ts exch def /FontInfo get dup
  /UnderlinePosition get Ts mul /To exch def
  /UnderlineThickness get Ts mul /Tt exch def
  ux uy To add moveto  Tcx uy To add lineto
  Tt setlinewidth stroke
  grestore
} bd
/OLE {
  /Tcx currentpoint pop def
  gsave
  newpath
  cf findfont cs scalefont dup
  /FontMatrix get 0 get /Ts exch def /FontInfo get dup
  /UnderlinePosition get Ts mul /To exch def
  /UnderlineThickness get Ts mul /Tt exch def
  ux uy To add cs add moveto Tcx uy To add cs add lineto
  Tt setlinewidth stroke
  grestore
} bd
/SOE {
  /Tcx currentpoint pop def
  gsave
  newpath
  cf findfont cs scalefont dup
  /FontMatrix get 0 get /Ts exch def /FontInfo get dup
  /UnderlinePosition get Ts mul /To exch def
  /UnderlineThickness get Ts mul /Tt exch def
  ux uy To add cs 10 mul 26 idiv add moveto Tcx uy To add cs 10 mul 26 idiv add lineto
  Tt setlinewidth stroke
  grestore
} bd
/QT {
/Y22 exch store
/X22 exch store
/Y21 exch store
/X21 exch store
currentpoint
/Y21 load 2 mul add 3 div exch
/X21 load 2 mul add 3 div exch
/X21 load 2 mul /X22 load add 3 div
/Y21 load 2 mul /Y22 load add 3 div
/X22 load /Y22 load curveto
} bd
/SSPD {
dup length /d exch dict def
{
/v exch def
/k exch def
currentpagedevice k known {
/cpdv currentpagedevice k get def
v cpdv ne {
/upd false def
/nullv v type /nulltype eq def
/nullcpdv cpdv type /nulltype eq def
nullv nullcpdv or
{
/upd true def
} {
/sametype v type cpdv type eq def
sametype {
v type /arraytype eq {
/vlen v length def
/cpdvlen cpdv length def
vlen cpdvlen eq {
0 1 vlen 1 sub {
/i exch def
/obj v i get def
/cpdobj cpdv i get def
obj cpdobj ne {
/upd true def
exit
} if
} for
} {
/upd true def
} ifelse
} {
v type /dicttype eq {
v {
/dv exch def
/dk exch def
/cpddv cpdv dk get def
dv cpddv ne {
/upd true def
exit
} if
} forall
} {
/upd true def
} ifelse
} ifelse
} if
} ifelse
upd true eq {
d k v put
} if
} if
} if
} forall
d length 0 gt {
d setpagedevice
} if
} bd
/RE { % /NewFontName [NewEncodingArray] /FontName RE -
  findfont dup length dict begin
  {
    1 index /FID ne
    {def} {pop pop} ifelse
  } forall
  /Encoding exch def
  /FontName 1 index def
  currentdict definefont pop
  end
} bind def
%%EndResource
%%BeginResource: procset (Apache XML Graphics EPS ProcSet) 1.0 0
%%Version: 1.0 0
%%Copyright: (Copyright 2002-2003 The Apache Software Foundation. License terms: http://www.apache.org/licenses/LICENSE-2.0)
/BeginEPSF { %def
/b4_Inc_state save def         % Save state for cleanup
/dict_count countdictstack def % Count objects on dict stack
/op_count count 1 sub def      % Count objects on operand stack
userdict begin                 % Push userdict on dict stack
/showpage { } def              % Redefine showpage, { } = null proc
0 setgray 0 setlinecap         % Prepare graphics state
1 setlinewidth 0 setlinejoin
10 setmiterlimit [ ] 0 setdash newpath
/languagelevel where           % If level not equal to 1 then
{pop languagelevel             % set strokeadjust and
1 ne                           % overprint to their defaults.
{false setstrokeadjust false setoverprint
} if
} if
} bd
/EndEPSF { %def
count op_count sub {pop} repeat            % Clean up stacks
countdictstack dict_count sub {end} repeat
b4_Inc_state restore
} bd
%%EndResource
%FOPBeginFontDict
%%IncludeResource: font Courier-Oblique
%%IncludeResource: font Courier-BoldOblique
%%IncludeResource: font Courier-Bold
%%IncludeResource: font ZapfDingbats
%%IncludeResource: font Symbol
%%IncludeResource: font Helvetica
%%IncludeResource: font Helvetica-Oblique
%%IncludeResource: font Helvetica-Bold
%%IncludeResource: font Helvetica-BoldOblique
%%IncludeResource: font Times-Roman
%%IncludeResource: font Times-Italic
%%IncludeResource: font Times-Bold
%%IncludeResource: font Times-BoldItalic
%%IncludeResource: font Courier
%FOPEndFontDict
%%BeginResource: encoding WinAnsiEncoding
/WinAnsiEncoding [
/.notdef /.notdef /.notdef /.notdef /.notdef
/.notdef /.notdef /.notdef /.notdef /.notdef
/.notdef /.notdef /.notdef /.notdef /.notdef
/.notdef /.notdef /.notdef /.notdef /.notdef
/.notdef /.notdef /.notdef /.notdef /.notdef
/.notdef /.notdef /.notdef /.notdef /.notdef
/.notdef /.notdef /space /exclam /quotedbl
/numbersign /dollar /percent /ampersand /quotesingle
/parenleft /parenright /asterisk /plus /comma
/hyphen /period /slash /zero /one
/two /three /four /five /six
/seven /eight /nine /colon /semicolon
/less /equal /greater /question /at
/A /B /C /D /E
/F /G /H /I /J
/K /L /M /N /O
/P /Q /R /S /T
/U /V /W /X /Y
/Z /bracketleft /backslash /bracketright /asciicircum
/underscore /quoteleft /a /b /c
/d /e /f /g /h
/i /j /k /l /m
/n /o /p /q /r
/s /t /u /v /w
/x /y /z /braceleft /bar
/braceright /asciitilde /bullet /Euro /bullet
/quotesinglbase /florin /quotedblbase /ellipsis /dagger
/daggerdbl /circumflex /perthousand /Scaron /guilsinglleft
/OE /bullet /Zcaron /bullet /bullet
/quoteleft /quoteright /quotedblleft /quotedblright /bullet
/endash /emdash /asciitilde /trademark /scaron
/guilsinglright /oe /bullet /zcaron /Ydieresis
/space /exclamdown /cent /sterling /currency
/yen /brokenbar /section /dieresis /copyright
/ordfeminine /guillemotleft /logicalnot /sfthyphen /registered
/macron /degree /plusminus /twosuperior /threesuperior
/acute /mu /paragraph /middot /cedilla
/onesuperior /ordmasculine /guillemotright /onequarter /onehalf
/threequarters /questiondown /Agrave /Aacute /Acircumflex
/Atilde /Adieresis /Aring /AE /Ccedilla
/Egrave /Eacute /Ecircumflex /Edieresis /Igrave
/Iacute /Icircumflex /Idieresis /Eth /Ntilde
/Ograve /Oacute /Ocircumflex /Otilde /Odieresis
/multiply /Oslash /Ugrave /Uacute /Ucircumflex
/Udieresis /Yacute /Thorn /germandbls /agrave
/aacute /acircumflex /atilde /adieresis /aring
/ae /ccedilla /egrave /eacute /ecircumflex
/edieresis /igrave /iacute /icircumflex /idieresis
/eth /ntilde /ograve /oacute /ocircumflex
/otilde /odieresis /divide /oslash /ugrave
/uacute /ucircumflex /udieresis /yacute /thorn
/ydieresis
] def
%%EndResource
%FOPBeginFontReencode
/Courier-Oblique findfont
dup length dict begin
  {1 index /FID ne {def} {pop pop} ifelse} forall
  /Encoding WinAnsiEncoding def
  currentdict
end
/Courier-Oblique exch definefont pop
/Courier-BoldOblique findfont
dup length dict begin
  {1 index /FID ne {def} {pop pop} ifelse} forall
  /Encoding WinAnsiEncoding def
  currentdict
end
/Courier-BoldOblique exch definefont pop
/Courier-Bold findfont
dup length dict begin
  {1 index /FID ne {def} {pop pop} ifelse} forall
  /Encoding WinAnsiEncoding def
  currentdict
end
/Courier-Bold exch definefont pop
/Helvetica findfont
dup length dict begin
  {1 index /FID ne {def} {pop pop} ifelse} forall
  /Encoding WinAnsiEncoding def
  currentdict
end
/Helvetica exch definefont pop
/Helvetica-Oblique findfont
dup length dict begin
  {1 index /FID ne {def} {pop pop} ifelse} forall
  /Encoding WinAnsiEncoding def
  currentdict
end
/Helvetica-Oblique exch definefont pop
/Helvetica-Bold findfont
dup length dict begin
  {1 index /FID ne {def} {pop pop} ifelse} forall
  /Encoding WinAnsiEncoding def
  currentdict
end
/Helvetica-Bold exch definefont pop
/Helvetica-BoldOblique findfont
dup length dict begin
  {1 index /FID ne {def} {pop pop} ifelse} forall
  /Encoding WinAnsiEncoding def
  currentdict
end
/Helvetica-BoldOblique exch definefont pop
/Times-Roman findfont
dup length dict begin
  {1 index /FID ne {def} {pop pop} ifelse} forall
  /Encoding WinAnsiEncoding def
  currentdict
end
/Times-Roman exch definefont pop
/Times-Italic findfont
dup length dict begin
  {1 index /FID ne {def} {pop pop} ifelse} forall
  /Encoding WinAnsiEncoding def
  currentdict
end
/Times-Italic exch definefont pop
/Times-Bold findfont
dup length dict begin
  {1 index /FID ne {def} {pop pop} ifelse} forall
  /Encoding WinAnsiEncoding def
  currentdict
end
/Times-Bold exch definefont pop
/Times-BoldItalic findfont
dup length dict begin
  {1 index /FID ne {def} {pop pop} ifelse} forall
  /Encoding WinAnsiEncoding def
  currentdict
end
/Times-BoldItalic exch definefont pop
/Courier findfont
dup length dict begin
  {1 index /FID ne {def} {pop pop} ifelse} forall
  /Encoding WinAnsiEncoding def
  currentdict
end
/Courier exch definefont pop
%FOPEndFontReencode
%%EndProlog
%%Page: 1 1
%%PageBoundingBox: 0 0 533 698
%%BeginPageSetup
N
   23    35 M
  513    35 L
  513   708 L
   23   708 L
cp
clip
[1 0 0 -1 0 698] CT
%%EndPageSetup
GS
[0.75 0 0 0.75 0 0.5] CT
1 GC
N
0 0 710 930 re
f
GR
GS
[0.75 0 0 0.75 0 0.5] CT
1 GC
N
0 0 710 930 re
f
GR
GS
[0.75 0 0 0.75 0 0.5] CT
1 GC
N
92 828 M
643 828 L
643 70 L
92 70 L
cp
f
GR
GS
[0.75 0 0 0.75 0 0.5] CT
0.873 GC
1 LJ
0.667 LW
N
92 828 M
92 70 L
S
GR
GS
[0.75 0 0 0.75 0 0.5] CT
0.873 GC
1 LJ
0.667 LW
N
183.833 828 M
183.833 70 L
S
GR
GS
[0.75 0 0 0.75 0 0.5] CT
0.873 GC
1 LJ
0.667 LW
N
275.667 828 M
275.667 70 L
S
GR
GS
[0.75 0 0 0.75 0 0.5] CT
0.873 GC
1 LJ
0.667 LW
N
367.5 828 M
367.5 70 L
S
GR
GS
[0.75 0 0 0.75 0 0.5] CT
0.873 GC
1 LJ
0.667 LW
N
459.333 828 M
459.333 70 L
S
GR
GS
[0.75 0 0 0.75 0 0.5] CT
0.873 GC
1 LJ
0.667 LW
N
551.167 828 M
551.167 70 L
S
GR
GS
[0.75 0 0 0.75 0 0.5] CT
0.873 GC
1 LJ
0.667 LW
N
643 828 M
643 70 L
S
GR
GS
[0.75 0 0 0.75 0 0.5] CT
0.873 GC
1 LJ
0.667 LW
N
643 828 M
92 828 L
S
GR
GS
[0.75 0 0 0.75 0 0.5] CT
0.873 GC
1 LJ
0.667 LW
N
643 720.005 M
92 720.005 L
S
GR
GS
[0.75 0 0 0.75 0 0.5] CT
0.873 GC
1 LJ
0.667 LW
N
643 612.01 M
92 612.01 L
S
GR
GS
[0.75 0 0 0.75 0 0.5] CT
0.873 GC
1 LJ
0.667 LW
N
643 504.014 M
92 504.014 L
S
GR
GS
[0.75 0 0 0.75 0 0.5] CT
0.873 GC
1 LJ
0.667 LW
N
643 396.019 M
92 396.019 L
S
GR
GS
[0.75 0 0 0.75 0 0.5] CT
0.873 GC
1 LJ
0.667 LW
N
643 288.024 M
92 288.024 L
S
GR
GS
[0.75 0 0 0.75 0 0.5] CT
0.873 GC
1 LJ
0.667 LW
N
643 180.029 M
92 180.029 L
S
GR
GS
[0.75 0 0 0.75 0 0.5] CT
0.873 GC
1 LJ
0.667 LW
N
643 72.034 M
92 72.034 L
S
GR
GS
[0.75 0 0 0.75 0 0.5] CT
0.149 GC
2 setlinecap
1 LJ
0.667 LW
N
92 828 M
643 828 L
S
GR
GS
[0.75 0 0 0.75 0 0.5] CT
0.149 GC
2 setlinecap
1 LJ
0.667 LW
N
92 828 M
92 820.42 L
S
GR
GS
[0.75 0 0 0.75 0 0.5] CT
0.149 GC
2 setlinecap
1 LJ
0.667 LW
N
183.833 828 M
183.833 820.42 L
S
GR
GS
[0.75 0 0 0.75 0 0.5] CT
0.149 GC
2 setlinecap
1 LJ
0.667 LW
N
275.667 828 M
275.667 820.42 L
S
GR
GS
[0.75 0 0 0.75 0 0.5] CT
0.149 GC
2 setlinecap
1 LJ
0.667 LW
N
367.5 828 M
367.5 820.42 L
S
GR
GS
[0.75 0 0 0.75 0 0.5] CT
0.149 GC
2 setlinecap
1 LJ
0.667 LW
N
459.333 828 M
459.333 820.42 L
S
GR
GS
[0.75 0 0 0.75 0 0.5] CT
0.149 GC
2 setlinecap
1 LJ
0.667 LW
N
551.167 828 M
551.167 820.42 L
S
GR
GS
[0.75 0 0 0.75 0 0.5] CT
0.149 GC
2 setlinecap
1 LJ
0.667 LW
N
643 828 M
643 820.42 L
S
GR
GS
[0.75 0 0 0.75 69 625.49998] CT
0.149 GC
/Helvetica 13.333 F
GS
[1 0 0 1 0 0] CT
-4 15 moveto 
1 -1 scale
(0) t 
GR
GR
GS
[0.75 0 0 0.75 137.875 625.49998] CT
0.149 GC
/Helvetica 13.333 F
GS
[1 0 0 1 0 0] CT
-8 15 moveto 
1 -1 scale
(50) t 
GR
GR
GS
[0.75 0 0 0.75 206.74999 625.49998] CT
0.149 GC
/Helvetica 13.333 F
GS
[1 0 0 1 0 0] CT
-11.5 15 moveto 
1 -1 scale
(100) t 
GR
GR
GS
[0.75 0 0 0.75 275.625 625.49998] CT
0.149 GC
/Helvetica 13.333 F
GS
[1 0 0 1 0 0] CT
-11.5 15 moveto 
1 -1 scale
(150) t 
GR
GR
GS
[0.75 0 0 0.75 344.50001 625.49998] CT
0.149 GC
/Helvetica 13.333 F
GS
[1 0 0 1 0 0] CT
-11.5 15 moveto 
1 -1 scale
(200) t 
GR
GR
GS
[0.75 0 0 0.75 413.37502 625.49998] CT
0.149 GC
/Helvetica 13.333 F
GS
[1 0 0 1 0 0] CT
-11.5 15 moveto 
1 -1 scale
(250) t 
GR
GR
GS
[0.75 0 0 0.75 482.25 625.49998] CT
0.149 GC
/Helvetica 13.333 F
GS
[1 0 0 1 0 0] CT
-11.5 15 moveto 
1 -1 scale
(300) t 
GR
GR
GS
[0.75 0 0 0.75 275.62518 640.75002] CT
0.149 GC
N
-44.575 22.041 M
-44.56 21.978 -44.513 21.806 QT
-44.466 21.634 -44.396 21.541 QT
-44.325 21.447 -44.185 21.447 QT
-41.872 21.447 -41.122 21.322 QT
-40.388 21.134 -40.247 20.541 QT
-36.56 5.712 L
-36.435 5.384 -36.435 5.119 QT
-36.435 4.9 -37.388 4.9 QT
-38.95 4.9 L
-40.763 4.9 -41.747 5.455 QT
-42.732 6.009 -43.192 6.923 QT
-43.653 7.837 -44.372 9.9 QT
-44.466 10.134 -44.653 10.134 QT
-44.888 10.134 L
-45.169 10.134 -45.169 9.791 QT
-43.232 4.212 L
-43.185 3.962 -42.982 3.962 QT
-27.028 3.962 L
-26.747 3.962 -26.747 4.306 QT
-27.638 9.9 L
-27.638 9.978 -27.732 10.056 QT
-27.825 10.134 -27.903 10.134 QT
-28.153 10.134 L
-28.419 10.134 -28.419 9.791 QT
-28.138 7.884 -28.138 7.087 QT
-28.138 6.15 -28.528 5.658 QT
-28.919 5.166 -29.552 5.033 QT
-30.185 4.9 -31.2 4.9 QT
-32.794 4.9 L
-33.528 4.9 -33.778 5.033 QT
-34.028 5.166 -34.2 5.822 QT
-37.903 20.65 L
-37.919 20.697 -37.919 20.751 QT
-37.919 20.806 -37.95 20.884 QT
-37.95 21.228 -37.544 21.322 QT
-36.841 21.447 -34.544 21.447 QT
-34.294 21.447 -34.294 21.806 QT
-34.372 22.181 -34.427 22.291 QT
-34.482 22.4 -34.732 22.4 QT
-44.294 22.4 L
-44.575 22.4 -44.575 22.041 QT
cp
f
GR
GS
[0.75 0 0 0.75 275.62518 640.75002] CT
0.149 GC
N
-24.413 20.462 M
-24.413 19.962 -24.194 19.4 QT
-22.007 13.587 L
-21.663 12.603 -21.663 11.978 QT
-21.663 11.166 -22.257 11.166 QT
-23.319 11.166 -24.015 12.267 QT
-24.71 13.369 -25.038 14.728 QT
-25.085 14.9 -25.257 14.9 QT
-25.569 14.9 L
-25.804 14.9 -25.804 14.65 QT
-25.804 14.572 L
-25.366 12.962 -24.468 11.712 QT
-23.569 10.462 -22.194 10.462 QT
-21.241 10.462 -20.569 11.095 QT
-19.898 11.728 -19.898 12.712 QT
-19.898 13.212 -20.132 13.759 QT
-22.319 19.572 L
-22.679 20.462 -22.679 21.181 QT
-22.679 21.994 -22.069 21.994 QT
-21.007 21.994 -20.304 20.869 QT
-19.601 19.744 -19.304 18.431 QT
-19.257 18.275 -19.101 18.275 QT
-18.773 18.275 L
-18.663 18.275 -18.601 18.345 QT
-18.538 18.416 -18.538 18.509 QT
-18.538 18.541 -18.554 18.587 QT
-18.929 20.119 -19.843 21.408 QT
-20.757 22.697 -22.116 22.697 QT
-23.069 22.697 -23.741 22.048 QT
-24.413 21.4 -24.413 20.462 QT
cp
-21.366 6.041 M
-21.366 5.478 -20.89 5.017 QT
-20.413 4.556 -19.851 4.556 QT
-19.398 4.556 -19.101 4.837 QT
-18.804 5.119 -18.804 5.556 QT
-18.804 6.15 -19.28 6.611 QT
-19.757 7.072 -20.335 7.072 QT
-20.773 7.072 -21.069 6.775 QT
-21.366 6.478 -21.366 6.041 QT
cp
f
GR
GS
[0.75 0 0 0.75 275.62518 640.75002] CT
0.149 GC
N
-15.257 21.931 M
-15.257 21.775 -15.226 21.697 QT
-13.211 13.65 L
-13.007 12.9 -13.007 12.322 QT
-13.007 11.166 -13.804 11.166 QT
-14.648 11.166 -15.054 12.173 QT
-15.461 13.181 -15.851 14.728 QT
-15.851 14.806 -15.929 14.853 QT
-16.007 14.9 -16.07 14.9 QT
-16.382 14.9 L
-16.476 14.9 -16.547 14.798 QT
-16.617 14.697 -16.617 14.619 QT
-16.32 13.447 -16.047 12.626 QT
-15.773 11.806 -15.203 11.134 QT
-14.632 10.462 -13.773 10.462 QT
-12.757 10.462 -11.984 11.103 QT
-11.211 11.744 -11.211 12.744 QT
-10.398 11.681 -9.32 11.072 QT
-8.242 10.462 -7.023 10.462 QT
-5.742 10.462 -4.812 11.119 QT
-3.882 11.775 -3.882 12.978 QT
-3.054 11.806 -1.945 11.134 QT
-0.836 10.462 0.493 10.462 QT
1.883 10.462 2.735 11.22 QT
3.586 11.978 3.586 13.384 QT
3.586 14.494 3.094 16.064 QT
2.602 17.634 1.868 19.572 QT
1.477 20.494 1.477 21.181 QT
1.477 21.994 2.118 21.994 QT
3.164 21.994 3.86 20.861 QT
4.555 19.728 4.852 18.431 QT
4.93 18.275 5.071 18.275 QT
5.399 18.275 L
5.493 18.275 5.571 18.345 QT
5.649 18.416 5.649 18.509 QT
5.649 18.541 5.618 18.587 QT
5.243 20.119 4.328 21.408 QT
3.414 22.697 2.039 22.697 QT
1.102 22.697 0.43 22.048 QT
-0.242 21.4 -0.242 20.462 QT
-0.242 19.994 -0.023 19.4 QT
0.743 17.384 1.25 15.783 QT
1.758 14.181 1.758 12.978 QT
1.758 12.228 1.453 11.697 QT
1.149 11.166 0.43 11.166 QT
-1.039 11.166 -2.117 12.072 QT
-3.195 12.978 -3.992 14.462 QT
-4.039 14.728 -4.07 14.869 QT
-5.82 21.806 L
-5.898 22.181 -6.226 22.439 QT
-6.554 22.697 -6.945 22.697 QT
-7.257 22.697 -7.507 22.486 QT
-7.757 22.275 -7.757 21.931 QT
-7.757 21.775 -7.726 21.697 QT
-5.992 14.822 L
-5.726 13.712 -5.726 12.978 QT
-5.726 12.228 -6.031 11.697 QT
-6.336 11.166 -7.086 11.166 QT
-8.07 11.166 -8.898 11.603 QT
-9.726 12.041 -10.343 12.759 QT
-10.961 13.478 -11.476 14.462 QT
-13.32 21.806 L
-13.414 22.181 -13.734 22.439 QT
-14.054 22.697 -14.445 22.697 QT
-14.773 22.697 -15.015 22.486 QT
-15.257 22.275 -15.257 21.931 QT
cp
f
GR
GS
[0.75 0 0 0.75 275.62518 640.75002] CT
0.149 GC
N
11.516 22.697 M
10.219 22.697 9.25 22.025 QT
8.281 21.353 7.773 20.212 QT
7.266 19.072 7.266 17.806 QT
7.266 15.884 8.234 14.189 QT
9.203 12.494 10.867 11.478 QT
12.531 10.462 14.422 10.462 QT
15.578 10.462 16.445 11.064 QT
17.313 11.666 17.313 12.791 QT
17.313 14.337 16.07 15.095 QT
14.828 15.853 13.273 16.033 QT
11.719 16.212 9.828 16.212 QT
9.75 16.212 L
9.328 17.822 9.328 18.978 QT
9.328 20.166 9.875 21.08 QT
10.422 21.994 11.563 21.994 QT
13.172 21.994 14.656 21.251 QT
16.141 20.509 17.078 19.212 QT
17.156 19.134 17.281 19.134 QT
17.422 19.134 17.555 19.283 QT
17.688 19.431 17.688 19.572 QT
17.688 19.666 17.641 19.728 QT
16.656 21.103 14.977 21.9 QT
13.297 22.697 11.516 22.697 QT
cp
9.922 15.525 M
11.484 15.525 12.813 15.376 QT
14.141 15.228 15.227 14.642 QT
16.313 14.056 16.313 12.822 QT
16.313 12.322 16.031 11.939 QT
15.75 11.556 15.313 11.361 QT
14.875 11.166 14.391 11.166 QT
13.25 11.166 12.336 11.783 QT
11.422 12.4 10.828 13.4 QT
10.234 14.4 9.922 15.525 QT
cp
f
GR
GS
[0.75 0 0 0.75 275.62518 640.75002] CT
0.149 GC
N
21.682 29.15 M
21.682 2.15 L
25.37 2.15 L
25.37 3.228 L
22.76 3.228 L
22.76 28.072 L
25.37 28.072 L
25.37 29.15 L
21.682 29.15 L
cp
f
GR
GS
[0.75 0 0 0.75 275.62518 640.75002] CT
0.149 GC
N
28.246 20.759 M
28.98 21.994 31.168 21.994 QT
32.105 21.994 32.965 21.666 QT
33.824 21.337 34.387 20.697 QT
34.949 20.056 34.949 19.134 QT
34.949 18.431 34.449 17.986 QT
33.949 17.541 33.215 17.384 QT
31.762 17.087 L
30.762 16.837 30.113 16.15 QT
29.465 15.462 29.465 14.494 QT
29.465 13.291 30.113 12.369 QT
30.762 11.447 31.832 10.955 QT
32.902 10.462 34.043 10.462 QT
35.277 10.462 36.246 11.048 QT
37.215 11.634 37.215 12.791 QT
37.215 13.416 36.863 13.884 QT
36.512 14.353 35.902 14.353 QT
35.543 14.353 35.285 14.126 QT
35.027 13.9 35.027 13.541 QT
35.027 13.228 35.207 12.931 QT
35.387 12.634 35.684 12.455 QT
35.98 12.275 36.293 12.275 QT
36.059 11.697 35.402 11.431 QT
34.746 11.166 33.996 11.166 QT
33.309 11.166 32.621 11.447 QT
31.934 11.728 31.519 12.259 QT
31.105 12.791 31.105 13.509 QT
31.105 14.009 31.449 14.376 QT
31.793 14.744 32.293 14.9 QT
33.871 15.212 L
34.621 15.369 35.246 15.775 QT
35.871 16.181 36.23 16.791 QT
36.59 17.4 36.59 18.197 QT
36.59 19.197 36.035 20.173 QT
35.48 21.15 34.652 21.728 QT
33.215 22.697 31.137 22.697 QT
29.699 22.697 28.496 22.041 QT
27.293 21.384 27.293 20.072 QT
27.293 19.337 27.723 18.791 QT
28.152 18.244 28.902 18.244 QT
29.324 18.244 29.621 18.509 QT
29.918 18.775 29.918 19.212 QT
29.918 19.822 29.457 20.291 QT
28.996 20.759 28.387 20.759 QT
28.246 20.759 L
cp
f
GR
GS
[0.75 0 0 0.75 275.62518 640.75002] CT
0.149 GC
N
38.996 29.15 M
38.996 28.072 L
41.621 28.072 L
41.621 3.228 L
38.996 3.228 L
38.996 2.15 L
42.699 2.15 L
42.699 29.15 L
38.996 29.15 L
cp
f
GR
GS
[0.75 0 0 0.75 0 0.5] CT
0.149 GC
2 setlinecap
1 LJ
0.667 LW
N
92 828 M
92 70 L
S
GR
GS
[0.75 0 0 0.75 0 0.5] CT
0.149 GC
2 setlinecap
1 LJ
0.667 LW
N
92 828 M
99.58 828 L
S
GR
GS
[0.75 0 0 0.75 0 0.5] CT
0.149 GC
2 setlinecap
1 LJ
0.667 LW
N
92 720.005 M
99.58 720.005 L
S
GR
GS
[0.75 0 0 0.75 0 0.5] CT
0.149 GC
2 setlinecap
1 LJ
0.667 LW
N
92 612.01 M
99.58 612.01 L
S
GR
GS
[0.75 0 0 0.75 0 0.5] CT
0.149 GC
2 setlinecap
1 LJ
0.667 LW
N
92 504.014 M
99.58 504.014 L
S
GR
GS
[0.75 0 0 0.75 0 0.5] CT
0.149 GC
2 setlinecap
1 LJ
0.667 LW
N
92 396.019 M
99.58 396.019 L
S
GR
GS
[0.75 0 0 0.75 0 0.5] CT
0.149 GC
2 setlinecap
1 LJ
0.667 LW
N
92 288.024 M
99.58 288.024 L
S
GR
GS
[0.75 0 0 0.75 0 0.5] CT
0.149 GC
2 setlinecap
1 LJ
0.667 LW
N
92 180.029 M
99.58 180.029 L
S
GR
GS
[0.75 0 0 0.75 0 0.5] CT
0.149 GC
2 setlinecap
1 LJ
0.667 LW
N
92 72.034 M
99.58 72.034 L
S
GR
GS
[0.75 0 0 0.75 65 621.5] CT
0.149 GC
/Helvetica 13.333 F
GS
[1 0 0 1 0 0] CT
-8 5.5 moveto 
1 -1 scale
(0) t 
GR
GR
GS
[0.75 0 0 0.75 65 540.50357] CT
0.149 GC
/Helvetica 13.333 F
GS
[1 0 0 1 0 0] CT
-23 5.5 moveto 
1 -1 scale
(100) t 
GR
GR
GS
[0.75 0 0 0.75 65 459.50719] CT
0.149 GC
/Helvetica 13.333 F
GS
[1 0 0 1 0 0] CT
-23 5.5 moveto 
1 -1 scale
(200) t 
GR
GR
GS
[0.75 0 0 0.75 65 378.51078] CT
0.149 GC
/Helvetica 13.333 F
GS
[1 0 0 1 0 0] CT
-23 5.5 moveto 
1 -1 scale
(300) t 
GR
GR
GS
[0.75 0 0 0.75 65 297.51437] CT
0.149 GC
/Helvetica 13.333 F
GS
[1 0 0 1 0 0] CT
-23 5.5 moveto 
1 -1 scale
(400) t 
GR
GR
GS
[0.75 0 0 0.75 65 216.51794] CT
0.149 GC
/Helvetica 13.333 F
GS
[1 0 0 1 0 0] CT
-23 5.5 moveto 
1 -1 scale
(500) t 
GR
GR
GS
[0.75 0 0 0.75 65 135.52155] CT
0.149 GC
/Helvetica 13.333 F
GS
[1 0 0 1 0 0] CT
-23 5.5 moveto 
1 -1 scale
(600) t 
GR
GR
GS
[0.75 0 0 0.75 65 54.52514] CT
0.149 GC
/Helvetica 13.333 F
GS
[1 0 0 1 0 0] CT
-23 5.5 moveto 
1 -1 scale
(700) t 
GR
GR
GS
[0 -0.75 0.75 0 44.75 337.24973] CT
0.149 GC
N
-29.917 -9.303 M
-32.089 -26.506 L
-32.277 -27.1 -34.12 -27.1 QT
-34.386 -27.1 -34.386 -27.444 QT
-34.324 -27.741 -34.245 -27.889 QT
-34.167 -28.038 -33.933 -28.038 QT
-27.339 -28.038 L
-27.199 -28.038 -27.128 -27.936 QT
-27.058 -27.834 -27.058 -27.694 QT
-27.167 -27.1 -27.417 -27.1 QT
-29.527 -27.1 -29.667 -26.366 QT
-27.886 -12.256 L
-19.558 -25.522 L
-19.324 -25.975 -19.324 -26.241 QT
-19.324 -26.709 -19.753 -26.905 QT
-20.183 -27.1 -20.745 -27.1 QT
-21.027 -27.1 -21.027 -27.444 QT
-20.98 -27.663 -20.933 -27.78 QT
-20.886 -27.897 -20.808 -27.967 QT
-20.73 -28.038 -20.558 -28.038 QT
-15.355 -28.038 L
-15.105 -28.038 -15.105 -27.694 QT
-15.214 -27.1 -15.464 -27.1 QT
-17.495 -27.1 -18.636 -25.319 QT
-18.699 -25.256 -18.73 -25.256 QT
-28.683 -9.303 L
-28.886 -9.006 -29.199 -9.006 QT
-29.589 -9.006 L
-29.886 -9.006 -29.917 -9.303 QT
cp
f
GR
GS
[0 -0.75 0.75 0 44.75 337.24973] CT
0.149 GC
N
-9.701 -9.303 M
-11.389 -9.303 -12.373 -10.584 QT
-13.358 -11.866 -13.358 -13.616 QT
-13.358 -15.35 -12.459 -17.209 QT
-11.561 -19.069 -10.045 -20.303 QT
-8.53 -21.538 -6.764 -21.538 QT
-5.967 -21.538 -5.334 -21.1 QT
-4.701 -20.663 -4.342 -19.913 QT
-4.045 -20.991 -3.155 -20.991 QT
-2.811 -20.991 -2.584 -20.788 QT
-2.358 -20.584 -2.358 -20.241 QT
-2.358 -20.163 -2.358 -20.124 QT
-2.358 -20.084 -2.373 -20.022 QT
-4.264 -12.491 L
-4.451 -11.678 -4.451 -11.163 QT
-4.451 -10.006 -3.67 -10.006 QT
-2.826 -10.006 -2.381 -11.084 QT
-1.936 -12.163 -1.639 -13.569 QT
-1.592 -13.725 -1.436 -13.725 QT
-1.092 -13.725 L
-0.998 -13.725 -0.928 -13.631 QT
-0.858 -13.538 -0.858 -13.459 QT
-1.342 -11.584 -1.897 -10.444 QT
-2.451 -9.303 -3.717 -9.303 QT
-4.639 -9.303 -5.334 -9.834 QT
-6.03 -10.366 -6.201 -11.241 QT
-7.936 -9.303 -9.701 -9.303 QT
cp
-9.67 -10.006 M
-8.686 -10.006 -7.772 -10.741 QT
-6.858 -11.475 -6.201 -12.459 QT
-6.17 -12.491 -6.17 -12.538 QT
-4.733 -18.413 L
-4.701 -18.491 L
-4.858 -19.444 -5.389 -20.139 QT
-5.92 -20.834 -6.842 -20.834 QT
-7.748 -20.834 -8.53 -20.092 QT
-9.311 -19.35 -9.858 -18.334 QT
-10.373 -17.241 -10.858 -15.358 QT
-11.342 -13.475 -11.342 -12.428 QT
-11.342 -11.506 -10.944 -10.756 QT
-10.545 -10.006 -9.67 -10.006 QT
cp
f
GR
GS
[0 -0.75 0.75 0 44.75 337.24973] CT
0.149 GC
N
0.894 -11.788 M
0.894 -11.866 0.91 -12.022 QT
0.925 -12.178 0.949 -12.334 QT
0.972 -12.491 0.972 -12.569 QT
4.316 -25.928 L
4.425 -26.397 4.457 -26.663 QT
4.457 -27.1 2.707 -27.1 QT
2.441 -27.1 2.441 -27.444 QT
2.457 -27.522 2.496 -27.694 QT
2.535 -27.866 2.613 -27.952 QT
2.691 -28.038 2.816 -28.038 QT
6.457 -28.334 L
6.785 -28.334 6.785 -27.991 QT
2.894 -12.459 L
2.707 -12.022 2.707 -11.163 QT
2.707 -10.006 3.488 -10.006 QT
4.316 -10.006 4.73 -11.045 QT
5.144 -12.084 5.488 -13.569 QT
5.535 -13.725 5.707 -13.725 QT
6.019 -13.725 L
6.129 -13.725 6.199 -13.639 QT
6.269 -13.553 6.269 -13.459 QT
5.957 -12.163 5.699 -11.405 QT
5.441 -10.647 4.871 -9.975 QT
4.3 -9.303 3.441 -9.303 QT
2.363 -9.303 1.629 -9.999 QT
0.894 -10.694 0.894 -11.788 QT
cp
f
GR
GS
[0 -0.75 0.75 0 44.75 337.24973] CT
0.149 GC
N
11.048 -12.538 M
11.048 -13.428 11.282 -14.358 QT
11.516 -15.288 11.946 -16.428 QT
12.376 -17.569 12.704 -18.413 QT
13.048 -19.397 13.048 -20.022 QT
13.048 -20.834 12.454 -20.834 QT
11.391 -20.834 10.696 -19.733 QT
10.001 -18.631 9.673 -17.272 QT
9.626 -17.1 9.454 -17.1 QT
9.141 -17.1 L
8.907 -17.1 8.907 -17.35 QT
8.907 -17.428 L
9.344 -19.038 10.243 -20.288 QT
11.141 -21.538 12.516 -21.538 QT
13.469 -21.538 14.141 -20.905 QT
14.813 -20.272 14.813 -19.288 QT
14.813 -18.788 14.579 -18.241 QT
14.469 -17.913 14.048 -16.803 QT
13.626 -15.694 13.399 -14.967 QT
13.173 -14.241 13.024 -13.545 QT
12.876 -12.85 12.876 -12.147 QT
12.876 -11.241 13.259 -10.624 QT
13.641 -10.006 14.501 -10.006 QT
16.235 -10.006 17.532 -12.147 QT
17.563 -12.256 17.579 -12.35 QT
17.594 -12.444 17.61 -12.538 QT
19.548 -20.366 L
19.641 -20.725 19.969 -20.983 QT
20.298 -21.241 20.688 -21.241 QT
21.016 -21.241 21.259 -21.03 QT
21.501 -20.819 21.501 -20.475 QT
21.501 -20.319 21.485 -20.272 QT
19.532 -12.491 L
19.344 -11.678 19.344 -11.163 QT
19.344 -10.006 20.126 -10.006 QT
20.985 -10.006 21.415 -11.084 QT
21.844 -12.163 22.157 -13.569 QT
22.204 -13.725 22.36 -13.725 QT
22.688 -13.725 L
22.798 -13.725 22.86 -13.631 QT
22.923 -13.538 22.923 -13.459 QT
22.641 -12.303 22.368 -11.475 QT
22.094 -10.647 21.516 -9.975 QT
20.938 -9.303 20.063 -9.303 QT
19.204 -9.303 18.524 -9.772 QT
17.844 -10.241 17.61 -11.038 QT
17.001 -10.241 16.18 -9.772 QT
15.36 -9.303 14.454 -9.303 QT
12.891 -9.303 11.969 -10.147 QT
11.048 -10.991 11.048 -12.538 QT
cp
f
GR
GS
[0 -0.75 0.75 0 44.75 337.24973] CT
0.149 GC
N
28.891 -9.303 M
27.594 -9.303 26.626 -9.975 QT
25.657 -10.647 25.149 -11.788 QT
24.641 -12.928 24.641 -14.194 QT
24.641 -16.116 25.61 -17.811 QT
26.579 -19.506 28.243 -20.522 QT
29.907 -21.538 31.798 -21.538 QT
32.954 -21.538 33.821 -20.936 QT
34.688 -20.334 34.688 -19.209 QT
34.688 -17.663 33.446 -16.905 QT
32.204 -16.147 30.649 -15.967 QT
29.094 -15.788 27.204 -15.788 QT
27.126 -15.788 L
26.704 -14.178 26.704 -13.022 QT
26.704 -11.834 27.251 -10.92 QT
27.798 -10.006 28.938 -10.006 QT
30.548 -10.006 32.032 -10.749 QT
33.516 -11.491 34.454 -12.788 QT
34.532 -12.866 34.657 -12.866 QT
34.798 -12.866 34.93 -12.717 QT
35.063 -12.569 35.063 -12.428 QT
35.063 -12.334 35.016 -12.272 QT
34.032 -10.897 32.352 -10.1 QT
30.673 -9.303 28.891 -9.303 QT
cp
27.298 -16.475 M
28.86 -16.475 30.188 -16.624 QT
31.516 -16.772 32.602 -17.358 QT
33.688 -17.944 33.688 -19.178 QT
33.688 -19.678 33.407 -20.061 QT
33.126 -20.444 32.688 -20.639 QT
32.251 -20.834 31.766 -20.834 QT
30.626 -20.834 29.712 -20.217 QT
28.798 -19.6 28.204 -18.6 QT
27.61 -17.6 27.298 -16.475 QT
cp
f
GR
GS
[0.75 0 0 0.75 275.62527 48.87497] CT
N
-240.11 -10.56 M
-240.11 -11.576 L
-236.985 -11.576 -236.985 -12.498 QT
-236.985 -28.435 L
-236.985 -29.357 -240.11 -29.357 QT
-240.11 -30.373 L
-231.141 -30.373 L
-231.141 -29.357 L
-234.282 -29.357 -234.282 -28.435 QT
-234.282 -12.498 L
-234.282 -11.576 -231.141 -11.576 QT
-231.141 -10.56 L
-240.11 -10.56 L
cp
f
GR
GS
[0.75 0 0 0.75 275.62527 48.87497] CT
N
-229.408 -10.56 M
-229.408 -11.576 L
-228.408 -11.576 -227.775 -11.732 QT
-227.142 -11.888 -227.142 -12.498 QT
-227.142 -20.419 L
-227.142 -21.201 -227.377 -21.544 QT
-227.611 -21.888 -228.048 -21.966 QT
-228.486 -22.044 -229.408 -22.044 QT
-229.408 -23.06 L
-225.205 -23.373 L
-225.205 -20.544 L
-224.611 -21.794 -223.47 -22.584 QT
-222.33 -23.373 -220.986 -23.373 QT
-218.986 -23.373 -217.97 -22.412 QT
-216.955 -21.451 -216.955 -19.466 QT
-216.955 -12.498 L
-216.955 -11.888 -216.322 -11.732 QT
-215.689 -11.576 -214.689 -11.576 QT
-214.689 -10.56 L
-221.33 -10.56 L
-221.33 -11.576 L
-220.345 -11.576 -219.705 -11.732 QT
-219.064 -11.888 -219.064 -12.498 QT
-219.064 -19.388 L
-219.064 -20.794 -219.478 -21.709 QT
-219.892 -22.623 -221.158 -22.623 QT
-222.845 -22.623 -223.931 -21.279 QT
-225.017 -19.935 -225.017 -18.216 QT
-225.017 -12.498 L
-225.017 -11.888 -224.377 -11.732 QT
-223.736 -11.576 -222.767 -11.576 QT
-222.767 -10.56 L
-229.408 -10.56 L
cp
f
GR
GS
[0.75 0 0 0.75 275.62527 48.87497] CT
N
-206.752 -10.232 M
-208.502 -10.232 -209.932 -11.146 QT
-211.361 -12.06 -212.182 -13.584 QT
-213.002 -15.107 -213.002 -16.826 QT
-213.002 -18.529 -212.19 -20.099 QT
-211.377 -21.669 -209.94 -22.615 QT
-208.502 -23.56 -206.752 -23.56 QT
-205.049 -23.56 -203.658 -22.896 QT
-202.268 -22.232 -202.268 -20.716 QT
-202.268 -20.154 -202.666 -19.732 QT
-203.065 -19.31 -203.643 -19.31 QT
-204.221 -19.31 -204.627 -19.732 QT
-205.033 -20.154 -205.033 -20.716 QT
-205.033 -21.216 -204.705 -21.591 QT
-204.377 -21.966 -203.908 -22.076 QT
-204.908 -22.716 -206.721 -22.716 QT
-208.111 -22.716 -208.963 -21.794 QT
-209.815 -20.873 -210.151 -19.513 QT
-210.486 -18.154 -210.486 -16.826 QT
-210.486 -15.419 -210.072 -14.107 QT
-209.658 -12.794 -208.729 -11.943 QT
-207.799 -11.091 -206.393 -11.091 QT
-205.018 -11.091 -204.057 -11.927 QT
-203.096 -12.763 -202.736 -14.123 QT
-202.736 -14.294 -202.518 -14.294 QT
-202.158 -14.294 L
-202.08 -14.294 -202.01 -14.216 QT
-201.94 -14.138 -201.94 -14.044 QT
-201.94 -13.966 L
-202.377 -12.248 -203.682 -11.24 QT
-204.986 -10.232 -206.752 -10.232 QT
cp
f
GR
GS
[0.75 0 0 0.75 275.62527 48.87497] CT
N
-197.809 -14.013 M
-197.809 -20.419 L
-197.809 -21.201 -198.043 -21.544 QT
-198.278 -21.888 -198.715 -21.966 QT
-199.153 -22.044 -200.074 -22.044 QT
-200.074 -23.06 L
-195.684 -23.373 L
-195.684 -14.013 L
-195.684 -12.888 -195.52 -12.255 QT
-195.356 -11.623 -194.824 -11.31 QT
-194.293 -10.998 -193.137 -10.998 QT
-191.574 -10.998 -190.653 -12.302 QT
-189.731 -13.607 -189.731 -15.263 QT
-189.731 -20.419 L
-189.731 -21.201 -189.973 -21.544 QT
-190.215 -21.888 -190.645 -21.966 QT
-191.074 -22.044 -191.996 -22.044 QT
-191.996 -23.06 L
-187.621 -23.373 L
-187.621 -13.201 L
-187.621 -12.435 -187.387 -12.084 QT
-187.153 -11.732 -186.715 -11.654 QT
-186.278 -11.576 -185.356 -11.576 QT
-185.356 -10.56 L
-189.653 -10.232 L
-189.653 -12.685 L
-190.184 -11.591 -191.145 -10.912 QT
-192.106 -10.232 -193.278 -10.232 QT
-195.356 -10.232 -196.582 -11.115 QT
-197.809 -11.998 -197.809 -14.013 QT
cp
f
GR
GS
[0.75 0 0 0.75 275.62527 48.87497] CT
N
-183.778 -10.56 M
-183.778 -11.576 L
-182.778 -11.576 -182.145 -11.732 QT
-181.512 -11.888 -181.512 -12.498 QT
-181.512 -20.419 L
-181.512 -21.201 -181.747 -21.544 QT
-181.981 -21.888 -182.419 -21.966 QT
-182.856 -22.044 -183.778 -22.044 QT
-183.778 -23.06 L
-179.575 -23.373 L
-179.575 -20.544 L
-178.981 -21.794 -177.841 -22.584 QT
-176.7 -23.373 -175.356 -23.373 QT
-172.028 -23.373 -171.434 -20.654 QT
-170.856 -21.873 -169.739 -22.623 QT
-168.622 -23.373 -167.294 -23.373 QT
-165.981 -23.373 -165.075 -22.951 QT
-164.169 -22.529 -163.716 -21.654 QT
-163.262 -20.779 -163.262 -19.466 QT
-163.262 -12.498 L
-163.262 -11.888 -162.622 -11.732 QT
-161.981 -11.576 -160.997 -11.576 QT
-160.997 -10.56 L
-167.637 -10.56 L
-167.637 -11.576 L
-166.653 -11.576 -166.012 -11.732 QT
-165.372 -11.888 -165.372 -12.498 QT
-165.372 -19.388 L
-165.372 -20.841 -165.786 -21.732 QT
-166.2 -22.623 -167.481 -22.623 QT
-169.153 -22.623 -170.239 -21.279 QT
-171.325 -19.935 -171.325 -18.216 QT
-171.325 -12.498 L
-171.325 -11.888 -170.692 -11.732 QT
-170.059 -11.576 -169.059 -11.576 QT
-169.059 -10.56 L
-175.7 -10.56 L
-175.7 -11.576 L
-174.716 -11.576 -174.075 -11.732 QT
-173.434 -11.888 -173.434 -12.498 QT
-173.434 -19.388 L
-173.434 -20.794 -173.848 -21.709 QT
-174.262 -22.623 -175.528 -22.623 QT
-177.216 -22.623 -178.301 -21.279 QT
-179.387 -19.935 -179.387 -18.216 QT
-179.387 -12.498 L
-179.387 -11.888 -178.747 -11.732 QT
-178.106 -11.576 -177.137 -11.576 QT
-177.137 -10.56 L
-183.778 -10.56 L
cp
f
GR
GS
[0.75 0 0 0.75 275.62527 48.87497] CT
N
-157.992 -10.56 M
-157.992 -27.716 L
-157.992 -28.498 -158.227 -28.849 QT
-158.461 -29.201 -158.898 -29.279 QT
-159.336 -29.357 -160.258 -29.357 QT
-160.258 -30.373 L
-155.961 -30.685 L
-155.961 -21.607 L
-155.492 -22.138 -154.844 -22.544 QT
-154.195 -22.951 -153.461 -23.162 QT
-152.727 -23.373 -151.961 -23.373 QT
-150.664 -23.373 -149.547 -22.849 QT
-148.43 -22.326 -147.609 -21.404 QT
-146.789 -20.482 -146.328 -19.287 QT
-145.867 -18.091 -145.867 -16.826 QT
-145.867 -15.06 -146.727 -13.544 QT
-147.586 -12.029 -149.062 -11.13 QT
-150.539 -10.232 -152.32 -10.232 QT
-153.414 -10.232 -154.453 -10.802 QT
-155.492 -11.373 -156.164 -12.294 QT
-157.148 -10.56 L
-157.992 -10.56 L
cp
-155.883 -13.404 M
-155.398 -12.341 -154.492 -11.669 QT
-153.586 -10.998 -152.477 -10.998 QT
-150.977 -10.998 -150.055 -11.865 QT
-149.133 -12.732 -148.766 -14.044 QT
-148.398 -15.357 -148.398 -16.826 QT
-148.398 -19.263 -149.023 -20.544 QT
-149.305 -21.107 -149.797 -21.591 QT
-150.289 -22.076 -150.891 -22.349 QT
-151.492 -22.623 -152.164 -22.623 QT
-153.32 -22.623 -154.312 -22.005 QT
-155.305 -21.388 -155.883 -20.357 QT
-155.883 -13.404 L
cp
f
GR
GS
[0.75 0 0 0.75 275.62527 48.87497] CT
N
-136.678 -10.232 M
-138.443 -10.232 -139.92 -11.162 QT
-141.397 -12.091 -142.24 -13.638 QT
-143.084 -15.185 -143.084 -16.919 QT
-143.084 -18.623 -142.318 -20.146 QT
-141.553 -21.669 -140.17 -22.615 QT
-138.787 -23.56 -137.084 -23.56 QT
-135.756 -23.56 -134.772 -23.115 QT
-133.787 -22.669 -133.147 -21.873 QT
-132.506 -21.076 -132.186 -20.005 QT
-131.865 -18.935 -131.865 -17.638 QT
-131.865 -17.263 -132.162 -17.263 QT
-140.553 -17.263 L
-140.553 -16.951 L
-140.553 -14.544 -139.584 -12.818 QT
-138.615 -11.091 -136.412 -11.091 QT
-135.522 -11.091 -134.764 -11.482 QT
-134.006 -11.873 -133.451 -12.584 QT
-132.897 -13.294 -132.693 -14.107 QT
-132.662 -14.201 -132.584 -14.279 QT
-132.506 -14.357 -132.412 -14.357 QT
-132.162 -14.357 L
-131.865 -14.357 -131.865 -13.982 QT
-132.272 -12.341 -133.631 -11.287 QT
-134.99 -10.232 -136.678 -10.232 QT
cp
-140.522 -17.982 M
-133.912 -17.982 L
-133.912 -19.076 -134.217 -20.193 QT
-134.522 -21.31 -135.233 -22.052 QT
-135.943 -22.794 -137.084 -22.794 QT
-138.725 -22.794 -139.623 -21.255 QT
-140.522 -19.716 -140.522 -17.982 QT
cp
f
GR
GS
[0.75 0 0 0.75 275.62527 48.87497] CT
N
-130 -10.56 M
-130 -11.576 L
-129 -11.576 -128.367 -11.732 QT
-127.735 -11.888 -127.735 -12.498 QT
-127.735 -20.419 L
-127.735 -21.201 -127.969 -21.544 QT
-128.203 -21.888 -128.641 -21.966 QT
-129.078 -22.044 -130 -22.044 QT
-130 -23.06 L
-125.797 -23.373 L
-125.797 -20.544 L
-125.203 -21.794 -124.063 -22.584 QT
-122.922 -23.373 -121.578 -23.373 QT
-119.578 -23.373 -118.563 -22.412 QT
-117.547 -21.451 -117.547 -19.466 QT
-117.547 -12.498 L
-117.547 -11.888 -116.914 -11.732 QT
-116.281 -11.576 -115.281 -11.576 QT
-115.281 -10.56 L
-121.922 -10.56 L
-121.922 -11.576 L
-120.938 -11.576 -120.297 -11.732 QT
-119.656 -11.888 -119.656 -12.498 QT
-119.656 -19.388 L
-119.656 -20.794 -120.07 -21.709 QT
-120.485 -22.623 -121.75 -22.623 QT
-123.438 -22.623 -124.524 -21.279 QT
-125.61 -19.935 -125.61 -18.216 QT
-125.61 -12.498 L
-125.61 -11.888 -124.969 -11.732 QT
-124.328 -11.576 -123.36 -11.576 QT
-123.36 -10.56 L
-130 -10.56 L
cp
f
GR
GS
[0.75 0 0 0.75 275.62527 48.87497] CT
N
-112.425 -14.044 M
-112.425 -22.044 L
-114.831 -22.044 L
-114.831 -22.794 L
-112.925 -22.794 -112.034 -24.568 QT
-111.144 -26.341 -111.144 -28.404 QT
-110.316 -28.404 L
-110.316 -23.06 L
-106.222 -23.06 L
-106.222 -22.044 L
-110.316 -22.044 L
-110.316 -14.107 L
-110.316 -12.904 -109.909 -11.998 QT
-109.503 -11.091 -108.456 -11.091 QT
-107.456 -11.091 -107.019 -12.044 QT
-106.581 -12.998 -106.581 -14.107 QT
-106.581 -15.81 L
-105.753 -15.81 L
-105.753 -14.044 L
-105.753 -13.138 -106.081 -12.255 QT
-106.409 -11.373 -107.066 -10.802 QT
-107.722 -10.232 -108.659 -10.232 QT
-110.394 -10.232 -111.409 -11.271 QT
-112.425 -12.31 -112.425 -14.044 QT
cp
f
GR
GS
[0.75 0 0 0.75 275.62527 48.87497] CT
N
-93.037 -13.404 M
-93.037 -15.138 -91.677 -16.216 QT
-90.318 -17.294 -88.412 -17.74 QT
-86.505 -18.185 -84.787 -18.185 QT
-84.787 -19.388 L
-84.787 -20.216 -85.154 -21.005 QT
-85.521 -21.794 -86.216 -22.294 QT
-86.912 -22.794 -87.755 -22.794 QT
-89.677 -22.794 -90.677 -21.935 QT
-90.13 -21.935 -89.771 -21.513 QT
-89.412 -21.091 -89.412 -20.544 QT
-89.412 -19.966 -89.818 -19.552 QT
-90.224 -19.138 -90.787 -19.138 QT
-91.38 -19.138 -91.787 -19.552 QT
-92.193 -19.966 -92.193 -20.544 QT
-92.193 -22.076 -90.81 -22.818 QT
-89.427 -23.56 -87.755 -23.56 QT
-86.568 -23.56 -85.38 -23.06 QT
-84.193 -22.56 -83.435 -21.623 QT
-82.677 -20.685 -82.677 -19.435 QT
-82.677 -12.904 L
-82.677 -12.341 -82.435 -11.865 QT
-82.193 -11.388 -81.693 -11.388 QT
-81.208 -11.388 -80.974 -11.873 QT
-80.74 -12.357 -80.74 -12.904 QT
-80.74 -14.763 L
-79.896 -14.763 L
-79.896 -12.904 L
-79.896 -12.263 -80.232 -11.677 QT
-80.568 -11.091 -81.146 -10.74 QT
-81.724 -10.388 -82.38 -10.388 QT
-83.24 -10.388 -83.849 -11.044 QT
-84.458 -11.701 -84.537 -12.607 QT
-85.068 -11.529 -86.115 -10.88 QT
-87.162 -10.232 -88.365 -10.232 QT
-89.458 -10.232 -90.529 -10.56 QT
-91.599 -10.888 -92.318 -11.591 QT
-93.037 -12.294 -93.037 -13.404 QT
cp
-90.677 -13.404 M
-90.677 -12.388 -89.927 -11.693 QT
-89.177 -10.998 -88.162 -10.998 QT
-87.224 -10.998 -86.458 -11.466 QT
-85.693 -11.935 -85.24 -12.74 QT
-84.787 -13.544 -84.787 -14.435 QT
-84.787 -17.451 L
-86.115 -17.451 -87.49 -17.021 QT
-88.865 -16.591 -89.771 -15.669 QT
-90.677 -14.748 -90.677 -13.404 QT
cp
f
GR
GS
[0.75 0 0 0.75 275.62527 48.87497] CT
N
-78.667 -10.56 M
-78.667 -11.576 L
-77.667 -11.576 -77.034 -11.732 QT
-76.401 -11.888 -76.401 -12.498 QT
-76.401 -20.419 L
-76.401 -21.201 -76.635 -21.544 QT
-76.87 -21.888 -77.307 -21.966 QT
-77.745 -22.044 -78.667 -22.044 QT
-78.667 -23.06 L
-74.464 -23.373 L
-74.464 -20.544 L
-73.87 -21.794 -72.729 -22.584 QT
-71.589 -23.373 -70.245 -23.373 QT
-68.245 -23.373 -67.229 -22.412 QT
-66.214 -21.451 -66.214 -19.466 QT
-66.214 -12.498 L
-66.214 -11.888 -65.581 -11.732 QT
-64.948 -11.576 -63.948 -11.576 QT
-63.948 -10.56 L
-70.589 -10.56 L
-70.589 -11.576 L
-69.604 -11.576 -68.964 -11.732 QT
-68.323 -11.888 -68.323 -12.498 QT
-68.323 -19.388 L
-68.323 -20.794 -68.737 -21.709 QT
-69.151 -22.623 -70.417 -22.623 QT
-72.104 -22.623 -73.19 -21.279 QT
-74.276 -19.935 -74.276 -18.216 QT
-74.276 -12.498 L
-74.276 -11.888 -73.635 -11.732 QT
-72.995 -11.576 -72.026 -11.576 QT
-72.026 -10.56 L
-78.667 -10.56 L
cp
f
GR
GS
[0.75 0 0 0.75 275.62527 48.87497] CT
N
-56.152 -10.232 M
-57.87 -10.232 -59.284 -11.162 QT
-60.699 -12.091 -61.48 -13.607 QT
-62.261 -15.123 -62.261 -16.826 QT
-62.261 -18.576 -61.409 -20.084 QT
-60.558 -21.591 -59.081 -22.482 QT
-57.605 -23.373 -55.839 -23.373 QT
-54.777 -23.373 -53.831 -22.927 QT
-52.886 -22.482 -52.183 -21.685 QT
-52.183 -27.716 L
-52.183 -28.498 -52.417 -28.849 QT
-52.652 -29.201 -53.081 -29.279 QT
-53.511 -29.357 -54.433 -29.357 QT
-54.433 -30.373 L
-50.152 -30.685 L
-50.152 -13.201 L
-50.152 -12.435 -49.917 -12.084 QT
-49.683 -11.732 -49.245 -11.654 QT
-48.808 -11.576 -47.902 -11.576 QT
-47.902 -10.56 L
-52.277 -10.232 L
-52.277 -12.06 L
-53.027 -11.201 -54.058 -10.716 QT
-55.089 -10.232 -56.152 -10.232 QT
cp
-59.105 -13.076 M
-58.62 -12.138 -57.792 -11.568 QT
-56.964 -10.998 -55.98 -10.998 QT
-54.777 -10.998 -53.769 -11.693 QT
-52.761 -12.388 -52.277 -13.498 QT
-52.277 -20.451 L
-52.605 -21.076 -53.12 -21.584 QT
-53.636 -22.091 -54.284 -22.357 QT
-54.933 -22.623 -55.652 -22.623 QT
-57.167 -22.623 -58.089 -21.763 QT
-59.011 -20.904 -59.378 -19.576 QT
-59.745 -18.248 -59.745 -16.794 QT
-59.745 -15.623 -59.628 -14.763 QT
-59.511 -13.904 -59.105 -13.076 QT
cp
f
GR
GS
[0.75 0 0 0.75 275.62527 48.87497] CT
N
-36.171 -10.56 M
-36.171 -11.576 L
-33.171 -11.576 -33.171 -12.498 QT
-33.171 -28.435 L
-33.171 -29.357 -36.171 -29.357 QT
-36.171 -30.373 L
-25.499 -30.373 L
-24.031 -30.373 -22.531 -29.794 QT
-21.031 -29.216 -20.046 -28.091 QT
-19.062 -26.966 -19.062 -25.435 QT
-19.062 -23.669 -20.515 -22.474 QT
-21.968 -21.279 -23.906 -20.904 QT
-22.64 -20.904 -21.312 -20.216 QT
-19.984 -19.529 -19.132 -18.365 QT
-18.281 -17.201 -18.281 -15.904 QT
-18.281 -14.31 -19.218 -13.091 QT
-20.156 -11.873 -21.663 -11.216 QT
-23.171 -10.56 -24.687 -10.56 QT
-36.171 -10.56 L
cp
-30.656 -12.498 M
-30.656 -11.873 -30.304 -11.724 QT
-29.953 -11.576 -29.187 -11.576 QT
-25.499 -11.576 L
-24.374 -11.576 -23.398 -12.169 QT
-22.421 -12.763 -21.859 -13.763 QT
-21.296 -14.763 -21.296 -15.904 QT
-21.296 -16.998 -21.765 -18.052 QT
-22.234 -19.107 -23.101 -19.787 QT
-23.968 -20.466 -25.093 -20.466 QT
-30.656 -20.466 L
-30.656 -12.498 L
cp
-30.656 -21.232 M
-26.312 -21.232 L
-25.437 -21.232 -24.663 -21.552 QT
-23.89 -21.873 -23.273 -22.474 QT
-22.656 -23.076 -22.32 -23.834 QT
-21.984 -24.591 -21.984 -25.435 QT
-21.984 -26.201 -22.234 -26.888 QT
-22.484 -27.576 -22.968 -28.146 QT
-23.453 -28.716 -24.101 -29.037 QT
-24.749 -29.357 -25.499 -29.357 QT
-29.187 -29.357 L
-29.703 -29.357 -29.992 -29.31 QT
-30.281 -29.263 -30.468 -29.06 QT
-30.656 -28.857 -30.656 -28.435 QT
-30.656 -21.232 L
cp
f
GR
GS
[0.75 0 0 0.75 275.62527 48.87497] CT
N
-9.159 -10.232 M
-10.925 -10.232 -12.401 -11.162 QT
-13.878 -12.091 -14.722 -13.638 QT
-15.565 -15.185 -15.565 -16.919 QT
-15.565 -18.623 -14.8 -20.146 QT
-14.034 -21.669 -12.651 -22.615 QT
-11.268 -23.56 -9.565 -23.56 QT
-8.237 -23.56 -7.253 -23.115 QT
-6.268 -22.669 -5.628 -21.873 QT
-4.987 -21.076 -4.667 -20.005 QT
-4.347 -18.935 -4.347 -17.638 QT
-4.347 -17.263 -4.643 -17.263 QT
-13.034 -17.263 L
-13.034 -16.951 L
-13.034 -14.544 -12.065 -12.818 QT
-11.097 -11.091 -8.893 -11.091 QT
-8.003 -11.091 -7.245 -11.482 QT
-6.487 -11.873 -5.932 -12.584 QT
-5.378 -13.294 -5.175 -14.107 QT
-5.143 -14.201 -5.065 -14.279 QT
-4.987 -14.357 -4.893 -14.357 QT
-4.643 -14.357 L
-4.347 -14.357 -4.347 -13.982 QT
-4.753 -12.341 -6.112 -11.287 QT
-7.472 -10.232 -9.159 -10.232 QT
cp
-13.003 -17.982 M
-6.393 -17.982 L
-6.393 -19.076 -6.698 -20.193 QT
-7.003 -21.31 -7.714 -22.052 QT
-8.425 -22.794 -9.565 -22.794 QT
-11.206 -22.794 -12.104 -21.255 QT
-13.003 -19.716 -13.003 -17.982 QT
cp
f
GR
GS
[0.75 0 0 0.75 275.62527 48.87497] CT
N
-2.372 -10.482 M
-2.372 -15.201 L
-2.372 -15.435 -2.122 -15.435 QT
-1.763 -15.435 L
-1.606 -15.435 -1.544 -15.201 QT
-0.731 -10.998 2.362 -10.998 QT
3.737 -10.998 4.667 -11.623 QT
5.597 -12.248 5.597 -13.544 QT
5.597 -14.482 4.87 -15.138 QT
4.144 -15.794 3.159 -16.044 QT
1.222 -16.419 L
0.237 -16.638 -0.56 -17.076 QT
-1.356 -17.513 -1.864 -18.24 QT
-2.372 -18.966 -2.372 -19.935 QT
-2.372 -21.216 -1.7 -22.029 QT
-1.028 -22.841 0.042 -23.201 QT
1.112 -23.56 2.362 -23.56 QT
3.847 -23.56 4.956 -22.763 QT
5.8 -23.482 L
5.8 -23.56 5.94 -23.56 QT
6.144 -23.56 L
6.237 -23.56 6.308 -23.482 QT
6.378 -23.404 6.378 -23.326 QT
6.378 -19.529 L
6.378 -19.248 6.144 -19.248 QT
5.8 -19.248 L
5.534 -19.248 5.534 -19.529 QT
5.534 -21.044 4.69 -21.959 QT
3.847 -22.873 2.331 -22.873 QT
1.034 -22.873 0.081 -22.396 QT
-0.872 -21.919 -0.872 -20.748 QT
-0.872 -19.935 -0.185 -19.419 QT
0.503 -18.904 1.425 -18.669 QT
3.378 -18.31 L
4.378 -18.076 5.237 -17.537 QT
6.097 -16.998 6.597 -16.177 QT
7.097 -15.357 7.097 -14.326 QT
7.097 -13.279 6.737 -12.505 QT
6.378 -11.732 5.73 -11.224 QT
5.081 -10.716 4.206 -10.474 QT
3.331 -10.232 2.362 -10.232 QT
0.55 -10.232 -0.731 -11.451 QT
-1.794 -10.31 L
-1.794 -10.232 -1.95 -10.232 QT
-2.122 -10.232 L
-2.372 -10.232 -2.372 -10.482 QT
cp
f
GR
GS
[0.75 0 0 0.75 275.62527 48.87497] CT
N
11.183 -14.044 M
11.183 -22.044 L
8.776 -22.044 L
8.776 -22.794 L
10.683 -22.794 11.573 -24.568 QT
12.464 -26.341 12.464 -28.404 QT
13.292 -28.404 L
13.292 -23.06 L
17.386 -23.06 L
17.386 -22.044 L
13.292 -22.044 L
13.292 -14.107 L
13.292 -12.904 13.698 -11.998 QT
14.105 -11.091 15.151 -11.091 QT
16.151 -11.091 16.589 -12.044 QT
17.026 -12.998 17.026 -14.107 QT
17.026 -15.81 L
17.855 -15.81 L
17.855 -14.044 L
17.855 -13.138 17.526 -12.255 QT
17.198 -11.373 16.542 -10.802 QT
15.886 -10.232 14.948 -10.232 QT
13.214 -10.232 12.198 -11.271 QT
11.183 -12.31 11.183 -14.044 QT
cp
f
GR
GS
[0.75 0 0 0.75 275.62527 48.87497] CT
N
30.399 -10.56 M
30.399 -11.576 L
33.399 -11.576 33.399 -12.498 QT
33.399 -28.435 L
33.399 -29.357 30.399 -29.357 QT
30.399 -30.373 L
41.071 -30.373 L
42.54 -30.373 44.04 -29.794 QT
45.54 -29.216 46.524 -28.091 QT
47.509 -26.966 47.509 -25.435 QT
47.509 -23.669 46.055 -22.474 QT
44.602 -21.279 42.665 -20.904 QT
43.93 -20.904 45.259 -20.216 QT
46.587 -19.529 47.438 -18.365 QT
48.29 -17.201 48.29 -15.904 QT
48.29 -14.31 47.352 -13.091 QT
46.415 -11.873 44.907 -11.216 QT
43.399 -10.56 41.884 -10.56 QT
30.399 -10.56 L
cp
35.915 -12.498 M
35.915 -11.873 36.266 -11.724 QT
36.618 -11.576 37.384 -11.576 QT
41.071 -11.576 L
42.196 -11.576 43.173 -12.169 QT
44.149 -12.763 44.712 -13.763 QT
45.274 -14.763 45.274 -15.904 QT
45.274 -16.998 44.805 -18.052 QT
44.337 -19.107 43.469 -19.787 QT
42.602 -20.466 41.477 -20.466 QT
35.915 -20.466 L
35.915 -12.498 L
cp
35.915 -21.232 M
40.259 -21.232 L
41.134 -21.232 41.907 -21.552 QT
42.68 -21.873 43.298 -22.474 QT
43.915 -23.076 44.251 -23.834 QT
44.587 -24.591 44.587 -25.435 QT
44.587 -26.201 44.337 -26.888 QT
44.087 -27.576 43.602 -28.146 QT
43.118 -28.716 42.469 -29.037 QT
41.821 -29.357 41.071 -29.357 QT
37.384 -29.357 L
36.868 -29.357 36.579 -29.31 QT
36.29 -29.263 36.102 -29.06 QT
35.915 -28.857 35.915 -28.435 QT
35.915 -21.232 L
cp
f
GR
GS
[0.75 0 0 0.75 275.62527 48.87497] CT
N
57.443 -10.232 M
55.708 -10.232 54.216 -11.115 QT
52.724 -11.998 51.865 -13.49 QT
51.005 -14.982 51.005 -16.732 QT
51.005 -18.06 51.474 -19.294 QT
51.943 -20.529 52.833 -21.498 QT
53.724 -22.466 54.896 -23.013 QT
56.068 -23.56 57.443 -23.56 QT
59.224 -23.56 60.693 -22.615 QT
62.161 -21.669 63.013 -20.091 QT
63.865 -18.513 63.865 -16.732 QT
63.865 -14.998 62.997 -13.498 QT
62.13 -11.998 60.654 -11.115 QT
59.177 -10.232 57.443 -10.232 QT
cp
57.443 -11.091 M
59.771 -11.091 60.544 -12.771 QT
61.318 -14.451 61.318 -17.06 QT
61.318 -18.513 61.161 -19.474 QT
61.005 -20.435 60.49 -21.216 QT
60.161 -21.685 59.661 -22.052 QT
59.161 -22.419 58.599 -22.607 QT
58.036 -22.794 57.443 -22.794 QT
56.536 -22.794 55.724 -22.38 QT
54.911 -21.966 54.365 -21.216 QT
53.833 -20.388 53.685 -19.404 QT
53.536 -18.419 53.536 -17.06 QT
53.536 -15.435 53.818 -14.138 QT
54.099 -12.841 54.958 -11.966 QT
55.818 -11.091 57.443 -11.091 QT
cp
f
GR
GS
[0.75 0 0 0.75 275.62527 48.87497] CT
N
67.984 -14.013 M
67.984 -20.419 L
67.984 -21.201 67.75 -21.544 QT
67.516 -21.888 67.078 -21.966 QT
66.641 -22.044 65.719 -22.044 QT
65.719 -23.06 L
70.109 -23.373 L
70.109 -14.013 L
70.109 -12.888 70.273 -12.255 QT
70.437 -11.623 70.969 -11.31 QT
71.5 -10.998 72.656 -10.998 QT
74.219 -10.998 75.141 -12.302 QT
76.062 -13.607 76.062 -15.263 QT
76.062 -20.419 L
76.062 -21.201 75.82 -21.544 QT
75.578 -21.888 75.148 -21.966 QT
74.719 -22.044 73.797 -22.044 QT
73.797 -23.06 L
78.172 -23.373 L
78.172 -13.201 L
78.172 -12.435 78.406 -12.084 QT
78.641 -11.732 79.078 -11.654 QT
79.516 -11.576 80.437 -11.576 QT
80.437 -10.56 L
76.141 -10.232 L
76.141 -12.685 L
75.609 -11.591 74.648 -10.912 QT
73.687 -10.232 72.516 -10.232 QT
70.437 -10.232 69.211 -11.115 QT
67.984 -11.998 67.984 -14.013 QT
cp
f
GR
GS
[0.75 0 0 0.75 275.62527 48.87497] CT
N
82.015 -10.56 M
82.015 -11.576 L
83.015 -11.576 83.648 -11.732 QT
84.281 -11.888 84.281 -12.498 QT
84.281 -20.419 L
84.281 -21.201 84.046 -21.544 QT
83.812 -21.888 83.374 -21.966 QT
82.937 -22.044 82.015 -22.044 QT
82.015 -23.06 L
86.218 -23.373 L
86.218 -20.544 L
86.812 -21.794 87.953 -22.584 QT
89.093 -23.373 90.437 -23.373 QT
92.437 -23.373 93.453 -22.412 QT
94.468 -21.451 94.468 -19.466 QT
94.468 -12.498 L
94.468 -11.888 95.101 -11.732 QT
95.734 -11.576 96.734 -11.576 QT
96.734 -10.56 L
90.093 -10.56 L
90.093 -11.576 L
91.078 -11.576 91.718 -11.732 QT
92.359 -11.888 92.359 -12.498 QT
92.359 -19.388 L
92.359 -20.794 91.945 -21.709 QT
91.531 -22.623 90.265 -22.623 QT
88.578 -22.623 87.492 -21.279 QT
86.406 -19.935 86.406 -18.216 QT
86.406 -12.498 L
86.406 -11.888 87.046 -11.732 QT
87.687 -11.576 88.656 -11.576 QT
88.656 -10.56 L
82.015 -10.56 L
cp
f
GR
GS
[0.75 0 0 0.75 275.62527 48.87497] CT
N
104.53 -10.232 M
102.811 -10.232 101.397 -11.162 QT
99.983 -12.091 99.202 -13.607 QT
98.421 -15.123 98.421 -16.826 QT
98.421 -18.576 99.272 -20.084 QT
100.124 -21.591 101.6 -22.482 QT
103.077 -23.373 104.843 -23.373 QT
105.905 -23.373 106.85 -22.927 QT
107.796 -22.482 108.499 -21.685 QT
108.499 -27.716 L
108.499 -28.498 108.265 -28.849 QT
108.03 -29.201 107.6 -29.279 QT
107.171 -29.357 106.249 -29.357 QT
106.249 -30.373 L
110.53 -30.685 L
110.53 -13.201 L
110.53 -12.435 110.765 -12.084 QT
110.999 -11.732 111.436 -11.654 QT
111.874 -11.576 112.78 -11.576 QT
112.78 -10.56 L
108.405 -10.232 L
108.405 -12.06 L
107.655 -11.201 106.624 -10.716 QT
105.593 -10.232 104.53 -10.232 QT
cp
101.577 -13.076 M
102.061 -12.138 102.89 -11.568 QT
103.718 -10.998 104.702 -10.998 QT
105.905 -10.998 106.913 -11.693 QT
107.921 -12.388 108.405 -13.498 QT
108.405 -20.451 L
108.077 -21.076 107.561 -21.584 QT
107.046 -22.091 106.397 -22.357 QT
105.749 -22.623 105.03 -22.623 QT
103.515 -22.623 102.593 -21.763 QT
101.671 -20.904 101.304 -19.576 QT
100.936 -18.248 100.936 -16.794 QT
100.936 -15.623 101.054 -14.763 QT
101.171 -13.904 101.577 -13.076 QT
cp
f
GR
GS
[0.75 0 0 0.75 275.62527 48.87497] CT
N
130.745 -10.232 M
128.979 -10.232 127.503 -11.162 QT
126.026 -12.091 125.182 -13.638 QT
124.339 -15.185 124.339 -16.919 QT
124.339 -18.623 125.104 -20.146 QT
125.87 -21.669 127.253 -22.615 QT
128.636 -23.56 130.339 -23.56 QT
131.667 -23.56 132.651 -23.115 QT
133.636 -22.669 134.276 -21.873 QT
134.917 -21.076 135.237 -20.005 QT
135.557 -18.935 135.557 -17.638 QT
135.557 -17.263 135.261 -17.263 QT
126.87 -17.263 L
126.87 -16.951 L
126.87 -14.544 127.839 -12.818 QT
128.807 -11.091 131.011 -11.091 QT
131.901 -11.091 132.659 -11.482 QT
133.417 -11.873 133.971 -12.584 QT
134.526 -13.294 134.729 -14.107 QT
134.761 -14.201 134.839 -14.279 QT
134.917 -14.357 135.011 -14.357 QT
135.261 -14.357 L
135.557 -14.357 135.557 -13.982 QT
135.151 -12.341 133.792 -11.287 QT
132.432 -10.232 130.745 -10.232 QT
cp
126.901 -17.982 M
133.511 -17.982 L
133.511 -19.076 133.206 -20.193 QT
132.901 -21.31 132.19 -22.052 QT
131.479 -22.794 130.339 -22.794 QT
128.698 -22.794 127.8 -21.255 QT
126.901 -19.716 126.901 -17.982 QT
cp
f
GR
GS
[0.75 0 0 0.75 275.62527 48.87497] CT
N
143.641 -10.56 M
139.407 -21.216 L
139.141 -21.748 138.579 -21.896 QT
138.016 -22.044 137.11 -22.044 QT
137.11 -23.06 L
143.204 -23.06 L
143.204 -22.044 L
141.579 -22.044 141.579 -21.357 QT
141.579 -21.232 141.61 -21.185 QT
144.86 -12.998 L
147.798 -20.388 L
147.876 -20.607 147.876 -20.857 QT
147.876 -21.404 147.462 -21.724 QT
147.048 -22.044 146.469 -22.044 QT
146.469 -23.06 L
151.298 -23.06 L
151.298 -22.044 L
150.391 -22.044 149.719 -21.63 QT
149.048 -21.216 148.688 -20.419 QT
144.782 -10.56 L
144.657 -10.232 144.313 -10.232 QT
144.094 -10.232 L
143.735 -10.232 143.641 -10.56 QT
cp
f
GR
GS
[0.75 0 0 0.75 275.62527 48.87497] CT
N
158.48 -10.232 M
156.746 -10.232 155.253 -11.115 QT
153.761 -11.998 152.902 -13.49 QT
152.042 -14.982 152.042 -16.732 QT
152.042 -18.06 152.511 -19.294 QT
152.98 -20.529 153.871 -21.498 QT
154.761 -22.466 155.933 -23.013 QT
157.105 -23.56 158.48 -23.56 QT
160.261 -23.56 161.73 -22.615 QT
163.199 -21.669 164.05 -20.091 QT
164.902 -18.513 164.902 -16.732 QT
164.902 -14.998 164.035 -13.498 QT
163.167 -11.998 161.691 -11.115 QT
160.214 -10.232 158.48 -10.232 QT
cp
158.48 -11.091 M
160.808 -11.091 161.581 -12.771 QT
162.355 -14.451 162.355 -17.06 QT
162.355 -18.513 162.199 -19.474 QT
162.042 -20.435 161.527 -21.216 QT
161.199 -21.685 160.699 -22.052 QT
160.199 -22.419 159.636 -22.607 QT
159.074 -22.794 158.48 -22.794 QT
157.574 -22.794 156.761 -22.38 QT
155.949 -21.966 155.402 -21.216 QT
154.871 -20.388 154.722 -19.404 QT
154.574 -18.419 154.574 -17.06 QT
154.574 -15.435 154.855 -14.138 QT
155.136 -12.841 155.996 -11.966 QT
156.855 -11.091 158.48 -11.091 QT
cp
f
GR
GS
[0.75 0 0 0.75 275.62527 48.87497] CT
N
166.787 -10.56 M
166.787 -11.576 L
167.787 -11.576 168.42 -11.732 QT
169.053 -11.888 169.053 -12.498 QT
169.053 -27.716 L
169.053 -28.498 168.818 -28.849 QT
168.584 -29.201 168.147 -29.279 QT
167.709 -29.357 166.787 -29.357 QT
166.787 -30.373 L
171.1 -30.685 L
171.1 -12.498 L
171.1 -11.888 171.733 -11.732 QT
172.365 -11.576 173.35 -11.576 QT
173.35 -10.56 L
166.787 -10.56 L
cp
f
GR
GS
[0.75 0 0 0.75 275.62527 48.87497] CT
N
177.17 -14.013 M
177.17 -20.419 L
177.17 -21.201 176.935 -21.544 QT
176.701 -21.888 176.264 -21.966 QT
175.826 -22.044 174.904 -22.044 QT
174.904 -23.06 L
179.295 -23.373 L
179.295 -14.013 L
179.295 -12.888 179.459 -12.255 QT
179.623 -11.623 180.154 -11.31 QT
180.685 -10.998 181.842 -10.998 QT
183.404 -10.998 184.326 -12.302 QT
185.248 -13.607 185.248 -15.263 QT
185.248 -20.419 L
185.248 -21.201 185.006 -21.544 QT
184.764 -21.888 184.334 -21.966 QT
183.904 -22.044 182.982 -22.044 QT
182.982 -23.06 L
187.357 -23.373 L
187.357 -13.201 L
187.357 -12.435 187.592 -12.084 QT
187.826 -11.732 188.264 -11.654 QT
188.701 -11.576 189.623 -11.576 QT
189.623 -10.56 L
185.326 -10.232 L
185.326 -12.685 L
184.795 -11.591 183.834 -10.912 QT
182.873 -10.232 181.701 -10.232 QT
179.623 -10.232 178.396 -11.115 QT
177.17 -11.998 177.17 -14.013 QT
cp
f
GR
GS
[0.75 0 0 0.75 275.62527 48.87497] CT
N
193.294 -14.044 M
193.294 -22.044 L
190.888 -22.044 L
190.888 -22.794 L
192.794 -22.794 193.685 -24.568 QT
194.576 -26.341 194.576 -28.404 QT
195.404 -28.404 L
195.404 -23.06 L
199.497 -23.06 L
199.497 -22.044 L
195.404 -22.044 L
195.404 -14.107 L
195.404 -12.904 195.81 -11.998 QT
196.216 -11.091 197.263 -11.091 QT
198.263 -11.091 198.701 -12.044 QT
199.138 -12.998 199.138 -14.107 QT
199.138 -15.81 L
199.966 -15.81 L
199.966 -14.044 L
199.966 -13.138 199.638 -12.255 QT
199.31 -11.373 198.654 -10.802 QT
197.997 -10.232 197.06 -10.232 QT
195.326 -10.232 194.31 -11.271 QT
193.294 -12.31 193.294 -14.044 QT
cp
f
GR
GS
[0.75 0 0 0.75 275.62527 48.87497] CT
N
202.639 -10.56 M
202.639 -11.576 L
203.639 -11.576 204.272 -11.732 QT
204.905 -11.888 204.905 -12.498 QT
204.905 -20.419 L
204.905 -21.529 204.475 -21.787 QT
204.045 -22.044 202.764 -22.044 QT
202.764 -23.06 L
206.952 -23.373 L
206.952 -12.498 L
206.952 -11.888 207.499 -11.732 QT
208.045 -11.576 208.967 -11.576 QT
208.967 -10.56 L
202.639 -10.56 L
cp
203.874 -28.357 M
203.874 -28.998 204.358 -29.482 QT
204.842 -29.966 205.452 -29.966 QT
205.874 -29.966 206.256 -29.748 QT
206.639 -29.529 206.85 -29.146 QT
207.061 -28.763 207.061 -28.357 QT
207.061 -27.732 206.577 -27.255 QT
206.092 -26.779 205.452 -26.779 QT
204.842 -26.779 204.358 -27.255 QT
203.874 -27.732 203.874 -28.357 QT
cp
f
GR
GS
[0.75 0 0 0.75 275.62527 48.87497] CT
N
217.147 -10.232 M
215.412 -10.232 213.92 -11.115 QT
212.428 -11.998 211.569 -13.49 QT
210.709 -14.982 210.709 -16.732 QT
210.709 -18.06 211.178 -19.294 QT
211.647 -20.529 212.537 -21.498 QT
213.428 -22.466 214.6 -23.013 QT
215.772 -23.56 217.147 -23.56 QT
218.928 -23.56 220.397 -22.615 QT
221.866 -21.669 222.717 -20.091 QT
223.569 -18.513 223.569 -16.732 QT
223.569 -14.998 222.701 -13.498 QT
221.834 -11.998 220.358 -11.115 QT
218.881 -10.232 217.147 -10.232 QT
cp
217.147 -11.091 M
219.475 -11.091 220.248 -12.771 QT
221.022 -14.451 221.022 -17.06 QT
221.022 -18.513 220.866 -19.474 QT
220.709 -20.435 220.194 -21.216 QT
219.866 -21.685 219.366 -22.052 QT
218.866 -22.419 218.303 -22.607 QT
217.741 -22.794 217.147 -22.794 QT
216.241 -22.794 215.428 -22.38 QT
214.616 -21.966 214.069 -21.216 QT
213.537 -20.388 213.389 -19.404 QT
213.241 -18.419 213.241 -17.06 QT
213.241 -15.435 213.522 -14.138 QT
213.803 -12.841 214.662 -11.966 QT
215.522 -11.091 217.147 -11.091 QT
cp
f
GR
GS
[0.75 0 0 0.75 275.62527 48.87497] CT
N
225.423 -10.56 M
225.423 -11.576 L
226.423 -11.576 227.056 -11.732 QT
227.688 -11.888 227.688 -12.498 QT
227.688 -20.419 L
227.688 -21.201 227.454 -21.544 QT
227.22 -21.888 226.782 -21.966 QT
226.345 -22.044 225.423 -22.044 QT
225.423 -23.06 L
229.626 -23.373 L
229.626 -20.544 L
230.22 -21.794 231.36 -22.584 QT
232.501 -23.373 233.845 -23.373 QT
235.845 -23.373 236.86 -22.412 QT
237.876 -21.451 237.876 -19.466 QT
237.876 -12.498 L
237.876 -11.888 238.509 -11.732 QT
239.142 -11.576 240.142 -11.576 QT
240.142 -10.56 L
233.501 -10.56 L
233.501 -11.576 L
234.485 -11.576 235.126 -11.732 QT
235.767 -11.888 235.767 -12.498 QT
235.767 -19.388 L
235.767 -20.794 235.353 -21.709 QT
234.938 -22.623 233.673 -22.623 QT
231.985 -22.623 230.899 -21.279 QT
229.813 -19.935 229.813 -18.216 QT
229.813 -12.498 L
229.813 -11.888 230.454 -11.732 QT
231.095 -11.576 232.063 -11.576 QT
232.063 -10.56 L
225.423 -10.56 L
cp
f
GR
GS
[0.75 0 0 0.75 0 0.5] CT
0 0.447 0.741 RC
10.0 ML
0.667 LW
N
92 106.095 M
93.837 106.095 L
93.837 106.095 L
95.673 106.095 L
95.673 106.095 L
97.51 106.095 L
97.51 106.095 L
99.347 106.095 L
99.347 106.095 L
101.183 106.095 L
101.183 118.003 L
103.02 118.003 L
103.02 118.003 L
104.857 118.003 L
104.857 118.003 L
106.693 118.003 L
106.693 159.585 L
108.53 159.585 L
108.53 168.526 L
110.367 168.526 L
110.367 586.244 L
112.203 586.244 L
112.203 625.7 L
114.04 625.7 L
114.04 678.977 L
115.877 678.977 L
115.877 678.977 L
117.713 678.977 L
117.713 678.977 L
119.55 678.977 L
119.55 678.977 L
121.387 678.977 L
121.387 678.977 L
123.223 678.977 L
123.223 678.977 L
125.06 678.977 L
125.06 678.977 L
126.897 678.977 L
126.897 678.977 L
128.733 678.977 L
128.733 678.977 L
130.57 678.977 L
130.57 678.977 L
132.407 678.977 L
132.407 679.037 L
134.243 679.037 L
134.243 679.397 L
136.08 679.397 L
136.08 679.397 L
137.917 679.397 L
137.917 680.957 L
139.753 680.957 L
139.753 683.27 L
141.59 683.27 L
141.59 771.422 L
143.427 771.422 L
143.427 772.076 L
145.263 772.076 L
145.263 773.544 L
147.1 773.544 L
147.1 773.898 L
148.937 773.898 L
148.937 774.355 L
150.773 774.355 L
150.773 791.569 L
152.61 791.569 L
152.61 796.082 L
154.447 796.082 L
154.447 798.658 L
156.283 798.658 L
156.283 799.257 L
158.12 799.257 L
158.12 800.575 L
159.957 800.575 L
159.957 801.302 L
161.793 801.302 L
161.793 801.365 L
163.63 801.365 L
163.63 804.471 L
165.467 804.471 L
165.467 804.471 L
169.14 804.471 L
169.14 804.551 L
170.977 804.551 L
170.977 804.761 L
172.813 804.761 L
172.813 804.761 L
176.487 804.761 L
176.487 804.761 L
178.323 804.761 L
178.323 805.608 L
180.16 805.608 L
180.16 805.668 L
183.833 805.668 L
183.833 806.264 L
185.67 806.264 L
185.67 806.372 L
187.507 806.372 L
187.507 806.632 L
191.18 806.632 L
191.18 806.632 L
194.853 806.632 L
194.853 806.698 L
196.69 806.698 L
196.69 806.698 L
198.527 806.698 L
198.527 806.698 L
202.2 806.698 L
202.2 806.698 L
205.873 806.698 L
205.873 806.698 L
209.547 806.698 L
209.547 807.558 L
211.383 807.558 L
211.383 807.644 L
216.893 807.644 L
216.893 809.409 L
220.567 809.409 L
220.567 810.599 L
224.24 810.599 L
224.24 810.789 L
227.913 810.789 L
227.913 810.789 L
231.587 810.789 L
231.587 810.789 L
237.097 810.789 L
237.097 810.884 L
240.77 810.884 L
240.77 811.641 L
246.28 811.641 L
246.28 811.641 L
253.627 811.641 L
253.627 811.641 L
259.137 811.641 L
259.137 811.641 L
264.647 811.641 L
264.647 811.641 L
268.32 811.641 L
268.32 811.641 L
275.667 811.641 L
275.667 811.641 L
279.34 811.641 L
279.34 811.641 L
284.85 811.641 L
284.85 811.641 L
288.523 811.641 L
288.523 811.641 L
294.033 811.641 L
294.033 811.641 L
299.543 811.641 L
299.543 811.846 L
305.053 811.846 L
305.053 811.846 L
317.91 811.846 L
317.91 811.903 L
328.93 811.903 L
328.93 811.903 L
336.277 811.903 L
336.277 811.903 L
343.623 811.903 L
343.623 811.903 L
350.97 811.903 L
350.97 811.903 L
358.317 811.903 L
358.317 811.903 L
365.663 811.903 L
365.663 811.903 L
373.01 811.903 L
373.01 811.903 L
382.193 811.903 L
382.193 811.903 L
391.377 811.903 L
391.377 811.903 L
398.723 811.903 L
398.723 811.903 L
406.07 811.903 L
406.07 811.903 L
413.417 811.903 L
413.417 811.903 L
418.927 811.903 L
418.927 811.903 L
426.273 811.903 L
426.273 811.903 L
431.783 811.903 L
431.783 811.903 L
439.13 811.903 L
439.13 811.903 L
446.477 811.903 L
446.477 811.903 L
453.823 811.903 L
453.823 811.903 L
461.17 811.903 L
461.17 811.903 L
468.517 811.903 L
468.517 811.903 L
475.863 811.903 L
475.863 811.903 L
483.21 811.903 L
483.21 811.903 L
488.72 811.903 L
488.72 811.903 L
497.903 811.903 L
497.903 811.903 L
503.413 811.903 L
503.413 811.903 L
510.76 811.903 L
510.76 811.903 L
521.78 811.903 L
521.78 811.903 L
530.963 811.903 L
530.963 811.903 L
538.31 811.903 L
538.31 811.903 L
613.613 811.903 L
613.613 811.903 L
619.123 811.903 L
619.123 811.903 L
624.633 811.903 L
624.633 811.903 L
630.143 811.903 L
630.143 811.903 L
635.653 811.903 L
635.653 811.903 L
643 811.903 L
643 811.903 L
643 811.903 L
643 811.903 L
S
GR
GS
[0.75 0 0 0.75 0 0.5] CT
0.851 0.325 0.098 RC
10.0 ML
0.667 LW
N
92 828 M
93.837 828 L
93.837 828 L
95.673 828 L
95.673 828 L
97.51 828 L
97.51 828 L
99.347 828 L
99.347 828 L
101.183 828 L
101.183 828 L
103.02 828 L
103.02 828 L
104.857 828 L
104.857 828 L
106.693 828 L
106.693 828 L
108.53 828 L
108.53 828 L
110.367 828 L
110.367 828 L
112.203 828 L
112.203 828 L
114.04 828 L
114.04 828 L
115.877 828 L
115.877 828 L
117.713 828 L
117.713 828 L
119.55 828 L
119.55 828 L
121.387 828 L
121.387 828 L
123.223 828 L
123.223 828 L
125.06 828 L
125.06 828 L
126.897 828 L
126.897 828 L
128.733 828 L
128.733 828 L
130.57 828 L
130.57 828 L
132.407 828 L
132.407 828 L
134.243 828 L
134.243 828 L
136.08 828 L
136.08 828 L
137.917 828 L
137.917 828 L
139.753 828 L
139.753 828 L
141.59 828 L
141.59 828 L
143.427 828 L
143.427 828 L
145.263 828 L
145.263 828 L
147.1 828 L
147.1 828 L
148.937 828 L
148.937 828 L
150.773 828 L
150.773 828 L
152.61 828 L
152.61 828 L
154.447 828 L
154.447 828 L
156.283 828 L
156.283 828 L
158.12 828 L
158.12 828 L
159.957 828 L
159.957 828 L
161.793 828 L
161.793 828 L
163.63 828 L
163.63 828 L
165.467 828 L
165.467 828 L
169.14 828 L
169.14 828 L
170.977 828 L
170.977 828 L
172.813 828 L
172.813 828 L
176.487 828 L
176.487 828 L
178.323 828 L
178.323 828 L
180.16 828 L
180.16 828 L
183.833 828 L
183.833 828 L
185.67 828 L
185.67 828 L
187.507 828 L
187.507 828 L
191.18 828 L
191.18 828 L
194.853 828 L
194.853 828 L
196.69 828 L
196.69 828 L
198.527 828 L
198.527 828 L
202.2 828 L
202.2 828 L
205.873 828 L
205.873 828 L
209.547 828 L
209.547 828 L
211.383 828 L
211.383 828 L
216.893 828 L
216.893 828 L
220.567 828 L
220.567 828 L
224.24 828 L
224.24 828 L
227.913 828 L
227.913 828 L
231.587 828 L
231.587 828 L
237.097 828 L
237.097 828 L
240.77 828 L
240.77 828 L
246.28 828 L
246.28 828 L
253.627 828 L
253.627 828 L
259.137 828 L
259.137 828 L
264.647 828 L
264.647 828 L
268.32 828 L
268.32 828 L
275.667 828 L
275.667 828 L
279.34 828 L
279.34 828 L
284.85 828 L
284.85 828 L
288.523 828 L
288.523 828 L
294.033 828 L
294.033 828 L
299.543 828 L
299.543 828 L
305.053 828 L
305.053 828 L
317.91 828 L
317.91 828 L
328.93 828 L
328.93 828 L
336.277 828 L
336.277 828 L
343.623 828 L
343.623 828 L
350.97 828 L
350.97 828 L
358.317 828 L
358.317 828 L
365.663 828 L
365.663 828 L
373.01 828 L
373.01 828 L
382.193 828 L
382.193 828 L
391.377 828 L
391.377 828 L
398.723 828 L
398.723 828 L
406.07 828 L
406.07 828 L
413.417 828 L
413.417 828 L
418.927 828 L
418.927 828 L
426.273 828 L
426.273 828 L
431.783 828 L
431.783 828 L
439.13 828 L
439.13 828 L
446.477 828 L
446.477 828 L
453.823 828 L
453.823 828 L
461.17 828 L
461.17 828 L
468.517 828 L
468.517 828 L
475.863 828 L
475.863 828 L
483.21 828 L
483.21 828 L
488.72 828 L
488.72 828 L
497.903 828 L
497.903 828 L
503.413 828 L
503.413 828 L
510.76 828 L
510.76 828 L
521.78 828 L
521.78 828 L
530.963 828 L
530.963 828 L
538.31 828 L
538.31 828 L
613.613 828 L
613.613 828 L
619.123 828 L
619.123 828 L
624.633 828 L
624.633 828 L
630.143 828 L
630.143 828 L
635.653 828 L
635.653 828 L
643 828 L
643 828 L
643 828 L
643 828 L
S
GR
GS
[0.75 0 0 0.75 69 80.07143] CT
1 0 0 RC
10.0 ML
0.667 LW
N
0 -4 M
0 4 L
-4 0 M
4 0 L
-2.828 -2.828 M
2.828 2.828 L
-2.828 2.828 M
2.828 -2.828 L
S
GR
GS
[0.75 0 0 0.75 0 0.5] CT
1 GC
N
632 172 M
632 81 L
418 81 L
418 172 L
cp
f
GR
GS
[0.75 0 0 0.75 348.7061 73.49617] CT
N
0.734 5.76 M
0.734 4.916 L
3.219 4.916 3.219 4.151 QT
3.219 -9.037 L
3.219 -9.787 0.734 -9.787 QT
0.734 -10.631 L
13.969 -10.631 L
14.641 -5.146 L
13.953 -5.146 L
13.781 -6.646 13.508 -7.521 QT
13.234 -8.396 12.703 -8.896 QT
12.172 -9.396 11.289 -9.592 QT
10.406 -9.787 8.859 -9.787 QT
6.672 -9.787 L
6.234 -9.787 5.992 -9.756 QT
5.75 -9.724 5.602 -9.553 QT
5.453 -9.381 5.453 -9.037 QT
5.453 -2.849 L
7.156 -2.849 L
8.375 -2.849 8.953 -3.068 QT
9.531 -3.287 9.75 -3.865 QT
9.969 -4.443 9.969 -5.662 QT
10.656 -5.662 L
10.656 0.791 L
9.969 0.791 L
9.969 -0.443 9.75 -1.014 QT
9.531 -1.584 8.953 -1.803 QT
8.375 -2.021 7.156 -2.021 QT
5.453 -2.021 L
5.453 4.151 L
5.453 4.916 8.516 4.916 QT
8.516 5.76 L
0.734 5.76 L
cp
f
GR
GS
[0.75 0 0 0.75 348.7061 73.49617] CT
N
19.651 6.026 M
18.182 6.026 16.956 5.26 QT
15.729 4.494 15.034 3.213 QT
14.339 1.932 14.339 0.494 QT
14.339 -0.912 14.979 -2.178 QT
15.62 -3.443 16.76 -4.224 QT
17.901 -5.006 19.307 -5.006 QT
20.401 -5.006 21.221 -4.631 QT
22.042 -4.256 22.565 -3.599 QT
23.089 -2.943 23.362 -2.053 QT
23.635 -1.162 23.635 -0.099 QT
23.635 0.213 23.385 0.213 QT
16.432 0.213 L
16.432 0.479 L
16.432 2.463 17.237 3.893 QT
18.042 5.322 19.854 5.322 QT
20.589 5.322 21.221 4.994 QT
21.854 4.666 22.315 4.08 QT
22.776 3.494 22.932 2.822 QT
22.964 2.744 23.026 2.682 QT
23.089 2.619 23.167 2.619 QT
23.385 2.619 L
23.635 2.619 23.635 2.916 QT
23.292 4.276 22.167 5.151 QT
21.042 6.026 19.651 6.026 QT
cp
16.464 -0.381 M
21.932 -0.381 L
21.932 -1.287 21.682 -2.209 QT
21.432 -3.131 20.846 -3.748 QT
20.26 -4.365 19.307 -4.365 QT
17.948 -4.365 17.206 -3.092 QT
16.464 -1.818 16.464 -0.381 QT
cp
f
GR
GS
[0.75 0 0 0.75 348.7061 73.49617] CT
N
25.302 3.401 M
25.302 1.979 26.427 1.08 QT
27.552 0.182 29.122 -0.185 QT
30.693 -0.553 32.115 -0.553 QT
32.115 -1.537 L
32.115 -2.24 31.81 -2.889 QT
31.505 -3.537 30.935 -3.951 QT
30.365 -4.365 29.661 -4.365 QT
28.068 -4.365 27.24 -3.646 QT
27.693 -3.646 27.997 -3.303 QT
28.302 -2.959 28.302 -2.506 QT
28.302 -2.021 27.958 -1.685 QT
27.615 -1.349 27.146 -1.349 QT
26.661 -1.349 26.326 -1.685 QT
25.99 -2.021 25.99 -2.506 QT
25.99 -3.771 27.138 -4.389 QT
28.286 -5.006 29.661 -5.006 QT
30.646 -5.006 31.63 -4.584 QT
32.615 -4.162 33.24 -3.389 QT
33.865 -2.615 33.865 -1.584 QT
33.865 3.807 L
33.865 4.276 34.06 4.674 QT
34.255 5.072 34.677 5.072 QT
35.083 5.072 35.279 4.674 QT
35.474 4.276 35.474 3.807 QT
35.474 2.276 L
36.177 2.276 L
36.177 3.807 L
36.177 4.354 35.896 4.838 QT
35.615 5.322 35.138 5.611 QT
34.661 5.901 34.115 5.901 QT
33.411 5.901 32.896 5.354 QT
32.38 4.807 32.333 4.057 QT
31.88 4.963 31.013 5.494 QT
30.146 6.026 29.161 6.026 QT
28.255 6.026 27.365 5.76 QT
26.474 5.494 25.888 4.908 QT
25.302 4.322 25.302 3.401 QT
cp
27.24 3.401 M
27.24 4.244 27.865 4.822 QT
28.49 5.401 29.333 5.401 QT
30.099 5.401 30.732 5.01 QT
31.365 4.619 31.74 3.955 QT
32.115 3.291 32.115 2.541 QT
32.115 0.057 L
31.021 0.057 29.88 0.408 QT
28.74 0.76 27.99 1.526 QT
27.24 2.291 27.24 3.401 QT
cp
f
GR
GS
[0.75 0 0 0.75 348.7061 73.49617] CT
N
37.13 5.838 M
37.13 1.916 L
37.13 1.729 37.349 1.729 QT
37.63 1.729 L
37.771 1.729 37.818 1.916 QT
38.49 5.401 41.052 5.401 QT
42.193 5.401 42.958 4.885 QT
43.724 4.369 43.724 3.291 QT
43.724 2.51 43.13 1.963 QT
42.537 1.416 41.708 1.229 QT
40.115 0.901 L
39.302 0.729 38.638 0.369 QT
37.974 0.01 37.552 -0.599 QT
37.13 -1.209 37.13 -2.006 QT
37.13 -3.053 37.685 -3.724 QT
38.24 -4.396 39.13 -4.701 QT
40.021 -5.006 41.052 -5.006 QT
42.287 -5.006 43.208 -4.349 QT
43.896 -4.943 L
43.896 -5.006 44.005 -5.006 QT
44.193 -5.006 L
44.255 -5.006 44.318 -4.935 QT
44.38 -4.865 44.38 -4.803 QT
44.38 -1.662 L
44.38 -1.443 44.193 -1.443 QT
43.896 -1.443 L
43.677 -1.443 43.677 -1.662 QT
43.677 -2.912 42.982 -3.678 QT
42.287 -4.443 41.037 -4.443 QT
39.958 -4.443 39.169 -4.045 QT
38.38 -3.646 38.38 -2.662 QT
38.38 -2.006 38.943 -1.576 QT
39.505 -1.146 40.271 -0.959 QT
41.896 -0.646 L
42.724 -0.459 43.435 -0.014 QT
44.146 0.432 44.56 1.111 QT
44.974 1.791 44.974 2.635 QT
44.974 3.51 44.677 4.151 QT
44.38 4.791 43.841 5.213 QT
43.302 5.635 42.576 5.83 QT
41.849 6.026 41.052 6.026 QT
39.552 6.026 38.49 5.026 QT
37.615 5.979 L
37.615 6.026 37.49 6.026 QT
37.349 6.026 L
37.13 6.026 37.13 5.838 QT
cp
f
GR
GS
[0.75 0 0 0.75 348.7061 73.49617] CT
N
46.534 5.76 M
46.534 4.916 L
47.363 4.916 47.886 4.783 QT
48.409 4.651 48.409 4.151 QT
48.409 -2.396 L
48.409 -3.318 48.058 -3.529 QT
47.706 -3.74 46.644 -3.74 QT
46.644 -4.584 L
50.097 -4.849 L
50.097 4.151 L
50.097 4.651 50.558 4.783 QT
51.019 4.916 51.784 4.916 QT
51.784 5.76 L
46.534 5.76 L
cp
47.566 -8.974 M
47.566 -9.506 47.964 -9.904 QT
48.363 -10.303 48.878 -10.303 QT
49.206 -10.303 49.527 -10.123 QT
49.847 -9.943 50.019 -9.631 QT
50.191 -9.318 50.191 -8.974 QT
50.191 -8.459 49.792 -8.06 QT
49.394 -7.662 48.878 -7.662 QT
48.363 -7.662 47.964 -8.06 QT
47.566 -8.459 47.566 -8.974 QT
cp
f
GR
GS
[0.75 0 0 0.75 348.7061 73.49617] CT
N
54.967 5.76 M
54.967 -8.443 L
54.967 -9.084 54.771 -9.373 QT
54.576 -9.662 54.217 -9.724 QT
53.857 -9.787 53.092 -9.787 QT
53.092 -10.631 L
56.639 -10.896 L
56.639 -3.381 L
57.045 -3.834 57.576 -4.162 QT
58.107 -4.49 58.717 -4.67 QT
59.326 -4.849 59.951 -4.849 QT
61.029 -4.849 61.951 -4.412 QT
62.873 -3.974 63.553 -3.217 QT
64.232 -2.459 64.615 -1.467 QT
64.998 -0.474 64.998 0.572 QT
64.998 2.026 64.287 3.283 QT
63.576 4.541 62.35 5.283 QT
61.123 6.026 59.67 6.026 QT
58.748 6.026 57.896 5.557 QT
57.045 5.088 56.482 4.322 QT
55.654 5.76 L
54.967 5.76 L
cp
56.717 3.401 M
57.107 4.276 57.857 4.838 QT
58.607 5.401 59.529 5.401 QT
60.764 5.401 61.529 4.682 QT
62.295 3.963 62.6 2.877 QT
62.904 1.791 62.904 0.572 QT
62.904 -1.443 62.389 -2.506 QT
62.154 -2.974 61.748 -3.373 QT
61.342 -3.771 60.842 -3.998 QT
60.342 -4.224 59.795 -4.224 QT
58.826 -4.224 58.006 -3.717 QT
57.186 -3.209 56.717 -2.349 QT
56.717 3.401 L
cp
f
GR
GS
[0.75 0 0 0.75 348.7061 73.49617] CT
N
66.535 5.76 M
66.535 4.916 L
67.363 4.916 67.886 4.783 QT
68.41 4.651 68.41 4.151 QT
68.41 -8.443 L
68.41 -9.084 68.222 -9.373 QT
68.035 -9.662 67.667 -9.724 QT
67.3 -9.787 66.535 -9.787 QT
66.535 -10.631 L
70.097 -10.896 L
70.097 4.151 L
70.097 4.651 70.628 4.783 QT
71.16 4.916 71.972 4.916 QT
71.972 5.76 L
66.535 5.76 L
cp
f
GR
GS
[0.75 0 0 0.75 348.7061 73.49617] CT
N
78.451 6.026 M
76.982 6.026 75.756 5.26 QT
74.529 4.494 73.834 3.213 QT
73.139 1.932 73.139 0.494 QT
73.139 -0.912 73.779 -2.178 QT
74.42 -3.443 75.561 -4.224 QT
76.701 -5.006 78.107 -5.006 QT
79.201 -5.006 80.021 -4.631 QT
80.842 -4.256 81.365 -3.599 QT
81.889 -2.943 82.162 -2.053 QT
82.436 -1.162 82.436 -0.099 QT
82.436 0.213 82.186 0.213 QT
75.232 0.213 L
75.232 0.479 L
75.232 2.463 76.037 3.893 QT
76.842 5.322 78.654 5.322 QT
79.389 5.322 80.021 4.994 QT
80.654 4.666 81.115 4.08 QT
81.576 3.494 81.732 2.822 QT
81.764 2.744 81.826 2.682 QT
81.889 2.619 81.967 2.619 QT
82.186 2.619 L
82.436 2.619 82.436 2.916 QT
82.092 4.276 80.967 5.151 QT
79.842 6.026 78.451 6.026 QT
cp
75.264 -0.381 M
80.732 -0.381 L
80.732 -1.287 80.482 -2.209 QT
80.232 -3.131 79.646 -3.748 QT
79.061 -4.365 78.107 -4.365 QT
76.748 -4.365 76.006 -3.092 QT
75.264 -1.818 75.264 -0.381 QT
cp
f
GR
GS
[0.75 0 0 0.75 348.7061 73.49617] CT
N
92.102 3.401 M
92.102 1.979 93.227 1.08 QT
94.352 0.182 95.923 -0.185 QT
97.493 -0.553 98.915 -0.553 QT
98.915 -1.537 L
98.915 -2.24 98.61 -2.889 QT
98.305 -3.537 97.735 -3.951 QT
97.165 -4.365 96.462 -4.365 QT
94.868 -4.365 94.04 -3.646 QT
94.493 -3.646 94.798 -3.303 QT
95.102 -2.959 95.102 -2.506 QT
95.102 -2.021 94.758 -1.685 QT
94.415 -1.349 93.946 -1.349 QT
93.462 -1.349 93.126 -1.685 QT
92.79 -2.021 92.79 -2.506 QT
92.79 -3.771 93.938 -4.389 QT
95.087 -5.006 96.462 -5.006 QT
97.446 -5.006 98.43 -4.584 QT
99.415 -4.162 100.04 -3.389 QT
100.665 -2.615 100.665 -1.584 QT
100.665 3.807 L
100.665 4.276 100.86 4.674 QT
101.055 5.072 101.477 5.072 QT
101.883 5.072 102.079 4.674 QT
102.274 4.276 102.274 3.807 QT
102.274 2.276 L
102.977 2.276 L
102.977 3.807 L
102.977 4.354 102.696 4.838 QT
102.415 5.322 101.938 5.611 QT
101.462 5.901 100.915 5.901 QT
100.212 5.901 99.696 5.354 QT
99.18 4.807 99.133 4.057 QT
98.68 4.963 97.813 5.494 QT
96.946 6.026 95.962 6.026 QT
95.055 6.026 94.165 5.76 QT
93.274 5.494 92.688 4.908 QT
92.102 4.322 92.102 3.401 QT
cp
94.04 3.401 M
94.04 4.244 94.665 4.822 QT
95.29 5.401 96.133 5.401 QT
96.899 5.401 97.532 5.01 QT
98.165 4.619 98.54 3.955 QT
98.915 3.291 98.915 2.541 QT
98.915 0.057 L
97.821 0.057 96.68 0.408 QT
95.54 0.76 94.79 1.526 QT
94.04 2.291 94.04 3.401 QT
cp
f
GR
GS
[0.75 0 0 0.75 348.7061 73.49617] CT
N
105.587 2.869 M
105.587 -3.74 L
103.587 -3.74 L
103.587 -4.365 L
105.165 -4.365 105.899 -5.834 QT
106.633 -7.303 106.633 -9.006 QT
107.337 -9.006 L
107.337 -4.584 L
110.712 -4.584 L
110.712 -3.74 L
107.337 -3.74 L
107.337 2.822 L
107.337 3.822 107.665 4.572 QT
107.993 5.322 108.868 5.322 QT
109.68 5.322 110.048 4.533 QT
110.415 3.744 110.415 2.822 QT
110.415 1.416 L
111.102 1.416 L
111.102 2.869 L
111.102 3.619 110.829 4.354 QT
110.555 5.088 110.016 5.557 QT
109.477 6.026 108.696 6.026 QT
107.258 6.026 106.423 5.166 QT
105.587 4.307 105.587 2.869 QT
cp
f
GR
GS
[0.75 0 0 0.75 348.7061 73.49617] CT
N
126.467 6.291 M
123.529 6.291 122.467 3.869 QT
121.404 1.447 121.404 -1.896 QT
121.404 -3.974 121.787 -5.818 QT
122.17 -7.662 123.303 -8.943 QT
124.436 -10.224 126.467 -10.224 QT
128.045 -10.224 129.053 -9.451 QT
130.061 -8.678 130.592 -7.451 QT
131.123 -6.224 131.318 -4.826 QT
131.514 -3.428 131.514 -1.896 QT
131.514 0.166 131.131 1.963 QT
130.748 3.76 129.631 5.026 QT
128.514 6.291 126.467 6.291 QT
cp
126.467 5.666 M
127.811 5.666 128.467 4.291 QT
129.123 2.916 129.272 1.252 QT
129.42 -0.412 129.42 -2.287 QT
129.42 -4.084 129.272 -5.607 QT
129.123 -7.131 128.467 -8.365 QT
127.811 -9.599 126.467 -9.599 QT
125.107 -9.599 124.451 -8.357 QT
123.795 -7.115 123.647 -5.599 QT
123.498 -4.084 123.498 -2.287 QT
123.498 -0.943 123.561 0.236 QT
123.623 1.416 123.904 2.682 QT
124.186 3.947 124.811 4.807 QT
125.436 5.666 126.467 5.666 QT
cp
f
GR
GS
[0.75 0 0 0.75 348.7061 73.49617] CT
N
143.311 11.76 M
143.311 -12.24 L
146.592 -12.24 L
146.592 -11.287 L
144.264 -11.287 L
144.264 10.807 L
146.592 10.807 L
146.592 11.76 L
143.311 11.76 L
cp
f
GR
GS
[0.75 0 0 0.75 348.7061 73.49617] CT
N
147.93 5.838 M
147.93 1.916 L
147.93 1.729 148.149 1.729 QT
148.43 1.729 L
148.571 1.729 148.618 1.916 QT
149.29 5.401 151.852 5.401 QT
152.993 5.401 153.759 4.885 QT
154.524 4.369 154.524 3.291 QT
154.524 2.51 153.93 1.963 QT
153.337 1.416 152.509 1.229 QT
150.915 0.901 L
150.102 0.729 149.438 0.369 QT
148.774 0.01 148.352 -0.599 QT
147.93 -1.209 147.93 -2.006 QT
147.93 -3.053 148.485 -3.724 QT
149.04 -4.396 149.93 -4.701 QT
150.821 -5.006 151.852 -5.006 QT
153.087 -5.006 154.009 -4.349 QT
154.696 -4.943 L
154.696 -5.006 154.805 -5.006 QT
154.993 -5.006 L
155.055 -5.006 155.118 -4.935 QT
155.18 -4.865 155.18 -4.803 QT
155.18 -1.662 L
155.18 -1.443 154.993 -1.443 QT
154.696 -1.443 L
154.477 -1.443 154.477 -1.662 QT
154.477 -2.912 153.782 -3.678 QT
153.087 -4.443 151.837 -4.443 QT
150.759 -4.443 149.969 -4.045 QT
149.18 -3.646 149.18 -2.662 QT
149.18 -2.006 149.743 -1.576 QT
150.305 -1.146 151.071 -0.959 QT
152.696 -0.646 L
153.524 -0.459 154.235 -0.014 QT
154.946 0.432 155.36 1.111 QT
155.774 1.791 155.774 2.635 QT
155.774 3.51 155.477 4.151 QT
155.18 4.791 154.641 5.213 QT
154.102 5.635 153.376 5.83 QT
152.649 6.026 151.852 6.026 QT
150.352 6.026 149.29 5.026 QT
148.415 5.979 L
148.415 6.026 148.29 6.026 QT
148.149 6.026 L
147.93 6.026 147.93 5.838 QT
cp
f
GR
GS
[0.75 0 0 0.75 348.7061 73.49617] CT
N
157.131 11.76 M
157.131 10.807 L
159.46 10.807 L
159.46 -11.287 L
157.131 -11.287 L
157.131 -12.24 L
160.428 -12.24 L
160.428 11.76 L
157.131 11.76 L
cp
f
GR
GS
[0.75 0 0 0.75 331.47757 73.49617] CT
1 0 0 RC
10.0 ML
0.667 LW
N
0 -4 M
0 4 L
-4 0 M
4 0 L
-2.828 -2.828 M
2.828 2.828 L
-2.828 2.828 M
2.828 -2.828 L
S
GR
GS
[0.75 0 0 0.75 348.7061 95.375] CT
N
0.625 5.76 M
0.625 4.916 L
3.219 4.916 3.219 4.151 QT
3.219 -9.037 L
3.219 -9.787 0.625 -9.787 QT
0.625 -10.631 L
8.047 -10.631 L
8.047 -9.787 L
5.453 -9.787 5.453 -9.037 QT
5.453 4.151 L
5.453 4.916 8.047 4.916 QT
8.047 5.76 L
0.625 5.76 L
cp
f
GR
GS
[0.75 0 0 0.75 348.7061 95.375] CT
N
9.385 5.76 M
9.385 4.916 L
10.198 4.916 10.729 4.783 QT
11.26 4.651 11.26 4.151 QT
11.26 -2.396 L
11.26 -3.037 11.065 -3.326 QT
10.87 -3.615 10.51 -3.678 QT
10.151 -3.74 9.385 -3.74 QT
9.385 -4.584 L
12.87 -4.849 L
12.87 -2.506 L
13.339 -3.537 14.284 -4.193 QT
15.229 -4.849 16.339 -4.849 QT
18.01 -4.849 18.846 -4.053 QT
19.682 -3.256 19.682 -1.615 QT
19.682 4.151 L
19.682 4.651 20.214 4.783 QT
20.745 4.916 21.557 4.916 QT
21.557 5.76 L
16.057 5.76 L
16.057 4.916 L
16.885 4.916 17.409 4.783 QT
17.932 4.651 17.932 4.151 QT
17.932 -1.537 L
17.932 -2.709 17.596 -3.467 QT
17.26 -4.224 16.198 -4.224 QT
14.807 -4.224 13.909 -3.115 QT
13.01 -2.006 13.01 -0.584 QT
13.01 4.151 L
13.01 4.651 13.542 4.783 QT
14.073 4.916 14.885 4.916 QT
14.885 5.76 L
9.385 5.76 L
cp
f
GR
GS
[0.75 0 0 0.75 348.7061 95.375] CT
N
27.984 6.026 M
26.531 6.026 25.344 5.268 QT
24.156 4.51 23.477 3.252 QT
22.797 1.994 22.797 0.572 QT
22.797 -0.834 23.469 -2.139 QT
24.141 -3.443 25.336 -4.224 QT
26.531 -5.006 27.984 -5.006 QT
29.391 -5.006 30.539 -4.451 QT
31.688 -3.896 31.688 -2.646 QT
31.688 -2.178 31.359 -1.834 QT
31.031 -1.49 30.547 -1.49 QT
30.063 -1.49 29.727 -1.834 QT
29.391 -2.178 29.391 -2.646 QT
29.391 -3.068 29.664 -3.381 QT
29.938 -3.693 30.328 -3.771 QT
29.5 -4.303 28 -4.303 QT
26.859 -4.303 26.156 -3.537 QT
25.453 -2.771 25.172 -1.646 QT
24.891 -0.521 24.891 0.572 QT
24.891 1.744 25.234 2.822 QT
25.578 3.901 26.344 4.611 QT
27.109 5.322 28.266 5.322 QT
29.406 5.322 30.203 4.627 QT
31 3.932 31.297 2.807 QT
31.297 2.666 31.484 2.666 QT
31.781 2.666 L
31.844 2.666 31.906 2.729 QT
31.969 2.791 31.969 2.869 QT
31.969 2.947 L
31.594 4.369 30.516 5.197 QT
29.438 6.026 27.984 6.026 QT
cp
f
GR
GS
[0.75 0 0 0.75 348.7061 95.375] CT
N
35.26 2.901 M
35.26 -2.396 L
35.26 -3.037 35.065 -3.326 QT
34.87 -3.615 34.51 -3.678 QT
34.151 -3.74 33.385 -3.74 QT
33.385 -4.584 L
37.01 -4.849 L
37.01 2.901 L
37.01 3.838 37.151 4.361 QT
37.292 4.885 37.729 5.143 QT
38.167 5.401 39.12 5.401 QT
40.417 5.401 41.175 4.322 QT
41.932 3.244 41.932 1.869 QT
41.932 -2.396 L
41.932 -3.037 41.737 -3.326 QT
41.542 -3.615 41.182 -3.678 QT
40.823 -3.74 40.057 -3.74 QT
40.057 -4.584 L
43.682 -4.849 L
43.682 3.572 L
43.682 4.213 43.878 4.502 QT
44.073 4.791 44.432 4.854 QT
44.792 4.916 45.557 4.916 QT
45.557 5.76 L
42.01 6.026 L
42.01 3.994 L
41.557 4.901 40.76 5.463 QT
39.964 6.026 39.01 6.026 QT
37.292 6.026 36.276 5.291 QT
35.26 4.557 35.26 2.901 QT
cp
f
GR
GS
[0.75 0 0 0.75 348.7061 95.375] CT
N
46.719 5.76 M
46.719 4.916 L
47.531 4.916 48.063 4.783 QT
48.594 4.651 48.594 4.151 QT
48.594 -2.396 L
48.594 -3.037 48.399 -3.326 QT
48.203 -3.615 47.844 -3.678 QT
47.484 -3.74 46.719 -3.74 QT
46.719 -4.584 L
50.203 -4.849 L
50.203 -2.506 L
50.672 -3.537 51.617 -4.193 QT
52.563 -4.849 53.672 -4.849 QT
56.438 -4.849 56.922 -2.599 QT
57.406 -3.599 58.328 -4.224 QT
59.25 -4.849 60.359 -4.849 QT
61.453 -4.849 62.195 -4.498 QT
62.938 -4.146 63.313 -3.428 QT
63.688 -2.709 63.688 -1.615 QT
63.688 4.151 L
63.688 4.651 64.219 4.783 QT
64.75 4.916 65.563 4.916 QT
65.563 5.76 L
60.063 5.76 L
60.063 4.916 L
60.891 4.916 61.414 4.783 QT
61.938 4.651 61.938 4.151 QT
61.938 -1.537 L
61.938 -2.756 61.602 -3.49 QT
61.266 -4.224 60.203 -4.224 QT
58.828 -4.224 57.922 -3.115 QT
57.016 -2.006 57.016 -0.584 QT
57.016 4.151 L
57.016 4.651 57.547 4.783 QT
58.078 4.916 58.891 4.916 QT
58.891 5.76 L
53.391 5.76 L
53.391 4.916 L
54.219 4.916 54.742 4.783 QT
55.266 4.651 55.266 4.151 QT
55.266 -1.537 L
55.266 -2.709 54.93 -3.467 QT
54.594 -4.224 53.531 -4.224 QT
52.141 -4.224 51.242 -3.115 QT
50.344 -2.006 50.344 -0.584 QT
50.344 4.151 L
50.344 4.651 50.875 4.783 QT
51.406 4.916 52.219 4.916 QT
52.219 5.76 L
46.719 5.76 L
cp
f
GR
GS
[0.75 0 0 0.75 348.7061 95.375] CT
N
67.833 5.76 M
67.833 -8.443 L
67.833 -9.084 67.638 -9.373 QT
67.443 -9.662 67.083 -9.724 QT
66.724 -9.787 65.958 -9.787 QT
65.958 -10.631 L
69.505 -10.896 L
69.505 -3.381 L
69.912 -3.834 70.443 -4.162 QT
70.974 -4.49 71.583 -4.67 QT
72.193 -4.849 72.818 -4.849 QT
73.896 -4.849 74.818 -4.412 QT
75.74 -3.974 76.419 -3.217 QT
77.099 -2.459 77.482 -1.467 QT
77.865 -0.474 77.865 0.572 QT
77.865 2.026 77.154 3.283 QT
76.443 4.541 75.216 5.283 QT
73.99 6.026 72.537 6.026 QT
71.615 6.026 70.763 5.557 QT
69.912 5.088 69.349 4.322 QT
68.521 5.76 L
67.833 5.76 L
cp
69.583 3.401 M
69.974 4.276 70.724 4.838 QT
71.474 5.401 72.396 5.401 QT
73.63 5.401 74.396 4.682 QT
75.162 3.963 75.466 2.877 QT
75.771 1.791 75.771 0.572 QT
75.771 -1.443 75.255 -2.506 QT
75.021 -2.974 74.615 -3.373 QT
74.208 -3.771 73.708 -3.998 QT
73.208 -4.224 72.662 -4.224 QT
71.693 -4.224 70.873 -3.717 QT
70.052 -3.209 69.583 -2.349 QT
69.583 3.401 L
cp
f
GR
GS
[0.75 0 0 0.75 348.7061 95.375] CT
N
85.318 6.026 M
83.849 6.026 82.623 5.26 QT
81.396 4.494 80.701 3.213 QT
80.005 1.932 80.005 0.494 QT
80.005 -0.912 80.646 -2.178 QT
81.287 -3.443 82.427 -4.224 QT
83.568 -5.006 84.974 -5.006 QT
86.068 -5.006 86.888 -4.631 QT
87.709 -4.256 88.232 -3.599 QT
88.755 -2.943 89.029 -2.053 QT
89.302 -1.162 89.302 -0.099 QT
89.302 0.213 89.052 0.213 QT
82.099 0.213 L
82.099 0.479 L
82.099 2.463 82.904 3.893 QT
83.709 5.322 85.521 5.322 QT
86.255 5.322 86.888 4.994 QT
87.521 4.666 87.982 4.08 QT
88.443 3.494 88.599 2.822 QT
88.63 2.744 88.693 2.682 QT
88.755 2.619 88.834 2.619 QT
89.052 2.619 L
89.302 2.619 89.302 2.916 QT
88.959 4.276 87.834 5.151 QT
86.709 6.026 85.318 6.026 QT
cp
82.13 -0.381 M
87.599 -0.381 L
87.599 -1.287 87.349 -2.209 QT
87.099 -3.131 86.513 -3.748 QT
85.927 -4.365 84.974 -4.365 QT
83.615 -4.365 82.873 -3.092 QT
82.13 -1.818 82.13 -0.381 QT
cp
f
GR
GS
[0.75 0 0 0.75 348.7061 95.375] CT
N
90.719 5.76 M
90.719 4.916 L
91.531 4.916 92.063 4.783 QT
92.594 4.651 92.594 4.151 QT
92.594 -2.396 L
92.594 -3.037 92.399 -3.326 QT
92.203 -3.615 91.844 -3.678 QT
91.485 -3.74 90.719 -3.74 QT
90.719 -4.584 L
94.203 -4.849 L
94.203 -2.506 L
94.672 -3.537 95.617 -4.193 QT
96.563 -4.849 97.672 -4.849 QT
99.344 -4.849 100.18 -4.053 QT
101.016 -3.256 101.016 -1.615 QT
101.016 4.151 L
101.016 4.651 101.547 4.783 QT
102.078 4.916 102.891 4.916 QT
102.891 5.76 L
97.391 5.76 L
97.391 4.916 L
98.219 4.916 98.742 4.783 QT
99.266 4.651 99.266 4.151 QT
99.266 -1.537 L
99.266 -2.709 98.93 -3.467 QT
98.594 -4.224 97.531 -4.224 QT
96.141 -4.224 95.242 -3.115 QT
94.344 -2.006 94.344 -0.584 QT
94.344 4.151 L
94.344 4.651 94.875 4.783 QT
95.406 4.916 96.219 4.916 QT
96.219 5.76 L
90.719 5.76 L
cp
f
GR
GS
[0.75 0 0 0.75 348.7061 95.375] CT
N
105.12 2.869 M
105.12 -3.74 L
103.12 -3.74 L
103.12 -4.365 L
104.698 -4.365 105.433 -5.834 QT
106.167 -7.303 106.167 -9.006 QT
106.87 -9.006 L
106.87 -4.584 L
110.245 -4.584 L
110.245 -3.74 L
106.87 -3.74 L
106.87 2.822 L
106.87 3.822 107.198 4.572 QT
107.526 5.322 108.401 5.322 QT
109.214 5.322 109.581 4.533 QT
109.948 3.744 109.948 2.822 QT
109.948 1.416 L
110.636 1.416 L
110.636 2.869 L
110.636 3.619 110.362 4.354 QT
110.089 5.088 109.55 5.557 QT
109.011 6.026 108.229 6.026 QT
106.792 6.026 105.956 5.166 QT
105.12 4.307 105.12 2.869 QT
cp
f
GR
GS
[0.75 0 0 0.75 0 0.5] CT
0 0.447 0.741 RC
1 LJ
0.667 LW
N
421.995 126.5 M
461.945 126.5 L
S
GR
GS
[0.75 0 0 0.75 348.7061 117.25383] CT
N
0.828 5.76 M
0.828 4.916 L
3.297 4.916 3.297 4.151 QT
3.297 -9.037 L
3.297 -9.787 0.828 -9.787 QT
0.828 -10.631 L
9.641 -10.631 L
10.859 -10.631 12.102 -10.162 QT
13.344 -9.693 14.164 -8.756 QT
14.984 -7.818 14.984 -6.553 QT
14.984 -5.099 13.781 -4.107 QT
12.578 -3.115 10.969 -2.803 QT
12.016 -2.803 13.117 -2.232 QT
14.219 -1.662 14.922 -0.701 QT
15.625 0.26 15.625 1.338 QT
15.625 2.651 14.844 3.658 QT
14.063 4.666 12.82 5.213 QT
11.578 5.76 10.328 5.76 QT
0.828 5.76 L
cp
5.375 4.151 M
5.375 4.666 5.672 4.791 QT
5.969 4.916 6.594 4.916 QT
9.641 4.916 L
10.578 4.916 11.383 4.424 QT
12.188 3.932 12.656 3.104 QT
13.125 2.276 13.125 1.338 QT
13.125 0.432 12.742 -0.443 QT
12.359 -1.318 11.633 -1.881 QT
10.906 -2.443 9.984 -2.443 QT
5.375 -2.443 L
5.375 4.151 L
cp
5.375 -3.084 M
8.984 -3.084 L
9.703 -3.084 10.344 -3.342 QT
10.984 -3.599 11.492 -4.099 QT
12 -4.599 12.273 -5.224 QT
12.547 -5.849 12.547 -6.553 QT
12.547 -7.178 12.344 -7.756 QT
12.141 -8.334 11.742 -8.803 QT
11.344 -9.271 10.805 -9.529 QT
10.266 -9.787 9.641 -9.787 QT
6.594 -9.787 L
6.172 -9.787 5.93 -9.756 QT
5.688 -9.724 5.531 -9.553 QT
5.375 -9.381 5.375 -9.037 QT
5.375 -3.084 L
cp
f
GR
GS
[0.75 0 0 0.75 348.7061 117.25383] CT
N
22.984 6.026 M
21.516 6.026 20.289 5.26 QT
19.063 4.494 18.367 3.213 QT
17.672 1.932 17.672 0.494 QT
17.672 -0.912 18.313 -2.178 QT
18.953 -3.443 20.094 -4.224 QT
21.234 -5.006 22.641 -5.006 QT
23.734 -5.006 24.555 -4.631 QT
25.375 -4.256 25.898 -3.599 QT
26.422 -2.943 26.695 -2.053 QT
26.969 -1.162 26.969 -0.099 QT
26.969 0.213 26.719 0.213 QT
19.766 0.213 L
19.766 0.479 L
19.766 2.463 20.57 3.893 QT
21.375 5.322 23.188 5.322 QT
23.922 5.322 24.555 4.994 QT
25.188 4.666 25.648 4.08 QT
26.109 3.494 26.266 2.822 QT
26.297 2.744 26.359 2.682 QT
26.422 2.619 26.5 2.619 QT
26.719 2.619 L
26.969 2.619 26.969 2.916 QT
26.625 4.276 25.5 5.151 QT
24.375 6.026 22.984 6.026 QT
cp
19.797 -0.381 M
25.266 -0.381 L
25.266 -1.287 25.016 -2.209 QT
24.766 -3.131 24.18 -3.748 QT
23.594 -4.365 22.641 -4.365 QT
21.281 -4.365 20.539 -3.092 QT
19.797 -1.818 19.797 -0.381 QT
cp
f
GR
GS
[0.75 0 0 0.75 348.7061 117.25383] CT
N
28.464 5.838 M
28.464 1.916 L
28.464 1.729 28.682 1.729 QT
28.964 1.729 L
29.104 1.729 29.151 1.916 QT
29.823 5.401 32.385 5.401 QT
33.526 5.401 34.292 4.885 QT
35.057 4.369 35.057 3.291 QT
35.057 2.51 34.464 1.963 QT
33.87 1.416 33.042 1.229 QT
31.448 0.901 L
30.635 0.729 29.971 0.369 QT
29.307 0.01 28.885 -0.599 QT
28.464 -1.209 28.464 -2.006 QT
28.464 -3.053 29.018 -3.724 QT
29.573 -4.396 30.464 -4.701 QT
31.354 -5.006 32.385 -5.006 QT
33.62 -5.006 34.542 -4.349 QT
35.229 -4.943 L
35.229 -5.006 35.339 -5.006 QT
35.526 -5.006 L
35.589 -5.006 35.651 -4.935 QT
35.714 -4.865 35.714 -4.803 QT
35.714 -1.662 L
35.714 -1.443 35.526 -1.443 QT
35.229 -1.443 L
35.01 -1.443 35.01 -1.662 QT
35.01 -2.912 34.315 -3.678 QT
33.62 -4.443 32.37 -4.443 QT
31.292 -4.443 30.503 -4.045 QT
29.714 -3.646 29.714 -2.662 QT
29.714 -2.006 30.276 -1.576 QT
30.839 -1.146 31.604 -0.959 QT
33.229 -0.646 L
34.057 -0.459 34.768 -0.014 QT
35.479 0.432 35.893 1.111 QT
36.307 1.791 36.307 2.635 QT
36.307 3.51 36.01 4.151 QT
35.714 4.791 35.175 5.213 QT
34.635 5.635 33.909 5.83 QT
33.182 6.026 32.385 6.026 QT
30.885 6.026 29.823 5.026 QT
28.948 5.979 L
28.948 6.026 28.823 6.026 QT
28.682 6.026 L
28.464 6.026 28.464 5.838 QT
cp
f
GR
GS
[0.75 0 0 0.75 348.7061 117.25383] CT
N
39.587 2.869 M
39.587 -3.74 L
37.587 -3.74 L
37.587 -4.365 L
39.165 -4.365 39.899 -5.834 QT
40.633 -7.303 40.633 -9.006 QT
41.337 -9.006 L
41.337 -4.584 L
44.712 -4.584 L
44.712 -3.74 L
41.337 -3.74 L
41.337 2.822 L
41.337 3.822 41.665 4.572 QT
41.993 5.322 42.868 5.322 QT
43.68 5.322 44.047 4.533 QT
44.415 3.744 44.415 2.822 QT
44.415 1.416 L
45.102 1.416 L
45.102 2.869 L
45.102 3.619 44.829 4.354 QT
44.555 5.088 44.016 5.557 QT
43.477 6.026 42.696 6.026 QT
41.258 6.026 40.422 5.166 QT
39.587 4.307 39.587 2.869 QT
cp
f
GR
GS
[0.75 0 0 0.75 348.7061 117.25383] CT
N
55.295 5.76 M
55.295 4.916 L
57.764 4.916 57.764 4.151 QT
57.764 -9.037 L
57.764 -9.787 55.295 -9.787 QT
55.295 -10.631 L
64.107 -10.631 L
65.326 -10.631 66.568 -10.162 QT
67.81 -9.693 68.631 -8.756 QT
69.451 -7.818 69.451 -6.553 QT
69.451 -5.099 68.248 -4.107 QT
67.045 -3.115 65.435 -2.803 QT
66.482 -2.803 67.584 -2.232 QT
68.685 -1.662 69.389 -0.701 QT
70.092 0.26 70.092 1.338 QT
70.092 2.651 69.31 3.658 QT
68.529 4.666 67.287 5.213 QT
66.045 5.76 64.795 5.76 QT
55.295 5.76 L
cp
59.842 4.151 M
59.842 4.666 60.139 4.791 QT
60.435 4.916 61.06 4.916 QT
64.107 4.916 L
65.045 4.916 65.85 4.424 QT
66.654 3.932 67.123 3.104 QT
67.592 2.276 67.592 1.338 QT
67.592 0.432 67.209 -0.443 QT
66.826 -1.318 66.1 -1.881 QT
65.373 -2.443 64.451 -2.443 QT
59.842 -2.443 L
59.842 4.151 L
cp
59.842 -3.084 M
63.451 -3.084 L
64.17 -3.084 64.81 -3.342 QT
65.451 -3.599 65.959 -4.099 QT
66.467 -4.599 66.74 -5.224 QT
67.014 -5.849 67.014 -6.553 QT
67.014 -7.178 66.81 -7.756 QT
66.607 -8.334 66.209 -8.803 QT
65.81 -9.271 65.271 -9.529 QT
64.732 -9.787 64.107 -9.787 QT
61.06 -9.787 L
60.639 -9.787 60.396 -9.756 QT
60.154 -9.724 59.998 -9.553 QT
59.842 -9.381 59.842 -9.037 QT
59.842 -3.084 L
cp
f
GR
GS
[0.75 0 0 0.75 348.7061 117.25383] CT
N
77.467 6.026 M
76.029 6.026 74.795 5.291 QT
73.561 4.557 72.85 3.33 QT
72.139 2.104 72.139 0.651 QT
72.139 -0.459 72.529 -1.474 QT
72.92 -2.49 73.654 -3.295 QT
74.389 -4.099 75.357 -4.553 QT
76.326 -5.006 77.467 -5.006 QT
78.951 -5.006 80.162 -4.224 QT
81.373 -3.443 82.076 -2.139 QT
82.779 -0.834 82.779 0.651 QT
82.779 2.088 82.061 3.322 QT
81.342 4.557 80.123 5.291 QT
78.904 6.026 77.467 6.026 QT
cp
77.467 5.322 M
79.389 5.322 80.037 3.932 QT
80.686 2.541 80.686 0.385 QT
80.686 -0.834 80.553 -1.623 QT
80.42 -2.412 79.982 -3.053 QT
79.717 -3.459 79.303 -3.756 QT
78.889 -4.053 78.428 -4.209 QT
77.967 -4.365 77.467 -4.365 QT
76.717 -4.365 76.045 -4.029 QT
75.373 -3.693 74.92 -3.053 QT
74.482 -2.381 74.357 -1.56 QT
74.232 -0.74 74.232 0.385 QT
74.232 1.729 74.467 2.799 QT
74.701 3.869 75.412 4.596 QT
76.123 5.322 77.467 5.322 QT
cp
f
GR
GS
[0.75 0 0 0.75 348.7061 117.25383] CT
N
86.061 2.901 M
86.061 -2.396 L
86.061 -3.037 85.865 -3.326 QT
85.67 -3.615 85.311 -3.678 QT
84.951 -3.74 84.186 -3.74 QT
84.186 -4.584 L
87.811 -4.849 L
87.811 2.901 L
87.811 3.838 87.951 4.361 QT
88.092 4.885 88.529 5.143 QT
88.967 5.401 89.92 5.401 QT
91.217 5.401 91.975 4.322 QT
92.732 3.244 92.732 1.869 QT
92.732 -2.396 L
92.732 -3.037 92.537 -3.326 QT
92.342 -3.615 91.982 -3.678 QT
91.623 -3.74 90.857 -3.74 QT
90.857 -4.584 L
94.482 -4.849 L
94.482 3.572 L
94.482 4.213 94.678 4.502 QT
94.873 4.791 95.232 4.854 QT
95.592 4.916 96.357 4.916 QT
96.357 5.76 L
92.811 6.026 L
92.811 3.994 L
92.357 4.901 91.561 5.463 QT
90.764 6.026 89.811 6.026 QT
88.092 6.026 87.076 5.291 QT
86.061 4.557 86.061 2.901 QT
cp
f
GR
GS
[0.75 0 0 0.75 348.7061 117.25383] CT
N
97.519 5.76 M
97.519 4.916 L
98.331 4.916 98.863 4.783 QT
99.394 4.651 99.394 4.151 QT
99.394 -2.396 L
99.394 -3.037 99.199 -3.326 QT
99.003 -3.615 98.644 -3.678 QT
98.285 -3.74 97.519 -3.74 QT
97.519 -4.584 L
101.003 -4.849 L
101.003 -2.506 L
101.472 -3.537 102.417 -4.193 QT
103.363 -4.849 104.472 -4.849 QT
106.144 -4.849 106.98 -4.053 QT
107.816 -3.256 107.816 -1.615 QT
107.816 4.151 L
107.816 4.651 108.347 4.783 QT
108.878 4.916 109.691 4.916 QT
109.691 5.76 L
104.191 5.76 L
104.191 4.916 L
105.019 4.916 105.542 4.783 QT
106.066 4.651 106.066 4.151 QT
106.066 -1.537 L
106.066 -2.709 105.73 -3.467 QT
105.394 -4.224 104.331 -4.224 QT
102.941 -4.224 102.042 -3.115 QT
101.144 -2.006 101.144 -0.584 QT
101.144 4.151 L
101.144 4.651 101.675 4.783 QT
102.206 4.916 103.019 4.916 QT
103.019 5.76 L
97.519 5.76 L
cp
f
GR
GS
[0.75 0 0 0.75 348.7061 117.25383] CT
N
115.993 6.026 M
114.571 6.026 113.399 5.26 QT
112.227 4.494 111.579 3.236 QT
110.93 1.979 110.93 0.572 QT
110.93 -0.881 111.641 -2.123 QT
112.352 -3.365 113.571 -4.107 QT
114.79 -4.849 116.259 -4.849 QT
117.134 -4.849 117.915 -4.482 QT
118.696 -4.115 119.274 -3.459 QT
119.274 -8.443 L
119.274 -9.084 119.079 -9.373 QT
118.884 -9.662 118.532 -9.724 QT
118.18 -9.787 117.415 -9.787 QT
117.415 -10.631 L
120.962 -10.896 L
120.962 3.572 L
120.962 4.213 121.157 4.502 QT
121.352 4.791 121.712 4.854 QT
122.071 4.916 122.821 4.916 QT
122.821 5.76 L
119.212 6.026 L
119.212 4.51 L
118.587 5.229 117.727 5.627 QT
116.868 6.026 115.993 6.026 QT
cp
113.54 3.666 M
113.962 4.463 114.641 4.932 QT
115.321 5.401 116.134 5.401 QT
117.134 5.401 117.962 4.822 QT
118.79 4.244 119.212 3.338 QT
119.212 -2.428 L
118.93 -2.943 118.501 -3.365 QT
118.071 -3.787 117.54 -4.006 QT
117.009 -4.224 116.399 -4.224 QT
115.149 -4.224 114.391 -3.514 QT
113.634 -2.803 113.329 -1.701 QT
113.024 -0.599 113.024 0.604 QT
113.024 1.557 113.118 2.276 QT
113.212 2.994 113.54 3.666 QT
cp
f
GR
GS
[0.75 0 0 0.75 0 0.5] CT
0.851 0.325 0.098 RC
1 LJ
0.667 LW
N
421.995 155.672 M
461.945 155.672 L
S
GR
GS
[0.75 0 0 0.75 0 0.5] CT
0.149 GC
10.0 ML
0.667 LW
N
418 172 M
418 81 L
632 81 L
632 172 L
cp
S
GR
%%Trailer
%%Pages: 1
%%EOF
