%!PS-Adobe-3.0 EPSF-3.0
%%Creator: (MATLAB, The Mathworks, Inc. Version 9.12.0.2529717 \(R2022a\) Update 8. Operating System: Linux)
%%Title: plots/Example3_ux.eps
%%CreationDate: 2024-06-10T20:08:31
%%Pages: (atend)
%%BoundingBox:     3     2   381   311
%%LanguageLevel: 3
%%EndComments
%%BeginProlog
%%BeginResource: procset (Apache XML Graphics Std ProcSet) 1.2 0
%%Version: 1.2 0
%%Copyright: (Copyright 2001-2003,2010 The Apache Software Foundation. License terms: http://www.apache.org/licenses/LICENSE-2.0)
/bd{bind def}bind def
/ld{load def}bd
/GR/grestore ld
/GS/gsave ld
/RM/rmoveto ld
/C/curveto ld
/t/show ld
/L/lineto ld
/ML/setmiterlimit ld
/CT/concat ld
/f/fill ld
/N/newpath ld
/S/stroke ld
/CC/setcmykcolor ld
/A/ashow ld
/cp/closepath ld
/RC/setrgbcolor ld
/LJ/setlinejoin ld
/GC/setgray ld
/LW/setlinewidth ld
/M/moveto ld
/re {4 2 roll M
1 index 0 rlineto
0 exch rlineto
neg 0 rlineto
cp } bd
/_ctm matrix def
/_tm matrix def
/BT { _ctm currentmatrix pop matrix _tm copy pop 0 0 moveto } bd
/ET { _ctm setmatrix } bd
/iTm { _ctm setmatrix _tm concat } bd
/Tm { _tm astore pop iTm 0 0 moveto } bd
/ux 0.0 def
/uy 0.0 def
/F {
  /Tp exch def
  /Tf exch def
  Tf findfont Tp scalefont setfont
  /cf Tf def  /cs Tp def
} bd
/ULS {currentpoint /uy exch def /ux exch def} bd
/ULE {
  /Tcx currentpoint pop def
  gsave
  newpath
  cf findfont cs scalefont dup
  /FontMatrix get 0 get /Ts exch def /FontInfo get dup
  /UnderlinePosition get Ts mul /To exch def
  /UnderlineThickness get Ts mul /Tt exch def
  ux uy To add moveto  Tcx uy To add lineto
  Tt setlinewidth stroke
  grestore
} bd
/OLE {
  /Tcx currentpoint pop def
  gsave
  newpath
  cf findfont cs scalefont dup
  /FontMatrix get 0 get /Ts exch def /FontInfo get dup
  /UnderlinePosition get Ts mul /To exch def
  /UnderlineThickness get Ts mul /Tt exch def
  ux uy To add cs add moveto Tcx uy To add cs add lineto
  Tt setlinewidth stroke
  grestore
} bd
/SOE {
  /Tcx currentpoint pop def
  gsave
  newpath
  cf findfont cs scalefont dup
  /FontMatrix get 0 get /Ts exch def /FontInfo get dup
  /UnderlinePosition get Ts mul /To exch def
  /UnderlineThickness get Ts mul /Tt exch def
  ux uy To add cs 10 mul 26 idiv add moveto Tcx uy To add cs 10 mul 26 idiv add lineto
  Tt setlinewidth stroke
  grestore
} bd
/QT {
/Y22 exch store
/X22 exch store
/Y21 exch store
/X21 exch store
currentpoint
/Y21 load 2 mul add 3 div exch
/X21 load 2 mul add 3 div exch
/X21 load 2 mul /X22 load add 3 div
/Y21 load 2 mul /Y22 load add 3 div
/X22 load /Y22 load curveto
} bd
/SSPD {
dup length /d exch dict def
{
/v exch def
/k exch def
currentpagedevice k known {
/cpdv currentpagedevice k get def
v cpdv ne {
/upd false def
/nullv v type /nulltype eq def
/nullcpdv cpdv type /nulltype eq def
nullv nullcpdv or
{
/upd true def
} {
/sametype v type cpdv type eq def
sametype {
v type /arraytype eq {
/vlen v length def
/cpdvlen cpdv length def
vlen cpdvlen eq {
0 1 vlen 1 sub {
/i exch def
/obj v i get def
/cpdobj cpdv i get def
obj cpdobj ne {
/upd true def
exit
} if
} for
} {
/upd true def
} ifelse
} {
v type /dicttype eq {
v {
/dv exch def
/dk exch def
/cpddv cpdv dk get def
dv cpddv ne {
/upd true def
exit
} if
} forall
} {
/upd true def
} ifelse
} ifelse
} if
} ifelse
upd true eq {
d k v put
} if
} if
} if
} forall
d length 0 gt {
d setpagedevice
} if
} bd
/RE { % /NewFontName [NewEncodingArray] /FontName RE -
  findfont dup length dict begin
  {
    1 index /FID ne
    {def} {pop pop} ifelse
  } forall
  /Encoding exch def
  /FontName 1 index def
  currentdict definefont pop
  end
} bind def
%%EndResource
%%BeginResource: procset (Apache XML Graphics EPS ProcSet) 1.0 0
%%Version: 1.0 0
%%Copyright: (Copyright 2002-2003 The Apache Software Foundation. License terms: http://www.apache.org/licenses/LICENSE-2.0)
/BeginEPSF { %def
/b4_Inc_state save def         % Save state for cleanup
/dict_count countdictstack def % Count objects on dict stack
/op_count count 1 sub def      % Count objects on operand stack
userdict begin                 % Push userdict on dict stack
/showpage { } def              % Redefine showpage, { } = null proc
0 setgray 0 setlinecap         % Prepare graphics state
1 setlinewidth 0 setlinejoin
10 setmiterlimit [ ] 0 setdash newpath
/languagelevel where           % If level not equal to 1 then
{pop languagelevel             % set strokeadjust and
1 ne                           % overprint to their defaults.
{false setstrokeadjust false setoverprint
} if
} if
} bd
/EndEPSF { %def
count op_count sub {pop} repeat            % Clean up stacks
countdictstack dict_count sub {end} repeat
b4_Inc_state restore
} bd
%%EndResource
%FOPBeginFontDict
%%IncludeResource: font Courier-Oblique
%%IncludeResource: font Courier-BoldOblique
%%IncludeResource: font Courier-Bold
%%IncludeResource: font ZapfDingbats
%%IncludeResource: font Symbol
%%IncludeResource: font Helvetica
%%IncludeResource: font Helvetica-Oblique
%%IncludeResource: font Helvetica-Bold
%%IncludeResource: font Helvetica-BoldOblique
%%IncludeResource: font Times-Roman
%%IncludeResource: font Times-Italic
%%IncludeResource: font Times-Bold
%%IncludeResource: font Times-BoldItalic
%%IncludeResource: font Courier
%FOPEndFontDict
%%BeginResource: encoding WinAnsiEncoding
/WinAnsiEncoding [
/.notdef /.notdef /.notdef /.notdef /.notdef
/.notdef /.notdef /.notdef /.notdef /.notdef
/.notdef /.notdef /.notdef /.notdef /.notdef
/.notdef /.notdef /.notdef /.notdef /.notdef
/.notdef /.notdef /.notdef /.notdef /.notdef
/.notdef /.notdef /.notdef /.notdef /.notdef
/.notdef /.notdef /space /exclam /quotedbl
/numbersign /dollar /percent /ampersand /quotesingle
/parenleft /parenright /asterisk /plus /comma
/hyphen /period /slash /zero /one
/two /three /four /five /six
/seven /eight /nine /colon /semicolon
/less /equal /greater /question /at
/A /B /C /D /E
/F /G /H /I /J
/K /L /M /N /O
/P /Q /R /S /T
/U /V /W /X /Y
/Z /bracketleft /backslash /bracketright /asciicircum
/underscore /quoteleft /a /b /c
/d /e /f /g /h
/i /j /k /l /m
/n /o /p /q /r
/s /t /u /v /w
/x /y /z /braceleft /bar
/braceright /asciitilde /bullet /Euro /bullet
/quotesinglbase /florin /quotedblbase /ellipsis /dagger
/daggerdbl /circumflex /perthousand /Scaron /guilsinglleft
/OE /bullet /Zcaron /bullet /bullet
/quoteleft /quoteright /quotedblleft /quotedblright /bullet
/endash /emdash /asciitilde /trademark /scaron
/guilsinglright /oe /bullet /zcaron /Ydieresis
/space /exclamdown /cent /sterling /currency
/yen /brokenbar /section /dieresis /copyright
/ordfeminine /guillemotleft /logicalnot /sfthyphen /registered
/macron /degree /plusminus /twosuperior /threesuperior
/acute /mu /paragraph /middot /cedilla
/onesuperior /ordmasculine /guillemotright /onequarter /onehalf
/threequarters /questiondown /Agrave /Aacute /Acircumflex
/Atilde /Adieresis /Aring /AE /Ccedilla
/Egrave /Eacute /Ecircumflex /Edieresis /Igrave
/Iacute /Icircumflex /Idieresis /Eth /Ntilde
/Ograve /Oacute /Ocircumflex /Otilde /Odieresis
/multiply /Oslash /Ugrave /Uacute /Ucircumflex
/Udieresis /Yacute /Thorn /germandbls /agrave
/aacute /acircumflex /atilde /adieresis /aring
/ae /ccedilla /egrave /eacute /ecircumflex
/edieresis /igrave /iacute /icircumflex /idieresis
/eth /ntilde /ograve /oacute /ocircumflex
/otilde /odieresis /divide /oslash /ugrave
/uacute /ucircumflex /udieresis /yacute /thorn
/ydieresis
] def
%%EndResource
%FOPBeginFontReencode
/Courier-Oblique findfont
dup length dict begin
  {1 index /FID ne {def} {pop pop} ifelse} forall
  /Encoding WinAnsiEncoding def
  currentdict
end
/Courier-Oblique exch definefont pop
/Courier-BoldOblique findfont
dup length dict begin
  {1 index /FID ne {def} {pop pop} ifelse} forall
  /Encoding WinAnsiEncoding def
  currentdict
end
/Courier-BoldOblique exch definefont pop
/Courier-Bold findfont
dup length dict begin
  {1 index /FID ne {def} {pop pop} ifelse} forall
  /Encoding WinAnsiEncoding def
  currentdict
end
/Courier-Bold exch definefont pop
/Helvetica findfont
dup length dict begin
  {1 index /FID ne {def} {pop pop} ifelse} forall
  /Encoding WinAnsiEncoding def
  currentdict
end
/Helvetica exch definefont pop
/Helvetica-Oblique findfont
dup length dict begin
  {1 index /FID ne {def} {pop pop} ifelse} forall
  /Encoding WinAnsiEncoding def
  currentdict
end
/Helvetica-Oblique exch definefont pop
/Helvetica-Bold findfont
dup length dict begin
  {1 index /FID ne {def} {pop pop} ifelse} forall
  /Encoding WinAnsiEncoding def
  currentdict
end
/Helvetica-Bold exch definefont pop
/Helvetica-BoldOblique findfont
dup length dict begin
  {1 index /FID ne {def} {pop pop} ifelse} forall
  /Encoding WinAnsiEncoding def
  currentdict
end
/Helvetica-BoldOblique exch definefont pop
/Times-Roman findfont
dup length dict begin
  {1 index /FID ne {def} {pop pop} ifelse} forall
  /Encoding WinAnsiEncoding def
  currentdict
end
/Times-Roman exch definefont pop
/Times-Italic findfont
dup length dict begin
  {1 index /FID ne {def} {pop pop} ifelse} forall
  /Encoding WinAnsiEncoding def
  currentdict
end
/Times-Italic exch definefont pop
/Times-Bold findfont
dup length dict begin
  {1 index /FID ne {def} {pop pop} ifelse} forall
  /Encoding WinAnsiEncoding def
  currentdict
end
/Times-Bold exch definefont pop
/Times-BoldItalic findfont
dup length dict begin
  {1 index /FID ne {def} {pop pop} ifelse} forall
  /Encoding WinAnsiEncoding def
  currentdict
end
/Times-BoldItalic exch definefont pop
/Courier findfont
dup length dict begin
  {1 index /FID ne {def} {pop pop} ifelse} forall
  /Encoding WinAnsiEncoding def
  currentdict
end
/Courier exch definefont pop
%FOPEndFontReencode
%%EndProlog
%%Page: 1 1
%%PageBoundingBox: 0 0 420 315
%%BeginPageSetup
N
    3     2 M
  384     2 L
  384   313 L
    3   313 L
cp
clip
[1 0 0 -1 0 315] CT
%%EndPageSetup
GS
[0.75 0 0 0.75 0 0] CT
1 GC
N
0 0 560 420 re
f
GR
GS
[0.75 0 0 0.75 0 0] CT
1 GC
N
0 0 560 420 re
f
GR
GS
[0.75 0 0 0.75 0 0] CT
1 GC
N
73 359 M
507 359 L
507 39 L
73 39 L
cp
f
GR
GS
[0.75 0 0 0.75 0 0] CT
0.873 GC
1 LJ
0.667 LW
N
73 359 M
73 39 L
S
GR
GS
[0.75 0 0 0.75 0 0] CT
0.873 GC
1 LJ
0.667 LW
N
128.641 359 M
128.641 39 L
S
GR
GS
[0.75 0 0 0.75 0 0] CT
0.873 GC
1 LJ
0.667 LW
N
184.282 359 M
184.282 39 L
S
GR
GS
[0.75 0 0 0.75 0 0] CT
0.873 GC
1 LJ
0.667 LW
N
239.923 359 M
239.923 39 L
S
GR
GS
[0.75 0 0 0.75 0 0] CT
0.873 GC
1 LJ
0.667 LW
N
295.564 359 M
295.564 39 L
S
GR
GS
[0.75 0 0 0.75 0 0] CT
0.873 GC
1 LJ
0.667 LW
N
351.205 359 M
351.205 39 L
S
GR
GS
[0.75 0 0 0.75 0 0] CT
0.873 GC
1 LJ
0.667 LW
N
406.846 359 M
406.846 39 L
S
GR
GS
[0.75 0 0 0.75 0 0] CT
0.873 GC
1 LJ
0.667 LW
N
462.487 359 M
462.487 39 L
S
GR
GS
[0.75 0 0 0.75 0 0] CT
0.873 GC
1 LJ
0.667 LW
N
507 359 M
73 359 L
S
GR
GS
[0.75 0 0 0.75 0 0] CT
0.873 GC
1 LJ
0.667 LW
N
507 295 M
73 295 L
S
GR
GS
[0.75 0 0 0.75 0 0] CT
0.873 GC
1 LJ
0.667 LW
N
507 231 M
73 231 L
S
GR
GS
[0.75 0 0 0.75 0 0] CT
0.873 GC
1 LJ
0.667 LW
N
507 167 M
73 167 L
S
GR
GS
[0.75 0 0 0.75 0 0] CT
0.873 GC
1 LJ
0.667 LW
N
507 103 M
73 103 L
S
GR
GS
[0.75 0 0 0.75 0 0] CT
0.873 GC
1 LJ
0.667 LW
N
507 39 M
73 39 L
S
GR
GS
[0.75 0 0 0.75 0 0] CT
0.149 GC
2 setlinecap
1 LJ
0.667 LW
N
73 359 M
507 359 L
S
GR
GS
[0.75 0 0 0.75 0 0] CT
0.149 GC
2 setlinecap
1 LJ
0.667 LW
N
73 359 M
73 354.66 L
S
GR
GS
[0.75 0 0 0.75 0 0] CT
0.149 GC
2 setlinecap
1 LJ
0.667 LW
N
128.641 359 M
128.641 354.66 L
S
GR
GS
[0.75 0 0 0.75 0 0] CT
0.149 GC
2 setlinecap
1 LJ
0.667 LW
N
184.282 359 M
184.282 354.66 L
S
GR
GS
[0.75 0 0 0.75 0 0] CT
0.149 GC
2 setlinecap
1 LJ
0.667 LW
N
239.923 359 M
239.923 354.66 L
S
GR
GS
[0.75 0 0 0.75 0 0] CT
0.149 GC
2 setlinecap
1 LJ
0.667 LW
N
295.564 359 M
295.564 354.66 L
S
GR
GS
[0.75 0 0 0.75 0 0] CT
0.149 GC
2 setlinecap
1 LJ
0.667 LW
N
351.205 359 M
351.205 354.66 L
S
GR
GS
[0.75 0 0 0.75 0 0] CT
0.149 GC
2 setlinecap
1 LJ
0.667 LW
N
406.846 359 M
406.846 354.66 L
S
GR
GS
[0.75 0 0 0.75 0 0] CT
0.149 GC
2 setlinecap
1 LJ
0.667 LW
N
462.487 359 M
462.487 354.66 L
S
GR
GS
[0.75 0 0 0.75 54.75 273.24998] CT
0.149 GC
/Helvetica 13.333 F
GS
[1 0 0 1 0 0] CT
-4 15 moveto 
1 -1 scale
(0) t 
GR
GR
GS
[0.75 0 0 0.75 96.48077 273.24998] CT
0.149 GC
/Helvetica 13.333 F
GS
[1 0 0 1 0 0] CT
-4 15 moveto 
1 -1 scale
(5) t 
GR
GR
GS
[0.75 0 0 0.75 138.21154 273.24998] CT
0.149 GC
/Helvetica 13.333 F
GS
[1 0 0 1 0 0] CT
-8 15 moveto 
1 -1 scale
(10) t 
GR
GR
GS
[0.75 0 0 0.75 179.94231 273.24998] CT
0.149 GC
/Helvetica 13.333 F
GS
[1 0 0 1 0 0] CT
-8 15 moveto 
1 -1 scale
(15) t 
GR
GR
GS
[0.75 0 0 0.75 221.67309 273.24998] CT
0.149 GC
/Helvetica 13.333 F
GS
[1 0 0 1 0 0] CT
-8 15 moveto 
1 -1 scale
(20) t 
GR
GR
GS
[0.75 0 0 0.75 263.40385 273.24998] CT
0.149 GC
/Helvetica 13.333 F
GS
[1 0 0 1 0 0] CT
-8 15 moveto 
1 -1 scale
(25) t 
GR
GR
GS
[0.75 0 0 0.75 305.13462 273.24998] CT
0.149 GC
/Helvetica 13.333 F
GS
[1 0 0 1 0 0] CT
-8 15 moveto 
1 -1 scale
(30) t 
GR
GR
GS
[0.75 0 0 0.75 346.86539 273.24998] CT
0.149 GC
/Helvetica 13.333 F
GS
[1 0 0 1 0 0] CT
-8 15 moveto 
1 -1 scale
(35) t 
GR
GR
GS
[0.75 0 0 0.75 217.50016 288.50002] CT
0.149 GC
N
-43.282 22.296 M
-43.282 21.859 -43.188 21.484 QT
-41.095 13.156 L
-44.142 13.156 L
-44.438 13.156 -44.438 12.781 QT
-44.329 12.14 -44.063 12.14 QT
-40.845 12.14 L
-39.688 7.406 L
-39.563 7.031 -39.227 6.757 QT
-38.892 6.484 -38.47 6.484 QT
-38.095 6.484 -37.845 6.702 QT
-37.595 6.921 -37.595 7.296 QT
-37.595 7.374 -37.602 7.429 QT
-37.61 7.484 -37.626 7.531 QT
-38.798 12.14 L
-35.798 12.14 L
-35.501 12.14 -35.501 12.515 QT
-35.517 12.593 -35.563 12.765 QT
-35.61 12.937 -35.681 13.046 QT
-35.751 13.156 -35.892 13.156 QT
-39.048 13.156 L
-41.126 21.546 L
-41.345 22.359 -41.345 22.952 QT
-41.345 24.202 -40.485 24.202 QT
-39.22 24.202 -38.235 23.007 QT
-37.251 21.812 -36.72 20.374 QT
-36.61 20.202 -36.501 20.202 QT
-36.142 20.202 L
-36.032 20.202 -35.962 20.281 QT
-35.892 20.359 -35.892 20.468 QT
-35.892 20.515 -35.923 20.546 QT
-36.548 22.296 -37.767 23.632 QT
-38.985 24.968 -40.563 24.968 QT
-41.704 24.968 -42.493 24.218 QT
-43.282 23.468 -43.282 22.296 QT
cp
f
GR
GS
[0.75 0 0 0.75 217.50016 288.50002] CT
0.149 GC
N
-32.221 22.562 M
-32.221 22.015 -31.986 21.421 QT
-29.643 15.187 L
-29.268 14.124 -29.268 13.437 QT
-29.268 12.577 -29.893 12.577 QT
-31.049 12.577 -31.791 13.757 QT
-32.533 14.937 -32.893 16.406 QT
-32.94 16.577 -33.127 16.577 QT
-33.471 16.577 L
-33.705 16.577 -33.705 16.312 QT
-33.705 16.234 L
-33.236 14.499 -32.276 13.163 QT
-31.315 11.827 -29.846 11.827 QT
-28.815 11.827 -28.096 12.507 QT
-27.377 13.187 -27.377 14.234 QT
-27.377 14.765 -27.611 15.359 QT
-29.971 21.593 L
-30.361 22.562 -30.361 23.343 QT
-30.361 24.202 -29.705 24.202 QT
-28.565 24.202 -27.807 22.991 QT
-27.049 21.781 -26.736 20.374 QT
-26.69 20.202 -26.518 20.202 QT
-26.158 20.202 L
-26.049 20.202 -25.979 20.281 QT
-25.908 20.359 -25.908 20.468 QT
-25.908 20.484 -25.94 20.546 QT
-26.33 22.187 -27.315 23.577 QT
-28.299 24.968 -29.752 24.968 QT
-30.783 24.968 -31.502 24.265 QT
-32.221 23.562 -32.221 22.562 QT
cp
-28.955 7.062 M
-28.955 6.452 -28.44 5.96 QT
-27.924 5.468 -27.315 5.468 QT
-26.83 5.468 -26.51 5.773 QT
-26.19 6.077 -26.19 6.546 QT
-26.19 7.187 -26.705 7.679 QT
-27.221 8.171 -27.846 8.171 QT
-28.315 8.171 -28.635 7.851 QT
-28.955 7.531 -28.955 7.062 QT
cp
f
GR
GS
[0.75 0 0 0.75 217.50016 288.50002] CT
0.149 GC
N
-22.146 24.14 M
-22.146 23.968 -22.115 23.89 QT
-19.943 15.234 L
-19.74 14.437 -19.74 13.827 QT
-19.74 12.577 -20.584 12.577 QT
-21.49 12.577 -21.928 13.663 QT
-22.365 14.749 -22.787 16.406 QT
-22.787 16.484 -22.865 16.531 QT
-22.943 16.577 -23.021 16.577 QT
-23.365 16.577 L
-23.459 16.577 -23.529 16.476 QT
-23.599 16.374 -23.599 16.281 QT
-23.287 15.031 -22.998 14.148 QT
-22.709 13.265 -22.092 12.546 QT
-21.474 11.827 -20.553 11.827 QT
-19.474 11.827 -18.639 12.515 QT
-17.803 13.202 -17.803 14.265 QT
-16.928 13.124 -15.771 12.476 QT
-14.615 11.827 -13.303 11.827 QT
-11.928 11.827 -10.935 12.531 QT
-9.943 13.234 -9.943 14.515 QT
-9.053 13.249 -7.849 12.538 QT
-6.646 11.827 -5.24 11.827 QT
-3.74 11.827 -2.826 12.64 QT
-1.912 13.452 -1.912 14.952 QT
-1.912 16.14 -2.443 17.827 QT
-2.974 19.515 -3.756 21.593 QT
-4.178 22.593 -4.178 23.343 QT
-4.178 24.202 -3.49 24.202 QT
-2.365 24.202 -1.615 22.984 QT
-0.865 21.765 -0.553 20.374 QT
-0.459 20.202 -0.303 20.202 QT
0.026 20.202 L
0.151 20.202 0.229 20.281 QT
0.307 20.359 0.307 20.468 QT
0.307 20.484 0.276 20.546 QT
-0.131 22.187 -1.115 23.577 QT
-2.099 24.968 -3.568 24.968 QT
-4.584 24.968 -5.303 24.265 QT
-6.021 23.562 -6.021 22.562 QT
-6.021 22.046 -5.787 21.421 QT
-4.974 19.249 -4.428 17.531 QT
-3.881 15.812 -3.881 14.515 QT
-3.881 13.702 -4.201 13.14 QT
-4.521 12.577 -5.287 12.577 QT
-6.881 12.577 -8.037 13.546 QT
-9.193 14.515 -10.053 16.109 QT
-10.099 16.406 -10.131 16.562 QT
-12.006 23.999 L
-12.099 24.406 -12.451 24.687 QT
-12.803 24.968 -13.224 24.968 QT
-13.568 24.968 -13.826 24.741 QT
-14.084 24.515 -14.084 24.14 QT
-14.084 23.968 -14.053 23.89 QT
-12.209 16.499 L
-11.912 15.312 -11.912 14.515 QT
-11.912 13.702 -12.24 13.14 QT
-12.568 12.577 -13.365 12.577 QT
-14.428 12.577 -15.318 13.046 QT
-16.209 13.515 -16.873 14.281 QT
-17.537 15.046 -18.099 16.109 QT
-20.068 23.999 L
-20.162 24.406 -20.506 24.687 QT
-20.849 24.968 -21.287 24.968 QT
-21.631 24.968 -21.889 24.741 QT
-22.146 24.515 -22.146 24.14 QT
cp
f
GR
GS
[0.75 0 0 0.75 217.50016 288.50002] CT
0.149 GC
N
7.202 24.968 M
5.827 24.968 4.781 24.241 QT
3.734 23.515 3.195 22.296 QT
2.656 21.077 2.656 19.718 QT
2.656 17.64 3.695 15.82 QT
4.734 13.999 6.515 12.913 QT
8.296 11.827 10.343 11.827 QT
11.577 11.827 12.507 12.468 QT
13.437 13.109 13.437 14.312 QT
13.437 15.984 12.109 16.796 QT
10.781 17.609 9.109 17.804 QT
7.437 17.999 5.406 17.999 QT
5.327 17.999 L
4.859 19.734 4.859 20.952 QT
4.859 22.249 5.452 23.226 QT
6.046 24.202 7.265 24.202 QT
8.999 24.202 10.585 23.406 QT
12.171 22.609 13.187 21.218 QT
13.265 21.124 13.406 21.124 QT
13.546 21.124 13.695 21.288 QT
13.843 21.452 13.843 21.593 QT
13.843 21.702 13.796 21.765 QT
12.734 23.249 10.937 24.109 QT
9.14 24.968 7.202 24.968 QT
cp
5.499 17.249 M
7.187 17.249 8.617 17.093 QT
10.046 16.937 11.202 16.304 QT
12.359 15.671 12.359 14.343 QT
12.359 13.812 12.062 13.406 QT
11.765 12.999 11.288 12.788 QT
10.812 12.577 10.312 12.577 QT
9.077 12.577 8.093 13.241 QT
7.109 13.906 6.468 14.976 QT
5.827 16.046 5.499 17.249 QT
cp
f
GR
GS
[0.75 0 0 0.75 217.50016 288.50002] CT
0.149 GC
N
18.455 31.89 M
18.455 2.89 L
22.423 2.89 L
22.423 4.046 L
19.626 4.046 L
19.626 30.734 L
22.423 30.734 L
22.423 31.89 L
18.455 31.89 L
cp
f
GR
GS
[0.75 0 0 0.75 217.50016 288.50002] CT
0.149 GC
N
25.697 22.874 M
26.478 24.202 28.837 24.202 QT
29.853 24.202 30.775 23.851 QT
31.697 23.499 32.298 22.812 QT
32.9 22.124 32.9 21.124 QT
32.9 20.374 32.361 19.898 QT
31.822 19.421 31.04 19.249 QT
29.462 18.937 L
28.4 18.671 27.704 17.929 QT
27.009 17.187 27.009 16.14 QT
27.009 14.859 27.704 13.866 QT
28.4 12.874 29.548 12.351 QT
30.697 11.827 31.931 11.827 QT
33.243 11.827 34.29 12.452 QT
35.337 13.077 35.337 14.312 QT
35.337 14.984 34.962 15.491 QT
34.587 15.999 33.915 15.999 QT
33.525 15.999 33.251 15.749 QT
32.978 15.499 32.978 15.124 QT
32.978 14.781 33.173 14.46 QT
33.368 14.14 33.681 13.952 QT
33.993 13.765 34.337 13.765 QT
34.087 13.14 33.384 12.859 QT
32.681 12.577 31.868 12.577 QT
31.134 12.577 30.4 12.874 QT
29.665 13.171 29.22 13.741 QT
28.775 14.312 28.775 15.093 QT
28.775 15.624 29.142 16.015 QT
29.509 16.406 30.056 16.577 QT
31.728 16.921 L
32.54 17.093 33.212 17.523 QT
33.884 17.952 34.275 18.616 QT
34.665 19.281 34.665 20.124 QT
34.665 21.202 34.064 22.249 QT
33.462 23.296 32.587 23.921 QT
31.04 24.968 28.806 24.968 QT
27.259 24.968 25.97 24.257 QT
24.681 23.546 24.681 22.14 QT
24.681 21.359 25.142 20.773 QT
25.603 20.187 26.4 20.187 QT
26.868 20.187 27.181 20.468 QT
27.493 20.749 27.493 21.218 QT
27.493 21.874 27.001 22.374 QT
26.509 22.874 25.837 22.874 QT
25.697 22.874 L
cp
f
GR
GS
[0.75 0 0 0.75 217.50016 288.50002] CT
0.149 GC
N
37.572 31.89 M
37.572 30.734 L
40.384 30.734 L
40.384 4.046 L
37.572 4.046 L
37.572 2.89 L
41.54 2.89 L
41.54 31.89 L
37.572 31.89 L
cp
f
GR
GS
[0.75 0 0 0.75 0 0] CT
0.149 GC
2 setlinecap
1 LJ
0.667 LW
N
73 359 M
73 39 L
S
GR
GS
[0.75 0 0 0.75 0 0] CT
0.149 GC
2 setlinecap
1 LJ
0.667 LW
N
73 359 M
77.34 359 L
S
GR
GS
[0.75 0 0 0.75 0 0] CT
0.149 GC
2 setlinecap
1 LJ
0.667 LW
N
73 295 M
77.34 295 L
S
GR
GS
[0.75 0 0 0.75 0 0] CT
0.149 GC
2 setlinecap
1 LJ
0.667 LW
N
73 231 M
77.34 231 L
S
GR
GS
[0.75 0 0 0.75 0 0] CT
0.149 GC
2 setlinecap
1 LJ
0.667 LW
N
73 167 M
77.34 167 L
S
GR
GS
[0.75 0 0 0.75 0 0] CT
0.149 GC
2 setlinecap
1 LJ
0.667 LW
N
73 103 M
77.34 103 L
S
GR
GS
[0.75 0 0 0.75 0 0] CT
0.149 GC
2 setlinecap
1 LJ
0.667 LW
N
73 39 M
77.34 39 L
S
GR
GS
[0.75 0 0 0.75 50.75 269.25] CT
0.149 GC
/Helvetica 13.333 F
GS
[1 0 0 1 0 0] CT
-24 5.5 moveto 
1 -1 scale
(-1.5) t 
GR
GR
GS
[0.75 0 0 0.75 50.75 221.25] CT
0.149 GC
/Helvetica 13.333 F
GS
[1 0 0 1 0 0] CT
-12 5.5 moveto 
1 -1 scale
(-1) t 
GR
GR
GS
[0.75 0 0 0.75 50.75 173.25] CT
0.149 GC
/Helvetica 13.333 F
GS
[1 0 0 1 0 0] CT
-24 5.5 moveto 
1 -1 scale
(-0.5) t 
GR
GR
GS
[0.75 0 0 0.75 50.75 125.25] CT
0.149 GC
/Helvetica 13.333 F
GS
[1 0 0 1 0 0] CT
-8 5.5 moveto 
1 -1 scale
(0) t 
GR
GR
GS
[0.75 0 0 0.75 50.75 77.25] CT
0.149 GC
/Helvetica 13.333 F
GS
[1 0 0 1 0 0] CT
-19 5.5 moveto 
1 -1 scale
(0.5) t 
GR
GR
GS
[0.75 0 0 0.75 50.75 29.25] CT
0.149 GC
/Helvetica 13.333 F
GS
[1 0 0 1 0 0] CT
-8 5.5 moveto 
1 -1 scale
(1) t 
GR
GR
GS
[0 -0.75 0.75 0 29.75 149.24989] CT
0.149 GC
N
-53.02 -13.716 M
-53.02 -14.669 -52.77 -15.669 QT
-52.52 -16.669 -52.059 -17.888 QT
-51.598 -19.107 -51.254 -20.013 QT
-50.879 -21.076 -50.879 -21.763 QT
-50.879 -22.623 -51.504 -22.623 QT
-52.66 -22.623 -53.402 -21.443 QT
-54.145 -20.263 -54.504 -18.794 QT
-54.551 -18.623 -54.738 -18.623 QT
-55.082 -18.623 L
-55.317 -18.623 -55.317 -18.888 QT
-55.317 -18.966 L
-54.848 -20.701 -53.887 -22.037 QT
-52.926 -23.373 -51.457 -23.373 QT
-50.426 -23.373 -49.707 -22.693 QT
-48.988 -22.013 -48.988 -20.966 QT
-48.988 -20.435 -49.223 -19.841 QT
-49.363 -19.482 -49.817 -18.294 QT
-50.27 -17.107 -50.504 -16.326 QT
-50.738 -15.544 -50.895 -14.794 QT
-51.051 -14.044 -51.051 -13.294 QT
-51.051 -12.326 -50.645 -11.662 QT
-50.238 -10.998 -49.317 -10.998 QT
-47.457 -10.998 -46.051 -13.294 QT
-46.035 -13.404 -46.012 -13.513 QT
-45.988 -13.623 -45.973 -13.716 QT
-43.895 -22.123 L
-43.785 -22.513 -43.434 -22.787 QT
-43.082 -23.06 -42.676 -23.06 QT
-42.317 -23.06 -42.059 -22.834 QT
-41.801 -22.607 -41.801 -22.248 QT
-41.801 -22.076 -41.817 -22.013 QT
-43.926 -13.654 L
-44.113 -12.794 -44.113 -12.248 QT
-44.113 -10.998 -43.285 -10.998 QT
-42.348 -10.998 -41.887 -12.154 QT
-41.426 -13.31 -41.098 -14.826 QT
-41.051 -14.998 -40.879 -14.998 QT
-40.52 -14.998 L
-40.41 -14.998 -40.34 -14.896 QT
-40.27 -14.794 -40.27 -14.716 QT
-40.582 -13.466 -40.871 -12.576 QT
-41.16 -11.685 -41.785 -10.959 QT
-42.41 -10.232 -43.332 -10.232 QT
-44.254 -10.232 -44.988 -10.74 QT
-45.723 -11.248 -45.973 -12.107 QT
-46.645 -11.248 -47.52 -10.74 QT
-48.395 -10.232 -49.379 -10.232 QT
-51.035 -10.232 -52.027 -11.146 QT
-53.02 -12.06 -53.02 -13.716 QT
cp
f
GR
GS
[0 -0.75 0.75 0 29.75 149.24989] CT
0.149 GC
N
-37.665 -6.77 M
-37.29 -6.473 -36.618 -6.473 QT
-35.962 -6.473 -35.462 -7.105 QT
-34.962 -7.738 -34.774 -8.488 QT
-33.821 -12.207 L
-33.587 -13.223 -33.587 -13.598 QT
-33.587 -14.113 -33.884 -14.504 QT
-34.181 -14.895 -34.696 -14.895 QT
-35.368 -14.895 -35.954 -14.48 QT
-36.54 -14.066 -36.938 -13.426 QT
-37.337 -12.785 -37.493 -12.129 QT
-37.54 -11.988 -37.665 -11.988 QT
-37.915 -11.988 L
-38.087 -11.988 -38.087 -12.191 QT
-38.087 -12.254 L
-37.884 -13.035 -37.392 -13.777 QT
-36.899 -14.52 -36.188 -14.98 QT
-35.478 -15.441 -34.665 -15.441 QT
-33.884 -15.441 -33.267 -15.027 QT
-32.649 -14.613 -32.399 -13.91 QT
-32.04 -14.551 -31.478 -14.996 QT
-30.915 -15.441 -30.259 -15.441 QT
-29.806 -15.441 -29.329 -15.285 QT
-28.853 -15.129 -28.556 -14.801 QT
-28.259 -14.473 -28.259 -13.973 QT
-28.259 -13.441 -28.603 -13.059 QT
-28.946 -12.676 -29.478 -12.676 QT
-29.821 -12.676 -30.048 -12.887 QT
-30.274 -13.098 -30.274 -13.426 QT
-30.274 -13.879 -29.97 -14.207 QT
-29.665 -14.535 -29.243 -14.598 QT
-29.618 -14.895 -30.29 -14.895 QT
-30.962 -14.895 -31.462 -14.27 QT
-31.962 -13.645 -32.165 -12.879 QT
-33.087 -9.16 L
-33.321 -8.316 -33.321 -7.785 QT
-33.321 -7.254 -33.017 -6.863 QT
-32.712 -6.473 -32.212 -6.473 QT
-31.228 -6.473 -30.454 -7.34 QT
-29.681 -8.207 -29.431 -9.254 QT
-29.384 -9.363 -29.274 -9.363 QT
-29.009 -9.363 L
-28.931 -9.363 -28.876 -9.309 QT
-28.821 -9.254 -28.821 -9.191 QT
-28.821 -9.16 -28.853 -9.129 QT
-29.149 -7.879 -30.103 -6.902 QT
-31.056 -5.926 -32.243 -5.926 QT
-33.024 -5.926 -33.642 -6.34 QT
-34.259 -6.754 -34.524 -7.457 QT
-34.853 -6.848 -35.431 -6.387 QT
-36.009 -5.926 -36.665 -5.926 QT
-37.118 -5.926 -37.595 -6.082 QT
-38.071 -6.238 -38.368 -6.566 QT
-38.665 -6.895 -38.665 -7.395 QT
-38.665 -7.895 -38.321 -8.301 QT
-37.978 -8.707 -37.462 -8.707 QT
-37.118 -8.707 -36.876 -8.496 QT
-36.634 -8.285 -36.634 -7.941 QT
-36.634 -7.504 -36.931 -7.176 QT
-37.228 -6.848 -37.665 -6.77 QT
cp
f
GR
GS
[0 -0.75 0.75 0 29.75 149.24989] CT
0.149 GC
N
-22.682 -3.31 M
-22.682 -32.31 L
-18.713 -32.31 L
-18.713 -31.154 L
-21.51 -31.154 L
-21.51 -4.466 L
-18.713 -4.466 L
-18.713 -3.31 L
-22.682 -3.31 L
cp
f
GR
GS
[0 -0.75 0.75 0 29.75 149.24989] CT
0.149 GC
N
-15.721 -11.06 M
-15.721 -11.232 -15.69 -11.31 QT
-13.518 -19.966 L
-13.315 -20.763 -13.315 -21.373 QT
-13.315 -22.623 -14.159 -22.623 QT
-15.065 -22.623 -15.502 -21.537 QT
-15.94 -20.451 -16.362 -18.794 QT
-16.362 -18.716 -16.44 -18.669 QT
-16.518 -18.623 -16.596 -18.623 QT
-16.94 -18.623 L
-17.034 -18.623 -17.104 -18.724 QT
-17.174 -18.826 -17.174 -18.919 QT
-16.862 -20.169 -16.573 -21.052 QT
-16.284 -21.935 -15.666 -22.654 QT
-15.049 -23.373 -14.127 -23.373 QT
-13.049 -23.373 -12.213 -22.685 QT
-11.377 -21.998 -11.377 -20.935 QT
-10.502 -22.076 -9.346 -22.724 QT
-8.19 -23.373 -6.877 -23.373 QT
-5.502 -23.373 -4.51 -22.669 QT
-3.518 -21.966 -3.518 -20.685 QT
-2.627 -21.951 -1.424 -22.662 QT
-0.221 -23.373 1.185 -23.373 QT
2.685 -23.373 3.599 -22.56 QT
4.513 -21.748 4.513 -20.248 QT
4.513 -19.06 3.982 -17.373 QT
3.451 -15.685 2.67 -13.607 QT
2.248 -12.607 2.248 -11.857 QT
2.248 -10.998 2.935 -10.998 QT
4.06 -10.998 4.81 -12.216 QT
5.56 -13.435 5.873 -14.826 QT
5.966 -14.998 6.123 -14.998 QT
6.451 -14.998 L
6.576 -14.998 6.654 -14.919 QT
6.732 -14.841 6.732 -14.732 QT
6.732 -14.716 6.701 -14.654 QT
6.295 -13.013 5.31 -11.623 QT
4.326 -10.232 2.857 -10.232 QT
1.841 -10.232 1.123 -10.935 QT
0.404 -11.638 0.404 -12.638 QT
0.404 -13.154 0.638 -13.779 QT
1.451 -15.951 1.998 -17.669 QT
2.545 -19.388 2.545 -20.685 QT
2.545 -21.498 2.224 -22.06 QT
1.904 -22.623 1.138 -22.623 QT
-0.455 -22.623 -1.612 -21.654 QT
-2.768 -20.685 -3.627 -19.091 QT
-3.674 -18.794 -3.705 -18.638 QT
-5.58 -11.201 L
-5.674 -10.794 -6.026 -10.513 QT
-6.377 -10.232 -6.799 -10.232 QT
-7.143 -10.232 -7.401 -10.459 QT
-7.659 -10.685 -7.659 -11.06 QT
-7.659 -11.232 -7.627 -11.31 QT
-5.784 -18.701 L
-5.487 -19.888 -5.487 -20.685 QT
-5.487 -21.498 -5.815 -22.06 QT
-6.143 -22.623 -6.94 -22.623 QT
-8.002 -22.623 -8.893 -22.154 QT
-9.784 -21.685 -10.448 -20.919 QT
-11.112 -20.154 -11.674 -19.091 QT
-13.643 -11.201 L
-13.737 -10.794 -14.08 -10.513 QT
-14.424 -10.232 -14.862 -10.232 QT
-15.205 -10.232 -15.463 -10.459 QT
-15.721 -10.685 -15.721 -11.06 QT
cp
f
GR
GS
[0 -0.75 0.75 0 29.75 149.24989] CT
0.149 GC
N
9.425 -3.888 M
9.425 -3.982 9.456 -3.998 QT
19.534 -31.951 L
19.596 -32.123 19.737 -32.216 QT
19.878 -32.31 20.065 -32.31 QT
20.315 -32.31 20.479 -32.154 QT
20.643 -31.998 20.643 -31.732 QT
20.643 -31.623 L
10.565 -3.669 L
10.393 -3.31 10.003 -3.31 QT
9.768 -3.31 9.596 -3.482 QT
9.425 -3.654 9.425 -3.888 QT
cp
f
GR
GS
[0 -0.75 0.75 0 29.75 149.24989] CT
0.149 GC
N
24.982 -12.326 M
25.763 -10.998 28.123 -10.998 QT
29.138 -10.998 30.06 -11.349 QT
30.982 -11.701 31.583 -12.388 QT
32.185 -13.076 32.185 -14.076 QT
32.185 -14.826 31.646 -15.302 QT
31.107 -15.779 30.326 -15.951 QT
28.748 -16.263 L
27.685 -16.529 26.99 -17.271 QT
26.294 -18.013 26.294 -19.06 QT
26.294 -20.341 26.99 -21.334 QT
27.685 -22.326 28.833 -22.849 QT
29.982 -23.373 31.216 -23.373 QT
32.529 -23.373 33.576 -22.748 QT
34.623 -22.123 34.623 -20.888 QT
34.623 -20.216 34.248 -19.709 QT
33.873 -19.201 33.201 -19.201 QT
32.81 -19.201 32.537 -19.451 QT
32.263 -19.701 32.263 -20.076 QT
32.263 -20.419 32.458 -20.74 QT
32.654 -21.06 32.966 -21.248 QT
33.279 -21.435 33.623 -21.435 QT
33.373 -22.06 32.669 -22.341 QT
31.966 -22.623 31.154 -22.623 QT
30.419 -22.623 29.685 -22.326 QT
28.951 -22.029 28.505 -21.459 QT
28.06 -20.888 28.06 -20.107 QT
28.06 -19.576 28.427 -19.185 QT
28.794 -18.794 29.341 -18.623 QT
31.013 -18.279 L
31.826 -18.107 32.498 -17.677 QT
33.169 -17.248 33.56 -16.584 QT
33.951 -15.919 33.951 -15.076 QT
33.951 -13.998 33.349 -12.951 QT
32.748 -11.904 31.873 -11.279 QT
30.326 -10.232 28.091 -10.232 QT
26.544 -10.232 25.255 -10.943 QT
23.966 -11.654 23.966 -13.06 QT
23.966 -13.841 24.427 -14.427 QT
24.888 -15.013 25.685 -15.013 QT
26.154 -15.013 26.466 -14.732 QT
26.779 -14.451 26.779 -13.982 QT
26.779 -13.326 26.287 -12.826 QT
25.794 -12.326 25.123 -12.326 QT
24.982 -12.326 L
cp
f
GR
GS
[0 -0.75 0.75 0 29.75 149.24989] CT
0.149 GC
N
37.263 -21.205 M
37.263 -21.767 L
37.263 -21.814 37.31 -21.877 QT
40.56 -25.486 L
41.31 -26.299 41.771 -26.838 QT
42.232 -27.377 42.677 -28.088 QT
43.123 -28.799 43.388 -29.525 QT
43.654 -30.252 43.654 -31.08 QT
43.654 -31.939 43.333 -32.728 QT
43.013 -33.517 42.38 -33.986 QT
41.748 -34.455 40.857 -34.455 QT
39.951 -34.455 39.224 -33.908 QT
38.498 -33.361 38.201 -32.486 QT
38.279 -32.502 38.419 -32.502 QT
38.888 -32.502 39.224 -32.189 QT
39.56 -31.877 39.56 -31.361 QT
39.56 -30.892 39.224 -30.557 QT
38.888 -30.221 38.419 -30.221 QT
37.935 -30.221 37.599 -30.564 QT
37.263 -30.908 37.263 -31.361 QT
37.263 -32.158 37.56 -32.846 QT
37.857 -33.533 38.419 -34.072 QT
38.982 -34.611 39.677 -34.9 QT
40.373 -35.189 41.169 -35.189 QT
42.373 -35.189 43.404 -34.682 QT
44.435 -34.174 45.044 -33.244 QT
45.654 -32.314 45.654 -31.08 QT
45.654 -30.174 45.255 -29.353 QT
44.857 -28.533 44.232 -27.861 QT
43.607 -27.189 42.63 -26.338 QT
41.654 -25.486 41.341 -25.189 QT
38.966 -22.908 L
40.982 -22.908 L
42.466 -22.908 43.466 -22.932 QT
44.466 -22.955 44.529 -23.017 QT
44.779 -23.283 45.029 -24.955 QT
45.654 -24.955 L
45.06 -21.205 L
37.263 -21.205 L
cp
f
GR
GS
[0 -0.75 0.75 0 29.75 149.24989] CT
0.149 GC
N
48.59 -3.31 M
48.59 -4.466 L
51.403 -4.466 L
51.403 -31.154 L
48.59 -31.154 L
48.59 -32.31 L
52.559 -32.31 L
52.559 -3.31 L
48.59 -3.31 L
cp
f
GR
GS
[0.75 0 0 0.75 217.50021 25.5] CT
N
-168.876 -9.6 M
-168.876 -10.553 L
-166.095 -10.553 -166.095 -11.413 QT
-166.095 -26.241 L
-166.095 -27.1 -168.876 -27.1 QT
-168.876 -28.038 L
-160.798 -28.038 L
-160.798 -27.1 L
-163.579 -27.1 -163.579 -26.241 QT
-163.579 -19.678 L
-155.61 -19.678 L
-155.61 -26.241 L
-155.61 -27.1 -158.392 -27.1 QT
-158.392 -28.038 L
-150.329 -28.038 L
-150.329 -27.1 L
-153.095 -27.1 -153.095 -26.241 QT
-153.095 -11.413 L
-153.095 -10.553 -150.329 -10.553 QT
-150.329 -9.6 L
-158.392 -9.6 L
-158.392 -10.553 L
-155.61 -10.553 -155.61 -11.413 QT
-155.61 -18.725 L
-163.579 -18.725 L
-163.579 -11.413 L
-163.579 -10.553 -160.798 -10.553 QT
-160.798 -9.6 L
-168.876 -9.6 L
cp
f
GR
GS
[0.75 0 0 0.75 217.50021 25.5] CT
N
-142.954 -9.303 M
-144.579 -9.303 -145.962 -10.124 QT
-147.345 -10.944 -148.149 -12.327 QT
-148.954 -13.709 -148.954 -15.35 QT
-148.954 -16.584 -148.509 -17.733 QT
-148.063 -18.881 -147.243 -19.788 QT
-146.423 -20.694 -145.329 -21.202 QT
-144.235 -21.709 -142.954 -21.709 QT
-141.298 -21.709 -139.931 -20.827 QT
-138.563 -19.944 -137.774 -18.475 QT
-136.985 -17.006 -136.985 -15.35 QT
-136.985 -13.725 -137.79 -12.334 QT
-138.595 -10.944 -139.97 -10.124 QT
-141.345 -9.303 -142.954 -9.303 QT
cp
-142.954 -10.084 M
-140.798 -10.084 -140.071 -11.655 QT
-139.345 -13.225 -139.345 -15.647 QT
-139.345 -17.006 -139.485 -17.897 QT
-139.626 -18.788 -140.126 -19.522 QT
-140.423 -19.959 -140.891 -20.295 QT
-141.36 -20.631 -141.884 -20.811 QT
-142.407 -20.991 -142.954 -20.991 QT
-143.798 -20.991 -144.556 -20.608 QT
-145.313 -20.225 -145.813 -19.522 QT
-146.313 -18.756 -146.454 -17.834 QT
-146.595 -16.913 -146.595 -15.647 QT
-146.595 -14.131 -146.329 -12.928 QT
-146.063 -11.725 -145.266 -10.905 QT
-144.47 -10.084 -142.954 -10.084 QT
cp
f
GR
GS
[0.75 0 0 0.75 217.50021 25.5] CT
N
-135.667 -9.6 M
-135.667 -10.553 L
-134.746 -10.553 -134.152 -10.694 QT
-133.558 -10.834 -133.558 -11.413 QT
-133.558 -18.772 L
-133.558 -19.506 -133.777 -19.827 QT
-133.996 -20.147 -134.402 -20.217 QT
-134.808 -20.288 -135.667 -20.288 QT
-135.667 -21.241 L
-131.808 -21.538 L
-131.808 -18.897 L
-131.371 -20.069 -130.566 -20.803 QT
-129.761 -21.538 -128.621 -21.538 QT
-127.808 -21.538 -127.175 -21.061 QT
-126.542 -20.584 -126.542 -19.803 QT
-126.542 -19.319 -126.894 -18.952 QT
-127.246 -18.584 -127.761 -18.584 QT
-128.261 -18.584 -128.621 -18.944 QT
-128.98 -19.303 -128.98 -19.803 QT
-128.98 -20.522 -128.464 -20.834 QT
-128.621 -20.834 L
-129.714 -20.834 -130.402 -20.045 QT
-131.089 -19.256 -131.386 -18.077 QT
-131.683 -16.897 -131.683 -15.834 QT
-131.683 -11.413 L
-131.683 -10.553 -129.058 -10.553 QT
-129.058 -9.6 L
-135.667 -9.6 L
cp
f
GR
GS
[0.75 0 0 0.75 217.50021 25.5] CT
N
-125.098 -9.6 M
-125.098 -10.553 L
-124.176 -10.553 -123.582 -10.694 QT
-122.989 -10.834 -122.989 -11.413 QT
-122.989 -18.772 L
-122.989 -19.819 -123.387 -20.053 QT
-123.786 -20.288 -124.973 -20.288 QT
-124.973 -21.241 L
-121.082 -21.538 L
-121.082 -11.413 L
-121.082 -10.834 -120.575 -10.694 QT
-120.067 -10.553 -119.207 -10.553 QT
-119.207 -9.6 L
-125.098 -9.6 L
cp
-123.942 -26.178 M
-123.942 -26.772 -123.496 -27.217 QT
-123.051 -27.663 -122.473 -27.663 QT
-122.082 -27.663 -121.731 -27.467 QT
-121.379 -27.272 -121.184 -26.913 QT
-120.989 -26.553 -120.989 -26.178 QT
-120.989 -25.584 -121.434 -25.139 QT
-121.879 -24.694 -122.473 -24.694 QT
-123.051 -24.694 -123.496 -25.139 QT
-123.942 -25.584 -123.942 -26.178 QT
cp
f
GR
GS
[0.75 0 0 0.75 217.50021 25.5] CT
N
-117.456 -9.6 M
-117.769 -9.6 -117.769 -9.897 QT
-117.769 -10.116 L
-117.769 -10.225 -117.691 -10.303 QT
-110.144 -20.522 L
-112.566 -20.522 L
-113.722 -20.522 -114.464 -20.381 QT
-115.206 -20.241 -115.691 -19.834 QT
-116.175 -19.428 -116.394 -18.725 QT
-116.612 -18.022 -116.612 -16.788 QT
-117.378 -16.788 L
-117.081 -21.241 L
-108.034 -21.241 L
-107.925 -21.241 -107.839 -21.155 QT
-107.753 -21.069 -107.753 -20.944 QT
-107.753 -20.788 L
-107.753 -20.694 -107.8 -20.6 QT
-115.347 -10.381 L
-112.769 -10.381 L
-111.597 -10.381 -110.816 -10.522 QT
-110.034 -10.663 -109.472 -11.225 QT
-108.956 -11.741 -108.769 -12.608 QT
-108.581 -13.475 -108.472 -14.756 QT
-107.691 -14.756 L
-108.159 -9.6 L
-117.456 -9.6 L
cp
f
GR
GS
[0.75 0 0 0.75 217.50021 25.5] CT
N
-99.917 -9.303 M
-101.542 -9.303 -102.925 -10.124 QT
-104.307 -10.944 -105.112 -12.327 QT
-105.917 -13.709 -105.917 -15.35 QT
-105.917 -16.584 -105.472 -17.733 QT
-105.026 -18.881 -104.206 -19.788 QT
-103.386 -20.694 -102.292 -21.202 QT
-101.198 -21.709 -99.917 -21.709 QT
-98.261 -21.709 -96.893 -20.827 QT
-95.526 -19.944 -94.737 -18.475 QT
-93.948 -17.006 -93.948 -15.35 QT
-93.948 -13.725 -94.753 -12.334 QT
-95.557 -10.944 -96.932 -10.124 QT
-98.307 -9.303 -99.917 -9.303 QT
cp
-99.917 -10.084 M
-97.761 -10.084 -97.034 -11.655 QT
-96.307 -13.225 -96.307 -15.647 QT
-96.307 -17.006 -96.448 -17.897 QT
-96.589 -18.788 -97.089 -19.522 QT
-97.386 -19.959 -97.854 -20.295 QT
-98.323 -20.631 -98.847 -20.811 QT
-99.37 -20.991 -99.917 -20.991 QT
-100.761 -20.991 -101.518 -20.608 QT
-102.276 -20.225 -102.776 -19.522 QT
-103.276 -18.756 -103.417 -17.834 QT
-103.557 -16.913 -103.557 -15.647 QT
-103.557 -14.131 -103.292 -12.928 QT
-103.026 -11.725 -102.229 -10.905 QT
-101.432 -10.084 -99.917 -10.084 QT
cp
f
GR
GS
[0.75 0 0 0.75 217.50021 25.5] CT
N
-92.537 -9.6 M
-92.537 -10.553 L
-91.599 -10.553 -91.013 -10.694 QT
-90.427 -10.834 -90.427 -11.413 QT
-90.427 -18.772 L
-90.427 -19.506 -90.638 -19.827 QT
-90.849 -20.147 -91.263 -20.217 QT
-91.677 -20.288 -92.537 -20.288 QT
-92.537 -21.241 L
-88.615 -21.538 L
-88.615 -18.897 L
-88.068 -20.053 -87.005 -20.795 QT
-85.943 -21.538 -84.693 -21.538 QT
-82.833 -21.538 -81.888 -20.639 QT
-80.943 -19.741 -80.943 -17.897 QT
-80.943 -11.413 L
-80.943 -10.834 -80.349 -10.694 QT
-79.755 -10.553 -78.833 -10.553 QT
-78.833 -9.6 L
-85.021 -9.6 L
-85.021 -10.553 L
-84.099 -10.553 -83.505 -10.694 QT
-82.912 -10.834 -82.912 -11.413 QT
-82.912 -17.819 L
-82.912 -19.131 -83.294 -19.983 QT
-83.677 -20.834 -84.849 -20.834 QT
-86.427 -20.834 -87.435 -19.584 QT
-88.443 -18.334 -88.443 -16.725 QT
-88.443 -11.413 L
-88.443 -10.834 -87.849 -10.694 QT
-87.255 -10.553 -86.349 -10.553 QT
-86.349 -9.6 L
-92.537 -9.6 L
cp
f
GR
GS
[0.75 0 0 0.75 217.50021 25.5] CT
N
-76.509 -12.85 M
-76.509 -20.288 L
-78.744 -20.288 L
-78.744 -20.991 L
-76.978 -20.991 -76.15 -22.639 QT
-75.322 -24.288 -75.322 -26.209 QT
-74.541 -26.209 L
-74.541 -21.241 L
-70.728 -21.241 L
-70.728 -20.288 L
-74.541 -20.288 L
-74.541 -12.897 L
-74.541 -11.772 -74.166 -10.928 QT
-73.791 -10.084 -72.806 -10.084 QT
-71.884 -10.084 -71.478 -10.975 QT
-71.072 -11.866 -71.072 -12.897 QT
-71.072 -14.491 L
-70.291 -14.491 L
-70.291 -12.85 L
-70.291 -12.006 -70.603 -11.178 QT
-70.916 -10.35 -71.525 -9.827 QT
-72.134 -9.303 -72.994 -9.303 QT
-74.619 -9.303 -75.564 -10.272 QT
-76.509 -11.241 -76.509 -12.85 QT
cp
f
GR
GS
[0.75 0 0 0.75 217.50021 25.5] CT
N
-67.811 -12.256 M
-67.811 -13.866 -66.545 -14.874 QT
-65.28 -15.881 -63.506 -16.295 QT
-61.733 -16.709 -60.139 -16.709 QT
-60.139 -17.819 L
-60.139 -18.584 -60.483 -19.319 QT
-60.826 -20.053 -61.467 -20.522 QT
-62.108 -20.991 -62.889 -20.991 QT
-64.686 -20.991 -65.623 -20.194 QT
-65.108 -20.194 -64.772 -19.803 QT
-64.436 -19.413 -64.436 -18.897 QT
-64.436 -18.35 -64.819 -17.967 QT
-65.201 -17.584 -65.717 -17.584 QT
-66.264 -17.584 -66.647 -17.967 QT
-67.03 -18.35 -67.03 -18.897 QT
-67.03 -20.319 -65.741 -21.014 QT
-64.451 -21.709 -62.889 -21.709 QT
-61.795 -21.709 -60.686 -21.241 QT
-59.576 -20.772 -58.873 -19.897 QT
-58.17 -19.022 -58.17 -17.866 QT
-58.17 -11.788 L
-58.17 -11.256 -57.944 -10.819 QT
-57.717 -10.381 -57.248 -10.381 QT
-56.795 -10.381 -56.576 -10.827 QT
-56.358 -11.272 -56.358 -11.788 QT
-56.358 -13.522 L
-55.576 -13.522 L
-55.576 -11.788 L
-55.576 -11.178 -55.889 -10.631 QT
-56.201 -10.084 -56.741 -9.764 QT
-57.28 -9.444 -57.889 -9.444 QT
-58.686 -9.444 -59.256 -10.053 QT
-59.826 -10.663 -59.905 -11.506 QT
-60.405 -10.491 -61.373 -9.897 QT
-62.342 -9.303 -63.451 -9.303 QT
-64.483 -9.303 -65.483 -9.6 QT
-66.483 -9.897 -67.147 -10.553 QT
-67.811 -11.209 -67.811 -12.256 QT
cp
-65.623 -12.256 M
-65.623 -11.303 -64.92 -10.655 QT
-64.217 -10.006 -63.28 -10.006 QT
-62.405 -10.006 -61.694 -10.444 QT
-60.983 -10.881 -60.561 -11.631 QT
-60.139 -12.381 -60.139 -13.209 QT
-60.139 -16.022 L
-61.358 -16.022 -62.647 -15.616 QT
-63.936 -15.209 -64.78 -14.358 QT
-65.623 -13.506 -65.623 -12.256 QT
cp
f
GR
GS
[0.75 0 0 0.75 217.50021 25.5] CT
N
-54.728 -9.6 M
-54.728 -10.553 L
-53.806 -10.553 -53.212 -10.694 QT
-52.618 -10.834 -52.618 -11.413 QT
-52.618 -25.584 L
-52.618 -26.303 -52.837 -26.624 QT
-53.056 -26.944 -53.462 -27.022 QT
-53.868 -27.1 -54.728 -27.1 QT
-54.728 -28.038 L
-50.712 -28.334 L
-50.712 -11.413 L
-50.712 -10.834 -50.118 -10.694 QT
-49.524 -10.553 -48.618 -10.553 QT
-48.618 -9.6 L
-54.728 -9.6 L
cp
f
GR
GS
[0.75 0 0 0.75 217.50021 25.5] CT
N
-38.181 -12.256 M
-38.181 -13.866 -36.916 -14.874 QT
-35.65 -15.881 -33.877 -16.295 QT
-32.103 -16.709 -30.509 -16.709 QT
-30.509 -17.819 L
-30.509 -18.584 -30.853 -19.319 QT
-31.197 -20.053 -31.837 -20.522 QT
-32.478 -20.991 -33.259 -20.991 QT
-35.056 -20.991 -35.994 -20.194 QT
-35.478 -20.194 -35.142 -19.803 QT
-34.806 -19.413 -34.806 -18.897 QT
-34.806 -18.35 -35.189 -17.967 QT
-35.572 -17.584 -36.087 -17.584 QT
-36.634 -17.584 -37.017 -17.967 QT
-37.4 -18.35 -37.4 -18.897 QT
-37.4 -20.319 -36.111 -21.014 QT
-34.822 -21.709 -33.259 -21.709 QT
-32.166 -21.709 -31.056 -21.241 QT
-29.947 -20.772 -29.244 -19.897 QT
-28.541 -19.022 -28.541 -17.866 QT
-28.541 -11.788 L
-28.541 -11.256 -28.314 -10.819 QT
-28.087 -10.381 -27.619 -10.381 QT
-27.166 -10.381 -26.947 -10.827 QT
-26.728 -11.272 -26.728 -11.788 QT
-26.728 -13.522 L
-25.947 -13.522 L
-25.947 -11.788 L
-25.947 -11.178 -26.259 -10.631 QT
-26.572 -10.084 -27.111 -9.764 QT
-27.65 -9.444 -28.259 -9.444 QT
-29.056 -9.444 -29.627 -10.053 QT
-30.197 -10.663 -30.275 -11.506 QT
-30.775 -10.491 -31.744 -9.897 QT
-32.712 -9.303 -33.822 -9.303 QT
-34.853 -9.303 -35.853 -9.6 QT
-36.853 -9.897 -37.517 -10.553 QT
-38.181 -11.209 -38.181 -12.256 QT
cp
-35.994 -12.256 M
-35.994 -11.303 -35.291 -10.655 QT
-34.587 -10.006 -33.65 -10.006 QT
-32.775 -10.006 -32.064 -10.444 QT
-31.353 -10.881 -30.931 -11.631 QT
-30.509 -12.381 -30.509 -13.209 QT
-30.509 -16.022 L
-31.728 -16.022 -33.017 -15.616 QT
-34.306 -15.209 -35.15 -14.358 QT
-35.994 -13.506 -35.994 -12.256 QT
cp
f
GR
GS
[0.75 0 0 0.75 217.50021 25.5] CT
N
-19.207 -9.303 M
-20.832 -9.303 -22.168 -10.147 QT
-23.504 -10.991 -24.27 -12.413 QT
-25.035 -13.834 -25.035 -15.428 QT
-25.035 -17.022 -24.278 -18.483 QT
-23.52 -19.944 -22.176 -20.827 QT
-20.832 -21.709 -19.207 -21.709 QT
-17.613 -21.709 -16.317 -21.084 QT
-15.02 -20.459 -15.02 -19.053 QT
-15.02 -18.522 -15.395 -18.131 QT
-15.77 -17.741 -16.317 -17.741 QT
-16.848 -17.741 -17.231 -18.131 QT
-17.613 -18.522 -17.613 -19.053 QT
-17.613 -19.522 -17.309 -19.874 QT
-17.004 -20.225 -16.551 -20.319 QT
-17.488 -20.913 -19.176 -20.913 QT
-20.473 -20.913 -21.262 -20.053 QT
-22.051 -19.194 -22.363 -17.928 QT
-22.676 -16.663 -22.676 -15.428 QT
-22.676 -14.116 -22.293 -12.897 QT
-21.91 -11.678 -21.043 -10.881 QT
-20.176 -10.084 -18.879 -10.084 QT
-17.598 -10.084 -16.699 -10.874 QT
-15.801 -11.663 -15.473 -12.928 QT
-15.473 -13.084 -15.254 -13.084 QT
-14.926 -13.084 L
-14.848 -13.084 -14.785 -13.006 QT
-14.723 -12.928 -14.723 -12.85 QT
-14.723 -12.772 L
-15.129 -11.163 -16.34 -10.233 QT
-17.551 -9.303 -19.207 -9.303 QT
cp
f
GR
GS
[0.75 0 0 0.75 217.50021 25.5] CT
N
-7.355 -9.303 M
-8.98 -9.303 -10.316 -10.147 QT
-11.652 -10.991 -12.418 -12.413 QT
-13.183 -13.834 -13.183 -15.428 QT
-13.183 -17.022 -12.426 -18.483 QT
-11.668 -19.944 -10.324 -20.827 QT
-8.98 -21.709 -7.355 -21.709 QT
-5.762 -21.709 -4.465 -21.084 QT
-3.168 -20.459 -3.168 -19.053 QT
-3.168 -18.522 -3.543 -18.131 QT
-3.918 -17.741 -4.465 -17.741 QT
-4.996 -17.741 -5.379 -18.131 QT
-5.762 -18.522 -5.762 -19.053 QT
-5.762 -19.522 -5.457 -19.874 QT
-5.152 -20.225 -4.699 -20.319 QT
-5.637 -20.913 -7.324 -20.913 QT
-8.621 -20.913 -9.41 -20.053 QT
-10.199 -19.194 -10.512 -17.928 QT
-10.824 -16.663 -10.824 -15.428 QT
-10.824 -14.116 -10.441 -12.897 QT
-10.058 -11.678 -9.191 -10.881 QT
-8.324 -10.084 -7.027 -10.084 QT
-5.746 -10.084 -4.848 -10.874 QT
-3.949 -11.663 -3.621 -12.928 QT
-3.621 -13.084 -3.402 -13.084 QT
-3.074 -13.084 L
-2.996 -13.084 -2.933 -13.006 QT
-2.871 -12.928 -2.871 -12.85 QT
-2.871 -12.772 L
-3.277 -11.163 -4.488 -10.233 QT
-5.699 -9.303 -7.355 -9.303 QT
cp
f
GR
GS
[0.75 0 0 0.75 217.50021 25.5] CT
N
4.497 -9.303 M
2.856 -9.303 1.481 -10.163 QT
0.106 -11.022 -0.683 -12.467 QT
-1.472 -13.913 -1.472 -15.522 QT
-1.472 -17.1 -0.753 -18.522 QT
-0.035 -19.944 1.254 -20.827 QT
2.543 -21.709 4.122 -21.709 QT
5.356 -21.709 6.27 -21.288 QT
7.184 -20.866 7.778 -20.131 QT
8.372 -19.397 8.676 -18.397 QT
8.981 -17.397 8.981 -16.194 QT
8.981 -15.834 8.7 -15.834 QT
0.887 -15.834 L
0.887 -15.553 L
0.887 -13.303 1.793 -11.694 QT
2.7 -10.084 4.747 -10.084 QT
5.575 -10.084 6.278 -10.452 QT
6.981 -10.819 7.504 -11.483 QT
8.028 -12.147 8.2 -12.897 QT
8.231 -12.991 8.301 -13.061 QT
8.372 -13.131 8.465 -13.131 QT
8.7 -13.131 L
8.981 -13.131 8.981 -12.788 QT
8.606 -11.256 7.34 -10.28 QT
6.075 -9.303 4.497 -9.303 QT
cp
0.918 -16.506 M
7.075 -16.506 L
7.075 -17.522 6.793 -18.561 QT
6.512 -19.6 5.848 -20.295 QT
5.184 -20.991 4.122 -20.991 QT
2.59 -20.991 1.754 -19.561 QT
0.918 -18.131 0.918 -16.506 QT
cp
f
GR
GS
[0.75 0 0 0.75 217.50021 25.5] CT
N
10.458 -9.6 M
10.458 -10.553 L
11.38 -10.553 11.973 -10.694 QT
12.567 -10.834 12.567 -11.413 QT
12.567 -25.584 L
12.567 -26.303 12.348 -26.624 QT
12.13 -26.944 11.723 -27.022 QT
11.317 -27.1 10.458 -27.1 QT
10.458 -28.038 L
14.473 -28.334 L
14.473 -11.413 L
14.473 -10.834 15.067 -10.694 QT
15.661 -10.553 16.567 -10.553 QT
16.567 -9.6 L
10.458 -9.6 L
cp
f
GR
GS
[0.75 0 0 0.75 217.50021 25.5] CT
N
23.756 -9.303 M
22.115 -9.303 20.74 -10.163 QT
19.365 -11.022 18.576 -12.467 QT
17.787 -13.913 17.787 -15.522 QT
17.787 -17.1 18.506 -18.522 QT
19.225 -19.944 20.514 -20.827 QT
21.803 -21.709 23.381 -21.709 QT
24.615 -21.709 25.529 -21.288 QT
26.443 -20.866 27.037 -20.131 QT
27.631 -19.397 27.935 -18.397 QT
28.24 -17.397 28.24 -16.194 QT
28.24 -15.834 27.959 -15.834 QT
20.146 -15.834 L
20.146 -15.553 L
20.146 -13.303 21.053 -11.694 QT
21.959 -10.084 24.006 -10.084 QT
24.834 -10.084 25.537 -10.452 QT
26.24 -10.819 26.764 -11.483 QT
27.287 -12.147 27.459 -12.897 QT
27.49 -12.991 27.56 -13.061 QT
27.631 -13.131 27.725 -13.131 QT
27.959 -13.131 L
28.24 -13.131 28.24 -12.788 QT
27.865 -11.256 26.6 -10.28 QT
25.334 -9.303 23.756 -9.303 QT
cp
20.178 -16.506 M
26.334 -16.506 L
26.334 -17.522 26.053 -18.561 QT
25.771 -19.6 25.107 -20.295 QT
24.443 -20.991 23.381 -20.991 QT
21.85 -20.991 21.014 -19.561 QT
20.178 -18.131 20.178 -16.506 QT
cp
f
GR
GS
[0.75 0 0 0.75 217.50021 25.5] CT
N
29.592 -9.6 M
29.592 -10.553 L
30.514 -10.553 31.108 -10.694 QT
31.701 -10.834 31.701 -11.413 QT
31.701 -18.772 L
31.701 -19.506 31.483 -19.827 QT
31.264 -20.147 30.858 -20.217 QT
30.451 -20.288 29.592 -20.288 QT
29.592 -21.241 L
33.451 -21.538 L
33.451 -18.897 L
33.889 -20.069 34.694 -20.803 QT
35.498 -21.538 36.639 -21.538 QT
37.451 -21.538 38.084 -21.061 QT
38.717 -20.584 38.717 -19.803 QT
38.717 -19.319 38.365 -18.952 QT
38.014 -18.584 37.498 -18.584 QT
36.998 -18.584 36.639 -18.944 QT
36.28 -19.303 36.28 -19.803 QT
36.28 -20.522 36.795 -20.834 QT
36.639 -20.834 L
35.545 -20.834 34.858 -20.045 QT
34.17 -19.256 33.873 -18.077 QT
33.576 -16.897 33.576 -15.834 QT
33.576 -11.413 L
33.576 -10.553 36.201 -10.553 QT
36.201 -9.6 L
29.592 -9.6 L
cp
f
GR
GS
[0.75 0 0 0.75 217.50021 25.5] CT
N
40.411 -12.256 M
40.411 -13.866 41.677 -14.874 QT
42.943 -15.881 44.716 -16.295 QT
46.49 -16.709 48.083 -16.709 QT
48.083 -17.819 L
48.083 -18.584 47.74 -19.319 QT
47.396 -20.053 46.755 -20.522 QT
46.115 -20.991 45.333 -20.991 QT
43.536 -20.991 42.599 -20.194 QT
43.115 -20.194 43.451 -19.803 QT
43.786 -19.413 43.786 -18.897 QT
43.786 -18.35 43.404 -17.967 QT
43.021 -17.584 42.505 -17.584 QT
41.958 -17.584 41.576 -17.967 QT
41.193 -18.35 41.193 -18.897 QT
41.193 -20.319 42.482 -21.014 QT
43.771 -21.709 45.333 -21.709 QT
46.427 -21.709 47.536 -21.241 QT
48.646 -20.772 49.349 -19.897 QT
50.052 -19.022 50.052 -17.866 QT
50.052 -11.788 L
50.052 -11.256 50.279 -10.819 QT
50.505 -10.381 50.974 -10.381 QT
51.427 -10.381 51.646 -10.827 QT
51.865 -11.272 51.865 -11.788 QT
51.865 -13.522 L
52.646 -13.522 L
52.646 -11.788 L
52.646 -11.178 52.333 -10.631 QT
52.021 -10.084 51.482 -9.764 QT
50.943 -9.444 50.333 -9.444 QT
49.536 -9.444 48.966 -10.053 QT
48.396 -10.663 48.318 -11.506 QT
47.818 -10.491 46.849 -9.897 QT
45.88 -9.303 44.771 -9.303 QT
43.74 -9.303 42.74 -9.6 QT
41.74 -9.897 41.076 -10.553 QT
40.411 -11.209 40.411 -12.256 QT
cp
42.599 -12.256 M
42.599 -11.303 43.302 -10.655 QT
44.005 -10.006 44.943 -10.006 QT
45.818 -10.006 46.529 -10.444 QT
47.24 -10.881 47.661 -11.631 QT
48.083 -12.381 48.083 -13.209 QT
48.083 -16.022 L
46.865 -16.022 45.576 -15.616 QT
44.286 -15.209 43.443 -14.358 QT
42.599 -13.506 42.599 -12.256 QT
cp
f
GR
GS
[0.75 0 0 0.75 217.50021 25.5] CT
N
55.417 -12.85 M
55.417 -20.288 L
53.182 -20.288 L
53.182 -20.991 L
54.948 -20.991 55.776 -22.639 QT
56.604 -24.288 56.604 -26.209 QT
57.385 -26.209 L
57.385 -21.241 L
61.198 -21.241 L
61.198 -20.288 L
57.385 -20.288 L
57.385 -12.897 L
57.385 -11.772 57.76 -10.928 QT
58.135 -10.084 59.12 -10.084 QT
60.042 -10.084 60.448 -10.975 QT
60.854 -11.866 60.854 -12.897 QT
60.854 -14.491 L
61.635 -14.491 L
61.635 -12.85 L
61.635 -12.006 61.323 -11.178 QT
61.01 -10.35 60.401 -9.827 QT
59.792 -9.303 58.932 -9.303 QT
57.307 -9.303 56.362 -10.272 QT
55.417 -11.241 55.417 -12.85 QT
cp
f
GR
GS
[0.75 0 0 0.75 217.50021 25.5] CT
N
63.865 -9.6 M
63.865 -10.553 L
64.787 -10.553 65.381 -10.694 QT
65.975 -10.834 65.975 -11.413 QT
65.975 -18.772 L
65.975 -19.819 65.576 -20.053 QT
65.178 -20.288 63.99 -20.288 QT
63.99 -21.241 L
67.881 -21.538 L
67.881 -11.413 L
67.881 -10.834 68.389 -10.694 QT
68.896 -10.553 69.756 -10.553 QT
69.756 -9.6 L
63.865 -9.6 L
cp
65.021 -26.178 M
65.021 -26.772 65.467 -27.217 QT
65.912 -27.663 66.49 -27.663 QT
66.881 -27.663 67.232 -27.467 QT
67.584 -27.272 67.779 -26.913 QT
67.975 -26.553 67.975 -26.178 QT
67.975 -25.584 67.529 -25.139 QT
67.084 -24.694 66.49 -24.694 QT
65.912 -24.694 65.467 -25.139 QT
65.021 -25.584 65.021 -26.178 QT
cp
f
GR
GS
[0.75 0 0 0.75 217.50021 25.5] CT
N
77.195 -9.303 M
75.57 -9.303 74.187 -10.124 QT
72.804 -10.944 71.999 -12.327 QT
71.195 -13.709 71.195 -15.35 QT
71.195 -16.584 71.64 -17.733 QT
72.085 -18.881 72.905 -19.788 QT
73.726 -20.694 74.82 -21.202 QT
75.913 -21.709 77.195 -21.709 QT
78.851 -21.709 80.218 -20.827 QT
81.585 -19.944 82.374 -18.475 QT
83.163 -17.006 83.163 -15.35 QT
83.163 -13.725 82.359 -12.334 QT
81.554 -10.944 80.179 -10.124 QT
78.804 -9.303 77.195 -9.303 QT
cp
77.195 -10.084 M
79.351 -10.084 80.077 -11.655 QT
80.804 -13.225 80.804 -15.647 QT
80.804 -17.006 80.663 -17.897 QT
80.523 -18.788 80.023 -19.522 QT
79.726 -19.959 79.257 -20.295 QT
78.788 -20.631 78.265 -20.811 QT
77.741 -20.991 77.195 -20.991 QT
76.351 -20.991 75.593 -20.608 QT
74.835 -20.225 74.335 -19.522 QT
73.835 -18.756 73.695 -17.834 QT
73.554 -16.913 73.554 -15.647 QT
73.554 -14.131 73.82 -12.928 QT
74.085 -11.725 74.882 -10.905 QT
75.679 -10.084 77.195 -10.084 QT
cp
f
GR
GS
[0.75 0 0 0.75 217.50021 25.5] CT
N
84.575 -9.6 M
84.575 -10.553 L
85.512 -10.553 86.098 -10.694 QT
86.684 -10.834 86.684 -11.413 QT
86.684 -18.772 L
86.684 -19.506 86.473 -19.827 QT
86.262 -20.147 85.848 -20.217 QT
85.434 -20.288 84.575 -20.288 QT
84.575 -21.241 L
88.497 -21.538 L
88.497 -18.897 L
89.044 -20.053 90.106 -20.795 QT
91.169 -21.538 92.419 -21.538 QT
94.278 -21.538 95.223 -20.639 QT
96.169 -19.741 96.169 -17.897 QT
96.169 -11.413 L
96.169 -10.834 96.762 -10.694 QT
97.356 -10.553 98.278 -10.553 QT
98.278 -9.6 L
92.09 -9.6 L
92.09 -10.553 L
93.012 -10.553 93.606 -10.694 QT
94.2 -10.834 94.2 -11.413 QT
94.2 -17.819 L
94.2 -19.131 93.817 -19.983 QT
93.434 -20.834 92.262 -20.834 QT
90.684 -20.834 89.676 -19.584 QT
88.669 -18.334 88.669 -16.725 QT
88.669 -11.413 L
88.669 -10.834 89.262 -10.694 QT
89.856 -10.553 90.762 -10.553 QT
90.762 -9.6 L
84.575 -9.6 L
cp
f
GR
GS
[0.75 0 0 0.75 217.50021 25.5] CT
N
108.31 -9.6 M
108.31 -10.553 L
109.232 -10.553 109.825 -10.694 QT
110.419 -10.834 110.419 -11.413 QT
110.419 -18.772 L
110.419 -19.819 110.021 -20.053 QT
109.622 -20.288 108.435 -20.288 QT
108.435 -21.241 L
112.325 -21.538 L
112.325 -11.413 L
112.325 -10.834 112.833 -10.694 QT
113.341 -10.553 114.2 -10.553 QT
114.2 -9.6 L
108.31 -9.6 L
cp
109.466 -26.178 M
109.466 -26.772 109.911 -27.217 QT
110.357 -27.663 110.935 -27.663 QT
111.325 -27.663 111.677 -27.467 QT
112.029 -27.272 112.224 -26.913 QT
112.419 -26.553 112.419 -26.178 QT
112.419 -25.584 111.974 -25.139 QT
111.529 -24.694 110.935 -24.694 QT
110.357 -24.694 109.911 -25.139 QT
109.466 -25.584 109.466 -26.178 QT
cp
f
GR
GS
[0.75 0 0 0.75 217.50021 25.5] CT
N
115.686 -9.6 M
115.686 -10.553 L
116.623 -10.553 117.209 -10.694 QT
117.795 -10.834 117.795 -11.413 QT
117.795 -18.772 L
117.795 -19.506 117.584 -19.827 QT
117.373 -20.147 116.959 -20.217 QT
116.545 -20.288 115.686 -20.288 QT
115.686 -21.241 L
119.608 -21.538 L
119.608 -18.897 L
120.155 -20.053 121.217 -20.795 QT
122.28 -21.538 123.53 -21.538 QT
125.389 -21.538 126.334 -20.639 QT
127.28 -19.741 127.28 -17.897 QT
127.28 -11.413 L
127.28 -10.834 127.873 -10.694 QT
128.467 -10.553 129.389 -10.553 QT
129.389 -9.6 L
123.202 -9.6 L
123.202 -10.553 L
124.123 -10.553 124.717 -10.694 QT
125.311 -10.834 125.311 -11.413 QT
125.311 -17.819 L
125.311 -19.131 124.928 -19.983 QT
124.545 -20.834 123.373 -20.834 QT
121.795 -20.834 120.788 -19.584 QT
119.78 -18.334 119.78 -16.725 QT
119.78 -11.413 L
119.78 -10.834 120.373 -10.694 QT
120.967 -10.553 121.873 -10.553 QT
121.873 -9.6 L
115.686 -9.6 L
cp
f
GR
GS
[0.75 0 0 0.75 217.50021 25.5] CT
N
130.407 -4.366 M
130.407 -5.303 L
131.329 -5.303 131.923 -5.459 QT
132.516 -5.616 132.516 -6.178 QT
132.516 -19.178 L
132.516 -19.928 131.985 -20.108 QT
131.454 -20.288 130.407 -20.288 QT
130.407 -21.241 L
134.391 -21.538 L
134.391 -19.85 L
135.141 -20.678 136.118 -21.108 QT
137.095 -21.538 138.204 -21.538 QT
139.798 -21.538 141.079 -20.67 QT
142.36 -19.803 143.079 -18.397 QT
143.798 -16.991 143.798 -15.428 QT
143.798 -13.788 143.001 -12.381 QT
142.204 -10.975 140.829 -10.139 QT
139.454 -9.303 137.798 -9.303 QT
135.829 -9.303 134.47 -10.897 QT
134.47 -6.178 L
134.47 -5.616 135.071 -5.459 QT
135.673 -5.303 136.579 -5.303 QT
136.579 -4.366 L
130.407 -4.366 L
cp
134.47 -12.225 M
134.954 -11.256 135.798 -10.631 QT
136.641 -10.006 137.641 -10.006 QT
138.579 -10.006 139.298 -10.506 QT
140.016 -11.006 140.501 -11.85 QT
140.985 -12.694 141.22 -13.624 QT
141.454 -14.553 141.454 -15.428 QT
141.454 -16.506 141.063 -17.764 QT
140.673 -19.022 139.876 -19.889 QT
139.079 -20.756 137.938 -20.756 QT
136.845 -20.756 135.931 -20.194 QT
135.016 -19.631 134.47 -18.678 QT
134.47 -12.225 L
cp
f
GR
GS
[0.75 0 0 0.75 217.50021 25.5] CT
N
147.425 -12.819 M
147.425 -18.772 L
147.425 -19.506 147.214 -19.827 QT
147.003 -20.147 146.589 -20.217 QT
146.175 -20.288 145.316 -20.288 QT
145.316 -21.241 L
149.409 -21.538 L
149.409 -12.819 L
149.409 -11.756 149.558 -11.17 QT
149.706 -10.584 150.206 -10.295 QT
150.706 -10.006 151.784 -10.006 QT
153.238 -10.006 154.089 -11.217 QT
154.941 -12.428 154.941 -13.975 QT
154.941 -18.772 L
154.941 -19.506 154.722 -19.827 QT
154.503 -20.147 154.097 -20.217 QT
153.691 -20.288 152.831 -20.288 QT
152.831 -21.241 L
156.909 -21.538 L
156.909 -12.053 L
156.909 -11.334 157.128 -11.014 QT
157.347 -10.694 157.753 -10.624 QT
158.159 -10.553 159.019 -10.553 QT
159.019 -9.6 L
155.019 -9.303 L
155.019 -11.584 L
154.519 -10.569 153.628 -9.936 QT
152.738 -9.303 151.644 -9.303 QT
149.706 -9.303 148.566 -10.124 QT
147.425 -10.944 147.425 -12.819 QT
cp
f
GR
GS
[0.75 0 0 0.75 217.50021 25.5] CT
N
162.084 -12.85 M
162.084 -20.288 L
159.849 -20.288 L
159.849 -20.991 L
161.615 -20.991 162.443 -22.639 QT
163.271 -24.288 163.271 -26.209 QT
164.052 -26.209 L
164.052 -21.241 L
167.865 -21.241 L
167.865 -20.288 L
164.052 -20.288 L
164.052 -12.897 L
164.052 -11.772 164.427 -10.928 QT
164.802 -10.084 165.787 -10.084 QT
166.709 -10.084 167.115 -10.975 QT
167.521 -11.866 167.521 -12.897 QT
167.521 -14.491 L
168.302 -14.491 L
168.302 -12.85 L
168.302 -12.006 167.99 -11.178 QT
167.677 -10.35 167.068 -9.827 QT
166.459 -9.303 165.599 -9.303 QT
163.974 -9.303 163.029 -10.272 QT
162.084 -11.241 162.084 -12.85 QT
cp
f
GR
GS
[0.75 0 0 0.75 0 0] CT
0.2 0.702 0.2 RC
1 LJ
0.667 LW
N
84.128 173.165 M
95.256 171.778 L
106.385 170.392 L
117.513 169.005 L
128.641 167.619 L
139.769 166.232 L
150.897 164.846 L
162.026 163.459 L
173.154 162.073 L
184.282 160.686 L
195.41 159.299 L
206.538 157.913 L
217.667 156.526 L
228.795 155.14 L
239.923 153.753 L
251.051 152.367 L
262.179 150.98 L
273.308 149.594 L
284.436 148.207 L
295.564 146.821 L
306.692 145.434 L
317.821 144.047 L
328.949 142.661 L
340.077 141.274 L
351.205 139.888 L
362.333 141.387 L
373.462 145.773 L
384.59 150.159 L
395.718 154.545 L
406.846 158.931 L
417.974 163.317 L
429.103 167.703 L
440.231 172.089 L
451.359 176.475 L
462.487 180.861 L
473.615 185.247 L
484.744 177.22 L
495.872 167 L
S
GR
GS
[0.75 0 0 0.75 0 0] CT
1 LJ
0.667 LW
N
84.128 108.561 M
95.256 112.018 L
106.385 115.476 L
117.513 118.934 L
128.641 122.392 L
139.769 125.85 L
150.897 129.308 L
162.026 132.766 L
173.154 136.224 L
184.282 139.682 L
195.41 143.139 L
206.538 146.597 L
217.667 150.055 L
228.795 153.513 L
239.923 156.971 L
251.051 160.429 L
262.179 163.887 L
273.308 167.345 L
284.436 170.803 L
295.564 174.261 L
306.692 177.718 L
317.821 181.176 L
328.949 184.634 L
340.077 188.092 L
351.205 191.55 L
362.333 192.122 L
373.462 189.807 L
384.59 187.492 L
395.718 185.178 L
406.846 182.863 L
417.974 180.549 L
429.103 178.234 L
440.231 175.919 L
451.359 173.605 L
462.487 171.29 L
473.615 168.976 L
484.744 121.686 L
495.872 121.277 L
S
GR
GS
[0.75 0 0 0.75 0 0] CT
0 0 1 RC
1 LJ
0.667 LW
N
84.128 252.708 M
95.256 244.919 L
106.385 237.131 L
117.513 229.343 L
128.641 221.555 L
139.769 213.766 L
150.897 205.978 L
162.026 198.19 L
173.154 190.401 L
184.282 182.613 L
195.41 174.825 L
206.538 167.036 L
217.667 159.248 L
228.795 151.46 L
239.923 143.672 L
251.051 137.896 L
262.179 134.132 L
273.308 130.369 L
284.436 126.605 L
295.564 122.841 L
306.692 119.078 L
317.821 115.314 L
328.949 111.551 L
340.077 107.787 L
351.205 104.024 L
362.333 100.26 L
373.462 96.496 L
384.59 98.776 L
395.718 111.392 L
406.846 128.3 L
417.974 145.208 L
429.103 163.54 L
440.231 189.895 L
451.359 222.851 L
462.487 255.806 L
473.615 288.762 L
484.744 321.717 L
495.872 252.597 L
S
GR
GS
[0.75 0 0 0.75 0 0] CT
0.6 0.2 0.2 RC
1 LJ
0.667 LW
N
84.128 215.111 M
95.256 211.874 L
106.385 208.637 L
117.513 205.399 L
128.641 202.162 L
139.769 198.924 L
150.897 195.687 L
162.026 192.45 L
173.154 189.212 L
184.282 185.975 L
195.41 182.738 L
206.538 179.5 L
217.667 176.263 L
228.795 173.026 L
239.923 169.788 L
251.051 164.539 L
262.179 157.277 L
273.308 150.015 L
284.436 142.752 L
295.564 135.49 L
306.692 128.228 L
317.821 120.966 L
328.949 113.704 L
340.077 106.442 L
351.205 99.18 L
362.333 91.918 L
373.462 84.656 L
384.59 93.341 L
395.718 113.681 L
406.846 129.729 L
417.974 145.776 L
429.103 160.4 L
440.231 167 L
451.359 167 L
462.487 167 L
473.615 167 L
484.744 167 L
495.872 167 L
S
GR
GS
[0.75 0 0 0.75 0 0] CT
1 GC
N
496 158 M
496 50 L
372 50 L
372 158 L
cp
f
GR
GS
[0.75 0 0 0.75 314.11361 48.61029] CT
N
0.672 5.12 M
0.672 4.386 L
2.547 4.386 2.984 3.136 QT
7.391 -9.693 L
7.453 -9.911 7.734 -9.911 QT
8 -9.911 L
8.281 -9.911 8.344 -9.693 QT
12.938 3.714 L
13.141 4.151 13.688 4.268 QT
14.234 4.386 15.047 4.386 QT
15.047 5.12 L
9.203 5.12 L
9.203 4.386 L
10.938 4.386 10.938 3.823 QT
10.938 3.714 L
9.797 0.432 L
4.703 0.432 L
3.766 3.136 L
3.75 3.214 3.75 3.354 QT
3.75 3.886 4.242 4.136 QT
4.734 4.386 5.313 4.386 QT
5.313 5.12 L
0.672 5.12 L
cp
4.953 -0.302 M
9.563 -0.302 L
7.25 -7.005 L
4.953 -0.302 L
cp
f
GR
GS
[0.75 0 0 0.75 314.11361 48.61029] CT
N
16.578 6.761 M
16.578 6.011 17.125 5.456 QT
17.672 4.901 18.422 4.651 QT
18 4.339 17.781 3.854 QT
17.563 3.37 17.563 2.839 QT
17.563 1.854 18.188 1.089 QT
17.219 0.151 17.219 -1.068 QT
17.219 -1.724 17.5 -2.302 QT
17.781 -2.88 18.289 -3.302 QT
18.797 -3.724 19.406 -3.943 QT
20.016 -4.161 20.672 -4.161 QT
21.922 -4.161 22.906 -3.427 QT
23.344 -3.896 23.93 -4.146 QT
24.516 -4.396 25.156 -4.396 QT
25.609 -4.396 25.898 -4.075 QT
26.188 -3.755 26.188 -3.302 QT
26.188 -3.036 25.992 -2.841 QT
25.797 -2.646 25.531 -2.646 QT
25.266 -2.646 25.07 -2.841 QT
24.875 -3.036 24.875 -3.302 QT
24.875 -3.693 25.141 -3.849 QT
24.047 -3.849 23.266 -3.099 QT
23.656 -2.708 23.883 -2.161 QT
24.109 -1.614 24.109 -1.068 QT
24.109 -0.177 23.617 0.534 QT
23.125 1.245 22.32 1.636 QT
21.516 2.026 20.672 2.026 QT
19.516 2.026 18.563 1.401 QT
18.266 1.823 18.266 2.323 QT
18.266 2.886 18.633 3.3 QT
19 3.714 19.547 3.714 QT
21.266 3.714 L
22.516 3.714 23.523 3.94 QT
24.531 4.167 25.211 4.846 QT
25.891 5.526 25.891 6.761 QT
25.891 7.682 25.117 8.292 QT
24.344 8.901 23.258 9.175 QT
22.172 9.448 21.25 9.448 QT
20.313 9.448 19.227 9.175 QT
18.141 8.901 17.359 8.292 QT
16.578 7.682 16.578 6.761 QT
cp
17.766 6.761 M
17.766 7.464 18.336 7.94 QT
18.906 8.417 19.719 8.651 QT
20.531 8.886 21.25 8.886 QT
21.953 8.886 22.766 8.651 QT
23.578 8.417 24.148 7.94 QT
24.719 7.464 24.719 6.761 QT
24.719 5.667 23.711 5.339 QT
22.703 5.011 21.266 5.011 QT
19.547 5.011 L
19.063 5.011 18.656 5.245 QT
18.25 5.479 18.008 5.893 QT
17.766 6.307 17.766 6.761 QT
cp
20.672 1.464 M
22.453 1.464 22.453 -1.068 QT
22.453 -2.177 22.07 -2.888 QT
21.688 -3.599 20.672 -3.599 QT
19.641 -3.599 19.258 -2.888 QT
18.875 -2.177 18.875 -1.068 QT
18.875 -0.38 19.023 0.182 QT
19.172 0.745 19.563 1.104 QT
19.953 1.464 20.672 1.464 QT
cp
f
GR
GS
[0.75 0 0 0.75 314.11361 48.61029] CT
N
31.901 5.354 M
30.62 5.354 29.55 4.682 QT
28.479 4.011 27.862 2.886 QT
27.245 1.761 27.245 0.511 QT
27.245 -0.708 27.807 -1.818 QT
28.37 -2.927 29.37 -3.607 QT
30.37 -4.286 31.604 -4.286 QT
32.557 -4.286 33.276 -3.966 QT
33.995 -3.646 34.456 -3.075 QT
34.917 -2.505 35.151 -1.724 QT
35.385 -0.943 35.385 -0.005 QT
35.385 0.276 35.167 0.276 QT
29.089 0.276 L
29.089 0.495 L
29.089 2.245 29.792 3.495 QT
30.495 4.745 32.089 4.745 QT
32.729 4.745 33.276 4.456 QT
33.823 4.167 34.229 3.651 QT
34.635 3.136 34.776 2.557 QT
34.792 2.479 34.854 2.425 QT
34.917 2.37 34.979 2.37 QT
35.167 2.37 L
35.385 2.37 35.385 2.636 QT
35.089 3.823 34.104 4.589 QT
33.12 5.354 31.901 5.354 QT
cp
29.104 -0.255 M
33.901 -0.255 L
33.901 -1.036 33.675 -1.849 QT
33.448 -2.661 32.94 -3.2 QT
32.432 -3.739 31.604 -3.739 QT
30.417 -3.739 29.76 -2.63 QT
29.104 -1.521 29.104 -0.255 QT
cp
f
GR
GS
[0.75 0 0 0.75 314.11361 48.61029] CT
N
36.773 5.12 M
36.773 4.386 L
37.492 4.386 37.953 4.268 QT
38.414 4.151 38.414 3.714 QT
38.414 -2.021 L
38.414 -2.583 38.242 -2.833 QT
38.07 -3.083 37.758 -3.138 QT
37.445 -3.193 36.773 -3.193 QT
36.773 -3.927 L
39.82 -4.161 L
39.82 -2.114 L
40.242 -3.005 41.07 -3.583 QT
41.898 -4.161 42.867 -4.161 QT
44.32 -4.161 45.054 -3.466 QT
45.789 -2.771 45.789 -1.333 QT
45.789 3.714 L
45.789 4.151 46.25 4.268 QT
46.711 4.386 47.429 4.386 QT
47.429 5.12 L
42.617 5.12 L
42.617 4.386 L
43.336 4.386 43.797 4.268 QT
44.258 4.151 44.258 3.714 QT
44.258 -1.271 L
44.258 -2.286 43.961 -2.95 QT
43.664 -3.614 42.742 -3.614 QT
41.523 -3.614 40.734 -2.638 QT
39.945 -1.661 39.945 -0.427 QT
39.945 3.714 L
39.945 4.151 40.414 4.268 QT
40.883 4.386 41.586 4.386 QT
41.586 5.12 L
36.773 5.12 L
cp
f
GR
GS
[0.75 0 0 0.75 314.11361 48.61029] CT
N
49.548 2.604 M
49.548 -3.193 L
47.814 -3.193 L
47.814 -3.739 L
49.189 -3.739 49.829 -5.021 QT
50.47 -6.302 50.47 -7.802 QT
51.079 -7.802 L
51.079 -3.927 L
54.048 -3.927 L
54.048 -3.193 L
51.079 -3.193 L
51.079 2.557 L
51.079 3.432 51.368 4.089 QT
51.657 4.745 52.423 4.745 QT
53.142 4.745 53.462 4.05 QT
53.782 3.354 53.782 2.557 QT
53.782 1.323 L
54.376 1.323 L
54.376 2.604 L
54.376 3.261 54.134 3.901 QT
53.892 4.542 53.423 4.948 QT
52.954 5.354 52.282 5.354 QT
51.017 5.354 50.282 4.604 QT
49.548 3.854 49.548 2.604 QT
cp
f
GR
GS
[0.75 0 0 0.75 314.11361 48.61029] CT
N
64.768 5.12 M
64.768 4.386 L
67.393 4.386 67.393 3.714 QT
67.393 -7.302 L
66.299 -6.786 64.643 -6.786 QT
64.643 -7.521 L
67.221 -7.521 68.534 -8.864 QT
68.831 -8.864 L
68.893 -8.864 68.963 -8.81 QT
69.034 -8.755 69.034 -8.677 QT
69.034 3.714 L
69.034 4.386 71.659 4.386 QT
71.659 5.12 L
64.768 5.12 L
cp
f
GR
GS
[0.75 0 0 0.75 0 0] CT
0.2 0.702 0.2 RC
1 LJ
0.667 LW
N
375.985 64.814 M
415.83 64.814 L
S
GR
GS
[0.75 0 0 0.75 314.11361 68.20343] CT
N
/f-597267615{0.672 5.12 M
0.672 4.386 L
2.547 4.386 2.984 3.136 QT
7.391 -9.693 L
7.453 -9.911 7.734 -9.911 QT
8 -9.911 L
8.281 -9.911 8.344 -9.693 QT
12.938 3.714 L
13.141 4.151 13.688 4.268 QT
14.234 4.386 15.047 4.386 QT
15.047 5.12 L
9.203 5.12 L
9.203 4.386 L
10.938 4.386 10.938 3.823 QT
10.938 3.714 L
9.797 0.432 L
4.703 0.432 L
3.766 3.136 L
3.75 3.214 3.75 3.354 QT
3.75 3.886 4.242 4.136 QT
4.734 4.386 5.313 4.386 QT
5.313 5.12 L
0.672 5.12 L
cp
4.953 -0.302 M
9.563 -0.302 L
7.25 -7.005 L
4.953 -0.302 L
cp}def
f-597267615
f
GR
GS
[0.75 0 0 0.75 314.11361 68.20343] CT
N
/f-745240314{16.578 6.761 M
16.578 6.011 17.125 5.456 QT
17.672 4.901 18.422 4.651 QT
18 4.339 17.781 3.854 QT
17.563 3.37 17.563 2.839 QT
17.563 1.854 18.188 1.089 QT
17.219 0.151 17.219 -1.068 QT
17.219 -1.724 17.5 -2.302 QT
17.781 -2.88 18.289 -3.302 QT
18.797 -3.724 19.406 -3.943 QT
20.016 -4.161 20.672 -4.161 QT
21.922 -4.161 22.906 -3.427 QT
23.344 -3.896 23.93 -4.146 QT
24.516 -4.396 25.156 -4.396 QT
25.609 -4.396 25.898 -4.075 QT
26.188 -3.755 26.188 -3.302 QT
26.188 -3.036 25.992 -2.841 QT
25.797 -2.646 25.531 -2.646 QT
25.266 -2.646 25.07 -2.841 QT
24.875 -3.036 24.875 -3.302 QT
24.875 -3.693 25.141 -3.849 QT
24.047 -3.849 23.266 -3.099 QT
23.656 -2.708 23.883 -2.161 QT
24.109 -1.614 24.109 -1.068 QT
24.109 -0.177 23.617 0.534 QT
23.125 1.245 22.32 1.636 QT
21.516 2.026 20.672 2.026 QT
19.516 2.026 18.563 1.401 QT
18.266 1.823 18.266 2.323 QT
18.266 2.886 18.633 3.3 QT
19 3.714 19.547 3.714 QT
21.266 3.714 L
22.516 3.714 23.523 3.94 QT
24.531 4.167 25.211 4.846 QT
25.891 5.526 25.891 6.761 QT
25.891 7.682 25.117 8.292 QT
24.344 8.901 23.258 9.175 QT
22.172 9.448 21.25 9.448 QT
20.313 9.448 19.227 9.175 QT
18.141 8.901 17.359 8.292 QT
16.578 7.682 16.578 6.761 QT
cp
17.766 6.761 M
17.766 7.464 18.336 7.94 QT
18.906 8.417 19.719 8.651 QT
20.531 8.886 21.25 8.886 QT
21.953 8.886 22.766 8.651 QT
23.578 8.417 24.148 7.94 QT
24.719 7.464 24.719 6.761 QT
24.719 5.667 23.711 5.339 QT
22.703 5.011 21.266 5.011 QT
19.547 5.011 L
19.063 5.011 18.656 5.245 QT
18.25 5.479 18.008 5.893 QT
17.766 6.307 17.766 6.761 QT
cp
20.672 1.464 M
22.453 1.464 22.453 -1.068 QT
22.453 -2.177 22.07 -2.888 QT
21.688 -3.599 20.672 -3.599 QT
19.641 -3.599 19.258 -2.888 QT
18.875 -2.177 18.875 -1.068 QT
18.875 -0.38 19.023 0.182 QT
19.172 0.745 19.563 1.104 QT
19.953 1.464 20.672 1.464 QT
cp}def
f-745240314
f
GR
GS
[0.75 0 0 0.75 314.11361 68.20343] CT
N
/f1964844890{31.901 5.354 M
30.62 5.354 29.55 4.682 QT
28.479 4.011 27.862 2.886 QT
27.245 1.761 27.245 0.511 QT
27.245 -0.708 27.807 -1.818 QT
28.37 -2.927 29.37 -3.607 QT
30.37 -4.286 31.604 -4.286 QT
32.557 -4.286 33.276 -3.966 QT
33.995 -3.646 34.456 -3.075 QT
34.917 -2.505 35.151 -1.724 QT
35.385 -0.943 35.385 -0.005 QT
35.385 0.276 35.167 0.276 QT
29.089 0.276 L
29.089 0.495 L
29.089 2.245 29.792 3.495 QT
30.495 4.745 32.089 4.745 QT
32.729 4.745 33.276 4.456 QT
33.823 4.167 34.229 3.651 QT
34.635 3.136 34.776 2.557 QT
34.792 2.479 34.854 2.425 QT
34.917 2.37 34.979 2.37 QT
35.167 2.37 L
35.385 2.37 35.385 2.636 QT
35.089 3.823 34.104 4.589 QT
33.12 5.354 31.901 5.354 QT
cp
29.104 -0.255 M
33.901 -0.255 L
33.901 -1.036 33.675 -1.849 QT
33.448 -2.661 32.94 -3.2 QT
32.432 -3.739 31.604 -3.739 QT
30.417 -3.739 29.76 -2.63 QT
29.104 -1.521 29.104 -0.255 QT
cp}def
f1964844890
f
GR
GS
[0.75 0 0 0.75 314.11361 68.20343] CT
N
/f1881606250{36.773 5.12 M
36.773 4.386 L
37.492 4.386 37.953 4.268 QT
38.414 4.151 38.414 3.714 QT
38.414 -2.021 L
38.414 -2.583 38.242 -2.833 QT
38.07 -3.083 37.758 -3.138 QT
37.445 -3.193 36.773 -3.193 QT
36.773 -3.927 L
39.82 -4.161 L
39.82 -2.114 L
40.242 -3.005 41.07 -3.583 QT
41.898 -4.161 42.867 -4.161 QT
44.32 -4.161 45.054 -3.466 QT
45.789 -2.771 45.789 -1.333 QT
45.789 3.714 L
45.789 4.151 46.25 4.268 QT
46.711 4.386 47.429 4.386 QT
47.429 5.12 L
42.617 5.12 L
42.617 4.386 L
43.336 4.386 43.797 4.268 QT
44.258 4.151 44.258 3.714 QT
44.258 -1.271 L
44.258 -2.286 43.961 -2.95 QT
43.664 -3.614 42.742 -3.614 QT
41.523 -3.614 40.734 -2.638 QT
39.945 -1.661 39.945 -0.427 QT
39.945 3.714 L
39.945 4.151 40.414 4.268 QT
40.883 4.386 41.586 4.386 QT
41.586 5.12 L
36.773 5.12 L
cp}def
f1881606250
f
GR
GS
[0.75 0 0 0.75 314.11361 68.20343] CT
N
/f-1218143468{49.548 2.604 M
49.548 -3.193 L
47.814 -3.193 L
47.814 -3.739 L
49.189 -3.739 49.829 -5.021 QT
50.47 -6.302 50.47 -7.802 QT
51.079 -7.802 L
51.079 -3.927 L
54.048 -3.927 L
54.048 -3.193 L
51.079 -3.193 L
51.079 2.557 L
51.079 3.432 51.368 4.089 QT
51.657 4.745 52.423 4.745 QT
53.142 4.745 53.462 4.05 QT
53.782 3.354 53.782 2.557 QT
53.782 1.323 L
54.376 1.323 L
54.376 2.604 L
54.376 3.261 54.134 3.901 QT
53.892 4.542 53.423 4.948 QT
52.954 5.354 52.282 5.354 QT
51.017 5.354 50.282 4.604 QT
49.548 3.854 49.548 2.604 QT
cp}def
f-1218143468
f
GR
GS
[0.75 0 0 0.75 314.11361 68.20343] CT
N
/f-1429999007{63.862 5.12 M
63.862 4.557 L
63.862 4.511 63.909 4.448 QT
67.159 0.839 L
67.909 0.026 68.37 -0.513 QT
68.831 -1.052 69.276 -1.763 QT
69.721 -2.474 69.987 -3.2 QT
70.252 -3.927 70.252 -4.755 QT
70.252 -5.614 69.932 -6.404 QT
69.612 -7.193 68.979 -7.661 QT
68.346 -8.13 67.456 -8.13 QT
66.549 -8.13 65.823 -7.583 QT
65.096 -7.036 64.799 -6.161 QT
64.877 -6.177 65.018 -6.177 QT
65.487 -6.177 65.823 -5.864 QT
66.159 -5.552 66.159 -5.036 QT
66.159 -4.568 65.823 -4.232 QT
65.487 -3.896 65.018 -3.896 QT
64.534 -3.896 64.198 -4.239 QT
63.862 -4.583 63.862 -5.036 QT
63.862 -5.833 64.159 -6.521 QT
64.456 -7.208 65.018 -7.747 QT
65.581 -8.286 66.276 -8.575 QT
66.971 -8.864 67.768 -8.864 QT
68.971 -8.864 70.002 -8.357 QT
71.034 -7.849 71.643 -6.919 QT
72.252 -5.989 72.252 -4.755 QT
72.252 -3.849 71.854 -3.029 QT
71.456 -2.208 70.831 -1.536 QT
70.206 -0.864 69.229 -0.013 QT
68.252 0.839 67.94 1.136 QT
65.565 3.417 L
67.581 3.417 L
69.065 3.417 70.065 3.393 QT
71.065 3.37 71.127 3.307 QT
71.377 3.042 71.627 1.37 QT
72.252 1.37 L
71.659 5.12 L
63.862 5.12 L
cp}def
f-1429999007
f
GR
GS
[0.75 0 0 0.75 0 0] CT
1 LJ
0.667 LW
N
375.985 90.938 M
415.83 90.938 L
S
GR
GS
[0.75 0 0 0.75 314.11361 87.79657] CT
N
f-597267615
f
GR
GS
[0.75 0 0 0.75 314.11361 87.79657] CT
N
f-745240314
f
GR
GS
[0.75 0 0 0.75 314.11361 87.79657] CT
N
f1964844890
f
GR
GS
[0.75 0 0 0.75 314.11361 87.79657] CT
N
f1881606250
f
GR
GS
[0.75 0 0 0.75 314.11361 87.79657] CT
N
f-1218143468
f
GR
GS
[0.75 0 0 0.75 314.11361 87.79657] CT
N
/f300774680{64.815 3.495 M
65.299 4.214 66.135 4.565 QT
66.971 4.917 67.924 4.917 QT
69.143 4.917 69.659 3.878 QT
70.174 2.839 70.174 1.511 QT
70.174 0.917 70.065 0.323 QT
69.956 -0.271 69.698 -0.786 QT
69.44 -1.302 68.995 -1.607 QT
68.549 -1.911 67.909 -1.911 QT
66.502 -1.911 L
66.315 -1.911 66.315 -2.114 QT
66.315 -2.286 L
66.315 -2.458 66.502 -2.458 QT
67.659 -2.552 L
68.409 -2.552 68.893 -3.107 QT
69.377 -3.661 69.604 -4.45 QT
69.831 -5.239 69.831 -5.958 QT
69.831 -6.974 69.362 -7.614 QT
68.893 -8.255 67.924 -8.255 QT
67.127 -8.255 66.393 -7.958 QT
65.659 -7.661 65.237 -7.036 QT
65.284 -7.052 65.307 -7.06 QT
65.331 -7.068 65.377 -7.068 QT
65.846 -7.068 66.166 -6.739 QT
66.487 -6.411 66.487 -5.943 QT
66.487 -5.489 66.166 -5.161 QT
65.846 -4.833 65.377 -4.833 QT
64.924 -4.833 64.596 -5.161 QT
64.268 -5.489 64.268 -5.943 QT
64.268 -6.849 64.807 -7.513 QT
65.346 -8.177 66.206 -8.521 QT
67.065 -8.864 67.924 -8.864 QT
68.565 -8.864 69.268 -8.677 QT
69.971 -8.489 70.549 -8.138 QT
71.127 -7.786 71.487 -7.232 QT
71.846 -6.677 71.846 -5.958 QT
71.846 -5.083 71.456 -4.333 QT
71.065 -3.583 70.377 -3.044 QT
69.69 -2.505 68.862 -2.239 QT
69.784 -2.052 70.604 -1.544 QT
71.424 -1.036 71.916 -0.232 QT
72.409 0.573 72.409 1.495 QT
72.409 2.651 71.776 3.589 QT
71.143 4.526 70.104 5.057 QT
69.065 5.589 67.924 5.589 QT
66.94 5.589 65.948 5.214 QT
64.956 4.839 64.323 4.089 QT
63.69 3.339 63.69 2.292 QT
63.69 1.761 64.041 1.417 QT
64.393 1.073 64.924 1.073 QT
65.252 1.073 65.534 1.229 QT
65.815 1.386 65.979 1.675 QT
66.143 1.964 66.143 2.292 QT
66.143 2.807 65.784 3.151 QT
65.424 3.495 64.924 3.495 QT
64.815 3.495 L
cp}def
f300774680
f
GR
GS
[0.75 0 0 0.75 0 0] CT
0 0 1 RC
1 LJ
0.667 LW
N
375.985 117.062 M
415.83 117.062 L
S
GR
GS
[0.75 0 0 0.75 314.11361 107.38971] CT
N
f-597267615
f
GR
GS
[0.75 0 0 0.75 314.11361 107.38971] CT
N
f-745240314
f
GR
GS
[0.75 0 0 0.75 314.11361 107.38971] CT
N
f1964844890
f
GR
GS
[0.75 0 0 0.75 314.11361 107.38971] CT
N
f1881606250
f
GR
GS
[0.75 0 0 0.75 314.11361 107.38971] CT
N
f-1218143468
f
GR
GS
[0.75 0 0 0.75 314.11361 107.38971] CT
N
/f-1674298674{63.393 1.651 M
63.393 0.917 L
69.893 -8.771 L
69.956 -8.864 70.112 -8.864 QT
70.409 -8.864 L
70.643 -8.864 70.643 -8.63 QT
70.643 0.917 L
72.706 0.917 L
72.706 1.651 L
70.643 1.651 L
70.643 3.714 L
70.643 4.151 71.26 4.268 QT
71.877 4.386 72.69 4.386 QT
72.69 5.12 L
66.909 5.12 L
66.909 4.386 L
67.721 4.386 68.331 4.268 QT
68.94 4.151 68.94 3.714 QT
68.94 1.651 L
63.393 1.651 L
cp
64.096 0.917 M
69.065 0.917 L
69.065 -6.521 L
64.096 0.917 L
cp}def
f-1674298674
f
GR
GS
[0.75 0 0 0.75 0 0] CT
0.6 0.2 0.2 RC
1 LJ
0.667 LW
N
375.985 143.186 M
415.83 143.186 L
S
GR
GS
[0.75 0 0 0.75 0 0] CT
0.149 GC
10.0 ML
0.667 LW
N
372 158 M
372 50 L
496 50 L
496 158 L
cp
S
GR
%%Trailer
%%Pages: 1
%%EOF
