0.00000,0
0.00000,1
0.00000,2
0.00000,3
0.00000,4
0.00000,5
0.00000,6
0.00000,7
0.00000,8
0.00000,9
0.00000,10
0.00000,11
0.00000,12
0.00000,13
0.00000,14
0.00000,15
0.00000,16
0.00000,17
0.00000,18
0.00000,19
0.00000,20
0.00000,21
0.00000,22
0.00000,23
0.00000,24
0.00000,25
0.00000,26
0.00000,27
0.00000,28
0.00000,29
0.00000,30
0.00000,31
0.00000,32
0.00000,33
0.00000,34
0.00000,35
0.00000,36
0.00000,37
0.00000,38
0.00000,39
0.00000,40
0.00000,42
0.00000,43
0.00000,44
0.00000,46
0.00000,47
0.00000,48
0.00000,50
0.00000,51
0.00000,52
0.00000,54
0.00000,56
0.00000,57
0.00000,58
0.00000,60
0.00000,62
0.00000,64
0.00000,65
0.00000,68
0.00000,70
0.00000,72
0.00000,74
0.00000,76
0.00000,79
0.00000,81
0.00000,84
0.00000,88
0.00000,91
0.00000,94
0.00000,96
0.00000,100
0.00000,102
0.00000,105
0.00000,107
0.00000,110
0.00000,113
0.00000,116
0.00000,123
0.00000,129
0.00000,133
0.00000,137
0.00000,141
0.00000,145
0.00000,149
0.00000,153
0.00000,158
0.00000,163
0.00000,167
0.00000,171
0.00000,175
0.00000,178
0.00000,182
0.00000,185
0.00000,189
0.00000,193
0.00000,197
0.00000,201
0.00000,205
0.00000,209
0.00000,213
0.00000,216
0.00000,221
0.00000,224
0.00000,228
0.00000,234
0.00000,239
0.00000,243
0.00000,284
0.00000,287
0.00000,290
0.00000,293
0.00000,296
0.00000,300
