%!PS-Adobe-3.0 EPSF-3.0
%%Creator: (MATLAB, The Mathworks, Inc. Version 9.12.0.2529717 \(R2022a\) Update 8. Operating System: Linux)
%%Title: plots/Example7c_uy.eps
%%CreationDate: 2024-06-26T03:18:21
%%Pages: (atend)
%%BoundingBox:     3     3   385   311
%%LanguageLevel: 3
%%EndComments
%%BeginProlog
%%BeginResource: procset (Apache XML Graphics Std ProcSet) 1.2 0
%%Version: 1.2 0
%%Copyright: (Copyright 2001-2003,2010 The Apache Software Foundation. License terms: http://www.apache.org/licenses/LICENSE-2.0)
/bd{bind def}bind def
/ld{load def}bd
/GR/grestore ld
/GS/gsave ld
/RM/rmoveto ld
/C/curveto ld
/t/show ld
/L/lineto ld
/ML/setmiterlimit ld
/CT/concat ld
/f/fill ld
/N/newpath ld
/S/stroke ld
/CC/setcmykcolor ld
/A/ashow ld
/cp/closepath ld
/RC/setrgbcolor ld
/LJ/setlinejoin ld
/GC/setgray ld
/LW/setlinewidth ld
/M/moveto ld
/re {4 2 roll M
1 index 0 rlineto
0 exch rlineto
neg 0 rlineto
cp } bd
/_ctm matrix def
/_tm matrix def
/BT { _ctm currentmatrix pop matrix _tm copy pop 0 0 moveto } bd
/ET { _ctm setmatrix } bd
/iTm { _ctm setmatrix _tm concat } bd
/Tm { _tm astore pop iTm 0 0 moveto } bd
/ux 0.0 def
/uy 0.0 def
/F {
  /Tp exch def
  /Tf exch def
  Tf findfont Tp scalefont setfont
  /cf Tf def  /cs Tp def
} bd
/ULS {currentpoint /uy exch def /ux exch def} bd
/ULE {
  /Tcx currentpoint pop def
  gsave
  newpath
  cf findfont cs scalefont dup
  /FontMatrix get 0 get /Ts exch def /FontInfo get dup
  /UnderlinePosition get Ts mul /To exch def
  /UnderlineThickness get Ts mul /Tt exch def
  ux uy To add moveto  Tcx uy To add lineto
  Tt setlinewidth stroke
  grestore
} bd
/OLE {
  /Tcx currentpoint pop def
  gsave
  newpath
  cf findfont cs scalefont dup
  /FontMatrix get 0 get /Ts exch def /FontInfo get dup
  /UnderlinePosition get Ts mul /To exch def
  /UnderlineThickness get Ts mul /Tt exch def
  ux uy To add cs add moveto Tcx uy To add cs add lineto
  Tt setlinewidth stroke
  grestore
} bd
/SOE {
  /Tcx currentpoint pop def
  gsave
  newpath
  cf findfont cs scalefont dup
  /FontMatrix get 0 get /Ts exch def /FontInfo get dup
  /UnderlinePosition get Ts mul /To exch def
  /UnderlineThickness get Ts mul /Tt exch def
  ux uy To add cs 10 mul 26 idiv add moveto Tcx uy To add cs 10 mul 26 idiv add lineto
  Tt setlinewidth stroke
  grestore
} bd
/QT {
/Y22 exch store
/X22 exch store
/Y21 exch store
/X21 exch store
currentpoint
/Y21 load 2 mul add 3 div exch
/X21 load 2 mul add 3 div exch
/X21 load 2 mul /X22 load add 3 div
/Y21 load 2 mul /Y22 load add 3 div
/X22 load /Y22 load curveto
} bd
/SSPD {
dup length /d exch dict def
{
/v exch def
/k exch def
currentpagedevice k known {
/cpdv currentpagedevice k get def
v cpdv ne {
/upd false def
/nullv v type /nulltype eq def
/nullcpdv cpdv type /nulltype eq def
nullv nullcpdv or
{
/upd true def
} {
/sametype v type cpdv type eq def
sametype {
v type /arraytype eq {
/vlen v length def
/cpdvlen cpdv length def
vlen cpdvlen eq {
0 1 vlen 1 sub {
/i exch def
/obj v i get def
/cpdobj cpdv i get def
obj cpdobj ne {
/upd true def
exit
} if
} for
} {
/upd true def
} ifelse
} {
v type /dicttype eq {
v {
/dv exch def
/dk exch def
/cpddv cpdv dk get def
dv cpddv ne {
/upd true def
exit
} if
} forall
} {
/upd true def
} ifelse
} ifelse
} if
} ifelse
upd true eq {
d k v put
} if
} if
} if
} forall
d length 0 gt {
d setpagedevice
} if
} bd
/RE { % /NewFontName [NewEncodingArray] /FontName RE -
  findfont dup length dict begin
  {
    1 index /FID ne
    {def} {pop pop} ifelse
  } forall
  /Encoding exch def
  /FontName 1 index def
  currentdict definefont pop
  end
} bind def
%%EndResource
%%BeginResource: procset (Apache XML Graphics EPS ProcSet) 1.0 0
%%Version: 1.0 0
%%Copyright: (Copyright 2002-2003 The Apache Software Foundation. License terms: http://www.apache.org/licenses/LICENSE-2.0)
/BeginEPSF { %def
/b4_Inc_state save def         % Save state for cleanup
/dict_count countdictstack def % Count objects on dict stack
/op_count count 1 sub def      % Count objects on operand stack
userdict begin                 % Push userdict on dict stack
/showpage { } def              % Redefine showpage, { } = null proc
0 setgray 0 setlinecap         % Prepare graphics state
1 setlinewidth 0 setlinejoin
10 setmiterlimit [ ] 0 setdash newpath
/languagelevel where           % If level not equal to 1 then
{pop languagelevel             % set strokeadjust and
1 ne                           % overprint to their defaults.
{false setstrokeadjust false setoverprint
} if
} if
} bd
/EndEPSF { %def
count op_count sub {pop} repeat            % Clean up stacks
countdictstack dict_count sub {end} repeat
b4_Inc_state restore
} bd
%%EndResource
%FOPBeginFontDict
%%IncludeResource: font Courier-Oblique
%%IncludeResource: font Courier-BoldOblique
%%IncludeResource: font Courier-Bold
%%IncludeResource: font ZapfDingbats
%%IncludeResource: font Symbol
%%IncludeResource: font Helvetica
%%IncludeResource: font Helvetica-Oblique
%%IncludeResource: font Helvetica-Bold
%%IncludeResource: font Helvetica-BoldOblique
%%IncludeResource: font Times-Roman
%%IncludeResource: font Times-Italic
%%IncludeResource: font Times-Bold
%%IncludeResource: font Times-BoldItalic
%%IncludeResource: font Courier
%FOPEndFontDict
%%BeginResource: encoding WinAnsiEncoding
/WinAnsiEncoding [
/.notdef /.notdef /.notdef /.notdef /.notdef
/.notdef /.notdef /.notdef /.notdef /.notdef
/.notdef /.notdef /.notdef /.notdef /.notdef
/.notdef /.notdef /.notdef /.notdef /.notdef
/.notdef /.notdef /.notdef /.notdef /.notdef
/.notdef /.notdef /.notdef /.notdef /.notdef
/.notdef /.notdef /space /exclam /quotedbl
/numbersign /dollar /percent /ampersand /quotesingle
/parenleft /parenright /asterisk /plus /comma
/hyphen /period /slash /zero /one
/two /three /four /five /six
/seven /eight /nine /colon /semicolon
/less /equal /greater /question /at
/A /B /C /D /E
/F /G /H /I /J
/K /L /M /N /O
/P /Q /R /S /T
/U /V /W /X /Y
/Z /bracketleft /backslash /bracketright /asciicircum
/underscore /quoteleft /a /b /c
/d /e /f /g /h
/i /j /k /l /m
/n /o /p /q /r
/s /t /u /v /w
/x /y /z /braceleft /bar
/braceright /asciitilde /bullet /Euro /bullet
/quotesinglbase /florin /quotedblbase /ellipsis /dagger
/daggerdbl /circumflex /perthousand /Scaron /guilsinglleft
/OE /bullet /Zcaron /bullet /bullet
/quoteleft /quoteright /quotedblleft /quotedblright /bullet
/endash /emdash /asciitilde /trademark /scaron
/guilsinglright /oe /bullet /zcaron /Ydieresis
/space /exclamdown /cent /sterling /currency
/yen /brokenbar /section /dieresis /copyright
/ordfeminine /guillemotleft /logicalnot /sfthyphen /registered
/macron /degree /plusminus /twosuperior /threesuperior
/acute /mu /paragraph /middot /cedilla
/onesuperior /ordmasculine /guillemotright /onequarter /onehalf
/threequarters /questiondown /Agrave /Aacute /Acircumflex
/Atilde /Adieresis /Aring /AE /Ccedilla
/Egrave /Eacute /Ecircumflex /Edieresis /Igrave
/Iacute /Icircumflex /Idieresis /Eth /Ntilde
/Ograve /Oacute /Ocircumflex /Otilde /Odieresis
/multiply /Oslash /Ugrave /Uacute /Ucircumflex
/Udieresis /Yacute /Thorn /germandbls /agrave
/aacute /acircumflex /atilde /adieresis /aring
/ae /ccedilla /egrave /eacute /ecircumflex
/edieresis /igrave /iacute /icircumflex /idieresis
/eth /ntilde /ograve /oacute /ocircumflex
/otilde /odieresis /divide /oslash /ugrave
/uacute /ucircumflex /udieresis /yacute /thorn
/ydieresis
] def
%%EndResource
%FOPBeginFontReencode
/Courier-Oblique findfont
dup length dict begin
  {1 index /FID ne {def} {pop pop} ifelse} forall
  /Encoding WinAnsiEncoding def
  currentdict
end
/Courier-Oblique exch definefont pop
/Courier-BoldOblique findfont
dup length dict begin
  {1 index /FID ne {def} {pop pop} ifelse} forall
  /Encoding WinAnsiEncoding def
  currentdict
end
/Courier-BoldOblique exch definefont pop
/Courier-Bold findfont
dup length dict begin
  {1 index /FID ne {def} {pop pop} ifelse} forall
  /Encoding WinAnsiEncoding def
  currentdict
end
/Courier-Bold exch definefont pop
/Helvetica findfont
dup length dict begin
  {1 index /FID ne {def} {pop pop} ifelse} forall
  /Encoding WinAnsiEncoding def
  currentdict
end
/Helvetica exch definefont pop
/Helvetica-Oblique findfont
dup length dict begin
  {1 index /FID ne {def} {pop pop} ifelse} forall
  /Encoding WinAnsiEncoding def
  currentdict
end
/Helvetica-Oblique exch definefont pop
/Helvetica-Bold findfont
dup length dict begin
  {1 index /FID ne {def} {pop pop} ifelse} forall
  /Encoding WinAnsiEncoding def
  currentdict
end
/Helvetica-Bold exch definefont pop
/Helvetica-BoldOblique findfont
dup length dict begin
  {1 index /FID ne {def} {pop pop} ifelse} forall
  /Encoding WinAnsiEncoding def
  currentdict
end
/Helvetica-BoldOblique exch definefont pop
/Times-Roman findfont
dup length dict begin
  {1 index /FID ne {def} {pop pop} ifelse} forall
  /Encoding WinAnsiEncoding def
  currentdict
end
/Times-Roman exch definefont pop
/Times-Italic findfont
dup length dict begin
  {1 index /FID ne {def} {pop pop} ifelse} forall
  /Encoding WinAnsiEncoding def
  currentdict
end
/Times-Italic exch definefont pop
/Times-Bold findfont
dup length dict begin
  {1 index /FID ne {def} {pop pop} ifelse} forall
  /Encoding WinAnsiEncoding def
  currentdict
end
/Times-Bold exch definefont pop
/Times-BoldItalic findfont
dup length dict begin
  {1 index /FID ne {def} {pop pop} ifelse} forall
  /Encoding WinAnsiEncoding def
  currentdict
end
/Times-BoldItalic exch definefont pop
/Courier findfont
dup length dict begin
  {1 index /FID ne {def} {pop pop} ifelse} forall
  /Encoding WinAnsiEncoding def
  currentdict
end
/Courier exch definefont pop
%FOPEndFontReencode
%%EndProlog
%%Page: 1 1
%%PageBoundingBox: 0 0 420 315
%%BeginPageSetup
N
    3     3 M
  388     3 L
  388   314 L
    3   314 L
cp
clip
[1 0 0 -1 0 315] CT
%%EndPageSetup
GS
[0.75 0 0 0.75 0 0] CT
1 GC
N
0 0 560 420 re
f
GR
GS
[0.75 0 0 0.75 0 0] CT
1 GC
N
0 0 560 420 re
f
GR
GS
[0.75 0 0 0.75 0 0] CT
1 GC
N
73 359 M
507 359 L
507 39 L
73 39 L
cp
f
GR
GS
[0.75 0 0 0.75 0 0] CT
0.873 GC
1 LJ
0.667 LW
N
73 359 M
73 39 L
S
GR
GS
[0.75 0 0 0.75 0 0] CT
0.873 GC
1 LJ
0.667 LW
N
127.25 359 M
127.25 39 L
S
GR
GS
[0.75 0 0 0.75 0 0] CT
0.873 GC
1 LJ
0.667 LW
N
181.5 359 M
181.5 39 L
S
GR
GS
[0.75 0 0 0.75 0 0] CT
0.873 GC
1 LJ
0.667 LW
N
235.75 359 M
235.75 39 L
S
GR
GS
[0.75 0 0 0.75 0 0] CT
0.873 GC
1 LJ
0.667 LW
N
290 359 M
290 39 L
S
GR
GS
[0.75 0 0 0.75 0 0] CT
0.873 GC
1 LJ
0.667 LW
N
344.25 359 M
344.25 39 L
S
GR
GS
[0.75 0 0 0.75 0 0] CT
0.873 GC
1 LJ
0.667 LW
N
398.5 359 M
398.5 39 L
S
GR
GS
[0.75 0 0 0.75 0 0] CT
0.873 GC
1 LJ
0.667 LW
N
452.75 359 M
452.75 39 L
S
GR
GS
[0.75 0 0 0.75 0 0] CT
0.873 GC
1 LJ
0.667 LW
N
507 359 M
507 39 L
S
GR
GS
[0.75 0 0 0.75 0 0] CT
0.873 GC
1 LJ
0.667 LW
N
507 359 M
73 359 L
S
GR
GS
[0.75 0 0 0.75 0 0] CT
0.873 GC
1 LJ
0.667 LW
N
507 313.286 M
73 313.286 L
S
GR
GS
[0.75 0 0 0.75 0 0] CT
0.873 GC
1 LJ
0.667 LW
N
507 267.571 M
73 267.571 L
S
GR
GS
[0.75 0 0 0.75 0 0] CT
0.873 GC
1 LJ
0.667 LW
N
507 221.857 M
73 221.857 L
S
GR
GS
[0.75 0 0 0.75 0 0] CT
0.873 GC
1 LJ
0.667 LW
N
507 176.143 M
73 176.143 L
S
GR
GS
[0.75 0 0 0.75 0 0] CT
0.873 GC
1 LJ
0.667 LW
N
507 130.429 M
73 130.429 L
S
GR
GS
[0.75 0 0 0.75 0 0] CT
0.873 GC
1 LJ
0.667 LW
N
507 84.714 M
73 84.714 L
S
GR
GS
[0.75 0 0 0.75 0 0] CT
0.873 GC
1 LJ
0.667 LW
N
507 39 M
73 39 L
S
GR
GS
[0.75 0 0 0.75 0 0] CT
0.149 GC
2 setlinecap
1 LJ
0.667 LW
N
73 359 M
507 359 L
S
GR
GS
[0.75 0 0 0.75 0 0] CT
0.149 GC
2 setlinecap
1 LJ
0.667 LW
N
73 359 M
73 354.66 L
S
GR
GS
[0.75 0 0 0.75 0 0] CT
0.149 GC
2 setlinecap
1 LJ
0.667 LW
N
127.25 359 M
127.25 354.66 L
S
GR
GS
[0.75 0 0 0.75 0 0] CT
0.149 GC
2 setlinecap
1 LJ
0.667 LW
N
181.5 359 M
181.5 354.66 L
S
GR
GS
[0.75 0 0 0.75 0 0] CT
0.149 GC
2 setlinecap
1 LJ
0.667 LW
N
235.75 359 M
235.75 354.66 L
S
GR
GS
[0.75 0 0 0.75 0 0] CT
0.149 GC
2 setlinecap
1 LJ
0.667 LW
N
290 359 M
290 354.66 L
S
GR
GS
[0.75 0 0 0.75 0 0] CT
0.149 GC
2 setlinecap
1 LJ
0.667 LW
N
344.25 359 M
344.25 354.66 L
S
GR
GS
[0.75 0 0 0.75 0 0] CT
0.149 GC
2 setlinecap
1 LJ
0.667 LW
N
398.5 359 M
398.5 354.66 L
S
GR
GS
[0.75 0 0 0.75 0 0] CT
0.149 GC
2 setlinecap
1 LJ
0.667 LW
N
452.75 359 M
452.75 354.66 L
S
GR
GS
[0.75 0 0 0.75 0 0] CT
0.149 GC
2 setlinecap
1 LJ
0.667 LW
N
507 359 M
507 354.66 L
S
GR
GS
[0.75 0 0 0.75 54.75 273.25001] CT
0.149 GC
/Helvetica 13.333 F
GS
[1 0 0 1 0 0] CT
-4 15 moveto 
1 -1 scale
(0) t 
GR
GR
GS
[0.75 0 0 0.75 95.4375 273.25001] CT
0.149 GC
/Helvetica 13.333 F
GS
[1 0 0 1 0 0] CT
-4 15 moveto 
1 -1 scale
(2) t 
GR
GR
GS
[0.75 0 0 0.75 136.125 273.25001] CT
0.149 GC
/Helvetica 13.333 F
GS
[1 0 0 1 0 0] CT
-4 15 moveto 
1 -1 scale
(4) t 
GR
GR
GS
[0.75 0 0 0.75 176.8125 273.25001] CT
0.149 GC
/Helvetica 13.333 F
GS
[1 0 0 1 0 0] CT
-4 15 moveto 
1 -1 scale
(6) t 
GR
GR
GS
[0.75 0 0 0.75 217.5 273.25001] CT
0.149 GC
/Helvetica 13.333 F
GS
[1 0 0 1 0 0] CT
-4 15 moveto 
1 -1 scale
(8) t 
GR
GR
GS
[0.75 0 0 0.75 258.1875 273.25001] CT
0.149 GC
/Helvetica 13.333 F
GS
[1 0 0 1 0 0] CT
-8 15 moveto 
1 -1 scale
(10) t 
GR
GR
GS
[0.75 0 0 0.75 298.875 273.25001] CT
0.149 GC
/Helvetica 13.333 F
GS
[1 0 0 1 0 0] CT
-8 15 moveto 
1 -1 scale
(12) t 
GR
GR
GS
[0.75 0 0 0.75 339.5625 273.25001] CT
0.149 GC
/Helvetica 13.333 F
GS
[1 0 0 1 0 0] CT
-8 15 moveto 
1 -1 scale
(14) t 
GR
GR
GS
[0.75 0 0 0.75 380.25 273.25001] CT
0.149 GC
/Helvetica 13.333 F
GS
[1 0 0 1 0 0] CT
-8 15 moveto 
1 -1 scale
(16) t 
GR
GR
GS
[0.75 0 0 0.75 217.50016 288.50002] CT
0.149 GC
N
-74.637 22.296 M
-74.637 21.859 -74.544 21.484 QT
-72.45 13.156 L
-75.497 13.156 L
-75.794 13.156 -75.794 12.781 QT
-75.684 12.14 -75.419 12.14 QT
-72.2 12.14 L
-71.044 7.406 L
-70.919 7.031 -70.583 6.757 QT
-70.247 6.484 -69.825 6.484 QT
-69.45 6.484 -69.2 6.702 QT
-68.95 6.921 -68.95 7.296 QT
-68.95 7.374 -68.958 7.429 QT
-68.965 7.484 -68.981 7.531 QT
-70.153 12.14 L
-67.153 12.14 L
-66.856 12.14 -66.856 12.515 QT
-66.872 12.593 -66.919 12.765 QT
-66.965 12.937 -67.036 13.046 QT
-67.106 13.156 -67.247 13.156 QT
-70.403 13.156 L
-72.481 21.546 L
-72.7 22.359 -72.7 22.952 QT
-72.7 24.202 -71.84 24.202 QT
-70.575 24.202 -69.59 23.007 QT
-68.606 21.812 -68.075 20.374 QT
-67.965 20.202 -67.856 20.202 QT
-67.497 20.202 L
-67.387 20.202 -67.317 20.281 QT
-67.247 20.359 -67.247 20.468 QT
-67.247 20.515 -67.278 20.546 QT
-67.903 22.296 -69.122 23.632 QT
-70.34 24.968 -71.919 24.968 QT
-73.059 24.968 -73.848 24.218 QT
-74.637 23.468 -74.637 22.296 QT
cp
f
GR
GS
[0.75 0 0 0.75 217.50016 288.50002] CT
0.149 GC
N
-63.576 22.562 M
-63.576 22.015 -63.342 21.421 QT
-60.998 15.187 L
-60.623 14.124 -60.623 13.437 QT
-60.623 12.577 -61.248 12.577 QT
-62.404 12.577 -63.146 13.757 QT
-63.889 14.937 -64.248 16.406 QT
-64.295 16.577 -64.482 16.577 QT
-64.826 16.577 L
-65.06 16.577 -65.06 16.312 QT
-65.06 16.234 L
-64.592 14.499 -63.631 13.163 QT
-62.67 11.827 -61.201 11.827 QT
-60.17 11.827 -59.451 12.507 QT
-58.732 13.187 -58.732 14.234 QT
-58.732 14.765 -58.967 15.359 QT
-61.326 21.593 L
-61.717 22.562 -61.717 23.343 QT
-61.717 24.202 -61.06 24.202 QT
-59.92 24.202 -59.162 22.991 QT
-58.404 21.781 -58.092 20.374 QT
-58.045 20.202 -57.873 20.202 QT
-57.514 20.202 L
-57.404 20.202 -57.334 20.281 QT
-57.264 20.359 -57.264 20.468 QT
-57.264 20.484 -57.295 20.546 QT
-57.685 22.187 -58.67 23.577 QT
-59.654 24.968 -61.107 24.968 QT
-62.139 24.968 -62.857 24.265 QT
-63.576 23.562 -63.576 22.562 QT
cp
-60.31 7.062 M
-60.31 6.452 -59.795 5.96 QT
-59.279 5.468 -58.67 5.468 QT
-58.185 5.468 -57.865 5.773 QT
-57.545 6.077 -57.545 6.546 QT
-57.545 7.187 -58.06 7.679 QT
-58.576 8.171 -59.201 8.171 QT
-59.67 8.171 -59.99 7.851 QT
-60.31 7.531 -60.31 7.062 QT
cp
f
GR
GS
[0.75 0 0 0.75 217.50016 288.50002] CT
0.149 GC
N
-53.502 24.14 M
-53.502 23.968 -53.47 23.89 QT
-51.298 15.234 L
-51.095 14.437 -51.095 13.827 QT
-51.095 12.577 -51.939 12.577 QT
-52.845 12.577 -53.283 13.663 QT
-53.72 14.749 -54.142 16.406 QT
-54.142 16.484 -54.22 16.531 QT
-54.298 16.577 -54.377 16.577 QT
-54.72 16.577 L
-54.814 16.577 -54.884 16.476 QT
-54.955 16.374 -54.955 16.281 QT
-54.642 15.031 -54.353 14.148 QT
-54.064 13.265 -53.447 12.546 QT
-52.83 11.827 -51.908 11.827 QT
-50.83 11.827 -49.994 12.515 QT
-49.158 13.202 -49.158 14.265 QT
-48.283 13.124 -47.127 12.476 QT
-45.97 11.827 -44.658 11.827 QT
-43.283 11.827 -42.291 12.531 QT
-41.298 13.234 -41.298 14.515 QT
-40.408 13.249 -39.205 12.538 QT
-38.002 11.827 -36.595 11.827 QT
-35.095 11.827 -34.181 12.64 QT
-33.267 13.452 -33.267 14.952 QT
-33.267 16.14 -33.798 17.827 QT
-34.33 19.515 -35.111 21.593 QT
-35.533 22.593 -35.533 23.343 QT
-35.533 24.202 -34.845 24.202 QT
-33.72 24.202 -32.97 22.984 QT
-32.22 21.765 -31.908 20.374 QT
-31.814 20.202 -31.658 20.202 QT
-31.33 20.202 L
-31.205 20.202 -31.127 20.281 QT
-31.048 20.359 -31.048 20.468 QT
-31.048 20.484 -31.08 20.546 QT
-31.486 22.187 -32.47 23.577 QT
-33.455 24.968 -34.923 24.968 QT
-35.939 24.968 -36.658 24.265 QT
-37.377 23.562 -37.377 22.562 QT
-37.377 22.046 -37.142 21.421 QT
-36.33 19.249 -35.783 17.531 QT
-35.236 15.812 -35.236 14.515 QT
-35.236 13.702 -35.556 13.14 QT
-35.877 12.577 -36.642 12.577 QT
-38.236 12.577 -39.392 13.546 QT
-40.548 14.515 -41.408 16.109 QT
-41.455 16.406 -41.486 16.562 QT
-43.361 23.999 L
-43.455 24.406 -43.806 24.687 QT
-44.158 24.968 -44.58 24.968 QT
-44.923 24.968 -45.181 24.741 QT
-45.439 24.515 -45.439 24.14 QT
-45.439 23.968 -45.408 23.89 QT
-43.564 16.499 L
-43.267 15.312 -43.267 14.515 QT
-43.267 13.702 -43.595 13.14 QT
-43.923 12.577 -44.72 12.577 QT
-45.783 12.577 -46.673 13.046 QT
-47.564 13.515 -48.228 14.281 QT
-48.892 15.046 -49.455 16.109 QT
-51.423 23.999 L
-51.517 24.406 -51.861 24.687 QT
-52.205 24.968 -52.642 24.968 QT
-52.986 24.968 -53.244 24.741 QT
-53.502 24.515 -53.502 24.14 QT
cp
f
GR
GS
[0.75 0 0 0.75 217.50016 288.50002] CT
0.149 GC
N
-24.153 24.968 M
-25.528 24.968 -26.575 24.241 QT
-27.621 23.515 -28.161 22.296 QT
-28.7 21.077 -28.7 19.718 QT
-28.7 17.64 -27.661 15.82 QT
-26.621 13.999 -24.84 12.913 QT
-23.059 11.827 -21.012 11.827 QT
-19.778 11.827 -18.848 12.468 QT
-17.918 13.109 -17.918 14.312 QT
-17.918 15.984 -19.246 16.796 QT
-20.575 17.609 -22.246 17.804 QT
-23.918 17.999 -25.95 17.999 QT
-26.028 17.999 L
-26.496 19.734 -26.496 20.952 QT
-26.496 22.249 -25.903 23.226 QT
-25.309 24.202 -24.09 24.202 QT
-22.356 24.202 -20.77 23.406 QT
-19.184 22.609 -18.168 21.218 QT
-18.09 21.124 -17.95 21.124 QT
-17.809 21.124 -17.661 21.288 QT
-17.512 21.452 -17.512 21.593 QT
-17.512 21.702 -17.559 21.765 QT
-18.621 23.249 -20.418 24.109 QT
-22.215 24.968 -24.153 24.968 QT
cp
-25.856 17.249 M
-24.168 17.249 -22.739 17.093 QT
-21.309 16.937 -20.153 16.304 QT
-18.996 15.671 -18.996 14.343 QT
-18.996 13.812 -19.293 13.406 QT
-19.59 12.999 -20.067 12.788 QT
-20.543 12.577 -21.043 12.577 QT
-22.278 12.577 -23.262 13.241 QT
-24.246 13.906 -24.887 14.976 QT
-25.528 16.046 -25.856 17.249 QT
cp
f
GR
GS
[0.75 0 0 0.75 217.50016 288.50002] CT
0.149 GC
N
-13.807 22.874 M
-13.026 24.202 -10.666 24.202 QT
-9.651 24.202 -8.729 23.851 QT
-7.807 23.499 -7.205 22.812 QT
-6.604 22.124 -6.604 21.124 QT
-6.604 20.374 -7.143 19.898 QT
-7.682 19.421 -8.463 19.249 QT
-10.041 18.937 L
-11.104 18.671 -11.799 17.929 QT
-12.494 17.187 -12.494 16.14 QT
-12.494 14.859 -11.799 13.866 QT
-11.104 12.874 -9.955 12.351 QT
-8.807 11.827 -7.572 11.827 QT
-6.26 11.827 -5.213 12.452 QT
-4.166 13.077 -4.166 14.312 QT
-4.166 14.984 -4.541 15.491 QT
-4.916 15.999 -5.588 15.999 QT
-5.979 15.999 -6.252 15.749 QT
-6.526 15.499 -6.526 15.124 QT
-6.526 14.781 -6.33 14.46 QT
-6.135 14.14 -5.822 13.952 QT
-5.51 13.765 -5.166 13.765 QT
-5.416 13.14 -6.119 12.859 QT
-6.822 12.577 -7.635 12.577 QT
-8.369 12.577 -9.104 12.874 QT
-9.838 13.171 -10.283 13.741 QT
-10.729 14.312 -10.729 15.093 QT
-10.729 15.624 -10.362 16.015 QT
-9.994 16.406 -9.447 16.577 QT
-7.776 16.921 L
-6.963 17.093 -6.291 17.523 QT
-5.619 17.952 -5.229 18.616 QT
-4.838 19.281 -4.838 20.124 QT
-4.838 21.202 -5.44 22.249 QT
-6.041 23.296 -6.916 23.921 QT
-8.463 24.968 -10.697 24.968 QT
-12.244 24.968 -13.533 24.257 QT
-14.822 23.546 -14.822 22.14 QT
-14.822 21.359 -14.362 20.773 QT
-13.901 20.187 -13.104 20.187 QT
-12.635 20.187 -12.322 20.468 QT
-12.01 20.749 -12.01 21.218 QT
-12.01 21.874 -12.502 22.374 QT
-12.994 22.874 -13.666 22.874 QT
-13.807 22.874 L
cp
f
GR
GS
[0.75 0 0 0.75 217.50016 288.50002] CT
0.149 GC
N
2.474 24.968 M
0.646 24.968 -0.408 23.585 QT
-1.463 22.202 -1.463 20.327 QT
-1.463 18.468 -0.502 16.468 QT
0.459 14.468 2.092 13.148 QT
3.724 11.827 5.615 11.827 QT
6.474 11.827 7.154 12.296 QT
7.834 12.765 8.224 13.562 QT
8.537 12.406 9.49 12.406 QT
9.865 12.406 10.107 12.624 QT
10.349 12.843 10.349 13.218 QT
10.349 13.296 10.349 13.343 QT
10.349 13.39 10.334 13.437 QT
8.303 21.546 L
8.099 22.406 8.099 22.952 QT
8.099 24.202 8.943 24.202 QT
9.849 24.202 10.326 23.046 QT
10.803 21.89 11.115 20.374 QT
11.178 20.202 11.349 20.202 QT
11.709 20.202 L
11.818 20.202 11.888 20.304 QT
11.959 20.406 11.959 20.484 QT
11.443 22.515 10.842 23.741 QT
10.24 24.968 8.881 24.968 QT
7.912 24.968 7.162 24.39 QT
6.412 23.812 6.224 22.874 QT
4.349 24.968 2.474 24.968 QT
cp
2.49 24.202 M
3.553 24.202 4.529 23.413 QT
5.506 22.624 6.224 21.562 QT
6.256 21.546 6.256 21.484 QT
7.803 15.187 L
7.834 15.093 L
7.662 14.062 7.092 13.32 QT
6.521 12.577 5.537 12.577 QT
4.568 12.577 3.724 13.374 QT
2.881 14.171 2.303 15.265 QT
1.74 16.421 1.217 18.452 QT
0.693 20.484 0.693 21.593 QT
0.693 22.593 1.131 23.398 QT
1.568 24.202 2.49 24.202 QT
cp
f
GR
GS
[0.75 0 0 0.75 217.50016 288.50002] CT
0.149 GC
N
15.167 24.14 M
15.167 23.968 15.198 23.89 QT
17.37 15.234 L
17.573 14.437 17.573 13.827 QT
17.573 12.577 16.73 12.577 QT
15.823 12.577 15.386 13.663 QT
14.948 14.749 14.527 16.406 QT
14.527 16.484 14.448 16.531 QT
14.37 16.577 14.292 16.577 QT
13.948 16.577 L
13.855 16.577 13.784 16.476 QT
13.714 16.374 13.714 16.281 QT
14.027 15.031 14.316 14.148 QT
14.605 13.265 15.222 12.546 QT
15.839 11.827 16.761 11.827 QT
17.839 11.827 18.675 12.515 QT
19.511 13.202 19.511 14.265 QT
20.386 13.124 21.542 12.476 QT
22.698 11.827 24.011 11.827 QT
25.386 11.827 26.378 12.531 QT
27.37 13.234 27.37 14.515 QT
28.261 13.249 29.464 12.538 QT
30.667 11.827 32.073 11.827 QT
33.573 11.827 34.487 12.64 QT
35.402 13.452 35.402 14.952 QT
35.402 16.14 34.87 17.827 QT
34.339 19.515 33.558 21.593 QT
33.136 22.593 33.136 23.343 QT
33.136 24.202 33.823 24.202 QT
34.948 24.202 35.698 22.984 QT
36.448 21.765 36.761 20.374 QT
36.855 20.202 37.011 20.202 QT
37.339 20.202 L
37.464 20.202 37.542 20.281 QT
37.62 20.359 37.62 20.468 QT
37.62 20.484 37.589 20.546 QT
37.183 22.187 36.198 23.577 QT
35.214 24.968 33.745 24.968 QT
32.73 24.968 32.011 24.265 QT
31.292 23.562 31.292 22.562 QT
31.292 22.046 31.527 21.421 QT
32.339 19.249 32.886 17.531 QT
33.433 15.812 33.433 14.515 QT
33.433 13.702 33.112 13.14 QT
32.792 12.577 32.027 12.577 QT
30.433 12.577 29.277 13.546 QT
28.12 14.515 27.261 16.109 QT
27.214 16.406 27.183 16.562 QT
25.308 23.999 L
25.214 24.406 24.862 24.687 QT
24.511 24.968 24.089 24.968 QT
23.745 24.968 23.487 24.741 QT
23.23 24.515 23.23 24.14 QT
23.23 23.968 23.261 23.89 QT
25.105 16.499 L
25.402 15.312 25.402 14.515 QT
25.402 13.702 25.073 13.14 QT
24.745 12.577 23.948 12.577 QT
22.886 12.577 21.995 13.046 QT
21.105 13.515 20.441 14.281 QT
19.777 15.046 19.214 16.109 QT
17.245 23.999 L
17.152 24.406 16.808 24.687 QT
16.464 24.968 16.027 24.968 QT
15.683 24.968 15.425 24.741 QT
15.167 24.515 15.167 24.14 QT
cp
f
GR
GS
[0.75 0 0 0.75 217.50016 288.50002] CT
0.149 GC
N
37.969 30.265 M
37.703 30.265 37.703 29.89 QT
37.797 29.249 38.078 29.249 QT
38.985 29.249 39.344 29.093 QT
39.703 28.937 39.907 28.265 QT
43.172 15.202 L
43.391 14.671 43.391 13.827 QT
43.391 12.577 42.547 12.577 QT
41.641 12.577 41.196 13.663 QT
40.75 14.749 40.344 16.406 QT
40.344 16.577 40.11 16.577 QT
39.766 16.577 L
39.688 16.577 39.602 16.476 QT
39.516 16.374 39.516 16.281 QT
39.828 15.031 40.125 14.148 QT
40.422 13.265 41.032 12.546 QT
41.641 11.827 42.563 11.827 QT
43.563 11.827 44.313 12.382 QT
45.063 12.937 45.266 13.906 QT
46.063 12.984 47.024 12.406 QT
47.985 11.827 49.016 11.827 QT
50.235 11.827 51.133 12.476 QT
52.032 13.124 52.485 14.179 QT
52.938 15.234 52.938 16.452 QT
52.938 18.327 51.977 20.32 QT
51.016 22.312 49.383 23.64 QT
47.75 24.968 45.875 24.968 QT
45.032 24.968 44.344 24.484 QT
43.657 23.999 43.282 23.218 QT
41.953 28.374 L
41.891 28.796 41.875 28.874 QT
41.875 29.249 43.782 29.249 QT
44.078 29.249 44.078 29.624 QT
43.985 29.999 43.922 30.132 QT
43.86 30.265 43.594 30.265 QT
37.969 30.265 L
cp
45.907 24.202 M
46.922 24.202 47.782 23.374 QT
48.641 22.546 49.188 21.515 QT
49.578 20.734 49.922 19.609 QT
50.266 18.484 50.524 17.21 QT
50.782 15.937 50.782 15.187 QT
50.782 14.515 50.602 13.937 QT
50.422 13.359 50.024 12.968 QT
49.625 12.577 48.953 12.577 QT
47.891 12.577 46.953 13.335 QT
46.016 14.093 45.25 15.202 QT
45.25 15.312 L
43.641 21.702 L
43.844 22.749 44.407 23.476 QT
44.969 24.202 45.907 24.202 QT
cp
f
GR
GS
[0.75 0 0 0.75 217.50016 288.50002] CT
0.149 GC
N
54.727 22.296 M
54.727 22.202 54.743 22.031 QT
54.759 21.859 54.782 21.702 QT
54.806 21.546 54.806 21.452 QT
58.399 7.093 L
58.509 6.593 58.54 6.312 QT
58.54 5.843 56.665 5.843 QT
56.384 5.843 56.384 5.468 QT
56.399 5.39 56.446 5.21 QT
56.493 5.031 56.571 4.929 QT
56.649 4.827 56.79 4.827 QT
60.696 4.515 L
61.056 4.515 61.056 4.89 QT
56.868 21.562 L
56.665 22.031 56.665 22.952 QT
56.665 24.202 57.509 24.202 QT
58.399 24.202 58.845 23.093 QT
59.29 21.984 59.649 20.374 QT
59.712 20.202 59.884 20.202 QT
60.227 20.202 L
60.337 20.202 60.415 20.296 QT
60.493 20.39 60.493 20.484 QT
60.165 21.89 59.884 22.702 QT
59.602 23.515 58.993 24.241 QT
58.384 24.968 57.446 24.968 QT
56.29 24.968 55.509 24.218 QT
54.727 23.468 54.727 22.296 QT
cp
f
GR
GS
[0.75 0 0 0.75 217.50016 288.50002] CT
0.149 GC
N
68.604 24.968 M
67.229 24.968 66.182 24.241 QT
65.135 23.515 64.596 22.296 QT
64.057 21.077 64.057 19.718 QT
64.057 17.64 65.096 15.82 QT
66.135 13.999 67.916 12.913 QT
69.698 11.827 71.745 11.827 QT
72.979 11.827 73.909 12.468 QT
74.838 13.109 74.838 14.312 QT
74.838 15.984 73.51 16.796 QT
72.182 17.609 70.51 17.804 QT
68.838 17.999 66.807 17.999 QT
66.729 17.999 L
66.26 19.734 66.26 20.952 QT
66.26 22.249 66.854 23.226 QT
67.448 24.202 68.666 24.202 QT
70.401 24.202 71.987 23.406 QT
73.573 22.609 74.588 21.218 QT
74.666 21.124 74.807 21.124 QT
74.948 21.124 75.096 21.288 QT
75.245 21.452 75.245 21.593 QT
75.245 21.702 75.198 21.765 QT
74.135 23.249 72.338 24.109 QT
70.541 24.968 68.604 24.968 QT
cp
66.901 17.249 M
68.588 17.249 70.018 17.093 QT
71.448 16.937 72.604 16.304 QT
73.76 15.671 73.76 14.343 QT
73.76 13.812 73.463 13.406 QT
73.166 12.999 72.69 12.788 QT
72.213 12.577 71.713 12.577 QT
70.479 12.577 69.495 13.241 QT
68.51 13.906 67.87 14.976 QT
67.229 16.046 66.901 17.249 QT
cp
f
GR
GS
[0.75 0 0 0.75 0 0] CT
0.149 GC
2 setlinecap
1 LJ
0.667 LW
N
73 359 M
73 39 L
S
GR
GS
[0.75 0 0 0.75 0 0] CT
0.149 GC
2 setlinecap
1 LJ
0.667 LW
N
73 359 M
77.34 359 L
S
GR
GS
[0.75 0 0 0.75 0 0] CT
0.149 GC
2 setlinecap
1 LJ
0.667 LW
N
73 313.286 M
77.34 313.286 L
S
GR
GS
[0.75 0 0 0.75 0 0] CT
0.149 GC
2 setlinecap
1 LJ
0.667 LW
N
73 267.571 M
77.34 267.571 L
S
GR
GS
[0.75 0 0 0.75 0 0] CT
0.149 GC
2 setlinecap
1 LJ
0.667 LW
N
73 221.857 M
77.34 221.857 L
S
GR
GS
[0.75 0 0 0.75 0 0] CT
0.149 GC
2 setlinecap
1 LJ
0.667 LW
N
73 176.143 M
77.34 176.143 L
S
GR
GS
[0.75 0 0 0.75 0 0] CT
0.149 GC
2 setlinecap
1 LJ
0.667 LW
N
73 130.429 M
77.34 130.429 L
S
GR
GS
[0.75 0 0 0.75 0 0] CT
0.149 GC
2 setlinecap
1 LJ
0.667 LW
N
73 84.714 M
77.34 84.714 L
S
GR
GS
[0.75 0 0 0.75 0 0] CT
0.149 GC
2 setlinecap
1 LJ
0.667 LW
N
73 39 M
77.34 39 L
S
GR
GS
[0.75 0 0 0.75 50.75 269.25] CT
0.149 GC
/Helvetica 13.333 F
GS
[1 0 0 1 0 0] CT
-24 5.5 moveto 
1 -1 scale
(-0.6) t 
GR
GR
GS
[0.75 0 0 0.75 50.75 234.96428] CT
0.149 GC
/Helvetica 13.333 F
GS
[1 0 0 1 0 0] CT
-24 5.5 moveto 
1 -1 scale
(-0.4) t 
GR
GR
GS
[0.75 0 0 0.75 50.75 200.67858] CT
0.149 GC
/Helvetica 13.333 F
GS
[1 0 0 1 0 0] CT
-24 5.5 moveto 
1 -1 scale
(-0.2) t 
GR
GR
GS
[0.75 0 0 0.75 50.75 166.39286] CT
0.149 GC
/Helvetica 13.333 F
GS
[1 0 0 1 0 0] CT
-8 5.5 moveto 
1 -1 scale
(0) t 
GR
GR
GS
[0.75 0 0 0.75 50.75 132.10714] CT
0.149 GC
/Helvetica 13.333 F
GS
[1 0 0 1 0 0] CT
-19 5.5 moveto 
1 -1 scale
(0.2) t 
GR
GR
GS
[0.75 0 0 0.75 50.75 97.82143] CT
0.149 GC
/Helvetica 13.333 F
GS
[1 0 0 1 0 0] CT
-19 5.5 moveto 
1 -1 scale
(0.4) t 
GR
GR
GS
[0.75 0 0 0.75 50.75 63.53571] CT
0.149 GC
/Helvetica 13.333 F
GS
[1 0 0 1 0 0] CT
-19 5.5 moveto 
1 -1 scale
(0.6) t 
GR
GR
GS
[0.75 0 0 0.75 50.75 29.25] CT
0.149 GC
/Helvetica 13.333 F
GS
[1 0 0 1 0 0] CT
-19 5.5 moveto 
1 -1 scale
(0.8) t 
GR
GR
GS
[0 -0.75 0.75 0 29.75 149.24989] CT
0.149 GC
N
-52.554 -13.716 M
-52.554 -14.669 -52.304 -15.669 QT
-52.054 -16.669 -51.593 -17.888 QT
-51.132 -19.107 -50.788 -20.013 QT
-50.413 -21.076 -50.413 -21.763 QT
-50.413 -22.623 -51.038 -22.623 QT
-52.194 -22.623 -52.937 -21.443 QT
-53.679 -20.263 -54.038 -18.794 QT
-54.085 -18.623 -54.273 -18.623 QT
-54.616 -18.623 L
-54.851 -18.623 -54.851 -18.888 QT
-54.851 -18.966 L
-54.382 -20.701 -53.421 -22.037 QT
-52.46 -23.373 -50.991 -23.373 QT
-49.96 -23.373 -49.241 -22.693 QT
-48.523 -22.013 -48.523 -20.966 QT
-48.523 -20.435 -48.757 -19.841 QT
-48.898 -19.482 -49.351 -18.294 QT
-49.804 -17.107 -50.038 -16.326 QT
-50.273 -15.544 -50.429 -14.794 QT
-50.585 -14.044 -50.585 -13.294 QT
-50.585 -12.326 -50.179 -11.662 QT
-49.773 -10.998 -48.851 -10.998 QT
-46.991 -10.998 -45.585 -13.294 QT
-45.569 -13.404 -45.546 -13.513 QT
-45.523 -13.623 -45.507 -13.716 QT
-43.429 -22.123 L
-43.319 -22.513 -42.968 -22.787 QT
-42.616 -23.06 -42.21 -23.06 QT
-41.851 -23.06 -41.593 -22.834 QT
-41.335 -22.607 -41.335 -22.248 QT
-41.335 -22.076 -41.351 -22.013 QT
-43.46 -13.654 L
-43.648 -12.794 -43.648 -12.248 QT
-43.648 -10.998 -42.819 -10.998 QT
-41.882 -10.998 -41.421 -12.154 QT
-40.96 -13.31 -40.632 -14.826 QT
-40.585 -14.998 -40.413 -14.998 QT
-40.054 -14.998 L
-39.944 -14.998 -39.874 -14.896 QT
-39.804 -14.794 -39.804 -14.716 QT
-40.116 -13.466 -40.405 -12.576 QT
-40.694 -11.685 -41.319 -10.959 QT
-41.944 -10.232 -42.866 -10.232 QT
-43.788 -10.232 -44.523 -10.74 QT
-45.257 -11.248 -45.507 -12.107 QT
-46.179 -11.248 -47.054 -10.74 QT
-47.929 -10.232 -48.913 -10.232 QT
-50.569 -10.232 -51.562 -11.146 QT
-52.554 -12.06 -52.554 -13.716 QT
cp
f
GR
GS
[0 -0.75 0.75 0 29.75 149.24989] CT
0.149 GC
N
-37.074 -3.16 M
-36.637 -2.395 -35.543 -2.395 QT
-34.543 -2.395 -33.816 -3.09 QT
-33.09 -3.785 -32.645 -4.777 QT
-32.199 -5.77 -31.949 -6.801 QT
-32.887 -5.926 -33.965 -5.926 QT
-34.793 -5.926 -35.379 -6.215 QT
-35.965 -6.504 -36.293 -7.074 QT
-36.621 -7.645 -36.621 -8.441 QT
-36.621 -9.129 -36.434 -9.855 QT
-36.246 -10.582 -35.91 -11.465 QT
-35.574 -12.348 -35.34 -13.004 QT
-35.059 -13.785 -35.059 -14.27 QT
-35.059 -14.895 -35.512 -14.895 QT
-36.356 -14.895 -36.887 -14.043 QT
-37.418 -13.191 -37.684 -12.129 QT
-37.715 -11.988 -37.856 -11.988 QT
-38.106 -11.988 L
-38.277 -11.988 -38.277 -12.191 QT
-38.277 -12.254 L
-37.934 -13.504 -37.238 -14.473 QT
-36.543 -15.441 -35.481 -15.441 QT
-34.731 -15.441 -34.215 -14.949 QT
-33.699 -14.457 -33.699 -13.691 QT
-33.699 -13.301 -33.871 -12.879 QT
-33.965 -12.613 -34.293 -11.754 QT
-34.621 -10.895 -34.793 -10.332 QT
-34.965 -9.77 -35.074 -9.223 QT
-35.184 -8.676 -35.184 -8.145 QT
-35.184 -7.441 -34.887 -6.957 QT
-34.59 -6.473 -33.949 -6.473 QT
-32.652 -6.473 -31.606 -8.066 QT
-30.027 -14.535 L
-29.949 -14.816 -29.691 -15.012 QT
-29.434 -15.207 -29.137 -15.207 QT
-28.887 -15.207 -28.691 -15.043 QT
-28.496 -14.879 -28.496 -14.613 QT
-28.496 -14.504 -28.527 -14.457 QT
-30.606 -6.098 L
-30.887 -5.02 -31.621 -4.035 QT
-32.356 -3.051 -33.395 -2.449 QT
-34.434 -1.848 -35.574 -1.848 QT
-36.106 -1.848 -36.645 -2.059 QT
-37.184 -2.27 -37.512 -2.691 QT
-37.84 -3.113 -37.84 -3.676 QT
-37.84 -4.254 -37.496 -4.676 QT
-37.152 -5.098 -36.59 -5.098 QT
-36.262 -5.098 -36.027 -4.887 QT
-35.793 -4.676 -35.793 -4.332 QT
-35.793 -3.848 -36.152 -3.488 QT
-36.512 -3.129 -36.996 -3.129 QT
-37.012 -3.145 -37.035 -3.152 QT
-37.059 -3.16 -37.074 -3.16 QT
cp
f
GR
GS
[0 -0.75 0.75 0 29.75 149.24989] CT
0.149 GC
N
-23.148 -3.31 M
-23.148 -32.31 L
-19.179 -32.31 L
-19.179 -31.154 L
-21.976 -31.154 L
-21.976 -4.466 L
-19.179 -4.466 L
-19.179 -3.31 L
-23.148 -3.31 L
cp
f
GR
GS
[0 -0.75 0.75 0 29.75 149.24989] CT
0.149 GC
N
-16.187 -11.06 M
-16.187 -11.232 -16.156 -11.31 QT
-13.984 -19.966 L
-13.781 -20.763 -13.781 -21.373 QT
-13.781 -22.623 -14.624 -22.623 QT
-15.531 -22.623 -15.968 -21.537 QT
-16.406 -20.451 -16.828 -18.794 QT
-16.828 -18.716 -16.906 -18.669 QT
-16.984 -18.623 -17.062 -18.623 QT
-17.406 -18.623 L
-17.499 -18.623 -17.57 -18.724 QT
-17.64 -18.826 -17.64 -18.919 QT
-17.328 -20.169 -17.038 -21.052 QT
-16.749 -21.935 -16.132 -22.654 QT
-15.515 -23.373 -14.593 -23.373 QT
-13.515 -23.373 -12.679 -22.685 QT
-11.843 -21.998 -11.843 -20.935 QT
-10.968 -22.076 -9.812 -22.724 QT
-8.656 -23.373 -7.343 -23.373 QT
-5.968 -23.373 -4.976 -22.669 QT
-3.984 -21.966 -3.984 -20.685 QT
-3.093 -21.951 -1.89 -22.662 QT
-0.687 -23.373 0.719 -23.373 QT
2.219 -23.373 3.133 -22.56 QT
4.047 -21.748 4.047 -20.248 QT
4.047 -19.06 3.516 -17.373 QT
2.985 -15.685 2.204 -13.607 QT
1.782 -12.607 1.782 -11.857 QT
1.782 -10.998 2.469 -10.998 QT
3.594 -10.998 4.344 -12.216 QT
5.094 -13.435 5.407 -14.826 QT
5.501 -14.998 5.657 -14.998 QT
5.985 -14.998 L
6.11 -14.998 6.188 -14.919 QT
6.266 -14.841 6.266 -14.732 QT
6.266 -14.716 6.235 -14.654 QT
5.829 -13.013 4.844 -11.623 QT
3.86 -10.232 2.391 -10.232 QT
1.376 -10.232 0.657 -10.935 QT
-0.062 -11.638 -0.062 -12.638 QT
-0.062 -13.154 0.172 -13.779 QT
0.985 -15.951 1.532 -17.669 QT
2.079 -19.388 2.079 -20.685 QT
2.079 -21.498 1.758 -22.06 QT
1.438 -22.623 0.672 -22.623 QT
-0.921 -22.623 -2.078 -21.654 QT
-3.234 -20.685 -4.093 -19.091 QT
-4.14 -18.794 -4.171 -18.638 QT
-6.046 -11.201 L
-6.14 -10.794 -6.492 -10.513 QT
-6.843 -10.232 -7.265 -10.232 QT
-7.609 -10.232 -7.867 -10.459 QT
-8.124 -10.685 -8.124 -11.06 QT
-8.124 -11.232 -8.093 -11.31 QT
-6.249 -18.701 L
-5.953 -19.888 -5.953 -20.685 QT
-5.953 -21.498 -6.281 -22.06 QT
-6.609 -22.623 -7.406 -22.623 QT
-8.468 -22.623 -9.359 -22.154 QT
-10.249 -21.685 -10.913 -20.919 QT
-11.578 -20.154 -12.14 -19.091 QT
-14.109 -11.201 L
-14.203 -10.794 -14.546 -10.513 QT
-14.89 -10.232 -15.328 -10.232 QT
-15.671 -10.232 -15.929 -10.459 QT
-16.187 -10.685 -16.187 -11.06 QT
cp
f
GR
GS
[0 -0.75 0.75 0 29.75 149.24989] CT
0.149 GC
N
8.959 -3.888 M
8.959 -3.982 8.99 -3.998 QT
19.068 -31.951 L
19.131 -32.123 19.271 -32.216 QT
19.412 -32.31 19.599 -32.31 QT
19.849 -32.31 20.013 -32.154 QT
20.178 -31.998 20.178 -31.732 QT
20.178 -31.623 L
10.099 -3.669 L
9.928 -3.31 9.537 -3.31 QT
9.303 -3.31 9.131 -3.482 QT
8.959 -3.654 8.959 -3.888 QT
cp
f
GR
GS
[0 -0.75 0.75 0 29.75 149.24989] CT
0.149 GC
N
24.516 -12.326 M
25.297 -10.998 27.657 -10.998 QT
28.672 -10.998 29.594 -11.349 QT
30.516 -11.701 31.118 -12.388 QT
31.719 -13.076 31.719 -14.076 QT
31.719 -14.826 31.18 -15.302 QT
30.641 -15.779 29.86 -15.951 QT
28.282 -16.263 L
27.219 -16.529 26.524 -17.271 QT
25.829 -18.013 25.829 -19.06 QT
25.829 -20.341 26.524 -21.334 QT
27.219 -22.326 28.368 -22.849 QT
29.516 -23.373 30.75 -23.373 QT
32.063 -23.373 33.11 -22.748 QT
34.157 -22.123 34.157 -20.888 QT
34.157 -20.216 33.782 -19.709 QT
33.407 -19.201 32.735 -19.201 QT
32.344 -19.201 32.071 -19.451 QT
31.797 -19.701 31.797 -20.076 QT
31.797 -20.419 31.993 -20.74 QT
32.188 -21.06 32.5 -21.248 QT
32.813 -21.435 33.157 -21.435 QT
32.907 -22.06 32.204 -22.341 QT
31.5 -22.623 30.688 -22.623 QT
29.954 -22.623 29.219 -22.326 QT
28.485 -22.029 28.04 -21.459 QT
27.594 -20.888 27.594 -20.107 QT
27.594 -19.576 27.961 -19.185 QT
28.329 -18.794 28.875 -18.623 QT
30.547 -18.279 L
31.36 -18.107 32.032 -17.677 QT
32.704 -17.248 33.094 -16.584 QT
33.485 -15.919 33.485 -15.076 QT
33.485 -13.998 32.883 -12.951 QT
32.282 -11.904 31.407 -11.279 QT
29.86 -10.232 27.625 -10.232 QT
26.079 -10.232 24.79 -10.943 QT
23.5 -11.654 23.5 -13.06 QT
23.5 -13.841 23.961 -14.427 QT
24.422 -15.013 25.219 -15.013 QT
25.688 -15.013 26 -14.732 QT
26.313 -14.451 26.313 -13.982 QT
26.313 -13.326 25.821 -12.826 QT
25.329 -12.326 24.657 -12.326 QT
24.516 -12.326 L
cp
f
GR
GS
[0 -0.75 0.75 0 29.75 149.24989] CT
0.149 GC
N
36.797 -21.205 M
36.797 -21.767 L
36.797 -21.814 36.844 -21.877 QT
40.094 -25.486 L
40.844 -26.299 41.305 -26.838 QT
41.766 -27.377 42.211 -28.088 QT
42.657 -28.799 42.922 -29.525 QT
43.188 -30.252 43.188 -31.08 QT
43.188 -31.939 42.868 -32.728 QT
42.547 -33.517 41.915 -33.986 QT
41.282 -34.455 40.391 -34.455 QT
39.485 -34.455 38.758 -33.908 QT
38.032 -33.361 37.735 -32.486 QT
37.813 -32.502 37.954 -32.502 QT
38.422 -32.502 38.758 -32.189 QT
39.094 -31.877 39.094 -31.361 QT
39.094 -30.892 38.758 -30.557 QT
38.422 -30.221 37.954 -30.221 QT
37.469 -30.221 37.133 -30.564 QT
36.797 -30.908 36.797 -31.361 QT
36.797 -32.158 37.094 -32.846 QT
37.391 -33.533 37.954 -34.072 QT
38.516 -34.611 39.211 -34.9 QT
39.907 -35.189 40.704 -35.189 QT
41.907 -35.189 42.938 -34.682 QT
43.969 -34.174 44.579 -33.244 QT
45.188 -32.314 45.188 -31.08 QT
45.188 -30.174 44.79 -29.353 QT
44.391 -28.533 43.766 -27.861 QT
43.141 -27.189 42.165 -26.338 QT
41.188 -25.486 40.875 -25.189 QT
38.5 -22.908 L
40.516 -22.908 L
42 -22.908 43 -22.932 QT
44 -22.955 44.063 -23.017 QT
44.313 -23.283 44.563 -24.955 QT
45.188 -24.955 L
44.594 -21.205 L
36.797 -21.205 L
cp
f
GR
GS
[0 -0.75 0.75 0 29.75 149.24989] CT
0.149 GC
N
48.124 -3.31 M
48.124 -4.466 L
50.937 -4.466 L
50.937 -31.154 L
48.124 -31.154 L
48.124 -32.31 L
52.093 -32.31 L
52.093 -3.31 L
48.124 -3.31 L
cp
f
GR
GS
[0.75 0 0 0.75 217.50021 25.49999] CT
N
-149.802 -9.6 M
-149.802 -10.553 L
-147.021 -10.553 -147.021 -11.413 QT
-147.021 -26.241 L
-147.021 -27.1 -149.802 -27.1 QT
-149.802 -28.038 L
-141.052 -28.038 L
-141.052 -27.1 L
-144.505 -27.1 -144.505 -26.241 QT
-144.505 -11.413 L
-144.505 -10.819 -144.169 -10.686 QT
-143.833 -10.553 -143.13 -10.553 QT
-141.052 -10.553 L
-139.021 -10.553 -137.927 -11.288 QT
-136.833 -12.022 -136.38 -13.295 QT
-135.927 -14.569 -135.692 -16.678 QT
-134.911 -16.678 L
-135.661 -9.6 L
-149.802 -9.6 L
cp
f
GR
GS
[0.75 0 0 0.75 217.50021 25.49999] CT
N
-132.885 -12.256 M
-132.885 -13.866 -131.619 -14.874 QT
-130.354 -15.881 -128.58 -16.295 QT
-126.807 -16.709 -125.213 -16.709 QT
-125.213 -17.819 L
-125.213 -18.584 -125.557 -19.319 QT
-125.901 -20.053 -126.541 -20.522 QT
-127.182 -20.991 -127.963 -20.991 QT
-129.76 -20.991 -130.698 -20.194 QT
-130.182 -20.194 -129.846 -19.803 QT
-129.51 -19.413 -129.51 -18.897 QT
-129.51 -18.35 -129.893 -17.967 QT
-130.276 -17.584 -130.791 -17.584 QT
-131.338 -17.584 -131.721 -17.967 QT
-132.104 -18.35 -132.104 -18.897 QT
-132.104 -20.319 -130.815 -21.014 QT
-129.526 -21.709 -127.963 -21.709 QT
-126.869 -21.709 -125.76 -21.241 QT
-124.651 -20.772 -123.948 -19.897 QT
-123.244 -19.022 -123.244 -17.866 QT
-123.244 -11.788 L
-123.244 -11.256 -123.018 -10.819 QT
-122.791 -10.381 -122.323 -10.381 QT
-121.869 -10.381 -121.651 -10.827 QT
-121.432 -11.272 -121.432 -11.788 QT
-121.432 -13.522 L
-120.651 -13.522 L
-120.651 -11.788 L
-120.651 -11.178 -120.963 -10.631 QT
-121.276 -10.084 -121.815 -9.764 QT
-122.354 -9.444 -122.963 -9.444 QT
-123.76 -9.444 -124.33 -10.053 QT
-124.901 -10.663 -124.979 -11.506 QT
-125.479 -10.491 -126.448 -9.897 QT
-127.416 -9.303 -128.526 -9.303 QT
-129.557 -9.303 -130.557 -9.6 QT
-131.557 -9.897 -132.221 -10.553 QT
-132.885 -11.209 -132.885 -12.256 QT
cp
-130.698 -12.256 M
-130.698 -11.303 -129.994 -10.655 QT
-129.291 -10.006 -128.354 -10.006 QT
-127.479 -10.006 -126.768 -10.444 QT
-126.057 -10.881 -125.635 -11.631 QT
-125.213 -12.381 -125.213 -13.209 QT
-125.213 -16.022 L
-126.432 -16.022 -127.721 -15.616 QT
-129.01 -15.209 -129.854 -14.358 QT
-130.698 -13.506 -130.698 -12.256 QT
cp
f
GR
GS
[0.75 0 0 0.75 217.50021 25.49999] CT
N
-117.88 -12.85 M
-117.88 -20.288 L
-120.114 -20.288 L
-120.114 -20.991 L
-118.349 -20.991 -117.52 -22.639 QT
-116.692 -24.288 -116.692 -26.209 QT
-115.911 -26.209 L
-115.911 -21.241 L
-112.099 -21.241 L
-112.099 -20.288 L
-115.911 -20.288 L
-115.911 -12.897 L
-115.911 -11.772 -115.536 -10.928 QT
-115.161 -10.084 -114.177 -10.084 QT
-113.255 -10.084 -112.849 -10.975 QT
-112.442 -11.866 -112.442 -12.897 QT
-112.442 -14.491 L
-111.661 -14.491 L
-111.661 -12.85 L
-111.661 -12.006 -111.974 -11.178 QT
-112.286 -10.35 -112.895 -9.827 QT
-113.505 -9.303 -114.364 -9.303 QT
-115.989 -9.303 -116.935 -10.272 QT
-117.88 -11.241 -117.88 -12.85 QT
cp
f
GR
GS
[0.75 0 0 0.75 217.50021 25.49999] CT
N
-103.541 -9.303 M
-105.181 -9.303 -106.556 -10.163 QT
-107.931 -11.022 -108.72 -12.467 QT
-109.509 -13.913 -109.509 -15.522 QT
-109.509 -17.1 -108.791 -18.522 QT
-108.072 -19.944 -106.783 -20.827 QT
-105.494 -21.709 -103.916 -21.709 QT
-102.681 -21.709 -101.767 -21.288 QT
-100.853 -20.866 -100.259 -20.131 QT
-99.666 -19.397 -99.361 -18.397 QT
-99.056 -17.397 -99.056 -16.194 QT
-99.056 -15.834 -99.338 -15.834 QT
-107.15 -15.834 L
-107.15 -15.553 L
-107.15 -13.303 -106.244 -11.694 QT
-105.338 -10.084 -103.291 -10.084 QT
-102.463 -10.084 -101.759 -10.452 QT
-101.056 -10.819 -100.533 -11.483 QT
-100.009 -12.147 -99.838 -12.897 QT
-99.806 -12.991 -99.736 -13.061 QT
-99.666 -13.131 -99.572 -13.131 QT
-99.338 -13.131 L
-99.056 -13.131 -99.056 -12.788 QT
-99.431 -11.256 -100.697 -10.28 QT
-101.963 -9.303 -103.541 -9.303 QT
cp
-107.119 -16.506 M
-100.963 -16.506 L
-100.963 -17.522 -101.244 -18.561 QT
-101.525 -19.6 -102.189 -20.295 QT
-102.853 -20.991 -103.916 -20.991 QT
-105.447 -20.991 -106.283 -19.561 QT
-107.119 -18.131 -107.119 -16.506 QT
cp
f
GR
GS
[0.75 0 0 0.75 217.50021 25.49999] CT
N
-97.704 -9.6 M
-97.704 -10.553 L
-96.783 -10.553 -96.189 -10.694 QT
-95.595 -10.834 -95.595 -11.413 QT
-95.595 -18.772 L
-95.595 -19.506 -95.814 -19.827 QT
-96.033 -20.147 -96.439 -20.217 QT
-96.845 -20.288 -97.704 -20.288 QT
-97.704 -21.241 L
-93.845 -21.538 L
-93.845 -18.897 L
-93.408 -20.069 -92.603 -20.803 QT
-91.798 -21.538 -90.658 -21.538 QT
-89.845 -21.538 -89.212 -21.061 QT
-88.579 -20.584 -88.579 -19.803 QT
-88.579 -19.319 -88.931 -18.952 QT
-89.283 -18.584 -89.798 -18.584 QT
-90.298 -18.584 -90.658 -18.944 QT
-91.017 -19.303 -91.017 -19.803 QT
-91.017 -20.522 -90.501 -20.834 QT
-90.658 -20.834 L
-91.751 -20.834 -92.439 -20.045 QT
-93.126 -19.256 -93.423 -18.077 QT
-93.72 -16.897 -93.72 -15.834 QT
-93.72 -11.413 L
-93.72 -10.553 -91.095 -10.553 QT
-91.095 -9.6 L
-97.704 -9.6 L
cp
f
GR
GS
[0.75 0 0 0.75 217.50021 25.49999] CT
N
-86.885 -12.256 M
-86.885 -13.866 -85.619 -14.874 QT
-84.354 -15.881 -82.58 -16.295 QT
-80.807 -16.709 -79.213 -16.709 QT
-79.213 -17.819 L
-79.213 -18.584 -79.557 -19.319 QT
-79.901 -20.053 -80.541 -20.522 QT
-81.182 -20.991 -81.963 -20.991 QT
-83.76 -20.991 -84.698 -20.194 QT
-84.182 -20.194 -83.846 -19.803 QT
-83.51 -19.413 -83.51 -18.897 QT
-83.51 -18.35 -83.893 -17.967 QT
-84.276 -17.584 -84.791 -17.584 QT
-85.338 -17.584 -85.721 -17.967 QT
-86.104 -18.35 -86.104 -18.897 QT
-86.104 -20.319 -84.815 -21.014 QT
-83.526 -21.709 -81.963 -21.709 QT
-80.869 -21.709 -79.76 -21.241 QT
-78.651 -20.772 -77.948 -19.897 QT
-77.244 -19.022 -77.244 -17.866 QT
-77.244 -11.788 L
-77.244 -11.256 -77.018 -10.819 QT
-76.791 -10.381 -76.323 -10.381 QT
-75.869 -10.381 -75.651 -10.827 QT
-75.432 -11.272 -75.432 -11.788 QT
-75.432 -13.522 L
-74.651 -13.522 L
-74.651 -11.788 L
-74.651 -11.178 -74.963 -10.631 QT
-75.276 -10.084 -75.815 -9.764 QT
-76.354 -9.444 -76.963 -9.444 QT
-77.76 -9.444 -78.33 -10.053 QT
-78.901 -10.663 -78.979 -11.506 QT
-79.479 -10.491 -80.448 -9.897 QT
-81.416 -9.303 -82.526 -9.303 QT
-83.557 -9.303 -84.557 -9.6 QT
-85.557 -9.897 -86.221 -10.553 QT
-86.885 -11.209 -86.885 -12.256 QT
cp
-84.698 -12.256 M
-84.698 -11.303 -83.994 -10.655 QT
-83.291 -10.006 -82.354 -10.006 QT
-81.479 -10.006 -80.768 -10.444 QT
-80.057 -10.881 -79.635 -11.631 QT
-79.213 -12.381 -79.213 -13.209 QT
-79.213 -16.022 L
-80.432 -16.022 -81.721 -15.616 QT
-83.01 -15.209 -83.854 -14.358 QT
-84.698 -13.506 -84.698 -12.256 QT
cp
f
GR
GS
[0.75 0 0 0.75 217.50021 25.49999] CT
N
-73.802 -9.6 M
-73.802 -10.553 L
-72.88 -10.553 -72.286 -10.694 QT
-71.692 -10.834 -71.692 -11.413 QT
-71.692 -25.584 L
-71.692 -26.303 -71.911 -26.624 QT
-72.13 -26.944 -72.536 -27.022 QT
-72.942 -27.1 -73.802 -27.1 QT
-73.802 -28.038 L
-69.786 -28.334 L
-69.786 -11.413 L
-69.786 -10.834 -69.192 -10.694 QT
-68.599 -10.553 -67.692 -10.553 QT
-67.692 -9.6 L
-73.802 -9.6 L
cp
f
GR
GS
[0.75 0 0 0.75 217.50021 25.49999] CT
N
-57.255 -12.256 M
-57.255 -13.866 -55.99 -14.874 QT
-54.724 -15.881 -52.951 -16.295 QT
-51.177 -16.709 -49.583 -16.709 QT
-49.583 -17.819 L
-49.583 -18.584 -49.927 -19.319 QT
-50.271 -20.053 -50.912 -20.522 QT
-51.552 -20.991 -52.333 -20.991 QT
-54.13 -20.991 -55.068 -20.194 QT
-54.552 -20.194 -54.216 -19.803 QT
-53.88 -19.413 -53.88 -18.897 QT
-53.88 -18.35 -54.263 -17.967 QT
-54.646 -17.584 -55.162 -17.584 QT
-55.708 -17.584 -56.091 -17.967 QT
-56.474 -18.35 -56.474 -18.897 QT
-56.474 -20.319 -55.185 -21.014 QT
-53.896 -21.709 -52.333 -21.709 QT
-51.24 -21.709 -50.13 -21.241 QT
-49.021 -20.772 -48.318 -19.897 QT
-47.615 -19.022 -47.615 -17.866 QT
-47.615 -11.788 L
-47.615 -11.256 -47.388 -10.819 QT
-47.162 -10.381 -46.693 -10.381 QT
-46.24 -10.381 -46.021 -10.827 QT
-45.802 -11.272 -45.802 -11.788 QT
-45.802 -13.522 L
-45.021 -13.522 L
-45.021 -11.788 L
-45.021 -11.178 -45.333 -10.631 QT
-45.646 -10.084 -46.185 -9.764 QT
-46.724 -9.444 -47.333 -9.444 QT
-48.13 -9.444 -48.701 -10.053 QT
-49.271 -10.663 -49.349 -11.506 QT
-49.849 -10.491 -50.818 -9.897 QT
-51.787 -9.303 -52.896 -9.303 QT
-53.927 -9.303 -54.927 -9.6 QT
-55.927 -9.897 -56.591 -10.553 QT
-57.255 -11.209 -57.255 -12.256 QT
cp
-55.068 -12.256 M
-55.068 -11.303 -54.365 -10.655 QT
-53.662 -10.006 -52.724 -10.006 QT
-51.849 -10.006 -51.138 -10.444 QT
-50.427 -10.881 -50.005 -11.631 QT
-49.583 -12.381 -49.583 -13.209 QT
-49.583 -16.022 L
-50.802 -16.022 -52.091 -15.616 QT
-53.38 -15.209 -54.224 -14.358 QT
-55.068 -13.506 -55.068 -12.256 QT
cp
f
GR
GS
[0.75 0 0 0.75 217.50021 25.49999] CT
N
-38.281 -9.303 M
-39.906 -9.303 -41.242 -10.147 QT
-42.578 -10.991 -43.344 -12.413 QT
-44.109 -13.834 -44.109 -15.428 QT
-44.109 -17.022 -43.352 -18.483 QT
-42.594 -19.944 -41.25 -20.827 QT
-39.906 -21.709 -38.281 -21.709 QT
-36.688 -21.709 -35.391 -21.084 QT
-34.094 -20.459 -34.094 -19.053 QT
-34.094 -18.522 -34.469 -18.131 QT
-34.844 -17.741 -35.391 -17.741 QT
-35.922 -17.741 -36.305 -18.131 QT
-36.688 -18.522 -36.688 -19.053 QT
-36.688 -19.522 -36.383 -19.874 QT
-36.078 -20.225 -35.625 -20.319 QT
-36.563 -20.913 -38.25 -20.913 QT
-39.547 -20.913 -40.336 -20.053 QT
-41.125 -19.194 -41.438 -17.928 QT
-41.75 -16.663 -41.75 -15.428 QT
-41.75 -14.116 -41.367 -12.897 QT
-40.984 -11.678 -40.117 -10.881 QT
-39.25 -10.084 -37.953 -10.084 QT
-36.672 -10.084 -35.774 -10.874 QT
-34.875 -11.663 -34.547 -12.928 QT
-34.547 -13.084 -34.328 -13.084 QT
-34 -13.084 L
-33.922 -13.084 -33.859 -13.006 QT
-33.797 -12.928 -33.797 -12.85 QT
-33.797 -12.772 L
-34.203 -11.163 -35.414 -10.233 QT
-36.625 -9.303 -38.281 -9.303 QT
cp
f
GR
GS
[0.75 0 0 0.75 217.50021 25.49999] CT
N
-26.429 -9.303 M
-28.054 -9.303 -29.39 -10.147 QT
-30.726 -10.991 -31.492 -12.413 QT
-32.258 -13.834 -32.258 -15.428 QT
-32.258 -17.022 -31.5 -18.483 QT
-30.742 -19.944 -29.398 -20.827 QT
-28.054 -21.709 -26.429 -21.709 QT
-24.836 -21.709 -23.539 -21.084 QT
-22.242 -20.459 -22.242 -19.053 QT
-22.242 -18.522 -22.617 -18.131 QT
-22.992 -17.741 -23.539 -17.741 QT
-24.07 -17.741 -24.453 -18.131 QT
-24.836 -18.522 -24.836 -19.053 QT
-24.836 -19.522 -24.531 -19.874 QT
-24.226 -20.225 -23.773 -20.319 QT
-24.711 -20.913 -26.398 -20.913 QT
-27.695 -20.913 -28.484 -20.053 QT
-29.273 -19.194 -29.586 -17.928 QT
-29.898 -16.663 -29.898 -15.428 QT
-29.898 -14.116 -29.515 -12.897 QT
-29.133 -11.678 -28.265 -10.881 QT
-27.398 -10.084 -26.101 -10.084 QT
-24.82 -10.084 -23.922 -10.874 QT
-23.023 -11.663 -22.695 -12.928 QT
-22.695 -13.084 -22.476 -13.084 QT
-22.148 -13.084 L
-22.07 -13.084 -22.008 -13.006 QT
-21.945 -12.928 -21.945 -12.85 QT
-21.945 -12.772 L
-22.351 -11.163 -23.562 -10.233 QT
-24.773 -9.303 -26.429 -9.303 QT
cp
f
GR
GS
[0.75 0 0 0.75 217.50021 25.49999] CT
N
-14.578 -9.303 M
-16.218 -9.303 -17.593 -10.163 QT
-18.968 -11.022 -19.757 -12.467 QT
-20.546 -13.913 -20.546 -15.522 QT
-20.546 -17.1 -19.828 -18.522 QT
-19.109 -19.944 -17.82 -20.827 QT
-16.531 -21.709 -14.953 -21.709 QT
-13.718 -21.709 -12.804 -21.288 QT
-11.89 -20.866 -11.296 -20.131 QT
-10.703 -19.397 -10.398 -18.397 QT
-10.093 -17.397 -10.093 -16.194 QT
-10.093 -15.834 -10.375 -15.834 QT
-18.187 -15.834 L
-18.187 -15.553 L
-18.187 -13.303 -17.281 -11.694 QT
-16.375 -10.084 -14.328 -10.084 QT
-13.5 -10.084 -12.796 -10.452 QT
-12.093 -10.819 -11.57 -11.483 QT
-11.046 -12.147 -10.875 -12.897 QT
-10.843 -12.991 -10.773 -13.061 QT
-10.703 -13.131 -10.609 -13.131 QT
-10.375 -13.131 L
-10.093 -13.131 -10.093 -12.788 QT
-10.468 -11.256 -11.734 -10.28 QT
-13 -9.303 -14.578 -9.303 QT
cp
-18.156 -16.506 M
-12 -16.506 L
-12 -17.522 -12.281 -18.561 QT
-12.562 -19.6 -13.226 -20.295 QT
-13.89 -20.991 -14.953 -20.991 QT
-16.484 -20.991 -17.32 -19.561 QT
-18.156 -18.131 -18.156 -16.506 QT
cp
f
GR
GS
[0.75 0 0 0.75 217.50021 25.49999] CT
N
-8.616 -9.6 M
-8.616 -10.553 L
-7.695 -10.553 -7.101 -10.694 QT
-6.507 -10.834 -6.507 -11.413 QT
-6.507 -25.584 L
-6.507 -26.303 -6.726 -26.624 QT
-6.945 -26.944 -7.351 -27.022 QT
-7.757 -27.1 -8.616 -27.1 QT
-8.616 -28.038 L
-4.601 -28.334 L
-4.601 -11.413 L
-4.601 -10.834 -4.007 -10.694 QT
-3.413 -10.553 -2.507 -10.553 QT
-2.507 -9.6 L
-8.616 -9.6 L
cp
f
GR
GS
[0.75 0 0 0.75 217.50021 25.49999] CT
N
4.682 -9.303 M
3.041 -9.303 1.666 -10.163 QT
0.291 -11.022 -0.498 -12.467 QT
-1.287 -13.913 -1.287 -15.522 QT
-1.287 -17.1 -0.568 -18.522 QT
0.15 -19.944 1.439 -20.827 QT
2.729 -21.709 4.307 -21.709 QT
5.541 -21.709 6.455 -21.288 QT
7.369 -20.866 7.963 -20.131 QT
8.557 -19.397 8.861 -18.397 QT
9.166 -17.397 9.166 -16.194 QT
9.166 -15.834 8.885 -15.834 QT
1.072 -15.834 L
1.072 -15.553 L
1.072 -13.303 1.979 -11.694 QT
2.885 -10.084 4.932 -10.084 QT
5.76 -10.084 6.463 -10.452 QT
7.166 -10.819 7.689 -11.483 QT
8.213 -12.147 8.385 -12.897 QT
8.416 -12.991 8.486 -13.061 QT
8.557 -13.131 8.65 -13.131 QT
8.885 -13.131 L
9.166 -13.131 9.166 -12.788 QT
8.791 -11.256 7.525 -10.28 QT
6.26 -9.303 4.682 -9.303 QT
cp
1.104 -16.506 M
7.26 -16.506 L
7.26 -17.522 6.979 -18.561 QT
6.697 -19.6 6.033 -20.295 QT
5.369 -20.991 4.307 -20.991 QT
2.775 -20.991 1.939 -19.561 QT
1.104 -18.131 1.104 -16.506 QT
cp
f
GR
GS
[0.75 0 0 0.75 217.50021 25.49999] CT
N
10.518 -9.6 M
10.518 -10.553 L
11.44 -10.553 12.033 -10.694 QT
12.627 -10.834 12.627 -11.413 QT
12.627 -18.772 L
12.627 -19.506 12.408 -19.827 QT
12.19 -20.147 11.783 -20.217 QT
11.377 -20.288 10.518 -20.288 QT
10.518 -21.241 L
14.377 -21.538 L
14.377 -18.897 L
14.815 -20.069 15.619 -20.803 QT
16.424 -21.538 17.565 -21.538 QT
18.377 -21.538 19.01 -21.061 QT
19.643 -20.584 19.643 -19.803 QT
19.643 -19.319 19.291 -18.952 QT
18.94 -18.584 18.424 -18.584 QT
17.924 -18.584 17.565 -18.944 QT
17.205 -19.303 17.205 -19.803 QT
17.205 -20.522 17.721 -20.834 QT
17.565 -20.834 L
16.471 -20.834 15.783 -20.045 QT
15.096 -19.256 14.799 -18.077 QT
14.502 -16.897 14.502 -15.834 QT
14.502 -11.413 L
14.502 -10.553 17.127 -10.553 QT
17.127 -9.6 L
10.518 -9.6 L
cp
f
GR
GS
[0.75 0 0 0.75 217.50021 25.49999] CT
N
21.337 -12.256 M
21.337 -13.866 22.603 -14.874 QT
23.869 -15.881 25.642 -16.295 QT
27.415 -16.709 29.009 -16.709 QT
29.009 -17.819 L
29.009 -18.584 28.665 -19.319 QT
28.322 -20.053 27.681 -20.522 QT
27.04 -20.991 26.259 -20.991 QT
24.462 -20.991 23.525 -20.194 QT
24.04 -20.194 24.376 -19.803 QT
24.712 -19.413 24.712 -18.897 QT
24.712 -18.35 24.33 -17.967 QT
23.947 -17.584 23.431 -17.584 QT
22.884 -17.584 22.501 -17.967 QT
22.119 -18.35 22.119 -18.897 QT
22.119 -20.319 23.408 -21.014 QT
24.697 -21.709 26.259 -21.709 QT
27.353 -21.709 28.462 -21.241 QT
29.572 -20.772 30.275 -19.897 QT
30.978 -19.022 30.978 -17.866 QT
30.978 -11.788 L
30.978 -11.256 31.205 -10.819 QT
31.431 -10.381 31.9 -10.381 QT
32.353 -10.381 32.572 -10.827 QT
32.79 -11.272 32.79 -11.788 QT
32.79 -13.522 L
33.572 -13.522 L
33.572 -11.788 L
33.572 -11.178 33.259 -10.631 QT
32.947 -10.084 32.408 -9.764 QT
31.869 -9.444 31.259 -9.444 QT
30.462 -9.444 29.892 -10.053 QT
29.322 -10.663 29.244 -11.506 QT
28.744 -10.491 27.775 -9.897 QT
26.806 -9.303 25.697 -9.303 QT
24.665 -9.303 23.665 -9.6 QT
22.665 -9.897 22.001 -10.553 QT
21.337 -11.209 21.337 -12.256 QT
cp
23.525 -12.256 M
23.525 -11.303 24.228 -10.655 QT
24.931 -10.006 25.869 -10.006 QT
26.744 -10.006 27.455 -10.444 QT
28.165 -10.881 28.587 -11.631 QT
29.009 -12.381 29.009 -13.209 QT
29.009 -16.022 L
27.79 -16.022 26.501 -15.616 QT
25.212 -15.209 24.369 -14.358 QT
23.525 -13.506 23.525 -12.256 QT
cp
f
GR
GS
[0.75 0 0 0.75 217.50021 25.49999] CT
N
36.343 -12.85 M
36.343 -20.288 L
34.108 -20.288 L
34.108 -20.991 L
35.874 -20.991 36.702 -22.639 QT
37.53 -24.288 37.53 -26.209 QT
38.311 -26.209 L
38.311 -21.241 L
42.124 -21.241 L
42.124 -20.288 L
38.311 -20.288 L
38.311 -12.897 L
38.311 -11.772 38.686 -10.928 QT
39.061 -10.084 40.046 -10.084 QT
40.968 -10.084 41.374 -10.975 QT
41.78 -11.866 41.78 -12.897 QT
41.78 -14.491 L
42.561 -14.491 L
42.561 -12.85 L
42.561 -12.006 42.249 -11.178 QT
41.936 -10.35 41.327 -9.827 QT
40.718 -9.303 39.858 -9.303 QT
38.233 -9.303 37.288 -10.272 QT
36.343 -11.241 36.343 -12.85 QT
cp
f
GR
GS
[0.75 0 0 0.75 217.50021 25.49999] CT
N
44.791 -9.6 M
44.791 -10.553 L
45.713 -10.553 46.307 -10.694 QT
46.9 -10.834 46.9 -11.413 QT
46.9 -18.772 L
46.9 -19.819 46.502 -20.053 QT
46.104 -20.288 44.916 -20.288 QT
44.916 -21.241 L
48.807 -21.538 L
48.807 -11.413 L
48.807 -10.834 49.315 -10.694 QT
49.822 -10.553 50.682 -10.553 QT
50.682 -9.6 L
44.791 -9.6 L
cp
45.947 -26.178 M
45.947 -26.772 46.393 -27.217 QT
46.838 -27.663 47.416 -27.663 QT
47.807 -27.663 48.158 -27.467 QT
48.51 -27.272 48.705 -26.913 QT
48.9 -26.553 48.9 -26.178 QT
48.9 -25.584 48.455 -25.139 QT
48.01 -24.694 47.416 -24.694 QT
46.838 -24.694 46.393 -25.139 QT
45.947 -25.584 45.947 -26.178 QT
cp
f
GR
GS
[0.75 0 0 0.75 217.50021 25.49999] CT
N
58.12 -9.303 M
56.495 -9.303 55.113 -10.124 QT
53.73 -10.944 52.925 -12.327 QT
52.12 -13.709 52.12 -15.35 QT
52.12 -16.584 52.566 -17.733 QT
53.011 -18.881 53.831 -19.788 QT
54.652 -20.694 55.745 -21.202 QT
56.839 -21.709 58.12 -21.709 QT
59.777 -21.709 61.144 -20.827 QT
62.511 -19.944 63.3 -18.475 QT
64.089 -17.006 64.089 -15.35 QT
64.089 -13.725 63.284 -12.334 QT
62.48 -10.944 61.105 -10.124 QT
59.73 -9.303 58.12 -9.303 QT
cp
58.12 -10.084 M
60.277 -10.084 61.003 -11.655 QT
61.73 -13.225 61.73 -15.647 QT
61.73 -17.006 61.589 -17.897 QT
61.449 -18.788 60.949 -19.522 QT
60.652 -19.959 60.183 -20.295 QT
59.714 -20.631 59.191 -20.811 QT
58.667 -20.991 58.12 -20.991 QT
57.277 -20.991 56.519 -20.608 QT
55.761 -20.225 55.261 -19.522 QT
54.761 -18.756 54.62 -17.834 QT
54.48 -16.913 54.48 -15.647 QT
54.48 -14.131 54.745 -12.928 QT
55.011 -11.725 55.808 -10.905 QT
56.605 -10.084 58.12 -10.084 QT
cp
f
GR
GS
[0.75 0 0 0.75 217.50021 25.49999] CT
N
65.501 -9.6 M
65.501 -10.553 L
66.438 -10.553 67.024 -10.694 QT
67.61 -10.834 67.61 -11.413 QT
67.61 -18.772 L
67.61 -19.506 67.399 -19.827 QT
67.188 -20.147 66.774 -20.217 QT
66.36 -20.288 65.501 -20.288 QT
65.501 -21.241 L
69.423 -21.538 L
69.423 -18.897 L
69.969 -20.053 71.032 -20.795 QT
72.094 -21.538 73.344 -21.538 QT
75.204 -21.538 76.149 -20.639 QT
77.094 -19.741 77.094 -17.897 QT
77.094 -11.413 L
77.094 -10.834 77.688 -10.694 QT
78.282 -10.553 79.204 -10.553 QT
79.204 -9.6 L
73.016 -9.6 L
73.016 -10.553 L
73.938 -10.553 74.532 -10.694 QT
75.126 -10.834 75.126 -11.413 QT
75.126 -17.819 L
75.126 -19.131 74.743 -19.983 QT
74.36 -20.834 73.188 -20.834 QT
71.61 -20.834 70.602 -19.584 QT
69.594 -18.334 69.594 -16.725 QT
69.594 -11.413 L
69.594 -10.834 70.188 -10.694 QT
70.782 -10.553 71.688 -10.553 QT
71.688 -9.6 L
65.501 -9.6 L
cp
f
GR
GS
[0.75 0 0 0.75 217.50021 25.49999] CT
N
89.236 -9.6 M
89.236 -10.553 L
90.158 -10.553 90.751 -10.694 QT
91.345 -10.834 91.345 -11.413 QT
91.345 -18.772 L
91.345 -19.819 90.947 -20.053 QT
90.548 -20.288 89.361 -20.288 QT
89.361 -21.241 L
93.251 -21.538 L
93.251 -11.413 L
93.251 -10.834 93.759 -10.694 QT
94.267 -10.553 95.126 -10.553 QT
95.126 -9.6 L
89.236 -9.6 L
cp
90.392 -26.178 M
90.392 -26.772 90.837 -27.217 QT
91.283 -27.663 91.861 -27.663 QT
92.251 -27.663 92.603 -27.467 QT
92.954 -27.272 93.15 -26.913 QT
93.345 -26.553 93.345 -26.178 QT
93.345 -25.584 92.9 -25.139 QT
92.454 -24.694 91.861 -24.694 QT
91.283 -24.694 90.837 -25.139 QT
90.392 -25.584 90.392 -26.178 QT
cp
f
GR
GS
[0.75 0 0 0.75 217.50021 25.49999] CT
N
96.612 -9.6 M
96.612 -10.553 L
97.549 -10.553 98.135 -10.694 QT
98.721 -10.834 98.721 -11.413 QT
98.721 -18.772 L
98.721 -19.506 98.51 -19.827 QT
98.299 -20.147 97.885 -20.217 QT
97.471 -20.288 96.612 -20.288 QT
96.612 -21.241 L
100.534 -21.538 L
100.534 -18.897 L
101.081 -20.053 102.143 -20.795 QT
103.206 -21.538 104.456 -21.538 QT
106.315 -21.538 107.26 -20.639 QT
108.206 -19.741 108.206 -17.897 QT
108.206 -11.413 L
108.206 -10.834 108.799 -10.694 QT
109.393 -10.553 110.315 -10.553 QT
110.315 -9.6 L
104.127 -9.6 L
104.127 -10.553 L
105.049 -10.553 105.643 -10.694 QT
106.237 -10.834 106.237 -11.413 QT
106.237 -17.819 L
106.237 -19.131 105.854 -19.983 QT
105.471 -20.834 104.299 -20.834 QT
102.721 -20.834 101.713 -19.584 QT
100.706 -18.334 100.706 -16.725 QT
100.706 -11.413 L
100.706 -10.834 101.299 -10.694 QT
101.893 -10.553 102.799 -10.553 QT
102.799 -9.6 L
96.612 -9.6 L
cp
f
GR
GS
[0.75 0 0 0.75 217.50021 25.49999] CT
N
111.333 -4.366 M
111.333 -5.303 L
112.255 -5.303 112.849 -5.459 QT
113.442 -5.616 113.442 -6.178 QT
113.442 -19.178 L
113.442 -19.928 112.911 -20.108 QT
112.38 -20.288 111.333 -20.288 QT
111.333 -21.241 L
115.317 -21.538 L
115.317 -19.85 L
116.067 -20.678 117.044 -21.108 QT
118.02 -21.538 119.13 -21.538 QT
120.724 -21.538 122.005 -20.67 QT
123.286 -19.803 124.005 -18.397 QT
124.724 -16.991 124.724 -15.428 QT
124.724 -13.788 123.927 -12.381 QT
123.13 -10.975 121.755 -10.139 QT
120.38 -9.303 118.724 -9.303 QT
116.755 -9.303 115.395 -10.897 QT
115.395 -6.178 L
115.395 -5.616 115.997 -5.459 QT
116.599 -5.303 117.505 -5.303 QT
117.505 -4.366 L
111.333 -4.366 L
cp
115.395 -12.225 M
115.88 -11.256 116.724 -10.631 QT
117.567 -10.006 118.567 -10.006 QT
119.505 -10.006 120.224 -10.506 QT
120.942 -11.006 121.427 -11.85 QT
121.911 -12.694 122.145 -13.624 QT
122.38 -14.553 122.38 -15.428 QT
122.38 -16.506 121.989 -17.764 QT
121.599 -19.022 120.802 -19.889 QT
120.005 -20.756 118.864 -20.756 QT
117.77 -20.756 116.856 -20.194 QT
115.942 -19.631 115.395 -18.678 QT
115.395 -12.225 L
cp
f
GR
GS
[0.75 0 0 0.75 217.50021 25.49999] CT
N
128.351 -12.819 M
128.351 -18.772 L
128.351 -19.506 128.14 -19.827 QT
127.929 -20.147 127.515 -20.217 QT
127.101 -20.288 126.242 -20.288 QT
126.242 -21.241 L
130.335 -21.538 L
130.335 -12.819 L
130.335 -11.756 130.484 -11.17 QT
130.632 -10.584 131.132 -10.295 QT
131.632 -10.006 132.71 -10.006 QT
134.163 -10.006 135.015 -11.217 QT
135.867 -12.428 135.867 -13.975 QT
135.867 -18.772 L
135.867 -19.506 135.648 -19.827 QT
135.429 -20.147 135.023 -20.217 QT
134.617 -20.288 133.757 -20.288 QT
133.757 -21.241 L
137.835 -21.538 L
137.835 -12.053 L
137.835 -11.334 138.054 -11.014 QT
138.273 -10.694 138.679 -10.624 QT
139.085 -10.553 139.945 -10.553 QT
139.945 -9.6 L
135.945 -9.303 L
135.945 -11.584 L
135.445 -10.569 134.554 -9.936 QT
133.663 -9.303 132.57 -9.303 QT
130.632 -9.303 129.492 -10.124 QT
128.351 -10.944 128.351 -12.819 QT
cp
f
GR
GS
[0.75 0 0 0.75 217.50021 25.49999] CT
N
143.01 -12.85 M
143.01 -20.288 L
140.775 -20.288 L
140.775 -20.991 L
142.541 -20.991 143.369 -22.639 QT
144.197 -24.288 144.197 -26.209 QT
144.978 -26.209 L
144.978 -21.241 L
148.791 -21.241 L
148.791 -20.288 L
144.978 -20.288 L
144.978 -12.897 L
144.978 -11.772 145.353 -10.928 QT
145.728 -10.084 146.713 -10.084 QT
147.635 -10.084 148.041 -10.975 QT
148.447 -11.866 148.447 -12.897 QT
148.447 -14.491 L
149.228 -14.491 L
149.228 -12.85 L
149.228 -12.006 148.916 -11.178 QT
148.603 -10.35 147.994 -9.827 QT
147.385 -9.303 146.525 -9.303 QT
144.9 -9.303 143.955 -10.272 QT
143.01 -11.241 143.01 -12.85 QT
cp
f
GR
GS
[0.75 0 0 0.75 0 0] CT
0.2 0.702 0.2 RC
1 LJ
0.667 LW
N
100.125 201.96 M
127.25 204.958 L
154.375 207.957 L
181.5 210.955 L
208.625 213.953 L
235.75 216.952 L
262.875 219.95 L
290 222.948 L
317.125 225.946 L
344.25 228.945 L
371.375 231.943 L
398.5 234.941 L
425.625 237.939 L
452.75 240.938 L
479.875 220.358 L
S
GR
GS
[0.75 0 0 0.75 0 0] CT
1 LJ
0.667 LW
N
100.125 192.99 M
127.25 197.369 L
154.375 201.747 L
181.5 206.125 L
208.625 210.503 L
235.75 214.882 L
262.875 219.26 L
290 223.638 L
317.125 228.016 L
344.25 232.395 L
371.375 236.773 L
398.5 241.151 L
425.625 245.529 L
452.75 249.908 L
479.875 219.668 L
S
GR
GS
[0.75 0 0 0.75 0 0] CT
0 0 1 RC
1 LJ
0.667 LW
N
100.125 127.217 M
127.25 165.618 L
154.375 204.019 L
181.5 242.42 L
208.625 280.822 L
235.75 319.223 L
262.875 357.624 L
290 340.302 L
317.125 267.257 L
344.25 194.211 L
371.375 121.166 L
398.5 48.121 L
425.625 258.38 L
452.75 221.857 L
479.875 221.857 L
S
GR
GS
[0.75 0 0 0.75 0 0] CT
0.6 0.2 0.2 RC
1 LJ
0.667 LW
N
100.125 244.185 M
127.25 233.592 L
154.375 223 L
181.5 212.408 L
208.625 201.815 L
235.75 227.153 L
262.875 221.857 L
290 221.857 L
317.125 221.857 L
344.25 221.857 L
371.375 221.857 L
398.5 221.857 L
425.625 221.857 L
452.75 221.857 L
479.875 221.857 L
S
GR
GS
[0.75 0 0 0.75 0 0] CT
1 GC
N
496 158 M
496 50 L
372 50 L
372 158 L
cp
f
GR
GS
[0.75 0 0 0.75 314.11361 48.61029] CT
N
0.672 5.12 M
0.672 4.386 L
2.547 4.386 2.984 3.136 QT
7.391 -9.693 L
7.453 -9.911 7.734 -9.911 QT
8 -9.911 L
8.281 -9.911 8.344 -9.693 QT
12.938 3.714 L
13.141 4.151 13.688 4.268 QT
14.234 4.386 15.047 4.386 QT
15.047 5.12 L
9.203 5.12 L
9.203 4.386 L
10.938 4.386 10.938 3.823 QT
10.938 3.714 L
9.797 0.432 L
4.703 0.432 L
3.766 3.136 L
3.75 3.214 3.75 3.354 QT
3.75 3.886 4.242 4.136 QT
4.734 4.386 5.313 4.386 QT
5.313 5.12 L
0.672 5.12 L
cp
4.953 -0.302 M
9.563 -0.302 L
7.25 -7.005 L
4.953 -0.302 L
cp
f
GR
GS
[0.75 0 0 0.75 314.11361 48.61029] CT
N
16.578 6.761 M
16.578 6.011 17.125 5.456 QT
17.672 4.901 18.422 4.651 QT
18 4.339 17.781 3.854 QT
17.563 3.37 17.563 2.839 QT
17.563 1.854 18.188 1.089 QT
17.219 0.151 17.219 -1.068 QT
17.219 -1.724 17.5 -2.302 QT
17.781 -2.88 18.289 -3.302 QT
18.797 -3.724 19.406 -3.943 QT
20.016 -4.161 20.672 -4.161 QT
21.922 -4.161 22.906 -3.427 QT
23.344 -3.896 23.93 -4.146 QT
24.516 -4.396 25.156 -4.396 QT
25.609 -4.396 25.898 -4.075 QT
26.188 -3.755 26.188 -3.302 QT
26.188 -3.036 25.992 -2.841 QT
25.797 -2.646 25.531 -2.646 QT
25.266 -2.646 25.07 -2.841 QT
24.875 -3.036 24.875 -3.302 QT
24.875 -3.693 25.141 -3.849 QT
24.047 -3.849 23.266 -3.099 QT
23.656 -2.708 23.883 -2.161 QT
24.109 -1.614 24.109 -1.068 QT
24.109 -0.177 23.617 0.534 QT
23.125 1.245 22.32 1.636 QT
21.516 2.026 20.672 2.026 QT
19.516 2.026 18.563 1.401 QT
18.266 1.823 18.266 2.323 QT
18.266 2.886 18.633 3.3 QT
19 3.714 19.547 3.714 QT
21.266 3.714 L
22.516 3.714 23.523 3.94 QT
24.531 4.167 25.211 4.846 QT
25.891 5.526 25.891 6.761 QT
25.891 7.682 25.117 8.292 QT
24.344 8.901 23.258 9.175 QT
22.172 9.448 21.25 9.448 QT
20.313 9.448 19.227 9.175 QT
18.141 8.901 17.359 8.292 QT
16.578 7.682 16.578 6.761 QT
cp
17.766 6.761 M
17.766 7.464 18.336 7.94 QT
18.906 8.417 19.719 8.651 QT
20.531 8.886 21.25 8.886 QT
21.953 8.886 22.766 8.651 QT
23.578 8.417 24.148 7.94 QT
24.719 7.464 24.719 6.761 QT
24.719 5.667 23.711 5.339 QT
22.703 5.011 21.266 5.011 QT
19.547 5.011 L
19.063 5.011 18.656 5.245 QT
18.25 5.479 18.008 5.893 QT
17.766 6.307 17.766 6.761 QT
cp
20.672 1.464 M
22.453 1.464 22.453 -1.068 QT
22.453 -2.177 22.07 -2.888 QT
21.688 -3.599 20.672 -3.599 QT
19.641 -3.599 19.258 -2.888 QT
18.875 -2.177 18.875 -1.068 QT
18.875 -0.38 19.023 0.182 QT
19.172 0.745 19.563 1.104 QT
19.953 1.464 20.672 1.464 QT
cp
f
GR
GS
[0.75 0 0 0.75 314.11361 48.61029] CT
N
31.901 5.354 M
30.62 5.354 29.55 4.682 QT
28.479 4.011 27.862 2.886 QT
27.245 1.761 27.245 0.511 QT
27.245 -0.708 27.807 -1.818 QT
28.37 -2.927 29.37 -3.607 QT
30.37 -4.286 31.604 -4.286 QT
32.557 -4.286 33.276 -3.966 QT
33.995 -3.646 34.456 -3.075 QT
34.917 -2.505 35.151 -1.724 QT
35.385 -0.943 35.385 -0.005 QT
35.385 0.276 35.167 0.276 QT
29.089 0.276 L
29.089 0.495 L
29.089 2.245 29.792 3.495 QT
30.495 4.745 32.089 4.745 QT
32.729 4.745 33.276 4.456 QT
33.823 4.167 34.229 3.651 QT
34.635 3.136 34.776 2.557 QT
34.792 2.479 34.854 2.425 QT
34.917 2.37 34.979 2.37 QT
35.167 2.37 L
35.385 2.37 35.385 2.636 QT
35.089 3.823 34.104 4.589 QT
33.12 5.354 31.901 5.354 QT
cp
29.104 -0.255 M
33.901 -0.255 L
33.901 -1.036 33.675 -1.849 QT
33.448 -2.661 32.94 -3.2 QT
32.432 -3.739 31.604 -3.739 QT
30.417 -3.739 29.76 -2.63 QT
29.104 -1.521 29.104 -0.255 QT
cp
f
GR
GS
[0.75 0 0 0.75 314.11361 48.61029] CT
N
36.773 5.12 M
36.773 4.386 L
37.492 4.386 37.953 4.268 QT
38.414 4.151 38.414 3.714 QT
38.414 -2.021 L
38.414 -2.583 38.242 -2.833 QT
38.07 -3.083 37.758 -3.138 QT
37.445 -3.193 36.773 -3.193 QT
36.773 -3.927 L
39.82 -4.161 L
39.82 -2.114 L
40.242 -3.005 41.07 -3.583 QT
41.898 -4.161 42.867 -4.161 QT
44.32 -4.161 45.054 -3.466 QT
45.789 -2.771 45.789 -1.333 QT
45.789 3.714 L
45.789 4.151 46.25 4.268 QT
46.711 4.386 47.429 4.386 QT
47.429 5.12 L
42.617 5.12 L
42.617 4.386 L
43.336 4.386 43.797 4.268 QT
44.258 4.151 44.258 3.714 QT
44.258 -1.271 L
44.258 -2.286 43.961 -2.95 QT
43.664 -3.614 42.742 -3.614 QT
41.523 -3.614 40.734 -2.638 QT
39.945 -1.661 39.945 -0.427 QT
39.945 3.714 L
39.945 4.151 40.414 4.268 QT
40.883 4.386 41.586 4.386 QT
41.586 5.12 L
36.773 5.12 L
cp
f
GR
GS
[0.75 0 0 0.75 314.11361 48.61029] CT
N
49.548 2.604 M
49.548 -3.193 L
47.814 -3.193 L
47.814 -3.739 L
49.189 -3.739 49.829 -5.021 QT
50.47 -6.302 50.47 -7.802 QT
51.079 -7.802 L
51.079 -3.927 L
54.048 -3.927 L
54.048 -3.193 L
51.079 -3.193 L
51.079 2.557 L
51.079 3.432 51.368 4.089 QT
51.657 4.745 52.423 4.745 QT
53.142 4.745 53.462 4.05 QT
53.782 3.354 53.782 2.557 QT
53.782 1.323 L
54.376 1.323 L
54.376 2.604 L
54.376 3.261 54.134 3.901 QT
53.892 4.542 53.423 4.948 QT
52.954 5.354 52.282 5.354 QT
51.017 5.354 50.282 4.604 QT
49.548 3.854 49.548 2.604 QT
cp
f
GR
GS
[0.75 0 0 0.75 314.11361 48.61029] CT
N
64.768 5.12 M
64.768 4.386 L
67.393 4.386 67.393 3.714 QT
67.393 -7.302 L
66.299 -6.786 64.643 -6.786 QT
64.643 -7.521 L
67.221 -7.521 68.534 -8.864 QT
68.831 -8.864 L
68.893 -8.864 68.963 -8.81 QT
69.034 -8.755 69.034 -8.677 QT
69.034 3.714 L
69.034 4.386 71.659 4.386 QT
71.659 5.12 L
64.768 5.12 L
cp
f
GR
GS
[0.75 0 0 0.75 0 0] CT
0.2 0.702 0.2 RC
1 LJ
0.667 LW
N
375.985 64.814 M
415.83 64.814 L
S
GR
GS
[0.75 0 0 0.75 314.11361 68.20343] CT
N
/f-597267615{0.672 5.12 M
0.672 4.386 L
2.547 4.386 2.984 3.136 QT
7.391 -9.693 L
7.453 -9.911 7.734 -9.911 QT
8 -9.911 L
8.281 -9.911 8.344 -9.693 QT
12.938 3.714 L
13.141 4.151 13.688 4.268 QT
14.234 4.386 15.047 4.386 QT
15.047 5.12 L
9.203 5.12 L
9.203 4.386 L
10.938 4.386 10.938 3.823 QT
10.938 3.714 L
9.797 0.432 L
4.703 0.432 L
3.766 3.136 L
3.75 3.214 3.75 3.354 QT
3.75 3.886 4.242 4.136 QT
4.734 4.386 5.313 4.386 QT
5.313 5.12 L
0.672 5.12 L
cp
4.953 -0.302 M
9.563 -0.302 L
7.25 -7.005 L
4.953 -0.302 L
cp}def
f-597267615
f
GR
GS
[0.75 0 0 0.75 314.11361 68.20343] CT
N
/f-745240314{16.578 6.761 M
16.578 6.011 17.125 5.456 QT
17.672 4.901 18.422 4.651 QT
18 4.339 17.781 3.854 QT
17.563 3.37 17.563 2.839 QT
17.563 1.854 18.188 1.089 QT
17.219 0.151 17.219 -1.068 QT
17.219 -1.724 17.5 -2.302 QT
17.781 -2.88 18.289 -3.302 QT
18.797 -3.724 19.406 -3.943 QT
20.016 -4.161 20.672 -4.161 QT
21.922 -4.161 22.906 -3.427 QT
23.344 -3.896 23.93 -4.146 QT
24.516 -4.396 25.156 -4.396 QT
25.609 -4.396 25.898 -4.075 QT
26.188 -3.755 26.188 -3.302 QT
26.188 -3.036 25.992 -2.841 QT
25.797 -2.646 25.531 -2.646 QT
25.266 -2.646 25.07 -2.841 QT
24.875 -3.036 24.875 -3.302 QT
24.875 -3.693 25.141 -3.849 QT
24.047 -3.849 23.266 -3.099 QT
23.656 -2.708 23.883 -2.161 QT
24.109 -1.614 24.109 -1.068 QT
24.109 -0.177 23.617 0.534 QT
23.125 1.245 22.32 1.636 QT
21.516 2.026 20.672 2.026 QT
19.516 2.026 18.563 1.401 QT
18.266 1.823 18.266 2.323 QT
18.266 2.886 18.633 3.3 QT
19 3.714 19.547 3.714 QT
21.266 3.714 L
22.516 3.714 23.523 3.94 QT
24.531 4.167 25.211 4.846 QT
25.891 5.526 25.891 6.761 QT
25.891 7.682 25.117 8.292 QT
24.344 8.901 23.258 9.175 QT
22.172 9.448 21.25 9.448 QT
20.313 9.448 19.227 9.175 QT
18.141 8.901 17.359 8.292 QT
16.578 7.682 16.578 6.761 QT
cp
17.766 6.761 M
17.766 7.464 18.336 7.94 QT
18.906 8.417 19.719 8.651 QT
20.531 8.886 21.25 8.886 QT
21.953 8.886 22.766 8.651 QT
23.578 8.417 24.148 7.94 QT
24.719 7.464 24.719 6.761 QT
24.719 5.667 23.711 5.339 QT
22.703 5.011 21.266 5.011 QT
19.547 5.011 L
19.063 5.011 18.656 5.245 QT
18.25 5.479 18.008 5.893 QT
17.766 6.307 17.766 6.761 QT
cp
20.672 1.464 M
22.453 1.464 22.453 -1.068 QT
22.453 -2.177 22.07 -2.888 QT
21.688 -3.599 20.672 -3.599 QT
19.641 -3.599 19.258 -2.888 QT
18.875 -2.177 18.875 -1.068 QT
18.875 -0.38 19.023 0.182 QT
19.172 0.745 19.563 1.104 QT
19.953 1.464 20.672 1.464 QT
cp}def
f-745240314
f
GR
GS
[0.75 0 0 0.75 314.11361 68.20343] CT
N
/f1964844890{31.901 5.354 M
30.62 5.354 29.55 4.682 QT
28.479 4.011 27.862 2.886 QT
27.245 1.761 27.245 0.511 QT
27.245 -0.708 27.807 -1.818 QT
28.37 -2.927 29.37 -3.607 QT
30.37 -4.286 31.604 -4.286 QT
32.557 -4.286 33.276 -3.966 QT
33.995 -3.646 34.456 -3.075 QT
34.917 -2.505 35.151 -1.724 QT
35.385 -0.943 35.385 -0.005 QT
35.385 0.276 35.167 0.276 QT
29.089 0.276 L
29.089 0.495 L
29.089 2.245 29.792 3.495 QT
30.495 4.745 32.089 4.745 QT
32.729 4.745 33.276 4.456 QT
33.823 4.167 34.229 3.651 QT
34.635 3.136 34.776 2.557 QT
34.792 2.479 34.854 2.425 QT
34.917 2.37 34.979 2.37 QT
35.167 2.37 L
35.385 2.37 35.385 2.636 QT
35.089 3.823 34.104 4.589 QT
33.12 5.354 31.901 5.354 QT
cp
29.104 -0.255 M
33.901 -0.255 L
33.901 -1.036 33.675 -1.849 QT
33.448 -2.661 32.94 -3.2 QT
32.432 -3.739 31.604 -3.739 QT
30.417 -3.739 29.76 -2.63 QT
29.104 -1.521 29.104 -0.255 QT
cp}def
f1964844890
f
GR
GS
[0.75 0 0 0.75 314.11361 68.20343] CT
N
/f1881606250{36.773 5.12 M
36.773 4.386 L
37.492 4.386 37.953 4.268 QT
38.414 4.151 38.414 3.714 QT
38.414 -2.021 L
38.414 -2.583 38.242 -2.833 QT
38.07 -3.083 37.758 -3.138 QT
37.445 -3.193 36.773 -3.193 QT
36.773 -3.927 L
39.82 -4.161 L
39.82 -2.114 L
40.242 -3.005 41.07 -3.583 QT
41.898 -4.161 42.867 -4.161 QT
44.32 -4.161 45.054 -3.466 QT
45.789 -2.771 45.789 -1.333 QT
45.789 3.714 L
45.789 4.151 46.25 4.268 QT
46.711 4.386 47.429 4.386 QT
47.429 5.12 L
42.617 5.12 L
42.617 4.386 L
43.336 4.386 43.797 4.268 QT
44.258 4.151 44.258 3.714 QT
44.258 -1.271 L
44.258 -2.286 43.961 -2.95 QT
43.664 -3.614 42.742 -3.614 QT
41.523 -3.614 40.734 -2.638 QT
39.945 -1.661 39.945 -0.427 QT
39.945 3.714 L
39.945 4.151 40.414 4.268 QT
40.883 4.386 41.586 4.386 QT
41.586 5.12 L
36.773 5.12 L
cp}def
f1881606250
f
GR
GS
[0.75 0 0 0.75 314.11361 68.20343] CT
N
/f-1218143468{49.548 2.604 M
49.548 -3.193 L
47.814 -3.193 L
47.814 -3.739 L
49.189 -3.739 49.829 -5.021 QT
50.47 -6.302 50.47 -7.802 QT
51.079 -7.802 L
51.079 -3.927 L
54.048 -3.927 L
54.048 -3.193 L
51.079 -3.193 L
51.079 2.557 L
51.079 3.432 51.368 4.089 QT
51.657 4.745 52.423 4.745 QT
53.142 4.745 53.462 4.05 QT
53.782 3.354 53.782 2.557 QT
53.782 1.323 L
54.376 1.323 L
54.376 2.604 L
54.376 3.261 54.134 3.901 QT
53.892 4.542 53.423 4.948 QT
52.954 5.354 52.282 5.354 QT
51.017 5.354 50.282 4.604 QT
49.548 3.854 49.548 2.604 QT
cp}def
f-1218143468
f
GR
GS
[0.75 0 0 0.75 314.11361 68.20343] CT
N
/f-1429999007{63.862 5.12 M
63.862 4.557 L
63.862 4.511 63.909 4.448 QT
67.159 0.839 L
67.909 0.026 68.37 -0.513 QT
68.831 -1.052 69.276 -1.763 QT
69.721 -2.474 69.987 -3.2 QT
70.252 -3.927 70.252 -4.755 QT
70.252 -5.614 69.932 -6.404 QT
69.612 -7.193 68.979 -7.661 QT
68.346 -8.13 67.456 -8.13 QT
66.549 -8.13 65.823 -7.583 QT
65.096 -7.036 64.799 -6.161 QT
64.877 -6.177 65.018 -6.177 QT
65.487 -6.177 65.823 -5.864 QT
66.159 -5.552 66.159 -5.036 QT
66.159 -4.568 65.823 -4.232 QT
65.487 -3.896 65.018 -3.896 QT
64.534 -3.896 64.198 -4.239 QT
63.862 -4.583 63.862 -5.036 QT
63.862 -5.833 64.159 -6.521 QT
64.456 -7.208 65.018 -7.747 QT
65.581 -8.286 66.276 -8.575 QT
66.971 -8.864 67.768 -8.864 QT
68.971 -8.864 70.002 -8.357 QT
71.034 -7.849 71.643 -6.919 QT
72.252 -5.989 72.252 -4.755 QT
72.252 -3.849 71.854 -3.029 QT
71.456 -2.208 70.831 -1.536 QT
70.206 -0.864 69.229 -0.013 QT
68.252 0.839 67.94 1.136 QT
65.565 3.417 L
67.581 3.417 L
69.065 3.417 70.065 3.393 QT
71.065 3.37 71.127 3.307 QT
71.377 3.042 71.627 1.37 QT
72.252 1.37 L
71.659 5.12 L
63.862 5.12 L
cp}def
f-1429999007
f
GR
GS
[0.75 0 0 0.75 0 0] CT
1 LJ
0.667 LW
N
375.985 90.938 M
415.83 90.938 L
S
GR
GS
[0.75 0 0 0.75 314.11361 87.79657] CT
N
f-597267615
f
GR
GS
[0.75 0 0 0.75 314.11361 87.79657] CT
N
f-745240314
f
GR
GS
[0.75 0 0 0.75 314.11361 87.79657] CT
N
f1964844890
f
GR
GS
[0.75 0 0 0.75 314.11361 87.79657] CT
N
f1881606250
f
GR
GS
[0.75 0 0 0.75 314.11361 87.79657] CT
N
f-1218143468
f
GR
GS
[0.75 0 0 0.75 314.11361 87.79657] CT
N
/f300774680{64.815 3.495 M
65.299 4.214 66.135 4.565 QT
66.971 4.917 67.924 4.917 QT
69.143 4.917 69.659 3.878 QT
70.174 2.839 70.174 1.511 QT
70.174 0.917 70.065 0.323 QT
69.956 -0.271 69.698 -0.786 QT
69.44 -1.302 68.995 -1.607 QT
68.549 -1.911 67.909 -1.911 QT
66.502 -1.911 L
66.315 -1.911 66.315 -2.114 QT
66.315 -2.286 L
66.315 -2.458 66.502 -2.458 QT
67.659 -2.552 L
68.409 -2.552 68.893 -3.107 QT
69.377 -3.661 69.604 -4.45 QT
69.831 -5.239 69.831 -5.958 QT
69.831 -6.974 69.362 -7.614 QT
68.893 -8.255 67.924 -8.255 QT
67.127 -8.255 66.393 -7.958 QT
65.659 -7.661 65.237 -7.036 QT
65.284 -7.052 65.307 -7.06 QT
65.331 -7.068 65.377 -7.068 QT
65.846 -7.068 66.166 -6.739 QT
66.487 -6.411 66.487 -5.943 QT
66.487 -5.489 66.166 -5.161 QT
65.846 -4.833 65.377 -4.833 QT
64.924 -4.833 64.596 -5.161 QT
64.268 -5.489 64.268 -5.943 QT
64.268 -6.849 64.807 -7.513 QT
65.346 -8.177 66.206 -8.521 QT
67.065 -8.864 67.924 -8.864 QT
68.565 -8.864 69.268 -8.677 QT
69.971 -8.489 70.549 -8.138 QT
71.127 -7.786 71.487 -7.232 QT
71.846 -6.677 71.846 -5.958 QT
71.846 -5.083 71.456 -4.333 QT
71.065 -3.583 70.377 -3.044 QT
69.69 -2.505 68.862 -2.239 QT
69.784 -2.052 70.604 -1.544 QT
71.424 -1.036 71.916 -0.232 QT
72.409 0.573 72.409 1.495 QT
72.409 2.651 71.776 3.589 QT
71.143 4.526 70.104 5.057 QT
69.065 5.589 67.924 5.589 QT
66.94 5.589 65.948 5.214 QT
64.956 4.839 64.323 4.089 QT
63.69 3.339 63.69 2.292 QT
63.69 1.761 64.041 1.417 QT
64.393 1.073 64.924 1.073 QT
65.252 1.073 65.534 1.229 QT
65.815 1.386 65.979 1.675 QT
66.143 1.964 66.143 2.292 QT
66.143 2.807 65.784 3.151 QT
65.424 3.495 64.924 3.495 QT
64.815 3.495 L
cp}def
f300774680
f
GR
GS
[0.75 0 0 0.75 0 0] CT
0 0 1 RC
1 LJ
0.667 LW
N
375.985 117.062 M
415.83 117.062 L
S
GR
GS
[0.75 0 0 0.75 314.11361 107.38971] CT
N
f-597267615
f
GR
GS
[0.75 0 0 0.75 314.11361 107.38971] CT
N
f-745240314
f
GR
GS
[0.75 0 0 0.75 314.11361 107.38971] CT
N
f1964844890
f
GR
GS
[0.75 0 0 0.75 314.11361 107.38971] CT
N
f1881606250
f
GR
GS
[0.75 0 0 0.75 314.11361 107.38971] CT
N
f-1218143468
f
GR
GS
[0.75 0 0 0.75 314.11361 107.38971] CT
N
/f-1674298674{63.393 1.651 M
63.393 0.917 L
69.893 -8.771 L
69.956 -8.864 70.112 -8.864 QT
70.409 -8.864 L
70.643 -8.864 70.643 -8.63 QT
70.643 0.917 L
72.706 0.917 L
72.706 1.651 L
70.643 1.651 L
70.643 3.714 L
70.643 4.151 71.26 4.268 QT
71.877 4.386 72.69 4.386 QT
72.69 5.12 L
66.909 5.12 L
66.909 4.386 L
67.721 4.386 68.331 4.268 QT
68.94 4.151 68.94 3.714 QT
68.94 1.651 L
63.393 1.651 L
cp
64.096 0.917 M
69.065 0.917 L
69.065 -6.521 L
64.096 0.917 L
cp}def
f-1674298674
f
GR
GS
[0.75 0 0 0.75 0 0] CT
0.6 0.2 0.2 RC
1 LJ
0.667 LW
N
375.985 143.186 M
415.83 143.186 L
S
GR
GS
[0.75 0 0 0.75 0 0] CT
0.149 GC
10.0 ML
0.667 LW
N
372 158 M
372 50 L
496 50 L
496 158 L
cp
S
GR
%%Trailer
%%Pages: 1
%%EOF
