%!PS-Adobe-3.0 EPSF-3.0
%%Creator: (MATLAB, The Mathworks, Inc. Version 9.12.0.2529717 \(R2022a\) Update 8. Operating System: Linux)
%%Title: plots/Example3_uz.eps
%%CreationDate: 2024-06-25T03:53:17
%%Pages: (atend)
%%BoundingBox:     5     3   410   311
%%LanguageLevel: 3
%%EndComments
%%BeginProlog
%%BeginResource: procset (Apache XML Graphics Std ProcSet) 1.2 0
%%Version: 1.2 0
%%Copyright: (Copyright 2001-2003,2010 The Apache Software Foundation. License terms: http://www.apache.org/licenses/LICENSE-2.0)
/bd{bind def}bind def
/ld{load def}bd
/GR/grestore ld
/GS/gsave ld
/RM/rmoveto ld
/C/curveto ld
/t/show ld
/L/lineto ld
/ML/setmiterlimit ld
/CT/concat ld
/f/fill ld
/N/newpath ld
/S/stroke ld
/CC/setcmykcolor ld
/A/ashow ld
/cp/closepath ld
/RC/setrgbcolor ld
/LJ/setlinejoin ld
/GC/setgray ld
/LW/setlinewidth ld
/M/moveto ld
/re {4 2 roll M
1 index 0 rlineto
0 exch rlineto
neg 0 rlineto
cp } bd
/_ctm matrix def
/_tm matrix def
/BT { _ctm currentmatrix pop matrix _tm copy pop 0 0 moveto } bd
/ET { _ctm setmatrix } bd
/iTm { _ctm setmatrix _tm concat } bd
/Tm { _tm astore pop iTm 0 0 moveto } bd
/ux 0.0 def
/uy 0.0 def
/F {
  /Tp exch def
  /Tf exch def
  Tf findfont Tp scalefont setfont
  /cf Tf def  /cs Tp def
} bd
/ULS {currentpoint /uy exch def /ux exch def} bd
/ULE {
  /Tcx currentpoint pop def
  gsave
  newpath
  cf findfont cs scalefont dup
  /FontMatrix get 0 get /Ts exch def /FontInfo get dup
  /UnderlinePosition get Ts mul /To exch def
  /UnderlineThickness get Ts mul /Tt exch def
  ux uy To add moveto  Tcx uy To add lineto
  Tt setlinewidth stroke
  grestore
} bd
/OLE {
  /Tcx currentpoint pop def
  gsave
  newpath
  cf findfont cs scalefont dup
  /FontMatrix get 0 get /Ts exch def /FontInfo get dup
  /UnderlinePosition get Ts mul /To exch def
  /UnderlineThickness get Ts mul /Tt exch def
  ux uy To add cs add moveto Tcx uy To add cs add lineto
  Tt setlinewidth stroke
  grestore
} bd
/SOE {
  /Tcx currentpoint pop def
  gsave
  newpath
  cf findfont cs scalefont dup
  /FontMatrix get 0 get /Ts exch def /FontInfo get dup
  /UnderlinePosition get Ts mul /To exch def
  /UnderlineThickness get Ts mul /Tt exch def
  ux uy To add cs 10 mul 26 idiv add moveto Tcx uy To add cs 10 mul 26 idiv add lineto
  Tt setlinewidth stroke
  grestore
} bd
/QT {
/Y22 exch store
/X22 exch store
/Y21 exch store
/X21 exch store
currentpoint
/Y21 load 2 mul add 3 div exch
/X21 load 2 mul add 3 div exch
/X21 load 2 mul /X22 load add 3 div
/Y21 load 2 mul /Y22 load add 3 div
/X22 load /Y22 load curveto
} bd
/SSPD {
dup length /d exch dict def
{
/v exch def
/k exch def
currentpagedevice k known {
/cpdv currentpagedevice k get def
v cpdv ne {
/upd false def
/nullv v type /nulltype eq def
/nullcpdv cpdv type /nulltype eq def
nullv nullcpdv or
{
/upd true def
} {
/sametype v type cpdv type eq def
sametype {
v type /arraytype eq {
/vlen v length def
/cpdvlen cpdv length def
vlen cpdvlen eq {
0 1 vlen 1 sub {
/i exch def
/obj v i get def
/cpdobj cpdv i get def
obj cpdobj ne {
/upd true def
exit
} if
} for
} {
/upd true def
} ifelse
} {
v type /dicttype eq {
v {
/dv exch def
/dk exch def
/cpddv cpdv dk get def
dv cpddv ne {
/upd true def
exit
} if
} forall
} {
/upd true def
} ifelse
} ifelse
} if
} ifelse
upd true eq {
d k v put
} if
} if
} if
} forall
d length 0 gt {
d setpagedevice
} if
} bd
/RE { % /NewFontName [NewEncodingArray] /FontName RE -
  findfont dup length dict begin
  {
    1 index /FID ne
    {def} {pop pop} ifelse
  } forall
  /Encoding exch def
  /FontName 1 index def
  currentdict definefont pop
  end
} bind def
%%EndResource
%%BeginResource: procset (Apache XML Graphics EPS ProcSet) 1.0 0
%%Version: 1.0 0
%%Copyright: (Copyright 2002-2003 The Apache Software Foundation. License terms: http://www.apache.org/licenses/LICENSE-2.0)
/BeginEPSF { %def
/b4_Inc_state save def         % Save state for cleanup
/dict_count countdictstack def % Count objects on dict stack
/op_count count 1 sub def      % Count objects on operand stack
userdict begin                 % Push userdict on dict stack
/showpage { } def              % Redefine showpage, { } = null proc
0 setgray 0 setlinecap         % Prepare graphics state
1 setlinewidth 0 setlinejoin
10 setmiterlimit [ ] 0 setdash newpath
/languagelevel where           % If level not equal to 1 then
{pop languagelevel             % set strokeadjust and
1 ne                           % overprint to their defaults.
{false setstrokeadjust false setoverprint
} if
} if
} bd
/EndEPSF { %def
count op_count sub {pop} repeat            % Clean up stacks
countdictstack dict_count sub {end} repeat
b4_Inc_state restore
} bd
%%EndResource
%FOPBeginFontDict
%%IncludeResource: font Courier-Oblique
%%IncludeResource: font Courier-BoldOblique
%%IncludeResource: font Courier-Bold
%%IncludeResource: font ZapfDingbats
%%IncludeResource: font Symbol
%%IncludeResource: font Helvetica
%%IncludeResource: font Helvetica-Oblique
%%IncludeResource: font Helvetica-Bold
%%IncludeResource: font Helvetica-BoldOblique
%%IncludeResource: font Times-Roman
%%IncludeResource: font Times-Italic
%%IncludeResource: font Times-Bold
%%IncludeResource: font Times-BoldItalic
%%IncludeResource: font Courier
%FOPEndFontDict
%%BeginResource: encoding WinAnsiEncoding
/WinAnsiEncoding [
/.notdef /.notdef /.notdef /.notdef /.notdef
/.notdef /.notdef /.notdef /.notdef /.notdef
/.notdef /.notdef /.notdef /.notdef /.notdef
/.notdef /.notdef /.notdef /.notdef /.notdef
/.notdef /.notdef /.notdef /.notdef /.notdef
/.notdef /.notdef /.notdef /.notdef /.notdef
/.notdef /.notdef /space /exclam /quotedbl
/numbersign /dollar /percent /ampersand /quotesingle
/parenleft /parenright /asterisk /plus /comma
/hyphen /period /slash /zero /one
/two /three /four /five /six
/seven /eight /nine /colon /semicolon
/less /equal /greater /question /at
/A /B /C /D /E
/F /G /H /I /J
/K /L /M /N /O
/P /Q /R /S /T
/U /V /W /X /Y
/Z /bracketleft /backslash /bracketright /asciicircum
/underscore /quoteleft /a /b /c
/d /e /f /g /h
/i /j /k /l /m
/n /o /p /q /r
/s /t /u /v /w
/x /y /z /braceleft /bar
/braceright /asciitilde /bullet /Euro /bullet
/quotesinglbase /florin /quotedblbase /ellipsis /dagger
/daggerdbl /circumflex /perthousand /Scaron /guilsinglleft
/OE /bullet /Zcaron /bullet /bullet
/quoteleft /quoteright /quotedblleft /quotedblright /bullet
/endash /emdash /asciitilde /trademark /scaron
/guilsinglright /oe /bullet /zcaron /Ydieresis
/space /exclamdown /cent /sterling /currency
/yen /brokenbar /section /dieresis /copyright
/ordfeminine /guillemotleft /logicalnot /sfthyphen /registered
/macron /degree /plusminus /twosuperior /threesuperior
/acute /mu /paragraph /middot /cedilla
/onesuperior /ordmasculine /guillemotright /onequarter /onehalf
/threequarters /questiondown /Agrave /Aacute /Acircumflex
/Atilde /Adieresis /Aring /AE /Ccedilla
/Egrave /Eacute /Ecircumflex /Edieresis /Igrave
/Iacute /Icircumflex /Idieresis /Eth /Ntilde
/Ograve /Oacute /Ocircumflex /Otilde /Odieresis
/multiply /Oslash /Ugrave /Uacute /Ucircumflex
/Udieresis /Yacute /Thorn /germandbls /agrave
/aacute /acircumflex /atilde /adieresis /aring
/ae /ccedilla /egrave /eacute /ecircumflex
/edieresis /igrave /iacute /icircumflex /idieresis
/eth /ntilde /ograve /oacute /ocircumflex
/otilde /odieresis /divide /oslash /ugrave
/uacute /ucircumflex /udieresis /yacute /thorn
/ydieresis
] def
%%EndResource
%FOPBeginFontReencode
/Courier-Oblique findfont
dup length dict begin
  {1 index /FID ne {def} {pop pop} ifelse} forall
  /Encoding WinAnsiEncoding def
  currentdict
end
/Courier-Oblique exch definefont pop
/Courier-BoldOblique findfont
dup length dict begin
  {1 index /FID ne {def} {pop pop} ifelse} forall
  /Encoding WinAnsiEncoding def
  currentdict
end
/Courier-BoldOblique exch definefont pop
/Courier-Bold findfont
dup length dict begin
  {1 index /FID ne {def} {pop pop} ifelse} forall
  /Encoding WinAnsiEncoding def
  currentdict
end
/Courier-Bold exch definefont pop
/Helvetica findfont
dup length dict begin
  {1 index /FID ne {def} {pop pop} ifelse} forall
  /Encoding WinAnsiEncoding def
  currentdict
end
/Helvetica exch definefont pop
/Helvetica-Oblique findfont
dup length dict begin
  {1 index /FID ne {def} {pop pop} ifelse} forall
  /Encoding WinAnsiEncoding def
  currentdict
end
/Helvetica-Oblique exch definefont pop
/Helvetica-Bold findfont
dup length dict begin
  {1 index /FID ne {def} {pop pop} ifelse} forall
  /Encoding WinAnsiEncoding def
  currentdict
end
/Helvetica-Bold exch definefont pop
/Helvetica-BoldOblique findfont
dup length dict begin
  {1 index /FID ne {def} {pop pop} ifelse} forall
  /Encoding WinAnsiEncoding def
  currentdict
end
/Helvetica-BoldOblique exch definefont pop
/Times-Roman findfont
dup length dict begin
  {1 index /FID ne {def} {pop pop} ifelse} forall
  /Encoding WinAnsiEncoding def
  currentdict
end
/Times-Roman exch definefont pop
/Times-Italic findfont
dup length dict begin
  {1 index /FID ne {def} {pop pop} ifelse} forall
  /Encoding WinAnsiEncoding def
  currentdict
end
/Times-Italic exch definefont pop
/Times-Bold findfont
dup length dict begin
  {1 index /FID ne {def} {pop pop} ifelse} forall
  /Encoding WinAnsiEncoding def
  currentdict
end
/Times-Bold exch definefont pop
/Times-BoldItalic findfont
dup length dict begin
  {1 index /FID ne {def} {pop pop} ifelse} forall
  /Encoding WinAnsiEncoding def
  currentdict
end
/Times-BoldItalic exch definefont pop
/Courier findfont
dup length dict begin
  {1 index /FID ne {def} {pop pop} ifelse} forall
  /Encoding WinAnsiEncoding def
  currentdict
end
/Courier exch definefont pop
%FOPEndFontReencode
%%EndProlog
%%Page: 1 1
%%PageBoundingBox: 0 0 420 315
%%BeginPageSetup
N
    5     3 M
  415     3 L
  415   314 L
    5   314 L
cp
clip
[1 0 0 -1 0 315] CT
%%EndPageSetup
GS
[0.75 0 0 0.75 0 0] CT
1 GC
N
0 0 560 420 re
f
GR
GS
[0.75 0 0 0.75 0 0] CT
1 GC
N
0 0 560 420 re
f
GR
GS
[0.75 0 0 0.75 0 0] CT
1 GC
N
75 359 M
507 359 L
507 39 L
75 39 L
cp
f
GR
GS
[0.75 0 0 0.75 0 0] CT
0.873 GC
1 LJ
0.667 LW
N
75 359 M
75 39 L
S
GR
GS
[0.75 0 0 0.75 0 0] CT
0.873 GC
1 LJ
0.667 LW
N
158.077 359 M
158.077 39 L
S
GR
GS
[0.75 0 0 0.75 0 0] CT
0.873 GC
1 LJ
0.667 LW
N
241.154 359 M
241.154 39 L
S
GR
GS
[0.75 0 0 0.75 0 0] CT
0.873 GC
1 LJ
0.667 LW
N
324.231 359 M
324.231 39 L
S
GR
GS
[0.75 0 0 0.75 0 0] CT
0.873 GC
1 LJ
0.667 LW
N
407.308 359 M
407.308 39 L
S
GR
GS
[0.75 0 0 0.75 0 0] CT
0.873 GC
1 LJ
0.667 LW
N
490.385 359 M
490.385 39 L
S
GR
GS
[0.75 0 0 0.75 0 0] CT
0.873 GC
1 LJ
0.667 LW
N
507 359 M
75 359 L
S
GR
GS
[0.75 0 0 0.75 0 0] CT
0.873 GC
1 LJ
0.667 LW
N
507 295 M
75 295 L
S
GR
GS
[0.75 0 0 0.75 0 0] CT
0.873 GC
1 LJ
0.667 LW
N
507 231 M
75 231 L
S
GR
GS
[0.75 0 0 0.75 0 0] CT
0.873 GC
1 LJ
0.667 LW
N
507 167 M
75 167 L
S
GR
GS
[0.75 0 0 0.75 0 0] CT
0.873 GC
1 LJ
0.667 LW
N
507 103 M
75 103 L
S
GR
GS
[0.75 0 0 0.75 0 0] CT
0.873 GC
1 LJ
0.667 LW
N
507 39 M
75 39 L
S
GR
GS
[0.75 0 0 0.75 0 0] CT
0.149 GC
2 setlinecap
1 LJ
0.667 LW
N
75 359 M
507 359 L
S
GR
GS
[0.75 0 0 0.75 0 0] CT
0.149 GC
2 setlinecap
1 LJ
0.667 LW
N
75 359 M
75 354.69 L
S
GR
GS
[0.75 0 0 0.75 0 0] CT
0.149 GC
2 setlinecap
1 LJ
0.667 LW
N
158.077 359 M
158.077 354.69 L
S
GR
GS
[0.75 0 0 0.75 0 0] CT
0.149 GC
2 setlinecap
1 LJ
0.667 LW
N
241.154 359 M
241.154 354.69 L
S
GR
GS
[0.75 0 0 0.75 0 0] CT
0.149 GC
2 setlinecap
1 LJ
0.667 LW
N
324.231 359 M
324.231 354.69 L
S
GR
GS
[0.75 0 0 0.75 0 0] CT
0.149 GC
2 setlinecap
1 LJ
0.667 LW
N
407.308 359 M
407.308 354.69 L
S
GR
GS
[0.75 0 0 0.75 0 0] CT
0.149 GC
2 setlinecap
1 LJ
0.667 LW
N
490.385 359 M
490.385 354.69 L
S
GR
GS
[0.75 0 0 0.75 56.25 273.25001] CT
0.149 GC
/Helvetica 13.333 F
GS
[1 0 0 1 0 0] CT
-4 15 moveto 
1 -1 scale
(0) t 
GR
GR
GS
[0.75 0 0 0.75 118.55769 273.25001] CT
0.149 GC
/Helvetica 13.333 F
GS
[1 0 0 1 0 0] CT
-4 15 moveto 
1 -1 scale
(5) t 
GR
GR
GS
[0.75 0 0 0.75 180.86538 273.25001] CT
0.149 GC
/Helvetica 13.333 F
GS
[1 0 0 1 0 0] CT
-8 15 moveto 
1 -1 scale
(10) t 
GR
GR
GS
[0.75 0 0 0.75 243.17308 273.25001] CT
0.149 GC
/Helvetica 13.333 F
GS
[1 0 0 1 0 0] CT
-8 15 moveto 
1 -1 scale
(15) t 
GR
GR
GS
[0.75 0 0 0.75 305.48076 273.25001] CT
0.149 GC
/Helvetica 13.333 F
GS
[1 0 0 1 0 0] CT
-8 15 moveto 
1 -1 scale
(20) t 
GR
GR
GS
[0.75 0 0 0.75 367.78846 273.25001] CT
0.149 GC
/Helvetica 13.333 F
GS
[1 0 0 1 0 0] CT
-8 15 moveto 
1 -1 scale
(25) t 
GR
GR
GS
[0.75 0 0 0.75 218.25016 288.49999] CT
0.149 GC
N
-74.637 22.296 M
-74.637 21.859 -74.544 21.484 QT
-72.45 13.156 L
-75.497 13.156 L
-75.794 13.156 -75.794 12.781 QT
-75.684 12.14 -75.419 12.14 QT
-72.2 12.14 L
-71.044 7.406 L
-70.919 7.031 -70.583 6.757 QT
-70.247 6.484 -69.825 6.484 QT
-69.45 6.484 -69.2 6.702 QT
-68.95 6.921 -68.95 7.296 QT
-68.95 7.374 -68.958 7.429 QT
-68.965 7.484 -68.981 7.531 QT
-70.153 12.14 L
-67.153 12.14 L
-66.856 12.14 -66.856 12.515 QT
-66.872 12.593 -66.919 12.765 QT
-66.965 12.937 -67.036 13.046 QT
-67.106 13.156 -67.247 13.156 QT
-70.403 13.156 L
-72.481 21.546 L
-72.7 22.359 -72.7 22.952 QT
-72.7 24.202 -71.84 24.202 QT
-70.575 24.202 -69.59 23.007 QT
-68.606 21.812 -68.075 20.374 QT
-67.965 20.202 -67.856 20.202 QT
-67.497 20.202 L
-67.387 20.202 -67.317 20.281 QT
-67.247 20.359 -67.247 20.468 QT
-67.247 20.515 -67.278 20.546 QT
-67.903 22.296 -69.122 23.632 QT
-70.34 24.968 -71.919 24.968 QT
-73.059 24.968 -73.848 24.218 QT
-74.637 23.468 -74.637 22.296 QT
cp
f
GR
GS
[0.75 0 0 0.75 218.25016 288.49999] CT
0.149 GC
N
-63.576 22.562 M
-63.576 22.015 -63.342 21.421 QT
-60.998 15.187 L
-60.623 14.124 -60.623 13.437 QT
-60.623 12.577 -61.248 12.577 QT
-62.404 12.577 -63.146 13.757 QT
-63.889 14.937 -64.248 16.406 QT
-64.295 16.577 -64.482 16.577 QT
-64.826 16.577 L
-65.06 16.577 -65.06 16.312 QT
-65.06 16.234 L
-64.592 14.499 -63.631 13.163 QT
-62.67 11.827 -61.201 11.827 QT
-60.17 11.827 -59.451 12.507 QT
-58.732 13.187 -58.732 14.234 QT
-58.732 14.765 -58.967 15.359 QT
-61.326 21.593 L
-61.717 22.562 -61.717 23.343 QT
-61.717 24.202 -61.06 24.202 QT
-59.92 24.202 -59.162 22.991 QT
-58.404 21.781 -58.092 20.374 QT
-58.045 20.202 -57.873 20.202 QT
-57.514 20.202 L
-57.404 20.202 -57.334 20.281 QT
-57.264 20.359 -57.264 20.468 QT
-57.264 20.484 -57.295 20.546 QT
-57.685 22.187 -58.67 23.577 QT
-59.654 24.968 -61.107 24.968 QT
-62.139 24.968 -62.857 24.265 QT
-63.576 23.562 -63.576 22.562 QT
cp
-60.31 7.062 M
-60.31 6.452 -59.795 5.96 QT
-59.279 5.468 -58.67 5.468 QT
-58.185 5.468 -57.865 5.773 QT
-57.545 6.077 -57.545 6.546 QT
-57.545 7.187 -58.06 7.679 QT
-58.576 8.171 -59.201 8.171 QT
-59.67 8.171 -59.99 7.851 QT
-60.31 7.531 -60.31 7.062 QT
cp
f
GR
GS
[0.75 0 0 0.75 218.25016 288.49999] CT
0.149 GC
N
-53.502 24.14 M
-53.502 23.968 -53.47 23.89 QT
-51.298 15.234 L
-51.095 14.437 -51.095 13.827 QT
-51.095 12.577 -51.939 12.577 QT
-52.845 12.577 -53.283 13.663 QT
-53.72 14.749 -54.142 16.406 QT
-54.142 16.484 -54.22 16.531 QT
-54.298 16.577 -54.377 16.577 QT
-54.72 16.577 L
-54.814 16.577 -54.884 16.476 QT
-54.955 16.374 -54.955 16.281 QT
-54.642 15.031 -54.353 14.148 QT
-54.064 13.265 -53.447 12.546 QT
-52.83 11.827 -51.908 11.827 QT
-50.83 11.827 -49.994 12.515 QT
-49.158 13.202 -49.158 14.265 QT
-48.283 13.124 -47.127 12.476 QT
-45.97 11.827 -44.658 11.827 QT
-43.283 11.827 -42.291 12.531 QT
-41.298 13.234 -41.298 14.515 QT
-40.408 13.249 -39.205 12.538 QT
-38.002 11.827 -36.595 11.827 QT
-35.095 11.827 -34.181 12.64 QT
-33.267 13.452 -33.267 14.952 QT
-33.267 16.14 -33.798 17.827 QT
-34.33 19.515 -35.111 21.593 QT
-35.533 22.593 -35.533 23.343 QT
-35.533 24.202 -34.845 24.202 QT
-33.72 24.202 -32.97 22.984 QT
-32.22 21.765 -31.908 20.374 QT
-31.814 20.202 -31.658 20.202 QT
-31.33 20.202 L
-31.205 20.202 -31.127 20.281 QT
-31.048 20.359 -31.048 20.468 QT
-31.048 20.484 -31.08 20.546 QT
-31.486 22.187 -32.47 23.577 QT
-33.455 24.968 -34.923 24.968 QT
-35.939 24.968 -36.658 24.265 QT
-37.377 23.562 -37.377 22.562 QT
-37.377 22.046 -37.142 21.421 QT
-36.33 19.249 -35.783 17.531 QT
-35.236 15.812 -35.236 14.515 QT
-35.236 13.702 -35.556 13.14 QT
-35.877 12.577 -36.642 12.577 QT
-38.236 12.577 -39.392 13.546 QT
-40.548 14.515 -41.408 16.109 QT
-41.455 16.406 -41.486 16.562 QT
-43.361 23.999 L
-43.455 24.406 -43.806 24.687 QT
-44.158 24.968 -44.58 24.968 QT
-44.923 24.968 -45.181 24.741 QT
-45.439 24.515 -45.439 24.14 QT
-45.439 23.968 -45.408 23.89 QT
-43.564 16.499 L
-43.267 15.312 -43.267 14.515 QT
-43.267 13.702 -43.595 13.14 QT
-43.923 12.577 -44.72 12.577 QT
-45.783 12.577 -46.673 13.046 QT
-47.564 13.515 -48.228 14.281 QT
-48.892 15.046 -49.455 16.109 QT
-51.423 23.999 L
-51.517 24.406 -51.861 24.687 QT
-52.205 24.968 -52.642 24.968 QT
-52.986 24.968 -53.244 24.741 QT
-53.502 24.515 -53.502 24.14 QT
cp
f
GR
GS
[0.75 0 0 0.75 218.25016 288.49999] CT
0.149 GC
N
-24.153 24.968 M
-25.528 24.968 -26.575 24.241 QT
-27.621 23.515 -28.161 22.296 QT
-28.7 21.077 -28.7 19.718 QT
-28.7 17.64 -27.661 15.82 QT
-26.621 13.999 -24.84 12.913 QT
-23.059 11.827 -21.012 11.827 QT
-19.778 11.827 -18.848 12.468 QT
-17.918 13.109 -17.918 14.312 QT
-17.918 15.984 -19.246 16.796 QT
-20.575 17.609 -22.246 17.804 QT
-23.918 17.999 -25.95 17.999 QT
-26.028 17.999 L
-26.496 19.734 -26.496 20.952 QT
-26.496 22.249 -25.903 23.226 QT
-25.309 24.202 -24.09 24.202 QT
-22.356 24.202 -20.77 23.406 QT
-19.184 22.609 -18.168 21.218 QT
-18.09 21.124 -17.95 21.124 QT
-17.809 21.124 -17.661 21.288 QT
-17.512 21.452 -17.512 21.593 QT
-17.512 21.702 -17.559 21.765 QT
-18.621 23.249 -20.418 24.109 QT
-22.215 24.968 -24.153 24.968 QT
cp
-25.856 17.249 M
-24.168 17.249 -22.739 17.093 QT
-21.309 16.937 -20.153 16.304 QT
-18.996 15.671 -18.996 14.343 QT
-18.996 13.812 -19.293 13.406 QT
-19.59 12.999 -20.067 12.788 QT
-20.543 12.577 -21.043 12.577 QT
-22.278 12.577 -23.262 13.241 QT
-24.246 13.906 -24.887 14.976 QT
-25.528 16.046 -25.856 17.249 QT
cp
f
GR
GS
[0.75 0 0 0.75 218.25016 288.49999] CT
0.149 GC
N
-13.807 22.874 M
-13.026 24.202 -10.666 24.202 QT
-9.651 24.202 -8.729 23.851 QT
-7.807 23.499 -7.205 22.812 QT
-6.604 22.124 -6.604 21.124 QT
-6.604 20.374 -7.143 19.898 QT
-7.682 19.421 -8.463 19.249 QT
-10.041 18.937 L
-11.104 18.671 -11.799 17.929 QT
-12.494 17.187 -12.494 16.14 QT
-12.494 14.859 -11.799 13.866 QT
-11.104 12.874 -9.955 12.351 QT
-8.807 11.827 -7.572 11.827 QT
-6.26 11.827 -5.213 12.452 QT
-4.166 13.077 -4.166 14.312 QT
-4.166 14.984 -4.541 15.491 QT
-4.916 15.999 -5.588 15.999 QT
-5.979 15.999 -6.252 15.749 QT
-6.526 15.499 -6.526 15.124 QT
-6.526 14.781 -6.33 14.46 QT
-6.135 14.14 -5.822 13.952 QT
-5.51 13.765 -5.166 13.765 QT
-5.416 13.14 -6.119 12.859 QT
-6.822 12.577 -7.635 12.577 QT
-8.369 12.577 -9.104 12.874 QT
-9.838 13.171 -10.283 13.741 QT
-10.729 14.312 -10.729 15.093 QT
-10.729 15.624 -10.362 16.015 QT
-9.994 16.406 -9.447 16.577 QT
-7.776 16.921 L
-6.963 17.093 -6.291 17.523 QT
-5.619 17.952 -5.229 18.616 QT
-4.838 19.281 -4.838 20.124 QT
-4.838 21.202 -5.44 22.249 QT
-6.041 23.296 -6.916 23.921 QT
-8.463 24.968 -10.697 24.968 QT
-12.244 24.968 -13.533 24.257 QT
-14.822 23.546 -14.822 22.14 QT
-14.822 21.359 -14.362 20.773 QT
-13.901 20.187 -13.104 20.187 QT
-12.635 20.187 -12.322 20.468 QT
-12.01 20.749 -12.01 21.218 QT
-12.01 21.874 -12.502 22.374 QT
-12.994 22.874 -13.666 22.874 QT
-13.807 22.874 L
cp
f
GR
GS
[0.75 0 0 0.75 218.25016 288.49999] CT
0.149 GC
N
2.474 24.968 M
0.646 24.968 -0.408 23.585 QT
-1.463 22.202 -1.463 20.327 QT
-1.463 18.468 -0.502 16.468 QT
0.459 14.468 2.092 13.148 QT
3.724 11.827 5.615 11.827 QT
6.474 11.827 7.154 12.296 QT
7.834 12.765 8.224 13.562 QT
8.537 12.406 9.49 12.406 QT
9.865 12.406 10.107 12.624 QT
10.349 12.843 10.349 13.218 QT
10.349 13.296 10.349 13.343 QT
10.349 13.39 10.334 13.437 QT
8.303 21.546 L
8.099 22.406 8.099 22.952 QT
8.099 24.202 8.943 24.202 QT
9.849 24.202 10.326 23.046 QT
10.803 21.89 11.115 20.374 QT
11.178 20.202 11.349 20.202 QT
11.709 20.202 L
11.818 20.202 11.888 20.304 QT
11.959 20.406 11.959 20.484 QT
11.443 22.515 10.842 23.741 QT
10.24 24.968 8.881 24.968 QT
7.912 24.968 7.162 24.39 QT
6.412 23.812 6.224 22.874 QT
4.349 24.968 2.474 24.968 QT
cp
2.49 24.202 M
3.553 24.202 4.529 23.413 QT
5.506 22.624 6.224 21.562 QT
6.256 21.546 6.256 21.484 QT
7.803 15.187 L
7.834 15.093 L
7.662 14.062 7.092 13.32 QT
6.521 12.577 5.537 12.577 QT
4.568 12.577 3.724 13.374 QT
2.881 14.171 2.303 15.265 QT
1.74 16.421 1.217 18.452 QT
0.693 20.484 0.693 21.593 QT
0.693 22.593 1.131 23.398 QT
1.568 24.202 2.49 24.202 QT
cp
f
GR
GS
[0.75 0 0 0.75 218.25016 288.49999] CT
0.149 GC
N
15.167 24.14 M
15.167 23.968 15.198 23.89 QT
17.37 15.234 L
17.573 14.437 17.573 13.827 QT
17.573 12.577 16.73 12.577 QT
15.823 12.577 15.386 13.663 QT
14.948 14.749 14.527 16.406 QT
14.527 16.484 14.448 16.531 QT
14.37 16.577 14.292 16.577 QT
13.948 16.577 L
13.855 16.577 13.784 16.476 QT
13.714 16.374 13.714 16.281 QT
14.027 15.031 14.316 14.148 QT
14.605 13.265 15.222 12.546 QT
15.839 11.827 16.761 11.827 QT
17.839 11.827 18.675 12.515 QT
19.511 13.202 19.511 14.265 QT
20.386 13.124 21.542 12.476 QT
22.698 11.827 24.011 11.827 QT
25.386 11.827 26.378 12.531 QT
27.37 13.234 27.37 14.515 QT
28.261 13.249 29.464 12.538 QT
30.667 11.827 32.073 11.827 QT
33.573 11.827 34.487 12.64 QT
35.402 13.452 35.402 14.952 QT
35.402 16.14 34.87 17.827 QT
34.339 19.515 33.558 21.593 QT
33.136 22.593 33.136 23.343 QT
33.136 24.202 33.823 24.202 QT
34.948 24.202 35.698 22.984 QT
36.448 21.765 36.761 20.374 QT
36.855 20.202 37.011 20.202 QT
37.339 20.202 L
37.464 20.202 37.542 20.281 QT
37.62 20.359 37.62 20.468 QT
37.62 20.484 37.589 20.546 QT
37.183 22.187 36.198 23.577 QT
35.214 24.968 33.745 24.968 QT
32.73 24.968 32.011 24.265 QT
31.292 23.562 31.292 22.562 QT
31.292 22.046 31.527 21.421 QT
32.339 19.249 32.886 17.531 QT
33.433 15.812 33.433 14.515 QT
33.433 13.702 33.112 13.14 QT
32.792 12.577 32.027 12.577 QT
30.433 12.577 29.277 13.546 QT
28.12 14.515 27.261 16.109 QT
27.214 16.406 27.183 16.562 QT
25.308 23.999 L
25.214 24.406 24.862 24.687 QT
24.511 24.968 24.089 24.968 QT
23.745 24.968 23.487 24.741 QT
23.23 24.515 23.23 24.14 QT
23.23 23.968 23.261 23.89 QT
25.105 16.499 L
25.402 15.312 25.402 14.515 QT
25.402 13.702 25.073 13.14 QT
24.745 12.577 23.948 12.577 QT
22.886 12.577 21.995 13.046 QT
21.105 13.515 20.441 14.281 QT
19.777 15.046 19.214 16.109 QT
17.245 23.999 L
17.152 24.406 16.808 24.687 QT
16.464 24.968 16.027 24.968 QT
15.683 24.968 15.425 24.741 QT
15.167 24.515 15.167 24.14 QT
cp
f
GR
GS
[0.75 0 0 0.75 218.25016 288.49999] CT
0.149 GC
N
37.969 30.265 M
37.703 30.265 37.703 29.89 QT
37.797 29.249 38.078 29.249 QT
38.985 29.249 39.344 29.093 QT
39.703 28.937 39.907 28.265 QT
43.172 15.202 L
43.391 14.671 43.391 13.827 QT
43.391 12.577 42.547 12.577 QT
41.641 12.577 41.196 13.663 QT
40.75 14.749 40.344 16.406 QT
40.344 16.577 40.11 16.577 QT
39.766 16.577 L
39.688 16.577 39.602 16.476 QT
39.516 16.374 39.516 16.281 QT
39.828 15.031 40.125 14.148 QT
40.422 13.265 41.032 12.546 QT
41.641 11.827 42.563 11.827 QT
43.563 11.827 44.313 12.382 QT
45.063 12.937 45.266 13.906 QT
46.063 12.984 47.024 12.406 QT
47.985 11.827 49.016 11.827 QT
50.235 11.827 51.133 12.476 QT
52.032 13.124 52.485 14.179 QT
52.938 15.234 52.938 16.452 QT
52.938 18.327 51.977 20.32 QT
51.016 22.312 49.383 23.64 QT
47.75 24.968 45.875 24.968 QT
45.032 24.968 44.344 24.484 QT
43.657 23.999 43.282 23.218 QT
41.953 28.374 L
41.891 28.796 41.875 28.874 QT
41.875 29.249 43.782 29.249 QT
44.078 29.249 44.078 29.624 QT
43.985 29.999 43.922 30.132 QT
43.86 30.265 43.594 30.265 QT
37.969 30.265 L
cp
45.907 24.202 M
46.922 24.202 47.782 23.374 QT
48.641 22.546 49.188 21.515 QT
49.578 20.734 49.922 19.609 QT
50.266 18.484 50.524 17.21 QT
50.782 15.937 50.782 15.187 QT
50.782 14.515 50.602 13.937 QT
50.422 13.359 50.024 12.968 QT
49.625 12.577 48.953 12.577 QT
47.891 12.577 46.953 13.335 QT
46.016 14.093 45.25 15.202 QT
45.25 15.312 L
43.641 21.702 L
43.844 22.749 44.407 23.476 QT
44.969 24.202 45.907 24.202 QT
cp
f
GR
GS
[0.75 0 0 0.75 218.25016 288.49999] CT
0.149 GC
N
54.727 22.296 M
54.727 22.202 54.743 22.031 QT
54.759 21.859 54.782 21.702 QT
54.806 21.546 54.806 21.452 QT
58.399 7.093 L
58.509 6.593 58.54 6.312 QT
58.54 5.843 56.665 5.843 QT
56.384 5.843 56.384 5.468 QT
56.399 5.39 56.446 5.21 QT
56.493 5.031 56.571 4.929 QT
56.649 4.827 56.79 4.827 QT
60.696 4.515 L
61.056 4.515 61.056 4.89 QT
56.868 21.562 L
56.665 22.031 56.665 22.952 QT
56.665 24.202 57.509 24.202 QT
58.399 24.202 58.845 23.093 QT
59.29 21.984 59.649 20.374 QT
59.712 20.202 59.884 20.202 QT
60.227 20.202 L
60.337 20.202 60.415 20.296 QT
60.493 20.39 60.493 20.484 QT
60.165 21.89 59.884 22.702 QT
59.602 23.515 58.993 24.241 QT
58.384 24.968 57.446 24.968 QT
56.29 24.968 55.509 24.218 QT
54.727 23.468 54.727 22.296 QT
cp
f
GR
GS
[0.75 0 0 0.75 218.25016 288.49999] CT
0.149 GC
N
68.604 24.968 M
67.229 24.968 66.182 24.241 QT
65.135 23.515 64.596 22.296 QT
64.057 21.077 64.057 19.718 QT
64.057 17.64 65.096 15.82 QT
66.135 13.999 67.916 12.913 QT
69.698 11.827 71.745 11.827 QT
72.979 11.827 73.909 12.468 QT
74.838 13.109 74.838 14.312 QT
74.838 15.984 73.51 16.796 QT
72.182 17.609 70.51 17.804 QT
68.838 17.999 66.807 17.999 QT
66.729 17.999 L
66.26 19.734 66.26 20.952 QT
66.26 22.249 66.854 23.226 QT
67.448 24.202 68.666 24.202 QT
70.401 24.202 71.987 23.406 QT
73.573 22.609 74.588 21.218 QT
74.666 21.124 74.807 21.124 QT
74.948 21.124 75.096 21.288 QT
75.245 21.452 75.245 21.593 QT
75.245 21.702 75.198 21.765 QT
74.135 23.249 72.338 24.109 QT
70.541 24.968 68.604 24.968 QT
cp
66.901 17.249 M
68.588 17.249 70.018 17.093 QT
71.448 16.937 72.604 16.304 QT
73.76 15.671 73.76 14.343 QT
73.76 13.812 73.463 13.406 QT
73.166 12.999 72.69 12.788 QT
72.213 12.577 71.713 12.577 QT
70.479 12.577 69.495 13.241 QT
68.51 13.906 67.87 14.976 QT
67.229 16.046 66.901 17.249 QT
cp
f
GR
GS
[0.75 0 0 0.75 0 0] CT
0.149 GC
2 setlinecap
1 LJ
0.667 LW
N
75 359 M
75 39 L
S
GR
GS
[0.75 0 0 0.75 0 0] CT
0.149 GC
2 setlinecap
1 LJ
0.667 LW
N
75 359 M
79.31 359 L
S
GR
GS
[0.75 0 0 0.75 0 0] CT
0.149 GC
2 setlinecap
1 LJ
0.667 LW
N
75 295 M
79.31 295 L
S
GR
GS
[0.75 0 0 0.75 0 0] CT
0.149 GC
2 setlinecap
1 LJ
0.667 LW
N
75 231 M
79.31 231 L
S
GR
GS
[0.75 0 0 0.75 0 0] CT
0.149 GC
2 setlinecap
1 LJ
0.667 LW
N
75 167 M
79.31 167 L
S
GR
GS
[0.75 0 0 0.75 0 0] CT
0.149 GC
2 setlinecap
1 LJ
0.667 LW
N
75 103 M
79.31 103 L
S
GR
GS
[0.75 0 0 0.75 0 0] CT
0.149 GC
2 setlinecap
1 LJ
0.667 LW
N
75 39 M
79.31 39 L
S
GR
GS
[0.75 0 0 0.75 52.25 269.25] CT
0.149 GC
/Helvetica 13.333 F
GS
[1 0 0 1 0 0] CT
-24 5.5 moveto 
1 -1 scale
(-0.2) t 
GR
GR
GS
[0.75 0 0 0.75 52.25 221.25] CT
0.149 GC
/Helvetica 13.333 F
GS
[1 0 0 1 0 0] CT
-24 5.5 moveto 
1 -1 scale
(-0.1) t 
GR
GR
GS
[0.75 0 0 0.75 52.25 173.25] CT
0.149 GC
/Helvetica 13.333 F
GS
[1 0 0 1 0 0] CT
-8 5.5 moveto 
1 -1 scale
(0) t 
GR
GR
GS
[0.75 0 0 0.75 52.25 125.25] CT
0.149 GC
/Helvetica 13.333 F
GS
[1 0 0 1 0 0] CT
-19 5.5 moveto 
1 -1 scale
(0.1) t 
GR
GR
GS
[0.75 0 0 0.75 52.25 77.25] CT
0.149 GC
/Helvetica 13.333 F
GS
[1 0 0 1 0 0] CT
-19 5.5 moveto 
1 -1 scale
(0.2) t 
GR
GR
GS
[0.75 0 0 0.75 52.25 29.24999] CT
0.149 GC
/Helvetica 13.333 F
GS
[1 0 0 1 0 0] CT
-19 5.5 moveto 
1 -1 scale
(0.3) t 
GR
GR
GS
[0 -0.75 0.75 0 32 149.24989] CT
0.149 GC
N
-52.378 -13.716 M
-52.378 -14.669 -52.128 -15.669 QT
-51.878 -16.669 -51.417 -17.888 QT
-50.956 -19.107 -50.612 -20.013 QT
-50.237 -21.076 -50.237 -21.763 QT
-50.237 -22.623 -50.862 -22.623 QT
-52.019 -22.623 -52.761 -21.443 QT
-53.503 -20.263 -53.862 -18.794 QT
-53.909 -18.623 -54.097 -18.623 QT
-54.441 -18.623 L
-54.675 -18.623 -54.675 -18.888 QT
-54.675 -18.966 L
-54.206 -20.701 -53.245 -22.037 QT
-52.284 -23.373 -50.816 -23.373 QT
-49.784 -23.373 -49.066 -22.693 QT
-48.347 -22.013 -48.347 -20.966 QT
-48.347 -20.435 -48.581 -19.841 QT
-48.722 -19.482 -49.175 -18.294 QT
-49.628 -17.107 -49.862 -16.326 QT
-50.097 -15.544 -50.253 -14.794 QT
-50.409 -14.044 -50.409 -13.294 QT
-50.409 -12.326 -50.003 -11.662 QT
-49.597 -10.998 -48.675 -10.998 QT
-46.816 -10.998 -45.409 -13.294 QT
-45.394 -13.404 -45.37 -13.513 QT
-45.347 -13.623 -45.331 -13.716 QT
-43.253 -22.123 L
-43.144 -22.513 -42.792 -22.787 QT
-42.441 -23.06 -42.034 -23.06 QT
-41.675 -23.06 -41.417 -22.834 QT
-41.159 -22.607 -41.159 -22.248 QT
-41.159 -22.076 -41.175 -22.013 QT
-43.284 -13.654 L
-43.472 -12.794 -43.472 -12.248 QT
-43.472 -10.998 -42.644 -10.998 QT
-41.706 -10.998 -41.245 -12.154 QT
-40.784 -13.31 -40.456 -14.826 QT
-40.409 -14.998 -40.237 -14.998 QT
-39.878 -14.998 L
-39.769 -14.998 -39.698 -14.896 QT
-39.628 -14.794 -39.628 -14.716 QT
-39.941 -13.466 -40.23 -12.576 QT
-40.519 -11.685 -41.144 -10.959 QT
-41.769 -10.232 -42.691 -10.232 QT
-43.612 -10.232 -44.347 -10.74 QT
-45.081 -11.248 -45.331 -12.107 QT
-46.003 -11.248 -46.878 -10.74 QT
-47.753 -10.232 -48.737 -10.232 QT
-50.394 -10.232 -51.386 -11.146 QT
-52.378 -12.06 -52.378 -13.716 QT
cp
f
GR
GS
[0 -0.75 0.75 0 32 149.24989] CT
0.149 GC
N
-37.633 -5.926 M
-37.805 -5.926 -37.805 -6.113 QT
-37.805 -6.223 -37.758 -6.27 QT
-37.195 -7.238 -36.398 -8.121 QT
-35.602 -9.004 -34.594 -9.918 QT
-33.586 -10.832 -32.57 -11.738 QT
-31.555 -12.645 -30.914 -13.363 QT
-30.992 -13.363 L
-31.461 -13.363 -32.352 -13.66 QT
-33.242 -13.957 -33.758 -13.957 QT
-34.305 -13.957 -34.828 -13.715 QT
-35.352 -13.473 -35.492 -12.973 QT
-35.523 -12.816 -35.664 -12.816 QT
-35.914 -12.816 L
-36.086 -12.816 -36.086 -13.035 QT
-36.086 -13.098 L
-35.914 -13.707 -35.539 -14.238 QT
-35.164 -14.77 -34.617 -15.105 QT
-34.07 -15.441 -33.477 -15.441 QT
-33.055 -15.441 -32.781 -15.254 QT
-32.508 -15.066 -32.133 -14.66 QT
-31.758 -14.254 -31.531 -14.082 QT
-31.305 -13.91 -30.945 -13.91 QT
-30.492 -13.91 -30.125 -14.332 QT
-29.758 -14.754 -29.398 -15.379 QT
-29.336 -15.441 -29.258 -15.441 QT
-29.008 -15.441 L
-28.93 -15.441 -28.883 -15.387 QT
-28.836 -15.332 -28.836 -15.254 QT
-28.836 -15.191 -28.883 -15.129 QT
-29.445 -14.145 -30.195 -13.301 QT
-30.945 -12.457 -32.164 -11.363 QT
-33.383 -10.27 -34.219 -9.52 QT
-35.055 -8.77 -35.789 -7.973 QT
-35.617 -8.004 -35.336 -8.004 QT
-34.836 -8.004 -33.945 -7.715 QT
-33.055 -7.426 -32.57 -7.426 QT
-32.055 -7.426 -31.516 -7.652 QT
-30.977 -7.879 -30.594 -8.285 QT
-30.211 -8.691 -30.07 -9.223 QT
-30.023 -9.363 -29.914 -9.363 QT
-29.648 -9.363 L
-29.57 -9.363 -29.516 -9.301 QT
-29.461 -9.238 -29.461 -9.16 QT
-29.461 -9.145 -29.492 -9.098 QT
-29.68 -8.301 -30.164 -7.582 QT
-30.648 -6.863 -31.352 -6.395 QT
-32.055 -5.926 -32.852 -5.926 QT
-33.242 -5.926 -33.523 -6.113 QT
-33.805 -6.301 -34.18 -6.699 QT
-34.555 -7.098 -34.789 -7.277 QT
-35.023 -7.457 -35.367 -7.457 QT
-36.414 -7.457 -37.242 -5.988 QT
-37.305 -5.926 -37.383 -5.926 QT
-37.633 -5.926 L
cp
f
GR
GS
[0 -0.75 0.75 0 32 149.24989] CT
0.149 GC
N
-23.323 -3.31 M
-23.323 -32.31 L
-19.355 -32.31 L
-19.355 -31.154 L
-22.152 -31.154 L
-22.152 -4.466 L
-19.355 -4.466 L
-19.355 -3.31 L
-23.323 -3.31 L
cp
f
GR
GS
[0 -0.75 0.75 0 32 149.24989] CT
0.149 GC
N
-16.363 -11.06 M
-16.363 -11.232 -16.332 -11.31 QT
-14.16 -19.966 L
-13.957 -20.763 -13.957 -21.373 QT
-13.957 -22.623 -14.8 -22.623 QT
-15.707 -22.623 -16.144 -21.537 QT
-16.582 -20.451 -17.003 -18.794 QT
-17.003 -18.716 -17.082 -18.669 QT
-17.16 -18.623 -17.238 -18.623 QT
-17.582 -18.623 L
-17.675 -18.623 -17.746 -18.724 QT
-17.816 -18.826 -17.816 -18.919 QT
-17.503 -20.169 -17.214 -21.052 QT
-16.925 -21.935 -16.308 -22.654 QT
-15.691 -23.373 -14.769 -23.373 QT
-13.691 -23.373 -12.855 -22.685 QT
-12.019 -21.998 -12.019 -20.935 QT
-11.144 -22.076 -9.988 -22.724 QT
-8.832 -23.373 -7.519 -23.373 QT
-6.144 -23.373 -5.152 -22.669 QT
-4.16 -21.966 -4.16 -20.685 QT
-3.269 -21.951 -2.066 -22.662 QT
-0.863 -23.373 0.543 -23.373 QT
2.043 -23.373 2.958 -22.56 QT
3.872 -21.748 3.872 -20.248 QT
3.872 -19.06 3.34 -17.373 QT
2.809 -15.685 2.028 -13.607 QT
1.606 -12.607 1.606 -11.857 QT
1.606 -10.998 2.293 -10.998 QT
3.418 -10.998 4.168 -12.216 QT
4.918 -13.435 5.231 -14.826 QT
5.325 -14.998 5.481 -14.998 QT
5.809 -14.998 L
5.934 -14.998 6.012 -14.919 QT
6.09 -14.841 6.09 -14.732 QT
6.09 -14.716 6.059 -14.654 QT
5.653 -13.013 4.668 -11.623 QT
3.684 -10.232 2.215 -10.232 QT
1.2 -10.232 0.481 -10.935 QT
-0.238 -11.638 -0.238 -12.638 QT
-0.238 -13.154 -0.003 -13.779 QT
0.809 -15.951 1.356 -17.669 QT
1.903 -19.388 1.903 -20.685 QT
1.903 -21.498 1.583 -22.06 QT
1.262 -22.623 0.497 -22.623 QT
-1.097 -22.623 -2.253 -21.654 QT
-3.41 -20.685 -4.269 -19.091 QT
-4.316 -18.794 -4.347 -18.638 QT
-6.222 -11.201 L
-6.316 -10.794 -6.667 -10.513 QT
-7.019 -10.232 -7.441 -10.232 QT
-7.785 -10.232 -8.042 -10.459 QT
-8.3 -10.685 -8.3 -11.06 QT
-8.3 -11.232 -8.269 -11.31 QT
-6.425 -18.701 L
-6.128 -19.888 -6.128 -20.685 QT
-6.128 -21.498 -6.457 -22.06 QT
-6.785 -22.623 -7.582 -22.623 QT
-8.644 -22.623 -9.535 -22.154 QT
-10.425 -21.685 -11.089 -20.919 QT
-11.753 -20.154 -12.316 -19.091 QT
-14.285 -11.201 L
-14.378 -10.794 -14.722 -10.513 QT
-15.066 -10.232 -15.503 -10.232 QT
-15.847 -10.232 -16.105 -10.459 QT
-16.363 -10.685 -16.363 -11.06 QT
cp
f
GR
GS
[0 -0.75 0.75 0 32 149.24989] CT
0.149 GC
N
8.783 -3.888 M
8.783 -3.982 8.814 -3.998 QT
18.892 -31.951 L
18.955 -32.123 19.095 -32.216 QT
19.236 -32.31 19.424 -32.31 QT
19.674 -32.31 19.838 -32.154 QT
20.002 -31.998 20.002 -31.732 QT
20.002 -31.623 L
9.924 -3.669 L
9.752 -3.31 9.361 -3.31 QT
9.127 -3.31 8.955 -3.482 QT
8.783 -3.654 8.783 -3.888 QT
cp
f
GR
GS
[0 -0.75 0.75 0 32 149.24989] CT
0.149 GC
N
24.34 -12.326 M
25.122 -10.998 27.481 -10.998 QT
28.497 -10.998 29.418 -11.349 QT
30.34 -11.701 30.942 -12.388 QT
31.543 -13.076 31.543 -14.076 QT
31.543 -14.826 31.004 -15.302 QT
30.465 -15.779 29.684 -15.951 QT
28.106 -16.263 L
27.043 -16.529 26.348 -17.271 QT
25.653 -18.013 25.653 -19.06 QT
25.653 -20.341 26.348 -21.334 QT
27.043 -22.326 28.192 -22.849 QT
29.34 -23.373 30.575 -23.373 QT
31.887 -23.373 32.934 -22.748 QT
33.981 -22.123 33.981 -20.888 QT
33.981 -20.216 33.606 -19.709 QT
33.231 -19.201 32.559 -19.201 QT
32.168 -19.201 31.895 -19.451 QT
31.622 -19.701 31.622 -20.076 QT
31.622 -20.419 31.817 -20.74 QT
32.012 -21.06 32.325 -21.248 QT
32.637 -21.435 32.981 -21.435 QT
32.731 -22.06 32.028 -22.341 QT
31.325 -22.623 30.512 -22.623 QT
29.778 -22.623 29.043 -22.326 QT
28.309 -22.029 27.864 -21.459 QT
27.418 -20.888 27.418 -20.107 QT
27.418 -19.576 27.786 -19.185 QT
28.153 -18.794 28.7 -18.623 QT
30.372 -18.279 L
31.184 -18.107 31.856 -17.677 QT
32.528 -17.248 32.918 -16.584 QT
33.309 -15.919 33.309 -15.076 QT
33.309 -13.998 32.707 -12.951 QT
32.106 -11.904 31.231 -11.279 QT
29.684 -10.232 27.45 -10.232 QT
25.903 -10.232 24.614 -10.943 QT
23.325 -11.654 23.325 -13.06 QT
23.325 -13.841 23.786 -14.427 QT
24.247 -15.013 25.043 -15.013 QT
25.512 -15.013 25.825 -14.732 QT
26.137 -14.451 26.137 -13.982 QT
26.137 -13.326 25.645 -12.826 QT
25.153 -12.326 24.481 -12.326 QT
24.34 -12.326 L
cp
f
GR
GS
[0 -0.75 0.75 0 32 149.24989] CT
0.149 GC
N
36.622 -21.205 M
36.622 -21.767 L
36.622 -21.814 36.668 -21.877 QT
39.918 -25.486 L
40.668 -26.299 41.129 -26.838 QT
41.59 -27.377 42.036 -28.088 QT
42.481 -28.799 42.747 -29.525 QT
43.012 -30.252 43.012 -31.08 QT
43.012 -31.939 42.692 -32.728 QT
42.372 -33.517 41.739 -33.986 QT
41.106 -34.455 40.215 -34.455 QT
39.309 -34.455 38.582 -33.908 QT
37.856 -33.361 37.559 -32.486 QT
37.637 -32.502 37.778 -32.502 QT
38.247 -32.502 38.582 -32.189 QT
38.918 -31.877 38.918 -31.361 QT
38.918 -30.892 38.582 -30.557 QT
38.247 -30.221 37.778 -30.221 QT
37.293 -30.221 36.957 -30.564 QT
36.622 -30.908 36.622 -31.361 QT
36.622 -32.158 36.918 -32.846 QT
37.215 -33.533 37.778 -34.072 QT
38.34 -34.611 39.036 -34.9 QT
39.731 -35.189 40.528 -35.189 QT
41.731 -35.189 42.762 -34.682 QT
43.793 -34.174 44.403 -33.244 QT
45.012 -32.314 45.012 -31.08 QT
45.012 -30.174 44.614 -29.353 QT
44.215 -28.533 43.59 -27.861 QT
42.965 -27.189 41.989 -26.338 QT
41.012 -25.486 40.7 -25.189 QT
38.325 -22.908 L
40.34 -22.908 L
41.825 -22.908 42.825 -22.932 QT
43.825 -22.955 43.887 -23.017 QT
44.137 -23.283 44.387 -24.955 QT
45.012 -24.955 L
44.418 -21.205 L
36.622 -21.205 L
cp
f
GR
GS
[0 -0.75 0.75 0 32 149.24989] CT
0.149 GC
N
47.949 -3.31 M
47.949 -4.466 L
50.761 -4.466 L
50.761 -31.154 L
47.949 -31.154 L
47.949 -32.31 L
51.917 -32.31 L
51.917 -3.31 L
47.949 -3.31 L
cp
f
GR
GS
[0.75 0 0 0.75 218.25021 25.49999] CT
N
-256.147 -9.6 M
-256.147 -10.553 L
-253.366 -10.553 -253.366 -11.413 QT
-253.366 -26.241 L
-253.366 -27.1 -256.147 -27.1 QT
-256.147 -28.038 L
-246.194 -28.038 L
-244.334 -28.038 -242.811 -27.241 QT
-241.287 -26.444 -240.202 -25.116 QT
-239.116 -23.788 -238.53 -22.1 QT
-237.944 -20.413 -237.944 -18.647 QT
-237.944 -16.928 -238.537 -15.311 QT
-239.131 -13.694 -240.248 -12.397 QT
-241.366 -11.1 -242.889 -10.35 QT
-244.412 -9.6 -246.194 -9.6 QT
-256.147 -9.6 L
cp
-250.928 -11.413 M
-250.928 -10.819 -250.6 -10.686 QT
-250.272 -10.553 -249.569 -10.553 QT
-246.881 -10.553 L
-245.506 -10.553 -244.256 -11.155 QT
-243.006 -11.756 -242.194 -12.819 QT
-241.334 -13.944 -241.045 -15.35 QT
-240.756 -16.756 -240.756 -18.647 QT
-240.756 -20.616 -241.045 -22.092 QT
-241.334 -23.569 -242.194 -24.725 QT
-242.991 -25.866 -244.233 -26.483 QT
-245.475 -27.1 -246.881 -27.1 QT
-249.569 -27.1 L
-250.053 -27.1 -250.319 -27.061 QT
-250.584 -27.022 -250.756 -26.827 QT
-250.928 -26.631 -250.928 -26.241 QT
-250.928 -11.413 L
cp
f
GR
GS
[0.75 0 0 0.75 218.25021 25.49999] CT
N
-235.839 -9.6 M
-235.839 -10.553 L
-234.917 -10.553 -234.323 -10.694 QT
-233.73 -10.834 -233.73 -11.413 QT
-233.73 -18.772 L
-233.73 -19.819 -234.128 -20.053 QT
-234.526 -20.288 -235.714 -20.288 QT
-235.714 -21.241 L
-231.823 -21.538 L
-231.823 -11.413 L
-231.823 -10.834 -231.316 -10.694 QT
-230.808 -10.553 -229.948 -10.553 QT
-229.948 -9.6 L
-235.839 -9.6 L
cp
-234.683 -26.178 M
-234.683 -26.772 -234.237 -27.217 QT
-233.792 -27.663 -233.214 -27.663 QT
-232.823 -27.663 -232.472 -27.467 QT
-232.12 -27.272 -231.925 -26.913 QT
-231.73 -26.553 -231.73 -26.178 QT
-231.73 -25.584 -232.175 -25.139 QT
-232.62 -24.694 -233.214 -24.694 QT
-233.792 -24.694 -234.237 -25.139 QT
-234.683 -25.584 -234.683 -26.178 QT
cp
f
GR
GS
[0.75 0 0 0.75 218.25021 25.49999] CT
N
-228.369 -9.522 M
-228.369 -13.928 L
-228.369 -14.131 -228.119 -14.131 QT
-227.791 -14.131 L
-227.635 -14.131 -227.588 -13.928 QT
-226.838 -10.006 -223.947 -10.006 QT
-222.666 -10.006 -221.807 -10.584 QT
-220.947 -11.163 -220.947 -12.381 QT
-220.947 -13.256 -221.619 -13.866 QT
-222.291 -14.475 -223.213 -14.709 QT
-225.01 -15.053 L
-225.932 -15.256 -226.674 -15.663 QT
-227.416 -16.069 -227.892 -16.749 QT
-228.369 -17.428 -228.369 -18.334 QT
-228.369 -19.522 -227.736 -20.28 QT
-227.103 -21.038 -226.103 -21.374 QT
-225.103 -21.709 -223.947 -21.709 QT
-222.557 -21.709 -221.541 -20.959 QT
-220.76 -21.631 L
-220.76 -21.709 -220.619 -21.709 QT
-220.432 -21.709 L
-220.353 -21.709 -220.283 -21.631 QT
-220.213 -21.553 -220.213 -21.475 QT
-220.213 -17.944 L
-220.213 -17.694 -220.432 -17.694 QT
-220.76 -17.694 L
-220.994 -17.694 -220.994 -17.944 QT
-220.994 -19.35 -221.775 -20.209 QT
-222.557 -21.069 -223.978 -21.069 QT
-225.182 -21.069 -226.072 -20.624 QT
-226.963 -20.178 -226.963 -19.084 QT
-226.963 -18.334 -226.322 -17.85 QT
-225.682 -17.366 -224.822 -17.147 QT
-222.994 -16.819 L
-222.072 -16.6 -221.275 -16.1 QT
-220.478 -15.6 -220.01 -14.834 QT
-219.541 -14.069 -219.541 -13.1 QT
-219.541 -12.131 -219.877 -11.413 QT
-220.213 -10.694 -220.814 -10.217 QT
-221.416 -9.741 -222.236 -9.522 QT
-223.057 -9.303 -223.947 -9.303 QT
-225.635 -9.303 -226.838 -10.428 QT
-227.822 -9.366 L
-227.822 -9.303 -227.963 -9.303 QT
-228.119 -9.303 L
-228.369 -9.303 -228.369 -9.522 QT
cp
f
GR
GS
[0.75 0 0 0.75 218.25021 25.49999] CT
N
-212.022 -9.303 M
-213.647 -9.303 -214.983 -10.147 QT
-216.319 -10.991 -217.085 -12.413 QT
-217.851 -13.834 -217.851 -15.428 QT
-217.851 -17.022 -217.093 -18.483 QT
-216.335 -19.944 -214.991 -20.827 QT
-213.647 -21.709 -212.022 -21.709 QT
-210.429 -21.709 -209.132 -21.084 QT
-207.835 -20.459 -207.835 -19.053 QT
-207.835 -18.522 -208.21 -18.131 QT
-208.585 -17.741 -209.132 -17.741 QT
-209.663 -17.741 -210.046 -18.131 QT
-210.429 -18.522 -210.429 -19.053 QT
-210.429 -19.522 -210.124 -19.874 QT
-209.819 -20.225 -209.366 -20.319 QT
-210.304 -20.913 -211.991 -20.913 QT
-213.288 -20.913 -214.077 -20.053 QT
-214.866 -19.194 -215.179 -17.928 QT
-215.491 -16.663 -215.491 -15.428 QT
-215.491 -14.116 -215.108 -12.897 QT
-214.726 -11.678 -213.858 -10.881 QT
-212.991 -10.084 -211.694 -10.084 QT
-210.413 -10.084 -209.515 -10.874 QT
-208.616 -11.663 -208.288 -12.928 QT
-208.288 -13.084 -208.069 -13.084 QT
-207.741 -13.084 L
-207.663 -13.084 -207.601 -13.006 QT
-207.538 -12.928 -207.538 -12.85 QT
-207.538 -12.772 L
-207.944 -11.163 -209.155 -10.233 QT
-210.366 -9.303 -212.022 -9.303 QT
cp
f
GR
GS
[0.75 0 0 0.75 218.25021 25.49999] CT
N
-200.139 -9.303 M
-201.764 -9.303 -203.147 -10.124 QT
-204.53 -10.944 -205.335 -12.327 QT
-206.139 -13.709 -206.139 -15.35 QT
-206.139 -16.584 -205.694 -17.733 QT
-205.249 -18.881 -204.428 -19.788 QT
-203.608 -20.694 -202.514 -21.202 QT
-201.421 -21.709 -200.139 -21.709 QT
-198.483 -21.709 -197.116 -20.827 QT
-195.749 -19.944 -194.96 -18.475 QT
-194.171 -17.006 -194.171 -15.35 QT
-194.171 -13.725 -194.975 -12.334 QT
-195.78 -10.944 -197.155 -10.124 QT
-198.53 -9.303 -200.139 -9.303 QT
cp
-200.139 -10.084 M
-197.983 -10.084 -197.256 -11.655 QT
-196.53 -13.225 -196.53 -15.647 QT
-196.53 -17.006 -196.671 -17.897 QT
-196.811 -18.788 -197.311 -19.522 QT
-197.608 -19.959 -198.077 -20.295 QT
-198.546 -20.631 -199.069 -20.811 QT
-199.592 -20.991 -200.139 -20.991 QT
-200.983 -20.991 -201.741 -20.608 QT
-202.499 -20.225 -202.999 -19.522 QT
-203.499 -18.756 -203.639 -17.834 QT
-203.78 -16.913 -203.78 -15.647 QT
-203.78 -14.131 -203.514 -12.928 QT
-203.249 -11.725 -202.452 -10.905 QT
-201.655 -10.084 -200.139 -10.084 QT
cp
f
GR
GS
[0.75 0 0 0.75 218.25021 25.49999] CT
N
-190.65 -12.819 M
-190.65 -18.772 L
-190.65 -19.506 -190.861 -19.827 QT
-191.072 -20.147 -191.486 -20.217 QT
-191.9 -20.288 -192.759 -20.288 QT
-192.759 -21.241 L
-188.665 -21.538 L
-188.665 -12.819 L
-188.665 -11.756 -188.517 -11.17 QT
-188.368 -10.584 -187.868 -10.295 QT
-187.368 -10.006 -186.29 -10.006 QT
-184.837 -10.006 -183.986 -11.217 QT
-183.134 -12.428 -183.134 -13.975 QT
-183.134 -18.772 L
-183.134 -19.506 -183.353 -19.827 QT
-183.572 -20.147 -183.978 -20.217 QT
-184.384 -20.288 -185.243 -20.288 QT
-185.243 -21.241 L
-181.165 -21.538 L
-181.165 -12.053 L
-181.165 -11.334 -180.947 -11.014 QT
-180.728 -10.694 -180.322 -10.624 QT
-179.915 -10.553 -179.056 -10.553 QT
-179.056 -9.6 L
-183.056 -9.303 L
-183.056 -11.584 L
-183.556 -10.569 -184.447 -9.936 QT
-185.337 -9.303 -186.431 -9.303 QT
-188.368 -9.303 -189.509 -10.124 QT
-190.65 -10.944 -190.65 -12.819 QT
cp
f
GR
GS
[0.75 0 0 0.75 218.25021 25.49999] CT
N
-177.944 -9.6 M
-177.944 -10.553 L
-177.007 -10.553 -176.421 -10.694 QT
-175.835 -10.834 -175.835 -11.413 QT
-175.835 -18.772 L
-175.835 -19.506 -176.046 -19.827 QT
-176.257 -20.147 -176.671 -20.217 QT
-177.085 -20.288 -177.944 -20.288 QT
-177.944 -21.241 L
-174.022 -21.538 L
-174.022 -18.897 L
-173.475 -20.053 -172.413 -20.795 QT
-171.35 -21.538 -170.1 -21.538 QT
-168.241 -21.538 -167.296 -20.639 QT
-166.35 -19.741 -166.35 -17.897 QT
-166.35 -11.413 L
-166.35 -10.834 -165.757 -10.694 QT
-165.163 -10.553 -164.241 -10.553 QT
-164.241 -9.6 L
-170.429 -9.6 L
-170.429 -10.553 L
-169.507 -10.553 -168.913 -10.694 QT
-168.319 -10.834 -168.319 -11.413 QT
-168.319 -17.819 L
-168.319 -19.131 -168.702 -19.983 QT
-169.085 -20.834 -170.257 -20.834 QT
-171.835 -20.834 -172.843 -19.584 QT
-173.85 -18.334 -173.85 -16.725 QT
-173.85 -11.413 L
-173.85 -10.834 -173.257 -10.694 QT
-172.663 -10.553 -171.757 -10.553 QT
-171.757 -9.6 L
-177.944 -9.6 L
cp
f
GR
GS
[0.75 0 0 0.75 218.25021 25.49999] CT
N
-161.917 -12.85 M
-161.917 -20.288 L
-164.151 -20.288 L
-164.151 -20.991 L
-162.386 -20.991 -161.558 -22.639 QT
-160.729 -24.288 -160.729 -26.209 QT
-159.948 -26.209 L
-159.948 -21.241 L
-156.136 -21.241 L
-156.136 -20.288 L
-159.948 -20.288 L
-159.948 -12.897 L
-159.948 -11.772 -159.573 -10.928 QT
-159.198 -10.084 -158.214 -10.084 QT
-157.292 -10.084 -156.886 -10.975 QT
-156.479 -11.866 -156.479 -12.897 QT
-156.479 -14.491 L
-155.698 -14.491 L
-155.698 -12.85 L
-155.698 -12.006 -156.011 -11.178 QT
-156.323 -10.35 -156.933 -9.827 QT
-157.542 -9.303 -158.401 -9.303 QT
-160.026 -9.303 -160.972 -10.272 QT
-161.917 -11.241 -161.917 -12.85 QT
cp
f
GR
GS
[0.75 0 0 0.75 218.25021 25.49999] CT
N
-147.578 -9.303 M
-149.218 -9.303 -150.593 -10.163 QT
-151.968 -11.022 -152.757 -12.467 QT
-153.547 -13.913 -153.547 -15.522 QT
-153.547 -17.1 -152.828 -18.522 QT
-152.109 -19.944 -150.82 -20.827 QT
-149.531 -21.709 -147.953 -21.709 QT
-146.718 -21.709 -145.804 -21.288 QT
-144.89 -20.866 -144.297 -20.131 QT
-143.703 -19.397 -143.398 -18.397 QT
-143.093 -17.397 -143.093 -16.194 QT
-143.093 -15.834 -143.375 -15.834 QT
-151.187 -15.834 L
-151.187 -15.553 L
-151.187 -13.303 -150.281 -11.694 QT
-149.375 -10.084 -147.328 -10.084 QT
-146.5 -10.084 -145.797 -10.452 QT
-145.093 -10.819 -144.57 -11.483 QT
-144.047 -12.147 -143.875 -12.897 QT
-143.843 -12.991 -143.773 -13.061 QT
-143.703 -13.131 -143.609 -13.131 QT
-143.375 -13.131 L
-143.093 -13.131 -143.093 -12.788 QT
-143.468 -11.256 -144.734 -10.28 QT
-146 -9.303 -147.578 -9.303 QT
cp
-151.156 -16.506 M
-145 -16.506 L
-145 -17.522 -145.281 -18.561 QT
-145.562 -19.6 -146.226 -20.295 QT
-146.89 -20.991 -147.953 -20.991 QT
-149.484 -20.991 -150.32 -19.561 QT
-151.156 -18.131 -151.156 -16.506 QT
cp
f
GR
GS
[0.75 0 0 0.75 218.25021 25.49999] CT
N
-135.851 -9.303 M
-137.445 -9.303 -138.765 -10.163 QT
-140.085 -11.022 -140.82 -12.436 QT
-141.554 -13.85 -141.554 -15.428 QT
-141.554 -17.069 -140.757 -18.467 QT
-139.96 -19.866 -138.585 -20.702 QT
-137.21 -21.538 -135.57 -21.538 QT
-134.57 -21.538 -133.687 -21.116 QT
-132.804 -20.694 -132.163 -19.959 QT
-132.163 -25.584 L
-132.163 -26.303 -132.382 -26.624 QT
-132.601 -26.944 -132.999 -27.022 QT
-133.398 -27.1 -134.257 -27.1 QT
-134.257 -28.038 L
-130.257 -28.334 L
-130.257 -12.053 L
-130.257 -11.334 -130.046 -11.014 QT
-129.835 -10.694 -129.429 -10.624 QT
-129.023 -10.553 -128.163 -10.553 QT
-128.163 -9.6 L
-132.242 -9.303 L
-132.242 -10.991 L
-132.945 -10.194 -133.906 -9.749 QT
-134.867 -9.303 -135.851 -9.303 QT
cp
-138.601 -11.944 M
-138.148 -11.069 -137.374 -10.538 QT
-136.601 -10.006 -135.695 -10.006 QT
-134.57 -10.006 -133.632 -10.655 QT
-132.695 -11.303 -132.242 -12.334 QT
-132.242 -18.803 L
-132.554 -19.397 -133.038 -19.866 QT
-133.523 -20.334 -134.124 -20.584 QT
-134.726 -20.834 -135.398 -20.834 QT
-136.804 -20.834 -137.663 -20.038 QT
-138.523 -19.241 -138.859 -17.999 QT
-139.195 -16.756 -139.195 -15.397 QT
-139.195 -14.319 -139.085 -13.514 QT
-138.976 -12.709 -138.601 -11.944 QT
cp
f
GR
GS
[0.75 0 0 0.75 218.25021 25.49999] CT
N
-117.944 -9.6 M
-117.944 -10.553 L
-117.007 -10.553 -116.421 -10.694 QT
-115.835 -10.834 -115.835 -11.413 QT
-115.835 -25.584 L
-115.835 -26.303 -116.046 -26.624 QT
-116.257 -26.944 -116.671 -27.022 QT
-117.085 -27.1 -117.944 -27.1 QT
-117.944 -28.038 L
-113.928 -28.334 L
-113.928 -19.053 L
-113.366 -20.178 -112.35 -20.858 QT
-111.335 -21.538 -110.1 -21.538 QT
-108.241 -21.538 -107.296 -20.639 QT
-106.35 -19.741 -106.35 -17.897 QT
-106.35 -11.413 L
-106.35 -10.834 -105.757 -10.694 QT
-105.163 -10.553 -104.241 -10.553 QT
-104.241 -9.6 L
-110.428 -9.6 L
-110.428 -10.553 L
-109.507 -10.553 -108.913 -10.694 QT
-108.319 -10.834 -108.319 -11.413 QT
-108.319 -17.819 L
-108.319 -19.131 -108.702 -19.983 QT
-109.085 -20.834 -110.257 -20.834 QT
-111.835 -20.834 -112.843 -19.584 QT
-113.85 -18.334 -113.85 -16.725 QT
-113.85 -11.413 L
-113.85 -10.834 -113.257 -10.694 QT
-112.663 -10.553 -111.757 -10.553 QT
-111.757 -9.6 L
-117.944 -9.6 L
cp
f
GR
GS
[0.75 0 0 0.75 218.25021 25.49999] CT
N
-97.176 -9.303 M
-98.801 -9.303 -100.184 -10.124 QT
-101.567 -10.944 -102.371 -12.327 QT
-103.176 -13.709 -103.176 -15.35 QT
-103.176 -16.584 -102.731 -17.733 QT
-102.285 -18.881 -101.465 -19.788 QT
-100.645 -20.694 -99.551 -21.202 QT
-98.457 -21.709 -97.176 -21.709 QT
-95.52 -21.709 -94.153 -20.827 QT
-92.785 -19.944 -91.996 -18.475 QT
-91.207 -17.006 -91.207 -15.35 QT
-91.207 -13.725 -92.012 -12.334 QT
-92.817 -10.944 -94.192 -10.124 QT
-95.567 -9.303 -97.176 -9.303 QT
cp
-97.176 -10.084 M
-95.02 -10.084 -94.293 -11.655 QT
-93.567 -13.225 -93.567 -15.647 QT
-93.567 -17.006 -93.707 -17.897 QT
-93.848 -18.788 -94.348 -19.522 QT
-94.645 -19.959 -95.114 -20.295 QT
-95.582 -20.631 -96.106 -20.811 QT
-96.629 -20.991 -97.176 -20.991 QT
-98.02 -20.991 -98.778 -20.608 QT
-99.535 -20.225 -100.035 -19.522 QT
-100.535 -18.756 -100.676 -17.834 QT
-100.817 -16.913 -100.817 -15.647 QT
-100.817 -14.131 -100.551 -12.928 QT
-100.285 -11.725 -99.489 -10.905 QT
-98.692 -10.084 -97.176 -10.084 QT
cp
f
GR
GS
[0.75 0 0 0.75 218.25021 25.49999] CT
N
-84.74 -9.6 M
-88.677 -19.522 L
-88.927 -20.022 -89.451 -20.155 QT
-89.974 -20.288 -90.818 -20.288 QT
-90.818 -21.241 L
-85.146 -21.241 L
-85.146 -20.288 L
-86.662 -20.288 -86.662 -19.647 QT
-86.662 -19.538 -86.646 -19.491 QT
-83.615 -11.866 L
-80.88 -18.756 L
-80.802 -18.959 -80.802 -19.178 QT
-80.802 -19.694 -81.193 -19.991 QT
-81.583 -20.288 -82.099 -20.288 QT
-82.099 -21.241 L
-77.615 -21.241 L
-77.615 -20.288 L
-78.458 -20.288 -79.083 -19.905 QT
-79.708 -19.522 -80.052 -18.772 QT
-83.693 -9.6 L
-83.787 -9.303 -84.115 -9.303 QT
-84.318 -9.303 L
-84.646 -9.303 -84.74 -9.6 QT
cp
f
GR
GS
[0.75 0 0 0.75 218.25021 25.49999] CT
N
-71.281 -9.303 M
-72.922 -9.303 -74.297 -10.163 QT
-75.672 -11.022 -76.461 -12.467 QT
-77.25 -13.913 -77.25 -15.522 QT
-77.25 -17.1 -76.531 -18.522 QT
-75.813 -19.944 -74.524 -20.827 QT
-73.234 -21.709 -71.656 -21.709 QT
-70.422 -21.709 -69.508 -21.288 QT
-68.594 -20.866 -68 -20.131 QT
-67.406 -19.397 -67.102 -18.397 QT
-66.797 -17.397 -66.797 -16.194 QT
-66.797 -15.834 -67.078 -15.834 QT
-74.891 -15.834 L
-74.891 -15.553 L
-74.891 -13.303 -73.984 -11.694 QT
-73.078 -10.084 -71.031 -10.084 QT
-70.203 -10.084 -69.5 -10.452 QT
-68.797 -10.819 -68.274 -11.483 QT
-67.75 -12.147 -67.578 -12.897 QT
-67.547 -12.991 -67.477 -13.061 QT
-67.406 -13.131 -67.313 -13.131 QT
-67.078 -13.131 L
-66.797 -13.131 -66.797 -12.788 QT
-67.172 -11.256 -68.438 -10.28 QT
-69.703 -9.303 -71.281 -9.303 QT
cp
-74.859 -16.506 M
-68.703 -16.506 L
-68.703 -17.522 -68.984 -18.561 QT
-69.266 -19.6 -69.93 -20.295 QT
-70.594 -20.991 -71.656 -20.991 QT
-73.188 -20.991 -74.024 -19.561 QT
-74.859 -18.131 -74.859 -16.506 QT
cp
f
GR
GS
[0.75 0 0 0.75 218.25021 25.49999] CT
N
-65.445 -9.6 M
-65.445 -10.553 L
-64.523 -10.553 -63.93 -10.694 QT
-63.336 -10.834 -63.336 -11.413 QT
-63.336 -18.772 L
-63.336 -19.506 -63.555 -19.827 QT
-63.773 -20.147 -64.18 -20.217 QT
-64.586 -20.288 -65.445 -20.288 QT
-65.445 -21.241 L
-61.586 -21.538 L
-61.586 -18.897 L
-61.148 -20.069 -60.344 -20.803 QT
-59.539 -21.538 -58.398 -21.538 QT
-57.586 -21.538 -56.953 -21.061 QT
-56.32 -20.584 -56.32 -19.803 QT
-56.32 -19.319 -56.672 -18.952 QT
-57.023 -18.584 -57.539 -18.584 QT
-58.039 -18.584 -58.398 -18.944 QT
-58.758 -19.303 -58.758 -19.803 QT
-58.758 -20.522 -58.242 -20.834 QT
-58.398 -20.834 L
-59.492 -20.834 -60.18 -20.045 QT
-60.867 -19.256 -61.164 -18.077 QT
-61.461 -16.897 -61.461 -15.834 QT
-61.461 -11.413 L
-61.461 -10.553 -58.836 -10.553 QT
-58.836 -9.6 L
-65.445 -9.6 L
cp
f
GR
GS
[0.75 0 0 0.75 218.25021 25.49999] CT
N
-40.221 -9.6 M
-44.159 -19.522 L
-44.409 -20.022 -44.932 -20.155 QT
-45.456 -20.288 -46.299 -20.288 QT
-46.299 -21.241 L
-40.627 -21.241 L
-40.627 -20.288 L
-42.143 -20.288 -42.143 -19.647 QT
-42.143 -19.538 -42.127 -19.491 QT
-39.096 -11.866 L
-36.362 -18.756 L
-36.284 -18.959 -36.284 -19.178 QT
-36.284 -19.694 -36.674 -19.991 QT
-37.065 -20.288 -37.581 -20.288 QT
-37.581 -21.241 L
-33.096 -21.241 L
-33.096 -20.288 L
-33.94 -20.288 -34.565 -19.905 QT
-35.19 -19.522 -35.534 -18.772 QT
-39.174 -9.6 L
-39.268 -9.303 -39.596 -9.303 QT
-39.799 -9.303 L
-40.127 -9.303 -40.221 -9.6 QT
cp
f
GR
GS
[0.75 0 0 0.75 218.25021 25.49999] CT
N
-26.763 -9.303 M
-28.403 -9.303 -29.778 -10.163 QT
-31.153 -11.022 -31.943 -12.467 QT
-32.732 -13.913 -32.732 -15.522 QT
-32.732 -17.1 -32.013 -18.522 QT
-31.294 -19.944 -30.005 -20.827 QT
-28.716 -21.709 -27.138 -21.709 QT
-25.903 -21.709 -24.989 -21.288 QT
-24.075 -20.866 -23.482 -20.131 QT
-22.888 -19.397 -22.583 -18.397 QT
-22.278 -17.397 -22.278 -16.194 QT
-22.278 -15.834 -22.56 -15.834 QT
-30.372 -15.834 L
-30.372 -15.553 L
-30.372 -13.303 -29.466 -11.694 QT
-28.56 -10.084 -26.513 -10.084 QT
-25.685 -10.084 -24.982 -10.452 QT
-24.278 -10.819 -23.755 -11.483 QT
-23.232 -12.147 -23.06 -12.897 QT
-23.028 -12.991 -22.958 -13.061 QT
-22.888 -13.131 -22.794 -13.131 QT
-22.56 -13.131 L
-22.278 -13.131 -22.278 -12.788 QT
-22.653 -11.256 -23.919 -10.28 QT
-25.185 -9.303 -26.763 -9.303 QT
cp
-30.341 -16.506 M
-24.185 -16.506 L
-24.185 -17.522 -24.466 -18.561 QT
-24.747 -19.6 -25.411 -20.295 QT
-26.075 -20.991 -27.138 -20.991 QT
-28.669 -20.991 -29.505 -19.561 QT
-30.341 -18.131 -30.341 -16.506 QT
cp
f
GR
GS
[0.75 0 0 0.75 218.25021 25.49999] CT
N
-20.927 -9.6 M
-20.927 -10.553 L
-20.005 -10.553 -19.411 -10.694 QT
-18.817 -10.834 -18.817 -11.413 QT
-18.817 -18.772 L
-18.817 -19.506 -19.036 -19.827 QT
-19.255 -20.147 -19.661 -20.217 QT
-20.067 -20.288 -20.927 -20.288 QT
-20.927 -21.241 L
-17.067 -21.538 L
-17.067 -18.897 L
-16.63 -20.069 -15.825 -20.803 QT
-15.02 -21.538 -13.88 -21.538 QT
-13.067 -21.538 -12.434 -21.061 QT
-11.802 -20.584 -11.802 -19.803 QT
-11.802 -19.319 -12.153 -18.952 QT
-12.505 -18.584 -13.02 -18.584 QT
-13.52 -18.584 -13.88 -18.944 QT
-14.239 -19.303 -14.239 -19.803 QT
-14.239 -20.522 -13.723 -20.834 QT
-13.88 -20.834 L
-14.973 -20.834 -15.661 -20.045 QT
-16.348 -19.256 -16.645 -18.077 QT
-16.942 -16.897 -16.942 -15.834 QT
-16.942 -11.413 L
-16.942 -10.553 -14.317 -10.553 QT
-14.317 -9.6 L
-20.927 -9.6 L
cp
f
GR
GS
[0.75 0 0 0.75 218.25021 25.49999] CT
N
-8.435 -12.85 M
-8.435 -20.288 L
-10.67 -20.288 L
-10.67 -20.991 L
-8.904 -20.991 -8.076 -22.639 QT
-7.248 -24.288 -7.248 -26.209 QT
-6.467 -26.209 L
-6.467 -21.241 L
-2.654 -21.241 L
-2.654 -20.288 L
-6.467 -20.288 L
-6.467 -12.897 L
-6.467 -11.772 -6.092 -10.928 QT
-5.717 -10.084 -4.732 -10.084 QT
-3.81 -10.084 -3.404 -10.975 QT
-2.998 -11.866 -2.998 -12.897 QT
-2.998 -14.491 L
-2.217 -14.491 L
-2.217 -12.85 L
-2.217 -12.006 -2.529 -11.178 QT
-2.842 -10.35 -3.451 -9.827 QT
-4.06 -9.303 -4.92 -9.303 QT
-6.545 -9.303 -7.49 -10.272 QT
-8.435 -11.241 -8.435 -12.85 QT
cp
f
GR
GS
[0.75 0 0 0.75 218.25021 25.49999] CT
N
0.013 -9.6 M
0.013 -10.553 L
0.935 -10.553 1.529 -10.694 QT
2.123 -10.834 2.123 -11.413 QT
2.123 -18.772 L
2.123 -19.819 1.724 -20.053 QT
1.326 -20.288 0.138 -20.288 QT
0.138 -21.241 L
4.029 -21.538 L
4.029 -11.413 L
4.029 -10.834 4.537 -10.694 QT
5.045 -10.553 5.904 -10.553 QT
5.904 -9.6 L
0.013 -9.6 L
cp
1.17 -26.178 M
1.17 -26.772 1.615 -27.217 QT
2.06 -27.663 2.638 -27.663 QT
3.029 -27.663 3.38 -27.467 QT
3.732 -27.272 3.927 -26.913 QT
4.123 -26.553 4.123 -26.178 QT
4.123 -25.584 3.677 -25.139 QT
3.232 -24.694 2.638 -24.694 QT
2.06 -24.694 1.615 -25.139 QT
1.17 -25.584 1.17 -26.178 QT
cp
f
GR
GS
[0.75 0 0 0.75 218.25021 25.49999] CT
N
13.311 -9.303 M
11.686 -9.303 10.35 -10.147 QT
9.014 -10.991 8.249 -12.413 QT
7.483 -13.834 7.483 -15.428 QT
7.483 -17.022 8.241 -18.483 QT
8.999 -19.944 10.343 -20.827 QT
11.686 -21.709 13.311 -21.709 QT
14.905 -21.709 16.202 -21.084 QT
17.499 -20.459 17.499 -19.053 QT
17.499 -18.522 17.124 -18.131 QT
16.749 -17.741 16.202 -17.741 QT
15.671 -17.741 15.288 -18.131 QT
14.905 -18.522 14.905 -19.053 QT
14.905 -19.522 15.21 -19.874 QT
15.514 -20.225 15.968 -20.319 QT
15.03 -20.913 13.343 -20.913 QT
12.046 -20.913 11.257 -20.053 QT
10.468 -19.194 10.155 -17.928 QT
9.843 -16.663 9.843 -15.428 QT
9.843 -14.116 10.225 -12.897 QT
10.608 -11.678 11.475 -10.881 QT
12.343 -10.084 13.639 -10.084 QT
14.921 -10.084 15.819 -10.874 QT
16.718 -11.663 17.046 -12.928 QT
17.046 -13.084 17.264 -13.084 QT
17.593 -13.084 L
17.671 -13.084 17.733 -13.006 QT
17.796 -12.928 17.796 -12.85 QT
17.796 -12.772 L
17.389 -11.163 16.179 -10.233 QT
14.968 -9.303 13.311 -9.303 QT
cp
f
GR
GS
[0.75 0 0 0.75 218.25021 25.49999] CT
N
19.523 -12.256 M
19.523 -13.866 20.788 -14.874 QT
22.054 -15.881 23.827 -16.295 QT
25.601 -16.709 27.194 -16.709 QT
27.194 -17.819 L
27.194 -18.584 26.851 -19.319 QT
26.507 -20.053 25.866 -20.522 QT
25.226 -20.991 24.444 -20.991 QT
22.648 -20.991 21.71 -20.194 QT
22.226 -20.194 22.562 -19.803 QT
22.898 -19.413 22.898 -18.897 QT
22.898 -18.35 22.515 -17.967 QT
22.132 -17.584 21.616 -17.584 QT
21.069 -17.584 20.687 -17.967 QT
20.304 -18.35 20.304 -18.897 QT
20.304 -20.319 21.593 -21.014 QT
22.882 -21.709 24.444 -21.709 QT
25.538 -21.709 26.648 -21.241 QT
27.757 -20.772 28.46 -19.897 QT
29.163 -19.022 29.163 -17.866 QT
29.163 -11.788 L
29.163 -11.256 29.39 -10.819 QT
29.616 -10.381 30.085 -10.381 QT
30.538 -10.381 30.757 -10.827 QT
30.976 -11.272 30.976 -11.788 QT
30.976 -13.522 L
31.757 -13.522 L
31.757 -11.788 L
31.757 -11.178 31.444 -10.631 QT
31.132 -10.084 30.593 -9.764 QT
30.054 -9.444 29.444 -9.444 QT
28.648 -9.444 28.077 -10.053 QT
27.507 -10.663 27.429 -11.506 QT
26.929 -10.491 25.96 -9.897 QT
24.991 -9.303 23.882 -9.303 QT
22.851 -9.303 21.851 -9.6 QT
20.851 -9.897 20.187 -10.553 QT
19.523 -11.209 19.523 -12.256 QT
cp
21.71 -12.256 M
21.71 -11.303 22.413 -10.655 QT
23.116 -10.006 24.054 -10.006 QT
24.929 -10.006 25.64 -10.444 QT
26.351 -10.881 26.773 -11.631 QT
27.194 -12.381 27.194 -13.209 QT
27.194 -16.022 L
25.976 -16.022 24.687 -15.616 QT
23.398 -15.209 22.554 -14.358 QT
21.71 -13.506 21.71 -12.256 QT
cp
f
GR
GS
[0.75 0 0 0.75 218.25021 25.49999] CT
N
32.606 -9.6 M
32.606 -10.553 L
33.528 -10.553 34.122 -10.694 QT
34.715 -10.834 34.715 -11.413 QT
34.715 -25.584 L
34.715 -26.303 34.497 -26.624 QT
34.278 -26.944 33.872 -27.022 QT
33.465 -27.1 32.606 -27.1 QT
32.606 -28.038 L
36.622 -28.334 L
36.622 -11.413 L
36.622 -10.834 37.215 -10.694 QT
37.809 -10.553 38.715 -10.553 QT
38.715 -9.6 L
32.606 -9.6 L
cp
f
GR
GS
[0.75 0 0 0.75 218.25021 25.49999] CT
N
49.152 -12.256 M
49.152 -13.866 50.418 -14.874 QT
51.683 -15.881 53.457 -16.295 QT
55.23 -16.709 56.824 -16.709 QT
56.824 -17.819 L
56.824 -18.584 56.48 -19.319 QT
56.137 -20.053 55.496 -20.522 QT
54.855 -20.991 54.074 -20.991 QT
52.277 -20.991 51.34 -20.194 QT
51.855 -20.194 52.191 -19.803 QT
52.527 -19.413 52.527 -18.897 QT
52.527 -18.35 52.144 -17.967 QT
51.762 -17.584 51.246 -17.584 QT
50.699 -17.584 50.316 -17.967 QT
49.933 -18.35 49.933 -18.897 QT
49.933 -20.319 51.223 -21.014 QT
52.512 -21.709 54.074 -21.709 QT
55.168 -21.709 56.277 -21.241 QT
57.387 -20.772 58.09 -19.897 QT
58.793 -19.022 58.793 -17.866 QT
58.793 -11.788 L
58.793 -11.256 59.019 -10.819 QT
59.246 -10.381 59.715 -10.381 QT
60.168 -10.381 60.387 -10.827 QT
60.605 -11.272 60.605 -11.788 QT
60.605 -13.522 L
61.387 -13.522 L
61.387 -11.788 L
61.387 -11.178 61.074 -10.631 QT
60.762 -10.084 60.223 -9.764 QT
59.683 -9.444 59.074 -9.444 QT
58.277 -9.444 57.707 -10.053 QT
57.137 -10.663 57.058 -11.506 QT
56.558 -10.491 55.59 -9.897 QT
54.621 -9.303 53.512 -9.303 QT
52.48 -9.303 51.48 -9.6 QT
50.48 -9.897 49.816 -10.553 QT
49.152 -11.209 49.152 -12.256 QT
cp
51.34 -12.256 M
51.34 -11.303 52.043 -10.655 QT
52.746 -10.006 53.683 -10.006 QT
54.558 -10.006 55.269 -10.444 QT
55.98 -10.881 56.402 -11.631 QT
56.824 -12.381 56.824 -13.209 QT
56.824 -16.022 L
55.605 -16.022 54.316 -15.616 QT
53.027 -15.209 52.183 -14.358 QT
51.34 -13.506 51.34 -12.256 QT
cp
f
GR
GS
[0.75 0 0 0.75 218.25021 25.49999] CT
N
68.126 -9.303 M
66.501 -9.303 65.165 -10.147 QT
63.829 -10.991 63.064 -12.413 QT
62.298 -13.834 62.298 -15.428 QT
62.298 -17.022 63.056 -18.483 QT
63.814 -19.944 65.157 -20.827 QT
66.501 -21.709 68.126 -21.709 QT
69.72 -21.709 71.017 -21.084 QT
72.314 -20.459 72.314 -19.053 QT
72.314 -18.522 71.939 -18.131 QT
71.564 -17.741 71.017 -17.741 QT
70.486 -17.741 70.103 -18.131 QT
69.72 -18.522 69.72 -19.053 QT
69.72 -19.522 70.025 -19.874 QT
70.329 -20.225 70.782 -20.319 QT
69.845 -20.913 68.157 -20.913 QT
66.861 -20.913 66.072 -20.053 QT
65.282 -19.194 64.97 -17.928 QT
64.657 -16.663 64.657 -15.428 QT
64.657 -14.116 65.04 -12.897 QT
65.423 -11.678 66.29 -10.881 QT
67.157 -10.084 68.454 -10.084 QT
69.736 -10.084 70.634 -10.874 QT
71.532 -11.663 71.861 -12.928 QT
71.861 -13.084 72.079 -13.084 QT
72.407 -13.084 L
72.486 -13.084 72.548 -13.006 QT
72.611 -12.928 72.611 -12.85 QT
72.611 -12.772 L
72.204 -11.163 70.993 -10.233 QT
69.782 -9.303 68.126 -9.303 QT
cp
f
GR
GS
[0.75 0 0 0.75 218.25021 25.49999] CT
N
79.978 -9.303 M
78.353 -9.303 77.017 -10.147 QT
75.681 -10.991 74.916 -12.413 QT
74.15 -13.834 74.15 -15.428 QT
74.15 -17.022 74.908 -18.483 QT
75.666 -19.944 77.009 -20.827 QT
78.353 -21.709 79.978 -21.709 QT
81.572 -21.709 82.869 -21.084 QT
84.166 -20.459 84.166 -19.053 QT
84.166 -18.522 83.791 -18.131 QT
83.416 -17.741 82.869 -17.741 QT
82.337 -17.741 81.955 -18.131 QT
81.572 -18.522 81.572 -19.053 QT
81.572 -19.522 81.877 -19.874 QT
82.181 -20.225 82.634 -20.319 QT
81.697 -20.913 80.009 -20.913 QT
78.712 -20.913 77.923 -20.053 QT
77.134 -19.194 76.822 -17.928 QT
76.509 -16.663 76.509 -15.428 QT
76.509 -14.116 76.892 -12.897 QT
77.275 -11.678 78.142 -10.881 QT
79.009 -10.084 80.306 -10.084 QT
81.587 -10.084 82.486 -10.874 QT
83.384 -11.663 83.712 -12.928 QT
83.712 -13.084 83.931 -13.084 QT
84.259 -13.084 L
84.337 -13.084 84.4 -13.006 QT
84.462 -12.928 84.462 -12.85 QT
84.462 -12.772 L
84.056 -11.163 82.845 -10.233 QT
81.634 -9.303 79.978 -9.303 QT
cp
f
GR
GS
[0.75 0 0 0.75 218.25021 25.49999] CT
N
91.83 -9.303 M
90.189 -9.303 88.814 -10.163 QT
87.439 -11.022 86.65 -12.467 QT
85.861 -13.913 85.861 -15.522 QT
85.861 -17.1 86.58 -18.522 QT
87.299 -19.944 88.588 -20.827 QT
89.877 -21.709 91.455 -21.709 QT
92.689 -21.709 93.603 -21.288 QT
94.517 -20.866 95.111 -20.131 QT
95.705 -19.397 96.01 -18.397 QT
96.314 -17.397 96.314 -16.194 QT
96.314 -15.834 96.033 -15.834 QT
88.221 -15.834 L
88.221 -15.553 L
88.221 -13.303 89.127 -11.694 QT
90.033 -10.084 92.08 -10.084 QT
92.908 -10.084 93.611 -10.452 QT
94.314 -10.819 94.838 -11.483 QT
95.361 -12.147 95.533 -12.897 QT
95.564 -12.991 95.635 -13.061 QT
95.705 -13.131 95.799 -13.131 QT
96.033 -13.131 L
96.314 -13.131 96.314 -12.788 QT
95.939 -11.256 94.674 -10.28 QT
93.408 -9.303 91.83 -9.303 QT
cp
88.252 -16.506 M
94.408 -16.506 L
94.408 -17.522 94.127 -18.561 QT
93.846 -19.6 93.181 -20.295 QT
92.517 -20.991 91.455 -20.991 QT
89.924 -20.991 89.088 -19.561 QT
88.252 -18.131 88.252 -16.506 QT
cp
f
GR
GS
[0.75 0 0 0.75 218.25021 25.49999] CT
N
97.791 -9.6 M
97.791 -10.553 L
98.713 -10.553 99.307 -10.694 QT
99.901 -10.834 99.901 -11.413 QT
99.901 -25.584 L
99.901 -26.303 99.682 -26.624 QT
99.463 -26.944 99.057 -27.022 QT
98.651 -27.1 97.791 -27.1 QT
97.791 -28.038 L
101.807 -28.334 L
101.807 -11.413 L
101.807 -10.834 102.401 -10.694 QT
102.994 -10.553 103.901 -10.553 QT
103.901 -9.6 L
97.791 -9.6 L
cp
f
GR
GS
[0.75 0 0 0.75 218.25021 25.49999] CT
N
111.089 -9.303 M
109.449 -9.303 108.074 -10.163 QT
106.699 -11.022 105.91 -12.467 QT
105.12 -13.913 105.12 -15.522 QT
105.12 -17.1 105.839 -18.522 QT
106.558 -19.944 107.847 -20.827 QT
109.136 -21.709 110.714 -21.709 QT
111.949 -21.709 112.863 -21.288 QT
113.777 -20.866 114.37 -20.131 QT
114.964 -19.397 115.269 -18.397 QT
115.574 -17.397 115.574 -16.194 QT
115.574 -15.834 115.292 -15.834 QT
107.48 -15.834 L
107.48 -15.553 L
107.48 -13.303 108.386 -11.694 QT
109.292 -10.084 111.339 -10.084 QT
112.167 -10.084 112.87 -10.452 QT
113.574 -10.819 114.097 -11.483 QT
114.62 -12.147 114.792 -12.897 QT
114.824 -12.991 114.894 -13.061 QT
114.964 -13.131 115.058 -13.131 QT
115.292 -13.131 L
115.574 -13.131 115.574 -12.788 QT
115.199 -11.256 113.933 -10.28 QT
112.667 -9.303 111.089 -9.303 QT
cp
107.511 -16.506 M
113.667 -16.506 L
113.667 -17.522 113.386 -18.561 QT
113.105 -19.6 112.441 -20.295 QT
111.777 -20.991 110.714 -20.991 QT
109.183 -20.991 108.347 -19.561 QT
107.511 -18.131 107.511 -16.506 QT
cp
f
GR
GS
[0.75 0 0 0.75 218.25021 25.49999] CT
N
116.925 -9.6 M
116.925 -10.553 L
117.847 -10.553 118.441 -10.694 QT
119.035 -10.834 119.035 -11.413 QT
119.035 -18.772 L
119.035 -19.506 118.816 -19.827 QT
118.597 -20.147 118.191 -20.217 QT
117.785 -20.288 116.925 -20.288 QT
116.925 -21.241 L
120.785 -21.538 L
120.785 -18.897 L
121.222 -20.069 122.027 -20.803 QT
122.832 -21.538 123.972 -21.538 QT
124.785 -21.538 125.418 -21.061 QT
126.05 -20.584 126.05 -19.803 QT
126.05 -19.319 125.699 -18.952 QT
125.347 -18.584 124.832 -18.584 QT
124.332 -18.584 123.972 -18.944 QT
123.613 -19.303 123.613 -19.803 QT
123.613 -20.522 124.129 -20.834 QT
123.972 -20.834 L
122.879 -20.834 122.191 -20.045 QT
121.504 -19.256 121.207 -18.077 QT
120.91 -16.897 120.91 -15.834 QT
120.91 -11.413 L
120.91 -10.553 123.535 -10.553 QT
123.535 -9.6 L
116.925 -9.6 L
cp
f
GR
GS
[0.75 0 0 0.75 218.25021 25.49999] CT
N
127.745 -12.256 M
127.745 -13.866 129.01 -14.874 QT
130.276 -15.881 132.05 -16.295 QT
133.823 -16.709 135.417 -16.709 QT
135.417 -17.819 L
135.417 -18.584 135.073 -19.319 QT
134.729 -20.053 134.089 -20.522 QT
133.448 -20.991 132.667 -20.991 QT
130.87 -20.991 129.932 -20.194 QT
130.448 -20.194 130.784 -19.803 QT
131.12 -19.413 131.12 -18.897 QT
131.12 -18.35 130.737 -17.967 QT
130.354 -17.584 129.839 -17.584 QT
129.292 -17.584 128.909 -17.967 QT
128.526 -18.35 128.526 -18.897 QT
128.526 -20.319 129.815 -21.014 QT
131.104 -21.709 132.667 -21.709 QT
133.76 -21.709 134.87 -21.241 QT
135.979 -20.772 136.682 -19.897 QT
137.385 -19.022 137.385 -17.866 QT
137.385 -11.788 L
137.385 -11.256 137.612 -10.819 QT
137.839 -10.381 138.307 -10.381 QT
138.76 -10.381 138.979 -10.827 QT
139.198 -11.272 139.198 -11.788 QT
139.198 -13.522 L
139.979 -13.522 L
139.979 -11.788 L
139.979 -11.178 139.667 -10.631 QT
139.354 -10.084 138.815 -9.764 QT
138.276 -9.444 137.667 -9.444 QT
136.87 -9.444 136.3 -10.053 QT
135.729 -10.663 135.651 -11.506 QT
135.151 -10.491 134.182 -9.897 QT
133.214 -9.303 132.104 -9.303 QT
131.073 -9.303 130.073 -9.6 QT
129.073 -9.897 128.409 -10.553 QT
127.745 -11.209 127.745 -12.256 QT
cp
129.932 -12.256 M
129.932 -11.303 130.635 -10.655 QT
131.339 -10.006 132.276 -10.006 QT
133.151 -10.006 133.862 -10.444 QT
134.573 -10.881 134.995 -11.631 QT
135.417 -12.381 135.417 -13.209 QT
135.417 -16.022 L
134.198 -16.022 132.909 -15.616 QT
131.62 -15.209 130.776 -14.358 QT
129.932 -13.506 129.932 -12.256 QT
cp
f
GR
GS
[0.75 0 0 0.75 218.25021 25.49999] CT
N
142.75 -12.85 M
142.75 -20.288 L
140.516 -20.288 L
140.516 -20.991 L
142.281 -20.991 143.109 -22.639 QT
143.938 -24.288 143.938 -26.209 QT
144.719 -26.209 L
144.719 -21.241 L
148.531 -21.241 L
148.531 -20.288 L
144.719 -20.288 L
144.719 -12.897 L
144.719 -11.772 145.094 -10.928 QT
145.469 -10.084 146.453 -10.084 QT
147.375 -10.084 147.781 -10.975 QT
148.188 -11.866 148.188 -12.897 QT
148.188 -14.491 L
148.969 -14.491 L
148.969 -12.85 L
148.969 -12.006 148.656 -11.178 QT
148.344 -10.35 147.734 -9.827 QT
147.125 -9.303 146.266 -9.303 QT
144.641 -9.303 143.695 -10.272 QT
142.75 -11.241 142.75 -12.85 QT
cp
f
GR
GS
[0.75 0 0 0.75 218.25021 25.49999] CT
N
151.199 -9.6 M
151.199 -10.553 L
152.121 -10.553 152.714 -10.694 QT
153.308 -10.834 153.308 -11.413 QT
153.308 -18.772 L
153.308 -19.819 152.91 -20.053 QT
152.511 -20.288 151.324 -20.288 QT
151.324 -21.241 L
155.214 -21.538 L
155.214 -11.413 L
155.214 -10.834 155.722 -10.694 QT
156.23 -10.553 157.089 -10.553 QT
157.089 -9.6 L
151.199 -9.6 L
cp
152.355 -26.178 M
152.355 -26.772 152.8 -27.217 QT
153.246 -27.663 153.824 -27.663 QT
154.214 -27.663 154.566 -27.467 QT
154.917 -27.272 155.113 -26.913 QT
155.308 -26.553 155.308 -26.178 QT
155.308 -25.584 154.863 -25.139 QT
154.417 -24.694 153.824 -24.694 QT
153.246 -24.694 152.8 -25.139 QT
152.355 -25.584 152.355 -26.178 QT
cp
f
GR
GS
[0.75 0 0 0.75 218.25021 25.49999] CT
N
164.528 -9.303 M
162.903 -9.303 161.52 -10.124 QT
160.137 -10.944 159.333 -12.327 QT
158.528 -13.709 158.528 -15.35 QT
158.528 -16.584 158.973 -17.733 QT
159.419 -18.881 160.239 -19.788 QT
161.059 -20.694 162.153 -21.202 QT
163.247 -21.709 164.528 -21.709 QT
166.184 -21.709 167.551 -20.827 QT
168.919 -19.944 169.708 -18.475 QT
170.497 -17.006 170.497 -15.35 QT
170.497 -13.725 169.692 -12.334 QT
168.887 -10.944 167.512 -10.124 QT
166.137 -9.303 164.528 -9.303 QT
cp
164.528 -10.084 M
166.684 -10.084 167.411 -11.655 QT
168.137 -13.225 168.137 -15.647 QT
168.137 -17.006 167.997 -17.897 QT
167.856 -18.788 167.356 -19.522 QT
167.059 -19.959 166.59 -20.295 QT
166.122 -20.631 165.598 -20.811 QT
165.075 -20.991 164.528 -20.991 QT
163.684 -20.991 162.926 -20.608 QT
162.169 -20.225 161.669 -19.522 QT
161.169 -18.756 161.028 -17.834 QT
160.887 -16.913 160.887 -15.647 QT
160.887 -14.131 161.153 -12.928 QT
161.419 -11.725 162.215 -10.905 QT
163.012 -10.084 164.528 -10.084 QT
cp
f
GR
GS
[0.75 0 0 0.75 218.25021 25.49999] CT
N
171.908 -9.6 M
171.908 -10.553 L
172.846 -10.553 173.432 -10.694 QT
174.018 -10.834 174.018 -11.413 QT
174.018 -18.772 L
174.018 -19.506 173.807 -19.827 QT
173.596 -20.147 173.182 -20.217 QT
172.768 -20.288 171.908 -20.288 QT
171.908 -21.241 L
175.83 -21.538 L
175.83 -18.897 L
176.377 -20.053 177.439 -20.795 QT
178.502 -21.538 179.752 -21.538 QT
181.611 -21.538 182.557 -20.639 QT
183.502 -19.741 183.502 -17.897 QT
183.502 -11.413 L
183.502 -10.834 184.096 -10.694 QT
184.689 -10.553 185.611 -10.553 QT
185.611 -9.6 L
179.424 -9.6 L
179.424 -10.553 L
180.346 -10.553 180.939 -10.694 QT
181.533 -10.834 181.533 -11.413 QT
181.533 -17.819 L
181.533 -19.131 181.15 -19.983 QT
180.768 -20.834 179.596 -20.834 QT
178.018 -20.834 177.01 -19.584 QT
176.002 -18.334 176.002 -16.725 QT
176.002 -11.413 L
176.002 -10.834 176.596 -10.694 QT
177.189 -10.553 178.096 -10.553 QT
178.096 -9.6 L
171.908 -9.6 L
cp
f
GR
GS
[0.75 0 0 0.75 218.25021 25.49999] CT
N
195.643 -9.6 M
195.643 -10.553 L
196.565 -10.553 197.159 -10.694 QT
197.753 -10.834 197.753 -11.413 QT
197.753 -18.772 L
197.753 -19.819 197.354 -20.053 QT
196.956 -20.288 195.768 -20.288 QT
195.768 -21.241 L
199.659 -21.538 L
199.659 -11.413 L
199.659 -10.834 200.167 -10.694 QT
200.674 -10.553 201.534 -10.553 QT
201.534 -9.6 L
195.643 -9.6 L
cp
196.799 -26.178 M
196.799 -26.772 197.245 -27.217 QT
197.69 -27.663 198.268 -27.663 QT
198.659 -27.663 199.01 -27.467 QT
199.362 -27.272 199.557 -26.913 QT
199.753 -26.553 199.753 -26.178 QT
199.753 -25.584 199.307 -25.139 QT
198.862 -24.694 198.268 -24.694 QT
197.69 -24.694 197.245 -25.139 QT
196.799 -25.584 196.799 -26.178 QT
cp
f
GR
GS
[0.75 0 0 0.75 218.25021 25.49999] CT
N
203.019 -9.6 M
203.019 -10.553 L
203.957 -10.553 204.543 -10.694 QT
205.129 -10.834 205.129 -11.413 QT
205.129 -18.772 L
205.129 -19.506 204.918 -19.827 QT
204.707 -20.147 204.293 -20.217 QT
203.879 -20.288 203.019 -20.288 QT
203.019 -21.241 L
206.941 -21.538 L
206.941 -18.897 L
207.488 -20.053 208.551 -20.795 QT
209.613 -21.538 210.863 -21.538 QT
212.723 -21.538 213.668 -20.639 QT
214.613 -19.741 214.613 -17.897 QT
214.613 -11.413 L
214.613 -10.834 215.207 -10.694 QT
215.801 -10.553 216.723 -10.553 QT
216.723 -9.6 L
210.535 -9.6 L
210.535 -10.553 L
211.457 -10.553 212.051 -10.694 QT
212.644 -10.834 212.644 -11.413 QT
212.644 -17.819 L
212.644 -19.131 212.262 -19.983 QT
211.879 -20.834 210.707 -20.834 QT
209.129 -20.834 208.121 -19.584 QT
207.113 -18.334 207.113 -16.725 QT
207.113 -11.413 L
207.113 -10.834 207.707 -10.694 QT
208.301 -10.553 209.207 -10.553 QT
209.207 -9.6 L
203.019 -9.6 L
cp
f
GR
GS
[0.75 0 0 0.75 218.25021 25.49999] CT
N
217.74 -4.366 M
217.74 -5.303 L
218.662 -5.303 219.256 -5.459 QT
219.85 -5.616 219.85 -6.178 QT
219.85 -19.178 L
219.85 -19.928 219.319 -20.108 QT
218.787 -20.288 217.74 -20.288 QT
217.74 -21.241 L
221.725 -21.538 L
221.725 -19.85 L
222.475 -20.678 223.451 -21.108 QT
224.428 -21.538 225.537 -21.538 QT
227.131 -21.538 228.412 -20.67 QT
229.694 -19.803 230.412 -18.397 QT
231.131 -16.991 231.131 -15.428 QT
231.131 -13.788 230.334 -12.381 QT
229.537 -10.975 228.162 -10.139 QT
226.787 -9.303 225.131 -9.303 QT
223.162 -9.303 221.803 -10.897 QT
221.803 -6.178 L
221.803 -5.616 222.405 -5.459 QT
223.006 -5.303 223.912 -5.303 QT
223.912 -4.366 L
217.74 -4.366 L
cp
221.803 -12.225 M
222.287 -11.256 223.131 -10.631 QT
223.975 -10.006 224.975 -10.006 QT
225.912 -10.006 226.631 -10.506 QT
227.35 -11.006 227.834 -11.85 QT
228.319 -12.694 228.553 -13.624 QT
228.787 -14.553 228.787 -15.428 QT
228.787 -16.506 228.397 -17.764 QT
228.006 -19.022 227.209 -19.889 QT
226.412 -20.756 225.272 -20.756 QT
224.178 -20.756 223.264 -20.194 QT
222.35 -19.631 221.803 -18.678 QT
221.803 -12.225 L
cp
f
GR
GS
[0.75 0 0 0.75 218.25021 25.49999] CT
N
234.758 -12.819 M
234.758 -18.772 L
234.758 -19.506 234.548 -19.827 QT
234.337 -20.147 233.923 -20.217 QT
233.508 -20.288 232.649 -20.288 QT
232.649 -21.241 L
236.743 -21.538 L
236.743 -12.819 L
236.743 -11.756 236.891 -11.17 QT
237.04 -10.584 237.54 -10.295 QT
238.04 -10.006 239.118 -10.006 QT
240.571 -10.006 241.423 -11.217 QT
242.274 -12.428 242.274 -13.975 QT
242.274 -18.772 L
242.274 -19.506 242.055 -19.827 QT
241.837 -20.147 241.43 -20.217 QT
241.024 -20.288 240.165 -20.288 QT
240.165 -21.241 L
244.243 -21.538 L
244.243 -12.053 L
244.243 -11.334 244.462 -11.014 QT
244.68 -10.694 245.087 -10.624 QT
245.493 -10.553 246.352 -10.553 QT
246.352 -9.6 L
242.352 -9.303 L
242.352 -11.584 L
241.852 -10.569 240.962 -9.936 QT
240.071 -9.303 238.977 -9.303 QT
237.04 -9.303 235.899 -10.124 QT
234.758 -10.944 234.758 -12.819 QT
cp
f
GR
GS
[0.75 0 0 0.75 218.25021 25.49999] CT
N
249.417 -12.85 M
249.417 -20.288 L
247.183 -20.288 L
247.183 -20.991 L
248.948 -20.991 249.776 -22.639 QT
250.605 -24.288 250.605 -26.209 QT
251.386 -26.209 L
251.386 -21.241 L
255.198 -21.241 L
255.198 -20.288 L
251.386 -20.288 L
251.386 -12.897 L
251.386 -11.772 251.761 -10.928 QT
252.136 -10.084 253.12 -10.084 QT
254.042 -10.084 254.448 -10.975 QT
254.855 -11.866 254.855 -12.897 QT
254.855 -14.491 L
255.636 -14.491 L
255.636 -12.85 L
255.636 -12.006 255.323 -11.178 QT
255.011 -10.35 254.401 -9.827 QT
253.792 -9.303 252.933 -9.303 QT
251.308 -9.303 250.362 -10.272 QT
249.417 -11.241 249.417 -12.85 QT
cp
f
GR
GS
[0.75 0 0 0.75 0 0] CT
0.2 0.702 0.2 RC
1 LJ
0.667 LW
N
91.615 167.453 M
108.231 190.308 L
124.846 213.163 L
141.462 236.018 L
158.077 255.166 L
174.692 270.607 L
191.308 286.048 L
207.923 301.49 L
224.538 316.931 L
241.154 317.776 L
257.769 304.025 L
274.385 290.275 L
291 276.524 L
307.615 262.773 L
324.231 249.023 L
340.846 235.272 L
357.462 221.521 L
374.077 207.77 L
390.692 194.02 L
407.308 180.269 L
423.923 166.518 L
440.538 152.768 L
457.154 139.017 L
473.769 125.266 L
490.385 237.875 L
S
GR
GS
[0.75 0 0 0.75 0 0] CT
1 LJ
0.667 LW
N
91.615 170.428 M
108.231 184.168 L
124.846 197.909 L
141.462 211.649 L
158.077 229.096 L
174.692 250.25 L
191.308 271.404 L
207.923 292.558 L
224.538 313.712 L
241.154 334.866 L
257.769 336.605 L
274.385 318.929 L
291 301.253 L
307.615 283.577 L
324.231 265.901 L
340.846 248.225 L
357.462 230.549 L
374.077 212.873 L
390.692 195.197 L
407.308 177.521 L
423.923 159.845 L
440.538 142.169 L
457.154 124.493 L
473.769 106.817 L
490.385 239.838 L
S
GR
GS
[0.75 0 0 0.75 0 0] CT
0 0 1 RC
1 LJ
0.667 LW
N
91.615 228.281 M
108.231 232.68 L
124.846 237.079 L
141.462 241.479 L
158.077 245.878 L
174.692 250.277 L
191.308 254.677 L
207.923 259.076 L
224.538 263.475 L
241.154 267.875 L
257.769 272.274 L
274.385 276.673 L
291 281.073 L
307.615 266.455 L
324.231 232.82 L
340.846 199.185 L
357.462 165.55 L
374.077 131.915 L
390.692 98.28 L
407.308 231 L
423.923 224.545 L
440.538 226.208 L
457.154 227.871 L
473.769 229.535 L
490.385 230.683 L
S
GR
GS
[0.75 0 0 0.75 0 0] CT
0.6 0.2 0.2 RC
1 LJ
0.667 LW
N
91.615 339.736 M
108.231 329.752 L
124.846 319.768 L
141.462 309.784 L
158.077 275.672 L
174.692 217.432 L
191.308 159.192 L
207.923 100.952 L
224.538 42.712 L
241.154 231 L
257.769 224.545 L
274.385 226.208 L
291 227.871 L
307.615 229.535 L
324.231 230.683 L
340.846 231 L
357.462 231 L
374.077 231 L
390.692 231 L
407.308 231 L
423.923 231 L
440.538 231 L
457.154 231 L
473.769 231 L
490.385 231 L
S
GR
GS
[0.75 0 0 0.75 0 0] CT
1 GC
N
496 158 M
496 50 L
372 50 L
372 158 L
cp
f
GR
GS
[0.75 0 0 0.75 314.11361 48.61029] CT
N
0.672 5.12 M
0.672 4.386 L
2.547 4.386 2.984 3.136 QT
7.391 -9.693 L
7.453 -9.911 7.734 -9.911 QT
8 -9.911 L
8.281 -9.911 8.344 -9.693 QT
12.938 3.714 L
13.141 4.151 13.688 4.268 QT
14.234 4.386 15.047 4.386 QT
15.047 5.12 L
9.203 5.12 L
9.203 4.386 L
10.938 4.386 10.938 3.823 QT
10.938 3.714 L
9.797 0.432 L
4.703 0.432 L
3.766 3.136 L
3.75 3.214 3.75 3.354 QT
3.75 3.886 4.242 4.136 QT
4.734 4.386 5.313 4.386 QT
5.313 5.12 L
0.672 5.12 L
cp
4.953 -0.302 M
9.563 -0.302 L
7.25 -7.005 L
4.953 -0.302 L
cp
f
GR
GS
[0.75 0 0 0.75 314.11361 48.61029] CT
N
16.578 6.761 M
16.578 6.011 17.125 5.456 QT
17.672 4.901 18.422 4.651 QT
18 4.339 17.781 3.854 QT
17.563 3.37 17.563 2.839 QT
17.563 1.854 18.188 1.089 QT
17.219 0.151 17.219 -1.068 QT
17.219 -1.724 17.5 -2.302 QT
17.781 -2.88 18.289 -3.302 QT
18.797 -3.724 19.406 -3.943 QT
20.016 -4.161 20.672 -4.161 QT
21.922 -4.161 22.906 -3.427 QT
23.344 -3.896 23.93 -4.146 QT
24.516 -4.396 25.156 -4.396 QT
25.609 -4.396 25.898 -4.075 QT
26.188 -3.755 26.188 -3.302 QT
26.188 -3.036 25.992 -2.841 QT
25.797 -2.646 25.531 -2.646 QT
25.266 -2.646 25.07 -2.841 QT
24.875 -3.036 24.875 -3.302 QT
24.875 -3.693 25.141 -3.849 QT
24.047 -3.849 23.266 -3.099 QT
23.656 -2.708 23.883 -2.161 QT
24.109 -1.614 24.109 -1.068 QT
24.109 -0.177 23.617 0.534 QT
23.125 1.245 22.32 1.636 QT
21.516 2.026 20.672 2.026 QT
19.516 2.026 18.563 1.401 QT
18.266 1.823 18.266 2.323 QT
18.266 2.886 18.633 3.3 QT
19 3.714 19.547 3.714 QT
21.266 3.714 L
22.516 3.714 23.523 3.94 QT
24.531 4.167 25.211 4.846 QT
25.891 5.526 25.891 6.761 QT
25.891 7.682 25.117 8.292 QT
24.344 8.901 23.258 9.175 QT
22.172 9.448 21.25 9.448 QT
20.313 9.448 19.227 9.175 QT
18.141 8.901 17.359 8.292 QT
16.578 7.682 16.578 6.761 QT
cp
17.766 6.761 M
17.766 7.464 18.336 7.94 QT
18.906 8.417 19.719 8.651 QT
20.531 8.886 21.25 8.886 QT
21.953 8.886 22.766 8.651 QT
23.578 8.417 24.148 7.94 QT
24.719 7.464 24.719 6.761 QT
24.719 5.667 23.711 5.339 QT
22.703 5.011 21.266 5.011 QT
19.547 5.011 L
19.063 5.011 18.656 5.245 QT
18.25 5.479 18.008 5.893 QT
17.766 6.307 17.766 6.761 QT
cp
20.672 1.464 M
22.453 1.464 22.453 -1.068 QT
22.453 -2.177 22.07 -2.888 QT
21.688 -3.599 20.672 -3.599 QT
19.641 -3.599 19.258 -2.888 QT
18.875 -2.177 18.875 -1.068 QT
18.875 -0.38 19.023 0.182 QT
19.172 0.745 19.563 1.104 QT
19.953 1.464 20.672 1.464 QT
cp
f
GR
GS
[0.75 0 0 0.75 314.11361 48.61029] CT
N
31.901 5.354 M
30.62 5.354 29.55 4.682 QT
28.479 4.011 27.862 2.886 QT
27.245 1.761 27.245 0.511 QT
27.245 -0.708 27.807 -1.818 QT
28.37 -2.927 29.37 -3.607 QT
30.37 -4.286 31.604 -4.286 QT
32.557 -4.286 33.276 -3.966 QT
33.995 -3.646 34.456 -3.075 QT
34.917 -2.505 35.151 -1.724 QT
35.385 -0.943 35.385 -0.005 QT
35.385 0.276 35.167 0.276 QT
29.089 0.276 L
29.089 0.495 L
29.089 2.245 29.792 3.495 QT
30.495 4.745 32.089 4.745 QT
32.729 4.745 33.276 4.456 QT
33.823 4.167 34.229 3.651 QT
34.635 3.136 34.776 2.557 QT
34.792 2.479 34.854 2.425 QT
34.917 2.37 34.979 2.37 QT
35.167 2.37 L
35.385 2.37 35.385 2.636 QT
35.089 3.823 34.104 4.589 QT
33.12 5.354 31.901 5.354 QT
cp
29.104 -0.255 M
33.901 -0.255 L
33.901 -1.036 33.675 -1.849 QT
33.448 -2.661 32.94 -3.2 QT
32.432 -3.739 31.604 -3.739 QT
30.417 -3.739 29.76 -2.63 QT
29.104 -1.521 29.104 -0.255 QT
cp
f
GR
GS
[0.75 0 0 0.75 314.11361 48.61029] CT
N
36.773 5.12 M
36.773 4.386 L
37.492 4.386 37.953 4.268 QT
38.414 4.151 38.414 3.714 QT
38.414 -2.021 L
38.414 -2.583 38.242 -2.833 QT
38.07 -3.083 37.758 -3.138 QT
37.445 -3.193 36.773 -3.193 QT
36.773 -3.927 L
39.82 -4.161 L
39.82 -2.114 L
40.242 -3.005 41.07 -3.583 QT
41.898 -4.161 42.867 -4.161 QT
44.32 -4.161 45.054 -3.466 QT
45.789 -2.771 45.789 -1.333 QT
45.789 3.714 L
45.789 4.151 46.25 4.268 QT
46.711 4.386 47.429 4.386 QT
47.429 5.12 L
42.617 5.12 L
42.617 4.386 L
43.336 4.386 43.797 4.268 QT
44.258 4.151 44.258 3.714 QT
44.258 -1.271 L
44.258 -2.286 43.961 -2.95 QT
43.664 -3.614 42.742 -3.614 QT
41.523 -3.614 40.734 -2.638 QT
39.945 -1.661 39.945 -0.427 QT
39.945 3.714 L
39.945 4.151 40.414 4.268 QT
40.883 4.386 41.586 4.386 QT
41.586 5.12 L
36.773 5.12 L
cp
f
GR
GS
[0.75 0 0 0.75 314.11361 48.61029] CT
N
49.548 2.604 M
49.548 -3.193 L
47.814 -3.193 L
47.814 -3.739 L
49.189 -3.739 49.829 -5.021 QT
50.47 -6.302 50.47 -7.802 QT
51.079 -7.802 L
51.079 -3.927 L
54.048 -3.927 L
54.048 -3.193 L
51.079 -3.193 L
51.079 2.557 L
51.079 3.432 51.368 4.089 QT
51.657 4.745 52.423 4.745 QT
53.142 4.745 53.462 4.05 QT
53.782 3.354 53.782 2.557 QT
53.782 1.323 L
54.376 1.323 L
54.376 2.604 L
54.376 3.261 54.134 3.901 QT
53.892 4.542 53.423 4.948 QT
52.954 5.354 52.282 5.354 QT
51.017 5.354 50.282 4.604 QT
49.548 3.854 49.548 2.604 QT
cp
f
GR
GS
[0.75 0 0 0.75 314.11361 48.61029] CT
N
64.768 5.12 M
64.768 4.386 L
67.393 4.386 67.393 3.714 QT
67.393 -7.302 L
66.299 -6.786 64.643 -6.786 QT
64.643 -7.521 L
67.221 -7.521 68.534 -8.864 QT
68.831 -8.864 L
68.893 -8.864 68.963 -8.81 QT
69.034 -8.755 69.034 -8.677 QT
69.034 3.714 L
69.034 4.386 71.659 4.386 QT
71.659 5.12 L
64.768 5.12 L
cp
f
GR
GS
[0.75 0 0 0.75 0 0] CT
0.2 0.702 0.2 RC
1 LJ
0.667 LW
N
375.985 64.814 M
415.83 64.814 L
S
GR
GS
[0.75 0 0 0.75 314.11361 68.20343] CT
N
/f-597267615{0.672 5.12 M
0.672 4.386 L
2.547 4.386 2.984 3.136 QT
7.391 -9.693 L
7.453 -9.911 7.734 -9.911 QT
8 -9.911 L
8.281 -9.911 8.344 -9.693 QT
12.938 3.714 L
13.141 4.151 13.688 4.268 QT
14.234 4.386 15.047 4.386 QT
15.047 5.12 L
9.203 5.12 L
9.203 4.386 L
10.938 4.386 10.938 3.823 QT
10.938 3.714 L
9.797 0.432 L
4.703 0.432 L
3.766 3.136 L
3.75 3.214 3.75 3.354 QT
3.75 3.886 4.242 4.136 QT
4.734 4.386 5.313 4.386 QT
5.313 5.12 L
0.672 5.12 L
cp
4.953 -0.302 M
9.563 -0.302 L
7.25 -7.005 L
4.953 -0.302 L
cp}def
f-597267615
f
GR
GS
[0.75 0 0 0.75 314.11361 68.20343] CT
N
/f-745240314{16.578 6.761 M
16.578 6.011 17.125 5.456 QT
17.672 4.901 18.422 4.651 QT
18 4.339 17.781 3.854 QT
17.563 3.37 17.563 2.839 QT
17.563 1.854 18.188 1.089 QT
17.219 0.151 17.219 -1.068 QT
17.219 -1.724 17.5 -2.302 QT
17.781 -2.88 18.289 -3.302 QT
18.797 -3.724 19.406 -3.943 QT
20.016 -4.161 20.672 -4.161 QT
21.922 -4.161 22.906 -3.427 QT
23.344 -3.896 23.93 -4.146 QT
24.516 -4.396 25.156 -4.396 QT
25.609 -4.396 25.898 -4.075 QT
26.188 -3.755 26.188 -3.302 QT
26.188 -3.036 25.992 -2.841 QT
25.797 -2.646 25.531 -2.646 QT
25.266 -2.646 25.07 -2.841 QT
24.875 -3.036 24.875 -3.302 QT
24.875 -3.693 25.141 -3.849 QT
24.047 -3.849 23.266 -3.099 QT
23.656 -2.708 23.883 -2.161 QT
24.109 -1.614 24.109 -1.068 QT
24.109 -0.177 23.617 0.534 QT
23.125 1.245 22.32 1.636 QT
21.516 2.026 20.672 2.026 QT
19.516 2.026 18.563 1.401 QT
18.266 1.823 18.266 2.323 QT
18.266 2.886 18.633 3.3 QT
19 3.714 19.547 3.714 QT
21.266 3.714 L
22.516 3.714 23.523 3.94 QT
24.531 4.167 25.211 4.846 QT
25.891 5.526 25.891 6.761 QT
25.891 7.682 25.117 8.292 QT
24.344 8.901 23.258 9.175 QT
22.172 9.448 21.25 9.448 QT
20.313 9.448 19.227 9.175 QT
18.141 8.901 17.359 8.292 QT
16.578 7.682 16.578 6.761 QT
cp
17.766 6.761 M
17.766 7.464 18.336 7.94 QT
18.906 8.417 19.719 8.651 QT
20.531 8.886 21.25 8.886 QT
21.953 8.886 22.766 8.651 QT
23.578 8.417 24.148 7.94 QT
24.719 7.464 24.719 6.761 QT
24.719 5.667 23.711 5.339 QT
22.703 5.011 21.266 5.011 QT
19.547 5.011 L
19.063 5.011 18.656 5.245 QT
18.25 5.479 18.008 5.893 QT
17.766 6.307 17.766 6.761 QT
cp
20.672 1.464 M
22.453 1.464 22.453 -1.068 QT
22.453 -2.177 22.07 -2.888 QT
21.688 -3.599 20.672 -3.599 QT
19.641 -3.599 19.258 -2.888 QT
18.875 -2.177 18.875 -1.068 QT
18.875 -0.38 19.023 0.182 QT
19.172 0.745 19.563 1.104 QT
19.953 1.464 20.672 1.464 QT
cp}def
f-745240314
f
GR
GS
[0.75 0 0 0.75 314.11361 68.20343] CT
N
/f1964844890{31.901 5.354 M
30.62 5.354 29.55 4.682 QT
28.479 4.011 27.862 2.886 QT
27.245 1.761 27.245 0.511 QT
27.245 -0.708 27.807 -1.818 QT
28.37 -2.927 29.37 -3.607 QT
30.37 -4.286 31.604 -4.286 QT
32.557 -4.286 33.276 -3.966 QT
33.995 -3.646 34.456 -3.075 QT
34.917 -2.505 35.151 -1.724 QT
35.385 -0.943 35.385 -0.005 QT
35.385 0.276 35.167 0.276 QT
29.089 0.276 L
29.089 0.495 L
29.089 2.245 29.792 3.495 QT
30.495 4.745 32.089 4.745 QT
32.729 4.745 33.276 4.456 QT
33.823 4.167 34.229 3.651 QT
34.635 3.136 34.776 2.557 QT
34.792 2.479 34.854 2.425 QT
34.917 2.37 34.979 2.37 QT
35.167 2.37 L
35.385 2.37 35.385 2.636 QT
35.089 3.823 34.104 4.589 QT
33.12 5.354 31.901 5.354 QT
cp
29.104 -0.255 M
33.901 -0.255 L
33.901 -1.036 33.675 -1.849 QT
33.448 -2.661 32.94 -3.2 QT
32.432 -3.739 31.604 -3.739 QT
30.417 -3.739 29.76 -2.63 QT
29.104 -1.521 29.104 -0.255 QT
cp}def
f1964844890
f
GR
GS
[0.75 0 0 0.75 314.11361 68.20343] CT
N
/f1881606250{36.773 5.12 M
36.773 4.386 L
37.492 4.386 37.953 4.268 QT
38.414 4.151 38.414 3.714 QT
38.414 -2.021 L
38.414 -2.583 38.242 -2.833 QT
38.07 -3.083 37.758 -3.138 QT
37.445 -3.193 36.773 -3.193 QT
36.773 -3.927 L
39.82 -4.161 L
39.82 -2.114 L
40.242 -3.005 41.07 -3.583 QT
41.898 -4.161 42.867 -4.161 QT
44.32 -4.161 45.054 -3.466 QT
45.789 -2.771 45.789 -1.333 QT
45.789 3.714 L
45.789 4.151 46.25 4.268 QT
46.711 4.386 47.429 4.386 QT
47.429 5.12 L
42.617 5.12 L
42.617 4.386 L
43.336 4.386 43.797 4.268 QT
44.258 4.151 44.258 3.714 QT
44.258 -1.271 L
44.258 -2.286 43.961 -2.95 QT
43.664 -3.614 42.742 -3.614 QT
41.523 -3.614 40.734 -2.638 QT
39.945 -1.661 39.945 -0.427 QT
39.945 3.714 L
39.945 4.151 40.414 4.268 QT
40.883 4.386 41.586 4.386 QT
41.586 5.12 L
36.773 5.12 L
cp}def
f1881606250
f
GR
GS
[0.75 0 0 0.75 314.11361 68.20343] CT
N
/f-1218143468{49.548 2.604 M
49.548 -3.193 L
47.814 -3.193 L
47.814 -3.739 L
49.189 -3.739 49.829 -5.021 QT
50.47 -6.302 50.47 -7.802 QT
51.079 -7.802 L
51.079 -3.927 L
54.048 -3.927 L
54.048 -3.193 L
51.079 -3.193 L
51.079 2.557 L
51.079 3.432 51.368 4.089 QT
51.657 4.745 52.423 4.745 QT
53.142 4.745 53.462 4.05 QT
53.782 3.354 53.782 2.557 QT
53.782 1.323 L
54.376 1.323 L
54.376 2.604 L
54.376 3.261 54.134 3.901 QT
53.892 4.542 53.423 4.948 QT
52.954 5.354 52.282 5.354 QT
51.017 5.354 50.282 4.604 QT
49.548 3.854 49.548 2.604 QT
cp}def
f-1218143468
f
GR
GS
[0.75 0 0 0.75 314.11361 68.20343] CT
N
/f-1429999007{63.862 5.12 M
63.862 4.557 L
63.862 4.511 63.909 4.448 QT
67.159 0.839 L
67.909 0.026 68.37 -0.513 QT
68.831 -1.052 69.276 -1.763 QT
69.721 -2.474 69.987 -3.2 QT
70.252 -3.927 70.252 -4.755 QT
70.252 -5.614 69.932 -6.404 QT
69.612 -7.193 68.979 -7.661 QT
68.346 -8.13 67.456 -8.13 QT
66.549 -8.13 65.823 -7.583 QT
65.096 -7.036 64.799 -6.161 QT
64.877 -6.177 65.018 -6.177 QT
65.487 -6.177 65.823 -5.864 QT
66.159 -5.552 66.159 -5.036 QT
66.159 -4.568 65.823 -4.232 QT
65.487 -3.896 65.018 -3.896 QT
64.534 -3.896 64.198 -4.239 QT
63.862 -4.583 63.862 -5.036 QT
63.862 -5.833 64.159 -6.521 QT
64.456 -7.208 65.018 -7.747 QT
65.581 -8.286 66.276 -8.575 QT
66.971 -8.864 67.768 -8.864 QT
68.971 -8.864 70.002 -8.357 QT
71.034 -7.849 71.643 -6.919 QT
72.252 -5.989 72.252 -4.755 QT
72.252 -3.849 71.854 -3.029 QT
71.456 -2.208 70.831 -1.536 QT
70.206 -0.864 69.229 -0.013 QT
68.252 0.839 67.94 1.136 QT
65.565 3.417 L
67.581 3.417 L
69.065 3.417 70.065 3.393 QT
71.065 3.37 71.127 3.307 QT
71.377 3.042 71.627 1.37 QT
72.252 1.37 L
71.659 5.12 L
63.862 5.12 L
cp}def
f-1429999007
f
GR
GS
[0.75 0 0 0.75 0 0] CT
1 LJ
0.667 LW
N
375.985 90.938 M
415.83 90.938 L
S
GR
GS
[0.75 0 0 0.75 314.11361 87.79657] CT
N
f-597267615
f
GR
GS
[0.75 0 0 0.75 314.11361 87.79657] CT
N
f-745240314
f
GR
GS
[0.75 0 0 0.75 314.11361 87.79657] CT
N
f1964844890
f
GR
GS
[0.75 0 0 0.75 314.11361 87.79657] CT
N
f1881606250
f
GR
GS
[0.75 0 0 0.75 314.11361 87.79657] CT
N
f-1218143468
f
GR
GS
[0.75 0 0 0.75 314.11361 87.79657] CT
N
/f300774680{64.815 3.495 M
65.299 4.214 66.135 4.565 QT
66.971 4.917 67.924 4.917 QT
69.143 4.917 69.659 3.878 QT
70.174 2.839 70.174 1.511 QT
70.174 0.917 70.065 0.323 QT
69.956 -0.271 69.698 -0.786 QT
69.44 -1.302 68.995 -1.607 QT
68.549 -1.911 67.909 -1.911 QT
66.502 -1.911 L
66.315 -1.911 66.315 -2.114 QT
66.315 -2.286 L
66.315 -2.458 66.502 -2.458 QT
67.659 -2.552 L
68.409 -2.552 68.893 -3.107 QT
69.377 -3.661 69.604 -4.45 QT
69.831 -5.239 69.831 -5.958 QT
69.831 -6.974 69.362 -7.614 QT
68.893 -8.255 67.924 -8.255 QT
67.127 -8.255 66.393 -7.958 QT
65.659 -7.661 65.237 -7.036 QT
65.284 -7.052 65.307 -7.06 QT
65.331 -7.068 65.377 -7.068 QT
65.846 -7.068 66.166 -6.739 QT
66.487 -6.411 66.487 -5.943 QT
66.487 -5.489 66.166 -5.161 QT
65.846 -4.833 65.377 -4.833 QT
64.924 -4.833 64.596 -5.161 QT
64.268 -5.489 64.268 -5.943 QT
64.268 -6.849 64.807 -7.513 QT
65.346 -8.177 66.206 -8.521 QT
67.065 -8.864 67.924 -8.864 QT
68.565 -8.864 69.268 -8.677 QT
69.971 -8.489 70.549 -8.138 QT
71.127 -7.786 71.487 -7.232 QT
71.846 -6.677 71.846 -5.958 QT
71.846 -5.083 71.456 -4.333 QT
71.065 -3.583 70.377 -3.044 QT
69.69 -2.505 68.862 -2.239 QT
69.784 -2.052 70.604 -1.544 QT
71.424 -1.036 71.916 -0.232 QT
72.409 0.573 72.409 1.495 QT
72.409 2.651 71.776 3.589 QT
71.143 4.526 70.104 5.057 QT
69.065 5.589 67.924 5.589 QT
66.94 5.589 65.948 5.214 QT
64.956 4.839 64.323 4.089 QT
63.69 3.339 63.69 2.292 QT
63.69 1.761 64.041 1.417 QT
64.393 1.073 64.924 1.073 QT
65.252 1.073 65.534 1.229 QT
65.815 1.386 65.979 1.675 QT
66.143 1.964 66.143 2.292 QT
66.143 2.807 65.784 3.151 QT
65.424 3.495 64.924 3.495 QT
64.815 3.495 L
cp}def
f300774680
f
GR
GS
[0.75 0 0 0.75 0 0] CT
0 0 1 RC
1 LJ
0.667 LW
N
375.985 117.062 M
415.83 117.062 L
S
GR
GS
[0.75 0 0 0.75 314.11361 107.38971] CT
N
f-597267615
f
GR
GS
[0.75 0 0 0.75 314.11361 107.38971] CT
N
f-745240314
f
GR
GS
[0.75 0 0 0.75 314.11361 107.38971] CT
N
f1964844890
f
GR
GS
[0.75 0 0 0.75 314.11361 107.38971] CT
N
f1881606250
f
GR
GS
[0.75 0 0 0.75 314.11361 107.38971] CT
N
f-1218143468
f
GR
GS
[0.75 0 0 0.75 314.11361 107.38971] CT
N
/f-1674298674{63.393 1.651 M
63.393 0.917 L
69.893 -8.771 L
69.956 -8.864 70.112 -8.864 QT
70.409 -8.864 L
70.643 -8.864 70.643 -8.63 QT
70.643 0.917 L
72.706 0.917 L
72.706 1.651 L
70.643 1.651 L
70.643 3.714 L
70.643 4.151 71.26 4.268 QT
71.877 4.386 72.69 4.386 QT
72.69 5.12 L
66.909 5.12 L
66.909 4.386 L
67.721 4.386 68.331 4.268 QT
68.94 4.151 68.94 3.714 QT
68.94 1.651 L
63.393 1.651 L
cp
64.096 0.917 M
69.065 0.917 L
69.065 -6.521 L
64.096 0.917 L
cp}def
f-1674298674
f
GR
GS
[0.75 0 0 0.75 0 0] CT
0.6 0.2 0.2 RC
1 LJ
0.667 LW
N
375.985 143.186 M
415.83 143.186 L
S
GR
GS
[0.75 0 0 0.75 0 0] CT
0.149 GC
10.0 ML
0.667 LW
N
372 158 M
372 50 L
496 50 L
496 158 L
cp
S
GR
%%Trailer
%%Pages: 1
%%EOF
