%!PS-Adobe-3.0 EPSF-3.0
%%Creator: (MATLAB, The Mathworks, Inc. Version 9.12.0.2529717 \(R2022a\) Update 8. Operating System: Linux)
%%Title: plots/Example7c_ry_dot.eps
%%CreationDate: 2024-06-26T03:18:15
%%Pages: (atend)
%%BoundingBox:    15     3   392   335
%%LanguageLevel: 3
%%EndComments
%%BeginProlog
%%BeginResource: procset (Apache XML Graphics Std ProcSet) 1.2 0
%%Version: 1.2 0
%%Copyright: (Copyright 2001-2003,2010 The Apache Software Foundation. License terms: http://www.apache.org/licenses/LICENSE-2.0)
/bd{bind def}bind def
/ld{load def}bd
/GR/grestore ld
/GS/gsave ld
/RM/rmoveto ld
/C/curveto ld
/t/show ld
/L/lineto ld
/ML/setmiterlimit ld
/CT/concat ld
/f/fill ld
/N/newpath ld
/S/stroke ld
/CC/setcmykcolor ld
/A/ashow ld
/cp/closepath ld
/RC/setrgbcolor ld
/LJ/setlinejoin ld
/GC/setgray ld
/LW/setlinewidth ld
/M/moveto ld
/re {4 2 roll M
1 index 0 rlineto
0 exch rlineto
neg 0 rlineto
cp } bd
/_ctm matrix def
/_tm matrix def
/BT { _ctm currentmatrix pop matrix _tm copy pop 0 0 moveto } bd
/ET { _ctm setmatrix } bd
/iTm { _ctm setmatrix _tm concat } bd
/Tm { _tm astore pop iTm 0 0 moveto } bd
/ux 0.0 def
/uy 0.0 def
/F {
  /Tp exch def
  /Tf exch def
  Tf findfont Tp scalefont setfont
  /cf Tf def  /cs Tp def
} bd
/ULS {currentpoint /uy exch def /ux exch def} bd
/ULE {
  /Tcx currentpoint pop def
  gsave
  newpath
  cf findfont cs scalefont dup
  /FontMatrix get 0 get /Ts exch def /FontInfo get dup
  /UnderlinePosition get Ts mul /To exch def
  /UnderlineThickness get Ts mul /Tt exch def
  ux uy To add moveto  Tcx uy To add lineto
  Tt setlinewidth stroke
  grestore
} bd
/OLE {
  /Tcx currentpoint pop def
  gsave
  newpath
  cf findfont cs scalefont dup
  /FontMatrix get 0 get /Ts exch def /FontInfo get dup
  /UnderlinePosition get Ts mul /To exch def
  /UnderlineThickness get Ts mul /Tt exch def
  ux uy To add cs add moveto Tcx uy To add cs add lineto
  Tt setlinewidth stroke
  grestore
} bd
/SOE {
  /Tcx currentpoint pop def
  gsave
  newpath
  cf findfont cs scalefont dup
  /FontMatrix get 0 get /Ts exch def /FontInfo get dup
  /UnderlinePosition get Ts mul /To exch def
  /UnderlineThickness get Ts mul /Tt exch def
  ux uy To add cs 10 mul 26 idiv add moveto Tcx uy To add cs 10 mul 26 idiv add lineto
  Tt setlinewidth stroke
  grestore
} bd
/QT {
/Y22 exch store
/X22 exch store
/Y21 exch store
/X21 exch store
currentpoint
/Y21 load 2 mul add 3 div exch
/X21 load 2 mul add 3 div exch
/X21 load 2 mul /X22 load add 3 div
/Y21 load 2 mul /Y22 load add 3 div
/X22 load /Y22 load curveto
} bd
/SSPD {
dup length /d exch dict def
{
/v exch def
/k exch def
currentpagedevice k known {
/cpdv currentpagedevice k get def
v cpdv ne {
/upd false def
/nullv v type /nulltype eq def
/nullcpdv cpdv type /nulltype eq def
nullv nullcpdv or
{
/upd true def
} {
/sametype v type cpdv type eq def
sametype {
v type /arraytype eq {
/vlen v length def
/cpdvlen cpdv length def
vlen cpdvlen eq {
0 1 vlen 1 sub {
/i exch def
/obj v i get def
/cpdobj cpdv i get def
obj cpdobj ne {
/upd true def
exit
} if
} for
} {
/upd true def
} ifelse
} {
v type /dicttype eq {
v {
/dv exch def
/dk exch def
/cpddv cpdv dk get def
dv cpddv ne {
/upd true def
exit
} if
} forall
} {
/upd true def
} ifelse
} ifelse
} if
} ifelse
upd true eq {
d k v put
} if
} if
} if
} forall
d length 0 gt {
d setpagedevice
} if
} bd
/RE { % /NewFontName [NewEncodingArray] /FontName RE -
  findfont dup length dict begin
  {
    1 index /FID ne
    {def} {pop pop} ifelse
  } forall
  /Encoding exch def
  /FontName 1 index def
  currentdict definefont pop
  end
} bind def
%%EndResource
%%BeginResource: procset (Apache XML Graphics EPS ProcSet) 1.0 0
%%Version: 1.0 0
%%Copyright: (Copyright 2002-2003 The Apache Software Foundation. License terms: http://www.apache.org/licenses/LICENSE-2.0)
/BeginEPSF { %def
/b4_Inc_state save def         % Save state for cleanup
/dict_count countdictstack def % Count objects on dict stack
/op_count count 1 sub def      % Count objects on operand stack
userdict begin                 % Push userdict on dict stack
/showpage { } def              % Redefine showpage, { } = null proc
0 setgray 0 setlinecap         % Prepare graphics state
1 setlinewidth 0 setlinejoin
10 setmiterlimit [ ] 0 setdash newpath
/languagelevel where           % If level not equal to 1 then
{pop languagelevel             % set strokeadjust and
1 ne                           % overprint to their defaults.
{false setstrokeadjust false setoverprint
} if
} if
} bd
/EndEPSF { %def
count op_count sub {pop} repeat            % Clean up stacks
countdictstack dict_count sub {end} repeat
b4_Inc_state restore
} bd
%%EndResource
%FOPBeginFontDict
%%IncludeResource: font Courier-Oblique
%%IncludeResource: font Courier-BoldOblique
%%IncludeResource: font Courier-Bold
%%IncludeResource: font ZapfDingbats
%%IncludeResource: font Symbol
%%IncludeResource: font Helvetica
%%IncludeResource: font Helvetica-Oblique
%%IncludeResource: font Helvetica-Bold
%%IncludeResource: font Helvetica-BoldOblique
%%IncludeResource: font Times-Roman
%%IncludeResource: font Times-Italic
%%IncludeResource: font Times-Bold
%%IncludeResource: font Times-BoldItalic
%%IncludeResource: font Courier
%FOPEndFontDict
%%BeginResource: encoding WinAnsiEncoding
/WinAnsiEncoding [
/.notdef /.notdef /.notdef /.notdef /.notdef
/.notdef /.notdef /.notdef /.notdef /.notdef
/.notdef /.notdef /.notdef /.notdef /.notdef
/.notdef /.notdef /.notdef /.notdef /.notdef
/.notdef /.notdef /.notdef /.notdef /.notdef
/.notdef /.notdef /.notdef /.notdef /.notdef
/.notdef /.notdef /space /exclam /quotedbl
/numbersign /dollar /percent /ampersand /quotesingle
/parenleft /parenright /asterisk /plus /comma
/hyphen /period /slash /zero /one
/two /three /four /five /six
/seven /eight /nine /colon /semicolon
/less /equal /greater /question /at
/A /B /C /D /E
/F /G /H /I /J
/K /L /M /N /O
/P /Q /R /S /T
/U /V /W /X /Y
/Z /bracketleft /backslash /bracketright /asciicircum
/underscore /quoteleft /a /b /c
/d /e /f /g /h
/i /j /k /l /m
/n /o /p /q /r
/s /t /u /v /w
/x /y /z /braceleft /bar
/braceright /asciitilde /bullet /Euro /bullet
/quotesinglbase /florin /quotedblbase /ellipsis /dagger
/daggerdbl /circumflex /perthousand /Scaron /guilsinglleft
/OE /bullet /Zcaron /bullet /bullet
/quoteleft /quoteright /quotedblleft /quotedblright /bullet
/endash /emdash /asciitilde /trademark /scaron
/guilsinglright /oe /bullet /zcaron /Ydieresis
/space /exclamdown /cent /sterling /currency
/yen /brokenbar /section /dieresis /copyright
/ordfeminine /guillemotleft /logicalnot /sfthyphen /registered
/macron /degree /plusminus /twosuperior /threesuperior
/acute /mu /paragraph /middot /cedilla
/onesuperior /ordmasculine /guillemotright /onequarter /onehalf
/threequarters /questiondown /Agrave /Aacute /Acircumflex
/Atilde /Adieresis /Aring /AE /Ccedilla
/Egrave /Eacute /Ecircumflex /Edieresis /Igrave
/Iacute /Icircumflex /Idieresis /Eth /Ntilde
/Ograve /Oacute /Ocircumflex /Otilde /Odieresis
/multiply /Oslash /Ugrave /Uacute /Ucircumflex
/Udieresis /Yacute /Thorn /germandbls /agrave
/aacute /acircumflex /atilde /adieresis /aring
/ae /ccedilla /egrave /eacute /ecircumflex
/edieresis /igrave /iacute /icircumflex /idieresis
/eth /ntilde /ograve /oacute /ocircumflex
/otilde /odieresis /divide /oslash /ugrave
/uacute /ucircumflex /udieresis /yacute /thorn
/ydieresis
] def
%%EndResource
%FOPBeginFontReencode
/Courier-Oblique findfont
dup length dict begin
  {1 index /FID ne {def} {pop pop} ifelse} forall
  /Encoding WinAnsiEncoding def
  currentdict
end
/Courier-Oblique exch definefont pop
/Courier-BoldOblique findfont
dup length dict begin
  {1 index /FID ne {def} {pop pop} ifelse} forall
  /Encoding WinAnsiEncoding def
  currentdict
end
/Courier-BoldOblique exch definefont pop
/Courier-Bold findfont
dup length dict begin
  {1 index /FID ne {def} {pop pop} ifelse} forall
  /Encoding WinAnsiEncoding def
  currentdict
end
/Courier-Bold exch definefont pop
/Helvetica findfont
dup length dict begin
  {1 index /FID ne {def} {pop pop} ifelse} forall
  /Encoding WinAnsiEncoding def
  currentdict
end
/Helvetica exch definefont pop
/Helvetica-Oblique findfont
dup length dict begin
  {1 index /FID ne {def} {pop pop} ifelse} forall
  /Encoding WinAnsiEncoding def
  currentdict
end
/Helvetica-Oblique exch definefont pop
/Helvetica-Bold findfont
dup length dict begin
  {1 index /FID ne {def} {pop pop} ifelse} forall
  /Encoding WinAnsiEncoding def
  currentdict
end
/Helvetica-Bold exch definefont pop
/Helvetica-BoldOblique findfont
dup length dict begin
  {1 index /FID ne {def} {pop pop} ifelse} forall
  /Encoding WinAnsiEncoding def
  currentdict
end
/Helvetica-BoldOblique exch definefont pop
/Times-Roman findfont
dup length dict begin
  {1 index /FID ne {def} {pop pop} ifelse} forall
  /Encoding WinAnsiEncoding def
  currentdict
end
/Times-Roman exch definefont pop
/Times-Italic findfont
dup length dict begin
  {1 index /FID ne {def} {pop pop} ifelse} forall
  /Encoding WinAnsiEncoding def
  currentdict
end
/Times-Italic exch definefont pop
/Times-Bold findfont
dup length dict begin
  {1 index /FID ne {def} {pop pop} ifelse} forall
  /Encoding WinAnsiEncoding def
  currentdict
end
/Times-Bold exch definefont pop
/Times-BoldItalic findfont
dup length dict begin
  {1 index /FID ne {def} {pop pop} ifelse} forall
  /Encoding WinAnsiEncoding def
  currentdict
end
/Times-BoldItalic exch definefont pop
/Courier findfont
dup length dict begin
  {1 index /FID ne {def} {pop pop} ifelse} forall
  /Encoding WinAnsiEncoding def
  currentdict
end
/Courier exch definefont pop
%FOPEndFontReencode
%%EndProlog
%%Page: 1 1
%%PageBoundingBox: 0 0 428 338
%%BeginPageSetup
N
   15     3 M
  407     3 L
  407   338 L
   15   338 L
cp
clip
[1 0 0 -1 0 338] CT
%%EndPageSetup
GS
[0.75 0 0 0.75 0 0.5] CT
N
0 0 M
570 0 L
570 450 L
0 450 L
0 0 L
cp
clip
1 GC
N
0 0 570 450 re
f
GR
GS
[0.75 0 0 0.75 0 0.5] CT
1 GC
N
0 0 570 450 re
f
GR
GS
[0.75 0 0 0.75 0 0.5] CT
1 GC
N
74 390 M
516 390 L
516 38 L
74 38 L
cp
f
GR
GS
[0.75 0 0 0.75 0 0.5] CT
0.873 GC
1 LJ
0.667 LW
N
74 390 M
74 38 L
S
GR
GS
[0.75 0 0 0.75 0 0.5] CT
0.873 GC
1 LJ
0.667 LW
N
129.25 390 M
129.25 38 L
S
GR
GS
[0.75 0 0 0.75 0 0.5] CT
0.873 GC
1 LJ
0.667 LW
N
184.5 390 M
184.5 38 L
S
GR
GS
[0.75 0 0 0.75 0 0.5] CT
0.873 GC
1 LJ
0.667 LW
N
239.75 390 M
239.75 38 L
S
GR
GS
[0.75 0 0 0.75 0 0.5] CT
0.873 GC
1 LJ
0.667 LW
N
295 390 M
295 38 L
S
GR
GS
[0.75 0 0 0.75 0 0.5] CT
0.873 GC
1 LJ
0.667 LW
N
350.25 390 M
350.25 38 L
S
GR
GS
[0.75 0 0 0.75 0 0.5] CT
0.873 GC
1 LJ
0.667 LW
N
405.5 390 M
405.5 38 L
S
GR
GS
[0.75 0 0 0.75 0 0.5] CT
0.873 GC
1 LJ
0.667 LW
N
460.75 390 M
460.75 38 L
S
GR
GS
[0.75 0 0 0.75 0 0.5] CT
0.873 GC
1 LJ
0.667 LW
N
516 390 M
516 38 L
S
GR
GS
[0.75 0 0 0.75 0 0.5] CT
0.873 GC
1 LJ
0.667 LW
N
516 390 M
74 390 L
S
GR
GS
[0.75 0 0 0.75 0 0.5] CT
0.873 GC
1 LJ
0.667 LW
N
516 350.889 M
74 350.889 L
S
GR
GS
[0.75 0 0 0.75 0 0.5] CT
0.873 GC
1 LJ
0.667 LW
N
516 311.778 M
74 311.778 L
S
GR
GS
[0.75 0 0 0.75 0 0.5] CT
0.873 GC
1 LJ
0.667 LW
N
516 272.667 M
74 272.667 L
S
GR
GS
[0.75 0 0 0.75 0 0.5] CT
0.873 GC
1 LJ
0.667 LW
N
516 233.556 M
74 233.556 L
S
GR
GS
[0.75 0 0 0.75 0 0.5] CT
0.873 GC
1 LJ
0.667 LW
N
516 194.444 M
74 194.444 L
S
GR
GS
[0.75 0 0 0.75 0 0.5] CT
0.873 GC
1 LJ
0.667 LW
N
516 155.333 M
74 155.333 L
S
GR
GS
[0.75 0 0 0.75 0 0.5] CT
0.873 GC
1 LJ
0.667 LW
N
516 116.222 M
74 116.222 L
S
GR
GS
[0.75 0 0 0.75 0 0.5] CT
0.873 GC
1 LJ
0.667 LW
N
516 77.111 M
74 77.111 L
S
GR
GS
[0.75 0 0 0.75 0 0.5] CT
0.873 GC
1 LJ
0.667 LW
N
516 38 M
74 38 L
S
GR
GS
[0.75 0 0 0.75 0 0.5] CT
0.149 GC
2 setlinecap
1 LJ
0.667 LW
N
74 390 M
516 390 L
S
GR
GS
[0.75 0 0 0.75 0 0.5] CT
0.149 GC
2 setlinecap
1 LJ
0.667 LW
N
74 390 M
74 385.58 L
S
GR
GS
[0.75 0 0 0.75 0 0.5] CT
0.149 GC
2 setlinecap
1 LJ
0.667 LW
N
129.25 390 M
129.25 385.58 L
S
GR
GS
[0.75 0 0 0.75 0 0.5] CT
0.149 GC
2 setlinecap
1 LJ
0.667 LW
N
184.5 390 M
184.5 385.58 L
S
GR
GS
[0.75 0 0 0.75 0 0.5] CT
0.149 GC
2 setlinecap
1 LJ
0.667 LW
N
239.75 390 M
239.75 385.58 L
S
GR
GS
[0.75 0 0 0.75 0 0.5] CT
0.149 GC
2 setlinecap
1 LJ
0.667 LW
N
295 390 M
295 385.58 L
S
GR
GS
[0.75 0 0 0.75 0 0.5] CT
0.149 GC
2 setlinecap
1 LJ
0.667 LW
N
350.25 390 M
350.25 385.58 L
S
GR
GS
[0.75 0 0 0.75 0 0.5] CT
0.149 GC
2 setlinecap
1 LJ
0.667 LW
N
405.5 390 M
405.5 385.58 L
S
GR
GS
[0.75 0 0 0.75 0 0.5] CT
0.149 GC
2 setlinecap
1 LJ
0.667 LW
N
460.75 390 M
460.75 385.58 L
S
GR
GS
[0.75 0 0 0.75 0 0.5] CT
0.149 GC
2 setlinecap
1 LJ
0.667 LW
N
516 390 M
516 385.58 L
S
GR
GS
[0.75 0 0 0.75 55.5 296.99998] CT
0.149 GC
/Helvetica 13.333 F
GS
[1 0 0 1 0 0] CT
-4 15 moveto 
1 -1 scale
(0) t 
GR
GR
GS
[0.75 0 0 0.75 96.9375 296.99998] CT
0.149 GC
/Helvetica 13.333 F
GS
[1 0 0 1 0 0] CT
-4 15 moveto 
1 -1 scale
(2) t 
GR
GR
GS
[0.75 0 0 0.75 138.375 296.99998] CT
0.149 GC
/Helvetica 13.333 F
GS
[1 0 0 1 0 0] CT
-4 15 moveto 
1 -1 scale
(4) t 
GR
GR
GS
[0.75 0 0 0.75 179.8125 296.99998] CT
0.149 GC
/Helvetica 13.333 F
GS
[1 0 0 1 0 0] CT
-4 15 moveto 
1 -1 scale
(6) t 
GR
GR
GS
[0.75 0 0 0.75 221.25 296.99998] CT
0.149 GC
/Helvetica 13.333 F
GS
[1 0 0 1 0 0] CT
-4 15 moveto 
1 -1 scale
(8) t 
GR
GR
GS
[0.75 0 0 0.75 262.6875 296.99998] CT
0.149 GC
/Helvetica 13.333 F
GS
[1 0 0 1 0 0] CT
-8 15 moveto 
1 -1 scale
(10) t 
GR
GR
GS
[0.75 0 0 0.75 304.125 296.99998] CT
0.149 GC
/Helvetica 13.333 F
GS
[1 0 0 1 0 0] CT
-8 15 moveto 
1 -1 scale
(12) t 
GR
GR
GS
[0.75 0 0 0.75 345.5625 296.99998] CT
0.149 GC
/Helvetica 13.333 F
GS
[1 0 0 1 0 0] CT
-8 15 moveto 
1 -1 scale
(14) t 
GR
GR
GS
[0.75 0 0 0.75 387 296.99998] CT
0.149 GC
/Helvetica 13.333 F
GS
[1 0 0 1 0 0] CT
-8 15 moveto 
1 -1 scale
(16) t 
GR
GR
GS
[0.75 0 0 0.75 221.25016 311.50002] CT
0.149 GC
N
-74.637 22.296 M
-74.637 21.859 -74.544 21.484 QT
-72.45 13.156 L
-75.497 13.156 L
-75.794 13.156 -75.794 12.781 QT
-75.684 12.14 -75.419 12.14 QT
-72.2 12.14 L
-71.044 7.406 L
-70.919 7.031 -70.583 6.757 QT
-70.247 6.484 -69.825 6.484 QT
-69.45 6.484 -69.2 6.702 QT
-68.95 6.921 -68.95 7.296 QT
-68.95 7.374 -68.958 7.429 QT
-68.965 7.484 -68.981 7.531 QT
-70.153 12.14 L
-67.153 12.14 L
-66.856 12.14 -66.856 12.515 QT
-66.872 12.593 -66.919 12.765 QT
-66.965 12.937 -67.036 13.046 QT
-67.106 13.156 -67.247 13.156 QT
-70.403 13.156 L
-72.481 21.546 L
-72.7 22.359 -72.7 22.952 QT
-72.7 24.202 -71.84 24.202 QT
-70.575 24.202 -69.59 23.007 QT
-68.606 21.812 -68.075 20.374 QT
-67.965 20.202 -67.856 20.202 QT
-67.497 20.202 L
-67.387 20.202 -67.317 20.281 QT
-67.247 20.359 -67.247 20.468 QT
-67.247 20.515 -67.278 20.546 QT
-67.903 22.296 -69.122 23.632 QT
-70.34 24.968 -71.919 24.968 QT
-73.059 24.968 -73.848 24.218 QT
-74.637 23.468 -74.637 22.296 QT
cp
f
GR
GS
[0.75 0 0 0.75 221.25016 311.50002] CT
0.149 GC
N
-63.576 22.562 M
-63.576 22.015 -63.342 21.421 QT
-60.998 15.187 L
-60.623 14.124 -60.623 13.437 QT
-60.623 12.577 -61.248 12.577 QT
-62.404 12.577 -63.146 13.757 QT
-63.889 14.937 -64.248 16.406 QT
-64.295 16.577 -64.482 16.577 QT
-64.826 16.577 L
-65.06 16.577 -65.06 16.312 QT
-65.06 16.234 L
-64.592 14.499 -63.631 13.163 QT
-62.67 11.827 -61.201 11.827 QT
-60.17 11.827 -59.451 12.507 QT
-58.732 13.187 -58.732 14.234 QT
-58.732 14.765 -58.967 15.359 QT
-61.326 21.593 L
-61.717 22.562 -61.717 23.343 QT
-61.717 24.202 -61.06 24.202 QT
-59.92 24.202 -59.162 22.991 QT
-58.404 21.781 -58.092 20.374 QT
-58.045 20.202 -57.873 20.202 QT
-57.514 20.202 L
-57.404 20.202 -57.334 20.281 QT
-57.264 20.359 -57.264 20.468 QT
-57.264 20.484 -57.295 20.546 QT
-57.685 22.187 -58.67 23.577 QT
-59.654 24.968 -61.107 24.968 QT
-62.139 24.968 -62.857 24.265 QT
-63.576 23.562 -63.576 22.562 QT
cp
-60.31 7.062 M
-60.31 6.452 -59.795 5.96 QT
-59.279 5.468 -58.67 5.468 QT
-58.185 5.468 -57.865 5.773 QT
-57.545 6.077 -57.545 6.546 QT
-57.545 7.187 -58.06 7.679 QT
-58.576 8.171 -59.201 8.171 QT
-59.67 8.171 -59.99 7.851 QT
-60.31 7.531 -60.31 7.062 QT
cp
f
GR
GS
[0.75 0 0 0.75 221.25016 311.50002] CT
0.149 GC
N
-53.502 24.14 M
-53.502 23.968 -53.47 23.89 QT
-51.298 15.234 L
-51.095 14.437 -51.095 13.827 QT
-51.095 12.577 -51.939 12.577 QT
-52.845 12.577 -53.283 13.663 QT
-53.72 14.749 -54.142 16.406 QT
-54.142 16.484 -54.22 16.531 QT
-54.298 16.577 -54.377 16.577 QT
-54.72 16.577 L
-54.814 16.577 -54.884 16.476 QT
-54.955 16.374 -54.955 16.281 QT
-54.642 15.031 -54.353 14.148 QT
-54.064 13.265 -53.447 12.546 QT
-52.83 11.827 -51.908 11.827 QT
-50.83 11.827 -49.994 12.515 QT
-49.158 13.202 -49.158 14.265 QT
-48.283 13.124 -47.127 12.476 QT
-45.97 11.827 -44.658 11.827 QT
-43.283 11.827 -42.291 12.531 QT
-41.298 13.234 -41.298 14.515 QT
-40.408 13.249 -39.205 12.538 QT
-38.002 11.827 -36.595 11.827 QT
-35.095 11.827 -34.181 12.64 QT
-33.267 13.452 -33.267 14.952 QT
-33.267 16.14 -33.798 17.827 QT
-34.33 19.515 -35.111 21.593 QT
-35.533 22.593 -35.533 23.343 QT
-35.533 24.202 -34.845 24.202 QT
-33.72 24.202 -32.97 22.984 QT
-32.22 21.765 -31.908 20.374 QT
-31.814 20.202 -31.658 20.202 QT
-31.33 20.202 L
-31.205 20.202 -31.127 20.281 QT
-31.048 20.359 -31.048 20.468 QT
-31.048 20.484 -31.08 20.546 QT
-31.486 22.187 -32.47 23.577 QT
-33.455 24.968 -34.923 24.968 QT
-35.939 24.968 -36.658 24.265 QT
-37.377 23.562 -37.377 22.562 QT
-37.377 22.046 -37.142 21.421 QT
-36.33 19.249 -35.783 17.531 QT
-35.236 15.812 -35.236 14.515 QT
-35.236 13.702 -35.556 13.14 QT
-35.877 12.577 -36.642 12.577 QT
-38.236 12.577 -39.392 13.546 QT
-40.548 14.515 -41.408 16.109 QT
-41.455 16.406 -41.486 16.562 QT
-43.361 23.999 L
-43.455 24.406 -43.806 24.687 QT
-44.158 24.968 -44.58 24.968 QT
-44.923 24.968 -45.181 24.741 QT
-45.439 24.515 -45.439 24.14 QT
-45.439 23.968 -45.408 23.89 QT
-43.564 16.499 L
-43.267 15.312 -43.267 14.515 QT
-43.267 13.702 -43.595 13.14 QT
-43.923 12.577 -44.72 12.577 QT
-45.783 12.577 -46.673 13.046 QT
-47.564 13.515 -48.228 14.281 QT
-48.892 15.046 -49.455 16.109 QT
-51.423 23.999 L
-51.517 24.406 -51.861 24.687 QT
-52.205 24.968 -52.642 24.968 QT
-52.986 24.968 -53.244 24.741 QT
-53.502 24.515 -53.502 24.14 QT
cp
f
GR
GS
[0.75 0 0 0.75 221.25016 311.50002] CT
0.149 GC
N
-24.153 24.968 M
-25.528 24.968 -26.575 24.241 QT
-27.621 23.515 -28.161 22.296 QT
-28.7 21.077 -28.7 19.718 QT
-28.7 17.64 -27.661 15.82 QT
-26.621 13.999 -24.84 12.913 QT
-23.059 11.827 -21.012 11.827 QT
-19.778 11.827 -18.848 12.468 QT
-17.918 13.109 -17.918 14.312 QT
-17.918 15.984 -19.246 16.796 QT
-20.575 17.609 -22.246 17.804 QT
-23.918 17.999 -25.95 17.999 QT
-26.028 17.999 L
-26.496 19.734 -26.496 20.952 QT
-26.496 22.249 -25.903 23.226 QT
-25.309 24.202 -24.09 24.202 QT
-22.356 24.202 -20.77 23.406 QT
-19.184 22.609 -18.168 21.218 QT
-18.09 21.124 -17.95 21.124 QT
-17.809 21.124 -17.661 21.288 QT
-17.512 21.452 -17.512 21.593 QT
-17.512 21.702 -17.559 21.765 QT
-18.621 23.249 -20.418 24.109 QT
-22.215 24.968 -24.153 24.968 QT
cp
-25.856 17.249 M
-24.168 17.249 -22.739 17.093 QT
-21.309 16.937 -20.153 16.304 QT
-18.996 15.671 -18.996 14.343 QT
-18.996 13.812 -19.293 13.406 QT
-19.59 12.999 -20.067 12.788 QT
-20.543 12.577 -21.043 12.577 QT
-22.278 12.577 -23.262 13.241 QT
-24.246 13.906 -24.887 14.976 QT
-25.528 16.046 -25.856 17.249 QT
cp
f
GR
GS
[0.75 0 0 0.75 221.25016 311.50002] CT
0.149 GC
N
-13.807 22.874 M
-13.026 24.202 -10.666 24.202 QT
-9.651 24.202 -8.729 23.851 QT
-7.807 23.499 -7.205 22.812 QT
-6.604 22.124 -6.604 21.124 QT
-6.604 20.374 -7.143 19.898 QT
-7.682 19.421 -8.463 19.249 QT
-10.041 18.937 L
-11.104 18.671 -11.799 17.929 QT
-12.494 17.187 -12.494 16.14 QT
-12.494 14.859 -11.799 13.866 QT
-11.104 12.874 -9.955 12.351 QT
-8.807 11.827 -7.572 11.827 QT
-6.26 11.827 -5.213 12.452 QT
-4.166 13.077 -4.166 14.312 QT
-4.166 14.984 -4.541 15.491 QT
-4.916 15.999 -5.588 15.999 QT
-5.979 15.999 -6.252 15.749 QT
-6.526 15.499 -6.526 15.124 QT
-6.526 14.781 -6.33 14.46 QT
-6.135 14.14 -5.822 13.952 QT
-5.51 13.765 -5.166 13.765 QT
-5.416 13.14 -6.119 12.859 QT
-6.822 12.577 -7.635 12.577 QT
-8.369 12.577 -9.104 12.874 QT
-9.838 13.171 -10.283 13.741 QT
-10.729 14.312 -10.729 15.093 QT
-10.729 15.624 -10.362 16.015 QT
-9.994 16.406 -9.447 16.577 QT
-7.776 16.921 L
-6.963 17.093 -6.291 17.523 QT
-5.619 17.952 -5.229 18.616 QT
-4.838 19.281 -4.838 20.124 QT
-4.838 21.202 -5.44 22.249 QT
-6.041 23.296 -6.916 23.921 QT
-8.463 24.968 -10.697 24.968 QT
-12.244 24.968 -13.533 24.257 QT
-14.822 23.546 -14.822 22.14 QT
-14.822 21.359 -14.362 20.773 QT
-13.901 20.187 -13.104 20.187 QT
-12.635 20.187 -12.322 20.468 QT
-12.01 20.749 -12.01 21.218 QT
-12.01 21.874 -12.502 22.374 QT
-12.994 22.874 -13.666 22.874 QT
-13.807 22.874 L
cp
f
GR
GS
[0.75 0 0 0.75 221.25016 311.50002] CT
0.149 GC
N
2.474 24.968 M
0.646 24.968 -0.408 23.585 QT
-1.463 22.202 -1.463 20.327 QT
-1.463 18.468 -0.502 16.468 QT
0.459 14.468 2.092 13.148 QT
3.724 11.827 5.615 11.827 QT
6.474 11.827 7.154 12.296 QT
7.834 12.765 8.224 13.562 QT
8.537 12.406 9.49 12.406 QT
9.865 12.406 10.107 12.624 QT
10.349 12.843 10.349 13.218 QT
10.349 13.296 10.349 13.343 QT
10.349 13.39 10.334 13.437 QT
8.303 21.546 L
8.099 22.406 8.099 22.952 QT
8.099 24.202 8.943 24.202 QT
9.849 24.202 10.326 23.046 QT
10.803 21.89 11.115 20.374 QT
11.178 20.202 11.349 20.202 QT
11.709 20.202 L
11.818 20.202 11.888 20.304 QT
11.959 20.406 11.959 20.484 QT
11.443 22.515 10.842 23.741 QT
10.24 24.968 8.881 24.968 QT
7.912 24.968 7.162 24.39 QT
6.412 23.812 6.224 22.874 QT
4.349 24.968 2.474 24.968 QT
cp
2.49 24.202 M
3.553 24.202 4.529 23.413 QT
5.506 22.624 6.224 21.562 QT
6.256 21.546 6.256 21.484 QT
7.803 15.187 L
7.834 15.093 L
7.662 14.062 7.092 13.32 QT
6.521 12.577 5.537 12.577 QT
4.568 12.577 3.724 13.374 QT
2.881 14.171 2.303 15.265 QT
1.74 16.421 1.217 18.452 QT
0.693 20.484 0.693 21.593 QT
0.693 22.593 1.131 23.398 QT
1.568 24.202 2.49 24.202 QT
cp
f
GR
GS
[0.75 0 0 0.75 221.25016 311.50002] CT
0.149 GC
N
15.167 24.14 M
15.167 23.968 15.198 23.89 QT
17.37 15.234 L
17.573 14.437 17.573 13.827 QT
17.573 12.577 16.73 12.577 QT
15.823 12.577 15.386 13.663 QT
14.948 14.749 14.527 16.406 QT
14.527 16.484 14.448 16.531 QT
14.37 16.577 14.292 16.577 QT
13.948 16.577 L
13.855 16.577 13.784 16.476 QT
13.714 16.374 13.714 16.281 QT
14.027 15.031 14.316 14.148 QT
14.605 13.265 15.222 12.546 QT
15.839 11.827 16.761 11.827 QT
17.839 11.827 18.675 12.515 QT
19.511 13.202 19.511 14.265 QT
20.386 13.124 21.542 12.476 QT
22.698 11.827 24.011 11.827 QT
25.386 11.827 26.378 12.531 QT
27.37 13.234 27.37 14.515 QT
28.261 13.249 29.464 12.538 QT
30.667 11.827 32.073 11.827 QT
33.573 11.827 34.487 12.64 QT
35.402 13.452 35.402 14.952 QT
35.402 16.14 34.87 17.827 QT
34.339 19.515 33.558 21.593 QT
33.136 22.593 33.136 23.343 QT
33.136 24.202 33.823 24.202 QT
34.948 24.202 35.698 22.984 QT
36.448 21.765 36.761 20.374 QT
36.855 20.202 37.011 20.202 QT
37.339 20.202 L
37.464 20.202 37.542 20.281 QT
37.62 20.359 37.62 20.468 QT
37.62 20.484 37.589 20.546 QT
37.183 22.187 36.198 23.577 QT
35.214 24.968 33.745 24.968 QT
32.73 24.968 32.011 24.265 QT
31.292 23.562 31.292 22.562 QT
31.292 22.046 31.527 21.421 QT
32.339 19.249 32.886 17.531 QT
33.433 15.812 33.433 14.515 QT
33.433 13.702 33.112 13.14 QT
32.792 12.577 32.027 12.577 QT
30.433 12.577 29.277 13.546 QT
28.12 14.515 27.261 16.109 QT
27.214 16.406 27.183 16.562 QT
25.308 23.999 L
25.214 24.406 24.862 24.687 QT
24.511 24.968 24.089 24.968 QT
23.745 24.968 23.487 24.741 QT
23.23 24.515 23.23 24.14 QT
23.23 23.968 23.261 23.89 QT
25.105 16.499 L
25.402 15.312 25.402 14.515 QT
25.402 13.702 25.073 13.14 QT
24.745 12.577 23.948 12.577 QT
22.886 12.577 21.995 13.046 QT
21.105 13.515 20.441 14.281 QT
19.777 15.046 19.214 16.109 QT
17.245 23.999 L
17.152 24.406 16.808 24.687 QT
16.464 24.968 16.027 24.968 QT
15.683 24.968 15.425 24.741 QT
15.167 24.515 15.167 24.14 QT
cp
f
GR
GS
[0.75 0 0 0.75 221.25016 311.50002] CT
0.149 GC
N
37.969 30.265 M
37.703 30.265 37.703 29.89 QT
37.797 29.249 38.078 29.249 QT
38.985 29.249 39.344 29.093 QT
39.703 28.937 39.907 28.265 QT
43.172 15.202 L
43.391 14.671 43.391 13.827 QT
43.391 12.577 42.547 12.577 QT
41.641 12.577 41.196 13.663 QT
40.75 14.749 40.344 16.406 QT
40.344 16.577 40.11 16.577 QT
39.766 16.577 L
39.688 16.577 39.602 16.476 QT
39.516 16.374 39.516 16.281 QT
39.828 15.031 40.125 14.148 QT
40.422 13.265 41.032 12.546 QT
41.641 11.827 42.563 11.827 QT
43.563 11.827 44.313 12.382 QT
45.063 12.937 45.266 13.906 QT
46.063 12.984 47.024 12.406 QT
47.985 11.827 49.016 11.827 QT
50.235 11.827 51.133 12.476 QT
52.032 13.124 52.485 14.179 QT
52.938 15.234 52.938 16.452 QT
52.938 18.327 51.977 20.32 QT
51.016 22.312 49.383 23.64 QT
47.75 24.968 45.875 24.968 QT
45.032 24.968 44.344 24.484 QT
43.657 23.999 43.282 23.218 QT
41.953 28.374 L
41.891 28.796 41.875 28.874 QT
41.875 29.249 43.782 29.249 QT
44.078 29.249 44.078 29.624 QT
43.985 29.999 43.922 30.132 QT
43.86 30.265 43.594 30.265 QT
37.969 30.265 L
cp
45.907 24.202 M
46.922 24.202 47.782 23.374 QT
48.641 22.546 49.188 21.515 QT
49.578 20.734 49.922 19.609 QT
50.266 18.484 50.524 17.21 QT
50.782 15.937 50.782 15.187 QT
50.782 14.515 50.602 13.937 QT
50.422 13.359 50.024 12.968 QT
49.625 12.577 48.953 12.577 QT
47.891 12.577 46.953 13.335 QT
46.016 14.093 45.25 15.202 QT
45.25 15.312 L
43.641 21.702 L
43.844 22.749 44.407 23.476 QT
44.969 24.202 45.907 24.202 QT
cp
f
GR
GS
[0.75 0 0 0.75 221.25016 311.50002] CT
0.149 GC
N
54.727 22.296 M
54.727 22.202 54.743 22.031 QT
54.759 21.859 54.782 21.702 QT
54.806 21.546 54.806 21.452 QT
58.399 7.093 L
58.509 6.593 58.54 6.312 QT
58.54 5.843 56.665 5.843 QT
56.384 5.843 56.384 5.468 QT
56.399 5.39 56.446 5.21 QT
56.493 5.031 56.571 4.929 QT
56.649 4.827 56.79 4.827 QT
60.696 4.515 L
61.056 4.515 61.056 4.89 QT
56.868 21.562 L
56.665 22.031 56.665 22.952 QT
56.665 24.202 57.509 24.202 QT
58.399 24.202 58.845 23.093 QT
59.29 21.984 59.649 20.374 QT
59.712 20.202 59.884 20.202 QT
60.227 20.202 L
60.337 20.202 60.415 20.296 QT
60.493 20.39 60.493 20.484 QT
60.165 21.89 59.884 22.702 QT
59.602 23.515 58.993 24.241 QT
58.384 24.968 57.446 24.968 QT
56.29 24.968 55.509 24.218 QT
54.727 23.468 54.727 22.296 QT
cp
f
GR
GS
[0.75 0 0 0.75 221.25016 311.50002] CT
0.149 GC
N
68.604 24.968 M
67.229 24.968 66.182 24.241 QT
65.135 23.515 64.596 22.296 QT
64.057 21.077 64.057 19.718 QT
64.057 17.64 65.096 15.82 QT
66.135 13.999 67.916 12.913 QT
69.698 11.827 71.745 11.827 QT
72.979 11.827 73.909 12.468 QT
74.838 13.109 74.838 14.312 QT
74.838 15.984 73.51 16.796 QT
72.182 17.609 70.51 17.804 QT
68.838 17.999 66.807 17.999 QT
66.729 17.999 L
66.26 19.734 66.26 20.952 QT
66.26 22.249 66.854 23.226 QT
67.448 24.202 68.666 24.202 QT
70.401 24.202 71.987 23.406 QT
73.573 22.609 74.588 21.218 QT
74.666 21.124 74.807 21.124 QT
74.948 21.124 75.096 21.288 QT
75.245 21.452 75.245 21.593 QT
75.245 21.702 75.198 21.765 QT
74.135 23.249 72.338 24.109 QT
70.541 24.968 68.604 24.968 QT
cp
66.901 17.249 M
68.588 17.249 70.018 17.093 QT
71.448 16.937 72.604 16.304 QT
73.76 15.671 73.76 14.343 QT
73.76 13.812 73.463 13.406 QT
73.166 12.999 72.69 12.788 QT
72.213 12.577 71.713 12.577 QT
70.479 12.577 69.495 13.241 QT
68.51 13.906 67.87 14.976 QT
67.229 16.046 66.901 17.249 QT
cp
f
GR
GS
[0.75 0 0 0.75 0 0.5] CT
0.149 GC
2 setlinecap
1 LJ
0.667 LW
N
74 390 M
74 38 L
S
GR
GS
[0.75 0 0 0.75 0 0.5] CT
0.149 GC
2 setlinecap
1 LJ
0.667 LW
N
74 390 M
78.42 390 L
S
GR
GS
[0.75 0 0 0.75 0 0.5] CT
0.149 GC
2 setlinecap
1 LJ
0.667 LW
N
74 350.889 M
78.42 350.889 L
S
GR
GS
[0.75 0 0 0.75 0 0.5] CT
0.149 GC
2 setlinecap
1 LJ
0.667 LW
N
74 311.778 M
78.42 311.778 L
S
GR
GS
[0.75 0 0 0.75 0 0.5] CT
0.149 GC
2 setlinecap
1 LJ
0.667 LW
N
74 272.667 M
78.42 272.667 L
S
GR
GS
[0.75 0 0 0.75 0 0.5] CT
0.149 GC
2 setlinecap
1 LJ
0.667 LW
N
74 233.556 M
78.42 233.556 L
S
GR
GS
[0.75 0 0 0.75 0 0.5] CT
0.149 GC
2 setlinecap
1 LJ
0.667 LW
N
74 194.444 M
78.42 194.444 L
S
GR
GS
[0.75 0 0 0.75 0 0.5] CT
0.149 GC
2 setlinecap
1 LJ
0.667 LW
N
74 155.333 M
78.42 155.333 L
S
GR
GS
[0.75 0 0 0.75 0 0.5] CT
0.149 GC
2 setlinecap
1 LJ
0.667 LW
N
74 116.222 M
78.42 116.222 L
S
GR
GS
[0.75 0 0 0.75 0 0.5] CT
0.149 GC
2 setlinecap
1 LJ
0.667 LW
N
74 77.111 M
78.42 77.111 L
S
GR
GS
[0.75 0 0 0.75 0 0.5] CT
0.149 GC
2 setlinecap
1 LJ
0.667 LW
N
74 38 M
78.42 38 L
S
GR
GS
[0.75 0 0 0.75 51.5 293] CT
0.149 GC
/Helvetica 13.333 F
GS
[1 0 0 1 0 0] CT
-12 5.5 moveto 
1 -1 scale
(-6) t 
GR
GR
GS
[0.75 0 0 0.75 51.5 263.66666] CT
0.149 GC
/Helvetica 13.333 F
GS
[1 0 0 1 0 0] CT
-12 5.5 moveto 
1 -1 scale
(-5) t 
GR
GR
GS
[0.75 0 0 0.75 51.5 234.33333] CT
0.149 GC
/Helvetica 13.333 F
GS
[1 0 0 1 0 0] CT
-12 5.5 moveto 
1 -1 scale
(-4) t 
GR
GR
GS
[0.75 0 0 0.75 51.5 204.99999] CT
0.149 GC
/Helvetica 13.333 F
GS
[1 0 0 1 0 0] CT
-12 5.5 moveto 
1 -1 scale
(-3) t 
GR
GR
GS
[0.75 0 0 0.75 51.5 175.66667] CT
0.149 GC
/Helvetica 13.333 F
GS
[1 0 0 1 0 0] CT
-12 5.5 moveto 
1 -1 scale
(-2) t 
GR
GR
GS
[0.75 0 0 0.75 51.5 146.33333] CT
0.149 GC
/Helvetica 13.333 F
GS
[1 0 0 1 0 0] CT
-12 5.5 moveto 
1 -1 scale
(-1) t 
GR
GR
GS
[0.75 0 0 0.75 51.5 117] CT
0.149 GC
/Helvetica 13.333 F
GS
[1 0 0 1 0 0] CT
-8 5.5 moveto 
1 -1 scale
(0) t 
GR
GR
GS
[0.75 0 0 0.75 51.5 87.66667] CT
0.149 GC
/Helvetica 13.333 F
GS
[1 0 0 1 0 0] CT
-8 5.5 moveto 
1 -1 scale
(1) t 
GR
GR
GS
[0.75 0 0 0.75 51.5 58.33334] CT
0.149 GC
/Helvetica 13.333 F
GS
[1 0 0 1 0 0] CT
-8 5.5 moveto 
1 -1 scale
(2) t 
GR
GR
GS
[0.75 0 0 0.75 51.5 29] CT
0.149 GC
/Helvetica 13.333 F
GS
[1 0 0 1 0 0] CT
-8 5.5 moveto 
1 -1 scale
(3) t 
GR
GR
GS
[0 -0.75 0.75 0 39.5 160.99987] CT
0.149 GC
N
-40.969 -28.357 M
-40.969 -28.998 -40.484 -29.482 QT
-40 -29.966 -39.375 -29.966 QT
-38.969 -29.966 -38.586 -29.748 QT
-38.203 -29.529 -37.992 -29.146 QT
-37.781 -28.763 -37.781 -28.357 QT
-37.781 -27.732 -38.25 -27.255 QT
-38.719 -26.779 -39.375 -26.779 QT
-40 -26.779 -40.484 -27.255 QT
-40.969 -27.732 -40.969 -28.357 QT
cp
f
GR
GS
[0 -0.75 0.75 0 39.5 160.99987] CT
0.149 GC
N
-45.752 -11.06 M
-45.752 -11.232 -45.721 -11.31 QT
-43.549 -19.966 L
-43.346 -20.763 -43.346 -21.373 QT
-43.346 -22.623 -44.189 -22.623 QT
-45.096 -22.623 -45.533 -21.537 QT
-45.971 -20.451 -46.392 -18.794 QT
-46.392 -18.716 -46.471 -18.669 QT
-46.549 -18.623 -46.627 -18.623 QT
-46.971 -18.623 L
-47.064 -18.623 -47.135 -18.724 QT
-47.205 -18.826 -47.205 -18.919 QT
-46.892 -20.169 -46.603 -21.052 QT
-46.314 -21.935 -45.697 -22.654 QT
-45.08 -23.373 -44.158 -23.373 QT
-43.158 -23.373 -42.4 -22.794 QT
-41.642 -22.216 -41.455 -21.263 QT
-40.721 -22.232 -39.783 -22.802 QT
-38.846 -23.373 -37.721 -23.373 QT
-36.799 -23.373 -36.096 -22.834 QT
-35.392 -22.294 -35.392 -21.373 QT
-35.392 -20.638 -35.853 -20.091 QT
-36.314 -19.544 -37.08 -19.544 QT
-37.549 -19.544 -37.869 -19.841 QT
-38.189 -20.138 -38.189 -20.607 QT
-38.189 -21.232 -37.721 -21.74 QT
-37.252 -22.248 -36.642 -22.248 QT
-37.111 -22.623 -37.783 -22.623 QT
-39.017 -22.623 -39.939 -21.74 QT
-40.861 -20.857 -41.596 -19.498 QT
-43.674 -11.201 L
-43.767 -10.794 -44.111 -10.513 QT
-44.455 -10.232 -44.892 -10.232 QT
-45.236 -10.232 -45.494 -10.459 QT
-45.752 -10.685 -45.752 -11.06 QT
cp
f
GR
GS
[0 -0.75 0.75 0 39.5 160.99987] CT
0.149 GC
N
-32.987 -3.16 M
-32.549 -2.395 -31.455 -2.395 QT
-30.455 -2.395 -29.729 -3.09 QT
-29.002 -3.785 -28.557 -4.777 QT
-28.112 -5.77 -27.862 -6.801 QT
-28.799 -5.926 -29.877 -5.926 QT
-30.705 -5.926 -31.291 -6.215 QT
-31.877 -6.504 -32.205 -7.074 QT
-32.534 -7.645 -32.534 -8.441 QT
-32.534 -9.129 -32.346 -9.855 QT
-32.159 -10.582 -31.823 -11.465 QT
-31.487 -12.348 -31.252 -13.004 QT
-30.971 -13.785 -30.971 -14.27 QT
-30.971 -14.895 -31.424 -14.895 QT
-32.268 -14.895 -32.799 -14.043 QT
-33.33 -13.191 -33.596 -12.129 QT
-33.627 -11.988 -33.768 -11.988 QT
-34.018 -11.988 L
-34.19 -11.988 -34.19 -12.191 QT
-34.19 -12.254 L
-33.846 -13.504 -33.151 -14.473 QT
-32.455 -15.441 -31.393 -15.441 QT
-30.643 -15.441 -30.127 -14.949 QT
-29.612 -14.457 -29.612 -13.691 QT
-29.612 -13.301 -29.784 -12.879 QT
-29.877 -12.613 -30.205 -11.754 QT
-30.534 -10.895 -30.705 -10.332 QT
-30.877 -9.77 -30.987 -9.223 QT
-31.096 -8.676 -31.096 -8.145 QT
-31.096 -7.441 -30.799 -6.957 QT
-30.502 -6.473 -29.862 -6.473 QT
-28.565 -6.473 -27.518 -8.066 QT
-25.94 -14.535 L
-25.862 -14.816 -25.604 -15.012 QT
-25.346 -15.207 -25.049 -15.207 QT
-24.799 -15.207 -24.604 -15.043 QT
-24.409 -14.879 -24.409 -14.613 QT
-24.409 -14.504 -24.44 -14.457 QT
-26.518 -6.098 L
-26.799 -5.02 -27.534 -4.035 QT
-28.268 -3.051 -29.307 -2.449 QT
-30.346 -1.848 -31.487 -1.848 QT
-32.018 -1.848 -32.557 -2.059 QT
-33.096 -2.27 -33.424 -2.691 QT
-33.752 -3.113 -33.752 -3.676 QT
-33.752 -4.254 -33.409 -4.676 QT
-33.065 -5.098 -32.502 -5.098 QT
-32.174 -5.098 -31.94 -4.887 QT
-31.705 -4.676 -31.705 -4.332 QT
-31.705 -3.848 -32.065 -3.488 QT
-32.424 -3.129 -32.909 -3.129 QT
-32.924 -3.145 -32.948 -3.152 QT
-32.971 -3.16 -32.987 -3.16 QT
cp
f
GR
GS
[0 -0.75 0.75 0 39.5 160.99987] CT
0.149 GC
N
-19.06 -3.31 M
-19.06 -32.31 L
-15.091 -32.31 L
-15.091 -31.154 L
-17.888 -31.154 L
-17.888 -4.466 L
-15.091 -4.466 L
-15.091 -3.31 L
-19.06 -3.31 L
cp
f
GR
GS
[0 -0.75 0.75 0 39.5 160.99987] CT
0.149 GC
N
-12.099 -11.06 M
-12.099 -11.232 -12.068 -11.31 QT
-9.896 -19.966 L
-9.693 -20.763 -9.693 -21.373 QT
-9.693 -22.623 -10.537 -22.623 QT
-11.443 -22.623 -11.881 -21.537 QT
-12.318 -20.451 -12.74 -18.794 QT
-12.74 -18.716 -12.818 -18.669 QT
-12.896 -18.623 -12.974 -18.623 QT
-13.318 -18.623 L
-13.412 -18.623 -13.482 -18.724 QT
-13.552 -18.826 -13.552 -18.919 QT
-13.24 -20.169 -12.951 -21.052 QT
-12.662 -21.935 -12.045 -22.654 QT
-11.427 -23.373 -10.506 -23.373 QT
-9.427 -23.373 -8.591 -22.685 QT
-7.756 -21.998 -7.756 -20.935 QT
-6.881 -22.076 -5.724 -22.724 QT
-4.568 -23.373 -3.256 -23.373 QT
-1.881 -23.373 -0.888 -22.669 QT
0.104 -21.966 0.104 -20.685 QT
0.994 -21.951 2.198 -22.662 QT
3.401 -23.373 4.807 -23.373 QT
6.307 -23.373 7.221 -22.56 QT
8.135 -21.748 8.135 -20.248 QT
8.135 -19.06 7.604 -17.373 QT
7.073 -15.685 6.291 -13.607 QT
5.869 -12.607 5.869 -11.857 QT
5.869 -10.998 6.557 -10.998 QT
7.682 -10.998 8.432 -12.216 QT
9.182 -13.435 9.494 -14.826 QT
9.588 -14.998 9.744 -14.998 QT
10.073 -14.998 L
10.198 -14.998 10.276 -14.919 QT
10.354 -14.841 10.354 -14.732 QT
10.354 -14.716 10.323 -14.654 QT
9.916 -13.013 8.932 -11.623 QT
7.948 -10.232 6.479 -10.232 QT
5.463 -10.232 4.744 -10.935 QT
4.026 -11.638 4.026 -12.638 QT
4.026 -13.154 4.26 -13.779 QT
5.073 -15.951 5.619 -17.669 QT
6.166 -19.388 6.166 -20.685 QT
6.166 -21.498 5.846 -22.06 QT
5.526 -22.623 4.76 -22.623 QT
3.166 -22.623 2.01 -21.654 QT
0.854 -20.685 -0.006 -19.091 QT
-0.052 -18.794 -0.084 -18.638 QT
-1.959 -11.201 L
-2.052 -10.794 -2.404 -10.513 QT
-2.756 -10.232 -3.177 -10.232 QT
-3.521 -10.232 -3.779 -10.459 QT
-4.037 -10.685 -4.037 -11.06 QT
-4.037 -11.232 -4.006 -11.31 QT
-2.162 -18.701 L
-1.865 -19.888 -1.865 -20.685 QT
-1.865 -21.498 -2.193 -22.06 QT
-2.521 -22.623 -3.318 -22.623 QT
-4.381 -22.623 -5.271 -22.154 QT
-6.162 -21.685 -6.826 -20.919 QT
-7.49 -20.154 -8.052 -19.091 QT
-10.021 -11.201 L
-10.115 -10.794 -10.459 -10.513 QT
-10.802 -10.232 -11.24 -10.232 QT
-11.584 -10.232 -11.841 -10.459 QT
-12.099 -10.685 -12.099 -11.06 QT
cp
f
GR
GS
[0 -0.75 0.75 0 39.5 160.99987] CT
0.149 GC
N
13.046 -3.888 M
13.046 -3.982 13.078 -3.998 QT
23.156 -31.951 L
23.218 -32.123 23.359 -32.216 QT
23.5 -32.31 23.687 -32.31 QT
23.937 -32.31 24.101 -32.154 QT
24.265 -31.998 24.265 -31.732 QT
24.265 -31.623 L
14.187 -3.669 L
14.015 -3.31 13.625 -3.31 QT
13.39 -3.31 13.218 -3.482 QT
13.046 -3.654 13.046 -3.888 QT
cp
f
GR
GS
[0 -0.75 0.75 0 39.5 160.99987] CT
0.149 GC
N
28.604 -12.326 M
29.385 -10.998 31.744 -10.998 QT
32.76 -10.998 33.682 -11.349 QT
34.604 -11.701 35.205 -12.388 QT
35.807 -13.076 35.807 -14.076 QT
35.807 -14.826 35.268 -15.302 QT
34.729 -15.779 33.947 -15.951 QT
32.369 -16.263 L
31.307 -16.529 30.612 -17.271 QT
29.916 -18.013 29.916 -19.06 QT
29.916 -20.341 30.612 -21.334 QT
31.307 -22.326 32.455 -22.849 QT
33.604 -23.373 34.838 -23.373 QT
36.151 -23.373 37.197 -22.748 QT
38.244 -22.123 38.244 -20.888 QT
38.244 -20.216 37.869 -19.709 QT
37.494 -19.201 36.822 -19.201 QT
36.432 -19.201 36.158 -19.451 QT
35.885 -19.701 35.885 -20.076 QT
35.885 -20.419 36.08 -20.74 QT
36.276 -21.06 36.588 -21.248 QT
36.901 -21.435 37.244 -21.435 QT
36.994 -22.06 36.291 -22.341 QT
35.588 -22.623 34.776 -22.623 QT
34.041 -22.623 33.307 -22.326 QT
32.572 -22.029 32.127 -21.459 QT
31.682 -20.888 31.682 -20.107 QT
31.682 -19.576 32.049 -19.185 QT
32.416 -18.794 32.963 -18.623 QT
34.635 -18.279 L
35.447 -18.107 36.119 -17.677 QT
36.791 -17.248 37.182 -16.584 QT
37.572 -15.919 37.572 -15.076 QT
37.572 -13.998 36.971 -12.951 QT
36.369 -11.904 35.494 -11.279 QT
33.947 -10.232 31.713 -10.232 QT
30.166 -10.232 28.877 -10.943 QT
27.588 -11.654 27.588 -13.06 QT
27.588 -13.841 28.049 -14.427 QT
28.51 -15.013 29.307 -15.013 QT
29.776 -15.013 30.088 -14.732 QT
30.401 -14.451 30.401 -13.982 QT
30.401 -13.326 29.908 -12.826 QT
29.416 -12.326 28.744 -12.326 QT
28.604 -12.326 L
cp
f
GR
GS
[0 -0.75 0.75 0 39.5 160.99987] CT
0.149 GC
N
40.479 -3.31 M
40.479 -4.466 L
43.291 -4.466 L
43.291 -31.154 L
40.479 -31.154 L
40.479 -32.31 L
44.447 -32.31 L
44.447 -3.31 L
40.479 -3.31 L
cp
f
GR
GS
[0.75 0 0 0.75 221.25021 25.22857] CT
N
-90.135 -9.6 M
-90.135 -10.553 L
-87.354 -10.553 -87.354 -11.413 QT
-87.354 -26.241 L
-87.354 -27.1 -90.135 -27.1 QT
-90.135 -28.038 L
-81.385 -28.038 L
-81.385 -27.1 L
-84.838 -27.1 -84.838 -26.241 QT
-84.838 -11.413 L
-84.838 -10.819 -84.502 -10.686 QT
-84.166 -10.553 -83.463 -10.553 QT
-81.385 -10.553 L
-79.354 -10.553 -78.26 -11.288 QT
-77.166 -12.022 -76.713 -13.295 QT
-76.26 -14.569 -76.026 -16.678 QT
-75.244 -16.678 L
-75.994 -9.6 L
-90.135 -9.6 L
cp
f
GR
GS
[0.75 0 0 0.75 221.25021 25.22857] CT
N
-73.218 -12.256 M
-73.218 -13.866 -71.953 -14.874 QT
-70.687 -15.881 -68.914 -16.295 QT
-67.14 -16.709 -65.546 -16.709 QT
-65.546 -17.819 L
-65.546 -18.584 -65.89 -19.319 QT
-66.234 -20.053 -66.875 -20.522 QT
-67.515 -20.991 -68.296 -20.991 QT
-70.093 -20.991 -71.031 -20.194 QT
-70.515 -20.194 -70.179 -19.803 QT
-69.843 -19.413 -69.843 -18.897 QT
-69.843 -18.35 -70.226 -17.967 QT
-70.609 -17.584 -71.125 -17.584 QT
-71.671 -17.584 -72.054 -17.967 QT
-72.437 -18.35 -72.437 -18.897 QT
-72.437 -20.319 -71.148 -21.014 QT
-69.859 -21.709 -68.296 -21.709 QT
-67.203 -21.709 -66.093 -21.241 QT
-64.984 -20.772 -64.281 -19.897 QT
-63.578 -19.022 -63.578 -17.866 QT
-63.578 -11.788 L
-63.578 -11.256 -63.351 -10.819 QT
-63.125 -10.381 -62.656 -10.381 QT
-62.203 -10.381 -61.984 -10.827 QT
-61.765 -11.272 -61.765 -11.788 QT
-61.765 -13.522 L
-60.984 -13.522 L
-60.984 -11.788 L
-60.984 -11.178 -61.296 -10.631 QT
-61.609 -10.084 -62.148 -9.764 QT
-62.687 -9.444 -63.296 -9.444 QT
-64.093 -9.444 -64.664 -10.053 QT
-65.234 -10.663 -65.312 -11.506 QT
-65.812 -10.491 -66.781 -9.897 QT
-67.75 -9.303 -68.859 -9.303 QT
-69.89 -9.303 -70.89 -9.6 QT
-71.89 -9.897 -72.554 -10.553 QT
-73.218 -11.209 -73.218 -12.256 QT
cp
-71.031 -12.256 M
-71.031 -11.303 -70.328 -10.655 QT
-69.625 -10.006 -68.687 -10.006 QT
-67.812 -10.006 -67.101 -10.444 QT
-66.39 -10.881 -65.968 -11.631 QT
-65.546 -12.381 -65.546 -13.209 QT
-65.546 -16.022 L
-66.765 -16.022 -68.054 -15.616 QT
-69.343 -15.209 -70.187 -14.358 QT
-71.031 -13.506 -71.031 -12.256 QT
cp
f
GR
GS
[0.75 0 0 0.75 221.25021 25.22857] CT
N
-58.213 -12.85 M
-58.213 -20.288 L
-60.447 -20.288 L
-60.447 -20.991 L
-58.682 -20.991 -57.854 -22.639 QT
-57.026 -24.288 -57.026 -26.209 QT
-56.244 -26.209 L
-56.244 -21.241 L
-52.432 -21.241 L
-52.432 -20.288 L
-56.244 -20.288 L
-56.244 -12.897 L
-56.244 -11.772 -55.869 -10.928 QT
-55.494 -10.084 -54.51 -10.084 QT
-53.588 -10.084 -53.182 -10.975 QT
-52.776 -11.866 -52.776 -12.897 QT
-52.776 -14.491 L
-51.994 -14.491 L
-51.994 -12.85 L
-51.994 -12.006 -52.307 -11.178 QT
-52.619 -10.35 -53.229 -9.827 QT
-53.838 -9.303 -54.697 -9.303 QT
-56.322 -9.303 -57.268 -10.272 QT
-58.213 -11.241 -58.213 -12.85 QT
cp
f
GR
GS
[0.75 0 0 0.75 221.25021 25.22857] CT
N
-43.874 -9.303 M
-45.515 -9.303 -46.89 -10.163 QT
-48.265 -11.022 -49.054 -12.467 QT
-49.843 -13.913 -49.843 -15.522 QT
-49.843 -17.1 -49.124 -18.522 QT
-48.405 -19.944 -47.116 -20.827 QT
-45.827 -21.709 -44.249 -21.709 QT
-43.015 -21.709 -42.1 -21.288 QT
-41.186 -20.866 -40.593 -20.131 QT
-39.999 -19.397 -39.694 -18.397 QT
-39.39 -17.397 -39.39 -16.194 QT
-39.39 -15.834 -39.671 -15.834 QT
-47.483 -15.834 L
-47.483 -15.553 L
-47.483 -13.303 -46.577 -11.694 QT
-45.671 -10.084 -43.624 -10.084 QT
-42.796 -10.084 -42.093 -10.452 QT
-41.39 -10.819 -40.866 -11.483 QT
-40.343 -12.147 -40.171 -12.897 QT
-40.14 -12.991 -40.069 -13.061 QT
-39.999 -13.131 -39.905 -13.131 QT
-39.671 -13.131 L
-39.39 -13.131 -39.39 -12.788 QT
-39.765 -11.256 -41.03 -10.28 QT
-42.296 -9.303 -43.874 -9.303 QT
cp
-47.452 -16.506 M
-41.296 -16.506 L
-41.296 -17.522 -41.577 -18.561 QT
-41.858 -19.6 -42.522 -20.295 QT
-43.186 -20.991 -44.249 -20.991 QT
-45.78 -20.991 -46.616 -19.561 QT
-47.452 -18.131 -47.452 -16.506 QT
cp
f
GR
GS
[0.75 0 0 0.75 221.25021 25.22857] CT
N
-38.038 -9.6 M
-38.038 -10.553 L
-37.116 -10.553 -36.522 -10.694 QT
-35.928 -10.834 -35.928 -11.413 QT
-35.928 -18.772 L
-35.928 -19.506 -36.147 -19.827 QT
-36.366 -20.147 -36.772 -20.217 QT
-37.178 -20.288 -38.038 -20.288 QT
-38.038 -21.241 L
-34.178 -21.538 L
-34.178 -18.897 L
-33.741 -20.069 -32.936 -20.803 QT
-32.131 -21.538 -30.991 -21.538 QT
-30.178 -21.538 -29.545 -21.061 QT
-28.913 -20.584 -28.913 -19.803 QT
-28.913 -19.319 -29.264 -18.952 QT
-29.616 -18.584 -30.131 -18.584 QT
-30.631 -18.584 -30.991 -18.944 QT
-31.35 -19.303 -31.35 -19.803 QT
-31.35 -20.522 -30.835 -20.834 QT
-30.991 -20.834 L
-32.085 -20.834 -32.772 -20.045 QT
-33.46 -19.256 -33.756 -18.077 QT
-34.053 -16.897 -34.053 -15.834 QT
-34.053 -11.413 L
-34.053 -10.553 -31.428 -10.553 QT
-31.428 -9.6 L
-38.038 -9.6 L
cp
f
GR
GS
[0.75 0 0 0.75 221.25021 25.22857] CT
N
-27.218 -12.256 M
-27.218 -13.866 -25.953 -14.874 QT
-24.687 -15.881 -22.914 -16.295 QT
-21.14 -16.709 -19.546 -16.709 QT
-19.546 -17.819 L
-19.546 -18.584 -19.89 -19.319 QT
-20.234 -20.053 -20.874 -20.522 QT
-21.515 -20.991 -22.296 -20.991 QT
-24.093 -20.991 -25.031 -20.194 QT
-24.515 -20.194 -24.179 -19.803 QT
-23.843 -19.413 -23.843 -18.897 QT
-23.843 -18.35 -24.226 -17.967 QT
-24.609 -17.584 -25.124 -17.584 QT
-25.671 -17.584 -26.054 -17.967 QT
-26.437 -18.35 -26.437 -18.897 QT
-26.437 -20.319 -25.148 -21.014 QT
-23.859 -21.709 -22.296 -21.709 QT
-21.203 -21.709 -20.093 -21.241 QT
-18.984 -20.772 -18.281 -19.897 QT
-17.578 -19.022 -17.578 -17.866 QT
-17.578 -11.788 L
-17.578 -11.256 -17.351 -10.819 QT
-17.124 -10.381 -16.656 -10.381 QT
-16.203 -10.381 -15.984 -10.827 QT
-15.765 -11.272 -15.765 -11.788 QT
-15.765 -13.522 L
-14.984 -13.522 L
-14.984 -11.788 L
-14.984 -11.178 -15.296 -10.631 QT
-15.609 -10.084 -16.148 -9.764 QT
-16.687 -9.444 -17.296 -9.444 QT
-18.093 -9.444 -18.664 -10.053 QT
-19.234 -10.663 -19.312 -11.506 QT
-19.812 -10.491 -20.781 -9.897 QT
-21.749 -9.303 -22.859 -9.303 QT
-23.89 -9.303 -24.89 -9.6 QT
-25.89 -9.897 -26.554 -10.553 QT
-27.218 -11.209 -27.218 -12.256 QT
cp
-25.031 -12.256 M
-25.031 -11.303 -24.328 -10.655 QT
-23.624 -10.006 -22.687 -10.006 QT
-21.812 -10.006 -21.101 -10.444 QT
-20.39 -10.881 -19.968 -11.631 QT
-19.546 -12.381 -19.546 -13.209 QT
-19.546 -16.022 L
-20.765 -16.022 -22.054 -15.616 QT
-23.343 -15.209 -24.187 -14.358 QT
-25.031 -13.506 -25.031 -12.256 QT
cp
f
GR
GS
[0.75 0 0 0.75 221.25021 25.22857] CT
N
-14.135 -9.6 M
-14.135 -10.553 L
-13.213 -10.553 -12.619 -10.694 QT
-12.025 -10.834 -12.025 -11.413 QT
-12.025 -25.584 L
-12.025 -26.303 -12.244 -26.624 QT
-12.463 -26.944 -12.869 -27.022 QT
-13.275 -27.1 -14.135 -27.1 QT
-14.135 -28.038 L
-10.119 -28.334 L
-10.119 -11.413 L
-10.119 -10.834 -9.525 -10.694 QT
-8.932 -10.553 -8.025 -10.553 QT
-8.025 -9.6 L
-14.135 -9.6 L
cp
f
GR
GS
[0.75 0 0 0.75 221.25021 25.22857] CT
N
7.927 -9.6 M
3.99 -19.522 L
3.74 -20.022 3.216 -20.155 QT
2.693 -20.288 1.849 -20.288 QT
1.849 -21.241 L
7.521 -21.241 L
7.521 -20.288 L
6.005 -20.288 6.005 -19.647 QT
6.005 -19.538 6.021 -19.491 QT
9.052 -11.866 L
11.786 -18.756 L
11.865 -18.959 11.865 -19.178 QT
11.865 -19.694 11.474 -19.991 QT
11.083 -20.288 10.568 -20.288 QT
10.568 -21.241 L
15.052 -21.241 L
15.052 -20.288 L
14.208 -20.288 13.583 -19.905 QT
12.958 -19.522 12.615 -18.772 QT
8.974 -9.6 L
8.88 -9.303 8.552 -9.303 QT
8.349 -9.303 L
8.021 -9.303 7.927 -9.6 QT
cp
f
GR
GS
[0.75 0 0 0.75 221.25021 25.22857] CT
N
21.385 -9.303 M
19.745 -9.303 18.37 -10.163 QT
16.995 -11.022 16.206 -12.467 QT
15.417 -13.913 15.417 -15.522 QT
15.417 -17.1 16.135 -18.522 QT
16.854 -19.944 18.143 -20.827 QT
19.432 -21.709 21.01 -21.709 QT
22.245 -21.709 23.159 -21.288 QT
24.073 -20.866 24.667 -20.131 QT
25.26 -19.397 25.565 -18.397 QT
25.87 -17.397 25.87 -16.194 QT
25.87 -15.834 25.589 -15.834 QT
17.776 -15.834 L
17.776 -15.553 L
17.776 -13.303 18.682 -11.694 QT
19.589 -10.084 21.635 -10.084 QT
22.464 -10.084 23.167 -10.452 QT
23.87 -10.819 24.393 -11.483 QT
24.917 -12.147 25.089 -12.897 QT
25.12 -12.991 25.19 -13.061 QT
25.26 -13.131 25.354 -13.131 QT
25.589 -13.131 L
25.87 -13.131 25.87 -12.788 QT
25.495 -11.256 24.229 -10.28 QT
22.964 -9.303 21.385 -9.303 QT
cp
17.807 -16.506 M
23.964 -16.506 L
23.964 -17.522 23.682 -18.561 QT
23.401 -19.6 22.737 -20.295 QT
22.073 -20.991 21.01 -20.991 QT
19.479 -20.991 18.643 -19.561 QT
17.807 -18.131 17.807 -16.506 QT
cp
f
GR
GS
[0.75 0 0 0.75 221.25021 25.22857] CT
N
27.347 -9.6 M
27.347 -10.553 L
28.269 -10.553 28.862 -10.694 QT
29.456 -10.834 29.456 -11.413 QT
29.456 -25.584 L
29.456 -26.303 29.237 -26.624 QT
29.019 -26.944 28.612 -27.022 QT
28.206 -27.1 27.347 -27.1 QT
27.347 -28.038 L
31.362 -28.334 L
31.362 -11.413 L
31.362 -10.834 31.956 -10.694 QT
32.55 -10.553 33.456 -10.553 QT
33.456 -9.6 L
27.347 -9.6 L
cp
f
GR
GS
[0.75 0 0 0.75 221.25021 25.22857] CT
N
40.676 -9.303 M
39.051 -9.303 37.668 -10.124 QT
36.285 -10.944 35.481 -12.327 QT
34.676 -13.709 34.676 -15.35 QT
34.676 -16.584 35.121 -17.733 QT
35.567 -18.881 36.387 -19.788 QT
37.207 -20.694 38.301 -21.202 QT
39.395 -21.709 40.676 -21.709 QT
42.332 -21.709 43.699 -20.827 QT
45.067 -19.944 45.856 -18.475 QT
46.645 -17.006 46.645 -15.35 QT
46.645 -13.725 45.84 -12.334 QT
45.035 -10.944 43.66 -10.124 QT
42.285 -9.303 40.676 -9.303 QT
cp
40.676 -10.084 M
42.832 -10.084 43.559 -11.655 QT
44.285 -13.225 44.285 -15.647 QT
44.285 -17.006 44.145 -17.897 QT
44.004 -18.788 43.504 -19.522 QT
43.207 -19.959 42.738 -20.295 QT
42.27 -20.631 41.746 -20.811 QT
41.223 -20.991 40.676 -20.991 QT
39.832 -20.991 39.074 -20.608 QT
38.317 -20.225 37.817 -19.522 QT
37.317 -18.756 37.176 -17.834 QT
37.035 -16.913 37.035 -15.647 QT
37.035 -14.131 37.301 -12.928 QT
37.567 -11.725 38.363 -10.905 QT
39.16 -10.084 40.676 -10.084 QT
cp
f
GR
GS
[0.75 0 0 0.75 221.25021 25.22857] CT
N
54.719 -9.303 M
53.094 -9.303 51.758 -10.147 QT
50.422 -10.991 49.656 -12.413 QT
48.891 -13.834 48.891 -15.428 QT
48.891 -17.022 49.649 -18.483 QT
50.406 -19.944 51.75 -20.827 QT
53.094 -21.709 54.719 -21.709 QT
56.313 -21.709 57.609 -21.084 QT
58.906 -20.459 58.906 -19.053 QT
58.906 -18.522 58.531 -18.131 QT
58.156 -17.741 57.609 -17.741 QT
57.078 -17.741 56.695 -18.131 QT
56.313 -18.522 56.313 -19.053 QT
56.313 -19.522 56.617 -19.874 QT
56.922 -20.225 57.375 -20.319 QT
56.438 -20.913 54.75 -20.913 QT
53.453 -20.913 52.664 -20.053 QT
51.875 -19.194 51.563 -17.928 QT
51.25 -16.663 51.25 -15.428 QT
51.25 -14.116 51.633 -12.897 QT
52.016 -11.678 52.883 -10.881 QT
53.75 -10.084 55.047 -10.084 QT
56.328 -10.084 57.227 -10.874 QT
58.125 -11.663 58.453 -12.928 QT
58.453 -13.084 58.672 -13.084 QT
59 -13.084 L
59.078 -13.084 59.141 -13.006 QT
59.203 -12.928 59.203 -12.85 QT
59.203 -12.772 L
58.797 -11.163 57.586 -10.233 QT
56.375 -9.303 54.719 -9.303 QT
cp
f
GR
GS
[0.75 0 0 0.75 221.25021 25.22857] CT
N
60.68 -9.6 M
60.68 -10.553 L
61.602 -10.553 62.196 -10.694 QT
62.789 -10.834 62.789 -11.413 QT
62.789 -18.772 L
62.789 -19.819 62.391 -20.053 QT
61.993 -20.288 60.805 -20.288 QT
60.805 -21.241 L
64.696 -21.538 L
64.696 -11.413 L
64.696 -10.834 65.204 -10.694 QT
65.711 -10.553 66.571 -10.553 QT
66.571 -9.6 L
60.68 -9.6 L
cp
61.836 -26.178 M
61.836 -26.772 62.282 -27.217 QT
62.727 -27.663 63.305 -27.663 QT
63.696 -27.663 64.047 -27.467 QT
64.399 -27.272 64.594 -26.913 QT
64.789 -26.553 64.789 -26.178 QT
64.789 -25.584 64.344 -25.139 QT
63.899 -24.694 63.305 -24.694 QT
62.727 -24.694 62.282 -25.139 QT
61.836 -25.584 61.836 -26.178 QT
cp
f
GR
GS
[0.75 0 0 0.75 221.25021 25.22857] CT
N
70.009 -12.85 M
70.009 -20.288 L
67.775 -20.288 L
67.775 -20.991 L
69.541 -20.991 70.369 -22.639 QT
71.197 -24.288 71.197 -26.209 QT
71.978 -26.209 L
71.978 -21.241 L
75.791 -21.241 L
75.791 -20.288 L
71.978 -20.288 L
71.978 -12.897 L
71.978 -11.772 72.353 -10.928 QT
72.728 -10.084 73.713 -10.084 QT
74.634 -10.084 75.041 -10.975 QT
75.447 -11.866 75.447 -12.897 QT
75.447 -14.491 L
76.228 -14.491 L
76.228 -12.85 L
76.228 -12.006 75.916 -11.178 QT
75.603 -10.35 74.994 -9.827 QT
74.384 -9.303 73.525 -9.303 QT
71.9 -9.303 70.955 -10.272 QT
70.009 -11.241 70.009 -12.85 QT
cp
f
GR
GS
[0.75 0 0 0.75 221.25021 25.22857] CT
N
78.748 -5.163 M
79.264 -4.756 79.889 -4.756 QT
81.577 -4.756 82.67 -7.334 QT
83.592 -9.6 L
79.545 -19.522 L
79.295 -20.022 78.78 -20.155 QT
78.264 -20.288 77.405 -20.288 QT
77.405 -21.241 L
83.077 -21.241 L
83.077 -20.288 L
81.577 -20.288 81.577 -19.647 QT
81.577 -19.538 81.608 -19.491 QT
84.608 -12.1 L
87.311 -18.756 L
87.389 -18.959 87.389 -19.209 QT
87.389 -19.538 87.217 -19.78 QT
87.045 -20.022 86.756 -20.155 QT
86.467 -20.288 86.123 -20.288 QT
86.123 -21.241 L
90.608 -21.241 L
90.608 -20.288 L
89.764 -20.288 89.139 -19.905 QT
88.514 -19.522 88.17 -18.772 QT
83.514 -7.334 L
83.139 -6.459 82.647 -5.733 QT
82.155 -5.006 81.444 -4.538 QT
80.733 -4.069 79.889 -4.069 QT
78.889 -4.069 78.147 -4.717 QT
77.405 -5.366 77.405 -6.334 QT
77.405 -6.834 77.748 -7.178 QT
78.092 -7.522 78.592 -7.522 QT
78.936 -7.522 79.202 -7.366 QT
79.467 -7.209 79.623 -6.952 QT
79.78 -6.694 79.78 -6.334 QT
79.78 -5.897 79.491 -5.553 QT
79.202 -5.209 78.748 -5.163 QT
cp
f
GR
GS
[0.75 0 0 0.75 0 0.5] CT
0.2 0.702 0.2 RC
1 LJ
0.667 LW
N
101.625 155.333 M
129.25 141.715 L
156.875 130.149 L
184.5 120.635 L
212.125 113.173 L
239.75 107.763 L
267.375 104.405 L
295 103.1 L
322.625 103.847 L
350.25 106.646 L
377.875 111.497 L
405.5 118.4 L
433.125 127.355 L
460.75 138.363 L
488.375 151.422 L
S
GR
GS
[0.75 0 0 0.75 0 0.5] CT
1 LJ
0.667 LW
N
101.625 155.333 M
129.25 135.576 L
156.875 118.815 L
184.5 105.05 L
212.125 94.283 L
239.75 86.512 L
267.375 81.737 L
295 79.96 L
322.625 81.179 L
350.25 85.394 L
377.875 92.607 L
405.5 102.815 L
433.125 116.021 L
460.75 132.223 L
488.375 151.422 L
S
GR
GS
[0.75 0 0 0.75 0 0.5] CT
0 0 1 RC
1 LJ
0.667 LW
N
101.625 155.333 M
129.25 90.558 L
156.875 52.065 L
184.5 39.856 L
212.125 53.931 L
239.75 94.289 L
267.375 160.93 L
295 253.855 L
322.625 334.923 L
350.25 365.997 L
377.875 347.075 L
405.5 278.157 L
433.125 159.244 L
460.75 184.242 L
488.375 184.242 L
S
GR
GS
[0.75 0 0 0.75 0 0.5] CT
0.6 0.2 0.2 RC
1 LJ
0.667 LW
N
101.625 155.333 M
129.25 170.615 L
156.875 178.647 L
184.5 179.43 L
212.125 172.962 L
239.75 159.244 L
267.375 162.869 L
295 162.869 L
322.625 162.869 L
350.25 162.869 L
377.875 162.869 L
405.5 162.869 L
433.125 162.869 L
460.75 162.869 L
488.375 162.869 L
S
GR
GS
[0.75 0 0 0.75 0 0.5] CT
1 GC
N
505 158 M
505 50 L
381 50 L
381 158 L
cp
f
GR
GS
[0.75 0 0 0.75 320.86361 49.11029] CT
N
0.672 5.12 M
0.672 4.386 L
2.547 4.386 2.984 3.136 QT
7.391 -9.693 L
7.453 -9.911 7.734 -9.911 QT
8 -9.911 L
8.281 -9.911 8.344 -9.693 QT
12.938 3.714 L
13.141 4.151 13.688 4.268 QT
14.234 4.386 15.047 4.386 QT
15.047 5.12 L
9.203 5.12 L
9.203 4.386 L
10.938 4.386 10.938 3.823 QT
10.938 3.714 L
9.797 0.432 L
4.703 0.432 L
3.766 3.136 L
3.75 3.214 3.75 3.354 QT
3.75 3.886 4.242 4.136 QT
4.734 4.386 5.313 4.386 QT
5.313 5.12 L
0.672 5.12 L
cp
4.953 -0.302 M
9.563 -0.302 L
7.25 -7.005 L
4.953 -0.302 L
cp
f
GR
GS
[0.75 0 0 0.75 320.86361 49.11029] CT
N
16.578 6.761 M
16.578 6.011 17.125 5.456 QT
17.672 4.901 18.422 4.651 QT
18 4.339 17.781 3.854 QT
17.563 3.37 17.563 2.839 QT
17.563 1.854 18.188 1.089 QT
17.219 0.151 17.219 -1.068 QT
17.219 -1.724 17.5 -2.302 QT
17.781 -2.88 18.289 -3.302 QT
18.797 -3.724 19.406 -3.943 QT
20.016 -4.161 20.672 -4.161 QT
21.922 -4.161 22.906 -3.427 QT
23.344 -3.896 23.93 -4.146 QT
24.516 -4.396 25.156 -4.396 QT
25.609 -4.396 25.898 -4.075 QT
26.188 -3.755 26.188 -3.302 QT
26.188 -3.036 25.992 -2.841 QT
25.797 -2.646 25.531 -2.646 QT
25.266 -2.646 25.07 -2.841 QT
24.875 -3.036 24.875 -3.302 QT
24.875 -3.693 25.141 -3.849 QT
24.047 -3.849 23.266 -3.099 QT
23.656 -2.708 23.883 -2.161 QT
24.109 -1.614 24.109 -1.068 QT
24.109 -0.177 23.617 0.534 QT
23.125 1.245 22.32 1.636 QT
21.516 2.026 20.672 2.026 QT
19.516 2.026 18.563 1.401 QT
18.266 1.823 18.266 2.323 QT
18.266 2.886 18.633 3.3 QT
19 3.714 19.547 3.714 QT
21.266 3.714 L
22.516 3.714 23.523 3.94 QT
24.531 4.167 25.211 4.846 QT
25.891 5.526 25.891 6.761 QT
25.891 7.682 25.117 8.292 QT
24.344 8.901 23.258 9.175 QT
22.172 9.448 21.25 9.448 QT
20.313 9.448 19.227 9.175 QT
18.141 8.901 17.359 8.292 QT
16.578 7.682 16.578 6.761 QT
cp
17.766 6.761 M
17.766 7.464 18.336 7.94 QT
18.906 8.417 19.719 8.651 QT
20.531 8.886 21.25 8.886 QT
21.953 8.886 22.766 8.651 QT
23.578 8.417 24.148 7.94 QT
24.719 7.464 24.719 6.761 QT
24.719 5.667 23.711 5.339 QT
22.703 5.011 21.266 5.011 QT
19.547 5.011 L
19.063 5.011 18.656 5.245 QT
18.25 5.479 18.008 5.893 QT
17.766 6.307 17.766 6.761 QT
cp
20.672 1.464 M
22.453 1.464 22.453 -1.068 QT
22.453 -2.177 22.07 -2.888 QT
21.688 -3.599 20.672 -3.599 QT
19.641 -3.599 19.258 -2.888 QT
18.875 -2.177 18.875 -1.068 QT
18.875 -0.38 19.023 0.182 QT
19.172 0.745 19.563 1.104 QT
19.953 1.464 20.672 1.464 QT
cp
f
GR
GS
[0.75 0 0 0.75 320.86361 49.11029] CT
N
31.901 5.354 M
30.62 5.354 29.55 4.682 QT
28.479 4.011 27.862 2.886 QT
27.245 1.761 27.245 0.511 QT
27.245 -0.708 27.807 -1.818 QT
28.37 -2.927 29.37 -3.607 QT
30.37 -4.286 31.604 -4.286 QT
32.557 -4.286 33.276 -3.966 QT
33.995 -3.646 34.456 -3.075 QT
34.917 -2.505 35.151 -1.724 QT
35.385 -0.943 35.385 -0.005 QT
35.385 0.276 35.167 0.276 QT
29.089 0.276 L
29.089 0.495 L
29.089 2.245 29.792 3.495 QT
30.495 4.745 32.089 4.745 QT
32.729 4.745 33.276 4.456 QT
33.823 4.167 34.229 3.651 QT
34.635 3.136 34.776 2.557 QT
34.792 2.479 34.854 2.425 QT
34.917 2.37 34.979 2.37 QT
35.167 2.37 L
35.385 2.37 35.385 2.636 QT
35.089 3.823 34.104 4.589 QT
33.12 5.354 31.901 5.354 QT
cp
29.104 -0.255 M
33.901 -0.255 L
33.901 -1.036 33.675 -1.849 QT
33.448 -2.661 32.94 -3.2 QT
32.432 -3.739 31.604 -3.739 QT
30.417 -3.739 29.76 -2.63 QT
29.104 -1.521 29.104 -0.255 QT
cp
f
GR
GS
[0.75 0 0 0.75 320.86361 49.11029] CT
N
36.773 5.12 M
36.773 4.386 L
37.492 4.386 37.953 4.268 QT
38.414 4.151 38.414 3.714 QT
38.414 -2.021 L
38.414 -2.583 38.242 -2.833 QT
38.07 -3.083 37.758 -3.138 QT
37.445 -3.193 36.773 -3.193 QT
36.773 -3.927 L
39.82 -4.161 L
39.82 -2.114 L
40.242 -3.005 41.07 -3.583 QT
41.898 -4.161 42.867 -4.161 QT
44.32 -4.161 45.054 -3.466 QT
45.789 -2.771 45.789 -1.333 QT
45.789 3.714 L
45.789 4.151 46.25 4.268 QT
46.711 4.386 47.429 4.386 QT
47.429 5.12 L
42.617 5.12 L
42.617 4.386 L
43.336 4.386 43.797 4.268 QT
44.258 4.151 44.258 3.714 QT
44.258 -1.271 L
44.258 -2.286 43.961 -2.95 QT
43.664 -3.614 42.742 -3.614 QT
41.523 -3.614 40.734 -2.638 QT
39.945 -1.661 39.945 -0.427 QT
39.945 3.714 L
39.945 4.151 40.414 4.268 QT
40.883 4.386 41.586 4.386 QT
41.586 5.12 L
36.773 5.12 L
cp
f
GR
GS
[0.75 0 0 0.75 320.86361 49.11029] CT
N
49.548 2.604 M
49.548 -3.193 L
47.814 -3.193 L
47.814 -3.739 L
49.189 -3.739 49.829 -5.021 QT
50.47 -6.302 50.47 -7.802 QT
51.079 -7.802 L
51.079 -3.927 L
54.048 -3.927 L
54.048 -3.193 L
51.079 -3.193 L
51.079 2.557 L
51.079 3.432 51.368 4.089 QT
51.657 4.745 52.423 4.745 QT
53.142 4.745 53.462 4.05 QT
53.782 3.354 53.782 2.557 QT
53.782 1.323 L
54.376 1.323 L
54.376 2.604 L
54.376 3.261 54.134 3.901 QT
53.892 4.542 53.423 4.948 QT
52.954 5.354 52.282 5.354 QT
51.017 5.354 50.282 4.604 QT
49.548 3.854 49.548 2.604 QT
cp
f
GR
GS
[0.75 0 0 0.75 320.86361 49.11029] CT
N
64.768 5.12 M
64.768 4.386 L
67.393 4.386 67.393 3.714 QT
67.393 -7.302 L
66.299 -6.786 64.643 -6.786 QT
64.643 -7.521 L
67.221 -7.521 68.534 -8.864 QT
68.831 -8.864 L
68.893 -8.864 68.963 -8.81 QT
69.034 -8.755 69.034 -8.677 QT
69.034 3.714 L
69.034 4.386 71.659 4.386 QT
71.659 5.12 L
64.768 5.12 L
cp
f
GR
GS
[0.75 0 0 0.75 0 0.5] CT
0.2 0.702 0.2 RC
1 LJ
0.667 LW
N
384.985 64.814 M
424.83 64.814 L
S
GR
GS
[0.75 0 0 0.75 320.86361 68.70343] CT
N
/f-597267615{0.672 5.12 M
0.672 4.386 L
2.547 4.386 2.984 3.136 QT
7.391 -9.693 L
7.453 -9.911 7.734 -9.911 QT
8 -9.911 L
8.281 -9.911 8.344 -9.693 QT
12.938 3.714 L
13.141 4.151 13.688 4.268 QT
14.234 4.386 15.047 4.386 QT
15.047 5.12 L
9.203 5.12 L
9.203 4.386 L
10.938 4.386 10.938 3.823 QT
10.938 3.714 L
9.797 0.432 L
4.703 0.432 L
3.766 3.136 L
3.75 3.214 3.75 3.354 QT
3.75 3.886 4.242 4.136 QT
4.734 4.386 5.313 4.386 QT
5.313 5.12 L
0.672 5.12 L
cp
4.953 -0.302 M
9.563 -0.302 L
7.25 -7.005 L
4.953 -0.302 L
cp}def
f-597267615
f
GR
GS
[0.75 0 0 0.75 320.86361 68.70343] CT
N
/f-745240314{16.578 6.761 M
16.578 6.011 17.125 5.456 QT
17.672 4.901 18.422 4.651 QT
18 4.339 17.781 3.854 QT
17.563 3.37 17.563 2.839 QT
17.563 1.854 18.188 1.089 QT
17.219 0.151 17.219 -1.068 QT
17.219 -1.724 17.5 -2.302 QT
17.781 -2.88 18.289 -3.302 QT
18.797 -3.724 19.406 -3.943 QT
20.016 -4.161 20.672 -4.161 QT
21.922 -4.161 22.906 -3.427 QT
23.344 -3.896 23.93 -4.146 QT
24.516 -4.396 25.156 -4.396 QT
25.609 -4.396 25.898 -4.075 QT
26.188 -3.755 26.188 -3.302 QT
26.188 -3.036 25.992 -2.841 QT
25.797 -2.646 25.531 -2.646 QT
25.266 -2.646 25.07 -2.841 QT
24.875 -3.036 24.875 -3.302 QT
24.875 -3.693 25.141 -3.849 QT
24.047 -3.849 23.266 -3.099 QT
23.656 -2.708 23.883 -2.161 QT
24.109 -1.614 24.109 -1.068 QT
24.109 -0.177 23.617 0.534 QT
23.125 1.245 22.32 1.636 QT
21.516 2.026 20.672 2.026 QT
19.516 2.026 18.563 1.401 QT
18.266 1.823 18.266 2.323 QT
18.266 2.886 18.633 3.3 QT
19 3.714 19.547 3.714 QT
21.266 3.714 L
22.516 3.714 23.523 3.94 QT
24.531 4.167 25.211 4.846 QT
25.891 5.526 25.891 6.761 QT
25.891 7.682 25.117 8.292 QT
24.344 8.901 23.258 9.175 QT
22.172 9.448 21.25 9.448 QT
20.313 9.448 19.227 9.175 QT
18.141 8.901 17.359 8.292 QT
16.578 7.682 16.578 6.761 QT
cp
17.766 6.761 M
17.766 7.464 18.336 7.94 QT
18.906 8.417 19.719 8.651 QT
20.531 8.886 21.25 8.886 QT
21.953 8.886 22.766 8.651 QT
23.578 8.417 24.148 7.94 QT
24.719 7.464 24.719 6.761 QT
24.719 5.667 23.711 5.339 QT
22.703 5.011 21.266 5.011 QT
19.547 5.011 L
19.063 5.011 18.656 5.245 QT
18.25 5.479 18.008 5.893 QT
17.766 6.307 17.766 6.761 QT
cp
20.672 1.464 M
22.453 1.464 22.453 -1.068 QT
22.453 -2.177 22.07 -2.888 QT
21.688 -3.599 20.672 -3.599 QT
19.641 -3.599 19.258 -2.888 QT
18.875 -2.177 18.875 -1.068 QT
18.875 -0.38 19.023 0.182 QT
19.172 0.745 19.563 1.104 QT
19.953 1.464 20.672 1.464 QT
cp}def
f-745240314
f
GR
GS
[0.75 0 0 0.75 320.86361 68.70343] CT
N
/f1964844890{31.901 5.354 M
30.62 5.354 29.55 4.682 QT
28.479 4.011 27.862 2.886 QT
27.245 1.761 27.245 0.511 QT
27.245 -0.708 27.807 -1.818 QT
28.37 -2.927 29.37 -3.607 QT
30.37 -4.286 31.604 -4.286 QT
32.557 -4.286 33.276 -3.966 QT
33.995 -3.646 34.456 -3.075 QT
34.917 -2.505 35.151 -1.724 QT
35.385 -0.943 35.385 -0.005 QT
35.385 0.276 35.167 0.276 QT
29.089 0.276 L
29.089 0.495 L
29.089 2.245 29.792 3.495 QT
30.495 4.745 32.089 4.745 QT
32.729 4.745 33.276 4.456 QT
33.823 4.167 34.229 3.651 QT
34.635 3.136 34.776 2.557 QT
34.792 2.479 34.854 2.425 QT
34.917 2.37 34.979 2.37 QT
35.167 2.37 L
35.385 2.37 35.385 2.636 QT
35.089 3.823 34.104 4.589 QT
33.12 5.354 31.901 5.354 QT
cp
29.104 -0.255 M
33.901 -0.255 L
33.901 -1.036 33.675 -1.849 QT
33.448 -2.661 32.94 -3.2 QT
32.432 -3.739 31.604 -3.739 QT
30.417 -3.739 29.76 -2.63 QT
29.104 -1.521 29.104 -0.255 QT
cp}def
f1964844890
f
GR
GS
[0.75 0 0 0.75 320.86361 68.70343] CT
N
/f1881606250{36.773 5.12 M
36.773 4.386 L
37.492 4.386 37.953 4.268 QT
38.414 4.151 38.414 3.714 QT
38.414 -2.021 L
38.414 -2.583 38.242 -2.833 QT
38.07 -3.083 37.758 -3.138 QT
37.445 -3.193 36.773 -3.193 QT
36.773 -3.927 L
39.82 -4.161 L
39.82 -2.114 L
40.242 -3.005 41.07 -3.583 QT
41.898 -4.161 42.867 -4.161 QT
44.32 -4.161 45.054 -3.466 QT
45.789 -2.771 45.789 -1.333 QT
45.789 3.714 L
45.789 4.151 46.25 4.268 QT
46.711 4.386 47.429 4.386 QT
47.429 5.12 L
42.617 5.12 L
42.617 4.386 L
43.336 4.386 43.797 4.268 QT
44.258 4.151 44.258 3.714 QT
44.258 -1.271 L
44.258 -2.286 43.961 -2.95 QT
43.664 -3.614 42.742 -3.614 QT
41.523 -3.614 40.734 -2.638 QT
39.945 -1.661 39.945 -0.427 QT
39.945 3.714 L
39.945 4.151 40.414 4.268 QT
40.883 4.386 41.586 4.386 QT
41.586 5.12 L
36.773 5.12 L
cp}def
f1881606250
f
GR
GS
[0.75 0 0 0.75 320.86361 68.70343] CT
N
/f-1218143468{49.548 2.604 M
49.548 -3.193 L
47.814 -3.193 L
47.814 -3.739 L
49.189 -3.739 49.829 -5.021 QT
50.47 -6.302 50.47 -7.802 QT
51.079 -7.802 L
51.079 -3.927 L
54.048 -3.927 L
54.048 -3.193 L
51.079 -3.193 L
51.079 2.557 L
51.079 3.432 51.368 4.089 QT
51.657 4.745 52.423 4.745 QT
53.142 4.745 53.462 4.05 QT
53.782 3.354 53.782 2.557 QT
53.782 1.323 L
54.376 1.323 L
54.376 2.604 L
54.376 3.261 54.134 3.901 QT
53.892 4.542 53.423 4.948 QT
52.954 5.354 52.282 5.354 QT
51.017 5.354 50.282 4.604 QT
49.548 3.854 49.548 2.604 QT
cp}def
f-1218143468
f
GR
GS
[0.75 0 0 0.75 320.86361 68.70343] CT
N
/f-1429999007{63.862 5.12 M
63.862 4.557 L
63.862 4.511 63.909 4.448 QT
67.159 0.839 L
67.909 0.026 68.37 -0.513 QT
68.831 -1.052 69.276 -1.763 QT
69.721 -2.474 69.987 -3.2 QT
70.252 -3.927 70.252 -4.755 QT
70.252 -5.614 69.932 -6.404 QT
69.612 -7.193 68.979 -7.661 QT
68.346 -8.13 67.456 -8.13 QT
66.549 -8.13 65.823 -7.583 QT
65.096 -7.036 64.799 -6.161 QT
64.877 -6.177 65.018 -6.177 QT
65.487 -6.177 65.823 -5.864 QT
66.159 -5.552 66.159 -5.036 QT
66.159 -4.568 65.823 -4.232 QT
65.487 -3.896 65.018 -3.896 QT
64.534 -3.896 64.198 -4.239 QT
63.862 -4.583 63.862 -5.036 QT
63.862 -5.833 64.159 -6.521 QT
64.456 -7.208 65.018 -7.747 QT
65.581 -8.286 66.276 -8.575 QT
66.971 -8.864 67.768 -8.864 QT
68.971 -8.864 70.002 -8.357 QT
71.034 -7.849 71.643 -6.919 QT
72.252 -5.989 72.252 -4.755 QT
72.252 -3.849 71.854 -3.029 QT
71.456 -2.208 70.831 -1.536 QT
70.206 -0.864 69.229 -0.013 QT
68.252 0.839 67.94 1.136 QT
65.565 3.417 L
67.581 3.417 L
69.065 3.417 70.065 3.393 QT
71.065 3.37 71.127 3.307 QT
71.377 3.042 71.627 1.37 QT
72.252 1.37 L
71.659 5.12 L
63.862 5.12 L
cp}def
f-1429999007
f
GR
GS
[0.75 0 0 0.75 0 0.5] CT
1 LJ
0.667 LW
N
384.985 90.938 M
424.83 90.938 L
S
GR
GS
[0.75 0 0 0.75 320.86361 88.29657] CT
N
f-597267615
f
GR
GS
[0.75 0 0 0.75 320.86361 88.29657] CT
N
f-745240314
f
GR
GS
[0.75 0 0 0.75 320.86361 88.29657] CT
N
f1964844890
f
GR
GS
[0.75 0 0 0.75 320.86361 88.29657] CT
N
f1881606250
f
GR
GS
[0.75 0 0 0.75 320.86361 88.29657] CT
N
f-1218143468
f
GR
GS
[0.75 0 0 0.75 320.86361 88.29657] CT
N
/f300774680{64.815 3.495 M
65.299 4.214 66.135 4.565 QT
66.971 4.917 67.924 4.917 QT
69.143 4.917 69.659 3.878 QT
70.174 2.839 70.174 1.511 QT
70.174 0.917 70.065 0.323 QT
69.956 -0.271 69.698 -0.786 QT
69.44 -1.302 68.995 -1.607 QT
68.549 -1.911 67.909 -1.911 QT
66.502 -1.911 L
66.315 -1.911 66.315 -2.114 QT
66.315 -2.286 L
66.315 -2.458 66.502 -2.458 QT
67.659 -2.552 L
68.409 -2.552 68.893 -3.107 QT
69.377 -3.661 69.604 -4.45 QT
69.831 -5.239 69.831 -5.958 QT
69.831 -6.974 69.362 -7.614 QT
68.893 -8.255 67.924 -8.255 QT
67.127 -8.255 66.393 -7.958 QT
65.659 -7.661 65.237 -7.036 QT
65.284 -7.052 65.307 -7.06 QT
65.331 -7.068 65.377 -7.068 QT
65.846 -7.068 66.166 -6.739 QT
66.487 -6.411 66.487 -5.943 QT
66.487 -5.489 66.166 -5.161 QT
65.846 -4.833 65.377 -4.833 QT
64.924 -4.833 64.596 -5.161 QT
64.268 -5.489 64.268 -5.943 QT
64.268 -6.849 64.807 -7.513 QT
65.346 -8.177 66.206 -8.521 QT
67.065 -8.864 67.924 -8.864 QT
68.565 -8.864 69.268 -8.677 QT
69.971 -8.489 70.549 -8.138 QT
71.127 -7.786 71.487 -7.232 QT
71.846 -6.677 71.846 -5.958 QT
71.846 -5.083 71.456 -4.333 QT
71.065 -3.583 70.377 -3.044 QT
69.69 -2.505 68.862 -2.239 QT
69.784 -2.052 70.604 -1.544 QT
71.424 -1.036 71.916 -0.232 QT
72.409 0.573 72.409 1.495 QT
72.409 2.651 71.776 3.589 QT
71.143 4.526 70.104 5.057 QT
69.065 5.589 67.924 5.589 QT
66.94 5.589 65.948 5.214 QT
64.956 4.839 64.323 4.089 QT
63.69 3.339 63.69 2.292 QT
63.69 1.761 64.041 1.417 QT
64.393 1.073 64.924 1.073 QT
65.252 1.073 65.534 1.229 QT
65.815 1.386 65.979 1.675 QT
66.143 1.964 66.143 2.292 QT
66.143 2.807 65.784 3.151 QT
65.424 3.495 64.924 3.495 QT
64.815 3.495 L
cp}def
f300774680
f
GR
GS
[0.75 0 0 0.75 0 0.5] CT
0 0 1 RC
1 LJ
0.667 LW
N
384.985 117.062 M
424.83 117.062 L
S
GR
GS
[0.75 0 0 0.75 320.86361 107.88971] CT
N
f-597267615
f
GR
GS
[0.75 0 0 0.75 320.86361 107.88971] CT
N
f-745240314
f
GR
GS
[0.75 0 0 0.75 320.86361 107.88971] CT
N
f1964844890
f
GR
GS
[0.75 0 0 0.75 320.86361 107.88971] CT
N
f1881606250
f
GR
GS
[0.75 0 0 0.75 320.86361 107.88971] CT
N
f-1218143468
f
GR
GS
[0.75 0 0 0.75 320.86361 107.88971] CT
N
/f-1674298674{63.393 1.651 M
63.393 0.917 L
69.893 -8.771 L
69.956 -8.864 70.112 -8.864 QT
70.409 -8.864 L
70.643 -8.864 70.643 -8.63 QT
70.643 0.917 L
72.706 0.917 L
72.706 1.651 L
70.643 1.651 L
70.643 3.714 L
70.643 4.151 71.26 4.268 QT
71.877 4.386 72.69 4.386 QT
72.69 5.12 L
66.909 5.12 L
66.909 4.386 L
67.721 4.386 68.331 4.268 QT
68.94 4.151 68.94 3.714 QT
68.94 1.651 L
63.393 1.651 L
cp
64.096 0.917 M
69.065 0.917 L
69.065 -6.521 L
64.096 0.917 L
cp}def
f-1674298674
f
GR
GS
[0.75 0 0 0.75 0 0.5] CT
0.6 0.2 0.2 RC
1 LJ
0.667 LW
N
384.985 143.186 M
424.83 143.186 L
S
GR
GS
[0.75 0 0 0.75 0 0.5] CT
0.149 GC
10.0 ML
0.667 LW
N
381 158 M
381 50 L
505 50 L
505 158 L
cp
S
GR
%%Trailer
%%Pages: 1
%%EOF
