%!PS-Adobe-3.0 EPSF-3.0
%%Creator: (MATLAB, The Mathworks, Inc. Version 9.12.0.2529717 \(R2022a\) Update 8. Operating System: Linux)
%%Title: plots/Example3_rx.eps
%%CreationDate: 2024-06-25T03:53:06
%%Pages: (atend)
%%BoundingBox:     6     3   381   311
%%LanguageLevel: 3
%%EndComments
%%BeginProlog
%%BeginResource: procset (Apache XML Graphics Std ProcSet) 1.2 0
%%Version: 1.2 0
%%Copyright: (Copyright 2001-2003,2010 The Apache Software Foundation. License terms: http://www.apache.org/licenses/LICENSE-2.0)
/bd{bind def}bind def
/ld{load def}bd
/GR/grestore ld
/GS/gsave ld
/RM/rmoveto ld
/C/curveto ld
/t/show ld
/L/lineto ld
/ML/setmiterlimit ld
/CT/concat ld
/f/fill ld
/N/newpath ld
/S/stroke ld
/CC/setcmykcolor ld
/A/ashow ld
/cp/closepath ld
/RC/setrgbcolor ld
/LJ/setlinejoin ld
/GC/setgray ld
/LW/setlinewidth ld
/M/moveto ld
/re {4 2 roll M
1 index 0 rlineto
0 exch rlineto
neg 0 rlineto
cp } bd
/_ctm matrix def
/_tm matrix def
/BT { _ctm currentmatrix pop matrix _tm copy pop 0 0 moveto } bd
/ET { _ctm setmatrix } bd
/iTm { _ctm setmatrix _tm concat } bd
/Tm { _tm astore pop iTm 0 0 moveto } bd
/ux 0.0 def
/uy 0.0 def
/F {
  /Tp exch def
  /Tf exch def
  Tf findfont Tp scalefont setfont
  /cf Tf def  /cs Tp def
} bd
/ULS {currentpoint /uy exch def /ux exch def} bd
/ULE {
  /Tcx currentpoint pop def
  gsave
  newpath
  cf findfont cs scalefont dup
  /FontMatrix get 0 get /Ts exch def /FontInfo get dup
  /UnderlinePosition get Ts mul /To exch def
  /UnderlineThickness get Ts mul /Tt exch def
  ux uy To add moveto  Tcx uy To add lineto
  Tt setlinewidth stroke
  grestore
} bd
/OLE {
  /Tcx currentpoint pop def
  gsave
  newpath
  cf findfont cs scalefont dup
  /FontMatrix get 0 get /Ts exch def /FontInfo get dup
  /UnderlinePosition get Ts mul /To exch def
  /UnderlineThickness get Ts mul /Tt exch def
  ux uy To add cs add moveto Tcx uy To add cs add lineto
  Tt setlinewidth stroke
  grestore
} bd
/SOE {
  /Tcx currentpoint pop def
  gsave
  newpath
  cf findfont cs scalefont dup
  /FontMatrix get 0 get /Ts exch def /FontInfo get dup
  /UnderlinePosition get Ts mul /To exch def
  /UnderlineThickness get Ts mul /Tt exch def
  ux uy To add cs 10 mul 26 idiv add moveto Tcx uy To add cs 10 mul 26 idiv add lineto
  Tt setlinewidth stroke
  grestore
} bd
/QT {
/Y22 exch store
/X22 exch store
/Y21 exch store
/X21 exch store
currentpoint
/Y21 load 2 mul add 3 div exch
/X21 load 2 mul add 3 div exch
/X21 load 2 mul /X22 load add 3 div
/Y21 load 2 mul /Y22 load add 3 div
/X22 load /Y22 load curveto
} bd
/SSPD {
dup length /d exch dict def
{
/v exch def
/k exch def
currentpagedevice k known {
/cpdv currentpagedevice k get def
v cpdv ne {
/upd false def
/nullv v type /nulltype eq def
/nullcpdv cpdv type /nulltype eq def
nullv nullcpdv or
{
/upd true def
} {
/sametype v type cpdv type eq def
sametype {
v type /arraytype eq {
/vlen v length def
/cpdvlen cpdv length def
vlen cpdvlen eq {
0 1 vlen 1 sub {
/i exch def
/obj v i get def
/cpdobj cpdv i get def
obj cpdobj ne {
/upd true def
exit
} if
} for
} {
/upd true def
} ifelse
} {
v type /dicttype eq {
v {
/dv exch def
/dk exch def
/cpddv cpdv dk get def
dv cpddv ne {
/upd true def
exit
} if
} forall
} {
/upd true def
} ifelse
} ifelse
} if
} ifelse
upd true eq {
d k v put
} if
} if
} if
} forall
d length 0 gt {
d setpagedevice
} if
} bd
/RE { % /NewFontName [NewEncodingArray] /FontName RE -
  findfont dup length dict begin
  {
    1 index /FID ne
    {def} {pop pop} ifelse
  } forall
  /Encoding exch def
  /FontName 1 index def
  currentdict definefont pop
  end
} bind def
%%EndResource
%%BeginResource: procset (Apache XML Graphics EPS ProcSet) 1.0 0
%%Version: 1.0 0
%%Copyright: (Copyright 2002-2003 The Apache Software Foundation. License terms: http://www.apache.org/licenses/LICENSE-2.0)
/BeginEPSF { %def
/b4_Inc_state save def         % Save state for cleanup
/dict_count countdictstack def % Count objects on dict stack
/op_count count 1 sub def      % Count objects on operand stack
userdict begin                 % Push userdict on dict stack
/showpage { } def              % Redefine showpage, { } = null proc
0 setgray 0 setlinecap         % Prepare graphics state
1 setlinewidth 0 setlinejoin
10 setmiterlimit [ ] 0 setdash newpath
/languagelevel where           % If level not equal to 1 then
{pop languagelevel             % set strokeadjust and
1 ne                           % overprint to their defaults.
{false setstrokeadjust false setoverprint
} if
} if
} bd
/EndEPSF { %def
count op_count sub {pop} repeat            % Clean up stacks
countdictstack dict_count sub {end} repeat
b4_Inc_state restore
} bd
%%EndResource
%FOPBeginFontDict
%%IncludeResource: font Courier-Oblique
%%IncludeResource: font Courier-BoldOblique
%%IncludeResource: font Courier-Bold
%%IncludeResource: font ZapfDingbats
%%IncludeResource: font Symbol
%%IncludeResource: font Helvetica
%%IncludeResource: font Helvetica-Oblique
%%IncludeResource: font Helvetica-Bold
%%IncludeResource: font Helvetica-BoldOblique
%%IncludeResource: font Times-Roman
%%IncludeResource: font Times-Italic
%%IncludeResource: font Times-Bold
%%IncludeResource: font Times-BoldItalic
%%IncludeResource: font Courier
%FOPEndFontDict
%%BeginResource: encoding WinAnsiEncoding
/WinAnsiEncoding [
/.notdef /.notdef /.notdef /.notdef /.notdef
/.notdef /.notdef /.notdef /.notdef /.notdef
/.notdef /.notdef /.notdef /.notdef /.notdef
/.notdef /.notdef /.notdef /.notdef /.notdef
/.notdef /.notdef /.notdef /.notdef /.notdef
/.notdef /.notdef /.notdef /.notdef /.notdef
/.notdef /.notdef /space /exclam /quotedbl
/numbersign /dollar /percent /ampersand /quotesingle
/parenleft /parenright /asterisk /plus /comma
/hyphen /period /slash /zero /one
/two /three /four /five /six
/seven /eight /nine /colon /semicolon
/less /equal /greater /question /at
/A /B /C /D /E
/F /G /H /I /J
/K /L /M /N /O
/P /Q /R /S /T
/U /V /W /X /Y
/Z /bracketleft /backslash /bracketright /asciicircum
/underscore /quoteleft /a /b /c
/d /e /f /g /h
/i /j /k /l /m
/n /o /p /q /r
/s /t /u /v /w
/x /y /z /braceleft /bar
/braceright /asciitilde /bullet /Euro /bullet
/quotesinglbase /florin /quotedblbase /ellipsis /dagger
/daggerdbl /circumflex /perthousand /Scaron /guilsinglleft
/OE /bullet /Zcaron /bullet /bullet
/quoteleft /quoteright /quotedblleft /quotedblright /bullet
/endash /emdash /asciitilde /trademark /scaron
/guilsinglright /oe /bullet /zcaron /Ydieresis
/space /exclamdown /cent /sterling /currency
/yen /brokenbar /section /dieresis /copyright
/ordfeminine /guillemotleft /logicalnot /sfthyphen /registered
/macron /degree /plusminus /twosuperior /threesuperior
/acute /mu /paragraph /middot /cedilla
/onesuperior /ordmasculine /guillemotright /onequarter /onehalf
/threequarters /questiondown /Agrave /Aacute /Acircumflex
/Atilde /Adieresis /Aring /AE /Ccedilla
/Egrave /Eacute /Ecircumflex /Edieresis /Igrave
/Iacute /Icircumflex /Idieresis /Eth /Ntilde
/Ograve /Oacute /Ocircumflex /Otilde /Odieresis
/multiply /Oslash /Ugrave /Uacute /Ucircumflex
/Udieresis /Yacute /Thorn /germandbls /agrave
/aacute /acircumflex /atilde /adieresis /aring
/ae /ccedilla /egrave /eacute /ecircumflex
/edieresis /igrave /iacute /icircumflex /idieresis
/eth /ntilde /ograve /oacute /ocircumflex
/otilde /odieresis /divide /oslash /ugrave
/uacute /ucircumflex /udieresis /yacute /thorn
/ydieresis
] def
%%EndResource
%FOPBeginFontReencode
/Courier-Oblique findfont
dup length dict begin
  {1 index /FID ne {def} {pop pop} ifelse} forall
  /Encoding WinAnsiEncoding def
  currentdict
end
/Courier-Oblique exch definefont pop
/Courier-BoldOblique findfont
dup length dict begin
  {1 index /FID ne {def} {pop pop} ifelse} forall
  /Encoding WinAnsiEncoding def
  currentdict
end
/Courier-BoldOblique exch definefont pop
/Courier-Bold findfont
dup length dict begin
  {1 index /FID ne {def} {pop pop} ifelse} forall
  /Encoding WinAnsiEncoding def
  currentdict
end
/Courier-Bold exch definefont pop
/Helvetica findfont
dup length dict begin
  {1 index /FID ne {def} {pop pop} ifelse} forall
  /Encoding WinAnsiEncoding def
  currentdict
end
/Helvetica exch definefont pop
/Helvetica-Oblique findfont
dup length dict begin
  {1 index /FID ne {def} {pop pop} ifelse} forall
  /Encoding WinAnsiEncoding def
  currentdict
end
/Helvetica-Oblique exch definefont pop
/Helvetica-Bold findfont
dup length dict begin
  {1 index /FID ne {def} {pop pop} ifelse} forall
  /Encoding WinAnsiEncoding def
  currentdict
end
/Helvetica-Bold exch definefont pop
/Helvetica-BoldOblique findfont
dup length dict begin
  {1 index /FID ne {def} {pop pop} ifelse} forall
  /Encoding WinAnsiEncoding def
  currentdict
end
/Helvetica-BoldOblique exch definefont pop
/Times-Roman findfont
dup length dict begin
  {1 index /FID ne {def} {pop pop} ifelse} forall
  /Encoding WinAnsiEncoding def
  currentdict
end
/Times-Roman exch definefont pop
/Times-Italic findfont
dup length dict begin
  {1 index /FID ne {def} {pop pop} ifelse} forall
  /Encoding WinAnsiEncoding def
  currentdict
end
/Times-Italic exch definefont pop
/Times-Bold findfont
dup length dict begin
  {1 index /FID ne {def} {pop pop} ifelse} forall
  /Encoding WinAnsiEncoding def
  currentdict
end
/Times-Bold exch definefont pop
/Times-BoldItalic findfont
dup length dict begin
  {1 index /FID ne {def} {pop pop} ifelse} forall
  /Encoding WinAnsiEncoding def
  currentdict
end
/Times-BoldItalic exch definefont pop
/Courier findfont
dup length dict begin
  {1 index /FID ne {def} {pop pop} ifelse} forall
  /Encoding WinAnsiEncoding def
  currentdict
end
/Courier exch definefont pop
%FOPEndFontReencode
%%EndProlog
%%Page: 1 1
%%PageBoundingBox: 0 0 420 315
%%BeginPageSetup
N
    6     3 M
  387     3 L
  387   314 L
    6   314 L
cp
clip
[1 0 0 -1 0 315] CT
%%EndPageSetup
GS
[0.75 0 0 0.75 0 0] CT
1 GC
N
0 0 560 420 re
f
GR
GS
[0.75 0 0 0.75 0 0] CT
1 GC
N
0 0 560 420 re
f
GR
GS
[0.75 0 0 0.75 0 0] CT
1 GC
N
73 359 M
507 359 L
507 39 L
73 39 L
cp
f
GR
GS
[0.75 0 0 0.75 0 0] CT
0.873 GC
1 LJ
0.667 LW
N
73 359 M
73 39 L
S
GR
GS
[0.75 0 0 0.75 0 0] CT
0.873 GC
1 LJ
0.667 LW
N
156.462 359 M
156.462 39 L
S
GR
GS
[0.75 0 0 0.75 0 0] CT
0.873 GC
1 LJ
0.667 LW
N
239.923 359 M
239.923 39 L
S
GR
GS
[0.75 0 0 0.75 0 0] CT
0.873 GC
1 LJ
0.667 LW
N
323.385 359 M
323.385 39 L
S
GR
GS
[0.75 0 0 0.75 0 0] CT
0.873 GC
1 LJ
0.667 LW
N
406.846 359 M
406.846 39 L
S
GR
GS
[0.75 0 0 0.75 0 0] CT
0.873 GC
1 LJ
0.667 LW
N
490.308 359 M
490.308 39 L
S
GR
GS
[0.75 0 0 0.75 0 0] CT
0.873 GC
1 LJ
0.667 LW
N
507 359 M
73 359 L
S
GR
GS
[0.75 0 0 0.75 0 0] CT
0.873 GC
1 LJ
0.667 LW
N
507 327 M
73 327 L
S
GR
GS
[0.75 0 0 0.75 0 0] CT
0.873 GC
1 LJ
0.667 LW
N
507 295 M
73 295 L
S
GR
GS
[0.75 0 0 0.75 0 0] CT
0.873 GC
1 LJ
0.667 LW
N
507 263 M
73 263 L
S
GR
GS
[0.75 0 0 0.75 0 0] CT
0.873 GC
1 LJ
0.667 LW
N
507 231 M
73 231 L
S
GR
GS
[0.75 0 0 0.75 0 0] CT
0.873 GC
1 LJ
0.667 LW
N
507 199 M
73 199 L
S
GR
GS
[0.75 0 0 0.75 0 0] CT
0.873 GC
1 LJ
0.667 LW
N
507 167 M
73 167 L
S
GR
GS
[0.75 0 0 0.75 0 0] CT
0.873 GC
1 LJ
0.667 LW
N
507 135 M
73 135 L
S
GR
GS
[0.75 0 0 0.75 0 0] CT
0.873 GC
1 LJ
0.667 LW
N
507 103 M
73 103 L
S
GR
GS
[0.75 0 0 0.75 0 0] CT
0.873 GC
1 LJ
0.667 LW
N
507 71 M
73 71 L
S
GR
GS
[0.75 0 0 0.75 0 0] CT
0.873 GC
1 LJ
0.667 LW
N
507 39 M
73 39 L
S
GR
GS
[0.75 0 0 0.75 0 0] CT
0.149 GC
2 setlinecap
1 LJ
0.667 LW
N
73 359 M
507 359 L
S
GR
GS
[0.75 0 0 0.75 0 0] CT
0.149 GC
2 setlinecap
1 LJ
0.667 LW
N
73 359 M
73 354.66 L
S
GR
GS
[0.75 0 0 0.75 0 0] CT
0.149 GC
2 setlinecap
1 LJ
0.667 LW
N
156.462 359 M
156.462 354.66 L
S
GR
GS
[0.75 0 0 0.75 0 0] CT
0.149 GC
2 setlinecap
1 LJ
0.667 LW
N
239.923 359 M
239.923 354.66 L
S
GR
GS
[0.75 0 0 0.75 0 0] CT
0.149 GC
2 setlinecap
1 LJ
0.667 LW
N
323.385 359 M
323.385 354.66 L
S
GR
GS
[0.75 0 0 0.75 0 0] CT
0.149 GC
2 setlinecap
1 LJ
0.667 LW
N
406.846 359 M
406.846 354.66 L
S
GR
GS
[0.75 0 0 0.75 0 0] CT
0.149 GC
2 setlinecap
1 LJ
0.667 LW
N
490.308 359 M
490.308 354.66 L
S
GR
GS
[0.75 0 0 0.75 54.75 273.25001] CT
0.149 GC
/Helvetica 13.333 F
GS
[1 0 0 1 0 0] CT
-4 15 moveto 
1 -1 scale
(0) t 
GR
GR
GS
[0.75 0 0 0.75 117.34615 273.25001] CT
0.149 GC
/Helvetica 13.333 F
GS
[1 0 0 1 0 0] CT
-4 15 moveto 
1 -1 scale
(5) t 
GR
GR
GS
[0.75 0 0 0.75 179.94231 273.25001] CT
0.149 GC
/Helvetica 13.333 F
GS
[1 0 0 1 0 0] CT
-8 15 moveto 
1 -1 scale
(10) t 
GR
GR
GS
[0.75 0 0 0.75 242.53846 273.25001] CT
0.149 GC
/Helvetica 13.333 F
GS
[1 0 0 1 0 0] CT
-8 15 moveto 
1 -1 scale
(15) t 
GR
GR
GS
[0.75 0 0 0.75 305.13462 273.25001] CT
0.149 GC
/Helvetica 13.333 F
GS
[1 0 0 1 0 0] CT
-8 15 moveto 
1 -1 scale
(20) t 
GR
GR
GS
[0.75 0 0 0.75 367.73076 273.25001] CT
0.149 GC
/Helvetica 13.333 F
GS
[1 0 0 1 0 0] CT
-8 15 moveto 
1 -1 scale
(25) t 
GR
GR
GS
[0.75 0 0 0.75 217.50016 288.49999] CT
0.149 GC
N
-74.637 22.296 M
-74.637 21.859 -74.544 21.484 QT
-72.45 13.156 L
-75.497 13.156 L
-75.794 13.156 -75.794 12.781 QT
-75.684 12.14 -75.419 12.14 QT
-72.2 12.14 L
-71.044 7.406 L
-70.919 7.031 -70.583 6.757 QT
-70.247 6.484 -69.825 6.484 QT
-69.45 6.484 -69.2 6.702 QT
-68.95 6.921 -68.95 7.296 QT
-68.95 7.374 -68.958 7.429 QT
-68.965 7.484 -68.981 7.531 QT
-70.153 12.14 L
-67.153 12.14 L
-66.856 12.14 -66.856 12.515 QT
-66.872 12.593 -66.919 12.765 QT
-66.965 12.937 -67.036 13.046 QT
-67.106 13.156 -67.247 13.156 QT
-70.403 13.156 L
-72.481 21.546 L
-72.7 22.359 -72.7 22.952 QT
-72.7 24.202 -71.84 24.202 QT
-70.575 24.202 -69.59 23.007 QT
-68.606 21.812 -68.075 20.374 QT
-67.965 20.202 -67.856 20.202 QT
-67.497 20.202 L
-67.387 20.202 -67.317 20.281 QT
-67.247 20.359 -67.247 20.468 QT
-67.247 20.515 -67.278 20.546 QT
-67.903 22.296 -69.122 23.632 QT
-70.34 24.968 -71.919 24.968 QT
-73.059 24.968 -73.848 24.218 QT
-74.637 23.468 -74.637 22.296 QT
cp
f
GR
GS
[0.75 0 0 0.75 217.50016 288.49999] CT
0.149 GC
N
-63.576 22.562 M
-63.576 22.015 -63.342 21.421 QT
-60.998 15.187 L
-60.623 14.124 -60.623 13.437 QT
-60.623 12.577 -61.248 12.577 QT
-62.404 12.577 -63.146 13.757 QT
-63.889 14.937 -64.248 16.406 QT
-64.295 16.577 -64.482 16.577 QT
-64.826 16.577 L
-65.06 16.577 -65.06 16.312 QT
-65.06 16.234 L
-64.592 14.499 -63.631 13.163 QT
-62.67 11.827 -61.201 11.827 QT
-60.17 11.827 -59.451 12.507 QT
-58.732 13.187 -58.732 14.234 QT
-58.732 14.765 -58.967 15.359 QT
-61.326 21.593 L
-61.717 22.562 -61.717 23.343 QT
-61.717 24.202 -61.06 24.202 QT
-59.92 24.202 -59.162 22.991 QT
-58.404 21.781 -58.092 20.374 QT
-58.045 20.202 -57.873 20.202 QT
-57.514 20.202 L
-57.404 20.202 -57.334 20.281 QT
-57.264 20.359 -57.264 20.468 QT
-57.264 20.484 -57.295 20.546 QT
-57.685 22.187 -58.67 23.577 QT
-59.654 24.968 -61.107 24.968 QT
-62.139 24.968 -62.857 24.265 QT
-63.576 23.562 -63.576 22.562 QT
cp
-60.31 7.062 M
-60.31 6.452 -59.795 5.96 QT
-59.279 5.468 -58.67 5.468 QT
-58.185 5.468 -57.865 5.773 QT
-57.545 6.077 -57.545 6.546 QT
-57.545 7.187 -58.06 7.679 QT
-58.576 8.171 -59.201 8.171 QT
-59.67 8.171 -59.99 7.851 QT
-60.31 7.531 -60.31 7.062 QT
cp
f
GR
GS
[0.75 0 0 0.75 217.50016 288.49999] CT
0.149 GC
N
-53.502 24.14 M
-53.502 23.968 -53.47 23.89 QT
-51.298 15.234 L
-51.095 14.437 -51.095 13.827 QT
-51.095 12.577 -51.939 12.577 QT
-52.845 12.577 -53.283 13.663 QT
-53.72 14.749 -54.142 16.406 QT
-54.142 16.484 -54.22 16.531 QT
-54.298 16.577 -54.377 16.577 QT
-54.72 16.577 L
-54.814 16.577 -54.884 16.476 QT
-54.955 16.374 -54.955 16.281 QT
-54.642 15.031 -54.353 14.148 QT
-54.064 13.265 -53.447 12.546 QT
-52.83 11.827 -51.908 11.827 QT
-50.83 11.827 -49.994 12.515 QT
-49.158 13.202 -49.158 14.265 QT
-48.283 13.124 -47.127 12.476 QT
-45.97 11.827 -44.658 11.827 QT
-43.283 11.827 -42.291 12.531 QT
-41.298 13.234 -41.298 14.515 QT
-40.408 13.249 -39.205 12.538 QT
-38.002 11.827 -36.595 11.827 QT
-35.095 11.827 -34.181 12.64 QT
-33.267 13.452 -33.267 14.952 QT
-33.267 16.14 -33.798 17.827 QT
-34.33 19.515 -35.111 21.593 QT
-35.533 22.593 -35.533 23.343 QT
-35.533 24.202 -34.845 24.202 QT
-33.72 24.202 -32.97 22.984 QT
-32.22 21.765 -31.908 20.374 QT
-31.814 20.202 -31.658 20.202 QT
-31.33 20.202 L
-31.205 20.202 -31.127 20.281 QT
-31.048 20.359 -31.048 20.468 QT
-31.048 20.484 -31.08 20.546 QT
-31.486 22.187 -32.47 23.577 QT
-33.455 24.968 -34.923 24.968 QT
-35.939 24.968 -36.658 24.265 QT
-37.377 23.562 -37.377 22.562 QT
-37.377 22.046 -37.142 21.421 QT
-36.33 19.249 -35.783 17.531 QT
-35.236 15.812 -35.236 14.515 QT
-35.236 13.702 -35.556 13.14 QT
-35.877 12.577 -36.642 12.577 QT
-38.236 12.577 -39.392 13.546 QT
-40.548 14.515 -41.408 16.109 QT
-41.455 16.406 -41.486 16.562 QT
-43.361 23.999 L
-43.455 24.406 -43.806 24.687 QT
-44.158 24.968 -44.58 24.968 QT
-44.923 24.968 -45.181 24.741 QT
-45.439 24.515 -45.439 24.14 QT
-45.439 23.968 -45.408 23.89 QT
-43.564 16.499 L
-43.267 15.312 -43.267 14.515 QT
-43.267 13.702 -43.595 13.14 QT
-43.923 12.577 -44.72 12.577 QT
-45.783 12.577 -46.673 13.046 QT
-47.564 13.515 -48.228 14.281 QT
-48.892 15.046 -49.455 16.109 QT
-51.423 23.999 L
-51.517 24.406 -51.861 24.687 QT
-52.205 24.968 -52.642 24.968 QT
-52.986 24.968 -53.244 24.741 QT
-53.502 24.515 -53.502 24.14 QT
cp
f
GR
GS
[0.75 0 0 0.75 217.50016 288.49999] CT
0.149 GC
N
-24.153 24.968 M
-25.528 24.968 -26.575 24.241 QT
-27.621 23.515 -28.161 22.296 QT
-28.7 21.077 -28.7 19.718 QT
-28.7 17.64 -27.661 15.82 QT
-26.621 13.999 -24.84 12.913 QT
-23.059 11.827 -21.012 11.827 QT
-19.778 11.827 -18.848 12.468 QT
-17.918 13.109 -17.918 14.312 QT
-17.918 15.984 -19.246 16.796 QT
-20.575 17.609 -22.246 17.804 QT
-23.918 17.999 -25.95 17.999 QT
-26.028 17.999 L
-26.496 19.734 -26.496 20.952 QT
-26.496 22.249 -25.903 23.226 QT
-25.309 24.202 -24.09 24.202 QT
-22.356 24.202 -20.77 23.406 QT
-19.184 22.609 -18.168 21.218 QT
-18.09 21.124 -17.95 21.124 QT
-17.809 21.124 -17.661 21.288 QT
-17.512 21.452 -17.512 21.593 QT
-17.512 21.702 -17.559 21.765 QT
-18.621 23.249 -20.418 24.109 QT
-22.215 24.968 -24.153 24.968 QT
cp
-25.856 17.249 M
-24.168 17.249 -22.739 17.093 QT
-21.309 16.937 -20.153 16.304 QT
-18.996 15.671 -18.996 14.343 QT
-18.996 13.812 -19.293 13.406 QT
-19.59 12.999 -20.067 12.788 QT
-20.543 12.577 -21.043 12.577 QT
-22.278 12.577 -23.262 13.241 QT
-24.246 13.906 -24.887 14.976 QT
-25.528 16.046 -25.856 17.249 QT
cp
f
GR
GS
[0.75 0 0 0.75 217.50016 288.49999] CT
0.149 GC
N
-13.807 22.874 M
-13.026 24.202 -10.666 24.202 QT
-9.651 24.202 -8.729 23.851 QT
-7.807 23.499 -7.205 22.812 QT
-6.604 22.124 -6.604 21.124 QT
-6.604 20.374 -7.143 19.898 QT
-7.682 19.421 -8.463 19.249 QT
-10.041 18.937 L
-11.104 18.671 -11.799 17.929 QT
-12.494 17.187 -12.494 16.14 QT
-12.494 14.859 -11.799 13.866 QT
-11.104 12.874 -9.955 12.351 QT
-8.807 11.827 -7.572 11.827 QT
-6.26 11.827 -5.213 12.452 QT
-4.166 13.077 -4.166 14.312 QT
-4.166 14.984 -4.541 15.491 QT
-4.916 15.999 -5.588 15.999 QT
-5.979 15.999 -6.252 15.749 QT
-6.526 15.499 -6.526 15.124 QT
-6.526 14.781 -6.33 14.46 QT
-6.135 14.14 -5.822 13.952 QT
-5.51 13.765 -5.166 13.765 QT
-5.416 13.14 -6.119 12.859 QT
-6.822 12.577 -7.635 12.577 QT
-8.369 12.577 -9.104 12.874 QT
-9.838 13.171 -10.283 13.741 QT
-10.729 14.312 -10.729 15.093 QT
-10.729 15.624 -10.362 16.015 QT
-9.994 16.406 -9.447 16.577 QT
-7.776 16.921 L
-6.963 17.093 -6.291 17.523 QT
-5.619 17.952 -5.229 18.616 QT
-4.838 19.281 -4.838 20.124 QT
-4.838 21.202 -5.44 22.249 QT
-6.041 23.296 -6.916 23.921 QT
-8.463 24.968 -10.697 24.968 QT
-12.244 24.968 -13.533 24.257 QT
-14.822 23.546 -14.822 22.14 QT
-14.822 21.359 -14.362 20.773 QT
-13.901 20.187 -13.104 20.187 QT
-12.635 20.187 -12.322 20.468 QT
-12.01 20.749 -12.01 21.218 QT
-12.01 21.874 -12.502 22.374 QT
-12.994 22.874 -13.666 22.874 QT
-13.807 22.874 L
cp
f
GR
GS
[0.75 0 0 0.75 217.50016 288.49999] CT
0.149 GC
N
2.474 24.968 M
0.646 24.968 -0.408 23.585 QT
-1.463 22.202 -1.463 20.327 QT
-1.463 18.468 -0.502 16.468 QT
0.459 14.468 2.092 13.148 QT
3.724 11.827 5.615 11.827 QT
6.474 11.827 7.154 12.296 QT
7.834 12.765 8.224 13.562 QT
8.537 12.406 9.49 12.406 QT
9.865 12.406 10.107 12.624 QT
10.349 12.843 10.349 13.218 QT
10.349 13.296 10.349 13.343 QT
10.349 13.39 10.334 13.437 QT
8.303 21.546 L
8.099 22.406 8.099 22.952 QT
8.099 24.202 8.943 24.202 QT
9.849 24.202 10.326 23.046 QT
10.803 21.89 11.115 20.374 QT
11.178 20.202 11.349 20.202 QT
11.709 20.202 L
11.818 20.202 11.888 20.304 QT
11.959 20.406 11.959 20.484 QT
11.443 22.515 10.842 23.741 QT
10.24 24.968 8.881 24.968 QT
7.912 24.968 7.162 24.39 QT
6.412 23.812 6.224 22.874 QT
4.349 24.968 2.474 24.968 QT
cp
2.49 24.202 M
3.553 24.202 4.529 23.413 QT
5.506 22.624 6.224 21.562 QT
6.256 21.546 6.256 21.484 QT
7.803 15.187 L
7.834 15.093 L
7.662 14.062 7.092 13.32 QT
6.521 12.577 5.537 12.577 QT
4.568 12.577 3.724 13.374 QT
2.881 14.171 2.303 15.265 QT
1.74 16.421 1.217 18.452 QT
0.693 20.484 0.693 21.593 QT
0.693 22.593 1.131 23.398 QT
1.568 24.202 2.49 24.202 QT
cp
f
GR
GS
[0.75 0 0 0.75 217.50016 288.49999] CT
0.149 GC
N
15.167 24.14 M
15.167 23.968 15.198 23.89 QT
17.37 15.234 L
17.573 14.437 17.573 13.827 QT
17.573 12.577 16.73 12.577 QT
15.823 12.577 15.386 13.663 QT
14.948 14.749 14.527 16.406 QT
14.527 16.484 14.448 16.531 QT
14.37 16.577 14.292 16.577 QT
13.948 16.577 L
13.855 16.577 13.784 16.476 QT
13.714 16.374 13.714 16.281 QT
14.027 15.031 14.316 14.148 QT
14.605 13.265 15.222 12.546 QT
15.839 11.827 16.761 11.827 QT
17.839 11.827 18.675 12.515 QT
19.511 13.202 19.511 14.265 QT
20.386 13.124 21.542 12.476 QT
22.698 11.827 24.011 11.827 QT
25.386 11.827 26.378 12.531 QT
27.37 13.234 27.37 14.515 QT
28.261 13.249 29.464 12.538 QT
30.667 11.827 32.073 11.827 QT
33.573 11.827 34.487 12.64 QT
35.402 13.452 35.402 14.952 QT
35.402 16.14 34.87 17.827 QT
34.339 19.515 33.558 21.593 QT
33.136 22.593 33.136 23.343 QT
33.136 24.202 33.823 24.202 QT
34.948 24.202 35.698 22.984 QT
36.448 21.765 36.761 20.374 QT
36.855 20.202 37.011 20.202 QT
37.339 20.202 L
37.464 20.202 37.542 20.281 QT
37.62 20.359 37.62 20.468 QT
37.62 20.484 37.589 20.546 QT
37.183 22.187 36.198 23.577 QT
35.214 24.968 33.745 24.968 QT
32.73 24.968 32.011 24.265 QT
31.292 23.562 31.292 22.562 QT
31.292 22.046 31.527 21.421 QT
32.339 19.249 32.886 17.531 QT
33.433 15.812 33.433 14.515 QT
33.433 13.702 33.112 13.14 QT
32.792 12.577 32.027 12.577 QT
30.433 12.577 29.277 13.546 QT
28.12 14.515 27.261 16.109 QT
27.214 16.406 27.183 16.562 QT
25.308 23.999 L
25.214 24.406 24.862 24.687 QT
24.511 24.968 24.089 24.968 QT
23.745 24.968 23.487 24.741 QT
23.23 24.515 23.23 24.14 QT
23.23 23.968 23.261 23.89 QT
25.105 16.499 L
25.402 15.312 25.402 14.515 QT
25.402 13.702 25.073 13.14 QT
24.745 12.577 23.948 12.577 QT
22.886 12.577 21.995 13.046 QT
21.105 13.515 20.441 14.281 QT
19.777 15.046 19.214 16.109 QT
17.245 23.999 L
17.152 24.406 16.808 24.687 QT
16.464 24.968 16.027 24.968 QT
15.683 24.968 15.425 24.741 QT
15.167 24.515 15.167 24.14 QT
cp
f
GR
GS
[0.75 0 0 0.75 217.50016 288.49999] CT
0.149 GC
N
37.969 30.265 M
37.703 30.265 37.703 29.89 QT
37.797 29.249 38.078 29.249 QT
38.985 29.249 39.344 29.093 QT
39.703 28.937 39.907 28.265 QT
43.172 15.202 L
43.391 14.671 43.391 13.827 QT
43.391 12.577 42.547 12.577 QT
41.641 12.577 41.196 13.663 QT
40.75 14.749 40.344 16.406 QT
40.344 16.577 40.11 16.577 QT
39.766 16.577 L
39.688 16.577 39.602 16.476 QT
39.516 16.374 39.516 16.281 QT
39.828 15.031 40.125 14.148 QT
40.422 13.265 41.032 12.546 QT
41.641 11.827 42.563 11.827 QT
43.563 11.827 44.313 12.382 QT
45.063 12.937 45.266 13.906 QT
46.063 12.984 47.024 12.406 QT
47.985 11.827 49.016 11.827 QT
50.235 11.827 51.133 12.476 QT
52.032 13.124 52.485 14.179 QT
52.938 15.234 52.938 16.452 QT
52.938 18.327 51.977 20.32 QT
51.016 22.312 49.383 23.64 QT
47.75 24.968 45.875 24.968 QT
45.032 24.968 44.344 24.484 QT
43.657 23.999 43.282 23.218 QT
41.953 28.374 L
41.891 28.796 41.875 28.874 QT
41.875 29.249 43.782 29.249 QT
44.078 29.249 44.078 29.624 QT
43.985 29.999 43.922 30.132 QT
43.86 30.265 43.594 30.265 QT
37.969 30.265 L
cp
45.907 24.202 M
46.922 24.202 47.782 23.374 QT
48.641 22.546 49.188 21.515 QT
49.578 20.734 49.922 19.609 QT
50.266 18.484 50.524 17.21 QT
50.782 15.937 50.782 15.187 QT
50.782 14.515 50.602 13.937 QT
50.422 13.359 50.024 12.968 QT
49.625 12.577 48.953 12.577 QT
47.891 12.577 46.953 13.335 QT
46.016 14.093 45.25 15.202 QT
45.25 15.312 L
43.641 21.702 L
43.844 22.749 44.407 23.476 QT
44.969 24.202 45.907 24.202 QT
cp
f
GR
GS
[0.75 0 0 0.75 217.50016 288.49999] CT
0.149 GC
N
54.727 22.296 M
54.727 22.202 54.743 22.031 QT
54.759 21.859 54.782 21.702 QT
54.806 21.546 54.806 21.452 QT
58.399 7.093 L
58.509 6.593 58.54 6.312 QT
58.54 5.843 56.665 5.843 QT
56.384 5.843 56.384 5.468 QT
56.399 5.39 56.446 5.21 QT
56.493 5.031 56.571 4.929 QT
56.649 4.827 56.79 4.827 QT
60.696 4.515 L
61.056 4.515 61.056 4.89 QT
56.868 21.562 L
56.665 22.031 56.665 22.952 QT
56.665 24.202 57.509 24.202 QT
58.399 24.202 58.845 23.093 QT
59.29 21.984 59.649 20.374 QT
59.712 20.202 59.884 20.202 QT
60.227 20.202 L
60.337 20.202 60.415 20.296 QT
60.493 20.39 60.493 20.484 QT
60.165 21.89 59.884 22.702 QT
59.602 23.515 58.993 24.241 QT
58.384 24.968 57.446 24.968 QT
56.29 24.968 55.509 24.218 QT
54.727 23.468 54.727 22.296 QT
cp
f
GR
GS
[0.75 0 0 0.75 217.50016 288.49999] CT
0.149 GC
N
68.604 24.968 M
67.229 24.968 66.182 24.241 QT
65.135 23.515 64.596 22.296 QT
64.057 21.077 64.057 19.718 QT
64.057 17.64 65.096 15.82 QT
66.135 13.999 67.916 12.913 QT
69.698 11.827 71.745 11.827 QT
72.979 11.827 73.909 12.468 QT
74.838 13.109 74.838 14.312 QT
74.838 15.984 73.51 16.796 QT
72.182 17.609 70.51 17.804 QT
68.838 17.999 66.807 17.999 QT
66.729 17.999 L
66.26 19.734 66.26 20.952 QT
66.26 22.249 66.854 23.226 QT
67.448 24.202 68.666 24.202 QT
70.401 24.202 71.987 23.406 QT
73.573 22.609 74.588 21.218 QT
74.666 21.124 74.807 21.124 QT
74.948 21.124 75.096 21.288 QT
75.245 21.452 75.245 21.593 QT
75.245 21.702 75.198 21.765 QT
74.135 23.249 72.338 24.109 QT
70.541 24.968 68.604 24.968 QT
cp
66.901 17.249 M
68.588 17.249 70.018 17.093 QT
71.448 16.937 72.604 16.304 QT
73.76 15.671 73.76 14.343 QT
73.76 13.812 73.463 13.406 QT
73.166 12.999 72.69 12.788 QT
72.213 12.577 71.713 12.577 QT
70.479 12.577 69.495 13.241 QT
68.51 13.906 67.87 14.976 QT
67.229 16.046 66.901 17.249 QT
cp
f
GR
GS
[0.75 0 0 0.75 0 0] CT
0.149 GC
2 setlinecap
1 LJ
0.667 LW
N
73 359 M
73 39 L
S
GR
GS
[0.75 0 0 0.75 0 0] CT
0.149 GC
2 setlinecap
1 LJ
0.667 LW
N
73 359 M
77.34 359 L
S
GR
GS
[0.75 0 0 0.75 0 0] CT
0.149 GC
2 setlinecap
1 LJ
0.667 LW
N
73 327 M
77.34 327 L
S
GR
GS
[0.75 0 0 0.75 0 0] CT
0.149 GC
2 setlinecap
1 LJ
0.667 LW
N
73 295 M
77.34 295 L
S
GR
GS
[0.75 0 0 0.75 0 0] CT
0.149 GC
2 setlinecap
1 LJ
0.667 LW
N
73 263 M
77.34 263 L
S
GR
GS
[0.75 0 0 0.75 0 0] CT
0.149 GC
2 setlinecap
1 LJ
0.667 LW
N
73 231 M
77.34 231 L
S
GR
GS
[0.75 0 0 0.75 0 0] CT
0.149 GC
2 setlinecap
1 LJ
0.667 LW
N
73 199 M
77.34 199 L
S
GR
GS
[0.75 0 0 0.75 0 0] CT
0.149 GC
2 setlinecap
1 LJ
0.667 LW
N
73 167 M
77.34 167 L
S
GR
GS
[0.75 0 0 0.75 0 0] CT
0.149 GC
2 setlinecap
1 LJ
0.667 LW
N
73 135 M
77.34 135 L
S
GR
GS
[0.75 0 0 0.75 0 0] CT
0.149 GC
2 setlinecap
1 LJ
0.667 LW
N
73 103 M
77.34 103 L
S
GR
GS
[0.75 0 0 0.75 0 0] CT
0.149 GC
2 setlinecap
1 LJ
0.667 LW
N
73 71 M
77.34 71 L
S
GR
GS
[0.75 0 0 0.75 0 0] CT
0.149 GC
2 setlinecap
1 LJ
0.667 LW
N
73 39 M
77.34 39 L
S
GR
GS
[0.75 0 0 0.75 50.75 269.25] CT
0.149 GC
/Helvetica 13.333 F
GS
[1 0 0 1 0 0] CT
-20 5.5 moveto 
1 -1 scale
(-60) t 
GR
GR
GS
[0.75 0 0 0.75 50.75 245.25] CT
0.149 GC
/Helvetica 13.333 F
GS
[1 0 0 1 0 0] CT
-20 5.5 moveto 
1 -1 scale
(-40) t 
GR
GR
GS
[0.75 0 0 0.75 50.75 221.25] CT
0.149 GC
/Helvetica 13.333 F
GS
[1 0 0 1 0 0] CT
-20 5.5 moveto 
1 -1 scale
(-20) t 
GR
GR
GS
[0.75 0 0 0.75 50.75 197.25] CT
0.149 GC
/Helvetica 13.333 F
GS
[1 0 0 1 0 0] CT
-8 5.5 moveto 
1 -1 scale
(0) t 
GR
GR
GS
[0.75 0 0 0.75 50.75 173.25] CT
0.149 GC
/Helvetica 13.333 F
GS
[1 0 0 1 0 0] CT
-16 5.5 moveto 
1 -1 scale
(20) t 
GR
GR
GS
[0.75 0 0 0.75 50.75 149.25] CT
0.149 GC
/Helvetica 13.333 F
GS
[1 0 0 1 0 0] CT
-16 5.5 moveto 
1 -1 scale
(40) t 
GR
GR
GS
[0.75 0 0 0.75 50.75 125.25] CT
0.149 GC
/Helvetica 13.333 F
GS
[1 0 0 1 0 0] CT
-16 5.5 moveto 
1 -1 scale
(60) t 
GR
GR
GS
[0.75 0 0 0.75 50.75 101.25] CT
0.149 GC
/Helvetica 13.333 F
GS
[1 0 0 1 0 0] CT
-16 5.5 moveto 
1 -1 scale
(80) t 
GR
GR
GS
[0.75 0 0 0.75 50.75 77.25] CT
0.149 GC
/Helvetica 13.333 F
GS
[1 0 0 1 0 0] CT
-23 5.5 moveto 
1 -1 scale
(100) t 
GR
GR
GS
[0.75 0 0 0.75 50.75 53.25] CT
0.149 GC
/Helvetica 13.333 F
GS
[1 0 0 1 0 0] CT
-23 5.5 moveto 
1 -1 scale
(120) t 
GR
GR
GS
[0.75 0 0 0.75 50.75 29.25] CT
0.149 GC
/Helvetica 13.333 F
GS
[1 0 0 1 0 0] CT
-23 5.5 moveto 
1 -1 scale
(140) t 
GR
GR
GS
[0 -0.75 0.75 0 30.5 149.24989] CT
0.149 GC
N
-32.009 -11.06 M
-32.009 -11.232 -31.978 -11.31 QT
-29.806 -19.966 L
-29.603 -20.763 -29.603 -21.373 QT
-29.603 -22.623 -30.447 -22.623 QT
-31.353 -22.623 -31.791 -21.537 QT
-32.228 -20.451 -32.65 -18.794 QT
-32.65 -18.716 -32.728 -18.669 QT
-32.806 -18.623 -32.884 -18.623 QT
-33.228 -18.623 L
-33.322 -18.623 -33.392 -18.724 QT
-33.462 -18.826 -33.462 -18.919 QT
-33.15 -20.169 -32.861 -21.052 QT
-32.572 -21.935 -31.955 -22.654 QT
-31.337 -23.373 -30.416 -23.373 QT
-29.416 -23.373 -28.658 -22.794 QT
-27.9 -22.216 -27.712 -21.263 QT
-26.978 -22.232 -26.041 -22.802 QT
-25.103 -23.373 -23.978 -23.373 QT
-23.056 -23.373 -22.353 -22.834 QT
-21.65 -22.294 -21.65 -21.373 QT
-21.65 -20.638 -22.111 -20.091 QT
-22.572 -19.544 -23.337 -19.544 QT
-23.806 -19.544 -24.126 -19.841 QT
-24.447 -20.138 -24.447 -20.607 QT
-24.447 -21.232 -23.978 -21.74 QT
-23.509 -22.248 -22.9 -22.248 QT
-23.369 -22.623 -24.041 -22.623 QT
-25.275 -22.623 -26.197 -21.74 QT
-27.119 -20.857 -27.853 -19.498 QT
-29.931 -11.201 L
-30.025 -10.794 -30.369 -10.513 QT
-30.712 -10.232 -31.15 -10.232 QT
-31.494 -10.232 -31.751 -10.459 QT
-32.009 -10.685 -32.009 -11.06 QT
cp
f
GR
GS
[0 -0.75 0.75 0 30.5 149.24989] CT
0.149 GC
N
-19.369 -6.77 M
-18.994 -6.473 -18.322 -6.473 QT
-17.666 -6.473 -17.166 -7.105 QT
-16.666 -7.738 -16.478 -8.488 QT
-15.525 -12.207 L
-15.291 -13.223 -15.291 -13.598 QT
-15.291 -14.113 -15.588 -14.504 QT
-15.885 -14.895 -16.4 -14.895 QT
-17.072 -14.895 -17.658 -14.48 QT
-18.244 -14.066 -18.643 -13.426 QT
-19.041 -12.785 -19.197 -12.129 QT
-19.244 -11.988 -19.369 -11.988 QT
-19.619 -11.988 L
-19.791 -11.988 -19.791 -12.191 QT
-19.791 -12.254 L
-19.588 -13.035 -19.096 -13.777 QT
-18.603 -14.52 -17.893 -14.98 QT
-17.182 -15.441 -16.369 -15.441 QT
-15.588 -15.441 -14.971 -15.027 QT
-14.353 -14.613 -14.103 -13.91 QT
-13.744 -14.551 -13.182 -14.996 QT
-12.619 -15.441 -11.963 -15.441 QT
-11.51 -15.441 -11.033 -15.285 QT
-10.557 -15.129 -10.26 -14.801 QT
-9.963 -14.473 -9.963 -13.973 QT
-9.963 -13.441 -10.307 -13.059 QT
-10.65 -12.676 -11.182 -12.676 QT
-11.525 -12.676 -11.752 -12.887 QT
-11.978 -13.098 -11.978 -13.426 QT
-11.978 -13.879 -11.674 -14.207 QT
-11.369 -14.535 -10.947 -14.598 QT
-11.322 -14.895 -11.994 -14.895 QT
-12.666 -14.895 -13.166 -14.27 QT
-13.666 -13.645 -13.869 -12.879 QT
-14.791 -9.16 L
-15.025 -8.316 -15.025 -7.785 QT
-15.025 -7.254 -14.721 -6.863 QT
-14.416 -6.473 -13.916 -6.473 QT
-12.932 -6.473 -12.158 -7.34 QT
-11.385 -8.207 -11.135 -9.254 QT
-11.088 -9.363 -10.978 -9.363 QT
-10.713 -9.363 L
-10.635 -9.363 -10.58 -9.309 QT
-10.525 -9.254 -10.525 -9.191 QT
-10.525 -9.16 -10.557 -9.129 QT
-10.853 -7.879 -11.807 -6.902 QT
-12.76 -5.926 -13.947 -5.926 QT
-14.728 -5.926 -15.346 -6.34 QT
-15.963 -6.754 -16.228 -7.457 QT
-16.557 -6.848 -17.135 -6.387 QT
-17.713 -5.926 -18.369 -5.926 QT
-18.822 -5.926 -19.299 -6.082 QT
-19.775 -6.238 -20.072 -6.566 QT
-20.369 -6.895 -20.369 -7.395 QT
-20.369 -7.895 -20.025 -8.301 QT
-19.682 -8.707 -19.166 -8.707 QT
-18.822 -8.707 -18.58 -8.496 QT
-18.338 -8.285 -18.338 -7.941 QT
-18.338 -7.504 -18.635 -7.176 QT
-18.932 -6.848 -19.369 -6.77 QT
cp
f
GR
GS
[0 -0.75 0.75 0 30.5 149.24989] CT
0.149 GC
N
-4.386 -3.31 M
-4.386 -32.31 L
-0.417 -32.31 L
-0.417 -31.154 L
-3.214 -31.154 L
-3.214 -4.466 L
-0.417 -4.466 L
-0.417 -3.31 L
-4.386 -3.31 L
cp
f
GR
GS
[0 -0.75 0.75 0 30.5 149.24989] CT
0.149 GC
N
2.575 -11.06 M
2.575 -11.232 2.606 -11.31 QT
4.778 -19.966 L
4.981 -20.763 4.981 -21.373 QT
4.981 -22.623 4.137 -22.623 QT
3.231 -22.623 2.794 -21.537 QT
2.356 -20.451 1.934 -18.794 QT
1.934 -18.716 1.856 -18.669 QT
1.778 -18.623 1.7 -18.623 QT
1.356 -18.623 L
1.262 -18.623 1.192 -18.724 QT
1.122 -18.826 1.122 -18.919 QT
1.434 -20.169 1.723 -21.052 QT
2.012 -21.935 2.63 -22.654 QT
3.247 -23.373 4.169 -23.373 QT
5.247 -23.373 6.083 -22.685 QT
6.919 -21.998 6.919 -20.935 QT
7.794 -22.076 8.95 -22.724 QT
10.106 -23.373 11.419 -23.373 QT
12.794 -23.373 13.786 -22.669 QT
14.778 -21.966 14.778 -20.685 QT
15.669 -21.951 16.872 -22.662 QT
18.075 -23.373 19.481 -23.373 QT
20.981 -23.373 21.895 -22.56 QT
22.809 -21.748 22.809 -20.248 QT
22.809 -19.06 22.278 -17.373 QT
21.747 -15.685 20.965 -13.607 QT
20.544 -12.607 20.544 -11.857 QT
20.544 -10.998 21.231 -10.998 QT
22.356 -10.998 23.106 -12.216 QT
23.856 -13.435 24.169 -14.826 QT
24.262 -14.998 24.419 -14.998 QT
24.747 -14.998 L
24.872 -14.998 24.95 -14.919 QT
25.028 -14.841 25.028 -14.732 QT
25.028 -14.716 24.997 -14.654 QT
24.59 -13.013 23.606 -11.623 QT
22.622 -10.232 21.153 -10.232 QT
20.137 -10.232 19.419 -10.935 QT
18.7 -11.638 18.7 -12.638 QT
18.7 -13.154 18.934 -13.779 QT
19.747 -15.951 20.294 -17.669 QT
20.84 -19.388 20.84 -20.685 QT
20.84 -21.498 20.52 -22.06 QT
20.2 -22.623 19.434 -22.623 QT
17.84 -22.623 16.684 -21.654 QT
15.528 -20.685 14.669 -19.091 QT
14.622 -18.794 14.59 -18.638 QT
12.715 -11.201 L
12.622 -10.794 12.27 -10.513 QT
11.919 -10.232 11.497 -10.232 QT
11.153 -10.232 10.895 -10.459 QT
10.637 -10.685 10.637 -11.06 QT
10.637 -11.232 10.669 -11.31 QT
12.512 -18.701 L
12.809 -19.888 12.809 -20.685 QT
12.809 -21.498 12.481 -22.06 QT
12.153 -22.623 11.356 -22.623 QT
10.294 -22.623 9.403 -22.154 QT
8.512 -21.685 7.848 -20.919 QT
7.184 -20.154 6.622 -19.091 QT
4.653 -11.201 L
4.559 -10.794 4.215 -10.513 QT
3.872 -10.232 3.434 -10.232 QT
3.09 -10.232 2.833 -10.459 QT
2.575 -10.685 2.575 -11.06 QT
cp
f
GR
GS
[0 -0.75 0.75 0 30.5 149.24989] CT
0.149 GC
N
26.736 -3.31 M
26.736 -4.466 L
29.549 -4.466 L
29.549 -31.154 L
26.736 -31.154 L
26.736 -32.31 L
30.705 -32.31 L
30.705 -3.31 L
26.736 -3.31 L
cp
f
GR
GS
[0.75 0 0 0.75 217.50021 25.5] CT
N
-122.246 -9.6 M
-122.246 -10.553 L
-119.465 -10.553 -119.465 -11.413 QT
-119.465 -26.241 L
-119.465 -27.1 -122.246 -27.1 QT
-122.246 -28.038 L
-114.168 -28.038 L
-114.168 -27.1 L
-116.949 -27.1 -116.949 -26.241 QT
-116.949 -19.678 L
-108.981 -19.678 L
-108.981 -26.241 L
-108.981 -27.1 -111.762 -27.1 QT
-111.762 -28.038 L
-103.699 -28.038 L
-103.699 -27.1 L
-106.465 -27.1 -106.465 -26.241 QT
-106.465 -11.413 L
-106.465 -10.553 -103.699 -10.553 QT
-103.699 -9.6 L
-111.762 -9.6 L
-111.762 -10.553 L
-108.981 -10.553 -108.981 -11.413 QT
-108.981 -18.725 L
-116.949 -18.725 L
-116.949 -11.413 L
-116.949 -10.553 -114.168 -10.553 QT
-114.168 -9.6 L
-122.246 -9.6 L
cp
f
GR
GS
[0.75 0 0 0.75 217.50021 25.5] CT
N
-96.324 -9.303 M
-97.949 -9.303 -99.332 -10.124 QT
-100.715 -10.944 -101.52 -12.327 QT
-102.324 -13.709 -102.324 -15.35 QT
-102.324 -16.584 -101.879 -17.733 QT
-101.434 -18.881 -100.613 -19.788 QT
-99.793 -20.694 -98.699 -21.202 QT
-97.606 -21.709 -96.324 -21.709 QT
-94.668 -21.709 -93.301 -20.827 QT
-91.934 -19.944 -91.145 -18.475 QT
-90.356 -17.006 -90.356 -15.35 QT
-90.356 -13.725 -91.16 -12.334 QT
-91.965 -10.944 -93.34 -10.124 QT
-94.715 -9.303 -96.324 -9.303 QT
cp
-96.324 -10.084 M
-94.168 -10.084 -93.441 -11.655 QT
-92.715 -13.225 -92.715 -15.647 QT
-92.715 -17.006 -92.856 -17.897 QT
-92.996 -18.788 -93.496 -19.522 QT
-93.793 -19.959 -94.262 -20.295 QT
-94.731 -20.631 -95.254 -20.811 QT
-95.777 -20.991 -96.324 -20.991 QT
-97.168 -20.991 -97.926 -20.608 QT
-98.684 -20.225 -99.184 -19.522 QT
-99.684 -18.756 -99.824 -17.834 QT
-99.965 -16.913 -99.965 -15.647 QT
-99.965 -14.131 -99.699 -12.928 QT
-99.434 -11.725 -98.637 -10.905 QT
-97.84 -10.084 -96.324 -10.084 QT
cp
f
GR
GS
[0.75 0 0 0.75 217.50021 25.5] CT
N
-89.038 -9.6 M
-89.038 -10.553 L
-88.116 -10.553 -87.522 -10.694 QT
-86.928 -10.834 -86.928 -11.413 QT
-86.928 -18.772 L
-86.928 -19.506 -87.147 -19.827 QT
-87.366 -20.147 -87.772 -20.217 QT
-88.178 -20.288 -89.038 -20.288 QT
-89.038 -21.241 L
-85.178 -21.538 L
-85.178 -18.897 L
-84.741 -20.069 -83.936 -20.803 QT
-83.132 -21.538 -81.991 -21.538 QT
-81.178 -21.538 -80.546 -21.061 QT
-79.913 -20.584 -79.913 -19.803 QT
-79.913 -19.319 -80.264 -18.952 QT
-80.616 -18.584 -81.132 -18.584 QT
-81.632 -18.584 -81.991 -18.944 QT
-82.35 -19.303 -82.35 -19.803 QT
-82.35 -20.522 -81.835 -20.834 QT
-81.991 -20.834 L
-83.085 -20.834 -83.772 -20.045 QT
-84.46 -19.256 -84.757 -18.077 QT
-85.053 -16.897 -85.053 -15.834 QT
-85.053 -11.413 L
-85.053 -10.553 -82.428 -10.553 QT
-82.428 -9.6 L
-89.038 -9.6 L
cp
f
GR
GS
[0.75 0 0 0.75 217.50021 25.5] CT
N
-78.468 -9.6 M
-78.468 -10.553 L
-77.546 -10.553 -76.953 -10.694 QT
-76.359 -10.834 -76.359 -11.413 QT
-76.359 -18.772 L
-76.359 -19.819 -76.757 -20.053 QT
-77.156 -20.288 -78.343 -20.288 QT
-78.343 -21.241 L
-74.453 -21.538 L
-74.453 -11.413 L
-74.453 -10.834 -73.945 -10.694 QT
-73.437 -10.553 -72.578 -10.553 QT
-72.578 -9.6 L
-78.468 -9.6 L
cp
-77.312 -26.178 M
-77.312 -26.772 -76.867 -27.217 QT
-76.421 -27.663 -75.843 -27.663 QT
-75.453 -27.663 -75.101 -27.467 QT
-74.75 -27.272 -74.554 -26.913 QT
-74.359 -26.553 -74.359 -26.178 QT
-74.359 -25.584 -74.804 -25.139 QT
-75.25 -24.694 -75.843 -24.694 QT
-76.421 -24.694 -76.867 -25.139 QT
-77.312 -25.584 -77.312 -26.178 QT
cp
f
GR
GS
[0.75 0 0 0.75 217.50021 25.5] CT
N
-70.826 -9.6 M
-71.139 -9.6 -71.139 -9.897 QT
-71.139 -10.116 L
-71.139 -10.225 -71.061 -10.303 QT
-63.514 -20.522 L
-65.936 -20.522 L
-67.092 -20.522 -67.834 -20.381 QT
-68.576 -20.241 -69.061 -19.834 QT
-69.545 -19.428 -69.764 -18.725 QT
-69.983 -18.022 -69.983 -16.788 QT
-70.748 -16.788 L
-70.451 -21.241 L
-61.405 -21.241 L
-61.295 -21.241 -61.209 -21.155 QT
-61.123 -21.069 -61.123 -20.944 QT
-61.123 -20.788 L
-61.123 -20.694 -61.17 -20.6 QT
-68.717 -10.381 L
-66.139 -10.381 L
-64.967 -10.381 -64.186 -10.522 QT
-63.405 -10.663 -62.842 -11.225 QT
-62.326 -11.741 -62.139 -12.608 QT
-61.951 -13.475 -61.842 -14.756 QT
-61.061 -14.756 L
-61.53 -9.6 L
-70.826 -9.6 L
cp
f
GR
GS
[0.75 0 0 0.75 217.50021 25.5] CT
N
-53.287 -9.303 M
-54.912 -9.303 -56.295 -10.124 QT
-57.678 -10.944 -58.482 -12.327 QT
-59.287 -13.709 -59.287 -15.35 QT
-59.287 -16.584 -58.842 -17.733 QT
-58.397 -18.881 -57.576 -19.788 QT
-56.756 -20.694 -55.662 -21.202 QT
-54.568 -21.709 -53.287 -21.709 QT
-51.631 -21.709 -50.264 -20.827 QT
-48.897 -19.944 -48.107 -18.475 QT
-47.318 -17.006 -47.318 -15.35 QT
-47.318 -13.725 -48.123 -12.334 QT
-48.928 -10.944 -50.303 -10.124 QT
-51.678 -9.303 -53.287 -9.303 QT
cp
-53.287 -10.084 M
-51.131 -10.084 -50.404 -11.655 QT
-49.678 -13.225 -49.678 -15.647 QT
-49.678 -17.006 -49.818 -17.897 QT
-49.959 -18.788 -50.459 -19.522 QT
-50.756 -19.959 -51.225 -20.295 QT
-51.693 -20.631 -52.217 -20.811 QT
-52.74 -20.991 -53.287 -20.991 QT
-54.131 -20.991 -54.889 -20.608 QT
-55.647 -20.225 -56.147 -19.522 QT
-56.647 -18.756 -56.787 -17.834 QT
-56.928 -16.913 -56.928 -15.647 QT
-56.928 -14.131 -56.662 -12.928 QT
-56.397 -11.725 -55.6 -10.905 QT
-54.803 -10.084 -53.287 -10.084 QT
cp
f
GR
GS
[0.75 0 0 0.75 217.50021 25.5] CT
N
-45.907 -9.6 M
-45.907 -10.553 L
-44.969 -10.553 -44.383 -10.694 QT
-43.798 -10.834 -43.798 -11.413 QT
-43.798 -18.772 L
-43.798 -19.506 -44.008 -19.827 QT
-44.219 -20.147 -44.633 -20.217 QT
-45.048 -20.288 -45.907 -20.288 QT
-45.907 -21.241 L
-41.985 -21.538 L
-41.985 -18.897 L
-41.438 -20.053 -40.376 -20.795 QT
-39.313 -21.538 -38.063 -21.538 QT
-36.204 -21.538 -35.258 -20.639 QT
-34.313 -19.741 -34.313 -17.897 QT
-34.313 -11.413 L
-34.313 -10.834 -33.719 -10.694 QT
-33.126 -10.553 -32.204 -10.553 QT
-32.204 -9.6 L
-38.391 -9.6 L
-38.391 -10.553 L
-37.469 -10.553 -36.876 -10.694 QT
-36.282 -10.834 -36.282 -11.413 QT
-36.282 -17.819 L
-36.282 -19.131 -36.665 -19.983 QT
-37.048 -20.834 -38.219 -20.834 QT
-39.798 -20.834 -40.805 -19.584 QT
-41.813 -18.334 -41.813 -16.725 QT
-41.813 -11.413 L
-41.813 -10.834 -41.219 -10.694 QT
-40.626 -10.553 -39.719 -10.553 QT
-39.719 -9.6 L
-45.907 -9.6 L
cp
f
GR
GS
[0.75 0 0 0.75 217.50021 25.5] CT
N
-29.88 -12.85 M
-29.88 -20.288 L
-32.114 -20.288 L
-32.114 -20.991 L
-30.348 -20.991 -29.52 -22.639 QT
-28.692 -24.288 -28.692 -26.209 QT
-27.911 -26.209 L
-27.911 -21.241 L
-24.098 -21.241 L
-24.098 -20.288 L
-27.911 -20.288 L
-27.911 -12.897 L
-27.911 -11.772 -27.536 -10.928 QT
-27.161 -10.084 -26.177 -10.084 QT
-25.255 -10.084 -24.848 -10.975 QT
-24.442 -11.866 -24.442 -12.897 QT
-24.442 -14.491 L
-23.661 -14.491 L
-23.661 -12.85 L
-23.661 -12.006 -23.973 -11.178 QT
-24.286 -10.35 -24.895 -9.827 QT
-25.505 -9.303 -26.364 -9.303 QT
-27.989 -9.303 -28.934 -10.272 QT
-29.88 -11.241 -29.88 -12.85 QT
cp
f
GR
GS
[0.75 0 0 0.75 217.50021 25.5] CT
N
-21.181 -12.256 M
-21.181 -13.866 -19.916 -14.874 QT
-18.65 -15.881 -16.876 -16.295 QT
-15.103 -16.709 -13.509 -16.709 QT
-13.509 -17.819 L
-13.509 -18.584 -13.853 -19.319 QT
-14.197 -20.053 -14.837 -20.522 QT
-15.478 -20.991 -16.259 -20.991 QT
-18.056 -20.991 -18.994 -20.194 QT
-18.478 -20.194 -18.142 -19.803 QT
-17.806 -19.413 -17.806 -18.897 QT
-17.806 -18.35 -18.189 -17.967 QT
-18.572 -17.584 -19.087 -17.584 QT
-19.634 -17.584 -20.017 -17.967 QT
-20.4 -18.35 -20.4 -18.897 QT
-20.4 -20.319 -19.111 -21.014 QT
-17.822 -21.709 -16.259 -21.709 QT
-15.166 -21.709 -14.056 -21.241 QT
-12.947 -20.772 -12.244 -19.897 QT
-11.541 -19.022 -11.541 -17.866 QT
-11.541 -11.788 L
-11.541 -11.256 -11.314 -10.819 QT
-11.087 -10.381 -10.619 -10.381 QT
-10.166 -10.381 -9.947 -10.827 QT
-9.728 -11.272 -9.728 -11.788 QT
-9.728 -13.522 L
-8.947 -13.522 L
-8.947 -11.788 L
-8.947 -11.178 -9.259 -10.631 QT
-9.572 -10.084 -10.111 -9.764 QT
-10.65 -9.444 -11.259 -9.444 QT
-12.056 -9.444 -12.626 -10.053 QT
-13.197 -10.663 -13.275 -11.506 QT
-13.775 -10.491 -14.744 -9.897 QT
-15.712 -9.303 -16.822 -9.303 QT
-17.853 -9.303 -18.853 -9.6 QT
-19.853 -9.897 -20.517 -10.553 QT
-21.181 -11.209 -21.181 -12.256 QT
cp
-18.994 -12.256 M
-18.994 -11.303 -18.291 -10.655 QT
-17.587 -10.006 -16.65 -10.006 QT
-15.775 -10.006 -15.064 -10.444 QT
-14.353 -10.881 -13.931 -11.631 QT
-13.509 -12.381 -13.509 -13.209 QT
-13.509 -16.022 L
-14.728 -16.022 -16.017 -15.616 QT
-17.306 -15.209 -18.15 -14.358 QT
-18.994 -13.506 -18.994 -12.256 QT
cp
f
GR
GS
[0.75 0 0 0.75 217.50021 25.5] CT
N
-8.098 -9.6 M
-8.098 -10.553 L
-7.176 -10.553 -6.582 -10.694 QT
-5.988 -10.834 -5.988 -11.413 QT
-5.988 -25.584 L
-5.988 -26.303 -6.207 -26.624 QT
-6.426 -26.944 -6.832 -27.022 QT
-7.238 -27.1 -8.098 -27.1 QT
-8.098 -28.038 L
-4.082 -28.334 L
-4.082 -11.413 L
-4.082 -10.834 -3.488 -10.694 QT
-2.895 -10.553 -1.988 -10.553 QT
-1.988 -9.6 L
-8.098 -9.6 L
cp
f
GR
GS
[0.75 0 0 0.75 217.50021 25.5] CT
N
10.12 -12.85 M
10.12 -20.288 L
7.886 -20.288 L
7.886 -20.991 L
9.652 -20.991 10.48 -22.639 QT
11.308 -24.288 11.308 -26.209 QT
12.089 -26.209 L
12.089 -21.241 L
15.902 -21.241 L
15.902 -20.288 L
12.089 -20.288 L
12.089 -12.897 L
12.089 -11.772 12.464 -10.928 QT
12.839 -10.084 13.824 -10.084 QT
14.745 -10.084 15.152 -10.975 QT
15.558 -11.866 15.558 -12.897 QT
15.558 -14.491 L
16.339 -14.491 L
16.339 -12.85 L
16.339 -12.006 16.027 -11.178 QT
15.714 -10.35 15.105 -9.827 QT
14.495 -9.303 13.636 -9.303 QT
12.011 -9.303 11.066 -10.272 QT
10.12 -11.241 10.12 -12.85 QT
cp
f
GR
GS
[0.75 0 0 0.75 217.50021 25.5] CT
N
18.444 -9.6 M
18.444 -10.553 L
19.366 -10.553 19.96 -10.694 QT
20.553 -10.834 20.553 -11.413 QT
20.553 -18.772 L
20.553 -19.506 20.335 -19.827 QT
20.116 -20.147 19.71 -20.217 QT
19.303 -20.288 18.444 -20.288 QT
18.444 -21.241 L
22.303 -21.538 L
22.303 -18.897 L
22.741 -20.069 23.545 -20.803 QT
24.35 -21.538 25.491 -21.538 QT
26.303 -21.538 26.936 -21.061 QT
27.569 -20.584 27.569 -19.803 QT
27.569 -19.319 27.217 -18.952 QT
26.866 -18.584 26.35 -18.584 QT
25.85 -18.584 25.491 -18.944 QT
25.131 -19.303 25.131 -19.803 QT
25.131 -20.522 25.647 -20.834 QT
25.491 -20.834 L
24.397 -20.834 23.71 -20.045 QT
23.022 -19.256 22.725 -18.077 QT
22.428 -16.897 22.428 -15.834 QT
22.428 -11.413 L
22.428 -10.553 25.053 -10.553 QT
25.053 -9.6 L
18.444 -9.6 L
cp
f
GR
GS
[0.75 0 0 0.75 217.50021 25.5] CT
N
29.263 -12.256 M
29.263 -13.866 30.529 -14.874 QT
31.795 -15.881 33.568 -16.295 QT
35.342 -16.709 36.935 -16.709 QT
36.935 -17.819 L
36.935 -18.584 36.592 -19.319 QT
36.248 -20.053 35.607 -20.522 QT
34.967 -20.991 34.185 -20.991 QT
32.388 -20.991 31.451 -20.194 QT
31.967 -20.194 32.302 -19.803 QT
32.638 -19.413 32.638 -18.897 QT
32.638 -18.35 32.256 -17.967 QT
31.873 -17.584 31.357 -17.584 QT
30.81 -17.584 30.427 -17.967 QT
30.045 -18.35 30.045 -18.897 QT
30.045 -20.319 31.334 -21.014 QT
32.623 -21.709 34.185 -21.709 QT
35.279 -21.709 36.388 -21.241 QT
37.498 -20.772 38.201 -19.897 QT
38.904 -19.022 38.904 -17.866 QT
38.904 -11.788 L
38.904 -11.256 39.131 -10.819 QT
39.357 -10.381 39.826 -10.381 QT
40.279 -10.381 40.498 -10.827 QT
40.717 -11.272 40.717 -11.788 QT
40.717 -13.522 L
41.498 -13.522 L
41.498 -11.788 L
41.498 -11.178 41.185 -10.631 QT
40.873 -10.084 40.334 -9.764 QT
39.795 -9.444 39.185 -9.444 QT
38.388 -9.444 37.818 -10.053 QT
37.248 -10.663 37.17 -11.506 QT
36.67 -10.491 35.701 -9.897 QT
34.732 -9.303 33.623 -9.303 QT
32.592 -9.303 31.592 -9.6 QT
30.592 -9.897 29.927 -10.553 QT
29.263 -11.209 29.263 -12.256 QT
cp
31.451 -12.256 M
31.451 -11.303 32.154 -10.655 QT
32.857 -10.006 33.795 -10.006 QT
34.67 -10.006 35.381 -10.444 QT
36.092 -10.881 36.513 -11.631 QT
36.935 -12.381 36.935 -13.209 QT
36.935 -16.022 L
35.717 -16.022 34.427 -15.616 QT
33.138 -15.209 32.295 -14.358 QT
31.451 -13.506 31.451 -12.256 QT
cp
f
GR
GS
[0.75 0 0 0.75 217.50021 25.5] CT
N
43.547 -5.069 M
44.156 -4.756 44.938 -4.756 QT
46 -4.756 46.422 -5.85 QT
46.844 -6.944 46.844 -8.209 QT
46.844 -18.772 L
46.844 -19.506 46.578 -19.827 QT
46.313 -20.147 45.859 -20.217 QT
45.406 -20.288 44.516 -20.288 QT
44.516 -21.241 L
48.719 -21.538 L
48.719 -8.084 L
48.719 -7.038 48.203 -6.108 QT
47.688 -5.178 46.805 -4.624 QT
45.922 -4.069 44.891 -4.069 QT
43.719 -4.069 42.766 -4.647 QT
41.813 -5.225 41.813 -6.272 QT
41.813 -6.803 42.195 -7.186 QT
42.578 -7.569 43.109 -7.569 QT
43.641 -7.569 44.016 -7.186 QT
44.391 -6.803 44.391 -6.272 QT
44.391 -5.866 44.164 -5.522 QT
43.938 -5.178 43.547 -5.069 QT
cp
45.75 -26.178 M
45.75 -26.772 46.203 -27.217 QT
46.656 -27.663 47.25 -27.663 QT
47.609 -27.663 47.969 -27.467 QT
48.328 -27.272 48.524 -26.913 QT
48.719 -26.553 48.719 -26.178 QT
48.719 -25.584 48.289 -25.139 QT
47.859 -24.694 47.25 -24.694 QT
46.656 -24.694 46.203 -25.139 QT
45.75 -25.584 45.75 -26.178 QT
cp
f
GR
GS
[0.75 0 0 0.75 217.50021 25.5] CT
N
57.867 -9.303 M
56.226 -9.303 54.851 -10.163 QT
53.476 -11.022 52.687 -12.467 QT
51.898 -13.913 51.898 -15.522 QT
51.898 -17.1 52.617 -18.522 QT
53.336 -19.944 54.625 -20.827 QT
55.914 -21.709 57.492 -21.709 QT
58.726 -21.709 59.64 -21.288 QT
60.555 -20.866 61.148 -20.131 QT
61.742 -19.397 62.047 -18.397 QT
62.351 -17.397 62.351 -16.194 QT
62.351 -15.834 62.07 -15.834 QT
54.258 -15.834 L
54.258 -15.553 L
54.258 -13.303 55.164 -11.694 QT
56.07 -10.084 58.117 -10.084 QT
58.945 -10.084 59.648 -10.452 QT
60.351 -10.819 60.875 -11.483 QT
61.398 -12.147 61.57 -12.897 QT
61.601 -12.991 61.672 -13.061 QT
61.742 -13.131 61.836 -13.131 QT
62.07 -13.131 L
62.351 -13.131 62.351 -12.788 QT
61.976 -11.256 60.711 -10.28 QT
59.445 -9.303 57.867 -9.303 QT
cp
54.289 -16.506 M
60.445 -16.506 L
60.445 -17.522 60.164 -18.561 QT
59.883 -19.6 59.219 -20.295 QT
58.555 -20.991 57.492 -20.991 QT
55.961 -20.991 55.125 -19.561 QT
54.289 -18.131 54.289 -16.506 QT
cp
f
GR
GS
[0.75 0 0 0.75 217.50021 25.5] CT
N
69.719 -9.303 M
68.094 -9.303 66.758 -10.147 QT
65.422 -10.991 64.656 -12.413 QT
63.891 -13.834 63.891 -15.428 QT
63.891 -17.022 64.649 -18.483 QT
65.406 -19.944 66.75 -20.827 QT
68.094 -21.709 69.719 -21.709 QT
71.313 -21.709 72.609 -21.084 QT
73.906 -20.459 73.906 -19.053 QT
73.906 -18.522 73.531 -18.131 QT
73.156 -17.741 72.609 -17.741 QT
72.078 -17.741 71.695 -18.131 QT
71.313 -18.522 71.313 -19.053 QT
71.313 -19.522 71.617 -19.874 QT
71.922 -20.225 72.375 -20.319 QT
71.438 -20.913 69.75 -20.913 QT
68.453 -20.913 67.664 -20.053 QT
66.875 -19.194 66.563 -17.928 QT
66.25 -16.663 66.25 -15.428 QT
66.25 -14.116 66.633 -12.897 QT
67.016 -11.678 67.883 -10.881 QT
68.75 -10.084 70.047 -10.084 QT
71.328 -10.084 72.227 -10.874 QT
73.125 -11.663 73.453 -12.928 QT
73.453 -13.084 73.672 -13.084 QT
74 -13.084 L
74.078 -13.084 74.141 -13.006 QT
74.203 -12.928 74.203 -12.85 QT
74.203 -12.772 L
73.797 -11.163 72.586 -10.233 QT
71.375 -9.303 69.719 -9.303 QT
cp
f
GR
GS
[0.75 0 0 0.75 217.50021 25.5] CT
N
77.602 -12.85 M
77.602 -20.288 L
75.368 -20.288 L
75.368 -20.991 L
77.133 -20.991 77.961 -22.639 QT
78.789 -24.288 78.789 -26.209 QT
79.571 -26.209 L
79.571 -21.241 L
83.383 -21.241 L
83.383 -20.288 L
79.571 -20.288 L
79.571 -12.897 L
79.571 -11.772 79.946 -10.928 QT
80.321 -10.084 81.305 -10.084 QT
82.227 -10.084 82.633 -10.975 QT
83.039 -11.866 83.039 -12.897 QT
83.039 -14.491 L
83.821 -14.491 L
83.821 -12.85 L
83.821 -12.006 83.508 -11.178 QT
83.196 -10.35 82.586 -9.827 QT
81.977 -9.303 81.118 -9.303 QT
79.493 -9.303 78.547 -10.272 QT
77.602 -11.241 77.602 -12.85 QT
cp
f
GR
GS
[0.75 0 0 0.75 217.50021 25.5] CT
N
91.972 -9.303 M
90.347 -9.303 88.965 -10.124 QT
87.582 -10.944 86.777 -12.327 QT
85.972 -13.709 85.972 -15.35 QT
85.972 -16.584 86.418 -17.733 QT
86.863 -18.881 87.683 -19.788 QT
88.504 -20.694 89.597 -21.202 QT
90.691 -21.709 91.972 -21.709 QT
93.629 -21.709 94.996 -20.827 QT
96.363 -19.944 97.152 -18.475 QT
97.941 -17.006 97.941 -15.35 QT
97.941 -13.725 97.136 -12.334 QT
96.332 -10.944 94.957 -10.124 QT
93.582 -9.303 91.972 -9.303 QT
cp
91.972 -10.084 M
94.129 -10.084 94.855 -11.655 QT
95.582 -13.225 95.582 -15.647 QT
95.582 -17.006 95.441 -17.897 QT
95.3 -18.788 94.8 -19.522 QT
94.504 -19.959 94.035 -20.295 QT
93.566 -20.631 93.043 -20.811 QT
92.519 -20.991 91.972 -20.991 QT
91.129 -20.991 90.371 -20.608 QT
89.613 -20.225 89.113 -19.522 QT
88.613 -18.756 88.472 -17.834 QT
88.332 -16.913 88.332 -15.647 QT
88.332 -14.131 88.597 -12.928 QT
88.863 -11.725 89.66 -10.905 QT
90.457 -10.084 91.972 -10.084 QT
cp
f
GR
GS
[0.75 0 0 0.75 217.50021 25.5] CT
N
99.259 -9.6 M
99.259 -10.553 L
100.181 -10.553 100.774 -10.694 QT
101.368 -10.834 101.368 -11.413 QT
101.368 -18.772 L
101.368 -19.506 101.149 -19.827 QT
100.931 -20.147 100.524 -20.217 QT
100.118 -20.288 99.259 -20.288 QT
99.259 -21.241 L
103.118 -21.538 L
103.118 -18.897 L
103.556 -20.069 104.36 -20.803 QT
105.165 -21.538 106.306 -21.538 QT
107.118 -21.538 107.751 -21.061 QT
108.384 -20.584 108.384 -19.803 QT
108.384 -19.319 108.032 -18.952 QT
107.681 -18.584 107.165 -18.584 QT
106.665 -18.584 106.306 -18.944 QT
105.946 -19.303 105.946 -19.803 QT
105.946 -20.522 106.462 -20.834 QT
106.306 -20.834 L
105.212 -20.834 104.524 -20.045 QT
103.837 -19.256 103.54 -18.077 QT
103.243 -16.897 103.243 -15.834 QT
103.243 -11.413 L
103.243 -10.553 105.868 -10.553 QT
105.868 -9.6 L
99.259 -9.6 L
cp
f
GR
GS
[0.75 0 0 0.75 217.50021 25.5] CT
N
110.86 -5.163 M
111.375 -4.756 112 -4.756 QT
113.688 -4.756 114.781 -7.334 QT
115.703 -9.6 L
111.656 -19.522 L
111.406 -20.022 110.891 -20.155 QT
110.375 -20.288 109.516 -20.288 QT
109.516 -21.241 L
115.188 -21.241 L
115.188 -20.288 L
113.688 -20.288 113.688 -19.647 QT
113.688 -19.538 113.719 -19.491 QT
116.719 -12.1 L
119.422 -18.756 L
119.5 -18.959 119.5 -19.209 QT
119.5 -19.538 119.328 -19.78 QT
119.156 -20.022 118.867 -20.155 QT
118.578 -20.288 118.235 -20.288 QT
118.235 -21.241 L
122.719 -21.241 L
122.719 -20.288 L
121.875 -20.288 121.25 -19.905 QT
120.625 -19.522 120.281 -18.772 QT
115.625 -7.334 L
115.25 -6.459 114.758 -5.733 QT
114.266 -5.006 113.555 -4.538 QT
112.844 -4.069 112 -4.069 QT
111 -4.069 110.258 -4.717 QT
109.516 -5.366 109.516 -6.334 QT
109.516 -6.834 109.86 -7.178 QT
110.203 -7.522 110.703 -7.522 QT
111.047 -7.522 111.313 -7.366 QT
111.578 -7.209 111.735 -6.952 QT
111.891 -6.694 111.891 -6.334 QT
111.891 -5.897 111.602 -5.553 QT
111.313 -5.209 110.86 -5.163 QT
cp
f
GR
GS
[0.75 0 0 0.75 0 0] CT
0.2 0.702 0.2 RC
1 LJ
0.667 LW
N
89.692 298.2 M
106.385 296.24 L
123.077 290.75 L
139.769 282.507 L
156.462 272.289 L
173.154 260.876 L
189.846 248.958 L
206.538 237.052 L
223.231 225.59 L
239.923 215 L
256.615 205.586 L
273.308 197.394 L
290 190.343 L
306.692 184.351 L
323.385 179.336 L
340.077 175.218 L
356.769 171.914 L
373.462 169.344 L
390.154 167.425 L
406.846 166.076 L
423.538 165.217 L
440.231 164.765 L
456.923 164.638 L
473.615 164.756 L
490.308 165.038 L
S
GR
GS
[0.75 0 0 0.75 0 0] CT
1 LJ
0.667 LW
N
89.692 301.4 M
106.385 300.277 L
123.077 296.974 L
139.769 291.619 L
156.462 284.343 L
173.154 275.276 L
189.846 264.634 L
206.538 252.808 L
223.231 240.275 L
239.923 227.513 L
256.615 215 L
273.308 203.098 L
290 191.936 L
306.692 181.531 L
323.385 171.897 L
340.077 163.049 L
356.769 155.002 L
373.462 147.771 L
390.154 141.37 L
406.846 135.815 L
423.538 131.12 L
440.231 127.3 L
456.923 124.371 L
473.615 122.348 L
490.308 121.244 L
S
GR
GS
[0.75 0 0 0.75 0 0] CT
0 0 1 RC
1 LJ
0.667 LW
N
89.692 330.2 M
106.385 327.025 L
123.077 318.129 L
139.769 304.768 L
156.462 288.2 L
173.154 269.682 L
189.846 250.472 L
206.538 231.825 L
223.231 215 L
239.923 200.866 L
256.615 189.52 L
273.308 180.669 L
290 174.023 L
306.692 169.29 L
323.385 166.179 L
340.077 164.399 L
356.769 163.658 L
373.462 163.666 L
390.154 164.13 L
406.846 164.76 L
423.538 165.4 L
440.231 166.04 L
456.923 166.68 L
473.615 167.32 L
490.308 167.96 L
S
GR
GS
[0.75 0 0 0.75 0 0] CT
0.6 0.2 0.2 RC
1 LJ
0.667 LW
N
89.692 55 M
106.385 59.662 L
123.077 71.747 L
139.769 87.459 L
156.462 103 L
173.154 115.641 L
189.846 124.79 L
206.538 130.928 L
223.231 134.531 L
239.923 136.08 L
256.615 136.6 L
273.308 137.001 L
290 137.402 L
306.692 137.802 L
323.385 138.203 L
340.077 138.604 L
356.769 139.005 L
373.462 139.406 L
390.154 139.806 L
406.846 140.207 L
423.538 140.608 L
440.231 141.009 L
456.923 141.409 L
473.615 141.81 L
490.308 142.211 L
S
GR
GS
[0.75 0 0 0.75 0 0] CT
1 GC
N
496 158 M
496 50 L
372 50 L
372 158 L
cp
f
GR
GS
[0.75 0 0 0.75 314.11361 48.61029] CT
N
0.672 5.12 M
0.672 4.386 L
2.547 4.386 2.984 3.136 QT
7.391 -9.693 L
7.453 -9.911 7.734 -9.911 QT
8 -9.911 L
8.281 -9.911 8.344 -9.693 QT
12.938 3.714 L
13.141 4.151 13.688 4.268 QT
14.234 4.386 15.047 4.386 QT
15.047 5.12 L
9.203 5.12 L
9.203 4.386 L
10.938 4.386 10.938 3.823 QT
10.938 3.714 L
9.797 0.432 L
4.703 0.432 L
3.766 3.136 L
3.75 3.214 3.75 3.354 QT
3.75 3.886 4.242 4.136 QT
4.734 4.386 5.313 4.386 QT
5.313 5.12 L
0.672 5.12 L
cp
4.953 -0.302 M
9.563 -0.302 L
7.25 -7.005 L
4.953 -0.302 L
cp
f
GR
GS
[0.75 0 0 0.75 314.11361 48.61029] CT
N
16.578 6.761 M
16.578 6.011 17.125 5.456 QT
17.672 4.901 18.422 4.651 QT
18 4.339 17.781 3.854 QT
17.563 3.37 17.563 2.839 QT
17.563 1.854 18.188 1.089 QT
17.219 0.151 17.219 -1.068 QT
17.219 -1.724 17.5 -2.302 QT
17.781 -2.88 18.289 -3.302 QT
18.797 -3.724 19.406 -3.943 QT
20.016 -4.161 20.672 -4.161 QT
21.922 -4.161 22.906 -3.427 QT
23.344 -3.896 23.93 -4.146 QT
24.516 -4.396 25.156 -4.396 QT
25.609 -4.396 25.898 -4.075 QT
26.188 -3.755 26.188 -3.302 QT
26.188 -3.036 25.992 -2.841 QT
25.797 -2.646 25.531 -2.646 QT
25.266 -2.646 25.07 -2.841 QT
24.875 -3.036 24.875 -3.302 QT
24.875 -3.693 25.141 -3.849 QT
24.047 -3.849 23.266 -3.099 QT
23.656 -2.708 23.883 -2.161 QT
24.109 -1.614 24.109 -1.068 QT
24.109 -0.177 23.617 0.534 QT
23.125 1.245 22.32 1.636 QT
21.516 2.026 20.672 2.026 QT
19.516 2.026 18.563 1.401 QT
18.266 1.823 18.266 2.323 QT
18.266 2.886 18.633 3.3 QT
19 3.714 19.547 3.714 QT
21.266 3.714 L
22.516 3.714 23.523 3.94 QT
24.531 4.167 25.211 4.846 QT
25.891 5.526 25.891 6.761 QT
25.891 7.682 25.117 8.292 QT
24.344 8.901 23.258 9.175 QT
22.172 9.448 21.25 9.448 QT
20.313 9.448 19.227 9.175 QT
18.141 8.901 17.359 8.292 QT
16.578 7.682 16.578 6.761 QT
cp
17.766 6.761 M
17.766 7.464 18.336 7.94 QT
18.906 8.417 19.719 8.651 QT
20.531 8.886 21.25 8.886 QT
21.953 8.886 22.766 8.651 QT
23.578 8.417 24.148 7.94 QT
24.719 7.464 24.719 6.761 QT
24.719 5.667 23.711 5.339 QT
22.703 5.011 21.266 5.011 QT
19.547 5.011 L
19.063 5.011 18.656 5.245 QT
18.25 5.479 18.008 5.893 QT
17.766 6.307 17.766 6.761 QT
cp
20.672 1.464 M
22.453 1.464 22.453 -1.068 QT
22.453 -2.177 22.07 -2.888 QT
21.688 -3.599 20.672 -3.599 QT
19.641 -3.599 19.258 -2.888 QT
18.875 -2.177 18.875 -1.068 QT
18.875 -0.38 19.023 0.182 QT
19.172 0.745 19.563 1.104 QT
19.953 1.464 20.672 1.464 QT
cp
f
GR
GS
[0.75 0 0 0.75 314.11361 48.61029] CT
N
31.901 5.354 M
30.62 5.354 29.55 4.682 QT
28.479 4.011 27.862 2.886 QT
27.245 1.761 27.245 0.511 QT
27.245 -0.708 27.807 -1.818 QT
28.37 -2.927 29.37 -3.607 QT
30.37 -4.286 31.604 -4.286 QT
32.557 -4.286 33.276 -3.966 QT
33.995 -3.646 34.456 -3.075 QT
34.917 -2.505 35.151 -1.724 QT
35.385 -0.943 35.385 -0.005 QT
35.385 0.276 35.167 0.276 QT
29.089 0.276 L
29.089 0.495 L
29.089 2.245 29.792 3.495 QT
30.495 4.745 32.089 4.745 QT
32.729 4.745 33.276 4.456 QT
33.823 4.167 34.229 3.651 QT
34.635 3.136 34.776 2.557 QT
34.792 2.479 34.854 2.425 QT
34.917 2.37 34.979 2.37 QT
35.167 2.37 L
35.385 2.37 35.385 2.636 QT
35.089 3.823 34.104 4.589 QT
33.12 5.354 31.901 5.354 QT
cp
29.104 -0.255 M
33.901 -0.255 L
33.901 -1.036 33.675 -1.849 QT
33.448 -2.661 32.94 -3.2 QT
32.432 -3.739 31.604 -3.739 QT
30.417 -3.739 29.76 -2.63 QT
29.104 -1.521 29.104 -0.255 QT
cp
f
GR
GS
[0.75 0 0 0.75 314.11361 48.61029] CT
N
36.773 5.12 M
36.773 4.386 L
37.492 4.386 37.953 4.268 QT
38.414 4.151 38.414 3.714 QT
38.414 -2.021 L
38.414 -2.583 38.242 -2.833 QT
38.07 -3.083 37.758 -3.138 QT
37.445 -3.193 36.773 -3.193 QT
36.773 -3.927 L
39.82 -4.161 L
39.82 -2.114 L
40.242 -3.005 41.07 -3.583 QT
41.898 -4.161 42.867 -4.161 QT
44.32 -4.161 45.054 -3.466 QT
45.789 -2.771 45.789 -1.333 QT
45.789 3.714 L
45.789 4.151 46.25 4.268 QT
46.711 4.386 47.429 4.386 QT
47.429 5.12 L
42.617 5.12 L
42.617 4.386 L
43.336 4.386 43.797 4.268 QT
44.258 4.151 44.258 3.714 QT
44.258 -1.271 L
44.258 -2.286 43.961 -2.95 QT
43.664 -3.614 42.742 -3.614 QT
41.523 -3.614 40.734 -2.638 QT
39.945 -1.661 39.945 -0.427 QT
39.945 3.714 L
39.945 4.151 40.414 4.268 QT
40.883 4.386 41.586 4.386 QT
41.586 5.12 L
36.773 5.12 L
cp
f
GR
GS
[0.75 0 0 0.75 314.11361 48.61029] CT
N
49.548 2.604 M
49.548 -3.193 L
47.814 -3.193 L
47.814 -3.739 L
49.189 -3.739 49.829 -5.021 QT
50.47 -6.302 50.47 -7.802 QT
51.079 -7.802 L
51.079 -3.927 L
54.048 -3.927 L
54.048 -3.193 L
51.079 -3.193 L
51.079 2.557 L
51.079 3.432 51.368 4.089 QT
51.657 4.745 52.423 4.745 QT
53.142 4.745 53.462 4.05 QT
53.782 3.354 53.782 2.557 QT
53.782 1.323 L
54.376 1.323 L
54.376 2.604 L
54.376 3.261 54.134 3.901 QT
53.892 4.542 53.423 4.948 QT
52.954 5.354 52.282 5.354 QT
51.017 5.354 50.282 4.604 QT
49.548 3.854 49.548 2.604 QT
cp
f
GR
GS
[0.75 0 0 0.75 314.11361 48.61029] CT
N
64.768 5.12 M
64.768 4.386 L
67.393 4.386 67.393 3.714 QT
67.393 -7.302 L
66.299 -6.786 64.643 -6.786 QT
64.643 -7.521 L
67.221 -7.521 68.534 -8.864 QT
68.831 -8.864 L
68.893 -8.864 68.963 -8.81 QT
69.034 -8.755 69.034 -8.677 QT
69.034 3.714 L
69.034 4.386 71.659 4.386 QT
71.659 5.12 L
64.768 5.12 L
cp
f
GR
GS
[0.75 0 0 0.75 0 0] CT
0.2 0.702 0.2 RC
1 LJ
0.667 LW
N
375.985 64.814 M
415.83 64.814 L
S
GR
GS
[0.75 0 0 0.75 314.11361 68.20343] CT
N
/f-597267615{0.672 5.12 M
0.672 4.386 L
2.547 4.386 2.984 3.136 QT
7.391 -9.693 L
7.453 -9.911 7.734 -9.911 QT
8 -9.911 L
8.281 -9.911 8.344 -9.693 QT
12.938 3.714 L
13.141 4.151 13.688 4.268 QT
14.234 4.386 15.047 4.386 QT
15.047 5.12 L
9.203 5.12 L
9.203 4.386 L
10.938 4.386 10.938 3.823 QT
10.938 3.714 L
9.797 0.432 L
4.703 0.432 L
3.766 3.136 L
3.75 3.214 3.75 3.354 QT
3.75 3.886 4.242 4.136 QT
4.734 4.386 5.313 4.386 QT
5.313 5.12 L
0.672 5.12 L
cp
4.953 -0.302 M
9.563 -0.302 L
7.25 -7.005 L
4.953 -0.302 L
cp}def
f-597267615
f
GR
GS
[0.75 0 0 0.75 314.11361 68.20343] CT
N
/f-745240314{16.578 6.761 M
16.578 6.011 17.125 5.456 QT
17.672 4.901 18.422 4.651 QT
18 4.339 17.781 3.854 QT
17.563 3.37 17.563 2.839 QT
17.563 1.854 18.188 1.089 QT
17.219 0.151 17.219 -1.068 QT
17.219 -1.724 17.5 -2.302 QT
17.781 -2.88 18.289 -3.302 QT
18.797 -3.724 19.406 -3.943 QT
20.016 -4.161 20.672 -4.161 QT
21.922 -4.161 22.906 -3.427 QT
23.344 -3.896 23.93 -4.146 QT
24.516 -4.396 25.156 -4.396 QT
25.609 -4.396 25.898 -4.075 QT
26.188 -3.755 26.188 -3.302 QT
26.188 -3.036 25.992 -2.841 QT
25.797 -2.646 25.531 -2.646 QT
25.266 -2.646 25.07 -2.841 QT
24.875 -3.036 24.875 -3.302 QT
24.875 -3.693 25.141 -3.849 QT
24.047 -3.849 23.266 -3.099 QT
23.656 -2.708 23.883 -2.161 QT
24.109 -1.614 24.109 -1.068 QT
24.109 -0.177 23.617 0.534 QT
23.125 1.245 22.32 1.636 QT
21.516 2.026 20.672 2.026 QT
19.516 2.026 18.563 1.401 QT
18.266 1.823 18.266 2.323 QT
18.266 2.886 18.633 3.3 QT
19 3.714 19.547 3.714 QT
21.266 3.714 L
22.516 3.714 23.523 3.94 QT
24.531 4.167 25.211 4.846 QT
25.891 5.526 25.891 6.761 QT
25.891 7.682 25.117 8.292 QT
24.344 8.901 23.258 9.175 QT
22.172 9.448 21.25 9.448 QT
20.313 9.448 19.227 9.175 QT
18.141 8.901 17.359 8.292 QT
16.578 7.682 16.578 6.761 QT
cp
17.766 6.761 M
17.766 7.464 18.336 7.94 QT
18.906 8.417 19.719 8.651 QT
20.531 8.886 21.25 8.886 QT
21.953 8.886 22.766 8.651 QT
23.578 8.417 24.148 7.94 QT
24.719 7.464 24.719 6.761 QT
24.719 5.667 23.711 5.339 QT
22.703 5.011 21.266 5.011 QT
19.547 5.011 L
19.063 5.011 18.656 5.245 QT
18.25 5.479 18.008 5.893 QT
17.766 6.307 17.766 6.761 QT
cp
20.672 1.464 M
22.453 1.464 22.453 -1.068 QT
22.453 -2.177 22.07 -2.888 QT
21.688 -3.599 20.672 -3.599 QT
19.641 -3.599 19.258 -2.888 QT
18.875 -2.177 18.875 -1.068 QT
18.875 -0.38 19.023 0.182 QT
19.172 0.745 19.563 1.104 QT
19.953 1.464 20.672 1.464 QT
cp}def
f-745240314
f
GR
GS
[0.75 0 0 0.75 314.11361 68.20343] CT
N
/f1964844890{31.901 5.354 M
30.62 5.354 29.55 4.682 QT
28.479 4.011 27.862 2.886 QT
27.245 1.761 27.245 0.511 QT
27.245 -0.708 27.807 -1.818 QT
28.37 -2.927 29.37 -3.607 QT
30.37 -4.286 31.604 -4.286 QT
32.557 -4.286 33.276 -3.966 QT
33.995 -3.646 34.456 -3.075 QT
34.917 -2.505 35.151 -1.724 QT
35.385 -0.943 35.385 -0.005 QT
35.385 0.276 35.167 0.276 QT
29.089 0.276 L
29.089 0.495 L
29.089 2.245 29.792 3.495 QT
30.495 4.745 32.089 4.745 QT
32.729 4.745 33.276 4.456 QT
33.823 4.167 34.229 3.651 QT
34.635 3.136 34.776 2.557 QT
34.792 2.479 34.854 2.425 QT
34.917 2.37 34.979 2.37 QT
35.167 2.37 L
35.385 2.37 35.385 2.636 QT
35.089 3.823 34.104 4.589 QT
33.12 5.354 31.901 5.354 QT
cp
29.104 -0.255 M
33.901 -0.255 L
33.901 -1.036 33.675 -1.849 QT
33.448 -2.661 32.94 -3.2 QT
32.432 -3.739 31.604 -3.739 QT
30.417 -3.739 29.76 -2.63 QT
29.104 -1.521 29.104 -0.255 QT
cp}def
f1964844890
f
GR
GS
[0.75 0 0 0.75 314.11361 68.20343] CT
N
/f1881606250{36.773 5.12 M
36.773 4.386 L
37.492 4.386 37.953 4.268 QT
38.414 4.151 38.414 3.714 QT
38.414 -2.021 L
38.414 -2.583 38.242 -2.833 QT
38.07 -3.083 37.758 -3.138 QT
37.445 -3.193 36.773 -3.193 QT
36.773 -3.927 L
39.82 -4.161 L
39.82 -2.114 L
40.242 -3.005 41.07 -3.583 QT
41.898 -4.161 42.867 -4.161 QT
44.32 -4.161 45.054 -3.466 QT
45.789 -2.771 45.789 -1.333 QT
45.789 3.714 L
45.789 4.151 46.25 4.268 QT
46.711 4.386 47.429 4.386 QT
47.429 5.12 L
42.617 5.12 L
42.617 4.386 L
43.336 4.386 43.797 4.268 QT
44.258 4.151 44.258 3.714 QT
44.258 -1.271 L
44.258 -2.286 43.961 -2.95 QT
43.664 -3.614 42.742 -3.614 QT
41.523 -3.614 40.734 -2.638 QT
39.945 -1.661 39.945 -0.427 QT
39.945 3.714 L
39.945 4.151 40.414 4.268 QT
40.883 4.386 41.586 4.386 QT
41.586 5.12 L
36.773 5.12 L
cp}def
f1881606250
f
GR
GS
[0.75 0 0 0.75 314.11361 68.20343] CT
N
/f-1218143468{49.548 2.604 M
49.548 -3.193 L
47.814 -3.193 L
47.814 -3.739 L
49.189 -3.739 49.829 -5.021 QT
50.47 -6.302 50.47 -7.802 QT
51.079 -7.802 L
51.079 -3.927 L
54.048 -3.927 L
54.048 -3.193 L
51.079 -3.193 L
51.079 2.557 L
51.079 3.432 51.368 4.089 QT
51.657 4.745 52.423 4.745 QT
53.142 4.745 53.462 4.05 QT
53.782 3.354 53.782 2.557 QT
53.782 1.323 L
54.376 1.323 L
54.376 2.604 L
54.376 3.261 54.134 3.901 QT
53.892 4.542 53.423 4.948 QT
52.954 5.354 52.282 5.354 QT
51.017 5.354 50.282 4.604 QT
49.548 3.854 49.548 2.604 QT
cp}def
f-1218143468
f
GR
GS
[0.75 0 0 0.75 314.11361 68.20343] CT
N
/f-1429999007{63.862 5.12 M
63.862 4.557 L
63.862 4.511 63.909 4.448 QT
67.159 0.839 L
67.909 0.026 68.37 -0.513 QT
68.831 -1.052 69.276 -1.763 QT
69.721 -2.474 69.987 -3.2 QT
70.252 -3.927 70.252 -4.755 QT
70.252 -5.614 69.932 -6.404 QT
69.612 -7.193 68.979 -7.661 QT
68.346 -8.13 67.456 -8.13 QT
66.549 -8.13 65.823 -7.583 QT
65.096 -7.036 64.799 -6.161 QT
64.877 -6.177 65.018 -6.177 QT
65.487 -6.177 65.823 -5.864 QT
66.159 -5.552 66.159 -5.036 QT
66.159 -4.568 65.823 -4.232 QT
65.487 -3.896 65.018 -3.896 QT
64.534 -3.896 64.198 -4.239 QT
63.862 -4.583 63.862 -5.036 QT
63.862 -5.833 64.159 -6.521 QT
64.456 -7.208 65.018 -7.747 QT
65.581 -8.286 66.276 -8.575 QT
66.971 -8.864 67.768 -8.864 QT
68.971 -8.864 70.002 -8.357 QT
71.034 -7.849 71.643 -6.919 QT
72.252 -5.989 72.252 -4.755 QT
72.252 -3.849 71.854 -3.029 QT
71.456 -2.208 70.831 -1.536 QT
70.206 -0.864 69.229 -0.013 QT
68.252 0.839 67.94 1.136 QT
65.565 3.417 L
67.581 3.417 L
69.065 3.417 70.065 3.393 QT
71.065 3.37 71.127 3.307 QT
71.377 3.042 71.627 1.37 QT
72.252 1.37 L
71.659 5.12 L
63.862 5.12 L
cp}def
f-1429999007
f
GR
GS
[0.75 0 0 0.75 0 0] CT
1 LJ
0.667 LW
N
375.985 90.938 M
415.83 90.938 L
S
GR
GS
[0.75 0 0 0.75 314.11361 87.79657] CT
N
f-597267615
f
GR
GS
[0.75 0 0 0.75 314.11361 87.79657] CT
N
f-745240314
f
GR
GS
[0.75 0 0 0.75 314.11361 87.79657] CT
N
f1964844890
f
GR
GS
[0.75 0 0 0.75 314.11361 87.79657] CT
N
f1881606250
f
GR
GS
[0.75 0 0 0.75 314.11361 87.79657] CT
N
f-1218143468
f
GR
GS
[0.75 0 0 0.75 314.11361 87.79657] CT
N
/f300774680{64.815 3.495 M
65.299 4.214 66.135 4.565 QT
66.971 4.917 67.924 4.917 QT
69.143 4.917 69.659 3.878 QT
70.174 2.839 70.174 1.511 QT
70.174 0.917 70.065 0.323 QT
69.956 -0.271 69.698 -0.786 QT
69.44 -1.302 68.995 -1.607 QT
68.549 -1.911 67.909 -1.911 QT
66.502 -1.911 L
66.315 -1.911 66.315 -2.114 QT
66.315 -2.286 L
66.315 -2.458 66.502 -2.458 QT
67.659 -2.552 L
68.409 -2.552 68.893 -3.107 QT
69.377 -3.661 69.604 -4.45 QT
69.831 -5.239 69.831 -5.958 QT
69.831 -6.974 69.362 -7.614 QT
68.893 -8.255 67.924 -8.255 QT
67.127 -8.255 66.393 -7.958 QT
65.659 -7.661 65.237 -7.036 QT
65.284 -7.052 65.307 -7.06 QT
65.331 -7.068 65.377 -7.068 QT
65.846 -7.068 66.166 -6.739 QT
66.487 -6.411 66.487 -5.943 QT
66.487 -5.489 66.166 -5.161 QT
65.846 -4.833 65.377 -4.833 QT
64.924 -4.833 64.596 -5.161 QT
64.268 -5.489 64.268 -5.943 QT
64.268 -6.849 64.807 -7.513 QT
65.346 -8.177 66.206 -8.521 QT
67.065 -8.864 67.924 -8.864 QT
68.565 -8.864 69.268 -8.677 QT
69.971 -8.489 70.549 -8.138 QT
71.127 -7.786 71.487 -7.232 QT
71.846 -6.677 71.846 -5.958 QT
71.846 -5.083 71.456 -4.333 QT
71.065 -3.583 70.377 -3.044 QT
69.69 -2.505 68.862 -2.239 QT
69.784 -2.052 70.604 -1.544 QT
71.424 -1.036 71.916 -0.232 QT
72.409 0.573 72.409 1.495 QT
72.409 2.651 71.776 3.589 QT
71.143 4.526 70.104 5.057 QT
69.065 5.589 67.924 5.589 QT
66.94 5.589 65.948 5.214 QT
64.956 4.839 64.323 4.089 QT
63.69 3.339 63.69 2.292 QT
63.69 1.761 64.041 1.417 QT
64.393 1.073 64.924 1.073 QT
65.252 1.073 65.534 1.229 QT
65.815 1.386 65.979 1.675 QT
66.143 1.964 66.143 2.292 QT
66.143 2.807 65.784 3.151 QT
65.424 3.495 64.924 3.495 QT
64.815 3.495 L
cp}def
f300774680
f
GR
GS
[0.75 0 0 0.75 0 0] CT
0 0 1 RC
1 LJ
0.667 LW
N
375.985 117.062 M
415.83 117.062 L
S
GR
GS
[0.75 0 0 0.75 314.11361 107.38971] CT
N
f-597267615
f
GR
GS
[0.75 0 0 0.75 314.11361 107.38971] CT
N
f-745240314
f
GR
GS
[0.75 0 0 0.75 314.11361 107.38971] CT
N
f1964844890
f
GR
GS
[0.75 0 0 0.75 314.11361 107.38971] CT
N
f1881606250
f
GR
GS
[0.75 0 0 0.75 314.11361 107.38971] CT
N
f-1218143468
f
GR
GS
[0.75 0 0 0.75 314.11361 107.38971] CT
N
/f-1674298674{63.393 1.651 M
63.393 0.917 L
69.893 -8.771 L
69.956 -8.864 70.112 -8.864 QT
70.409 -8.864 L
70.643 -8.864 70.643 -8.63 QT
70.643 0.917 L
72.706 0.917 L
72.706 1.651 L
70.643 1.651 L
70.643 3.714 L
70.643 4.151 71.26 4.268 QT
71.877 4.386 72.69 4.386 QT
72.69 5.12 L
66.909 5.12 L
66.909 4.386 L
67.721 4.386 68.331 4.268 QT
68.94 4.151 68.94 3.714 QT
68.94 1.651 L
63.393 1.651 L
cp
64.096 0.917 M
69.065 0.917 L
69.065 -6.521 L
64.096 0.917 L
cp}def
f-1674298674
f
GR
GS
[0.75 0 0 0.75 0 0] CT
0.6 0.2 0.2 RC
1 LJ
0.667 LW
N
375.985 143.186 M
415.83 143.186 L
S
GR
GS
[0.75 0 0 0.75 0 0] CT
0.149 GC
10.0 ML
0.667 LW
N
372 158 M
372 50 L
496 50 L
496 158 L
cp
S
GR
%%Trailer
%%Pages: 1
%%EOF
