%!PS-Adobe-3.0 EPSF-3.0
%%Creator: (MATLAB, The Mathworks, Inc. Version 9.12.0.2529717 \(R2022a\) Update 8. Operating System: Linux)
%%Title: plots/Example3_rz_dot.eps
%%CreationDate: 2024-06-16T12:26:37
%%Pages: (atend)
%%BoundingBox:     9     2   388   335
%%LanguageLevel: 3
%%EndComments
%%BeginProlog
%%BeginResource: procset (Apache XML Graphics Std ProcSet) 1.2 0
%%Version: 1.2 0
%%Copyright: (Copyright 2001-2003,2010 The Apache Software Foundation. License terms: http://www.apache.org/licenses/LICENSE-2.0)
/bd{bind def}bind def
/ld{load def}bd
/GR/grestore ld
/GS/gsave ld
/RM/rmoveto ld
/C/curveto ld
/t/show ld
/L/lineto ld
/ML/setmiterlimit ld
/CT/concat ld
/f/fill ld
/N/newpath ld
/S/stroke ld
/CC/setcmykcolor ld
/A/ashow ld
/cp/closepath ld
/RC/setrgbcolor ld
/LJ/setlinejoin ld
/GC/setgray ld
/LW/setlinewidth ld
/M/moveto ld
/re {4 2 roll M
1 index 0 rlineto
0 exch rlineto
neg 0 rlineto
cp } bd
/_ctm matrix def
/_tm matrix def
/BT { _ctm currentmatrix pop matrix _tm copy pop 0 0 moveto } bd
/ET { _ctm setmatrix } bd
/iTm { _ctm setmatrix _tm concat } bd
/Tm { _tm astore pop iTm 0 0 moveto } bd
/ux 0.0 def
/uy 0.0 def
/F {
  /Tp exch def
  /Tf exch def
  Tf findfont Tp scalefont setfont
  /cf Tf def  /cs Tp def
} bd
/ULS {currentpoint /uy exch def /ux exch def} bd
/ULE {
  /Tcx currentpoint pop def
  gsave
  newpath
  cf findfont cs scalefont dup
  /FontMatrix get 0 get /Ts exch def /FontInfo get dup
  /UnderlinePosition get Ts mul /To exch def
  /UnderlineThickness get Ts mul /Tt exch def
  ux uy To add moveto  Tcx uy To add lineto
  Tt setlinewidth stroke
  grestore
} bd
/OLE {
  /Tcx currentpoint pop def
  gsave
  newpath
  cf findfont cs scalefont dup
  /FontMatrix get 0 get /Ts exch def /FontInfo get dup
  /UnderlinePosition get Ts mul /To exch def
  /UnderlineThickness get Ts mul /Tt exch def
  ux uy To add cs add moveto Tcx uy To add cs add lineto
  Tt setlinewidth stroke
  grestore
} bd
/SOE {
  /Tcx currentpoint pop def
  gsave
  newpath
  cf findfont cs scalefont dup
  /FontMatrix get 0 get /Ts exch def /FontInfo get dup
  /UnderlinePosition get Ts mul /To exch def
  /UnderlineThickness get Ts mul /Tt exch def
  ux uy To add cs 10 mul 26 idiv add moveto Tcx uy To add cs 10 mul 26 idiv add lineto
  Tt setlinewidth stroke
  grestore
} bd
/QT {
/Y22 exch store
/X22 exch store
/Y21 exch store
/X21 exch store
currentpoint
/Y21 load 2 mul add 3 div exch
/X21 load 2 mul add 3 div exch
/X21 load 2 mul /X22 load add 3 div
/Y21 load 2 mul /Y22 load add 3 div
/X22 load /Y22 load curveto
} bd
/SSPD {
dup length /d exch dict def
{
/v exch def
/k exch def
currentpagedevice k known {
/cpdv currentpagedevice k get def
v cpdv ne {
/upd false def
/nullv v type /nulltype eq def
/nullcpdv cpdv type /nulltype eq def
nullv nullcpdv or
{
/upd true def
} {
/sametype v type cpdv type eq def
sametype {
v type /arraytype eq {
/vlen v length def
/cpdvlen cpdv length def
vlen cpdvlen eq {
0 1 vlen 1 sub {
/i exch def
/obj v i get def
/cpdobj cpdv i get def
obj cpdobj ne {
/upd true def
exit
} if
} for
} {
/upd true def
} ifelse
} {
v type /dicttype eq {
v {
/dv exch def
/dk exch def
/cpddv cpdv dk get def
dv cpddv ne {
/upd true def
exit
} if
} forall
} {
/upd true def
} ifelse
} ifelse
} if
} ifelse
upd true eq {
d k v put
} if
} if
} if
} forall
d length 0 gt {
d setpagedevice
} if
} bd
/RE { % /NewFontName [NewEncodingArray] /FontName RE -
  findfont dup length dict begin
  {
    1 index /FID ne
    {def} {pop pop} ifelse
  } forall
  /Encoding exch def
  /FontName 1 index def
  currentdict definefont pop
  end
} bind def
%%EndResource
%%BeginResource: procset (Apache XML Graphics EPS ProcSet) 1.0 0
%%Version: 1.0 0
%%Copyright: (Copyright 2002-2003 The Apache Software Foundation. License terms: http://www.apache.org/licenses/LICENSE-2.0)
/BeginEPSF { %def
/b4_Inc_state save def         % Save state for cleanup
/dict_count countdictstack def % Count objects on dict stack
/op_count count 1 sub def      % Count objects on operand stack
userdict begin                 % Push userdict on dict stack
/showpage { } def              % Redefine showpage, { } = null proc
0 setgray 0 setlinecap         % Prepare graphics state
1 setlinewidth 0 setlinejoin
10 setmiterlimit [ ] 0 setdash newpath
/languagelevel where           % If level not equal to 1 then
{pop languagelevel             % set strokeadjust and
1 ne                           % overprint to their defaults.
{false setstrokeadjust false setoverprint
} if
} if
} bd
/EndEPSF { %def
count op_count sub {pop} repeat            % Clean up stacks
countdictstack dict_count sub {end} repeat
b4_Inc_state restore
} bd
%%EndResource
%FOPBeginFontDict
%%IncludeResource: font Courier-Oblique
%%IncludeResource: font Courier-BoldOblique
%%IncludeResource: font Courier-Bold
%%IncludeResource: font ZapfDingbats
%%IncludeResource: font Symbol
%%IncludeResource: font Helvetica
%%IncludeResource: font Helvetica-Oblique
%%IncludeResource: font Helvetica-Bold
%%IncludeResource: font Helvetica-BoldOblique
%%IncludeResource: font Times-Roman
%%IncludeResource: font Times-Italic
%%IncludeResource: font Times-Bold
%%IncludeResource: font Times-BoldItalic
%%IncludeResource: font Courier
%FOPEndFontDict
%%BeginResource: encoding WinAnsiEncoding
/WinAnsiEncoding [
/.notdef /.notdef /.notdef /.notdef /.notdef
/.notdef /.notdef /.notdef /.notdef /.notdef
/.notdef /.notdef /.notdef /.notdef /.notdef
/.notdef /.notdef /.notdef /.notdef /.notdef
/.notdef /.notdef /.notdef /.notdef /.notdef
/.notdef /.notdef /.notdef /.notdef /.notdef
/.notdef /.notdef /space /exclam /quotedbl
/numbersign /dollar /percent /ampersand /quotesingle
/parenleft /parenright /asterisk /plus /comma
/hyphen /period /slash /zero /one
/two /three /four /five /six
/seven /eight /nine /colon /semicolon
/less /equal /greater /question /at
/A /B /C /D /E
/F /G /H /I /J
/K /L /M /N /O
/P /Q /R /S /T
/U /V /W /X /Y
/Z /bracketleft /backslash /bracketright /asciicircum
/underscore /quoteleft /a /b /c
/d /e /f /g /h
/i /j /k /l /m
/n /o /p /q /r
/s /t /u /v /w
/x /y /z /braceleft /bar
/braceright /asciitilde /bullet /Euro /bullet
/quotesinglbase /florin /quotedblbase /ellipsis /dagger
/daggerdbl /circumflex /perthousand /Scaron /guilsinglleft
/OE /bullet /Zcaron /bullet /bullet
/quoteleft /quoteright /quotedblleft /quotedblright /bullet
/endash /emdash /asciitilde /trademark /scaron
/guilsinglright /oe /bullet /zcaron /Ydieresis
/space /exclamdown /cent /sterling /currency
/yen /brokenbar /section /dieresis /copyright
/ordfeminine /guillemotleft /logicalnot /sfthyphen /registered
/macron /degree /plusminus /twosuperior /threesuperior
/acute /mu /paragraph /middot /cedilla
/onesuperior /ordmasculine /guillemotright /onequarter /onehalf
/threequarters /questiondown /Agrave /Aacute /Acircumflex
/Atilde /Adieresis /Aring /AE /Ccedilla
/Egrave /Eacute /Ecircumflex /Edieresis /Igrave
/Iacute /Icircumflex /Idieresis /Eth /Ntilde
/Ograve /Oacute /Ocircumflex /Otilde /Odieresis
/multiply /Oslash /Ugrave /Uacute /Ucircumflex
/Udieresis /Yacute /Thorn /germandbls /agrave
/aacute /acircumflex /atilde /adieresis /aring
/ae /ccedilla /egrave /eacute /ecircumflex
/edieresis /igrave /iacute /icircumflex /idieresis
/eth /ntilde /ograve /oacute /ocircumflex
/otilde /odieresis /divide /oslash /ugrave
/uacute /ucircumflex /udieresis /yacute /thorn
/ydieresis
] def
%%EndResource
%FOPBeginFontReencode
/Courier-Oblique findfont
dup length dict begin
  {1 index /FID ne {def} {pop pop} ifelse} forall
  /Encoding WinAnsiEncoding def
  currentdict
end
/Courier-Oblique exch definefont pop
/Courier-BoldOblique findfont
dup length dict begin
  {1 index /FID ne {def} {pop pop} ifelse} forall
  /Encoding WinAnsiEncoding def
  currentdict
end
/Courier-BoldOblique exch definefont pop
/Courier-Bold findfont
dup length dict begin
  {1 index /FID ne {def} {pop pop} ifelse} forall
  /Encoding WinAnsiEncoding def
  currentdict
end
/Courier-Bold exch definefont pop
/Helvetica findfont
dup length dict begin
  {1 index /FID ne {def} {pop pop} ifelse} forall
  /Encoding WinAnsiEncoding def
  currentdict
end
/Helvetica exch definefont pop
/Helvetica-Oblique findfont
dup length dict begin
  {1 index /FID ne {def} {pop pop} ifelse} forall
  /Encoding WinAnsiEncoding def
  currentdict
end
/Helvetica-Oblique exch definefont pop
/Helvetica-Bold findfont
dup length dict begin
  {1 index /FID ne {def} {pop pop} ifelse} forall
  /Encoding WinAnsiEncoding def
  currentdict
end
/Helvetica-Bold exch definefont pop
/Helvetica-BoldOblique findfont
dup length dict begin
  {1 index /FID ne {def} {pop pop} ifelse} forall
  /Encoding WinAnsiEncoding def
  currentdict
end
/Helvetica-BoldOblique exch definefont pop
/Times-Roman findfont
dup length dict begin
  {1 index /FID ne {def} {pop pop} ifelse} forall
  /Encoding WinAnsiEncoding def
  currentdict
end
/Times-Roman exch definefont pop
/Times-Italic findfont
dup length dict begin
  {1 index /FID ne {def} {pop pop} ifelse} forall
  /Encoding WinAnsiEncoding def
  currentdict
end
/Times-Italic exch definefont pop
/Times-Bold findfont
dup length dict begin
  {1 index /FID ne {def} {pop pop} ifelse} forall
  /Encoding WinAnsiEncoding def
  currentdict
end
/Times-Bold exch definefont pop
/Times-BoldItalic findfont
dup length dict begin
  {1 index /FID ne {def} {pop pop} ifelse} forall
  /Encoding WinAnsiEncoding def
  currentdict
end
/Times-BoldItalic exch definefont pop
/Courier findfont
dup length dict begin
  {1 index /FID ne {def} {pop pop} ifelse} forall
  /Encoding WinAnsiEncoding def
  currentdict
end
/Courier exch definefont pop
%FOPEndFontReencode
%%EndProlog
%%Page: 1 1
%%PageBoundingBox: 0 0 428 338
%%BeginPageSetup
N
    9     2 M
  397     2 L
  397   337 L
    9   337 L
cp
clip
[1 0 0 -1 0 338] CT
%%EndPageSetup
GS
[0.75 0 0 0.75 0 0.5] CT
N
0 0 M
570 0 L
570 450 L
0 450 L
0 0 L
cp
clip
1 GC
N
0 0 570 450 re
f
GR
GS
[0.75 0 0 0.75 0 0.5] CT
1 GC
N
0 0 570 450 re
f
GR
GS
[0.75 0 0 0.75 0 0.5] CT
1 GC
N
74 390 M
516 390 L
516 38 L
74 38 L
cp
f
GR
GS
[0.75 0 0 0.75 0 0.5] CT
0.873 GC
1 LJ
0.667 LW
N
74 390 M
74 38 L
S
GR
GS
[0.75 0 0 0.75 0 0.5] CT
0.873 GC
1 LJ
0.667 LW
N
120.526 390 M
120.526 38 L
S
GR
GS
[0.75 0 0 0.75 0 0.5] CT
0.873 GC
1 LJ
0.667 LW
N
167.053 390 M
167.053 38 L
S
GR
GS
[0.75 0 0 0.75 0 0.5] CT
0.873 GC
1 LJ
0.667 LW
N
213.579 390 M
213.579 38 L
S
GR
GS
[0.75 0 0 0.75 0 0.5] CT
0.873 GC
1 LJ
0.667 LW
N
260.105 390 M
260.105 38 L
S
GR
GS
[0.75 0 0 0.75 0 0.5] CT
0.873 GC
1 LJ
0.667 LW
N
306.632 390 M
306.632 38 L
S
GR
GS
[0.75 0 0 0.75 0 0.5] CT
0.873 GC
1 LJ
0.667 LW
N
353.158 390 M
353.158 38 L
S
GR
GS
[0.75 0 0 0.75 0 0.5] CT
0.873 GC
1 LJ
0.667 LW
N
399.684 390 M
399.684 38 L
S
GR
GS
[0.75 0 0 0.75 0 0.5] CT
0.873 GC
1 LJ
0.667 LW
N
446.211 390 M
446.211 38 L
S
GR
GS
[0.75 0 0 0.75 0 0.5] CT
0.873 GC
1 LJ
0.667 LW
N
492.737 390 M
492.737 38 L
S
GR
GS
[0.75 0 0 0.75 0 0.5] CT
0.873 GC
1 LJ
0.667 LW
N
516 390 M
74 390 L
S
GR
GS
[0.75 0 0 0.75 0 0.5] CT
0.873 GC
1 LJ
0.667 LW
N
516 339.714 M
74 339.714 L
S
GR
GS
[0.75 0 0 0.75 0 0.5] CT
0.873 GC
1 LJ
0.667 LW
N
516 289.429 M
74 289.429 L
S
GR
GS
[0.75 0 0 0.75 0 0.5] CT
0.873 GC
1 LJ
0.667 LW
N
516 239.143 M
74 239.143 L
S
GR
GS
[0.75 0 0 0.75 0 0.5] CT
0.873 GC
1 LJ
0.667 LW
N
516 188.857 M
74 188.857 L
S
GR
GS
[0.75 0 0 0.75 0 0.5] CT
0.873 GC
1 LJ
0.667 LW
N
516 138.571 M
74 138.571 L
S
GR
GS
[0.75 0 0 0.75 0 0.5] CT
0.873 GC
1 LJ
0.667 LW
N
516 88.286 M
74 88.286 L
S
GR
GS
[0.75 0 0 0.75 0 0.5] CT
0.873 GC
1 LJ
0.667 LW
N
516 38 M
74 38 L
S
GR
GS
[0.75 0 0 0.75 0 0.5] CT
0.149 GC
2 setlinecap
1 LJ
0.667 LW
N
74 390 M
516 390 L
S
GR
GS
[0.75 0 0 0.75 0 0.5] CT
0.149 GC
2 setlinecap
1 LJ
0.667 LW
N
74 390 M
74 385.58 L
S
GR
GS
[0.75 0 0 0.75 0 0.5] CT
0.149 GC
2 setlinecap
1 LJ
0.667 LW
N
120.526 390 M
120.526 385.58 L
S
GR
GS
[0.75 0 0 0.75 0 0.5] CT
0.149 GC
2 setlinecap
1 LJ
0.667 LW
N
167.053 390 M
167.053 385.58 L
S
GR
GS
[0.75 0 0 0.75 0 0.5] CT
0.149 GC
2 setlinecap
1 LJ
0.667 LW
N
213.579 390 M
213.579 385.58 L
S
GR
GS
[0.75 0 0 0.75 0 0.5] CT
0.149 GC
2 setlinecap
1 LJ
0.667 LW
N
260.105 390 M
260.105 385.58 L
S
GR
GS
[0.75 0 0 0.75 0 0.5] CT
0.149 GC
2 setlinecap
1 LJ
0.667 LW
N
306.632 390 M
306.632 385.58 L
S
GR
GS
[0.75 0 0 0.75 0 0.5] CT
0.149 GC
2 setlinecap
1 LJ
0.667 LW
N
353.158 390 M
353.158 385.58 L
S
GR
GS
[0.75 0 0 0.75 0 0.5] CT
0.149 GC
2 setlinecap
1 LJ
0.667 LW
N
399.684 390 M
399.684 385.58 L
S
GR
GS
[0.75 0 0 0.75 0 0.5] CT
0.149 GC
2 setlinecap
1 LJ
0.667 LW
N
446.211 390 M
446.211 385.58 L
S
GR
GS
[0.75 0 0 0.75 0 0.5] CT
0.149 GC
2 setlinecap
1 LJ
0.667 LW
N
492.737 390 M
492.737 385.58 L
S
GR
GS
[0.75 0 0 0.75 55.5 296.99998] CT
0.149 GC
/Helvetica 13.333 F
GS
[1 0 0 1 0 0] CT
-4 15 moveto 
1 -1 scale
(0) t 
GR
GR
GS
[0.75 0 0 0.75 90.39474 296.99998] CT
0.149 GC
/Helvetica 13.333 F
GS
[1 0 0 1 0 0] CT
-4 15 moveto 
1 -1 scale
(2) t 
GR
GR
GS
[0.75 0 0 0.75 125.28947 296.99998] CT
0.149 GC
/Helvetica 13.333 F
GS
[1 0 0 1 0 0] CT
-4 15 moveto 
1 -1 scale
(4) t 
GR
GR
GS
[0.75 0 0 0.75 160.18421 296.99998] CT
0.149 GC
/Helvetica 13.333 F
GS
[1 0 0 1 0 0] CT
-4 15 moveto 
1 -1 scale
(6) t 
GR
GR
GS
[0.75 0 0 0.75 195.07894 296.99998] CT
0.149 GC
/Helvetica 13.333 F
GS
[1 0 0 1 0 0] CT
-4 15 moveto 
1 -1 scale
(8) t 
GR
GR
GS
[0.75 0 0 0.75 229.97369 296.99998] CT
0.149 GC
/Helvetica 13.333 F
GS
[1 0 0 1 0 0] CT
-8 15 moveto 
1 -1 scale
(10) t 
GR
GR
GS
[0.75 0 0 0.75 264.86842 296.99998] CT
0.149 GC
/Helvetica 13.333 F
GS
[1 0 0 1 0 0] CT
-8 15 moveto 
1 -1 scale
(12) t 
GR
GR
GS
[0.75 0 0 0.75 299.76315 296.99998] CT
0.149 GC
/Helvetica 13.333 F
GS
[1 0 0 1 0 0] CT
-8 15 moveto 
1 -1 scale
(14) t 
GR
GR
GS
[0.75 0 0 0.75 334.65791 296.99998] CT
0.149 GC
/Helvetica 13.333 F
GS
[1 0 0 1 0 0] CT
-8 15 moveto 
1 -1 scale
(16) t 
GR
GR
GS
[0.75 0 0 0.75 369.55264 296.99998] CT
0.149 GC
/Helvetica 13.333 F
GS
[1 0 0 1 0 0] CT
-8 15 moveto 
1 -1 scale
(18) t 
GR
GR
GS
[0.75 0 0 0.75 221.25016 311.50002] CT
0.149 GC
N
-43.282 22.296 M
-43.282 21.859 -43.188 21.484 QT
-41.095 13.156 L
-44.142 13.156 L
-44.438 13.156 -44.438 12.781 QT
-44.329 12.14 -44.063 12.14 QT
-40.845 12.14 L
-39.688 7.406 L
-39.563 7.031 -39.227 6.757 QT
-38.892 6.484 -38.47 6.484 QT
-38.095 6.484 -37.845 6.702 QT
-37.595 6.921 -37.595 7.296 QT
-37.595 7.374 -37.602 7.429 QT
-37.61 7.484 -37.626 7.531 QT
-38.798 12.14 L
-35.798 12.14 L
-35.501 12.14 -35.501 12.515 QT
-35.517 12.593 -35.563 12.765 QT
-35.61 12.937 -35.681 13.046 QT
-35.751 13.156 -35.892 13.156 QT
-39.048 13.156 L
-41.126 21.546 L
-41.345 22.359 -41.345 22.952 QT
-41.345 24.202 -40.485 24.202 QT
-39.22 24.202 -38.235 23.007 QT
-37.251 21.812 -36.72 20.374 QT
-36.61 20.202 -36.501 20.202 QT
-36.142 20.202 L
-36.032 20.202 -35.962 20.281 QT
-35.892 20.359 -35.892 20.468 QT
-35.892 20.515 -35.923 20.546 QT
-36.548 22.296 -37.767 23.632 QT
-38.985 24.968 -40.563 24.968 QT
-41.704 24.968 -42.493 24.218 QT
-43.282 23.468 -43.282 22.296 QT
cp
f
GR
GS
[0.75 0 0 0.75 221.25016 311.50002] CT
0.149 GC
N
-32.221 22.562 M
-32.221 22.015 -31.986 21.421 QT
-29.643 15.187 L
-29.268 14.124 -29.268 13.437 QT
-29.268 12.577 -29.893 12.577 QT
-31.049 12.577 -31.791 13.757 QT
-32.533 14.937 -32.893 16.406 QT
-32.94 16.577 -33.127 16.577 QT
-33.471 16.577 L
-33.705 16.577 -33.705 16.312 QT
-33.705 16.234 L
-33.236 14.499 -32.276 13.163 QT
-31.315 11.827 -29.846 11.827 QT
-28.815 11.827 -28.096 12.507 QT
-27.377 13.187 -27.377 14.234 QT
-27.377 14.765 -27.611 15.359 QT
-29.971 21.593 L
-30.361 22.562 -30.361 23.343 QT
-30.361 24.202 -29.705 24.202 QT
-28.565 24.202 -27.807 22.991 QT
-27.049 21.781 -26.736 20.374 QT
-26.69 20.202 -26.518 20.202 QT
-26.158 20.202 L
-26.049 20.202 -25.979 20.281 QT
-25.908 20.359 -25.908 20.468 QT
-25.908 20.484 -25.94 20.546 QT
-26.33 22.187 -27.315 23.577 QT
-28.299 24.968 -29.752 24.968 QT
-30.783 24.968 -31.502 24.265 QT
-32.221 23.562 -32.221 22.562 QT
cp
-28.955 7.062 M
-28.955 6.452 -28.44 5.96 QT
-27.924 5.468 -27.315 5.468 QT
-26.83 5.468 -26.51 5.773 QT
-26.19 6.077 -26.19 6.546 QT
-26.19 7.187 -26.705 7.679 QT
-27.221 8.171 -27.846 8.171 QT
-28.315 8.171 -28.635 7.851 QT
-28.955 7.531 -28.955 7.062 QT
cp
f
GR
GS
[0.75 0 0 0.75 221.25016 311.50002] CT
0.149 GC
N
-22.146 24.14 M
-22.146 23.968 -22.115 23.89 QT
-19.943 15.234 L
-19.74 14.437 -19.74 13.827 QT
-19.74 12.577 -20.584 12.577 QT
-21.49 12.577 -21.928 13.663 QT
-22.365 14.749 -22.787 16.406 QT
-22.787 16.484 -22.865 16.531 QT
-22.943 16.577 -23.021 16.577 QT
-23.365 16.577 L
-23.459 16.577 -23.529 16.476 QT
-23.599 16.374 -23.599 16.281 QT
-23.287 15.031 -22.998 14.148 QT
-22.709 13.265 -22.092 12.546 QT
-21.474 11.827 -20.553 11.827 QT
-19.474 11.827 -18.639 12.515 QT
-17.803 13.202 -17.803 14.265 QT
-16.928 13.124 -15.771 12.476 QT
-14.615 11.827 -13.303 11.827 QT
-11.928 11.827 -10.935 12.531 QT
-9.943 13.234 -9.943 14.515 QT
-9.053 13.249 -7.849 12.538 QT
-6.646 11.827 -5.24 11.827 QT
-3.74 11.827 -2.826 12.64 QT
-1.912 13.452 -1.912 14.952 QT
-1.912 16.14 -2.443 17.827 QT
-2.974 19.515 -3.756 21.593 QT
-4.178 22.593 -4.178 23.343 QT
-4.178 24.202 -3.49 24.202 QT
-2.365 24.202 -1.615 22.984 QT
-0.865 21.765 -0.553 20.374 QT
-0.459 20.202 -0.303 20.202 QT
0.026 20.202 L
0.151 20.202 0.229 20.281 QT
0.307 20.359 0.307 20.468 QT
0.307 20.484 0.276 20.546 QT
-0.131 22.187 -1.115 23.577 QT
-2.099 24.968 -3.568 24.968 QT
-4.584 24.968 -5.303 24.265 QT
-6.021 23.562 -6.021 22.562 QT
-6.021 22.046 -5.787 21.421 QT
-4.974 19.249 -4.428 17.531 QT
-3.881 15.812 -3.881 14.515 QT
-3.881 13.702 -4.201 13.14 QT
-4.521 12.577 -5.287 12.577 QT
-6.881 12.577 -8.037 13.546 QT
-9.193 14.515 -10.053 16.109 QT
-10.099 16.406 -10.131 16.562 QT
-12.006 23.999 L
-12.099 24.406 -12.451 24.687 QT
-12.803 24.968 -13.224 24.968 QT
-13.568 24.968 -13.826 24.741 QT
-14.084 24.515 -14.084 24.14 QT
-14.084 23.968 -14.053 23.89 QT
-12.209 16.499 L
-11.912 15.312 -11.912 14.515 QT
-11.912 13.702 -12.24 13.14 QT
-12.568 12.577 -13.365 12.577 QT
-14.428 12.577 -15.318 13.046 QT
-16.209 13.515 -16.873 14.281 QT
-17.537 15.046 -18.099 16.109 QT
-20.068 23.999 L
-20.162 24.406 -20.506 24.687 QT
-20.849 24.968 -21.287 24.968 QT
-21.631 24.968 -21.889 24.741 QT
-22.146 24.515 -22.146 24.14 QT
cp
f
GR
GS
[0.75 0 0 0.75 221.25016 311.50002] CT
0.149 GC
N
7.202 24.968 M
5.827 24.968 4.781 24.241 QT
3.734 23.515 3.195 22.296 QT
2.656 21.077 2.656 19.718 QT
2.656 17.64 3.695 15.82 QT
4.734 13.999 6.515 12.913 QT
8.296 11.827 10.343 11.827 QT
11.577 11.827 12.507 12.468 QT
13.437 13.109 13.437 14.312 QT
13.437 15.984 12.109 16.796 QT
10.781 17.609 9.109 17.804 QT
7.437 17.999 5.406 17.999 QT
5.327 17.999 L
4.859 19.734 4.859 20.952 QT
4.859 22.249 5.452 23.226 QT
6.046 24.202 7.265 24.202 QT
8.999 24.202 10.585 23.406 QT
12.171 22.609 13.187 21.218 QT
13.265 21.124 13.406 21.124 QT
13.546 21.124 13.695 21.288 QT
13.843 21.452 13.843 21.593 QT
13.843 21.702 13.796 21.765 QT
12.734 23.249 10.937 24.109 QT
9.14 24.968 7.202 24.968 QT
cp
5.499 17.249 M
7.187 17.249 8.617 17.093 QT
10.046 16.937 11.202 16.304 QT
12.359 15.671 12.359 14.343 QT
12.359 13.812 12.062 13.406 QT
11.765 12.999 11.288 12.788 QT
10.812 12.577 10.312 12.577 QT
9.077 12.577 8.093 13.241 QT
7.109 13.906 6.468 14.976 QT
5.827 16.046 5.499 17.249 QT
cp
f
GR
GS
[0.75 0 0 0.75 221.25016 311.50002] CT
0.149 GC
N
18.455 31.89 M
18.455 2.89 L
22.423 2.89 L
22.423 4.046 L
19.626 4.046 L
19.626 30.734 L
22.423 30.734 L
22.423 31.89 L
18.455 31.89 L
cp
f
GR
GS
[0.75 0 0 0.75 221.25016 311.50002] CT
0.149 GC
N
25.697 22.874 M
26.478 24.202 28.837 24.202 QT
29.853 24.202 30.775 23.851 QT
31.697 23.499 32.298 22.812 QT
32.9 22.124 32.9 21.124 QT
32.9 20.374 32.361 19.898 QT
31.822 19.421 31.04 19.249 QT
29.462 18.937 L
28.4 18.671 27.704 17.929 QT
27.009 17.187 27.009 16.14 QT
27.009 14.859 27.704 13.866 QT
28.4 12.874 29.548 12.351 QT
30.697 11.827 31.931 11.827 QT
33.243 11.827 34.29 12.452 QT
35.337 13.077 35.337 14.312 QT
35.337 14.984 34.962 15.491 QT
34.587 15.999 33.915 15.999 QT
33.525 15.999 33.251 15.749 QT
32.978 15.499 32.978 15.124 QT
32.978 14.781 33.173 14.46 QT
33.368 14.14 33.681 13.952 QT
33.993 13.765 34.337 13.765 QT
34.087 13.14 33.384 12.859 QT
32.681 12.577 31.868 12.577 QT
31.134 12.577 30.4 12.874 QT
29.665 13.171 29.22 13.741 QT
28.775 14.312 28.775 15.093 QT
28.775 15.624 29.142 16.015 QT
29.509 16.406 30.056 16.577 QT
31.728 16.921 L
32.54 17.093 33.212 17.523 QT
33.884 17.952 34.275 18.616 QT
34.665 19.281 34.665 20.124 QT
34.665 21.202 34.064 22.249 QT
33.462 23.296 32.587 23.921 QT
31.04 24.968 28.806 24.968 QT
27.259 24.968 25.97 24.257 QT
24.681 23.546 24.681 22.14 QT
24.681 21.359 25.142 20.773 QT
25.603 20.187 26.4 20.187 QT
26.868 20.187 27.181 20.468 QT
27.493 20.749 27.493 21.218 QT
27.493 21.874 27.001 22.374 QT
26.509 22.874 25.837 22.874 QT
25.697 22.874 L
cp
f
GR
GS
[0.75 0 0 0.75 221.25016 311.50002] CT
0.149 GC
N
37.572 31.89 M
37.572 30.734 L
40.384 30.734 L
40.384 4.046 L
37.572 4.046 L
37.572 2.89 L
41.54 2.89 L
41.54 31.89 L
37.572 31.89 L
cp
f
GR
GS
[0.75 0 0 0.75 0 0.5] CT
0.149 GC
2 setlinecap
1 LJ
0.667 LW
N
74 390 M
74 38 L
S
GR
GS
[0.75 0 0 0.75 0 0.5] CT
0.149 GC
2 setlinecap
1 LJ
0.667 LW
N
74 390 M
78.42 390 L
S
GR
GS
[0.75 0 0 0.75 0 0.5] CT
0.149 GC
2 setlinecap
1 LJ
0.667 LW
N
74 339.714 M
78.42 339.714 L
S
GR
GS
[0.75 0 0 0.75 0 0.5] CT
0.149 GC
2 setlinecap
1 LJ
0.667 LW
N
74 289.429 M
78.42 289.429 L
S
GR
GS
[0.75 0 0 0.75 0 0.5] CT
0.149 GC
2 setlinecap
1 LJ
0.667 LW
N
74 239.143 M
78.42 239.143 L
S
GR
GS
[0.75 0 0 0.75 0 0.5] CT
0.149 GC
2 setlinecap
1 LJ
0.667 LW
N
74 188.857 M
78.42 188.857 L
S
GR
GS
[0.75 0 0 0.75 0 0.5] CT
0.149 GC
2 setlinecap
1 LJ
0.667 LW
N
74 138.571 M
78.42 138.571 L
S
GR
GS
[0.75 0 0 0.75 0 0.5] CT
0.149 GC
2 setlinecap
1 LJ
0.667 LW
N
74 88.286 M
78.42 88.286 L
S
GR
GS
[0.75 0 0 0.75 0 0.5] CT
0.149 GC
2 setlinecap
1 LJ
0.667 LW
N
74 38 M
78.42 38 L
S
GR
GS
[0.75 0 0 0.75 51.5 293] CT
0.149 GC
/Helvetica 13.333 F
GS
[1 0 0 1 0 0] CT
-20 5.5 moveto 
1 -1 scale
(-12) t 
GR
GR
GS
[0.75 0 0 0.75 51.5 255.28572] CT
0.149 GC
/Helvetica 13.333 F
GS
[1 0 0 1 0 0] CT
-20 5.5 moveto 
1 -1 scale
(-10) t 
GR
GR
GS
[0.75 0 0 0.75 51.5 217.57142] CT
0.149 GC
/Helvetica 13.333 F
GS
[1 0 0 1 0 0] CT
-12 5.5 moveto 
1 -1 scale
(-8) t 
GR
GR
GS
[0.75 0 0 0.75 51.5 179.85714] CT
0.149 GC
/Helvetica 13.333 F
GS
[1 0 0 1 0 0] CT
-12 5.5 moveto 
1 -1 scale
(-6) t 
GR
GR
GS
[0.75 0 0 0.75 51.5 142.14286] CT
0.149 GC
/Helvetica 13.333 F
GS
[1 0 0 1 0 0] CT
-12 5.5 moveto 
1 -1 scale
(-4) t 
GR
GR
GS
[0.75 0 0 0.75 51.5 104.42857] CT
0.149 GC
/Helvetica 13.333 F
GS
[1 0 0 1 0 0] CT
-12 5.5 moveto 
1 -1 scale
(-2) t 
GR
GR
GS
[0.75 0 0 0.75 51.5 66.71428] CT
0.149 GC
/Helvetica 13.333 F
GS
[1 0 0 1 0 0] CT
-8 5.5 moveto 
1 -1 scale
(0) t 
GR
GR
GS
[0.75 0 0 0.75 51.5 29] CT
0.149 GC
/Helvetica 13.333 F
GS
[1 0 0 1 0 0] CT
-8 5.5 moveto 
1 -1 scale
(2) t 
GR
GR
GS
[0 -0.75 0.75 0 33.5 160.99987] CT
0.149 GC
N
-40.793 -28.357 M
-40.793 -28.998 -40.308 -29.482 QT
-39.824 -29.966 -39.199 -29.966 QT
-38.793 -29.966 -38.41 -29.748 QT
-38.027 -29.529 -37.816 -29.146 QT
-37.605 -28.763 -37.605 -28.357 QT
-37.605 -27.732 -38.074 -27.255 QT
-38.543 -26.779 -39.199 -26.779 QT
-39.824 -26.779 -40.308 -27.255 QT
-40.793 -27.732 -40.793 -28.357 QT
cp
f
GR
GS
[0 -0.75 0.75 0 33.5 160.99987] CT
0.149 GC
N
-45.576 -11.06 M
-45.576 -11.232 -45.545 -11.31 QT
-43.373 -19.966 L
-43.17 -20.763 -43.17 -21.373 QT
-43.17 -22.623 -44.014 -22.623 QT
-44.92 -22.623 -45.357 -21.537 QT
-45.795 -20.451 -46.217 -18.794 QT
-46.217 -18.716 -46.295 -18.669 QT
-46.373 -18.623 -46.451 -18.623 QT
-46.795 -18.623 L
-46.889 -18.623 -46.959 -18.724 QT
-47.029 -18.826 -47.029 -18.919 QT
-46.717 -20.169 -46.428 -21.052 QT
-46.139 -21.935 -45.521 -22.654 QT
-44.904 -23.373 -43.982 -23.373 QT
-42.982 -23.373 -42.224 -22.794 QT
-41.467 -22.216 -41.279 -21.263 QT
-40.545 -22.232 -39.607 -22.802 QT
-38.67 -23.373 -37.545 -23.373 QT
-36.623 -23.373 -35.92 -22.834 QT
-35.217 -22.294 -35.217 -21.373 QT
-35.217 -20.638 -35.678 -20.091 QT
-36.139 -19.544 -36.904 -19.544 QT
-37.373 -19.544 -37.693 -19.841 QT
-38.014 -20.138 -38.014 -20.607 QT
-38.014 -21.232 -37.545 -21.74 QT
-37.076 -22.248 -36.467 -22.248 QT
-36.935 -22.623 -37.607 -22.623 QT
-38.842 -22.623 -39.764 -21.74 QT
-40.685 -20.857 -41.42 -19.498 QT
-43.498 -11.201 L
-43.592 -10.794 -43.935 -10.513 QT
-44.279 -10.232 -44.717 -10.232 QT
-45.06 -10.232 -45.318 -10.459 QT
-45.576 -10.685 -45.576 -11.06 QT
cp
f
GR
GS
[0 -0.75 0.75 0 33.5 160.99987] CT
0.149 GC
N
-33.545 -5.926 M
-33.717 -5.926 -33.717 -6.113 QT
-33.717 -6.223 -33.67 -6.27 QT
-33.108 -7.238 -32.311 -8.121 QT
-31.514 -9.004 -30.506 -9.918 QT
-29.498 -10.832 -28.483 -11.738 QT
-27.467 -12.645 -26.826 -13.363 QT
-26.905 -13.363 L
-27.373 -13.363 -28.264 -13.66 QT
-29.155 -13.957 -29.67 -13.957 QT
-30.217 -13.957 -30.74 -13.715 QT
-31.264 -13.473 -31.405 -12.973 QT
-31.436 -12.816 -31.576 -12.816 QT
-31.826 -12.816 L
-31.998 -12.816 -31.998 -13.035 QT
-31.998 -13.098 L
-31.826 -13.707 -31.451 -14.238 QT
-31.076 -14.77 -30.53 -15.105 QT
-29.983 -15.441 -29.389 -15.441 QT
-28.967 -15.441 -28.694 -15.254 QT
-28.42 -15.066 -28.045 -14.66 QT
-27.67 -14.254 -27.444 -14.082 QT
-27.217 -13.91 -26.858 -13.91 QT
-26.405 -13.91 -26.037 -14.332 QT
-25.67 -14.754 -25.311 -15.379 QT
-25.248 -15.441 -25.17 -15.441 QT
-24.92 -15.441 L
-24.842 -15.441 -24.795 -15.387 QT
-24.748 -15.332 -24.748 -15.254 QT
-24.748 -15.191 -24.795 -15.129 QT
-25.358 -14.145 -26.108 -13.301 QT
-26.858 -12.457 -28.076 -11.363 QT
-29.295 -10.27 -30.131 -9.52 QT
-30.967 -8.77 -31.701 -7.973 QT
-31.53 -8.004 -31.248 -8.004 QT
-30.748 -8.004 -29.858 -7.715 QT
-28.967 -7.426 -28.483 -7.426 QT
-27.967 -7.426 -27.428 -7.652 QT
-26.889 -7.879 -26.506 -8.285 QT
-26.123 -8.691 -25.983 -9.223 QT
-25.936 -9.363 -25.826 -9.363 QT
-25.561 -9.363 L
-25.483 -9.363 -25.428 -9.301 QT
-25.373 -9.238 -25.373 -9.16 QT
-25.373 -9.145 -25.405 -9.098 QT
-25.592 -8.301 -26.076 -7.582 QT
-26.561 -6.863 -27.264 -6.395 QT
-27.967 -5.926 -28.764 -5.926 QT
-29.155 -5.926 -29.436 -6.113 QT
-29.717 -6.301 -30.092 -6.699 QT
-30.467 -7.098 -30.701 -7.277 QT
-30.936 -7.457 -31.28 -7.457 QT
-32.326 -7.457 -33.155 -5.988 QT
-33.217 -5.926 -33.295 -5.926 QT
-33.545 -5.926 L
cp
f
GR
GS
[0 -0.75 0.75 0 33.5 160.99987] CT
0.149 GC
N
-19.236 -3.31 M
-19.236 -32.31 L
-15.267 -32.31 L
-15.267 -31.154 L
-18.064 -31.154 L
-18.064 -4.466 L
-15.267 -4.466 L
-15.267 -3.31 L
-19.236 -3.31 L
cp
f
GR
GS
[0 -0.75 0.75 0 33.5 160.99987] CT
0.149 GC
N
-12.275 -11.06 M
-12.275 -11.232 -12.244 -11.31 QT
-10.072 -19.966 L
-9.869 -20.763 -9.869 -21.373 QT
-9.869 -22.623 -10.713 -22.623 QT
-11.619 -22.623 -12.056 -21.537 QT
-12.494 -20.451 -12.916 -18.794 QT
-12.916 -18.716 -12.994 -18.669 QT
-13.072 -18.623 -13.15 -18.623 QT
-13.494 -18.623 L
-13.588 -18.623 -13.658 -18.724 QT
-13.728 -18.826 -13.728 -18.919 QT
-13.416 -20.169 -13.127 -21.052 QT
-12.838 -21.935 -12.22 -22.654 QT
-11.603 -23.373 -10.681 -23.373 QT
-9.603 -23.373 -8.767 -22.685 QT
-7.931 -21.998 -7.931 -20.935 QT
-7.056 -22.076 -5.9 -22.724 QT
-4.744 -23.373 -3.431 -23.373 QT
-2.056 -23.373 -1.064 -22.669 QT
-0.072 -21.966 -0.072 -20.685 QT
0.819 -21.951 2.022 -22.662 QT
3.225 -23.373 4.631 -23.373 QT
6.131 -23.373 7.045 -22.56 QT
7.959 -21.748 7.959 -20.248 QT
7.959 -19.06 7.428 -17.373 QT
6.897 -15.685 6.115 -13.607 QT
5.694 -12.607 5.694 -11.857 QT
5.694 -10.998 6.381 -10.998 QT
7.506 -10.998 8.256 -12.216 QT
9.006 -13.435 9.319 -14.826 QT
9.412 -14.998 9.569 -14.998 QT
9.897 -14.998 L
10.022 -14.998 10.1 -14.919 QT
10.178 -14.841 10.178 -14.732 QT
10.178 -14.716 10.147 -14.654 QT
9.74 -13.013 8.756 -11.623 QT
7.772 -10.232 6.303 -10.232 QT
5.287 -10.232 4.569 -10.935 QT
3.85 -11.638 3.85 -12.638 QT
3.85 -13.154 4.084 -13.779 QT
4.897 -15.951 5.444 -17.669 QT
5.99 -19.388 5.99 -20.685 QT
5.99 -21.498 5.67 -22.06 QT
5.35 -22.623 4.584 -22.623 QT
2.99 -22.623 1.834 -21.654 QT
0.678 -20.685 -0.181 -19.091 QT
-0.228 -18.794 -0.26 -18.638 QT
-2.135 -11.201 L
-2.228 -10.794 -2.58 -10.513 QT
-2.931 -10.232 -3.353 -10.232 QT
-3.697 -10.232 -3.955 -10.459 QT
-4.213 -10.685 -4.213 -11.06 QT
-4.213 -11.232 -4.181 -11.31 QT
-2.338 -18.701 L
-2.041 -19.888 -2.041 -20.685 QT
-2.041 -21.498 -2.369 -22.06 QT
-2.697 -22.623 -3.494 -22.623 QT
-4.556 -22.623 -5.447 -22.154 QT
-6.338 -21.685 -7.002 -20.919 QT
-7.666 -20.154 -8.228 -19.091 QT
-10.197 -11.201 L
-10.291 -10.794 -10.635 -10.513 QT
-10.978 -10.232 -11.416 -10.232 QT
-11.76 -10.232 -12.017 -10.459 QT
-12.275 -10.685 -12.275 -11.06 QT
cp
f
GR
GS
[0 -0.75 0.75 0 33.5 160.99987] CT
0.149 GC
N
12.871 -3.888 M
12.871 -3.982 12.902 -3.998 QT
22.98 -31.951 L
23.042 -32.123 23.183 -32.216 QT
23.324 -32.31 23.511 -32.31 QT
23.761 -32.31 23.925 -32.154 QT
24.089 -31.998 24.089 -31.732 QT
24.089 -31.623 L
14.011 -3.669 L
13.839 -3.31 13.449 -3.31 QT
13.214 -3.31 13.042 -3.482 QT
12.871 -3.654 12.871 -3.888 QT
cp
f
GR
GS
[0 -0.75 0.75 0 33.5 160.99987] CT
0.149 GC
N
28.428 -12.326 M
29.209 -10.998 31.569 -10.998 QT
32.584 -10.998 33.506 -11.349 QT
34.428 -11.701 35.029 -12.388 QT
35.631 -13.076 35.631 -14.076 QT
35.631 -14.826 35.092 -15.302 QT
34.553 -15.779 33.772 -15.951 QT
32.194 -16.263 L
31.131 -16.529 30.436 -17.271 QT
29.74 -18.013 29.74 -19.06 QT
29.74 -20.341 30.436 -21.334 QT
31.131 -22.326 32.279 -22.849 QT
33.428 -23.373 34.662 -23.373 QT
35.975 -23.373 37.022 -22.748 QT
38.069 -22.123 38.069 -20.888 QT
38.069 -20.216 37.694 -19.709 QT
37.319 -19.201 36.647 -19.201 QT
36.256 -19.201 35.983 -19.451 QT
35.709 -19.701 35.709 -20.076 QT
35.709 -20.419 35.904 -20.74 QT
36.1 -21.06 36.412 -21.248 QT
36.725 -21.435 37.069 -21.435 QT
36.819 -22.06 36.115 -22.341 QT
35.412 -22.623 34.6 -22.623 QT
33.865 -22.623 33.131 -22.326 QT
32.397 -22.029 31.951 -21.459 QT
31.506 -20.888 31.506 -20.107 QT
31.506 -19.576 31.873 -19.185 QT
32.24 -18.794 32.787 -18.623 QT
34.459 -18.279 L
35.272 -18.107 35.944 -17.677 QT
36.615 -17.248 37.006 -16.584 QT
37.397 -15.919 37.397 -15.076 QT
37.397 -13.998 36.795 -12.951 QT
36.194 -11.904 35.319 -11.279 QT
33.772 -10.232 31.537 -10.232 QT
29.99 -10.232 28.701 -10.943 QT
27.412 -11.654 27.412 -13.06 QT
27.412 -13.841 27.873 -14.427 QT
28.334 -15.013 29.131 -15.013 QT
29.6 -15.013 29.912 -14.732 QT
30.225 -14.451 30.225 -13.982 QT
30.225 -13.326 29.733 -12.826 QT
29.24 -12.326 28.569 -12.326 QT
28.428 -12.326 L
cp
f
GR
GS
[0 -0.75 0.75 0 33.5 160.99987] CT
0.149 GC
N
40.303 -3.31 M
40.303 -4.466 L
43.115 -4.466 L
43.115 -31.154 L
40.303 -31.154 L
40.303 -32.31 L
44.272 -32.31 L
44.272 -3.31 L
40.303 -3.31 L
cp
f
GR
GS
[0.75 0 0 0.75 221.25021 25.22857] CT
N
-84.982 -9.303 M
-91.341 -26.241 L
-91.575 -26.803 -92.247 -26.952 QT
-92.919 -27.1 -93.966 -27.1 QT
-93.966 -28.038 L
-86.544 -28.038 L
-86.544 -27.1 L
-88.779 -27.1 -88.779 -26.397 QT
-88.779 -26.35 -88.771 -26.319 QT
-88.763 -26.288 -88.763 -26.241 QT
-83.575 -12.459 L
-78.685 -25.506 L
-78.638 -25.6 -78.638 -25.834 QT
-78.638 -26.491 -79.239 -26.795 QT
-79.841 -27.1 -80.607 -27.1 QT
-80.607 -28.038 L
-74.779 -28.038 L
-74.779 -27.1 L
-75.794 -27.1 -76.56 -26.725 QT
-77.325 -26.35 -77.654 -25.506 QT
-83.763 -9.303 L
-83.841 -9.006 -84.2 -9.006 QT
-84.544 -9.006 L
-84.904 -9.006 -84.982 -9.303 QT
cp
f
GR
GS
[0.75 0 0 0.75 221.25021 25.22857] CT
N
-69.985 -9.303 M
-71.626 -9.303 -73.001 -10.163 QT
-74.376 -11.022 -75.165 -12.467 QT
-75.954 -13.913 -75.954 -15.522 QT
-75.954 -17.1 -75.235 -18.522 QT
-74.516 -19.944 -73.227 -20.827 QT
-71.938 -21.709 -70.36 -21.709 QT
-69.126 -21.709 -68.212 -21.288 QT
-67.298 -20.866 -66.704 -20.131 QT
-66.11 -19.397 -65.805 -18.397 QT
-65.501 -17.397 -65.501 -16.194 QT
-65.501 -15.834 -65.782 -15.834 QT
-73.594 -15.834 L
-73.594 -15.553 L
-73.594 -13.303 -72.688 -11.694 QT
-71.782 -10.084 -69.735 -10.084 QT
-68.907 -10.084 -68.204 -10.452 QT
-67.501 -10.819 -66.977 -11.483 QT
-66.454 -12.147 -66.282 -12.897 QT
-66.251 -12.991 -66.18 -13.061 QT
-66.11 -13.131 -66.016 -13.131 QT
-65.782 -13.131 L
-65.501 -13.131 -65.501 -12.788 QT
-65.876 -11.256 -67.141 -10.28 QT
-68.407 -9.303 -69.985 -9.303 QT
cp
-73.563 -16.506 M
-67.407 -16.506 L
-67.407 -17.522 -67.688 -18.561 QT
-67.969 -19.6 -68.634 -20.295 QT
-69.298 -20.991 -70.36 -20.991 QT
-71.891 -20.991 -72.727 -19.561 QT
-73.563 -18.131 -73.563 -16.506 QT
cp
f
GR
GS
[0.75 0 0 0.75 221.25021 25.22857] CT
N
-64.149 -9.6 M
-64.149 -10.553 L
-63.227 -10.553 -62.633 -10.694 QT
-62.04 -10.834 -62.04 -11.413 QT
-62.04 -18.772 L
-62.04 -19.506 -62.258 -19.827 QT
-62.477 -20.147 -62.883 -20.217 QT
-63.29 -20.288 -64.149 -20.288 QT
-64.149 -21.241 L
-60.29 -21.538 L
-60.29 -18.897 L
-59.852 -20.069 -59.047 -20.803 QT
-58.243 -21.538 -57.102 -21.538 QT
-56.29 -21.538 -55.657 -21.061 QT
-55.024 -20.584 -55.024 -19.803 QT
-55.024 -19.319 -55.375 -18.952 QT
-55.727 -18.584 -56.243 -18.584 QT
-56.743 -18.584 -57.102 -18.944 QT
-57.461 -19.303 -57.461 -19.803 QT
-57.461 -20.522 -56.946 -20.834 QT
-57.102 -20.834 L
-58.196 -20.834 -58.883 -20.045 QT
-59.571 -19.256 -59.868 -18.077 QT
-60.165 -16.897 -60.165 -15.834 QT
-60.165 -11.413 L
-60.165 -10.553 -57.54 -10.553 QT
-57.54 -9.6 L
-64.149 -9.6 L
cp
f
GR
GS
[0.75 0 0 0.75 221.25021 25.22857] CT
N
-51.658 -12.85 M
-51.658 -20.288 L
-53.892 -20.288 L
-53.892 -20.991 L
-52.126 -20.991 -51.298 -22.639 QT
-50.47 -24.288 -50.47 -26.209 QT
-49.689 -26.209 L
-49.689 -21.241 L
-45.876 -21.241 L
-45.876 -20.288 L
-49.689 -20.288 L
-49.689 -12.897 L
-49.689 -11.772 -49.314 -10.928 QT
-48.939 -10.084 -47.954 -10.084 QT
-47.033 -10.084 -46.626 -10.975 QT
-46.22 -11.866 -46.22 -12.897 QT
-46.22 -14.491 L
-45.439 -14.491 L
-45.439 -12.85 L
-45.439 -12.006 -45.751 -11.178 QT
-46.064 -10.35 -46.673 -9.827 QT
-47.283 -9.303 -48.142 -9.303 QT
-49.767 -9.303 -50.712 -10.272 QT
-51.658 -11.241 -51.658 -12.85 QT
cp
f
GR
GS
[0.75 0 0 0.75 221.25021 25.22857] CT
N
-43.209 -9.6 M
-43.209 -10.553 L
-42.287 -10.553 -41.693 -10.694 QT
-41.1 -10.834 -41.1 -11.413 QT
-41.1 -18.772 L
-41.1 -19.819 -41.498 -20.053 QT
-41.897 -20.288 -43.084 -20.288 QT
-43.084 -21.241 L
-39.193 -21.538 L
-39.193 -11.413 L
-39.193 -10.834 -38.686 -10.694 QT
-38.178 -10.553 -37.318 -10.553 QT
-37.318 -9.6 L
-43.209 -9.6 L
cp
-42.053 -26.178 M
-42.053 -26.772 -41.607 -27.217 QT
-41.162 -27.663 -40.584 -27.663 QT
-40.193 -27.663 -39.842 -27.467 QT
-39.49 -27.272 -39.295 -26.913 QT
-39.1 -26.553 -39.1 -26.178 QT
-39.1 -25.584 -39.545 -25.139 QT
-39.99 -24.694 -40.584 -24.694 QT
-41.162 -24.694 -41.607 -25.139 QT
-42.053 -25.584 -42.053 -26.178 QT
cp
f
GR
GS
[0.75 0 0 0.75 221.25021 25.22857] CT
N
-29.911 -9.303 M
-31.536 -9.303 -32.872 -10.147 QT
-34.208 -10.991 -34.973 -12.413 QT
-35.739 -13.834 -35.739 -15.428 QT
-35.739 -17.022 -34.981 -18.483 QT
-34.223 -19.944 -32.88 -20.827 QT
-31.536 -21.709 -29.911 -21.709 QT
-28.317 -21.709 -27.02 -21.084 QT
-25.723 -20.459 -25.723 -19.053 QT
-25.723 -18.522 -26.098 -18.131 QT
-26.473 -17.741 -27.02 -17.741 QT
-27.552 -17.741 -27.934 -18.131 QT
-28.317 -18.522 -28.317 -19.053 QT
-28.317 -19.522 -28.013 -19.874 QT
-27.708 -20.225 -27.255 -20.319 QT
-28.192 -20.913 -29.88 -20.913 QT
-31.177 -20.913 -31.966 -20.053 QT
-32.755 -19.194 -33.067 -17.928 QT
-33.38 -16.663 -33.38 -15.428 QT
-33.38 -14.116 -32.997 -12.897 QT
-32.614 -11.678 -31.747 -10.881 QT
-30.88 -10.084 -29.583 -10.084 QT
-28.302 -10.084 -27.403 -10.874 QT
-26.505 -11.663 -26.177 -12.928 QT
-26.177 -13.084 -25.958 -13.084 QT
-25.63 -13.084 L
-25.552 -13.084 -25.489 -13.006 QT
-25.427 -12.928 -25.427 -12.85 QT
-25.427 -12.772 L
-25.833 -11.163 -27.044 -10.233 QT
-28.255 -9.303 -29.911 -9.303 QT
cp
f
GR
GS
[0.75 0 0 0.75 221.25021 25.22857] CT
N
-23.7 -12.256 M
-23.7 -13.866 -22.434 -14.874 QT
-21.168 -15.881 -19.395 -16.295 QT
-17.622 -16.709 -16.028 -16.709 QT
-16.028 -17.819 L
-16.028 -18.584 -16.372 -19.319 QT
-16.715 -20.053 -17.356 -20.522 QT
-17.997 -20.991 -18.778 -20.991 QT
-20.575 -20.991 -21.512 -20.194 QT
-20.997 -20.194 -20.661 -19.803 QT
-20.325 -19.413 -20.325 -18.897 QT
-20.325 -18.35 -20.708 -17.967 QT
-21.09 -17.584 -21.606 -17.584 QT
-22.153 -17.584 -22.536 -17.967 QT
-22.918 -18.35 -22.918 -18.897 QT
-22.918 -20.319 -21.629 -21.014 QT
-20.34 -21.709 -18.778 -21.709 QT
-17.684 -21.709 -16.575 -21.241 QT
-15.465 -20.772 -14.762 -19.897 QT
-14.059 -19.022 -14.059 -17.866 QT
-14.059 -11.788 L
-14.059 -11.256 -13.833 -10.819 QT
-13.606 -10.381 -13.137 -10.381 QT
-12.684 -10.381 -12.465 -10.827 QT
-12.247 -11.272 -12.247 -11.788 QT
-12.247 -13.522 L
-11.465 -13.522 L
-11.465 -11.788 L
-11.465 -11.178 -11.778 -10.631 QT
-12.09 -10.084 -12.629 -9.764 QT
-13.168 -9.444 -13.778 -9.444 QT
-14.575 -9.444 -15.145 -10.053 QT
-15.715 -10.663 -15.793 -11.506 QT
-16.293 -10.491 -17.262 -9.897 QT
-18.231 -9.303 -19.34 -9.303 QT
-20.372 -9.303 -21.372 -9.6 QT
-22.372 -9.897 -23.036 -10.553 QT
-23.7 -11.209 -23.7 -12.256 QT
cp
-21.512 -12.256 M
-21.512 -11.303 -20.809 -10.655 QT
-20.106 -10.006 -19.168 -10.006 QT
-18.293 -10.006 -17.583 -10.444 QT
-16.872 -10.881 -16.45 -11.631 QT
-16.028 -12.381 -16.028 -13.209 QT
-16.028 -16.022 L
-17.247 -16.022 -18.536 -15.616 QT
-19.825 -15.209 -20.668 -14.358 QT
-21.512 -13.506 -21.512 -12.256 QT
cp
f
GR
GS
[0.75 0 0 0.75 221.25021 25.22857] CT
N
-10.616 -9.6 M
-10.616 -10.553 L
-9.694 -10.553 -9.101 -10.694 QT
-8.507 -10.834 -8.507 -11.413 QT
-8.507 -25.584 L
-8.507 -26.303 -8.726 -26.624 QT
-8.944 -26.944 -9.351 -27.022 QT
-9.757 -27.1 -10.616 -27.1 QT
-10.616 -28.038 L
-6.601 -28.334 L
-6.601 -11.413 L
-6.601 -10.834 -6.007 -10.694 QT
-5.413 -10.553 -4.507 -10.553 QT
-4.507 -9.6 L
-10.616 -9.6 L
cp
f
GR
GS
[0.75 0 0 0.75 221.25021 25.22857] CT
N
11.446 -9.6 M
7.508 -19.522 L
7.258 -20.022 6.735 -20.155 QT
6.211 -20.288 5.367 -20.288 QT
5.367 -21.241 L
11.039 -21.241 L
11.039 -20.288 L
9.524 -20.288 9.524 -19.647 QT
9.524 -19.538 9.539 -19.491 QT
12.571 -11.866 L
15.305 -18.756 L
15.383 -18.959 15.383 -19.178 QT
15.383 -19.694 14.992 -19.991 QT
14.602 -20.288 14.086 -20.288 QT
14.086 -21.241 L
18.571 -21.241 L
18.571 -20.288 L
17.727 -20.288 17.102 -19.905 QT
16.477 -19.522 16.133 -18.772 QT
12.492 -9.6 L
12.399 -9.303 12.071 -9.303 QT
11.867 -9.303 L
11.539 -9.303 11.446 -9.6 QT
cp
f
GR
GS
[0.75 0 0 0.75 221.25021 25.22857] CT
N
24.904 -9.303 M
23.263 -9.303 21.888 -10.163 QT
20.513 -11.022 19.724 -12.467 QT
18.935 -13.913 18.935 -15.522 QT
18.935 -17.1 19.654 -18.522 QT
20.373 -19.944 21.662 -20.827 QT
22.951 -21.709 24.529 -21.709 QT
25.763 -21.709 26.677 -21.288 QT
27.591 -20.866 28.185 -20.131 QT
28.779 -19.397 29.084 -18.397 QT
29.388 -17.397 29.388 -16.194 QT
29.388 -15.834 29.107 -15.834 QT
21.295 -15.834 L
21.295 -15.553 L
21.295 -13.303 22.201 -11.694 QT
23.107 -10.084 25.154 -10.084 QT
25.982 -10.084 26.685 -10.452 QT
27.388 -10.819 27.912 -11.483 QT
28.435 -12.147 28.607 -12.897 QT
28.638 -12.991 28.709 -13.061 QT
28.779 -13.131 28.873 -13.131 QT
29.107 -13.131 L
29.388 -13.131 29.388 -12.788 QT
29.013 -11.256 27.748 -10.28 QT
26.482 -9.303 24.904 -9.303 QT
cp
21.326 -16.506 M
27.482 -16.506 L
27.482 -17.522 27.201 -18.561 QT
26.92 -19.6 26.255 -20.295 QT
25.591 -20.991 24.529 -20.991 QT
22.998 -20.991 22.162 -19.561 QT
21.326 -18.131 21.326 -16.506 QT
cp
f
GR
GS
[0.75 0 0 0.75 221.25021 25.22857] CT
N
30.865 -9.6 M
30.865 -10.553 L
31.787 -10.553 32.381 -10.694 QT
32.975 -10.834 32.975 -11.413 QT
32.975 -25.584 L
32.975 -26.303 32.756 -26.624 QT
32.537 -26.944 32.131 -27.022 QT
31.725 -27.1 30.865 -27.1 QT
30.865 -28.038 L
34.881 -28.334 L
34.881 -11.413 L
34.881 -10.834 35.475 -10.694 QT
36.068 -10.553 36.975 -10.553 QT
36.975 -9.6 L
30.865 -9.6 L
cp
f
GR
GS
[0.75 0 0 0.75 221.25021 25.22857] CT
N
44.194 -9.303 M
42.569 -9.303 41.187 -10.124 QT
39.804 -10.944 38.999 -12.327 QT
38.194 -13.709 38.194 -15.35 QT
38.194 -16.584 38.64 -17.733 QT
39.085 -18.881 39.905 -19.788 QT
40.726 -20.694 41.819 -21.202 QT
42.913 -21.709 44.194 -21.709 QT
45.851 -21.709 47.218 -20.827 QT
48.585 -19.944 49.374 -18.475 QT
50.163 -17.006 50.163 -15.35 QT
50.163 -13.725 49.359 -12.334 QT
48.554 -10.944 47.179 -10.124 QT
45.804 -9.303 44.194 -9.303 QT
cp
44.194 -10.084 M
46.351 -10.084 47.077 -11.655 QT
47.804 -13.225 47.804 -15.647 QT
47.804 -17.006 47.663 -17.897 QT
47.523 -18.788 47.023 -19.522 QT
46.726 -19.959 46.257 -20.295 QT
45.788 -20.631 45.265 -20.811 QT
44.741 -20.991 44.194 -20.991 QT
43.351 -20.991 42.593 -20.608 QT
41.835 -20.225 41.335 -19.522 QT
40.835 -18.756 40.694 -17.834 QT
40.554 -16.913 40.554 -15.647 QT
40.554 -14.131 40.819 -12.928 QT
41.085 -11.725 41.882 -10.905 QT
42.679 -10.084 44.194 -10.084 QT
cp
f
GR
GS
[0.75 0 0 0.75 221.25021 25.22857] CT
N
58.237 -9.303 M
56.612 -9.303 55.276 -10.147 QT
53.94 -10.991 53.175 -12.413 QT
52.409 -13.834 52.409 -15.428 QT
52.409 -17.022 53.167 -18.483 QT
53.925 -19.944 55.269 -20.827 QT
56.612 -21.709 58.237 -21.709 QT
59.831 -21.709 61.128 -21.084 QT
62.425 -20.459 62.425 -19.053 QT
62.425 -18.522 62.05 -18.131 QT
61.675 -17.741 61.128 -17.741 QT
60.597 -17.741 60.214 -18.131 QT
59.831 -18.522 59.831 -19.053 QT
59.831 -19.522 60.136 -19.874 QT
60.44 -20.225 60.894 -20.319 QT
59.956 -20.913 58.269 -20.913 QT
56.972 -20.913 56.183 -20.053 QT
55.394 -19.194 55.081 -17.928 QT
54.769 -16.663 54.769 -15.428 QT
54.769 -14.116 55.151 -12.897 QT
55.534 -11.678 56.401 -10.881 QT
57.269 -10.084 58.565 -10.084 QT
59.847 -10.084 60.745 -10.874 QT
61.644 -11.663 61.972 -12.928 QT
61.972 -13.084 62.19 -13.084 QT
62.519 -13.084 L
62.597 -13.084 62.659 -13.006 QT
62.722 -12.928 62.722 -12.85 QT
62.722 -12.772 L
62.315 -11.163 61.105 -10.233 QT
59.894 -9.303 58.237 -9.303 QT
cp
f
GR
GS
[0.75 0 0 0.75 221.25021 25.22857] CT
N
64.199 -9.6 M
64.199 -10.553 L
65.12 -10.553 65.714 -10.694 QT
66.308 -10.834 66.308 -11.413 QT
66.308 -18.772 L
66.308 -19.819 65.91 -20.053 QT
65.511 -20.288 64.324 -20.288 QT
64.324 -21.241 L
68.214 -21.538 L
68.214 -11.413 L
68.214 -10.834 68.722 -10.694 QT
69.23 -10.553 70.089 -10.553 QT
70.089 -9.6 L
64.199 -9.6 L
cp
65.355 -26.178 M
65.355 -26.772 65.8 -27.217 QT
66.245 -27.663 66.824 -27.663 QT
67.214 -27.663 67.566 -27.467 QT
67.917 -27.272 68.113 -26.913 QT
68.308 -26.553 68.308 -26.178 QT
68.308 -25.584 67.863 -25.139 QT
67.417 -24.694 66.824 -24.694 QT
66.245 -24.694 65.8 -25.139 QT
65.355 -25.584 65.355 -26.178 QT
cp
f
GR
GS
[0.75 0 0 0.75 221.25021 25.22857] CT
N
73.528 -12.85 M
73.528 -20.288 L
71.294 -20.288 L
71.294 -20.991 L
73.059 -20.991 73.887 -22.639 QT
74.715 -24.288 74.715 -26.209 QT
75.497 -26.209 L
75.497 -21.241 L
79.309 -21.241 L
79.309 -20.288 L
75.497 -20.288 L
75.497 -12.897 L
75.497 -11.772 75.872 -10.928 QT
76.247 -10.084 77.231 -10.084 QT
78.153 -10.084 78.559 -10.975 QT
78.965 -11.866 78.965 -12.897 QT
78.965 -14.491 L
79.747 -14.491 L
79.747 -12.85 L
79.747 -12.006 79.434 -11.178 QT
79.122 -10.35 78.512 -9.827 QT
77.903 -9.303 77.044 -9.303 QT
75.419 -9.303 74.473 -10.272 QT
73.528 -11.241 73.528 -12.85 QT
cp
f
GR
GS
[0.75 0 0 0.75 221.25021 25.22857] CT
N
82.267 -5.163 M
82.783 -4.756 83.408 -4.756 QT
85.095 -4.756 86.189 -7.334 QT
87.111 -9.6 L
83.064 -19.522 L
82.814 -20.022 82.298 -20.155 QT
81.783 -20.288 80.923 -20.288 QT
80.923 -21.241 L
86.595 -21.241 L
86.595 -20.288 L
85.095 -20.288 85.095 -19.647 QT
85.095 -19.538 85.126 -19.491 QT
88.126 -12.1 L
90.829 -18.756 L
90.908 -18.959 90.908 -19.209 QT
90.908 -19.538 90.736 -19.78 QT
90.564 -20.022 90.275 -20.155 QT
89.986 -20.288 89.642 -20.288 QT
89.642 -21.241 L
94.126 -21.241 L
94.126 -20.288 L
93.283 -20.288 92.658 -19.905 QT
92.033 -19.522 91.689 -18.772 QT
87.033 -7.334 L
86.658 -6.459 86.165 -5.733 QT
85.673 -5.006 84.962 -4.538 QT
84.251 -4.069 83.408 -4.069 QT
82.408 -4.069 81.665 -4.717 QT
80.923 -5.366 80.923 -6.334 QT
80.923 -6.834 81.267 -7.178 QT
81.611 -7.522 82.111 -7.522 QT
82.454 -7.522 82.72 -7.366 QT
82.986 -7.209 83.142 -6.952 QT
83.298 -6.694 83.298 -6.334 QT
83.298 -5.897 83.009 -5.553 QT
82.72 -5.209 82.267 -5.163 QT
cp
f
GR
GS
[0.75 0 0 0.75 0 0.5] CT
0.2 0.702 0.2 RC
1 LJ
0.667 LW
N
97.263 88.286 M
120.526 72.78 L
143.789 64.363 L
167.053 63.034 L
190.316 68.793 L
213.579 81.64 L
236.842 101.576 L
260.105 128.6 L
283.368 162.712 L
306.632 198.486 L
329.895 230.494 L
353.158 258.736 L
376.421 283.213 L
399.684 303.924 L
422.947 320.869 L
446.211 334.049 L
469.474 343.463 L
492.737 349.112 L
S
GR
GS
[0.75 0 0 0.75 0 0.5] CT
1 GC
N
505 79 M
505 50 L
381 50 L
381 79 L
cp
f
GR
GS
[0.75 0 0 0.75 320.86361 48.875] CT
N
0.672 5.12 M
0.672 4.386 L
2.547 4.386 2.984 3.136 QT
7.391 -9.693 L
7.453 -9.911 7.734 -9.911 QT
8 -9.911 L
8.281 -9.911 8.344 -9.693 QT
12.938 3.714 L
13.141 4.151 13.688 4.268 QT
14.234 4.386 15.047 4.386 QT
15.047 5.12 L
9.203 5.12 L
9.203 4.386 L
10.938 4.386 10.938 3.823 QT
10.938 3.714 L
9.797 0.432 L
4.703 0.432 L
3.766 3.136 L
3.75 3.214 3.75 3.354 QT
3.75 3.886 4.242 4.136 QT
4.734 4.386 5.313 4.386 QT
5.313 5.12 L
0.672 5.12 L
cp
4.953 -0.302 M
9.563 -0.302 L
7.25 -7.005 L
4.953 -0.302 L
cp
f
GR
GS
[0.75 0 0 0.75 320.86361 48.875] CT
N
16.578 6.761 M
16.578 6.011 17.125 5.456 QT
17.672 4.901 18.422 4.651 QT
18 4.339 17.781 3.854 QT
17.563 3.37 17.563 2.839 QT
17.563 1.854 18.188 1.089 QT
17.219 0.151 17.219 -1.068 QT
17.219 -1.724 17.5 -2.302 QT
17.781 -2.88 18.289 -3.302 QT
18.797 -3.724 19.406 -3.943 QT
20.016 -4.161 20.672 -4.161 QT
21.922 -4.161 22.906 -3.427 QT
23.344 -3.896 23.93 -4.146 QT
24.516 -4.396 25.156 -4.396 QT
25.609 -4.396 25.898 -4.075 QT
26.188 -3.755 26.188 -3.302 QT
26.188 -3.036 25.992 -2.841 QT
25.797 -2.646 25.531 -2.646 QT
25.266 -2.646 25.07 -2.841 QT
24.875 -3.036 24.875 -3.302 QT
24.875 -3.693 25.141 -3.849 QT
24.047 -3.849 23.266 -3.099 QT
23.656 -2.708 23.883 -2.161 QT
24.109 -1.614 24.109 -1.068 QT
24.109 -0.177 23.617 0.534 QT
23.125 1.245 22.32 1.636 QT
21.516 2.026 20.672 2.026 QT
19.516 2.026 18.563 1.401 QT
18.266 1.823 18.266 2.323 QT
18.266 2.886 18.633 3.3 QT
19 3.714 19.547 3.714 QT
21.266 3.714 L
22.516 3.714 23.523 3.94 QT
24.531 4.167 25.211 4.846 QT
25.891 5.526 25.891 6.761 QT
25.891 7.682 25.117 8.292 QT
24.344 8.901 23.258 9.175 QT
22.172 9.448 21.25 9.448 QT
20.313 9.448 19.227 9.175 QT
18.141 8.901 17.359 8.292 QT
16.578 7.682 16.578 6.761 QT
cp
17.766 6.761 M
17.766 7.464 18.336 7.94 QT
18.906 8.417 19.719 8.651 QT
20.531 8.886 21.25 8.886 QT
21.953 8.886 22.766 8.651 QT
23.578 8.417 24.148 7.94 QT
24.719 7.464 24.719 6.761 QT
24.719 5.667 23.711 5.339 QT
22.703 5.011 21.266 5.011 QT
19.547 5.011 L
19.063 5.011 18.656 5.245 QT
18.25 5.479 18.008 5.893 QT
17.766 6.307 17.766 6.761 QT
cp
20.672 1.464 M
22.453 1.464 22.453 -1.068 QT
22.453 -2.177 22.07 -2.888 QT
21.688 -3.599 20.672 -3.599 QT
19.641 -3.599 19.258 -2.888 QT
18.875 -2.177 18.875 -1.068 QT
18.875 -0.38 19.023 0.182 QT
19.172 0.745 19.563 1.104 QT
19.953 1.464 20.672 1.464 QT
cp
f
GR
GS
[0.75 0 0 0.75 320.86361 48.875] CT
N
31.901 5.354 M
30.62 5.354 29.55 4.682 QT
28.479 4.011 27.862 2.886 QT
27.245 1.761 27.245 0.511 QT
27.245 -0.708 27.807 -1.818 QT
28.37 -2.927 29.37 -3.607 QT
30.37 -4.286 31.604 -4.286 QT
32.557 -4.286 33.276 -3.966 QT
33.995 -3.646 34.456 -3.075 QT
34.917 -2.505 35.151 -1.724 QT
35.385 -0.943 35.385 -0.005 QT
35.385 0.276 35.167 0.276 QT
29.089 0.276 L
29.089 0.495 L
29.089 2.245 29.792 3.495 QT
30.495 4.745 32.089 4.745 QT
32.729 4.745 33.276 4.456 QT
33.823 4.167 34.229 3.651 QT
34.635 3.136 34.776 2.557 QT
34.792 2.479 34.854 2.425 QT
34.917 2.37 34.979 2.37 QT
35.167 2.37 L
35.385 2.37 35.385 2.636 QT
35.089 3.823 34.104 4.589 QT
33.12 5.354 31.901 5.354 QT
cp
29.104 -0.255 M
33.901 -0.255 L
33.901 -1.036 33.675 -1.849 QT
33.448 -2.661 32.94 -3.2 QT
32.432 -3.739 31.604 -3.739 QT
30.417 -3.739 29.76 -2.63 QT
29.104 -1.521 29.104 -0.255 QT
cp
f
GR
GS
[0.75 0 0 0.75 320.86361 48.875] CT
N
36.773 5.12 M
36.773 4.386 L
37.492 4.386 37.953 4.268 QT
38.414 4.151 38.414 3.714 QT
38.414 -2.021 L
38.414 -2.583 38.242 -2.833 QT
38.07 -3.083 37.758 -3.138 QT
37.445 -3.193 36.773 -3.193 QT
36.773 -3.927 L
39.82 -4.161 L
39.82 -2.114 L
40.242 -3.005 41.07 -3.583 QT
41.898 -4.161 42.867 -4.161 QT
44.32 -4.161 45.054 -3.466 QT
45.789 -2.771 45.789 -1.333 QT
45.789 3.714 L
45.789 4.151 46.25 4.268 QT
46.711 4.386 47.429 4.386 QT
47.429 5.12 L
42.617 5.12 L
42.617 4.386 L
43.336 4.386 43.797 4.268 QT
44.258 4.151 44.258 3.714 QT
44.258 -1.271 L
44.258 -2.286 43.961 -2.95 QT
43.664 -3.614 42.742 -3.614 QT
41.523 -3.614 40.734 -2.638 QT
39.945 -1.661 39.945 -0.427 QT
39.945 3.714 L
39.945 4.151 40.414 4.268 QT
40.883 4.386 41.586 4.386 QT
41.586 5.12 L
36.773 5.12 L
cp
f
GR
GS
[0.75 0 0 0.75 320.86361 48.875] CT
N
49.548 2.604 M
49.548 -3.193 L
47.814 -3.193 L
47.814 -3.739 L
49.189 -3.739 49.829 -5.021 QT
50.47 -6.302 50.47 -7.802 QT
51.079 -7.802 L
51.079 -3.927 L
54.048 -3.927 L
54.048 -3.193 L
51.079 -3.193 L
51.079 2.557 L
51.079 3.432 51.368 4.089 QT
51.657 4.745 52.423 4.745 QT
53.142 4.745 53.462 4.05 QT
53.782 3.354 53.782 2.557 QT
53.782 1.323 L
54.376 1.323 L
54.376 2.604 L
54.376 3.261 54.134 3.901 QT
53.892 4.542 53.423 4.948 QT
52.954 5.354 52.282 5.354 QT
51.017 5.354 50.282 4.604 QT
49.548 3.854 49.548 2.604 QT
cp
f
GR
GS
[0.75 0 0 0.75 320.86361 48.875] CT
N
64.768 5.12 M
64.768 4.386 L
67.393 4.386 67.393 3.714 QT
67.393 -7.302 L
66.299 -6.786 64.643 -6.786 QT
64.643 -7.521 L
67.221 -7.521 68.534 -8.864 QT
68.831 -8.864 L
68.893 -8.864 68.963 -8.81 QT
69.034 -8.755 69.034 -8.677 QT
69.034 3.714 L
69.034 4.386 71.659 4.386 QT
71.659 5.12 L
64.768 5.12 L
cp
f
GR
GS
[0.75 0 0 0.75 0 0.5] CT
0.2 0.702 0.2 RC
1 LJ
0.667 LW
N
384.985 64.5 M
424.83 64.5 L
S
GR
GS
[0.75 0 0 0.75 0 0.5] CT
0.149 GC
10.0 ML
0.667 LW
N
381 79 M
381 50 L
505 50 L
505 79 L
cp
S
GR
%%Trailer
%%Pages: 1
%%EOF
