%!PS-Adobe-3.0 EPSF-3.0
%%Creator: (MATLAB, The Mathworks, Inc. Version 9.12.0.2529717 \(R2022a\) Update 8. Operating System: Linux)
%%Title: plots/Example2_uy.eps
%%CreationDate: 2024-05-27T22:54:30
%%Pages: (atend)
%%BoundingBox:     4     2   392   335
%%LanguageLevel: 3
%%EndComments
%%BeginProlog
%%BeginResource: procset (Apache XML Graphics Std ProcSet) 1.2 0
%%Version: 1.2 0
%%Copyright: (Copyright 2001-2003,2010 The Apache Software Foundation. License terms: http://www.apache.org/licenses/LICENSE-2.0)
/bd{bind def}bind def
/ld{load def}bd
/GR/grestore ld
/GS/gsave ld
/RM/rmoveto ld
/C/curveto ld
/t/show ld
/L/lineto ld
/ML/setmiterlimit ld
/CT/concat ld
/f/fill ld
/N/newpath ld
/S/stroke ld
/CC/setcmykcolor ld
/A/ashow ld
/cp/closepath ld
/RC/setrgbcolor ld
/LJ/setlinejoin ld
/GC/setgray ld
/LW/setlinewidth ld
/M/moveto ld
/re {4 2 roll M
1 index 0 rlineto
0 exch rlineto
neg 0 rlineto
cp } bd
/_ctm matrix def
/_tm matrix def
/BT { _ctm currentmatrix pop matrix _tm copy pop 0 0 moveto } bd
/ET { _ctm setmatrix } bd
/iTm { _ctm setmatrix _tm concat } bd
/Tm { _tm astore pop iTm 0 0 moveto } bd
/ux 0.0 def
/uy 0.0 def
/F {
  /Tp exch def
  /Tf exch def
  Tf findfont Tp scalefont setfont
  /cf Tf def  /cs Tp def
} bd
/ULS {currentpoint /uy exch def /ux exch def} bd
/ULE {
  /Tcx currentpoint pop def
  gsave
  newpath
  cf findfont cs scalefont dup
  /FontMatrix get 0 get /Ts exch def /FontInfo get dup
  /UnderlinePosition get Ts mul /To exch def
  /UnderlineThickness get Ts mul /Tt exch def
  ux uy To add moveto  Tcx uy To add lineto
  Tt setlinewidth stroke
  grestore
} bd
/OLE {
  /Tcx currentpoint pop def
  gsave
  newpath
  cf findfont cs scalefont dup
  /FontMatrix get 0 get /Ts exch def /FontInfo get dup
  /UnderlinePosition get Ts mul /To exch def
  /UnderlineThickness get Ts mul /Tt exch def
  ux uy To add cs add moveto Tcx uy To add cs add lineto
  Tt setlinewidth stroke
  grestore
} bd
/SOE {
  /Tcx currentpoint pop def
  gsave
  newpath
  cf findfont cs scalefont dup
  /FontMatrix get 0 get /Ts exch def /FontInfo get dup
  /UnderlinePosition get Ts mul /To exch def
  /UnderlineThickness get Ts mul /Tt exch def
  ux uy To add cs 10 mul 26 idiv add moveto Tcx uy To add cs 10 mul 26 idiv add lineto
  Tt setlinewidth stroke
  grestore
} bd
/QT {
/Y22 exch store
/X22 exch store
/Y21 exch store
/X21 exch store
currentpoint
/Y21 load 2 mul add 3 div exch
/X21 load 2 mul add 3 div exch
/X21 load 2 mul /X22 load add 3 div
/Y21 load 2 mul /Y22 load add 3 div
/X22 load /Y22 load curveto
} bd
/SSPD {
dup length /d exch dict def
{
/v exch def
/k exch def
currentpagedevice k known {
/cpdv currentpagedevice k get def
v cpdv ne {
/upd false def
/nullv v type /nulltype eq def
/nullcpdv cpdv type /nulltype eq def
nullv nullcpdv or
{
/upd true def
} {
/sametype v type cpdv type eq def
sametype {
v type /arraytype eq {
/vlen v length def
/cpdvlen cpdv length def
vlen cpdvlen eq {
0 1 vlen 1 sub {
/i exch def
/obj v i get def
/cpdobj cpdv i get def
obj cpdobj ne {
/upd true def
exit
} if
} for
} {
/upd true def
} ifelse
} {
v type /dicttype eq {
v {
/dv exch def
/dk exch def
/cpddv cpdv dk get def
dv cpddv ne {
/upd true def
exit
} if
} forall
} {
/upd true def
} ifelse
} ifelse
} if
} ifelse
upd true eq {
d k v put
} if
} if
} if
} forall
d length 0 gt {
d setpagedevice
} if
} bd
/RE { % /NewFontName [NewEncodingArray] /FontName RE -
  findfont dup length dict begin
  {
    1 index /FID ne
    {def} {pop pop} ifelse
  } forall
  /Encoding exch def
  /FontName 1 index def
  currentdict definefont pop
  end
} bind def
%%EndResource
%%BeginResource: procset (Apache XML Graphics EPS ProcSet) 1.0 0
%%Version: 1.0 0
%%Copyright: (Copyright 2002-2003 The Apache Software Foundation. License terms: http://www.apache.org/licenses/LICENSE-2.0)
/BeginEPSF { %def
/b4_Inc_state save def         % Save state for cleanup
/dict_count countdictstack def % Count objects on dict stack
/op_count count 1 sub def      % Count objects on operand stack
userdict begin                 % Push userdict on dict stack
/showpage { } def              % Redefine showpage, { } = null proc
0 setgray 0 setlinecap         % Prepare graphics state
1 setlinewidth 0 setlinejoin
10 setmiterlimit [ ] 0 setdash newpath
/languagelevel where           % If level not equal to 1 then
{pop languagelevel             % set strokeadjust and
1 ne                           % overprint to their defaults.
{false setstrokeadjust false setoverprint
} if
} if
} bd
/EndEPSF { %def
count op_count sub {pop} repeat            % Clean up stacks
countdictstack dict_count sub {end} repeat
b4_Inc_state restore
} bd
%%EndResource
%FOPBeginFontDict
%%IncludeResource: font Courier-Oblique
%%IncludeResource: font Courier-BoldOblique
%%IncludeResource: font Courier-Bold
%%IncludeResource: font ZapfDingbats
%%IncludeResource: font Symbol
%%IncludeResource: font Helvetica
%%IncludeResource: font Helvetica-Oblique
%%IncludeResource: font Helvetica-Bold
%%IncludeResource: font Helvetica-BoldOblique
%%IncludeResource: font Times-Roman
%%IncludeResource: font Times-Italic
%%IncludeResource: font Times-Bold
%%IncludeResource: font Times-BoldItalic
%%IncludeResource: font Courier
%FOPEndFontDict
%%BeginResource: encoding WinAnsiEncoding
/WinAnsiEncoding [
/.notdef /.notdef /.notdef /.notdef /.notdef
/.notdef /.notdef /.notdef /.notdef /.notdef
/.notdef /.notdef /.notdef /.notdef /.notdef
/.notdef /.notdef /.notdef /.notdef /.notdef
/.notdef /.notdef /.notdef /.notdef /.notdef
/.notdef /.notdef /.notdef /.notdef /.notdef
/.notdef /.notdef /space /exclam /quotedbl
/numbersign /dollar /percent /ampersand /quotesingle
/parenleft /parenright /asterisk /plus /comma
/hyphen /period /slash /zero /one
/two /three /four /five /six
/seven /eight /nine /colon /semicolon
/less /equal /greater /question /at
/A /B /C /D /E
/F /G /H /I /J
/K /L /M /N /O
/P /Q /R /S /T
/U /V /W /X /Y
/Z /bracketleft /backslash /bracketright /asciicircum
/underscore /quoteleft /a /b /c
/d /e /f /g /h
/i /j /k /l /m
/n /o /p /q /r
/s /t /u /v /w
/x /y /z /braceleft /bar
/braceright /asciitilde /bullet /Euro /bullet
/quotesinglbase /florin /quotedblbase /ellipsis /dagger
/daggerdbl /circumflex /perthousand /Scaron /guilsinglleft
/OE /bullet /Zcaron /bullet /bullet
/quoteleft /quoteright /quotedblleft /quotedblright /bullet
/endash /emdash /asciitilde /trademark /scaron
/guilsinglright /oe /bullet /zcaron /Ydieresis
/space /exclamdown /cent /sterling /currency
/yen /brokenbar /section /dieresis /copyright
/ordfeminine /guillemotleft /logicalnot /sfthyphen /registered
/macron /degree /plusminus /twosuperior /threesuperior
/acute /mu /paragraph /middot /cedilla
/onesuperior /ordmasculine /guillemotright /onequarter /onehalf
/threequarters /questiondown /Agrave /Aacute /Acircumflex
/Atilde /Adieresis /Aring /AE /Ccedilla
/Egrave /Eacute /Ecircumflex /Edieresis /Igrave
/Iacute /Icircumflex /Idieresis /Eth /Ntilde
/Ograve /Oacute /Ocircumflex /Otilde /Odieresis
/multiply /Oslash /Ugrave /Uacute /Ucircumflex
/Udieresis /Yacute /Thorn /germandbls /agrave
/aacute /acircumflex /atilde /adieresis /aring
/ae /ccedilla /egrave /eacute /ecircumflex
/edieresis /igrave /iacute /icircumflex /idieresis
/eth /ntilde /ograve /oacute /ocircumflex
/otilde /odieresis /divide /oslash /ugrave
/uacute /ucircumflex /udieresis /yacute /thorn
/ydieresis
] def
%%EndResource
%FOPBeginFontReencode
/Courier-Oblique findfont
dup length dict begin
  {1 index /FID ne {def} {pop pop} ifelse} forall
  /Encoding WinAnsiEncoding def
  currentdict
end
/Courier-Oblique exch definefont pop
/Courier-BoldOblique findfont
dup length dict begin
  {1 index /FID ne {def} {pop pop} ifelse} forall
  /Encoding WinAnsiEncoding def
  currentdict
end
/Courier-BoldOblique exch definefont pop
/Courier-Bold findfont
dup length dict begin
  {1 index /FID ne {def} {pop pop} ifelse} forall
  /Encoding WinAnsiEncoding def
  currentdict
end
/Courier-Bold exch definefont pop
/Helvetica findfont
dup length dict begin
  {1 index /FID ne {def} {pop pop} ifelse} forall
  /Encoding WinAnsiEncoding def
  currentdict
end
/Helvetica exch definefont pop
/Helvetica-Oblique findfont
dup length dict begin
  {1 index /FID ne {def} {pop pop} ifelse} forall
  /Encoding WinAnsiEncoding def
  currentdict
end
/Helvetica-Oblique exch definefont pop
/Helvetica-Bold findfont
dup length dict begin
  {1 index /FID ne {def} {pop pop} ifelse} forall
  /Encoding WinAnsiEncoding def
  currentdict
end
/Helvetica-Bold exch definefont pop
/Helvetica-BoldOblique findfont
dup length dict begin
  {1 index /FID ne {def} {pop pop} ifelse} forall
  /Encoding WinAnsiEncoding def
  currentdict
end
/Helvetica-BoldOblique exch definefont pop
/Times-Roman findfont
dup length dict begin
  {1 index /FID ne {def} {pop pop} ifelse} forall
  /Encoding WinAnsiEncoding def
  currentdict
end
/Times-Roman exch definefont pop
/Times-Italic findfont
dup length dict begin
  {1 index /FID ne {def} {pop pop} ifelse} forall
  /Encoding WinAnsiEncoding def
  currentdict
end
/Times-Italic exch definefont pop
/Times-Bold findfont
dup length dict begin
  {1 index /FID ne {def} {pop pop} ifelse} forall
  /Encoding WinAnsiEncoding def
  currentdict
end
/Times-Bold exch definefont pop
/Times-BoldItalic findfont
dup length dict begin
  {1 index /FID ne {def} {pop pop} ifelse} forall
  /Encoding WinAnsiEncoding def
  currentdict
end
/Times-BoldItalic exch definefont pop
/Courier findfont
dup length dict begin
  {1 index /FID ne {def} {pop pop} ifelse} forall
  /Encoding WinAnsiEncoding def
  currentdict
end
/Courier exch definefont pop
%FOPEndFontReencode
%%EndProlog
%%Page: 1 1
%%PageBoundingBox: 0 0 428 338
%%BeginPageSetup
N
    4     2 M
  396     2 L
  396   337 L
    4   337 L
cp
clip
[1 0 0 -1 0 338] CT
%%EndPageSetup
GS
[0.75 0 0 0.75 0 0.5] CT
N
0 0 M
570 0 L
570 450 L
0 450 L
0 0 L
cp
clip
1 GC
N
0 0 570 450 re
f
GR
GS
[0.75 0 0 0.75 0 0.5] CT
1 GC
N
0 0 570 450 re
f
GR
GS
[0.75 0 0 0.75 0 0.5] CT
1 GC
N
74 390 M
516 390 L
516 38 L
74 38 L
cp
f
GR
GS
[0.75 0 0 0.75 0 0.5] CT
0.873 GC
1 LJ
0.667 LW
N
74 390 M
74 38 L
S
GR
GS
[0.75 0 0 0.75 0 0.5] CT
0.873 GC
1 LJ
0.667 LW
N
114.182 390 M
114.182 38 L
S
GR
GS
[0.75 0 0 0.75 0 0.5] CT
0.873 GC
1 LJ
0.667 LW
N
154.364 390 M
154.364 38 L
S
GR
GS
[0.75 0 0 0.75 0 0.5] CT
0.873 GC
1 LJ
0.667 LW
N
194.545 390 M
194.545 38 L
S
GR
GS
[0.75 0 0 0.75 0 0.5] CT
0.873 GC
1 LJ
0.667 LW
N
234.727 390 M
234.727 38 L
S
GR
GS
[0.75 0 0 0.75 0 0.5] CT
0.873 GC
1 LJ
0.667 LW
N
274.909 390 M
274.909 38 L
S
GR
GS
[0.75 0 0 0.75 0 0.5] CT
0.873 GC
1 LJ
0.667 LW
N
315.091 390 M
315.091 38 L
S
GR
GS
[0.75 0 0 0.75 0 0.5] CT
0.873 GC
1 LJ
0.667 LW
N
355.273 390 M
355.273 38 L
S
GR
GS
[0.75 0 0 0.75 0 0.5] CT
0.873 GC
1 LJ
0.667 LW
N
395.455 390 M
395.455 38 L
S
GR
GS
[0.75 0 0 0.75 0 0.5] CT
0.873 GC
1 LJ
0.667 LW
N
435.636 390 M
435.636 38 L
S
GR
GS
[0.75 0 0 0.75 0 0.5] CT
0.873 GC
1 LJ
0.667 LW
N
475.818 390 M
475.818 38 L
S
GR
GS
[0.75 0 0 0.75 0 0.5] CT
0.873 GC
1 LJ
0.667 LW
N
516 390 M
516 38 L
S
GR
GS
[0.75 0 0 0.75 0 0.5] CT
0.873 GC
1 LJ
0.667 LW
N
516 390 M
74 390 L
S
GR
GS
[0.75 0 0 0.75 0 0.5] CT
0.873 GC
1 LJ
0.667 LW
N
516 346 M
74 346 L
S
GR
GS
[0.75 0 0 0.75 0 0.5] CT
0.873 GC
1 LJ
0.667 LW
N
516 302 M
74 302 L
S
GR
GS
[0.75 0 0 0.75 0 0.5] CT
0.873 GC
1 LJ
0.667 LW
N
516 258 M
74 258 L
S
GR
GS
[0.75 0 0 0.75 0 0.5] CT
0.873 GC
1 LJ
0.667 LW
N
516 214 M
74 214 L
S
GR
GS
[0.75 0 0 0.75 0 0.5] CT
0.873 GC
1 LJ
0.667 LW
N
516 170 M
74 170 L
S
GR
GS
[0.75 0 0 0.75 0 0.5] CT
0.873 GC
1 LJ
0.667 LW
N
516 126 M
74 126 L
S
GR
GS
[0.75 0 0 0.75 0 0.5] CT
0.873 GC
1 LJ
0.667 LW
N
516 82 M
74 82 L
S
GR
GS
[0.75 0 0 0.75 0 0.5] CT
0.873 GC
1 LJ
0.667 LW
N
516 38 M
74 38 L
S
GR
GS
[0.75 0 0 0.75 0 0.5] CT
0.149 GC
2 setlinecap
1 LJ
0.667 LW
N
74 390 M
516 390 L
S
GR
GS
[0.75 0 0 0.75 0 0.5] CT
0.149 GC
2 setlinecap
1 LJ
0.667 LW
N
74 390 M
74 385.58 L
S
GR
GS
[0.75 0 0 0.75 0 0.5] CT
0.149 GC
2 setlinecap
1 LJ
0.667 LW
N
114.182 390 M
114.182 385.58 L
S
GR
GS
[0.75 0 0 0.75 0 0.5] CT
0.149 GC
2 setlinecap
1 LJ
0.667 LW
N
154.364 390 M
154.364 385.58 L
S
GR
GS
[0.75 0 0 0.75 0 0.5] CT
0.149 GC
2 setlinecap
1 LJ
0.667 LW
N
194.545 390 M
194.545 385.58 L
S
GR
GS
[0.75 0 0 0.75 0 0.5] CT
0.149 GC
2 setlinecap
1 LJ
0.667 LW
N
234.727 390 M
234.727 385.58 L
S
GR
GS
[0.75 0 0 0.75 0 0.5] CT
0.149 GC
2 setlinecap
1 LJ
0.667 LW
N
274.909 390 M
274.909 385.58 L
S
GR
GS
[0.75 0 0 0.75 0 0.5] CT
0.149 GC
2 setlinecap
1 LJ
0.667 LW
N
315.091 390 M
315.091 385.58 L
S
GR
GS
[0.75 0 0 0.75 0 0.5] CT
0.149 GC
2 setlinecap
1 LJ
0.667 LW
N
355.273 390 M
355.273 385.58 L
S
GR
GS
[0.75 0 0 0.75 0 0.5] CT
0.149 GC
2 setlinecap
1 LJ
0.667 LW
N
395.455 390 M
395.455 385.58 L
S
GR
GS
[0.75 0 0 0.75 0 0.5] CT
0.149 GC
2 setlinecap
1 LJ
0.667 LW
N
435.636 390 M
435.636 385.58 L
S
GR
GS
[0.75 0 0 0.75 0 0.5] CT
0.149 GC
2 setlinecap
1 LJ
0.667 LW
N
475.818 390 M
475.818 385.58 L
S
GR
GS
[0.75 0 0 0.75 0 0.5] CT
0.149 GC
2 setlinecap
1 LJ
0.667 LW
N
516 390 M
516 385.58 L
S
GR
GS
[0.75 0 0 0.75 55.5 297.00001] CT
0.149 GC
/Helvetica 13.333 F
GS
[1 0 0 1 0 0] CT
-4 15 moveto 
1 -1 scale
(0) t 
GR
GR
GS
[0.75 0 0 0.75 85.63636 297.00001] CT
0.149 GC
/Helvetica 13.333 F
GS
[1 0 0 1 0 0] CT
-4 15 moveto 
1 -1 scale
(2) t 
GR
GR
GS
[0.75 0 0 0.75 115.77272 297.00001] CT
0.149 GC
/Helvetica 13.333 F
GS
[1 0 0 1 0 0] CT
-4 15 moveto 
1 -1 scale
(4) t 
GR
GR
GS
[0.75 0 0 0.75 145.90909 297.00001] CT
0.149 GC
/Helvetica 13.333 F
GS
[1 0 0 1 0 0] CT
-4 15 moveto 
1 -1 scale
(6) t 
GR
GR
GS
[0.75 0 0 0.75 176.04546 297.00001] CT
0.149 GC
/Helvetica 13.333 F
GS
[1 0 0 1 0 0] CT
-4 15 moveto 
1 -1 scale
(8) t 
GR
GR
GS
[0.75 0 0 0.75 206.18182 297.00001] CT
0.149 GC
/Helvetica 13.333 F
GS
[1 0 0 1 0 0] CT
-8 15 moveto 
1 -1 scale
(10) t 
GR
GR
GS
[0.75 0 0 0.75 236.31818 297.00001] CT
0.149 GC
/Helvetica 13.333 F
GS
[1 0 0 1 0 0] CT
-8 15 moveto 
1 -1 scale
(12) t 
GR
GR
GS
[0.75 0 0 0.75 266.45455 297.00001] CT
0.149 GC
/Helvetica 13.333 F
GS
[1 0 0 1 0 0] CT
-8 15 moveto 
1 -1 scale
(14) t 
GR
GR
GS
[0.75 0 0 0.75 296.59092 297.00001] CT
0.149 GC
/Helvetica 13.333 F
GS
[1 0 0 1 0 0] CT
-8 15 moveto 
1 -1 scale
(16) t 
GR
GR
GS
[0.75 0 0 0.75 326.72726 297.00001] CT
0.149 GC
/Helvetica 13.333 F
GS
[1 0 0 1 0 0] CT
-8 15 moveto 
1 -1 scale
(18) t 
GR
GR
GS
[0.75 0 0 0.75 356.86363 297.00001] CT
0.149 GC
/Helvetica 13.333 F
GS
[1 0 0 1 0 0] CT
-8 15 moveto 
1 -1 scale
(20) t 
GR
GR
GS
[0.75 0 0 0.75 387 297.00001] CT
0.149 GC
/Helvetica 13.333 F
GS
[1 0 0 1 0 0] CT
-8 15 moveto 
1 -1 scale
(22) t 
GR
GR
GS
[0.75 0 0 0.75 221.25016 311.49999] CT
0.149 GC
N
-43.282 22.296 M
-43.282 21.859 -43.188 21.484 QT
-41.095 13.156 L
-44.142 13.156 L
-44.438 13.156 -44.438 12.781 QT
-44.329 12.14 -44.063 12.14 QT
-40.845 12.14 L
-39.688 7.406 L
-39.563 7.031 -39.227 6.757 QT
-38.892 6.484 -38.47 6.484 QT
-38.095 6.484 -37.845 6.702 QT
-37.595 6.921 -37.595 7.296 QT
-37.595 7.374 -37.602 7.429 QT
-37.61 7.484 -37.626 7.531 QT
-38.798 12.14 L
-35.798 12.14 L
-35.501 12.14 -35.501 12.515 QT
-35.517 12.593 -35.563 12.765 QT
-35.61 12.937 -35.681 13.046 QT
-35.751 13.156 -35.892 13.156 QT
-39.048 13.156 L
-41.126 21.546 L
-41.345 22.359 -41.345 22.952 QT
-41.345 24.202 -40.485 24.202 QT
-39.22 24.202 -38.235 23.007 QT
-37.251 21.812 -36.72 20.374 QT
-36.61 20.202 -36.501 20.202 QT
-36.142 20.202 L
-36.032 20.202 -35.962 20.281 QT
-35.892 20.359 -35.892 20.468 QT
-35.892 20.515 -35.923 20.546 QT
-36.548 22.296 -37.767 23.632 QT
-38.985 24.968 -40.563 24.968 QT
-41.704 24.968 -42.493 24.218 QT
-43.282 23.468 -43.282 22.296 QT
cp
f
GR
GS
[0.75 0 0 0.75 221.25016 311.49999] CT
0.149 GC
N
-32.221 22.562 M
-32.221 22.015 -31.986 21.421 QT
-29.643 15.187 L
-29.268 14.124 -29.268 13.437 QT
-29.268 12.577 -29.893 12.577 QT
-31.049 12.577 -31.791 13.757 QT
-32.533 14.937 -32.893 16.406 QT
-32.94 16.577 -33.127 16.577 QT
-33.471 16.577 L
-33.705 16.577 -33.705 16.312 QT
-33.705 16.234 L
-33.236 14.499 -32.276 13.163 QT
-31.315 11.827 -29.846 11.827 QT
-28.815 11.827 -28.096 12.507 QT
-27.377 13.187 -27.377 14.234 QT
-27.377 14.765 -27.611 15.359 QT
-29.971 21.593 L
-30.361 22.562 -30.361 23.343 QT
-30.361 24.202 -29.705 24.202 QT
-28.565 24.202 -27.807 22.991 QT
-27.049 21.781 -26.736 20.374 QT
-26.69 20.202 -26.518 20.202 QT
-26.158 20.202 L
-26.049 20.202 -25.979 20.281 QT
-25.908 20.359 -25.908 20.468 QT
-25.908 20.484 -25.94 20.546 QT
-26.33 22.187 -27.315 23.577 QT
-28.299 24.968 -29.752 24.968 QT
-30.783 24.968 -31.502 24.265 QT
-32.221 23.562 -32.221 22.562 QT
cp
-28.955 7.062 M
-28.955 6.452 -28.44 5.96 QT
-27.924 5.468 -27.315 5.468 QT
-26.83 5.468 -26.51 5.773 QT
-26.19 6.077 -26.19 6.546 QT
-26.19 7.187 -26.705 7.679 QT
-27.221 8.171 -27.846 8.171 QT
-28.315 8.171 -28.635 7.851 QT
-28.955 7.531 -28.955 7.062 QT
cp
f
GR
GS
[0.75 0 0 0.75 221.25016 311.49999] CT
0.149 GC
N
-22.146 24.14 M
-22.146 23.968 -22.115 23.89 QT
-19.943 15.234 L
-19.74 14.437 -19.74 13.827 QT
-19.74 12.577 -20.584 12.577 QT
-21.49 12.577 -21.928 13.663 QT
-22.365 14.749 -22.787 16.406 QT
-22.787 16.484 -22.865 16.531 QT
-22.943 16.577 -23.021 16.577 QT
-23.365 16.577 L
-23.459 16.577 -23.529 16.476 QT
-23.599 16.374 -23.599 16.281 QT
-23.287 15.031 -22.998 14.148 QT
-22.709 13.265 -22.092 12.546 QT
-21.474 11.827 -20.553 11.827 QT
-19.474 11.827 -18.639 12.515 QT
-17.803 13.202 -17.803 14.265 QT
-16.928 13.124 -15.771 12.476 QT
-14.615 11.827 -13.303 11.827 QT
-11.928 11.827 -10.935 12.531 QT
-9.943 13.234 -9.943 14.515 QT
-9.053 13.249 -7.849 12.538 QT
-6.646 11.827 -5.24 11.827 QT
-3.74 11.827 -2.826 12.64 QT
-1.912 13.452 -1.912 14.952 QT
-1.912 16.14 -2.443 17.827 QT
-2.974 19.515 -3.756 21.593 QT
-4.178 22.593 -4.178 23.343 QT
-4.178 24.202 -3.49 24.202 QT
-2.365 24.202 -1.615 22.984 QT
-0.865 21.765 -0.553 20.374 QT
-0.459 20.202 -0.303 20.202 QT
0.026 20.202 L
0.151 20.202 0.229 20.281 QT
0.307 20.359 0.307 20.468 QT
0.307 20.484 0.276 20.546 QT
-0.131 22.187 -1.115 23.577 QT
-2.099 24.968 -3.568 24.968 QT
-4.584 24.968 -5.303 24.265 QT
-6.021 23.562 -6.021 22.562 QT
-6.021 22.046 -5.787 21.421 QT
-4.974 19.249 -4.428 17.531 QT
-3.881 15.812 -3.881 14.515 QT
-3.881 13.702 -4.201 13.14 QT
-4.521 12.577 -5.287 12.577 QT
-6.881 12.577 -8.037 13.546 QT
-9.193 14.515 -10.053 16.109 QT
-10.099 16.406 -10.131 16.562 QT
-12.006 23.999 L
-12.099 24.406 -12.451 24.687 QT
-12.803 24.968 -13.224 24.968 QT
-13.568 24.968 -13.826 24.741 QT
-14.084 24.515 -14.084 24.14 QT
-14.084 23.968 -14.053 23.89 QT
-12.209 16.499 L
-11.912 15.312 -11.912 14.515 QT
-11.912 13.702 -12.24 13.14 QT
-12.568 12.577 -13.365 12.577 QT
-14.428 12.577 -15.318 13.046 QT
-16.209 13.515 -16.873 14.281 QT
-17.537 15.046 -18.099 16.109 QT
-20.068 23.999 L
-20.162 24.406 -20.506 24.687 QT
-20.849 24.968 -21.287 24.968 QT
-21.631 24.968 -21.889 24.741 QT
-22.146 24.515 -22.146 24.14 QT
cp
f
GR
GS
[0.75 0 0 0.75 221.25016 311.49999] CT
0.149 GC
N
7.202 24.968 M
5.827 24.968 4.781 24.241 QT
3.734 23.515 3.195 22.296 QT
2.656 21.077 2.656 19.718 QT
2.656 17.64 3.695 15.82 QT
4.734 13.999 6.515 12.913 QT
8.296 11.827 10.343 11.827 QT
11.577 11.827 12.507 12.468 QT
13.437 13.109 13.437 14.312 QT
13.437 15.984 12.109 16.796 QT
10.781 17.609 9.109 17.804 QT
7.437 17.999 5.406 17.999 QT
5.327 17.999 L
4.859 19.734 4.859 20.952 QT
4.859 22.249 5.452 23.226 QT
6.046 24.202 7.265 24.202 QT
8.999 24.202 10.585 23.406 QT
12.171 22.609 13.187 21.218 QT
13.265 21.124 13.406 21.124 QT
13.546 21.124 13.695 21.288 QT
13.843 21.452 13.843 21.593 QT
13.843 21.702 13.796 21.765 QT
12.734 23.249 10.937 24.109 QT
9.14 24.968 7.202 24.968 QT
cp
5.499 17.249 M
7.187 17.249 8.617 17.093 QT
10.046 16.937 11.202 16.304 QT
12.359 15.671 12.359 14.343 QT
12.359 13.812 12.062 13.406 QT
11.765 12.999 11.288 12.788 QT
10.812 12.577 10.312 12.577 QT
9.077 12.577 8.093 13.241 QT
7.109 13.906 6.468 14.976 QT
5.827 16.046 5.499 17.249 QT
cp
f
GR
GS
[0.75 0 0 0.75 221.25016 311.49999] CT
0.149 GC
N
18.455 31.89 M
18.455 2.89 L
22.423 2.89 L
22.423 4.046 L
19.626 4.046 L
19.626 30.734 L
22.423 30.734 L
22.423 31.89 L
18.455 31.89 L
cp
f
GR
GS
[0.75 0 0 0.75 221.25016 311.49999] CT
0.149 GC
N
25.697 22.874 M
26.478 24.202 28.837 24.202 QT
29.853 24.202 30.775 23.851 QT
31.697 23.499 32.298 22.812 QT
32.9 22.124 32.9 21.124 QT
32.9 20.374 32.361 19.898 QT
31.822 19.421 31.04 19.249 QT
29.462 18.937 L
28.4 18.671 27.704 17.929 QT
27.009 17.187 27.009 16.14 QT
27.009 14.859 27.704 13.866 QT
28.4 12.874 29.548 12.351 QT
30.697 11.827 31.931 11.827 QT
33.243 11.827 34.29 12.452 QT
35.337 13.077 35.337 14.312 QT
35.337 14.984 34.962 15.491 QT
34.587 15.999 33.915 15.999 QT
33.525 15.999 33.251 15.749 QT
32.978 15.499 32.978 15.124 QT
32.978 14.781 33.173 14.46 QT
33.368 14.14 33.681 13.952 QT
33.993 13.765 34.337 13.765 QT
34.087 13.14 33.384 12.859 QT
32.681 12.577 31.868 12.577 QT
31.134 12.577 30.4 12.874 QT
29.665 13.171 29.22 13.741 QT
28.775 14.312 28.775 15.093 QT
28.775 15.624 29.142 16.015 QT
29.509 16.406 30.056 16.577 QT
31.728 16.921 L
32.54 17.093 33.212 17.523 QT
33.884 17.952 34.275 18.616 QT
34.665 19.281 34.665 20.124 QT
34.665 21.202 34.064 22.249 QT
33.462 23.296 32.587 23.921 QT
31.04 24.968 28.806 24.968 QT
27.259 24.968 25.97 24.257 QT
24.681 23.546 24.681 22.14 QT
24.681 21.359 25.142 20.773 QT
25.603 20.187 26.4 20.187 QT
26.868 20.187 27.181 20.468 QT
27.493 20.749 27.493 21.218 QT
27.493 21.874 27.001 22.374 QT
26.509 22.874 25.837 22.874 QT
25.697 22.874 L
cp
f
GR
GS
[0.75 0 0 0.75 221.25016 311.49999] CT
0.149 GC
N
37.572 31.89 M
37.572 30.734 L
40.384 30.734 L
40.384 4.046 L
37.572 4.046 L
37.572 2.89 L
41.54 2.89 L
41.54 31.89 L
37.572 31.89 L
cp
f
GR
GS
[0.75 0 0 0.75 0 0.5] CT
0.149 GC
2 setlinecap
1 LJ
0.667 LW
N
74 390 M
74 38 L
S
GR
GS
[0.75 0 0 0.75 0 0.5] CT
0.149 GC
2 setlinecap
1 LJ
0.667 LW
N
74 390 M
78.42 390 L
S
GR
GS
[0.75 0 0 0.75 0 0.5] CT
0.149 GC
2 setlinecap
1 LJ
0.667 LW
N
74 346 M
78.42 346 L
S
GR
GS
[0.75 0 0 0.75 0 0.5] CT
0.149 GC
2 setlinecap
1 LJ
0.667 LW
N
74 302 M
78.42 302 L
S
GR
GS
[0.75 0 0 0.75 0 0.5] CT
0.149 GC
2 setlinecap
1 LJ
0.667 LW
N
74 258 M
78.42 258 L
S
GR
GS
[0.75 0 0 0.75 0 0.5] CT
0.149 GC
2 setlinecap
1 LJ
0.667 LW
N
74 214 M
78.42 214 L
S
GR
GS
[0.75 0 0 0.75 0 0.5] CT
0.149 GC
2 setlinecap
1 LJ
0.667 LW
N
74 170 M
78.42 170 L
S
GR
GS
[0.75 0 0 0.75 0 0.5] CT
0.149 GC
2 setlinecap
1 LJ
0.667 LW
N
74 126 M
78.42 126 L
S
GR
GS
[0.75 0 0 0.75 0 0.5] CT
0.149 GC
2 setlinecap
1 LJ
0.667 LW
N
74 82 M
78.42 82 L
S
GR
GS
[0.75 0 0 0.75 0 0.5] CT
0.149 GC
2 setlinecap
1 LJ
0.667 LW
N
74 38 M
78.42 38 L
S
GR
GS
[0.75 0 0 0.75 51.5 293] CT
0.149 GC
/Helvetica 13.333 F
GS
[1 0 0 1 0 0] CT
-24 5.5 moveto 
1 -1 scale
(-0.2) t 
GR
GR
GS
[0.75 0 0 0.75 51.5 260] CT
0.149 GC
/Helvetica 13.333 F
GS
[1 0 0 1 0 0] CT
-24 5.5 moveto 
1 -1 scale
(-0.1) t 
GR
GR
GS
[0.75 0 0 0.75 51.5 227] CT
0.149 GC
/Helvetica 13.333 F
GS
[1 0 0 1 0 0] CT
-8 5.5 moveto 
1 -1 scale
(0) t 
GR
GR
GS
[0.75 0 0 0.75 51.5 194] CT
0.149 GC
/Helvetica 13.333 F
GS
[1 0 0 1 0 0] CT
-19 5.5 moveto 
1 -1 scale
(0.1) t 
GR
GR
GS
[0.75 0 0 0.75 51.5 161] CT
0.149 GC
/Helvetica 13.333 F
GS
[1 0 0 1 0 0] CT
-19 5.5 moveto 
1 -1 scale
(0.2) t 
GR
GR
GS
[0.75 0 0 0.75 51.5 128] CT
0.149 GC
/Helvetica 13.333 F
GS
[1 0 0 1 0 0] CT
-19 5.5 moveto 
1 -1 scale
(0.3) t 
GR
GR
GS
[0.75 0 0 0.75 51.5 95] CT
0.149 GC
/Helvetica 13.333 F
GS
[1 0 0 1 0 0] CT
-19 5.5 moveto 
1 -1 scale
(0.4) t 
GR
GR
GS
[0.75 0 0 0.75 51.5 62] CT
0.149 GC
/Helvetica 13.333 F
GS
[1 0 0 1 0 0] CT
-19 5.5 moveto 
1 -1 scale
(0.5) t 
GR
GR
GS
[0.75 0 0 0.75 51.5 28.99999] CT
0.149 GC
/Helvetica 13.333 F
GS
[1 0 0 1 0 0] CT
-19 5.5 moveto 
1 -1 scale
(0.6) t 
GR
GR
GS
[0 -0.75 0.75 0 30.5 160.99987] CT
0.149 GC
N
-52.554 -13.716 M
-52.554 -14.669 -52.304 -15.669 QT
-52.054 -16.669 -51.593 -17.888 QT
-51.132 -19.107 -50.788 -20.013 QT
-50.413 -21.076 -50.413 -21.763 QT
-50.413 -22.623 -51.038 -22.623 QT
-52.194 -22.623 -52.937 -21.443 QT
-53.679 -20.263 -54.038 -18.794 QT
-54.085 -18.623 -54.273 -18.623 QT
-54.616 -18.623 L
-54.851 -18.623 -54.851 -18.888 QT
-54.851 -18.966 L
-54.382 -20.701 -53.421 -22.037 QT
-52.46 -23.373 -50.991 -23.373 QT
-49.96 -23.373 -49.241 -22.693 QT
-48.523 -22.013 -48.523 -20.966 QT
-48.523 -20.435 -48.757 -19.841 QT
-48.898 -19.482 -49.351 -18.294 QT
-49.804 -17.107 -50.038 -16.326 QT
-50.273 -15.544 -50.429 -14.794 QT
-50.585 -14.044 -50.585 -13.294 QT
-50.585 -12.326 -50.179 -11.662 QT
-49.773 -10.998 -48.851 -10.998 QT
-46.991 -10.998 -45.585 -13.294 QT
-45.569 -13.404 -45.546 -13.513 QT
-45.523 -13.623 -45.507 -13.716 QT
-43.429 -22.123 L
-43.319 -22.513 -42.968 -22.787 QT
-42.616 -23.06 -42.21 -23.06 QT
-41.851 -23.06 -41.593 -22.834 QT
-41.335 -22.607 -41.335 -22.248 QT
-41.335 -22.076 -41.351 -22.013 QT
-43.46 -13.654 L
-43.648 -12.794 -43.648 -12.248 QT
-43.648 -10.998 -42.819 -10.998 QT
-41.882 -10.998 -41.421 -12.154 QT
-40.96 -13.31 -40.632 -14.826 QT
-40.585 -14.998 -40.413 -14.998 QT
-40.054 -14.998 L
-39.944 -14.998 -39.874 -14.896 QT
-39.804 -14.794 -39.804 -14.716 QT
-40.116 -13.466 -40.405 -12.576 QT
-40.694 -11.685 -41.319 -10.959 QT
-41.944 -10.232 -42.866 -10.232 QT
-43.788 -10.232 -44.523 -10.74 QT
-45.257 -11.248 -45.507 -12.107 QT
-46.179 -11.248 -47.054 -10.74 QT
-47.929 -10.232 -48.913 -10.232 QT
-50.569 -10.232 -51.562 -11.146 QT
-52.554 -12.06 -52.554 -13.716 QT
cp
f
GR
GS
[0 -0.75 0.75 0 30.5 160.99987] CT
0.149 GC
N
-37.074 -3.16 M
-36.637 -2.395 -35.543 -2.395 QT
-34.543 -2.395 -33.816 -3.09 QT
-33.09 -3.785 -32.645 -4.777 QT
-32.199 -5.77 -31.949 -6.801 QT
-32.887 -5.926 -33.965 -5.926 QT
-34.793 -5.926 -35.379 -6.215 QT
-35.965 -6.504 -36.293 -7.074 QT
-36.621 -7.645 -36.621 -8.441 QT
-36.621 -9.129 -36.434 -9.855 QT
-36.246 -10.582 -35.91 -11.465 QT
-35.574 -12.348 -35.34 -13.004 QT
-35.059 -13.785 -35.059 -14.27 QT
-35.059 -14.895 -35.512 -14.895 QT
-36.356 -14.895 -36.887 -14.043 QT
-37.418 -13.191 -37.684 -12.129 QT
-37.715 -11.988 -37.856 -11.988 QT
-38.106 -11.988 L
-38.277 -11.988 -38.277 -12.191 QT
-38.277 -12.254 L
-37.934 -13.504 -37.238 -14.473 QT
-36.543 -15.441 -35.481 -15.441 QT
-34.731 -15.441 -34.215 -14.949 QT
-33.699 -14.457 -33.699 -13.691 QT
-33.699 -13.301 -33.871 -12.879 QT
-33.965 -12.613 -34.293 -11.754 QT
-34.621 -10.895 -34.793 -10.332 QT
-34.965 -9.77 -35.074 -9.223 QT
-35.184 -8.676 -35.184 -8.145 QT
-35.184 -7.441 -34.887 -6.957 QT
-34.59 -6.473 -33.949 -6.473 QT
-32.652 -6.473 -31.606 -8.066 QT
-30.027 -14.535 L
-29.949 -14.816 -29.691 -15.012 QT
-29.434 -15.207 -29.137 -15.207 QT
-28.887 -15.207 -28.691 -15.043 QT
-28.496 -14.879 -28.496 -14.613 QT
-28.496 -14.504 -28.527 -14.457 QT
-30.606 -6.098 L
-30.887 -5.02 -31.621 -4.035 QT
-32.356 -3.051 -33.395 -2.449 QT
-34.434 -1.848 -35.574 -1.848 QT
-36.106 -1.848 -36.645 -2.059 QT
-37.184 -2.27 -37.512 -2.691 QT
-37.84 -3.113 -37.84 -3.676 QT
-37.84 -4.254 -37.496 -4.676 QT
-37.152 -5.098 -36.59 -5.098 QT
-36.262 -5.098 -36.027 -4.887 QT
-35.793 -4.676 -35.793 -4.332 QT
-35.793 -3.848 -36.152 -3.488 QT
-36.512 -3.129 -36.996 -3.129 QT
-37.012 -3.145 -37.035 -3.152 QT
-37.059 -3.16 -37.074 -3.16 QT
cp
f
GR
GS
[0 -0.75 0.75 0 30.5 160.99987] CT
0.149 GC
N
-23.148 -3.31 M
-23.148 -32.31 L
-19.179 -32.31 L
-19.179 -31.154 L
-21.976 -31.154 L
-21.976 -4.466 L
-19.179 -4.466 L
-19.179 -3.31 L
-23.148 -3.31 L
cp
f
GR
GS
[0 -0.75 0.75 0 30.5 160.99987] CT
0.149 GC
N
-16.187 -11.06 M
-16.187 -11.232 -16.156 -11.31 QT
-13.984 -19.966 L
-13.781 -20.763 -13.781 -21.373 QT
-13.781 -22.623 -14.624 -22.623 QT
-15.531 -22.623 -15.968 -21.537 QT
-16.406 -20.451 -16.828 -18.794 QT
-16.828 -18.716 -16.906 -18.669 QT
-16.984 -18.623 -17.062 -18.623 QT
-17.406 -18.623 L
-17.499 -18.623 -17.57 -18.724 QT
-17.64 -18.826 -17.64 -18.919 QT
-17.328 -20.169 -17.038 -21.052 QT
-16.749 -21.935 -16.132 -22.654 QT
-15.515 -23.373 -14.593 -23.373 QT
-13.515 -23.373 -12.679 -22.685 QT
-11.843 -21.998 -11.843 -20.935 QT
-10.968 -22.076 -9.812 -22.724 QT
-8.656 -23.373 -7.343 -23.373 QT
-5.968 -23.373 -4.976 -22.669 QT
-3.984 -21.966 -3.984 -20.685 QT
-3.093 -21.951 -1.89 -22.662 QT
-0.687 -23.373 0.719 -23.373 QT
2.219 -23.373 3.133 -22.56 QT
4.047 -21.748 4.047 -20.248 QT
4.047 -19.06 3.516 -17.373 QT
2.985 -15.685 2.204 -13.607 QT
1.782 -12.607 1.782 -11.857 QT
1.782 -10.998 2.469 -10.998 QT
3.594 -10.998 4.344 -12.216 QT
5.094 -13.435 5.407 -14.826 QT
5.501 -14.998 5.657 -14.998 QT
5.985 -14.998 L
6.11 -14.998 6.188 -14.919 QT
6.266 -14.841 6.266 -14.732 QT
6.266 -14.716 6.235 -14.654 QT
5.829 -13.013 4.844 -11.623 QT
3.86 -10.232 2.391 -10.232 QT
1.376 -10.232 0.657 -10.935 QT
-0.062 -11.638 -0.062 -12.638 QT
-0.062 -13.154 0.172 -13.779 QT
0.985 -15.951 1.532 -17.669 QT
2.079 -19.388 2.079 -20.685 QT
2.079 -21.498 1.758 -22.06 QT
1.438 -22.623 0.672 -22.623 QT
-0.921 -22.623 -2.078 -21.654 QT
-3.234 -20.685 -4.093 -19.091 QT
-4.14 -18.794 -4.171 -18.638 QT
-6.046 -11.201 L
-6.14 -10.794 -6.492 -10.513 QT
-6.843 -10.232 -7.265 -10.232 QT
-7.609 -10.232 -7.867 -10.459 QT
-8.124 -10.685 -8.124 -11.06 QT
-8.124 -11.232 -8.093 -11.31 QT
-6.249 -18.701 L
-5.953 -19.888 -5.953 -20.685 QT
-5.953 -21.498 -6.281 -22.06 QT
-6.609 -22.623 -7.406 -22.623 QT
-8.468 -22.623 -9.359 -22.154 QT
-10.249 -21.685 -10.913 -20.919 QT
-11.578 -20.154 -12.14 -19.091 QT
-14.109 -11.201 L
-14.203 -10.794 -14.546 -10.513 QT
-14.89 -10.232 -15.328 -10.232 QT
-15.671 -10.232 -15.929 -10.459 QT
-16.187 -10.685 -16.187 -11.06 QT
cp
f
GR
GS
[0 -0.75 0.75 0 30.5 160.99987] CT
0.149 GC
N
8.959 -3.888 M
8.959 -3.982 8.99 -3.998 QT
19.068 -31.951 L
19.131 -32.123 19.271 -32.216 QT
19.412 -32.31 19.599 -32.31 QT
19.849 -32.31 20.013 -32.154 QT
20.178 -31.998 20.178 -31.732 QT
20.178 -31.623 L
10.099 -3.669 L
9.928 -3.31 9.537 -3.31 QT
9.303 -3.31 9.131 -3.482 QT
8.959 -3.654 8.959 -3.888 QT
cp
f
GR
GS
[0 -0.75 0.75 0 30.5 160.99987] CT
0.149 GC
N
24.516 -12.326 M
25.297 -10.998 27.657 -10.998 QT
28.672 -10.998 29.594 -11.349 QT
30.516 -11.701 31.118 -12.388 QT
31.719 -13.076 31.719 -14.076 QT
31.719 -14.826 31.18 -15.302 QT
30.641 -15.779 29.86 -15.951 QT
28.282 -16.263 L
27.219 -16.529 26.524 -17.271 QT
25.829 -18.013 25.829 -19.06 QT
25.829 -20.341 26.524 -21.334 QT
27.219 -22.326 28.368 -22.849 QT
29.516 -23.373 30.75 -23.373 QT
32.063 -23.373 33.11 -22.748 QT
34.157 -22.123 34.157 -20.888 QT
34.157 -20.216 33.782 -19.709 QT
33.407 -19.201 32.735 -19.201 QT
32.344 -19.201 32.071 -19.451 QT
31.797 -19.701 31.797 -20.076 QT
31.797 -20.419 31.993 -20.74 QT
32.188 -21.06 32.5 -21.248 QT
32.813 -21.435 33.157 -21.435 QT
32.907 -22.06 32.204 -22.341 QT
31.5 -22.623 30.688 -22.623 QT
29.954 -22.623 29.219 -22.326 QT
28.485 -22.029 28.04 -21.459 QT
27.594 -20.888 27.594 -20.107 QT
27.594 -19.576 27.961 -19.185 QT
28.329 -18.794 28.875 -18.623 QT
30.547 -18.279 L
31.36 -18.107 32.032 -17.677 QT
32.704 -17.248 33.094 -16.584 QT
33.485 -15.919 33.485 -15.076 QT
33.485 -13.998 32.883 -12.951 QT
32.282 -11.904 31.407 -11.279 QT
29.86 -10.232 27.625 -10.232 QT
26.079 -10.232 24.79 -10.943 QT
23.5 -11.654 23.5 -13.06 QT
23.5 -13.841 23.961 -14.427 QT
24.422 -15.013 25.219 -15.013 QT
25.688 -15.013 26 -14.732 QT
26.313 -14.451 26.313 -13.982 QT
26.313 -13.326 25.821 -12.826 QT
25.329 -12.326 24.657 -12.326 QT
24.516 -12.326 L
cp
f
GR
GS
[0 -0.75 0.75 0 30.5 160.99987] CT
0.149 GC
N
36.797 -21.205 M
36.797 -21.767 L
36.797 -21.814 36.844 -21.877 QT
40.094 -25.486 L
40.844 -26.299 41.305 -26.838 QT
41.766 -27.377 42.211 -28.088 QT
42.657 -28.799 42.922 -29.525 QT
43.188 -30.252 43.188 -31.08 QT
43.188 -31.939 42.868 -32.728 QT
42.547 -33.517 41.915 -33.986 QT
41.282 -34.455 40.391 -34.455 QT
39.485 -34.455 38.758 -33.908 QT
38.032 -33.361 37.735 -32.486 QT
37.813 -32.502 37.954 -32.502 QT
38.422 -32.502 38.758 -32.189 QT
39.094 -31.877 39.094 -31.361 QT
39.094 -30.892 38.758 -30.557 QT
38.422 -30.221 37.954 -30.221 QT
37.469 -30.221 37.133 -30.564 QT
36.797 -30.908 36.797 -31.361 QT
36.797 -32.158 37.094 -32.846 QT
37.391 -33.533 37.954 -34.072 QT
38.516 -34.611 39.211 -34.9 QT
39.907 -35.189 40.704 -35.189 QT
41.907 -35.189 42.938 -34.682 QT
43.969 -34.174 44.579 -33.244 QT
45.188 -32.314 45.188 -31.08 QT
45.188 -30.174 44.79 -29.353 QT
44.391 -28.533 43.766 -27.861 QT
43.141 -27.189 42.165 -26.338 QT
41.188 -25.486 40.875 -25.189 QT
38.5 -22.908 L
40.516 -22.908 L
42 -22.908 43 -22.932 QT
44 -22.955 44.063 -23.017 QT
44.313 -23.283 44.563 -24.955 QT
45.188 -24.955 L
44.594 -21.205 L
36.797 -21.205 L
cp
f
GR
GS
[0 -0.75 0.75 0 30.5 160.99987] CT
0.149 GC
N
48.124 -3.31 M
48.124 -4.466 L
50.937 -4.466 L
50.937 -31.154 L
48.124 -31.154 L
48.124 -32.31 L
52.093 -32.31 L
52.093 -3.31 L
48.124 -3.31 L
cp
f
GR
GS
[0.75 0 0 0.75 221.25021 25.22856] CT
N
-149.802 -9.6 M
-149.802 -10.553 L
-147.021 -10.553 -147.021 -11.413 QT
-147.021 -26.241 L
-147.021 -27.1 -149.802 -27.1 QT
-149.802 -28.038 L
-141.052 -28.038 L
-141.052 -27.1 L
-144.505 -27.1 -144.505 -26.241 QT
-144.505 -11.413 L
-144.505 -10.819 -144.169 -10.686 QT
-143.833 -10.553 -143.13 -10.553 QT
-141.052 -10.553 L
-139.021 -10.553 -137.927 -11.288 QT
-136.833 -12.022 -136.38 -13.295 QT
-135.927 -14.569 -135.692 -16.678 QT
-134.911 -16.678 L
-135.661 -9.6 L
-149.802 -9.6 L
cp
f
GR
GS
[0.75 0 0 0.75 221.25021 25.22856] CT
N
-132.885 -12.256 M
-132.885 -13.866 -131.619 -14.874 QT
-130.354 -15.881 -128.58 -16.295 QT
-126.807 -16.709 -125.213 -16.709 QT
-125.213 -17.819 L
-125.213 -18.584 -125.557 -19.319 QT
-125.901 -20.053 -126.541 -20.522 QT
-127.182 -20.991 -127.963 -20.991 QT
-129.76 -20.991 -130.698 -20.194 QT
-130.182 -20.194 -129.846 -19.803 QT
-129.51 -19.413 -129.51 -18.897 QT
-129.51 -18.35 -129.893 -17.967 QT
-130.276 -17.584 -130.791 -17.584 QT
-131.338 -17.584 -131.721 -17.967 QT
-132.104 -18.35 -132.104 -18.897 QT
-132.104 -20.319 -130.815 -21.014 QT
-129.526 -21.709 -127.963 -21.709 QT
-126.869 -21.709 -125.76 -21.241 QT
-124.651 -20.772 -123.948 -19.897 QT
-123.244 -19.022 -123.244 -17.866 QT
-123.244 -11.788 L
-123.244 -11.256 -123.018 -10.819 QT
-122.791 -10.381 -122.323 -10.381 QT
-121.869 -10.381 -121.651 -10.827 QT
-121.432 -11.272 -121.432 -11.788 QT
-121.432 -13.522 L
-120.651 -13.522 L
-120.651 -11.788 L
-120.651 -11.178 -120.963 -10.631 QT
-121.276 -10.084 -121.815 -9.764 QT
-122.354 -9.444 -122.963 -9.444 QT
-123.76 -9.444 -124.33 -10.053 QT
-124.901 -10.663 -124.979 -11.506 QT
-125.479 -10.491 -126.448 -9.897 QT
-127.416 -9.303 -128.526 -9.303 QT
-129.557 -9.303 -130.557 -9.6 QT
-131.557 -9.897 -132.221 -10.553 QT
-132.885 -11.209 -132.885 -12.256 QT
cp
-130.698 -12.256 M
-130.698 -11.303 -129.994 -10.655 QT
-129.291 -10.006 -128.354 -10.006 QT
-127.479 -10.006 -126.768 -10.444 QT
-126.057 -10.881 -125.635 -11.631 QT
-125.213 -12.381 -125.213 -13.209 QT
-125.213 -16.022 L
-126.432 -16.022 -127.721 -15.616 QT
-129.01 -15.209 -129.854 -14.358 QT
-130.698 -13.506 -130.698 -12.256 QT
cp
f
GR
GS
[0.75 0 0 0.75 221.25021 25.22856] CT
N
-117.88 -12.85 M
-117.88 -20.288 L
-120.114 -20.288 L
-120.114 -20.991 L
-118.349 -20.991 -117.52 -22.639 QT
-116.692 -24.288 -116.692 -26.209 QT
-115.911 -26.209 L
-115.911 -21.241 L
-112.099 -21.241 L
-112.099 -20.288 L
-115.911 -20.288 L
-115.911 -12.897 L
-115.911 -11.772 -115.536 -10.928 QT
-115.161 -10.084 -114.177 -10.084 QT
-113.255 -10.084 -112.849 -10.975 QT
-112.442 -11.866 -112.442 -12.897 QT
-112.442 -14.491 L
-111.661 -14.491 L
-111.661 -12.85 L
-111.661 -12.006 -111.974 -11.178 QT
-112.286 -10.35 -112.895 -9.827 QT
-113.505 -9.303 -114.364 -9.303 QT
-115.989 -9.303 -116.935 -10.272 QT
-117.88 -11.241 -117.88 -12.85 QT
cp
f
GR
GS
[0.75 0 0 0.75 221.25021 25.22856] CT
N
-103.541 -9.303 M
-105.181 -9.303 -106.556 -10.163 QT
-107.931 -11.022 -108.72 -12.467 QT
-109.509 -13.913 -109.509 -15.522 QT
-109.509 -17.1 -108.791 -18.522 QT
-108.072 -19.944 -106.783 -20.827 QT
-105.494 -21.709 -103.916 -21.709 QT
-102.681 -21.709 -101.767 -21.288 QT
-100.853 -20.866 -100.259 -20.131 QT
-99.666 -19.397 -99.361 -18.397 QT
-99.056 -17.397 -99.056 -16.194 QT
-99.056 -15.834 -99.338 -15.834 QT
-107.15 -15.834 L
-107.15 -15.553 L
-107.15 -13.303 -106.244 -11.694 QT
-105.338 -10.084 -103.291 -10.084 QT
-102.463 -10.084 -101.759 -10.452 QT
-101.056 -10.819 -100.533 -11.483 QT
-100.009 -12.147 -99.838 -12.897 QT
-99.806 -12.991 -99.736 -13.061 QT
-99.666 -13.131 -99.572 -13.131 QT
-99.338 -13.131 L
-99.056 -13.131 -99.056 -12.788 QT
-99.431 -11.256 -100.697 -10.28 QT
-101.963 -9.303 -103.541 -9.303 QT
cp
-107.119 -16.506 M
-100.963 -16.506 L
-100.963 -17.522 -101.244 -18.561 QT
-101.525 -19.6 -102.189 -20.295 QT
-102.853 -20.991 -103.916 -20.991 QT
-105.447 -20.991 -106.283 -19.561 QT
-107.119 -18.131 -107.119 -16.506 QT
cp
f
GR
GS
[0.75 0 0 0.75 221.25021 25.22856] CT
N
-97.704 -9.6 M
-97.704 -10.553 L
-96.783 -10.553 -96.189 -10.694 QT
-95.595 -10.834 -95.595 -11.413 QT
-95.595 -18.772 L
-95.595 -19.506 -95.814 -19.827 QT
-96.033 -20.147 -96.439 -20.217 QT
-96.845 -20.288 -97.704 -20.288 QT
-97.704 -21.241 L
-93.845 -21.538 L
-93.845 -18.897 L
-93.408 -20.069 -92.603 -20.803 QT
-91.798 -21.538 -90.658 -21.538 QT
-89.845 -21.538 -89.212 -21.061 QT
-88.579 -20.584 -88.579 -19.803 QT
-88.579 -19.319 -88.931 -18.952 QT
-89.283 -18.584 -89.798 -18.584 QT
-90.298 -18.584 -90.658 -18.944 QT
-91.017 -19.303 -91.017 -19.803 QT
-91.017 -20.522 -90.501 -20.834 QT
-90.658 -20.834 L
-91.751 -20.834 -92.439 -20.045 QT
-93.126 -19.256 -93.423 -18.077 QT
-93.72 -16.897 -93.72 -15.834 QT
-93.72 -11.413 L
-93.72 -10.553 -91.095 -10.553 QT
-91.095 -9.6 L
-97.704 -9.6 L
cp
f
GR
GS
[0.75 0 0 0.75 221.25021 25.22856] CT
N
-86.885 -12.256 M
-86.885 -13.866 -85.619 -14.874 QT
-84.354 -15.881 -82.58 -16.295 QT
-80.807 -16.709 -79.213 -16.709 QT
-79.213 -17.819 L
-79.213 -18.584 -79.557 -19.319 QT
-79.901 -20.053 -80.541 -20.522 QT
-81.182 -20.991 -81.963 -20.991 QT
-83.76 -20.991 -84.698 -20.194 QT
-84.182 -20.194 -83.846 -19.803 QT
-83.51 -19.413 -83.51 -18.897 QT
-83.51 -18.35 -83.893 -17.967 QT
-84.276 -17.584 -84.791 -17.584 QT
-85.338 -17.584 -85.721 -17.967 QT
-86.104 -18.35 -86.104 -18.897 QT
-86.104 -20.319 -84.815 -21.014 QT
-83.526 -21.709 -81.963 -21.709 QT
-80.869 -21.709 -79.76 -21.241 QT
-78.651 -20.772 -77.948 -19.897 QT
-77.244 -19.022 -77.244 -17.866 QT
-77.244 -11.788 L
-77.244 -11.256 -77.018 -10.819 QT
-76.791 -10.381 -76.323 -10.381 QT
-75.869 -10.381 -75.651 -10.827 QT
-75.432 -11.272 -75.432 -11.788 QT
-75.432 -13.522 L
-74.651 -13.522 L
-74.651 -11.788 L
-74.651 -11.178 -74.963 -10.631 QT
-75.276 -10.084 -75.815 -9.764 QT
-76.354 -9.444 -76.963 -9.444 QT
-77.76 -9.444 -78.33 -10.053 QT
-78.901 -10.663 -78.979 -11.506 QT
-79.479 -10.491 -80.448 -9.897 QT
-81.416 -9.303 -82.526 -9.303 QT
-83.557 -9.303 -84.557 -9.6 QT
-85.557 -9.897 -86.221 -10.553 QT
-86.885 -11.209 -86.885 -12.256 QT
cp
-84.698 -12.256 M
-84.698 -11.303 -83.994 -10.655 QT
-83.291 -10.006 -82.354 -10.006 QT
-81.479 -10.006 -80.768 -10.444 QT
-80.057 -10.881 -79.635 -11.631 QT
-79.213 -12.381 -79.213 -13.209 QT
-79.213 -16.022 L
-80.432 -16.022 -81.721 -15.616 QT
-83.01 -15.209 -83.854 -14.358 QT
-84.698 -13.506 -84.698 -12.256 QT
cp
f
GR
GS
[0.75 0 0 0.75 221.25021 25.22856] CT
N
-73.802 -9.6 M
-73.802 -10.553 L
-72.88 -10.553 -72.286 -10.694 QT
-71.692 -10.834 -71.692 -11.413 QT
-71.692 -25.584 L
-71.692 -26.303 -71.911 -26.624 QT
-72.13 -26.944 -72.536 -27.022 QT
-72.942 -27.1 -73.802 -27.1 QT
-73.802 -28.038 L
-69.786 -28.334 L
-69.786 -11.413 L
-69.786 -10.834 -69.192 -10.694 QT
-68.599 -10.553 -67.692 -10.553 QT
-67.692 -9.6 L
-73.802 -9.6 L
cp
f
GR
GS
[0.75 0 0 0.75 221.25021 25.22856] CT
N
-57.255 -12.256 M
-57.255 -13.866 -55.99 -14.874 QT
-54.724 -15.881 -52.951 -16.295 QT
-51.177 -16.709 -49.583 -16.709 QT
-49.583 -17.819 L
-49.583 -18.584 -49.927 -19.319 QT
-50.271 -20.053 -50.912 -20.522 QT
-51.552 -20.991 -52.333 -20.991 QT
-54.13 -20.991 -55.068 -20.194 QT
-54.552 -20.194 -54.216 -19.803 QT
-53.88 -19.413 -53.88 -18.897 QT
-53.88 -18.35 -54.263 -17.967 QT
-54.646 -17.584 -55.162 -17.584 QT
-55.708 -17.584 -56.091 -17.967 QT
-56.474 -18.35 -56.474 -18.897 QT
-56.474 -20.319 -55.185 -21.014 QT
-53.896 -21.709 -52.333 -21.709 QT
-51.24 -21.709 -50.13 -21.241 QT
-49.021 -20.772 -48.318 -19.897 QT
-47.615 -19.022 -47.615 -17.866 QT
-47.615 -11.788 L
-47.615 -11.256 -47.388 -10.819 QT
-47.162 -10.381 -46.693 -10.381 QT
-46.24 -10.381 -46.021 -10.827 QT
-45.802 -11.272 -45.802 -11.788 QT
-45.802 -13.522 L
-45.021 -13.522 L
-45.021 -11.788 L
-45.021 -11.178 -45.333 -10.631 QT
-45.646 -10.084 -46.185 -9.764 QT
-46.724 -9.444 -47.333 -9.444 QT
-48.13 -9.444 -48.701 -10.053 QT
-49.271 -10.663 -49.349 -11.506 QT
-49.849 -10.491 -50.818 -9.897 QT
-51.787 -9.303 -52.896 -9.303 QT
-53.927 -9.303 -54.927 -9.6 QT
-55.927 -9.897 -56.591 -10.553 QT
-57.255 -11.209 -57.255 -12.256 QT
cp
-55.068 -12.256 M
-55.068 -11.303 -54.365 -10.655 QT
-53.662 -10.006 -52.724 -10.006 QT
-51.849 -10.006 -51.138 -10.444 QT
-50.427 -10.881 -50.005 -11.631 QT
-49.583 -12.381 -49.583 -13.209 QT
-49.583 -16.022 L
-50.802 -16.022 -52.091 -15.616 QT
-53.38 -15.209 -54.224 -14.358 QT
-55.068 -13.506 -55.068 -12.256 QT
cp
f
GR
GS
[0.75 0 0 0.75 221.25021 25.22856] CT
N
-38.281 -9.303 M
-39.906 -9.303 -41.242 -10.147 QT
-42.578 -10.991 -43.344 -12.413 QT
-44.109 -13.834 -44.109 -15.428 QT
-44.109 -17.022 -43.352 -18.483 QT
-42.594 -19.944 -41.25 -20.827 QT
-39.906 -21.709 -38.281 -21.709 QT
-36.688 -21.709 -35.391 -21.084 QT
-34.094 -20.459 -34.094 -19.053 QT
-34.094 -18.522 -34.469 -18.131 QT
-34.844 -17.741 -35.391 -17.741 QT
-35.922 -17.741 -36.305 -18.131 QT
-36.688 -18.522 -36.688 -19.053 QT
-36.688 -19.522 -36.383 -19.874 QT
-36.078 -20.225 -35.625 -20.319 QT
-36.563 -20.913 -38.25 -20.913 QT
-39.547 -20.913 -40.336 -20.053 QT
-41.125 -19.194 -41.438 -17.928 QT
-41.75 -16.663 -41.75 -15.428 QT
-41.75 -14.116 -41.367 -12.897 QT
-40.984 -11.678 -40.117 -10.881 QT
-39.25 -10.084 -37.953 -10.084 QT
-36.672 -10.084 -35.774 -10.874 QT
-34.875 -11.663 -34.547 -12.928 QT
-34.547 -13.084 -34.328 -13.084 QT
-34 -13.084 L
-33.922 -13.084 -33.859 -13.006 QT
-33.797 -12.928 -33.797 -12.85 QT
-33.797 -12.772 L
-34.203 -11.163 -35.414 -10.233 QT
-36.625 -9.303 -38.281 -9.303 QT
cp
f
GR
GS
[0.75 0 0 0.75 221.25021 25.22856] CT
N
-26.429 -9.303 M
-28.054 -9.303 -29.39 -10.147 QT
-30.726 -10.991 -31.492 -12.413 QT
-32.258 -13.834 -32.258 -15.428 QT
-32.258 -17.022 -31.5 -18.483 QT
-30.742 -19.944 -29.398 -20.827 QT
-28.054 -21.709 -26.429 -21.709 QT
-24.836 -21.709 -23.539 -21.084 QT
-22.242 -20.459 -22.242 -19.053 QT
-22.242 -18.522 -22.617 -18.131 QT
-22.992 -17.741 -23.539 -17.741 QT
-24.07 -17.741 -24.453 -18.131 QT
-24.836 -18.522 -24.836 -19.053 QT
-24.836 -19.522 -24.531 -19.874 QT
-24.226 -20.225 -23.773 -20.319 QT
-24.711 -20.913 -26.398 -20.913 QT
-27.695 -20.913 -28.484 -20.053 QT
-29.273 -19.194 -29.586 -17.928 QT
-29.898 -16.663 -29.898 -15.428 QT
-29.898 -14.116 -29.515 -12.897 QT
-29.133 -11.678 -28.265 -10.881 QT
-27.398 -10.084 -26.101 -10.084 QT
-24.82 -10.084 -23.922 -10.874 QT
-23.023 -11.663 -22.695 -12.928 QT
-22.695 -13.084 -22.476 -13.084 QT
-22.148 -13.084 L
-22.07 -13.084 -22.008 -13.006 QT
-21.945 -12.928 -21.945 -12.85 QT
-21.945 -12.772 L
-22.351 -11.163 -23.562 -10.233 QT
-24.773 -9.303 -26.429 -9.303 QT
cp
f
GR
GS
[0.75 0 0 0.75 221.25021 25.22856] CT
N
-14.578 -9.303 M
-16.218 -9.303 -17.593 -10.163 QT
-18.968 -11.022 -19.757 -12.467 QT
-20.546 -13.913 -20.546 -15.522 QT
-20.546 -17.1 -19.828 -18.522 QT
-19.109 -19.944 -17.82 -20.827 QT
-16.531 -21.709 -14.953 -21.709 QT
-13.718 -21.709 -12.804 -21.288 QT
-11.89 -20.866 -11.296 -20.131 QT
-10.703 -19.397 -10.398 -18.397 QT
-10.093 -17.397 -10.093 -16.194 QT
-10.093 -15.834 -10.375 -15.834 QT
-18.187 -15.834 L
-18.187 -15.553 L
-18.187 -13.303 -17.281 -11.694 QT
-16.375 -10.084 -14.328 -10.084 QT
-13.5 -10.084 -12.796 -10.452 QT
-12.093 -10.819 -11.57 -11.483 QT
-11.046 -12.147 -10.875 -12.897 QT
-10.843 -12.991 -10.773 -13.061 QT
-10.703 -13.131 -10.609 -13.131 QT
-10.375 -13.131 L
-10.093 -13.131 -10.093 -12.788 QT
-10.468 -11.256 -11.734 -10.28 QT
-13 -9.303 -14.578 -9.303 QT
cp
-18.156 -16.506 M
-12 -16.506 L
-12 -17.522 -12.281 -18.561 QT
-12.562 -19.6 -13.226 -20.295 QT
-13.89 -20.991 -14.953 -20.991 QT
-16.484 -20.991 -17.32 -19.561 QT
-18.156 -18.131 -18.156 -16.506 QT
cp
f
GR
GS
[0.75 0 0 0.75 221.25021 25.22856] CT
N
-8.616 -9.6 M
-8.616 -10.553 L
-7.695 -10.553 -7.101 -10.694 QT
-6.507 -10.834 -6.507 -11.413 QT
-6.507 -25.584 L
-6.507 -26.303 -6.726 -26.624 QT
-6.945 -26.944 -7.351 -27.022 QT
-7.757 -27.1 -8.616 -27.1 QT
-8.616 -28.038 L
-4.601 -28.334 L
-4.601 -11.413 L
-4.601 -10.834 -4.007 -10.694 QT
-3.413 -10.553 -2.507 -10.553 QT
-2.507 -9.6 L
-8.616 -9.6 L
cp
f
GR
GS
[0.75 0 0 0.75 221.25021 25.22856] CT
N
4.682 -9.303 M
3.041 -9.303 1.666 -10.163 QT
0.291 -11.022 -0.498 -12.467 QT
-1.287 -13.913 -1.287 -15.522 QT
-1.287 -17.1 -0.568 -18.522 QT
0.15 -19.944 1.439 -20.827 QT
2.729 -21.709 4.307 -21.709 QT
5.541 -21.709 6.455 -21.288 QT
7.369 -20.866 7.963 -20.131 QT
8.557 -19.397 8.861 -18.397 QT
9.166 -17.397 9.166 -16.194 QT
9.166 -15.834 8.885 -15.834 QT
1.072 -15.834 L
1.072 -15.553 L
1.072 -13.303 1.979 -11.694 QT
2.885 -10.084 4.932 -10.084 QT
5.76 -10.084 6.463 -10.452 QT
7.166 -10.819 7.689 -11.483 QT
8.213 -12.147 8.385 -12.897 QT
8.416 -12.991 8.486 -13.061 QT
8.557 -13.131 8.65 -13.131 QT
8.885 -13.131 L
9.166 -13.131 9.166 -12.788 QT
8.791 -11.256 7.525 -10.28 QT
6.26 -9.303 4.682 -9.303 QT
cp
1.104 -16.506 M
7.26 -16.506 L
7.26 -17.522 6.979 -18.561 QT
6.697 -19.6 6.033 -20.295 QT
5.369 -20.991 4.307 -20.991 QT
2.775 -20.991 1.939 -19.561 QT
1.104 -18.131 1.104 -16.506 QT
cp
f
GR
GS
[0.75 0 0 0.75 221.25021 25.22856] CT
N
10.518 -9.6 M
10.518 -10.553 L
11.44 -10.553 12.033 -10.694 QT
12.627 -10.834 12.627 -11.413 QT
12.627 -18.772 L
12.627 -19.506 12.408 -19.827 QT
12.19 -20.147 11.783 -20.217 QT
11.377 -20.288 10.518 -20.288 QT
10.518 -21.241 L
14.377 -21.538 L
14.377 -18.897 L
14.815 -20.069 15.619 -20.803 QT
16.424 -21.538 17.565 -21.538 QT
18.377 -21.538 19.01 -21.061 QT
19.643 -20.584 19.643 -19.803 QT
19.643 -19.319 19.291 -18.952 QT
18.94 -18.584 18.424 -18.584 QT
17.924 -18.584 17.565 -18.944 QT
17.205 -19.303 17.205 -19.803 QT
17.205 -20.522 17.721 -20.834 QT
17.565 -20.834 L
16.471 -20.834 15.783 -20.045 QT
15.096 -19.256 14.799 -18.077 QT
14.502 -16.897 14.502 -15.834 QT
14.502 -11.413 L
14.502 -10.553 17.127 -10.553 QT
17.127 -9.6 L
10.518 -9.6 L
cp
f
GR
GS
[0.75 0 0 0.75 221.25021 25.22856] CT
N
21.337 -12.256 M
21.337 -13.866 22.603 -14.874 QT
23.869 -15.881 25.642 -16.295 QT
27.415 -16.709 29.009 -16.709 QT
29.009 -17.819 L
29.009 -18.584 28.665 -19.319 QT
28.322 -20.053 27.681 -20.522 QT
27.04 -20.991 26.259 -20.991 QT
24.462 -20.991 23.525 -20.194 QT
24.04 -20.194 24.376 -19.803 QT
24.712 -19.413 24.712 -18.897 QT
24.712 -18.35 24.33 -17.967 QT
23.947 -17.584 23.431 -17.584 QT
22.884 -17.584 22.501 -17.967 QT
22.119 -18.35 22.119 -18.897 QT
22.119 -20.319 23.408 -21.014 QT
24.697 -21.709 26.259 -21.709 QT
27.353 -21.709 28.462 -21.241 QT
29.572 -20.772 30.275 -19.897 QT
30.978 -19.022 30.978 -17.866 QT
30.978 -11.788 L
30.978 -11.256 31.205 -10.819 QT
31.431 -10.381 31.9 -10.381 QT
32.353 -10.381 32.572 -10.827 QT
32.79 -11.272 32.79 -11.788 QT
32.79 -13.522 L
33.572 -13.522 L
33.572 -11.788 L
33.572 -11.178 33.259 -10.631 QT
32.947 -10.084 32.408 -9.764 QT
31.869 -9.444 31.259 -9.444 QT
30.462 -9.444 29.892 -10.053 QT
29.322 -10.663 29.244 -11.506 QT
28.744 -10.491 27.775 -9.897 QT
26.806 -9.303 25.697 -9.303 QT
24.665 -9.303 23.665 -9.6 QT
22.665 -9.897 22.001 -10.553 QT
21.337 -11.209 21.337 -12.256 QT
cp
23.525 -12.256 M
23.525 -11.303 24.228 -10.655 QT
24.931 -10.006 25.869 -10.006 QT
26.744 -10.006 27.455 -10.444 QT
28.165 -10.881 28.587 -11.631 QT
29.009 -12.381 29.009 -13.209 QT
29.009 -16.022 L
27.79 -16.022 26.501 -15.616 QT
25.212 -15.209 24.369 -14.358 QT
23.525 -13.506 23.525 -12.256 QT
cp
f
GR
GS
[0.75 0 0 0.75 221.25021 25.22856] CT
N
36.343 -12.85 M
36.343 -20.288 L
34.108 -20.288 L
34.108 -20.991 L
35.874 -20.991 36.702 -22.639 QT
37.53 -24.288 37.53 -26.209 QT
38.311 -26.209 L
38.311 -21.241 L
42.124 -21.241 L
42.124 -20.288 L
38.311 -20.288 L
38.311 -12.897 L
38.311 -11.772 38.686 -10.928 QT
39.061 -10.084 40.046 -10.084 QT
40.968 -10.084 41.374 -10.975 QT
41.78 -11.866 41.78 -12.897 QT
41.78 -14.491 L
42.561 -14.491 L
42.561 -12.85 L
42.561 -12.006 42.249 -11.178 QT
41.936 -10.35 41.327 -9.827 QT
40.718 -9.303 39.858 -9.303 QT
38.233 -9.303 37.288 -10.272 QT
36.343 -11.241 36.343 -12.85 QT
cp
f
GR
GS
[0.75 0 0 0.75 221.25021 25.22856] CT
N
44.791 -9.6 M
44.791 -10.553 L
45.713 -10.553 46.307 -10.694 QT
46.9 -10.834 46.9 -11.413 QT
46.9 -18.772 L
46.9 -19.819 46.502 -20.053 QT
46.104 -20.288 44.916 -20.288 QT
44.916 -21.241 L
48.807 -21.538 L
48.807 -11.413 L
48.807 -10.834 49.315 -10.694 QT
49.822 -10.553 50.682 -10.553 QT
50.682 -9.6 L
44.791 -9.6 L
cp
45.947 -26.178 M
45.947 -26.772 46.393 -27.217 QT
46.838 -27.663 47.416 -27.663 QT
47.807 -27.663 48.158 -27.467 QT
48.51 -27.272 48.705 -26.913 QT
48.9 -26.553 48.9 -26.178 QT
48.9 -25.584 48.455 -25.139 QT
48.01 -24.694 47.416 -24.694 QT
46.838 -24.694 46.393 -25.139 QT
45.947 -25.584 45.947 -26.178 QT
cp
f
GR
GS
[0.75 0 0 0.75 221.25021 25.22856] CT
N
58.12 -9.303 M
56.495 -9.303 55.113 -10.124 QT
53.73 -10.944 52.925 -12.327 QT
52.12 -13.709 52.12 -15.35 QT
52.12 -16.584 52.566 -17.733 QT
53.011 -18.881 53.831 -19.788 QT
54.652 -20.694 55.745 -21.202 QT
56.839 -21.709 58.12 -21.709 QT
59.777 -21.709 61.144 -20.827 QT
62.511 -19.944 63.3 -18.475 QT
64.089 -17.006 64.089 -15.35 QT
64.089 -13.725 63.284 -12.334 QT
62.48 -10.944 61.105 -10.124 QT
59.73 -9.303 58.12 -9.303 QT
cp
58.12 -10.084 M
60.277 -10.084 61.003 -11.655 QT
61.73 -13.225 61.73 -15.647 QT
61.73 -17.006 61.589 -17.897 QT
61.449 -18.788 60.949 -19.522 QT
60.652 -19.959 60.183 -20.295 QT
59.714 -20.631 59.191 -20.811 QT
58.667 -20.991 58.12 -20.991 QT
57.277 -20.991 56.519 -20.608 QT
55.761 -20.225 55.261 -19.522 QT
54.761 -18.756 54.62 -17.834 QT
54.48 -16.913 54.48 -15.647 QT
54.48 -14.131 54.745 -12.928 QT
55.011 -11.725 55.808 -10.905 QT
56.605 -10.084 58.12 -10.084 QT
cp
f
GR
GS
[0.75 0 0 0.75 221.25021 25.22856] CT
N
65.501 -9.6 M
65.501 -10.553 L
66.438 -10.553 67.024 -10.694 QT
67.61 -10.834 67.61 -11.413 QT
67.61 -18.772 L
67.61 -19.506 67.399 -19.827 QT
67.188 -20.147 66.774 -20.217 QT
66.36 -20.288 65.501 -20.288 QT
65.501 -21.241 L
69.423 -21.538 L
69.423 -18.897 L
69.969 -20.053 71.032 -20.795 QT
72.094 -21.538 73.344 -21.538 QT
75.204 -21.538 76.149 -20.639 QT
77.094 -19.741 77.094 -17.897 QT
77.094 -11.413 L
77.094 -10.834 77.688 -10.694 QT
78.282 -10.553 79.204 -10.553 QT
79.204 -9.6 L
73.016 -9.6 L
73.016 -10.553 L
73.938 -10.553 74.532 -10.694 QT
75.126 -10.834 75.126 -11.413 QT
75.126 -17.819 L
75.126 -19.131 74.743 -19.983 QT
74.36 -20.834 73.188 -20.834 QT
71.61 -20.834 70.602 -19.584 QT
69.594 -18.334 69.594 -16.725 QT
69.594 -11.413 L
69.594 -10.834 70.188 -10.694 QT
70.782 -10.553 71.688 -10.553 QT
71.688 -9.6 L
65.501 -9.6 L
cp
f
GR
GS
[0.75 0 0 0.75 221.25021 25.22856] CT
N
89.236 -9.6 M
89.236 -10.553 L
90.158 -10.553 90.751 -10.694 QT
91.345 -10.834 91.345 -11.413 QT
91.345 -18.772 L
91.345 -19.819 90.947 -20.053 QT
90.548 -20.288 89.361 -20.288 QT
89.361 -21.241 L
93.251 -21.538 L
93.251 -11.413 L
93.251 -10.834 93.759 -10.694 QT
94.267 -10.553 95.126 -10.553 QT
95.126 -9.6 L
89.236 -9.6 L
cp
90.392 -26.178 M
90.392 -26.772 90.837 -27.217 QT
91.283 -27.663 91.861 -27.663 QT
92.251 -27.663 92.603 -27.467 QT
92.954 -27.272 93.15 -26.913 QT
93.345 -26.553 93.345 -26.178 QT
93.345 -25.584 92.9 -25.139 QT
92.454 -24.694 91.861 -24.694 QT
91.283 -24.694 90.837 -25.139 QT
90.392 -25.584 90.392 -26.178 QT
cp
f
GR
GS
[0.75 0 0 0.75 221.25021 25.22856] CT
N
96.612 -9.6 M
96.612 -10.553 L
97.549 -10.553 98.135 -10.694 QT
98.721 -10.834 98.721 -11.413 QT
98.721 -18.772 L
98.721 -19.506 98.51 -19.827 QT
98.299 -20.147 97.885 -20.217 QT
97.471 -20.288 96.612 -20.288 QT
96.612 -21.241 L
100.534 -21.538 L
100.534 -18.897 L
101.081 -20.053 102.143 -20.795 QT
103.206 -21.538 104.456 -21.538 QT
106.315 -21.538 107.26 -20.639 QT
108.206 -19.741 108.206 -17.897 QT
108.206 -11.413 L
108.206 -10.834 108.799 -10.694 QT
109.393 -10.553 110.315 -10.553 QT
110.315 -9.6 L
104.127 -9.6 L
104.127 -10.553 L
105.049 -10.553 105.643 -10.694 QT
106.237 -10.834 106.237 -11.413 QT
106.237 -17.819 L
106.237 -19.131 105.854 -19.983 QT
105.471 -20.834 104.299 -20.834 QT
102.721 -20.834 101.713 -19.584 QT
100.706 -18.334 100.706 -16.725 QT
100.706 -11.413 L
100.706 -10.834 101.299 -10.694 QT
101.893 -10.553 102.799 -10.553 QT
102.799 -9.6 L
96.612 -9.6 L
cp
f
GR
GS
[0.75 0 0 0.75 221.25021 25.22856] CT
N
111.333 -4.366 M
111.333 -5.303 L
112.255 -5.303 112.849 -5.459 QT
113.442 -5.616 113.442 -6.178 QT
113.442 -19.178 L
113.442 -19.928 112.911 -20.108 QT
112.38 -20.288 111.333 -20.288 QT
111.333 -21.241 L
115.317 -21.538 L
115.317 -19.85 L
116.067 -20.678 117.044 -21.108 QT
118.02 -21.538 119.13 -21.538 QT
120.724 -21.538 122.005 -20.67 QT
123.286 -19.803 124.005 -18.397 QT
124.724 -16.991 124.724 -15.428 QT
124.724 -13.788 123.927 -12.381 QT
123.13 -10.975 121.755 -10.139 QT
120.38 -9.303 118.724 -9.303 QT
116.755 -9.303 115.395 -10.897 QT
115.395 -6.178 L
115.395 -5.616 115.997 -5.459 QT
116.599 -5.303 117.505 -5.303 QT
117.505 -4.366 L
111.333 -4.366 L
cp
115.395 -12.225 M
115.88 -11.256 116.724 -10.631 QT
117.567 -10.006 118.567 -10.006 QT
119.505 -10.006 120.224 -10.506 QT
120.942 -11.006 121.427 -11.85 QT
121.911 -12.694 122.145 -13.624 QT
122.38 -14.553 122.38 -15.428 QT
122.38 -16.506 121.989 -17.764 QT
121.599 -19.022 120.802 -19.889 QT
120.005 -20.756 118.864 -20.756 QT
117.77 -20.756 116.856 -20.194 QT
115.942 -19.631 115.395 -18.678 QT
115.395 -12.225 L
cp
f
GR
GS
[0.75 0 0 0.75 221.25021 25.22856] CT
N
128.351 -12.819 M
128.351 -18.772 L
128.351 -19.506 128.14 -19.827 QT
127.929 -20.147 127.515 -20.217 QT
127.101 -20.288 126.242 -20.288 QT
126.242 -21.241 L
130.335 -21.538 L
130.335 -12.819 L
130.335 -11.756 130.484 -11.17 QT
130.632 -10.584 131.132 -10.295 QT
131.632 -10.006 132.71 -10.006 QT
134.163 -10.006 135.015 -11.217 QT
135.867 -12.428 135.867 -13.975 QT
135.867 -18.772 L
135.867 -19.506 135.648 -19.827 QT
135.429 -20.147 135.023 -20.217 QT
134.617 -20.288 133.757 -20.288 QT
133.757 -21.241 L
137.835 -21.538 L
137.835 -12.053 L
137.835 -11.334 138.054 -11.014 QT
138.273 -10.694 138.679 -10.624 QT
139.085 -10.553 139.945 -10.553 QT
139.945 -9.6 L
135.945 -9.303 L
135.945 -11.584 L
135.445 -10.569 134.554 -9.936 QT
133.663 -9.303 132.57 -9.303 QT
130.632 -9.303 129.492 -10.124 QT
128.351 -10.944 128.351 -12.819 QT
cp
f
GR
GS
[0.75 0 0 0.75 221.25021 25.22856] CT
N
143.01 -12.85 M
143.01 -20.288 L
140.775 -20.288 L
140.775 -20.991 L
142.541 -20.991 143.369 -22.639 QT
144.197 -24.288 144.197 -26.209 QT
144.978 -26.209 L
144.978 -21.241 L
148.791 -21.241 L
148.791 -20.288 L
144.978 -20.288 L
144.978 -12.897 L
144.978 -11.772 145.353 -10.928 QT
145.728 -10.084 146.713 -10.084 QT
147.635 -10.084 148.041 -10.975 QT
148.447 -11.866 148.447 -12.897 QT
148.447 -14.491 L
149.228 -14.491 L
149.228 -12.85 L
149.228 -12.006 148.916 -11.178 QT
148.603 -10.35 147.994 -9.827 QT
147.385 -9.303 146.525 -9.303 QT
144.9 -9.303 143.955 -10.272 QT
143.01 -11.241 143.01 -12.85 QT
cp
f
GR
GS
[0.75 0 0 0.75 0 0.5] CT
0.2 0.702 0.2 RC
1 LJ
0.667 LW
N
94.091 98.811 M
114.182 108.722 L
134.273 118.634 L
154.364 128.546 L
174.455 138.457 L
194.545 148.369 L
214.636 158.281 L
234.727 168.192 L
254.818 178.104 L
274.909 188.016 L
295 197.927 L
315.091 207.839 L
335.182 217.751 L
355.273 227.662 L
375.364 237.574 L
395.455 247.486 L
415.545 257.397 L
435.636 267.309 L
455.727 277.221 L
475.818 287.132 L
495.909 297.044 L
S
GR
GS
[0.75 0 0 0.75 0 0.5] CT
1 LJ
0.667 LW
N
94.091 302 M
114.182 302 L
134.273 302 L
154.364 302 L
174.455 302 L
194.545 302 L
214.636 302 L
234.727 302 L
254.818 302 L
274.909 302 L
295 302 L
315.091 302 L
335.182 302 L
355.273 302 L
375.364 302 L
395.455 302 L
415.545 302 L
435.636 302 L
455.727 302 L
475.818 302 L
495.909 302 L
S
GR
GS
[0.75 0 0 0.75 0 0.5] CT
0 0 1 RC
1 LJ
0.667 LW
N
94.091 388.246 M
114.182 384.039 L
134.273 379.832 L
154.364 375.625 L
174.455 371.417 L
194.545 367.21 L
214.636 363.003 L
234.727 358.796 L
254.818 354.589 L
274.909 350.382 L
295 346.175 L
315.091 341.968 L
335.182 337.76 L
355.273 333.553 L
375.364 329.346 L
395.455 325.139 L
415.545 320.932 L
435.636 316.725 L
455.727 312.518 L
475.818 308.311 L
495.909 304.104 L
S
GR
GS
[0.75 0 0 0.75 0 0.5] CT
0.6 0.2 0.2 RC
1 LJ
0.667 LW
N
94.091 69.575 M
114.182 80.913 L
134.273 92.25 L
154.364 103.588 L
174.455 114.926 L
194.545 126.264 L
214.636 137.602 L
234.727 148.939 L
254.818 160.277 L
274.909 171.615 L
295 182.953 L
315.091 194.291 L
335.182 205.629 L
355.273 216.966 L
375.364 228.304 L
395.455 239.642 L
415.545 250.98 L
435.636 262.318 L
455.727 273.655 L
475.818 284.993 L
495.909 296.331 L
S
GR
GS
[0.75 0 0 0.75 0 0.5] CT
1 GC
N
505 158 M
505 50 L
381 50 L
381 158 L
cp
f
GR
GS
[0.75 0 0 0.75 320.86361 49.11029] CT
N
0.672 5.12 M
0.672 4.386 L
2.547 4.386 2.984 3.136 QT
7.391 -9.693 L
7.453 -9.911 7.734 -9.911 QT
8 -9.911 L
8.281 -9.911 8.344 -9.693 QT
12.938 3.714 L
13.141 4.151 13.688 4.268 QT
14.234 4.386 15.047 4.386 QT
15.047 5.12 L
9.203 5.12 L
9.203 4.386 L
10.938 4.386 10.938 3.823 QT
10.938 3.714 L
9.797 0.432 L
4.703 0.432 L
3.766 3.136 L
3.75 3.214 3.75 3.354 QT
3.75 3.886 4.242 4.136 QT
4.734 4.386 5.313 4.386 QT
5.313 5.12 L
0.672 5.12 L
cp
4.953 -0.302 M
9.563 -0.302 L
7.25 -7.005 L
4.953 -0.302 L
cp
f
GR
GS
[0.75 0 0 0.75 320.86361 49.11029] CT
N
16.578 6.761 M
16.578 6.011 17.125 5.456 QT
17.672 4.901 18.422 4.651 QT
18 4.339 17.781 3.854 QT
17.563 3.37 17.563 2.839 QT
17.563 1.854 18.188 1.089 QT
17.219 0.151 17.219 -1.068 QT
17.219 -1.724 17.5 -2.302 QT
17.781 -2.88 18.289 -3.302 QT
18.797 -3.724 19.406 -3.943 QT
20.016 -4.161 20.672 -4.161 QT
21.922 -4.161 22.906 -3.427 QT
23.344 -3.896 23.93 -4.146 QT
24.516 -4.396 25.156 -4.396 QT
25.609 -4.396 25.898 -4.075 QT
26.188 -3.755 26.188 -3.302 QT
26.188 -3.036 25.992 -2.841 QT
25.797 -2.646 25.531 -2.646 QT
25.266 -2.646 25.07 -2.841 QT
24.875 -3.036 24.875 -3.302 QT
24.875 -3.693 25.141 -3.849 QT
24.047 -3.849 23.266 -3.099 QT
23.656 -2.708 23.883 -2.161 QT
24.109 -1.614 24.109 -1.068 QT
24.109 -0.177 23.617 0.534 QT
23.125 1.245 22.32 1.636 QT
21.516 2.026 20.672 2.026 QT
19.516 2.026 18.563 1.401 QT
18.266 1.823 18.266 2.323 QT
18.266 2.886 18.633 3.3 QT
19 3.714 19.547 3.714 QT
21.266 3.714 L
22.516 3.714 23.523 3.94 QT
24.531 4.167 25.211 4.846 QT
25.891 5.526 25.891 6.761 QT
25.891 7.682 25.117 8.292 QT
24.344 8.901 23.258 9.175 QT
22.172 9.448 21.25 9.448 QT
20.313 9.448 19.227 9.175 QT
18.141 8.901 17.359 8.292 QT
16.578 7.682 16.578 6.761 QT
cp
17.766 6.761 M
17.766 7.464 18.336 7.94 QT
18.906 8.417 19.719 8.651 QT
20.531 8.886 21.25 8.886 QT
21.953 8.886 22.766 8.651 QT
23.578 8.417 24.148 7.94 QT
24.719 7.464 24.719 6.761 QT
24.719 5.667 23.711 5.339 QT
22.703 5.011 21.266 5.011 QT
19.547 5.011 L
19.063 5.011 18.656 5.245 QT
18.25 5.479 18.008 5.893 QT
17.766 6.307 17.766 6.761 QT
cp
20.672 1.464 M
22.453 1.464 22.453 -1.068 QT
22.453 -2.177 22.07 -2.888 QT
21.688 -3.599 20.672 -3.599 QT
19.641 -3.599 19.258 -2.888 QT
18.875 -2.177 18.875 -1.068 QT
18.875 -0.38 19.023 0.182 QT
19.172 0.745 19.563 1.104 QT
19.953 1.464 20.672 1.464 QT
cp
f
GR
GS
[0.75 0 0 0.75 320.86361 49.11029] CT
N
31.901 5.354 M
30.62 5.354 29.55 4.682 QT
28.479 4.011 27.862 2.886 QT
27.245 1.761 27.245 0.511 QT
27.245 -0.708 27.807 -1.818 QT
28.37 -2.927 29.37 -3.607 QT
30.37 -4.286 31.604 -4.286 QT
32.557 -4.286 33.276 -3.966 QT
33.995 -3.646 34.456 -3.075 QT
34.917 -2.505 35.151 -1.724 QT
35.385 -0.943 35.385 -0.005 QT
35.385 0.276 35.167 0.276 QT
29.089 0.276 L
29.089 0.495 L
29.089 2.245 29.792 3.495 QT
30.495 4.745 32.089 4.745 QT
32.729 4.745 33.276 4.456 QT
33.823 4.167 34.229 3.651 QT
34.635 3.136 34.776 2.557 QT
34.792 2.479 34.854 2.425 QT
34.917 2.37 34.979 2.37 QT
35.167 2.37 L
35.385 2.37 35.385 2.636 QT
35.089 3.823 34.104 4.589 QT
33.12 5.354 31.901 5.354 QT
cp
29.104 -0.255 M
33.901 -0.255 L
33.901 -1.036 33.675 -1.849 QT
33.448 -2.661 32.94 -3.2 QT
32.432 -3.739 31.604 -3.739 QT
30.417 -3.739 29.76 -2.63 QT
29.104 -1.521 29.104 -0.255 QT
cp
f
GR
GS
[0.75 0 0 0.75 320.86361 49.11029] CT
N
36.773 5.12 M
36.773 4.386 L
37.492 4.386 37.953 4.268 QT
38.414 4.151 38.414 3.714 QT
38.414 -2.021 L
38.414 -2.583 38.242 -2.833 QT
38.07 -3.083 37.758 -3.138 QT
37.445 -3.193 36.773 -3.193 QT
36.773 -3.927 L
39.82 -4.161 L
39.82 -2.114 L
40.242 -3.005 41.07 -3.583 QT
41.898 -4.161 42.867 -4.161 QT
44.32 -4.161 45.054 -3.466 QT
45.789 -2.771 45.789 -1.333 QT
45.789 3.714 L
45.789 4.151 46.25 4.268 QT
46.711 4.386 47.429 4.386 QT
47.429 5.12 L
42.617 5.12 L
42.617 4.386 L
43.336 4.386 43.797 4.268 QT
44.258 4.151 44.258 3.714 QT
44.258 -1.271 L
44.258 -2.286 43.961 -2.95 QT
43.664 -3.614 42.742 -3.614 QT
41.523 -3.614 40.734 -2.638 QT
39.945 -1.661 39.945 -0.427 QT
39.945 3.714 L
39.945 4.151 40.414 4.268 QT
40.883 4.386 41.586 4.386 QT
41.586 5.12 L
36.773 5.12 L
cp
f
GR
GS
[0.75 0 0 0.75 320.86361 49.11029] CT
N
49.548 2.604 M
49.548 -3.193 L
47.814 -3.193 L
47.814 -3.739 L
49.189 -3.739 49.829 -5.021 QT
50.47 -6.302 50.47 -7.802 QT
51.079 -7.802 L
51.079 -3.927 L
54.048 -3.927 L
54.048 -3.193 L
51.079 -3.193 L
51.079 2.557 L
51.079 3.432 51.368 4.089 QT
51.657 4.745 52.423 4.745 QT
53.142 4.745 53.462 4.05 QT
53.782 3.354 53.782 2.557 QT
53.782 1.323 L
54.376 1.323 L
54.376 2.604 L
54.376 3.261 54.134 3.901 QT
53.892 4.542 53.423 4.948 QT
52.954 5.354 52.282 5.354 QT
51.017 5.354 50.282 4.604 QT
49.548 3.854 49.548 2.604 QT
cp
f
GR
GS
[0.75 0 0 0.75 320.86361 49.11029] CT
N
64.768 5.12 M
64.768 4.386 L
67.393 4.386 67.393 3.714 QT
67.393 -7.302 L
66.299 -6.786 64.643 -6.786 QT
64.643 -7.521 L
67.221 -7.521 68.534 -8.864 QT
68.831 -8.864 L
68.893 -8.864 68.963 -8.81 QT
69.034 -8.755 69.034 -8.677 QT
69.034 3.714 L
69.034 4.386 71.659 4.386 QT
71.659 5.12 L
64.768 5.12 L
cp
f
GR
GS
[0.75 0 0 0.75 0 0.5] CT
0.2 0.702 0.2 RC
1 LJ
0.667 LW
N
384.985 64.814 M
424.83 64.814 L
S
GR
GS
[0.75 0 0 0.75 320.86361 68.70343] CT
N
/f-597267615{0.672 5.12 M
0.672 4.386 L
2.547 4.386 2.984 3.136 QT
7.391 -9.693 L
7.453 -9.911 7.734 -9.911 QT
8 -9.911 L
8.281 -9.911 8.344 -9.693 QT
12.938 3.714 L
13.141 4.151 13.688 4.268 QT
14.234 4.386 15.047 4.386 QT
15.047 5.12 L
9.203 5.12 L
9.203 4.386 L
10.938 4.386 10.938 3.823 QT
10.938 3.714 L
9.797 0.432 L
4.703 0.432 L
3.766 3.136 L
3.75 3.214 3.75 3.354 QT
3.75 3.886 4.242 4.136 QT
4.734 4.386 5.313 4.386 QT
5.313 5.12 L
0.672 5.12 L
cp
4.953 -0.302 M
9.563 -0.302 L
7.25 -7.005 L
4.953 -0.302 L
cp}def
f-597267615
f
GR
GS
[0.75 0 0 0.75 320.86361 68.70343] CT
N
/f-745240314{16.578 6.761 M
16.578 6.011 17.125 5.456 QT
17.672 4.901 18.422 4.651 QT
18 4.339 17.781 3.854 QT
17.563 3.37 17.563 2.839 QT
17.563 1.854 18.188 1.089 QT
17.219 0.151 17.219 -1.068 QT
17.219 -1.724 17.5 -2.302 QT
17.781 -2.88 18.289 -3.302 QT
18.797 -3.724 19.406 -3.943 QT
20.016 -4.161 20.672 -4.161 QT
21.922 -4.161 22.906 -3.427 QT
23.344 -3.896 23.93 -4.146 QT
24.516 -4.396 25.156 -4.396 QT
25.609 -4.396 25.898 -4.075 QT
26.188 -3.755 26.188 -3.302 QT
26.188 -3.036 25.992 -2.841 QT
25.797 -2.646 25.531 -2.646 QT
25.266 -2.646 25.07 -2.841 QT
24.875 -3.036 24.875 -3.302 QT
24.875 -3.693 25.141 -3.849 QT
24.047 -3.849 23.266 -3.099 QT
23.656 -2.708 23.883 -2.161 QT
24.109 -1.614 24.109 -1.068 QT
24.109 -0.177 23.617 0.534 QT
23.125 1.245 22.32 1.636 QT
21.516 2.026 20.672 2.026 QT
19.516 2.026 18.563 1.401 QT
18.266 1.823 18.266 2.323 QT
18.266 2.886 18.633 3.3 QT
19 3.714 19.547 3.714 QT
21.266 3.714 L
22.516 3.714 23.523 3.94 QT
24.531 4.167 25.211 4.846 QT
25.891 5.526 25.891 6.761 QT
25.891 7.682 25.117 8.292 QT
24.344 8.901 23.258 9.175 QT
22.172 9.448 21.25 9.448 QT
20.313 9.448 19.227 9.175 QT
18.141 8.901 17.359 8.292 QT
16.578 7.682 16.578 6.761 QT
cp
17.766 6.761 M
17.766 7.464 18.336 7.94 QT
18.906 8.417 19.719 8.651 QT
20.531 8.886 21.25 8.886 QT
21.953 8.886 22.766 8.651 QT
23.578 8.417 24.148 7.94 QT
24.719 7.464 24.719 6.761 QT
24.719 5.667 23.711 5.339 QT
22.703 5.011 21.266 5.011 QT
19.547 5.011 L
19.063 5.011 18.656 5.245 QT
18.25 5.479 18.008 5.893 QT
17.766 6.307 17.766 6.761 QT
cp
20.672 1.464 M
22.453 1.464 22.453 -1.068 QT
22.453 -2.177 22.07 -2.888 QT
21.688 -3.599 20.672 -3.599 QT
19.641 -3.599 19.258 -2.888 QT
18.875 -2.177 18.875 -1.068 QT
18.875 -0.38 19.023 0.182 QT
19.172 0.745 19.563 1.104 QT
19.953 1.464 20.672 1.464 QT
cp}def
f-745240314
f
GR
GS
[0.75 0 0 0.75 320.86361 68.70343] CT
N
/f1964844890{31.901 5.354 M
30.62 5.354 29.55 4.682 QT
28.479 4.011 27.862 2.886 QT
27.245 1.761 27.245 0.511 QT
27.245 -0.708 27.807 -1.818 QT
28.37 -2.927 29.37 -3.607 QT
30.37 -4.286 31.604 -4.286 QT
32.557 -4.286 33.276 -3.966 QT
33.995 -3.646 34.456 -3.075 QT
34.917 -2.505 35.151 -1.724 QT
35.385 -0.943 35.385 -0.005 QT
35.385 0.276 35.167 0.276 QT
29.089 0.276 L
29.089 0.495 L
29.089 2.245 29.792 3.495 QT
30.495 4.745 32.089 4.745 QT
32.729 4.745 33.276 4.456 QT
33.823 4.167 34.229 3.651 QT
34.635 3.136 34.776 2.557 QT
34.792 2.479 34.854 2.425 QT
34.917 2.37 34.979 2.37 QT
35.167 2.37 L
35.385 2.37 35.385 2.636 QT
35.089 3.823 34.104 4.589 QT
33.12 5.354 31.901 5.354 QT
cp
29.104 -0.255 M
33.901 -0.255 L
33.901 -1.036 33.675 -1.849 QT
33.448 -2.661 32.94 -3.2 QT
32.432 -3.739 31.604 -3.739 QT
30.417 -3.739 29.76 -2.63 QT
29.104 -1.521 29.104 -0.255 QT
cp}def
f1964844890
f
GR
GS
[0.75 0 0 0.75 320.86361 68.70343] CT
N
/f1881606250{36.773 5.12 M
36.773 4.386 L
37.492 4.386 37.953 4.268 QT
38.414 4.151 38.414 3.714 QT
38.414 -2.021 L
38.414 -2.583 38.242 -2.833 QT
38.07 -3.083 37.758 -3.138 QT
37.445 -3.193 36.773 -3.193 QT
36.773 -3.927 L
39.82 -4.161 L
39.82 -2.114 L
40.242 -3.005 41.07 -3.583 QT
41.898 -4.161 42.867 -4.161 QT
44.32 -4.161 45.054 -3.466 QT
45.789 -2.771 45.789 -1.333 QT
45.789 3.714 L
45.789 4.151 46.25 4.268 QT
46.711 4.386 47.429 4.386 QT
47.429 5.12 L
42.617 5.12 L
42.617 4.386 L
43.336 4.386 43.797 4.268 QT
44.258 4.151 44.258 3.714 QT
44.258 -1.271 L
44.258 -2.286 43.961 -2.95 QT
43.664 -3.614 42.742 -3.614 QT
41.523 -3.614 40.734 -2.638 QT
39.945 -1.661 39.945 -0.427 QT
39.945 3.714 L
39.945 4.151 40.414 4.268 QT
40.883 4.386 41.586 4.386 QT
41.586 5.12 L
36.773 5.12 L
cp}def
f1881606250
f
GR
GS
[0.75 0 0 0.75 320.86361 68.70343] CT
N
/f-1218143468{49.548 2.604 M
49.548 -3.193 L
47.814 -3.193 L
47.814 -3.739 L
49.189 -3.739 49.829 -5.021 QT
50.47 -6.302 50.47 -7.802 QT
51.079 -7.802 L
51.079 -3.927 L
54.048 -3.927 L
54.048 -3.193 L
51.079 -3.193 L
51.079 2.557 L
51.079 3.432 51.368 4.089 QT
51.657 4.745 52.423 4.745 QT
53.142 4.745 53.462 4.05 QT
53.782 3.354 53.782 2.557 QT
53.782 1.323 L
54.376 1.323 L
54.376 2.604 L
54.376 3.261 54.134 3.901 QT
53.892 4.542 53.423 4.948 QT
52.954 5.354 52.282 5.354 QT
51.017 5.354 50.282 4.604 QT
49.548 3.854 49.548 2.604 QT
cp}def
f-1218143468
f
GR
GS
[0.75 0 0 0.75 320.86361 68.70343] CT
N
/f-1429999007{63.862 5.12 M
63.862 4.557 L
63.862 4.511 63.909 4.448 QT
67.159 0.839 L
67.909 0.026 68.37 -0.513 QT
68.831 -1.052 69.276 -1.763 QT
69.721 -2.474 69.987 -3.2 QT
70.252 -3.927 70.252 -4.755 QT
70.252 -5.614 69.932 -6.404 QT
69.612 -7.193 68.979 -7.661 QT
68.346 -8.13 67.456 -8.13 QT
66.549 -8.13 65.823 -7.583 QT
65.096 -7.036 64.799 -6.161 QT
64.877 -6.177 65.018 -6.177 QT
65.487 -6.177 65.823 -5.864 QT
66.159 -5.552 66.159 -5.036 QT
66.159 -4.568 65.823 -4.232 QT
65.487 -3.896 65.018 -3.896 QT
64.534 -3.896 64.198 -4.239 QT
63.862 -4.583 63.862 -5.036 QT
63.862 -5.833 64.159 -6.521 QT
64.456 -7.208 65.018 -7.747 QT
65.581 -8.286 66.276 -8.575 QT
66.971 -8.864 67.768 -8.864 QT
68.971 -8.864 70.002 -8.357 QT
71.034 -7.849 71.643 -6.919 QT
72.252 -5.989 72.252 -4.755 QT
72.252 -3.849 71.854 -3.029 QT
71.456 -2.208 70.831 -1.536 QT
70.206 -0.864 69.229 -0.013 QT
68.252 0.839 67.94 1.136 QT
65.565 3.417 L
67.581 3.417 L
69.065 3.417 70.065 3.393 QT
71.065 3.37 71.127 3.307 QT
71.377 3.042 71.627 1.37 QT
72.252 1.37 L
71.659 5.12 L
63.862 5.12 L
cp}def
f-1429999007
f
GR
GS
[0.75 0 0 0.75 0 0.5] CT
1 LJ
0.667 LW
N
384.985 90.938 M
424.83 90.938 L
S
GR
GS
[0.75 0 0 0.75 320.86361 88.29657] CT
N
f-597267615
f
GR
GS
[0.75 0 0 0.75 320.86361 88.29657] CT
N
f-745240314
f
GR
GS
[0.75 0 0 0.75 320.86361 88.29657] CT
N
f1964844890
f
GR
GS
[0.75 0 0 0.75 320.86361 88.29657] CT
N
f1881606250
f
GR
GS
[0.75 0 0 0.75 320.86361 88.29657] CT
N
f-1218143468
f
GR
GS
[0.75 0 0 0.75 320.86361 88.29657] CT
N
/f300774680{64.815 3.495 M
65.299 4.214 66.135 4.565 QT
66.971 4.917 67.924 4.917 QT
69.143 4.917 69.659 3.878 QT
70.174 2.839 70.174 1.511 QT
70.174 0.917 70.065 0.323 QT
69.956 -0.271 69.698 -0.786 QT
69.44 -1.302 68.995 -1.607 QT
68.549 -1.911 67.909 -1.911 QT
66.502 -1.911 L
66.315 -1.911 66.315 -2.114 QT
66.315 -2.286 L
66.315 -2.458 66.502 -2.458 QT
67.659 -2.552 L
68.409 -2.552 68.893 -3.107 QT
69.377 -3.661 69.604 -4.45 QT
69.831 -5.239 69.831 -5.958 QT
69.831 -6.974 69.362 -7.614 QT
68.893 -8.255 67.924 -8.255 QT
67.127 -8.255 66.393 -7.958 QT
65.659 -7.661 65.237 -7.036 QT
65.284 -7.052 65.307 -7.06 QT
65.331 -7.068 65.377 -7.068 QT
65.846 -7.068 66.166 -6.739 QT
66.487 -6.411 66.487 -5.943 QT
66.487 -5.489 66.166 -5.161 QT
65.846 -4.833 65.377 -4.833 QT
64.924 -4.833 64.596 -5.161 QT
64.268 -5.489 64.268 -5.943 QT
64.268 -6.849 64.807 -7.513 QT
65.346 -8.177 66.206 -8.521 QT
67.065 -8.864 67.924 -8.864 QT
68.565 -8.864 69.268 -8.677 QT
69.971 -8.489 70.549 -8.138 QT
71.127 -7.786 71.487 -7.232 QT
71.846 -6.677 71.846 -5.958 QT
71.846 -5.083 71.456 -4.333 QT
71.065 -3.583 70.377 -3.044 QT
69.69 -2.505 68.862 -2.239 QT
69.784 -2.052 70.604 -1.544 QT
71.424 -1.036 71.916 -0.232 QT
72.409 0.573 72.409 1.495 QT
72.409 2.651 71.776 3.589 QT
71.143 4.526 70.104 5.057 QT
69.065 5.589 67.924 5.589 QT
66.94 5.589 65.948 5.214 QT
64.956 4.839 64.323 4.089 QT
63.69 3.339 63.69 2.292 QT
63.69 1.761 64.041 1.417 QT
64.393 1.073 64.924 1.073 QT
65.252 1.073 65.534 1.229 QT
65.815 1.386 65.979 1.675 QT
66.143 1.964 66.143 2.292 QT
66.143 2.807 65.784 3.151 QT
65.424 3.495 64.924 3.495 QT
64.815 3.495 L
cp}def
f300774680
f
GR
GS
[0.75 0 0 0.75 0 0.5] CT
0 0 1 RC
1 LJ
0.667 LW
N
384.985 117.062 M
424.83 117.062 L
S
GR
GS
[0.75 0 0 0.75 320.86361 107.88971] CT
N
f-597267615
f
GR
GS
[0.75 0 0 0.75 320.86361 107.88971] CT
N
f-745240314
f
GR
GS
[0.75 0 0 0.75 320.86361 107.88971] CT
N
f1964844890
f
GR
GS
[0.75 0 0 0.75 320.86361 107.88971] CT
N
f1881606250
f
GR
GS
[0.75 0 0 0.75 320.86361 107.88971] CT
N
f-1218143468
f
GR
GS
[0.75 0 0 0.75 320.86361 107.88971] CT
N
/f-1674298674{63.393 1.651 M
63.393 0.917 L
69.893 -8.771 L
69.956 -8.864 70.112 -8.864 QT
70.409 -8.864 L
70.643 -8.864 70.643 -8.63 QT
70.643 0.917 L
72.706 0.917 L
72.706 1.651 L
70.643 1.651 L
70.643 3.714 L
70.643 4.151 71.26 4.268 QT
71.877 4.386 72.69 4.386 QT
72.69 5.12 L
66.909 5.12 L
66.909 4.386 L
67.721 4.386 68.331 4.268 QT
68.94 4.151 68.94 3.714 QT
68.94 1.651 L
63.393 1.651 L
cp
64.096 0.917 M
69.065 0.917 L
69.065 -6.521 L
64.096 0.917 L
cp}def
f-1674298674
f
GR
GS
[0.75 0 0 0.75 0 0.5] CT
0.6 0.2 0.2 RC
1 LJ
0.667 LW
N
384.985 143.186 M
424.83 143.186 L
S
GR
GS
[0.75 0 0 0.75 0 0.5] CT
0.149 GC
10.0 ML
0.667 LW
N
381 158 M
381 50 L
505 50 L
505 158 L
cp
S
GR
%%Trailer
%%Pages: 1
%%EOF
