%!PS-Adobe-3.0 EPSF-3.0
%%Creator: (MATLAB, The Mathworks, Inc. Version 9.12.0.2529717 \(R2022a\) Update 8. Operating System: Linux)
%%Title: plots/Example3_ry_dot.eps
%%CreationDate: 2024-06-10T20:08:28
%%Pages: (atend)
%%BoundingBox:    14     2   381   311
%%LanguageLevel: 3
%%EndComments
%%BeginProlog
%%BeginResource: procset (Apache XML Graphics Std ProcSet) 1.2 0
%%Version: 1.2 0
%%Copyright: (Copyright 2001-2003,2010 The Apache Software Foundation. License terms: http://www.apache.org/licenses/LICENSE-2.0)
/bd{bind def}bind def
/ld{load def}bd
/GR/grestore ld
/GS/gsave ld
/RM/rmoveto ld
/C/curveto ld
/t/show ld
/L/lineto ld
/ML/setmiterlimit ld
/CT/concat ld
/f/fill ld
/N/newpath ld
/S/stroke ld
/CC/setcmykcolor ld
/A/ashow ld
/cp/closepath ld
/RC/setrgbcolor ld
/LJ/setlinejoin ld
/GC/setgray ld
/LW/setlinewidth ld
/M/moveto ld
/re {4 2 roll M
1 index 0 rlineto
0 exch rlineto
neg 0 rlineto
cp } bd
/_ctm matrix def
/_tm matrix def
/BT { _ctm currentmatrix pop matrix _tm copy pop 0 0 moveto } bd
/ET { _ctm setmatrix } bd
/iTm { _ctm setmatrix _tm concat } bd
/Tm { _tm astore pop iTm 0 0 moveto } bd
/ux 0.0 def
/uy 0.0 def
/F {
  /Tp exch def
  /Tf exch def
  Tf findfont Tp scalefont setfont
  /cf Tf def  /cs Tp def
} bd
/ULS {currentpoint /uy exch def /ux exch def} bd
/ULE {
  /Tcx currentpoint pop def
  gsave
  newpath
  cf findfont cs scalefont dup
  /FontMatrix get 0 get /Ts exch def /FontInfo get dup
  /UnderlinePosition get Ts mul /To exch def
  /UnderlineThickness get Ts mul /Tt exch def
  ux uy To add moveto  Tcx uy To add lineto
  Tt setlinewidth stroke
  grestore
} bd
/OLE {
  /Tcx currentpoint pop def
  gsave
  newpath
  cf findfont cs scalefont dup
  /FontMatrix get 0 get /Ts exch def /FontInfo get dup
  /UnderlinePosition get Ts mul /To exch def
  /UnderlineThickness get Ts mul /Tt exch def
  ux uy To add cs add moveto Tcx uy To add cs add lineto
  Tt setlinewidth stroke
  grestore
} bd
/SOE {
  /Tcx currentpoint pop def
  gsave
  newpath
  cf findfont cs scalefont dup
  /FontMatrix get 0 get /Ts exch def /FontInfo get dup
  /UnderlinePosition get Ts mul /To exch def
  /UnderlineThickness get Ts mul /Tt exch def
  ux uy To add cs 10 mul 26 idiv add moveto Tcx uy To add cs 10 mul 26 idiv add lineto
  Tt setlinewidth stroke
  grestore
} bd
/QT {
/Y22 exch store
/X22 exch store
/Y21 exch store
/X21 exch store
currentpoint
/Y21 load 2 mul add 3 div exch
/X21 load 2 mul add 3 div exch
/X21 load 2 mul /X22 load add 3 div
/Y21 load 2 mul /Y22 load add 3 div
/X22 load /Y22 load curveto
} bd
/SSPD {
dup length /d exch dict def
{
/v exch def
/k exch def
currentpagedevice k known {
/cpdv currentpagedevice k get def
v cpdv ne {
/upd false def
/nullv v type /nulltype eq def
/nullcpdv cpdv type /nulltype eq def
nullv nullcpdv or
{
/upd true def
} {
/sametype v type cpdv type eq def
sametype {
v type /arraytype eq {
/vlen v length def
/cpdvlen cpdv length def
vlen cpdvlen eq {
0 1 vlen 1 sub {
/i exch def
/obj v i get def
/cpdobj cpdv i get def
obj cpdobj ne {
/upd true def
exit
} if
} for
} {
/upd true def
} ifelse
} {
v type /dicttype eq {
v {
/dv exch def
/dk exch def
/cpddv cpdv dk get def
dv cpddv ne {
/upd true def
exit
} if
} forall
} {
/upd true def
} ifelse
} ifelse
} if
} ifelse
upd true eq {
d k v put
} if
} if
} if
} forall
d length 0 gt {
d setpagedevice
} if
} bd
/RE { % /NewFontName [NewEncodingArray] /FontName RE -
  findfont dup length dict begin
  {
    1 index /FID ne
    {def} {pop pop} ifelse
  } forall
  /Encoding exch def
  /FontName 1 index def
  currentdict definefont pop
  end
} bind def
%%EndResource
%%BeginResource: procset (Apache XML Graphics EPS ProcSet) 1.0 0
%%Version: 1.0 0
%%Copyright: (Copyright 2002-2003 The Apache Software Foundation. License terms: http://www.apache.org/licenses/LICENSE-2.0)
/BeginEPSF { %def
/b4_Inc_state save def         % Save state for cleanup
/dict_count countdictstack def % Count objects on dict stack
/op_count count 1 sub def      % Count objects on operand stack
userdict begin                 % Push userdict on dict stack
/showpage { } def              % Redefine showpage, { } = null proc
0 setgray 0 setlinecap         % Prepare graphics state
1 setlinewidth 0 setlinejoin
10 setmiterlimit [ ] 0 setdash newpath
/languagelevel where           % If level not equal to 1 then
{pop languagelevel             % set strokeadjust and
1 ne                           % overprint to their defaults.
{false setstrokeadjust false setoverprint
} if
} if
} bd
/EndEPSF { %def
count op_count sub {pop} repeat            % Clean up stacks
countdictstack dict_count sub {end} repeat
b4_Inc_state restore
} bd
%%EndResource
%FOPBeginFontDict
%%IncludeResource: font Courier-Oblique
%%IncludeResource: font Courier-BoldOblique
%%IncludeResource: font Courier-Bold
%%IncludeResource: font ZapfDingbats
%%IncludeResource: font Symbol
%%IncludeResource: font Helvetica
%%IncludeResource: font Helvetica-Oblique
%%IncludeResource: font Helvetica-Bold
%%IncludeResource: font Helvetica-BoldOblique
%%IncludeResource: font Times-Roman
%%IncludeResource: font Times-Italic
%%IncludeResource: font Times-Bold
%%IncludeResource: font Times-BoldItalic
%%IncludeResource: font Courier
%FOPEndFontDict
%%BeginResource: encoding WinAnsiEncoding
/WinAnsiEncoding [
/.notdef /.notdef /.notdef /.notdef /.notdef
/.notdef /.notdef /.notdef /.notdef /.notdef
/.notdef /.notdef /.notdef /.notdef /.notdef
/.notdef /.notdef /.notdef /.notdef /.notdef
/.notdef /.notdef /.notdef /.notdef /.notdef
/.notdef /.notdef /.notdef /.notdef /.notdef
/.notdef /.notdef /space /exclam /quotedbl
/numbersign /dollar /percent /ampersand /quotesingle
/parenleft /parenright /asterisk /plus /comma
/hyphen /period /slash /zero /one
/two /three /four /five /six
/seven /eight /nine /colon /semicolon
/less /equal /greater /question /at
/A /B /C /D /E
/F /G /H /I /J
/K /L /M /N /O
/P /Q /R /S /T
/U /V /W /X /Y
/Z /bracketleft /backslash /bracketright /asciicircum
/underscore /quoteleft /a /b /c
/d /e /f /g /h
/i /j /k /l /m
/n /o /p /q /r
/s /t /u /v /w
/x /y /z /braceleft /bar
/braceright /asciitilde /bullet /Euro /bullet
/quotesinglbase /florin /quotedblbase /ellipsis /dagger
/daggerdbl /circumflex /perthousand /Scaron /guilsinglleft
/OE /bullet /Zcaron /bullet /bullet
/quoteleft /quoteright /quotedblleft /quotedblright /bullet
/endash /emdash /asciitilde /trademark /scaron
/guilsinglright /oe /bullet /zcaron /Ydieresis
/space /exclamdown /cent /sterling /currency
/yen /brokenbar /section /dieresis /copyright
/ordfeminine /guillemotleft /logicalnot /sfthyphen /registered
/macron /degree /plusminus /twosuperior /threesuperior
/acute /mu /paragraph /middot /cedilla
/onesuperior /ordmasculine /guillemotright /onequarter /onehalf
/threequarters /questiondown /Agrave /Aacute /Acircumflex
/Atilde /Adieresis /Aring /AE /Ccedilla
/Egrave /Eacute /Ecircumflex /Edieresis /Igrave
/Iacute /Icircumflex /Idieresis /Eth /Ntilde
/Ograve /Oacute /Ocircumflex /Otilde /Odieresis
/multiply /Oslash /Ugrave /Uacute /Ucircumflex
/Udieresis /Yacute /Thorn /germandbls /agrave
/aacute /acircumflex /atilde /adieresis /aring
/ae /ccedilla /egrave /eacute /ecircumflex
/edieresis /igrave /iacute /icircumflex /idieresis
/eth /ntilde /ograve /oacute /ocircumflex
/otilde /odieresis /divide /oslash /ugrave
/uacute /ucircumflex /udieresis /yacute /thorn
/ydieresis
] def
%%EndResource
%FOPBeginFontReencode
/Courier-Oblique findfont
dup length dict begin
  {1 index /FID ne {def} {pop pop} ifelse} forall
  /Encoding WinAnsiEncoding def
  currentdict
end
/Courier-Oblique exch definefont pop
/Courier-BoldOblique findfont
dup length dict begin
  {1 index /FID ne {def} {pop pop} ifelse} forall
  /Encoding WinAnsiEncoding def
  currentdict
end
/Courier-BoldOblique exch definefont pop
/Courier-Bold findfont
dup length dict begin
  {1 index /FID ne {def} {pop pop} ifelse} forall
  /Encoding WinAnsiEncoding def
  currentdict
end
/Courier-Bold exch definefont pop
/Helvetica findfont
dup length dict begin
  {1 index /FID ne {def} {pop pop} ifelse} forall
  /Encoding WinAnsiEncoding def
  currentdict
end
/Helvetica exch definefont pop
/Helvetica-Oblique findfont
dup length dict begin
  {1 index /FID ne {def} {pop pop} ifelse} forall
  /Encoding WinAnsiEncoding def
  currentdict
end
/Helvetica-Oblique exch definefont pop
/Helvetica-Bold findfont
dup length dict begin
  {1 index /FID ne {def} {pop pop} ifelse} forall
  /Encoding WinAnsiEncoding def
  currentdict
end
/Helvetica-Bold exch definefont pop
/Helvetica-BoldOblique findfont
dup length dict begin
  {1 index /FID ne {def} {pop pop} ifelse} forall
  /Encoding WinAnsiEncoding def
  currentdict
end
/Helvetica-BoldOblique exch definefont pop
/Times-Roman findfont
dup length dict begin
  {1 index /FID ne {def} {pop pop} ifelse} forall
  /Encoding WinAnsiEncoding def
  currentdict
end
/Times-Roman exch definefont pop
/Times-Italic findfont
dup length dict begin
  {1 index /FID ne {def} {pop pop} ifelse} forall
  /Encoding WinAnsiEncoding def
  currentdict
end
/Times-Italic exch definefont pop
/Times-Bold findfont
dup length dict begin
  {1 index /FID ne {def} {pop pop} ifelse} forall
  /Encoding WinAnsiEncoding def
  currentdict
end
/Times-Bold exch definefont pop
/Times-BoldItalic findfont
dup length dict begin
  {1 index /FID ne {def} {pop pop} ifelse} forall
  /Encoding WinAnsiEncoding def
  currentdict
end
/Times-BoldItalic exch definefont pop
/Courier findfont
dup length dict begin
  {1 index /FID ne {def} {pop pop} ifelse} forall
  /Encoding WinAnsiEncoding def
  currentdict
end
/Courier exch definefont pop
%FOPEndFontReencode
%%EndProlog
%%Page: 1 1
%%PageBoundingBox: 0 0 420 315
%%BeginPageSetup
N
   14     2 M
  395     2 L
  395   313 L
   14   313 L
cp
clip
[1 0 0 -1 0 315] CT
%%EndPageSetup
GS
[0.75 0 0 0.75 0 0] CT
1 GC
N
0 0 560 420 re
f
GR
GS
[0.75 0 0 0.75 0 0] CT
1 GC
N
0 0 560 420 re
f
GR
GS
[0.75 0 0 0.75 0 0] CT
1 GC
N
73 359 M
507 359 L
507 39 L
73 39 L
cp
f
GR
GS
[0.75 0 0 0.75 0 0] CT
0.873 GC
1 LJ
0.667 LW
N
73 359 M
73 39 L
S
GR
GS
[0.75 0 0 0.75 0 0] CT
0.873 GC
1 LJ
0.667 LW
N
128.641 359 M
128.641 39 L
S
GR
GS
[0.75 0 0 0.75 0 0] CT
0.873 GC
1 LJ
0.667 LW
N
184.282 359 M
184.282 39 L
S
GR
GS
[0.75 0 0 0.75 0 0] CT
0.873 GC
1 LJ
0.667 LW
N
239.923 359 M
239.923 39 L
S
GR
GS
[0.75 0 0 0.75 0 0] CT
0.873 GC
1 LJ
0.667 LW
N
295.564 359 M
295.564 39 L
S
GR
GS
[0.75 0 0 0.75 0 0] CT
0.873 GC
1 LJ
0.667 LW
N
351.205 359 M
351.205 39 L
S
GR
GS
[0.75 0 0 0.75 0 0] CT
0.873 GC
1 LJ
0.667 LW
N
406.846 359 M
406.846 39 L
S
GR
GS
[0.75 0 0 0.75 0 0] CT
0.873 GC
1 LJ
0.667 LW
N
462.487 359 M
462.487 39 L
S
GR
GS
[0.75 0 0 0.75 0 0] CT
0.873 GC
1 LJ
0.667 LW
N
507 359 M
73 359 L
S
GR
GS
[0.75 0 0 0.75 0 0] CT
0.873 GC
1 LJ
0.667 LW
N
507 199 M
73 199 L
S
GR
GS
[0.75 0 0 0.75 0 0] CT
0.873 GC
1 LJ
0.667 LW
N
507 39 M
73 39 L
S
GR
GS
[0.75 0 0 0.75 0 0] CT
0.149 GC
2 setlinecap
1 LJ
0.667 LW
N
73 359 M
507 359 L
S
GR
GS
[0.75 0 0 0.75 0 0] CT
0.149 GC
2 setlinecap
1 LJ
0.667 LW
N
73 359 M
73 354.66 L
S
GR
GS
[0.75 0 0 0.75 0 0] CT
0.149 GC
2 setlinecap
1 LJ
0.667 LW
N
128.641 359 M
128.641 354.66 L
S
GR
GS
[0.75 0 0 0.75 0 0] CT
0.149 GC
2 setlinecap
1 LJ
0.667 LW
N
184.282 359 M
184.282 354.66 L
S
GR
GS
[0.75 0 0 0.75 0 0] CT
0.149 GC
2 setlinecap
1 LJ
0.667 LW
N
239.923 359 M
239.923 354.66 L
S
GR
GS
[0.75 0 0 0.75 0 0] CT
0.149 GC
2 setlinecap
1 LJ
0.667 LW
N
295.564 359 M
295.564 354.66 L
S
GR
GS
[0.75 0 0 0.75 0 0] CT
0.149 GC
2 setlinecap
1 LJ
0.667 LW
N
351.205 359 M
351.205 354.66 L
S
GR
GS
[0.75 0 0 0.75 0 0] CT
0.149 GC
2 setlinecap
1 LJ
0.667 LW
N
406.846 359 M
406.846 354.66 L
S
GR
GS
[0.75 0 0 0.75 0 0] CT
0.149 GC
2 setlinecap
1 LJ
0.667 LW
N
462.487 359 M
462.487 354.66 L
S
GR
GS
[0.75 0 0 0.75 54.75 273.24998] CT
0.149 GC
/Helvetica 13.333 F
GS
[1 0 0 1 0 0] CT
-4 15 moveto 
1 -1 scale
(0) t 
GR
GR
GS
[0.75 0 0 0.75 96.48077 273.24998] CT
0.149 GC
/Helvetica 13.333 F
GS
[1 0 0 1 0 0] CT
-4 15 moveto 
1 -1 scale
(5) t 
GR
GR
GS
[0.75 0 0 0.75 138.21154 273.24998] CT
0.149 GC
/Helvetica 13.333 F
GS
[1 0 0 1 0 0] CT
-8 15 moveto 
1 -1 scale
(10) t 
GR
GR
GS
[0.75 0 0 0.75 179.94231 273.24998] CT
0.149 GC
/Helvetica 13.333 F
GS
[1 0 0 1 0 0] CT
-8 15 moveto 
1 -1 scale
(15) t 
GR
GR
GS
[0.75 0 0 0.75 221.67309 273.24998] CT
0.149 GC
/Helvetica 13.333 F
GS
[1 0 0 1 0 0] CT
-8 15 moveto 
1 -1 scale
(20) t 
GR
GR
GS
[0.75 0 0 0.75 263.40385 273.24998] CT
0.149 GC
/Helvetica 13.333 F
GS
[1 0 0 1 0 0] CT
-8 15 moveto 
1 -1 scale
(25) t 
GR
GR
GS
[0.75 0 0 0.75 305.13462 273.24998] CT
0.149 GC
/Helvetica 13.333 F
GS
[1 0 0 1 0 0] CT
-8 15 moveto 
1 -1 scale
(30) t 
GR
GR
GS
[0.75 0 0 0.75 346.86539 273.24998] CT
0.149 GC
/Helvetica 13.333 F
GS
[1 0 0 1 0 0] CT
-8 15 moveto 
1 -1 scale
(35) t 
GR
GR
GS
[0.75 0 0 0.75 217.50016 288.50002] CT
0.149 GC
N
-43.282 22.296 M
-43.282 21.859 -43.188 21.484 QT
-41.095 13.156 L
-44.142 13.156 L
-44.438 13.156 -44.438 12.781 QT
-44.329 12.14 -44.063 12.14 QT
-40.845 12.14 L
-39.688 7.406 L
-39.563 7.031 -39.227 6.757 QT
-38.892 6.484 -38.47 6.484 QT
-38.095 6.484 -37.845 6.702 QT
-37.595 6.921 -37.595 7.296 QT
-37.595 7.374 -37.602 7.429 QT
-37.61 7.484 -37.626 7.531 QT
-38.798 12.14 L
-35.798 12.14 L
-35.501 12.14 -35.501 12.515 QT
-35.517 12.593 -35.563 12.765 QT
-35.61 12.937 -35.681 13.046 QT
-35.751 13.156 -35.892 13.156 QT
-39.048 13.156 L
-41.126 21.546 L
-41.345 22.359 -41.345 22.952 QT
-41.345 24.202 -40.485 24.202 QT
-39.22 24.202 -38.235 23.007 QT
-37.251 21.812 -36.72 20.374 QT
-36.61 20.202 -36.501 20.202 QT
-36.142 20.202 L
-36.032 20.202 -35.962 20.281 QT
-35.892 20.359 -35.892 20.468 QT
-35.892 20.515 -35.923 20.546 QT
-36.548 22.296 -37.767 23.632 QT
-38.985 24.968 -40.563 24.968 QT
-41.704 24.968 -42.493 24.218 QT
-43.282 23.468 -43.282 22.296 QT
cp
f
GR
GS
[0.75 0 0 0.75 217.50016 288.50002] CT
0.149 GC
N
-32.221 22.562 M
-32.221 22.015 -31.986 21.421 QT
-29.643 15.187 L
-29.268 14.124 -29.268 13.437 QT
-29.268 12.577 -29.893 12.577 QT
-31.049 12.577 -31.791 13.757 QT
-32.533 14.937 -32.893 16.406 QT
-32.94 16.577 -33.127 16.577 QT
-33.471 16.577 L
-33.705 16.577 -33.705 16.312 QT
-33.705 16.234 L
-33.236 14.499 -32.276 13.163 QT
-31.315 11.827 -29.846 11.827 QT
-28.815 11.827 -28.096 12.507 QT
-27.377 13.187 -27.377 14.234 QT
-27.377 14.765 -27.611 15.359 QT
-29.971 21.593 L
-30.361 22.562 -30.361 23.343 QT
-30.361 24.202 -29.705 24.202 QT
-28.565 24.202 -27.807 22.991 QT
-27.049 21.781 -26.736 20.374 QT
-26.69 20.202 -26.518 20.202 QT
-26.158 20.202 L
-26.049 20.202 -25.979 20.281 QT
-25.908 20.359 -25.908 20.468 QT
-25.908 20.484 -25.94 20.546 QT
-26.33 22.187 -27.315 23.577 QT
-28.299 24.968 -29.752 24.968 QT
-30.783 24.968 -31.502 24.265 QT
-32.221 23.562 -32.221 22.562 QT
cp
-28.955 7.062 M
-28.955 6.452 -28.44 5.96 QT
-27.924 5.468 -27.315 5.468 QT
-26.83 5.468 -26.51 5.773 QT
-26.19 6.077 -26.19 6.546 QT
-26.19 7.187 -26.705 7.679 QT
-27.221 8.171 -27.846 8.171 QT
-28.315 8.171 -28.635 7.851 QT
-28.955 7.531 -28.955 7.062 QT
cp
f
GR
GS
[0.75 0 0 0.75 217.50016 288.50002] CT
0.149 GC
N
-22.146 24.14 M
-22.146 23.968 -22.115 23.89 QT
-19.943 15.234 L
-19.74 14.437 -19.74 13.827 QT
-19.74 12.577 -20.584 12.577 QT
-21.49 12.577 -21.928 13.663 QT
-22.365 14.749 -22.787 16.406 QT
-22.787 16.484 -22.865 16.531 QT
-22.943 16.577 -23.021 16.577 QT
-23.365 16.577 L
-23.459 16.577 -23.529 16.476 QT
-23.599 16.374 -23.599 16.281 QT
-23.287 15.031 -22.998 14.148 QT
-22.709 13.265 -22.092 12.546 QT
-21.474 11.827 -20.553 11.827 QT
-19.474 11.827 -18.639 12.515 QT
-17.803 13.202 -17.803 14.265 QT
-16.928 13.124 -15.771 12.476 QT
-14.615 11.827 -13.303 11.827 QT
-11.928 11.827 -10.935 12.531 QT
-9.943 13.234 -9.943 14.515 QT
-9.053 13.249 -7.849 12.538 QT
-6.646 11.827 -5.24 11.827 QT
-3.74 11.827 -2.826 12.64 QT
-1.912 13.452 -1.912 14.952 QT
-1.912 16.14 -2.443 17.827 QT
-2.974 19.515 -3.756 21.593 QT
-4.178 22.593 -4.178 23.343 QT
-4.178 24.202 -3.49 24.202 QT
-2.365 24.202 -1.615 22.984 QT
-0.865 21.765 -0.553 20.374 QT
-0.459 20.202 -0.303 20.202 QT
0.026 20.202 L
0.151 20.202 0.229 20.281 QT
0.307 20.359 0.307 20.468 QT
0.307 20.484 0.276 20.546 QT
-0.131 22.187 -1.115 23.577 QT
-2.099 24.968 -3.568 24.968 QT
-4.584 24.968 -5.303 24.265 QT
-6.021 23.562 -6.021 22.562 QT
-6.021 22.046 -5.787 21.421 QT
-4.974 19.249 -4.428 17.531 QT
-3.881 15.812 -3.881 14.515 QT
-3.881 13.702 -4.201 13.14 QT
-4.521 12.577 -5.287 12.577 QT
-6.881 12.577 -8.037 13.546 QT
-9.193 14.515 -10.053 16.109 QT
-10.099 16.406 -10.131 16.562 QT
-12.006 23.999 L
-12.099 24.406 -12.451 24.687 QT
-12.803 24.968 -13.224 24.968 QT
-13.568 24.968 -13.826 24.741 QT
-14.084 24.515 -14.084 24.14 QT
-14.084 23.968 -14.053 23.89 QT
-12.209 16.499 L
-11.912 15.312 -11.912 14.515 QT
-11.912 13.702 -12.24 13.14 QT
-12.568 12.577 -13.365 12.577 QT
-14.428 12.577 -15.318 13.046 QT
-16.209 13.515 -16.873 14.281 QT
-17.537 15.046 -18.099 16.109 QT
-20.068 23.999 L
-20.162 24.406 -20.506 24.687 QT
-20.849 24.968 -21.287 24.968 QT
-21.631 24.968 -21.889 24.741 QT
-22.146 24.515 -22.146 24.14 QT
cp
f
GR
GS
[0.75 0 0 0.75 217.50016 288.50002] CT
0.149 GC
N
7.202 24.968 M
5.827 24.968 4.781 24.241 QT
3.734 23.515 3.195 22.296 QT
2.656 21.077 2.656 19.718 QT
2.656 17.64 3.695 15.82 QT
4.734 13.999 6.515 12.913 QT
8.296 11.827 10.343 11.827 QT
11.577 11.827 12.507 12.468 QT
13.437 13.109 13.437 14.312 QT
13.437 15.984 12.109 16.796 QT
10.781 17.609 9.109 17.804 QT
7.437 17.999 5.406 17.999 QT
5.327 17.999 L
4.859 19.734 4.859 20.952 QT
4.859 22.249 5.452 23.226 QT
6.046 24.202 7.265 24.202 QT
8.999 24.202 10.585 23.406 QT
12.171 22.609 13.187 21.218 QT
13.265 21.124 13.406 21.124 QT
13.546 21.124 13.695 21.288 QT
13.843 21.452 13.843 21.593 QT
13.843 21.702 13.796 21.765 QT
12.734 23.249 10.937 24.109 QT
9.14 24.968 7.202 24.968 QT
cp
5.499 17.249 M
7.187 17.249 8.617 17.093 QT
10.046 16.937 11.202 16.304 QT
12.359 15.671 12.359 14.343 QT
12.359 13.812 12.062 13.406 QT
11.765 12.999 11.288 12.788 QT
10.812 12.577 10.312 12.577 QT
9.077 12.577 8.093 13.241 QT
7.109 13.906 6.468 14.976 QT
5.827 16.046 5.499 17.249 QT
cp
f
GR
GS
[0.75 0 0 0.75 217.50016 288.50002] CT
0.149 GC
N
18.455 31.89 M
18.455 2.89 L
22.423 2.89 L
22.423 4.046 L
19.626 4.046 L
19.626 30.734 L
22.423 30.734 L
22.423 31.89 L
18.455 31.89 L
cp
f
GR
GS
[0.75 0 0 0.75 217.50016 288.50002] CT
0.149 GC
N
25.697 22.874 M
26.478 24.202 28.837 24.202 QT
29.853 24.202 30.775 23.851 QT
31.697 23.499 32.298 22.812 QT
32.9 22.124 32.9 21.124 QT
32.9 20.374 32.361 19.898 QT
31.822 19.421 31.04 19.249 QT
29.462 18.937 L
28.4 18.671 27.704 17.929 QT
27.009 17.187 27.009 16.14 QT
27.009 14.859 27.704 13.866 QT
28.4 12.874 29.548 12.351 QT
30.697 11.827 31.931 11.827 QT
33.243 11.827 34.29 12.452 QT
35.337 13.077 35.337 14.312 QT
35.337 14.984 34.962 15.491 QT
34.587 15.999 33.915 15.999 QT
33.525 15.999 33.251 15.749 QT
32.978 15.499 32.978 15.124 QT
32.978 14.781 33.173 14.46 QT
33.368 14.14 33.681 13.952 QT
33.993 13.765 34.337 13.765 QT
34.087 13.14 33.384 12.859 QT
32.681 12.577 31.868 12.577 QT
31.134 12.577 30.4 12.874 QT
29.665 13.171 29.22 13.741 QT
28.775 14.312 28.775 15.093 QT
28.775 15.624 29.142 16.015 QT
29.509 16.406 30.056 16.577 QT
31.728 16.921 L
32.54 17.093 33.212 17.523 QT
33.884 17.952 34.275 18.616 QT
34.665 19.281 34.665 20.124 QT
34.665 21.202 34.064 22.249 QT
33.462 23.296 32.587 23.921 QT
31.04 24.968 28.806 24.968 QT
27.259 24.968 25.97 24.257 QT
24.681 23.546 24.681 22.14 QT
24.681 21.359 25.142 20.773 QT
25.603 20.187 26.4 20.187 QT
26.868 20.187 27.181 20.468 QT
27.493 20.749 27.493 21.218 QT
27.493 21.874 27.001 22.374 QT
26.509 22.874 25.837 22.874 QT
25.697 22.874 L
cp
f
GR
GS
[0.75 0 0 0.75 217.50016 288.50002] CT
0.149 GC
N
37.572 31.89 M
37.572 30.734 L
40.384 30.734 L
40.384 4.046 L
37.572 4.046 L
37.572 2.89 L
41.54 2.89 L
41.54 31.89 L
37.572 31.89 L
cp
f
GR
GS
[0.75 0 0 0.75 0 0] CT
0.149 GC
2 setlinecap
1 LJ
0.667 LW
N
73 359 M
73 39 L
S
GR
GS
[0.75 0 0 0.75 0 0] CT
0.149 GC
2 setlinecap
1 LJ
0.667 LW
N
73 359 M
77.34 359 L
S
GR
GS
[0.75 0 0 0.75 0 0] CT
0.149 GC
2 setlinecap
1 LJ
0.667 LW
N
73 199 M
77.34 199 L
S
GR
GS
[0.75 0 0 0.75 0 0] CT
0.149 GC
2 setlinecap
1 LJ
0.667 LW
N
73 39 M
77.34 39 L
S
GR
GS
[0.75 0 0 0.75 50.75 269.25] CT
0.149 GC
/Helvetica 13.333 F
GS
[1 0 0 1 0 0] CT
-12 5.5 moveto 
1 -1 scale
(-5) t 
GR
GR
GS
[0.75 0 0 0.75 50.75 149.25] CT
0.149 GC
/Helvetica 13.333 F
GS
[1 0 0 1 0 0] CT
-8 5.5 moveto 
1 -1 scale
(0) t 
GR
GR
GS
[0.75 0 0 0.75 50.75 29.25] CT
0.149 GC
/Helvetica 13.333 F
GS
[1 0 0 1 0 0] CT
-8 5.5 moveto 
1 -1 scale
(5) t 
GR
GR
GS
[0 -0.75 0.75 0 38.75 149.24989] CT
0.149 GC
N
-40.969 -28.357 M
-40.969 -28.998 -40.484 -29.482 QT
-40 -29.966 -39.375 -29.966 QT
-38.969 -29.966 -38.586 -29.748 QT
-38.203 -29.529 -37.992 -29.146 QT
-37.781 -28.763 -37.781 -28.357 QT
-37.781 -27.732 -38.25 -27.255 QT
-38.719 -26.779 -39.375 -26.779 QT
-40 -26.779 -40.484 -27.255 QT
-40.969 -27.732 -40.969 -28.357 QT
cp
f
GR
GS
[0 -0.75 0.75 0 38.75 149.24989] CT
0.149 GC
N
-45.752 -11.06 M
-45.752 -11.232 -45.721 -11.31 QT
-43.549 -19.966 L
-43.346 -20.763 -43.346 -21.373 QT
-43.346 -22.623 -44.189 -22.623 QT
-45.096 -22.623 -45.533 -21.537 QT
-45.971 -20.451 -46.392 -18.794 QT
-46.392 -18.716 -46.471 -18.669 QT
-46.549 -18.623 -46.627 -18.623 QT
-46.971 -18.623 L
-47.064 -18.623 -47.135 -18.724 QT
-47.205 -18.826 -47.205 -18.919 QT
-46.892 -20.169 -46.603 -21.052 QT
-46.314 -21.935 -45.697 -22.654 QT
-45.08 -23.373 -44.158 -23.373 QT
-43.158 -23.373 -42.4 -22.794 QT
-41.642 -22.216 -41.455 -21.263 QT
-40.721 -22.232 -39.783 -22.802 QT
-38.846 -23.373 -37.721 -23.373 QT
-36.799 -23.373 -36.096 -22.834 QT
-35.392 -22.294 -35.392 -21.373 QT
-35.392 -20.638 -35.853 -20.091 QT
-36.314 -19.544 -37.08 -19.544 QT
-37.549 -19.544 -37.869 -19.841 QT
-38.189 -20.138 -38.189 -20.607 QT
-38.189 -21.232 -37.721 -21.74 QT
-37.252 -22.248 -36.642 -22.248 QT
-37.111 -22.623 -37.783 -22.623 QT
-39.017 -22.623 -39.939 -21.74 QT
-40.861 -20.857 -41.596 -19.498 QT
-43.674 -11.201 L
-43.767 -10.794 -44.111 -10.513 QT
-44.455 -10.232 -44.892 -10.232 QT
-45.236 -10.232 -45.494 -10.459 QT
-45.752 -10.685 -45.752 -11.06 QT
cp
f
GR
GS
[0 -0.75 0.75 0 38.75 149.24989] CT
0.149 GC
N
-32.987 -3.16 M
-32.549 -2.395 -31.455 -2.395 QT
-30.455 -2.395 -29.729 -3.09 QT
-29.002 -3.785 -28.557 -4.777 QT
-28.112 -5.77 -27.862 -6.801 QT
-28.799 -5.926 -29.877 -5.926 QT
-30.705 -5.926 -31.291 -6.215 QT
-31.877 -6.504 -32.205 -7.074 QT
-32.534 -7.645 -32.534 -8.441 QT
-32.534 -9.129 -32.346 -9.855 QT
-32.159 -10.582 -31.823 -11.465 QT
-31.487 -12.348 -31.252 -13.004 QT
-30.971 -13.785 -30.971 -14.27 QT
-30.971 -14.895 -31.424 -14.895 QT
-32.268 -14.895 -32.799 -14.043 QT
-33.33 -13.191 -33.596 -12.129 QT
-33.627 -11.988 -33.768 -11.988 QT
-34.018 -11.988 L
-34.19 -11.988 -34.19 -12.191 QT
-34.19 -12.254 L
-33.846 -13.504 -33.151 -14.473 QT
-32.455 -15.441 -31.393 -15.441 QT
-30.643 -15.441 -30.127 -14.949 QT
-29.612 -14.457 -29.612 -13.691 QT
-29.612 -13.301 -29.784 -12.879 QT
-29.877 -12.613 -30.205 -11.754 QT
-30.534 -10.895 -30.705 -10.332 QT
-30.877 -9.77 -30.987 -9.223 QT
-31.096 -8.676 -31.096 -8.145 QT
-31.096 -7.441 -30.799 -6.957 QT
-30.502 -6.473 -29.862 -6.473 QT
-28.565 -6.473 -27.518 -8.066 QT
-25.94 -14.535 L
-25.862 -14.816 -25.604 -15.012 QT
-25.346 -15.207 -25.049 -15.207 QT
-24.799 -15.207 -24.604 -15.043 QT
-24.409 -14.879 -24.409 -14.613 QT
-24.409 -14.504 -24.44 -14.457 QT
-26.518 -6.098 L
-26.799 -5.02 -27.534 -4.035 QT
-28.268 -3.051 -29.307 -2.449 QT
-30.346 -1.848 -31.487 -1.848 QT
-32.018 -1.848 -32.557 -2.059 QT
-33.096 -2.27 -33.424 -2.691 QT
-33.752 -3.113 -33.752 -3.676 QT
-33.752 -4.254 -33.409 -4.676 QT
-33.065 -5.098 -32.502 -5.098 QT
-32.174 -5.098 -31.94 -4.887 QT
-31.705 -4.676 -31.705 -4.332 QT
-31.705 -3.848 -32.065 -3.488 QT
-32.424 -3.129 -32.909 -3.129 QT
-32.924 -3.145 -32.948 -3.152 QT
-32.971 -3.16 -32.987 -3.16 QT
cp
f
GR
GS
[0 -0.75 0.75 0 38.75 149.24989] CT
0.149 GC
N
-19.06 -3.31 M
-19.06 -32.31 L
-15.091 -32.31 L
-15.091 -31.154 L
-17.888 -31.154 L
-17.888 -4.466 L
-15.091 -4.466 L
-15.091 -3.31 L
-19.06 -3.31 L
cp
f
GR
GS
[0 -0.75 0.75 0 38.75 149.24989] CT
0.149 GC
N
-12.099 -11.06 M
-12.099 -11.232 -12.068 -11.31 QT
-9.896 -19.966 L
-9.693 -20.763 -9.693 -21.373 QT
-9.693 -22.623 -10.537 -22.623 QT
-11.443 -22.623 -11.881 -21.537 QT
-12.318 -20.451 -12.74 -18.794 QT
-12.74 -18.716 -12.818 -18.669 QT
-12.896 -18.623 -12.974 -18.623 QT
-13.318 -18.623 L
-13.412 -18.623 -13.482 -18.724 QT
-13.552 -18.826 -13.552 -18.919 QT
-13.24 -20.169 -12.951 -21.052 QT
-12.662 -21.935 -12.045 -22.654 QT
-11.427 -23.373 -10.506 -23.373 QT
-9.427 -23.373 -8.591 -22.685 QT
-7.756 -21.998 -7.756 -20.935 QT
-6.881 -22.076 -5.724 -22.724 QT
-4.568 -23.373 -3.256 -23.373 QT
-1.881 -23.373 -0.888 -22.669 QT
0.104 -21.966 0.104 -20.685 QT
0.994 -21.951 2.198 -22.662 QT
3.401 -23.373 4.807 -23.373 QT
6.307 -23.373 7.221 -22.56 QT
8.135 -21.748 8.135 -20.248 QT
8.135 -19.06 7.604 -17.373 QT
7.073 -15.685 6.291 -13.607 QT
5.869 -12.607 5.869 -11.857 QT
5.869 -10.998 6.557 -10.998 QT
7.682 -10.998 8.432 -12.216 QT
9.182 -13.435 9.494 -14.826 QT
9.588 -14.998 9.744 -14.998 QT
10.073 -14.998 L
10.198 -14.998 10.276 -14.919 QT
10.354 -14.841 10.354 -14.732 QT
10.354 -14.716 10.323 -14.654 QT
9.916 -13.013 8.932 -11.623 QT
7.948 -10.232 6.479 -10.232 QT
5.463 -10.232 4.744 -10.935 QT
4.026 -11.638 4.026 -12.638 QT
4.026 -13.154 4.26 -13.779 QT
5.073 -15.951 5.619 -17.669 QT
6.166 -19.388 6.166 -20.685 QT
6.166 -21.498 5.846 -22.06 QT
5.526 -22.623 4.76 -22.623 QT
3.166 -22.623 2.01 -21.654 QT
0.854 -20.685 -0.006 -19.091 QT
-0.052 -18.794 -0.084 -18.638 QT
-1.959 -11.201 L
-2.052 -10.794 -2.404 -10.513 QT
-2.756 -10.232 -3.177 -10.232 QT
-3.521 -10.232 -3.779 -10.459 QT
-4.037 -10.685 -4.037 -11.06 QT
-4.037 -11.232 -4.006 -11.31 QT
-2.162 -18.701 L
-1.865 -19.888 -1.865 -20.685 QT
-1.865 -21.498 -2.193 -22.06 QT
-2.521 -22.623 -3.318 -22.623 QT
-4.381 -22.623 -5.271 -22.154 QT
-6.162 -21.685 -6.826 -20.919 QT
-7.49 -20.154 -8.052 -19.091 QT
-10.021 -11.201 L
-10.115 -10.794 -10.459 -10.513 QT
-10.802 -10.232 -11.24 -10.232 QT
-11.584 -10.232 -11.841 -10.459 QT
-12.099 -10.685 -12.099 -11.06 QT
cp
f
GR
GS
[0 -0.75 0.75 0 38.75 149.24989] CT
0.149 GC
N
13.046 -3.888 M
13.046 -3.982 13.078 -3.998 QT
23.156 -31.951 L
23.218 -32.123 23.359 -32.216 QT
23.5 -32.31 23.687 -32.31 QT
23.937 -32.31 24.101 -32.154 QT
24.265 -31.998 24.265 -31.732 QT
24.265 -31.623 L
14.187 -3.669 L
14.015 -3.31 13.625 -3.31 QT
13.39 -3.31 13.218 -3.482 QT
13.046 -3.654 13.046 -3.888 QT
cp
f
GR
GS
[0 -0.75 0.75 0 38.75 149.24989] CT
0.149 GC
N
28.604 -12.326 M
29.385 -10.998 31.744 -10.998 QT
32.76 -10.998 33.682 -11.349 QT
34.604 -11.701 35.205 -12.388 QT
35.807 -13.076 35.807 -14.076 QT
35.807 -14.826 35.268 -15.302 QT
34.729 -15.779 33.947 -15.951 QT
32.369 -16.263 L
31.307 -16.529 30.612 -17.271 QT
29.916 -18.013 29.916 -19.06 QT
29.916 -20.341 30.612 -21.334 QT
31.307 -22.326 32.455 -22.849 QT
33.604 -23.373 34.838 -23.373 QT
36.151 -23.373 37.197 -22.748 QT
38.244 -22.123 38.244 -20.888 QT
38.244 -20.216 37.869 -19.709 QT
37.494 -19.201 36.822 -19.201 QT
36.432 -19.201 36.158 -19.451 QT
35.885 -19.701 35.885 -20.076 QT
35.885 -20.419 36.08 -20.74 QT
36.276 -21.06 36.588 -21.248 QT
36.901 -21.435 37.244 -21.435 QT
36.994 -22.06 36.291 -22.341 QT
35.588 -22.623 34.776 -22.623 QT
34.041 -22.623 33.307 -22.326 QT
32.572 -22.029 32.127 -21.459 QT
31.682 -20.888 31.682 -20.107 QT
31.682 -19.576 32.049 -19.185 QT
32.416 -18.794 32.963 -18.623 QT
34.635 -18.279 L
35.447 -18.107 36.119 -17.677 QT
36.791 -17.248 37.182 -16.584 QT
37.572 -15.919 37.572 -15.076 QT
37.572 -13.998 36.971 -12.951 QT
36.369 -11.904 35.494 -11.279 QT
33.947 -10.232 31.713 -10.232 QT
30.166 -10.232 28.877 -10.943 QT
27.588 -11.654 27.588 -13.06 QT
27.588 -13.841 28.049 -14.427 QT
28.51 -15.013 29.307 -15.013 QT
29.776 -15.013 30.088 -14.732 QT
30.401 -14.451 30.401 -13.982 QT
30.401 -13.326 29.908 -12.826 QT
29.416 -12.326 28.744 -12.326 QT
28.604 -12.326 L
cp
f
GR
GS
[0 -0.75 0.75 0 38.75 149.24989] CT
0.149 GC
N
40.479 -3.31 M
40.479 -4.466 L
43.291 -4.466 L
43.291 -31.154 L
40.479 -31.154 L
40.479 -32.31 L
44.447 -32.31 L
44.447 -3.31 L
40.479 -3.31 L
cp
f
GR
GS
[0.75 0 0 0.75 217.50021 25.5] CT
N
-90.135 -9.6 M
-90.135 -10.553 L
-87.354 -10.553 -87.354 -11.413 QT
-87.354 -26.241 L
-87.354 -27.1 -90.135 -27.1 QT
-90.135 -28.038 L
-81.385 -28.038 L
-81.385 -27.1 L
-84.838 -27.1 -84.838 -26.241 QT
-84.838 -11.413 L
-84.838 -10.819 -84.502 -10.686 QT
-84.166 -10.553 -83.463 -10.553 QT
-81.385 -10.553 L
-79.354 -10.553 -78.26 -11.288 QT
-77.166 -12.022 -76.713 -13.295 QT
-76.26 -14.569 -76.026 -16.678 QT
-75.244 -16.678 L
-75.994 -9.6 L
-90.135 -9.6 L
cp
f
GR
GS
[0.75 0 0 0.75 217.50021 25.5] CT
N
-73.218 -12.256 M
-73.218 -13.866 -71.953 -14.874 QT
-70.687 -15.881 -68.914 -16.295 QT
-67.14 -16.709 -65.546 -16.709 QT
-65.546 -17.819 L
-65.546 -18.584 -65.89 -19.319 QT
-66.234 -20.053 -66.875 -20.522 QT
-67.515 -20.991 -68.296 -20.991 QT
-70.093 -20.991 -71.031 -20.194 QT
-70.515 -20.194 -70.179 -19.803 QT
-69.843 -19.413 -69.843 -18.897 QT
-69.843 -18.35 -70.226 -17.967 QT
-70.609 -17.584 -71.125 -17.584 QT
-71.671 -17.584 -72.054 -17.967 QT
-72.437 -18.35 -72.437 -18.897 QT
-72.437 -20.319 -71.148 -21.014 QT
-69.859 -21.709 -68.296 -21.709 QT
-67.203 -21.709 -66.093 -21.241 QT
-64.984 -20.772 -64.281 -19.897 QT
-63.578 -19.022 -63.578 -17.866 QT
-63.578 -11.788 L
-63.578 -11.256 -63.351 -10.819 QT
-63.125 -10.381 -62.656 -10.381 QT
-62.203 -10.381 -61.984 -10.827 QT
-61.765 -11.272 -61.765 -11.788 QT
-61.765 -13.522 L
-60.984 -13.522 L
-60.984 -11.788 L
-60.984 -11.178 -61.296 -10.631 QT
-61.609 -10.084 -62.148 -9.764 QT
-62.687 -9.444 -63.296 -9.444 QT
-64.093 -9.444 -64.664 -10.053 QT
-65.234 -10.663 -65.312 -11.506 QT
-65.812 -10.491 -66.781 -9.897 QT
-67.75 -9.303 -68.859 -9.303 QT
-69.89 -9.303 -70.89 -9.6 QT
-71.89 -9.897 -72.554 -10.553 QT
-73.218 -11.209 -73.218 -12.256 QT
cp
-71.031 -12.256 M
-71.031 -11.303 -70.328 -10.655 QT
-69.625 -10.006 -68.687 -10.006 QT
-67.812 -10.006 -67.101 -10.444 QT
-66.39 -10.881 -65.968 -11.631 QT
-65.546 -12.381 -65.546 -13.209 QT
-65.546 -16.022 L
-66.765 -16.022 -68.054 -15.616 QT
-69.343 -15.209 -70.187 -14.358 QT
-71.031 -13.506 -71.031 -12.256 QT
cp
f
GR
GS
[0.75 0 0 0.75 217.50021 25.5] CT
N
-58.213 -12.85 M
-58.213 -20.288 L
-60.447 -20.288 L
-60.447 -20.991 L
-58.682 -20.991 -57.854 -22.639 QT
-57.026 -24.288 -57.026 -26.209 QT
-56.244 -26.209 L
-56.244 -21.241 L
-52.432 -21.241 L
-52.432 -20.288 L
-56.244 -20.288 L
-56.244 -12.897 L
-56.244 -11.772 -55.869 -10.928 QT
-55.494 -10.084 -54.51 -10.084 QT
-53.588 -10.084 -53.182 -10.975 QT
-52.776 -11.866 -52.776 -12.897 QT
-52.776 -14.491 L
-51.994 -14.491 L
-51.994 -12.85 L
-51.994 -12.006 -52.307 -11.178 QT
-52.619 -10.35 -53.229 -9.827 QT
-53.838 -9.303 -54.697 -9.303 QT
-56.322 -9.303 -57.268 -10.272 QT
-58.213 -11.241 -58.213 -12.85 QT
cp
f
GR
GS
[0.75 0 0 0.75 217.50021 25.5] CT
N
-43.874 -9.303 M
-45.515 -9.303 -46.89 -10.163 QT
-48.265 -11.022 -49.054 -12.467 QT
-49.843 -13.913 -49.843 -15.522 QT
-49.843 -17.1 -49.124 -18.522 QT
-48.405 -19.944 -47.116 -20.827 QT
-45.827 -21.709 -44.249 -21.709 QT
-43.015 -21.709 -42.1 -21.288 QT
-41.186 -20.866 -40.593 -20.131 QT
-39.999 -19.397 -39.694 -18.397 QT
-39.39 -17.397 -39.39 -16.194 QT
-39.39 -15.834 -39.671 -15.834 QT
-47.483 -15.834 L
-47.483 -15.553 L
-47.483 -13.303 -46.577 -11.694 QT
-45.671 -10.084 -43.624 -10.084 QT
-42.796 -10.084 -42.093 -10.452 QT
-41.39 -10.819 -40.866 -11.483 QT
-40.343 -12.147 -40.171 -12.897 QT
-40.14 -12.991 -40.069 -13.061 QT
-39.999 -13.131 -39.905 -13.131 QT
-39.671 -13.131 L
-39.39 -13.131 -39.39 -12.788 QT
-39.765 -11.256 -41.03 -10.28 QT
-42.296 -9.303 -43.874 -9.303 QT
cp
-47.452 -16.506 M
-41.296 -16.506 L
-41.296 -17.522 -41.577 -18.561 QT
-41.858 -19.6 -42.522 -20.295 QT
-43.186 -20.991 -44.249 -20.991 QT
-45.78 -20.991 -46.616 -19.561 QT
-47.452 -18.131 -47.452 -16.506 QT
cp
f
GR
GS
[0.75 0 0 0.75 217.50021 25.5] CT
N
-38.038 -9.6 M
-38.038 -10.553 L
-37.116 -10.553 -36.522 -10.694 QT
-35.928 -10.834 -35.928 -11.413 QT
-35.928 -18.772 L
-35.928 -19.506 -36.147 -19.827 QT
-36.366 -20.147 -36.772 -20.217 QT
-37.178 -20.288 -38.038 -20.288 QT
-38.038 -21.241 L
-34.178 -21.538 L
-34.178 -18.897 L
-33.741 -20.069 -32.936 -20.803 QT
-32.131 -21.538 -30.991 -21.538 QT
-30.178 -21.538 -29.545 -21.061 QT
-28.913 -20.584 -28.913 -19.803 QT
-28.913 -19.319 -29.264 -18.952 QT
-29.616 -18.584 -30.131 -18.584 QT
-30.631 -18.584 -30.991 -18.944 QT
-31.35 -19.303 -31.35 -19.803 QT
-31.35 -20.522 -30.835 -20.834 QT
-30.991 -20.834 L
-32.085 -20.834 -32.772 -20.045 QT
-33.46 -19.256 -33.756 -18.077 QT
-34.053 -16.897 -34.053 -15.834 QT
-34.053 -11.413 L
-34.053 -10.553 -31.428 -10.553 QT
-31.428 -9.6 L
-38.038 -9.6 L
cp
f
GR
GS
[0.75 0 0 0.75 217.50021 25.5] CT
N
-27.218 -12.256 M
-27.218 -13.866 -25.953 -14.874 QT
-24.687 -15.881 -22.914 -16.295 QT
-21.14 -16.709 -19.546 -16.709 QT
-19.546 -17.819 L
-19.546 -18.584 -19.89 -19.319 QT
-20.234 -20.053 -20.874 -20.522 QT
-21.515 -20.991 -22.296 -20.991 QT
-24.093 -20.991 -25.031 -20.194 QT
-24.515 -20.194 -24.179 -19.803 QT
-23.843 -19.413 -23.843 -18.897 QT
-23.843 -18.35 -24.226 -17.967 QT
-24.609 -17.584 -25.124 -17.584 QT
-25.671 -17.584 -26.054 -17.967 QT
-26.437 -18.35 -26.437 -18.897 QT
-26.437 -20.319 -25.148 -21.014 QT
-23.859 -21.709 -22.296 -21.709 QT
-21.203 -21.709 -20.093 -21.241 QT
-18.984 -20.772 -18.281 -19.897 QT
-17.578 -19.022 -17.578 -17.866 QT
-17.578 -11.788 L
-17.578 -11.256 -17.351 -10.819 QT
-17.124 -10.381 -16.656 -10.381 QT
-16.203 -10.381 -15.984 -10.827 QT
-15.765 -11.272 -15.765 -11.788 QT
-15.765 -13.522 L
-14.984 -13.522 L
-14.984 -11.788 L
-14.984 -11.178 -15.296 -10.631 QT
-15.609 -10.084 -16.148 -9.764 QT
-16.687 -9.444 -17.296 -9.444 QT
-18.093 -9.444 -18.664 -10.053 QT
-19.234 -10.663 -19.312 -11.506 QT
-19.812 -10.491 -20.781 -9.897 QT
-21.749 -9.303 -22.859 -9.303 QT
-23.89 -9.303 -24.89 -9.6 QT
-25.89 -9.897 -26.554 -10.553 QT
-27.218 -11.209 -27.218 -12.256 QT
cp
-25.031 -12.256 M
-25.031 -11.303 -24.328 -10.655 QT
-23.624 -10.006 -22.687 -10.006 QT
-21.812 -10.006 -21.101 -10.444 QT
-20.39 -10.881 -19.968 -11.631 QT
-19.546 -12.381 -19.546 -13.209 QT
-19.546 -16.022 L
-20.765 -16.022 -22.054 -15.616 QT
-23.343 -15.209 -24.187 -14.358 QT
-25.031 -13.506 -25.031 -12.256 QT
cp
f
GR
GS
[0.75 0 0 0.75 217.50021 25.5] CT
N
-14.135 -9.6 M
-14.135 -10.553 L
-13.213 -10.553 -12.619 -10.694 QT
-12.025 -10.834 -12.025 -11.413 QT
-12.025 -25.584 L
-12.025 -26.303 -12.244 -26.624 QT
-12.463 -26.944 -12.869 -27.022 QT
-13.275 -27.1 -14.135 -27.1 QT
-14.135 -28.038 L
-10.119 -28.334 L
-10.119 -11.413 L
-10.119 -10.834 -9.525 -10.694 QT
-8.932 -10.553 -8.025 -10.553 QT
-8.025 -9.6 L
-14.135 -9.6 L
cp
f
GR
GS
[0.75 0 0 0.75 217.50021 25.5] CT
N
7.927 -9.6 M
3.99 -19.522 L
3.74 -20.022 3.216 -20.155 QT
2.693 -20.288 1.849 -20.288 QT
1.849 -21.241 L
7.521 -21.241 L
7.521 -20.288 L
6.005 -20.288 6.005 -19.647 QT
6.005 -19.538 6.021 -19.491 QT
9.052 -11.866 L
11.786 -18.756 L
11.865 -18.959 11.865 -19.178 QT
11.865 -19.694 11.474 -19.991 QT
11.083 -20.288 10.568 -20.288 QT
10.568 -21.241 L
15.052 -21.241 L
15.052 -20.288 L
14.208 -20.288 13.583 -19.905 QT
12.958 -19.522 12.615 -18.772 QT
8.974 -9.6 L
8.88 -9.303 8.552 -9.303 QT
8.349 -9.303 L
8.021 -9.303 7.927 -9.6 QT
cp
f
GR
GS
[0.75 0 0 0.75 217.50021 25.5] CT
N
21.385 -9.303 M
19.745 -9.303 18.37 -10.163 QT
16.995 -11.022 16.206 -12.467 QT
15.417 -13.913 15.417 -15.522 QT
15.417 -17.1 16.135 -18.522 QT
16.854 -19.944 18.143 -20.827 QT
19.432 -21.709 21.01 -21.709 QT
22.245 -21.709 23.159 -21.288 QT
24.073 -20.866 24.667 -20.131 QT
25.26 -19.397 25.565 -18.397 QT
25.87 -17.397 25.87 -16.194 QT
25.87 -15.834 25.589 -15.834 QT
17.776 -15.834 L
17.776 -15.553 L
17.776 -13.303 18.682 -11.694 QT
19.589 -10.084 21.635 -10.084 QT
22.464 -10.084 23.167 -10.452 QT
23.87 -10.819 24.393 -11.483 QT
24.917 -12.147 25.089 -12.897 QT
25.12 -12.991 25.19 -13.061 QT
25.26 -13.131 25.354 -13.131 QT
25.589 -13.131 L
25.87 -13.131 25.87 -12.788 QT
25.495 -11.256 24.229 -10.28 QT
22.964 -9.303 21.385 -9.303 QT
cp
17.807 -16.506 M
23.964 -16.506 L
23.964 -17.522 23.682 -18.561 QT
23.401 -19.6 22.737 -20.295 QT
22.073 -20.991 21.01 -20.991 QT
19.479 -20.991 18.643 -19.561 QT
17.807 -18.131 17.807 -16.506 QT
cp
f
GR
GS
[0.75 0 0 0.75 217.50021 25.5] CT
N
27.347 -9.6 M
27.347 -10.553 L
28.269 -10.553 28.862 -10.694 QT
29.456 -10.834 29.456 -11.413 QT
29.456 -25.584 L
29.456 -26.303 29.237 -26.624 QT
29.019 -26.944 28.612 -27.022 QT
28.206 -27.1 27.347 -27.1 QT
27.347 -28.038 L
31.362 -28.334 L
31.362 -11.413 L
31.362 -10.834 31.956 -10.694 QT
32.55 -10.553 33.456 -10.553 QT
33.456 -9.6 L
27.347 -9.6 L
cp
f
GR
GS
[0.75 0 0 0.75 217.50021 25.5] CT
N
40.676 -9.303 M
39.051 -9.303 37.668 -10.124 QT
36.285 -10.944 35.481 -12.327 QT
34.676 -13.709 34.676 -15.35 QT
34.676 -16.584 35.121 -17.733 QT
35.567 -18.881 36.387 -19.788 QT
37.207 -20.694 38.301 -21.202 QT
39.395 -21.709 40.676 -21.709 QT
42.332 -21.709 43.699 -20.827 QT
45.067 -19.944 45.856 -18.475 QT
46.645 -17.006 46.645 -15.35 QT
46.645 -13.725 45.84 -12.334 QT
45.035 -10.944 43.66 -10.124 QT
42.285 -9.303 40.676 -9.303 QT
cp
40.676 -10.084 M
42.832 -10.084 43.559 -11.655 QT
44.285 -13.225 44.285 -15.647 QT
44.285 -17.006 44.145 -17.897 QT
44.004 -18.788 43.504 -19.522 QT
43.207 -19.959 42.738 -20.295 QT
42.27 -20.631 41.746 -20.811 QT
41.223 -20.991 40.676 -20.991 QT
39.832 -20.991 39.074 -20.608 QT
38.317 -20.225 37.817 -19.522 QT
37.317 -18.756 37.176 -17.834 QT
37.035 -16.913 37.035 -15.647 QT
37.035 -14.131 37.301 -12.928 QT
37.567 -11.725 38.363 -10.905 QT
39.16 -10.084 40.676 -10.084 QT
cp
f
GR
GS
[0.75 0 0 0.75 217.50021 25.5] CT
N
54.719 -9.303 M
53.094 -9.303 51.758 -10.147 QT
50.422 -10.991 49.656 -12.413 QT
48.891 -13.834 48.891 -15.428 QT
48.891 -17.022 49.649 -18.483 QT
50.406 -19.944 51.75 -20.827 QT
53.094 -21.709 54.719 -21.709 QT
56.313 -21.709 57.609 -21.084 QT
58.906 -20.459 58.906 -19.053 QT
58.906 -18.522 58.531 -18.131 QT
58.156 -17.741 57.609 -17.741 QT
57.078 -17.741 56.695 -18.131 QT
56.313 -18.522 56.313 -19.053 QT
56.313 -19.522 56.617 -19.874 QT
56.922 -20.225 57.375 -20.319 QT
56.438 -20.913 54.75 -20.913 QT
53.453 -20.913 52.664 -20.053 QT
51.875 -19.194 51.563 -17.928 QT
51.25 -16.663 51.25 -15.428 QT
51.25 -14.116 51.633 -12.897 QT
52.016 -11.678 52.883 -10.881 QT
53.75 -10.084 55.047 -10.084 QT
56.328 -10.084 57.227 -10.874 QT
58.125 -11.663 58.453 -12.928 QT
58.453 -13.084 58.672 -13.084 QT
59 -13.084 L
59.078 -13.084 59.141 -13.006 QT
59.203 -12.928 59.203 -12.85 QT
59.203 -12.772 L
58.797 -11.163 57.586 -10.233 QT
56.375 -9.303 54.719 -9.303 QT
cp
f
GR
GS
[0.75 0 0 0.75 217.50021 25.5] CT
N
60.68 -9.6 M
60.68 -10.553 L
61.602 -10.553 62.196 -10.694 QT
62.789 -10.834 62.789 -11.413 QT
62.789 -18.772 L
62.789 -19.819 62.391 -20.053 QT
61.993 -20.288 60.805 -20.288 QT
60.805 -21.241 L
64.696 -21.538 L
64.696 -11.413 L
64.696 -10.834 65.204 -10.694 QT
65.711 -10.553 66.571 -10.553 QT
66.571 -9.6 L
60.68 -9.6 L
cp
61.836 -26.178 M
61.836 -26.772 62.282 -27.217 QT
62.727 -27.663 63.305 -27.663 QT
63.696 -27.663 64.047 -27.467 QT
64.399 -27.272 64.594 -26.913 QT
64.789 -26.553 64.789 -26.178 QT
64.789 -25.584 64.344 -25.139 QT
63.899 -24.694 63.305 -24.694 QT
62.727 -24.694 62.282 -25.139 QT
61.836 -25.584 61.836 -26.178 QT
cp
f
GR
GS
[0.75 0 0 0.75 217.50021 25.5] CT
N
70.009 -12.85 M
70.009 -20.288 L
67.775 -20.288 L
67.775 -20.991 L
69.541 -20.991 70.369 -22.639 QT
71.197 -24.288 71.197 -26.209 QT
71.978 -26.209 L
71.978 -21.241 L
75.791 -21.241 L
75.791 -20.288 L
71.978 -20.288 L
71.978 -12.897 L
71.978 -11.772 72.353 -10.928 QT
72.728 -10.084 73.713 -10.084 QT
74.634 -10.084 75.041 -10.975 QT
75.447 -11.866 75.447 -12.897 QT
75.447 -14.491 L
76.228 -14.491 L
76.228 -12.85 L
76.228 -12.006 75.916 -11.178 QT
75.603 -10.35 74.994 -9.827 QT
74.384 -9.303 73.525 -9.303 QT
71.9 -9.303 70.955 -10.272 QT
70.009 -11.241 70.009 -12.85 QT
cp
f
GR
GS
[0.75 0 0 0.75 217.50021 25.5] CT
N
78.748 -5.163 M
79.264 -4.756 79.889 -4.756 QT
81.577 -4.756 82.67 -7.334 QT
83.592 -9.6 L
79.545 -19.522 L
79.295 -20.022 78.78 -20.155 QT
78.264 -20.288 77.405 -20.288 QT
77.405 -21.241 L
83.077 -21.241 L
83.077 -20.288 L
81.577 -20.288 81.577 -19.647 QT
81.577 -19.538 81.608 -19.491 QT
84.608 -12.1 L
87.311 -18.756 L
87.389 -18.959 87.389 -19.209 QT
87.389 -19.538 87.217 -19.78 QT
87.045 -20.022 86.756 -20.155 QT
86.467 -20.288 86.123 -20.288 QT
86.123 -21.241 L
90.608 -21.241 L
90.608 -20.288 L
89.764 -20.288 89.139 -19.905 QT
88.514 -19.522 88.17 -18.772 QT
83.514 -7.334 L
83.139 -6.459 82.647 -5.733 QT
82.155 -5.006 81.444 -4.538 QT
80.733 -4.069 79.889 -4.069 QT
78.889 -4.069 78.147 -4.717 QT
77.405 -5.366 77.405 -6.334 QT
77.405 -6.834 77.748 -7.178 QT
78.092 -7.522 78.592 -7.522 QT
78.936 -7.522 79.202 -7.366 QT
79.467 -7.209 79.623 -6.952 QT
79.78 -6.694 79.78 -6.334 QT
79.78 -5.897 79.491 -5.553 QT
79.202 -5.209 78.748 -5.163 QT
cp
f
GR
GS
[0.75 0 0 0.75 0 0] CT
0.2 0.702 0.2 RC
1 LJ
0.667 LW
N
84.128 199 M
95.256 193.922 L
106.385 188.988 L
117.513 184.196 L
128.641 179.548 L
139.769 175.042 L
150.897 170.68 L
162.026 166.46 L
173.154 162.384 L
184.282 158.451 L
195.41 154.66 L
206.538 151.013 L
217.667 147.509 L
228.795 144.147 L
239.923 140.929 L
251.051 137.854 L
262.179 134.922 L
273.308 132.133 L
284.436 129.487 L
295.564 126.984 L
306.692 124.624 L
317.821 122.407 L
328.949 120.333 L
340.077 118.402 L
351.205 116.614 L
362.333 114.969 L
373.462 113.467 L
384.59 112.108 L
395.718 110.892 L
406.846 109.82 L
417.974 108.89 L
429.103 108.103 L
440.231 107.46 L
451.359 106.959 L
462.487 106.602 L
473.615 106.387 L
484.744 106.315 L
495.872 106.315 L
S
GR
GS
[0.75 0 0 0.75 0 0] CT
1 LJ
0.667 LW
N
84.128 199 M
95.256 199.623 L
106.385 200.23 L
117.513 200.82 L
128.641 201.394 L
139.769 201.951 L
150.897 202.491 L
162.026 203.015 L
173.154 203.522 L
184.282 204.012 L
195.41 204.486 L
206.538 204.943 L
217.667 205.383 L
228.795 205.807 L
239.923 206.215 L
251.051 206.605 L
262.179 206.979 L
273.308 207.337 L
284.436 207.677 L
295.564 208.002 L
306.692 208.309 L
317.821 208.6 L
328.949 208.874 L
340.077 209.132 L
351.205 209.373 L
362.333 209.597 L
373.462 209.805 L
384.59 209.996 L
395.718 210.171 L
406.846 210.329 L
417.974 210.47 L
429.103 210.595 L
440.231 210.703 L
451.359 210.794 L
462.487 210.869 L
473.615 210.927 L
484.744 210.969 L
495.872 210.994 L
S
GR
GS
[0.75 0 0 0.75 0 0] CT
0 0 1 RC
1 LJ
0.667 LW
N
84.128 199 M
95.256 221.923 L
106.385 242.672 L
117.513 261.246 L
128.641 277.647 L
139.769 291.873 L
150.897 303.925 L
162.026 313.803 L
173.154 321.507 L
184.282 327.036 L
195.41 330.392 L
206.538 331.573 L
217.667 330.58 L
228.795 327.413 L
239.923 322.072 L
251.051 314.556 L
262.179 304.866 L
273.308 293.003 L
284.436 278.965 L
295.564 262.753 L
306.692 245.909 L
317.821 229.975 L
328.949 214.952 L
340.077 200.84 L
351.205 187.638 L
362.333 175.346 L
373.462 163.965 L
384.59 153.495 L
395.718 143.935 L
406.846 135.285 L
417.974 127.546 L
429.103 120.717 L
440.231 114.799 L
451.359 109.791 L
462.487 105.694 L
473.615 102.508 L
484.744 100.231 L
495.872 98.866 L
S
GR
GS
[0.75 0 0 0.75 0 0] CT
0.6 0.2 0.2 RC
1 LJ
0.667 LW
N
84.128 199 M
95.256 176.705 L
106.385 156.183 L
117.513 137.433 L
128.641 120.456 L
139.769 105.251 L
150.897 91.819 L
162.026 80.16 L
173.154 70.273 L
184.282 62.158 L
195.41 55.816 L
206.538 51.247 L
217.667 48.45 L
228.795 47.425 L
239.923 48.173 L
251.051 50.694 L
262.179 54.987 L
273.308 61.053 L
284.436 68.891 L
295.564 78.502 L
306.692 88.343 L
317.821 96.871 L
328.949 104.088 L
340.077 109.993 L
351.205 114.585 L
362.333 117.865 L
373.462 119.834 L
384.59 120.49 L
395.718 120.49 L
406.846 120.49 L
417.974 120.49 L
429.103 120.49 L
440.231 120.49 L
451.359 120.49 L
462.487 120.49 L
473.615 120.49 L
484.744 120.49 L
495.872 120.49 L
S
GR
GS
[0.75 0 0 0.75 0 0] CT
1 GC
N
496 158 M
496 50 L
372 50 L
372 158 L
cp
f
GR
GS
[0.75 0 0 0.75 314.11361 48.61029] CT
N
0.672 5.12 M
0.672 4.386 L
2.547 4.386 2.984 3.136 QT
7.391 -9.693 L
7.453 -9.911 7.734 -9.911 QT
8 -9.911 L
8.281 -9.911 8.344 -9.693 QT
12.938 3.714 L
13.141 4.151 13.688 4.268 QT
14.234 4.386 15.047 4.386 QT
15.047 5.12 L
9.203 5.12 L
9.203 4.386 L
10.938 4.386 10.938 3.823 QT
10.938 3.714 L
9.797 0.432 L
4.703 0.432 L
3.766 3.136 L
3.75 3.214 3.75 3.354 QT
3.75 3.886 4.242 4.136 QT
4.734 4.386 5.313 4.386 QT
5.313 5.12 L
0.672 5.12 L
cp
4.953 -0.302 M
9.563 -0.302 L
7.25 -7.005 L
4.953 -0.302 L
cp
f
GR
GS
[0.75 0 0 0.75 314.11361 48.61029] CT
N
16.578 6.761 M
16.578 6.011 17.125 5.456 QT
17.672 4.901 18.422 4.651 QT
18 4.339 17.781 3.854 QT
17.563 3.37 17.563 2.839 QT
17.563 1.854 18.188 1.089 QT
17.219 0.151 17.219 -1.068 QT
17.219 -1.724 17.5 -2.302 QT
17.781 -2.88 18.289 -3.302 QT
18.797 -3.724 19.406 -3.943 QT
20.016 -4.161 20.672 -4.161 QT
21.922 -4.161 22.906 -3.427 QT
23.344 -3.896 23.93 -4.146 QT
24.516 -4.396 25.156 -4.396 QT
25.609 -4.396 25.898 -4.075 QT
26.188 -3.755 26.188 -3.302 QT
26.188 -3.036 25.992 -2.841 QT
25.797 -2.646 25.531 -2.646 QT
25.266 -2.646 25.07 -2.841 QT
24.875 -3.036 24.875 -3.302 QT
24.875 -3.693 25.141 -3.849 QT
24.047 -3.849 23.266 -3.099 QT
23.656 -2.708 23.883 -2.161 QT
24.109 -1.614 24.109 -1.068 QT
24.109 -0.177 23.617 0.534 QT
23.125 1.245 22.32 1.636 QT
21.516 2.026 20.672 2.026 QT
19.516 2.026 18.563 1.401 QT
18.266 1.823 18.266 2.323 QT
18.266 2.886 18.633 3.3 QT
19 3.714 19.547 3.714 QT
21.266 3.714 L
22.516 3.714 23.523 3.94 QT
24.531 4.167 25.211 4.846 QT
25.891 5.526 25.891 6.761 QT
25.891 7.682 25.117 8.292 QT
24.344 8.901 23.258 9.175 QT
22.172 9.448 21.25 9.448 QT
20.313 9.448 19.227 9.175 QT
18.141 8.901 17.359 8.292 QT
16.578 7.682 16.578 6.761 QT
cp
17.766 6.761 M
17.766 7.464 18.336 7.94 QT
18.906 8.417 19.719 8.651 QT
20.531 8.886 21.25 8.886 QT
21.953 8.886 22.766 8.651 QT
23.578 8.417 24.148 7.94 QT
24.719 7.464 24.719 6.761 QT
24.719 5.667 23.711 5.339 QT
22.703 5.011 21.266 5.011 QT
19.547 5.011 L
19.063 5.011 18.656 5.245 QT
18.25 5.479 18.008 5.893 QT
17.766 6.307 17.766 6.761 QT
cp
20.672 1.464 M
22.453 1.464 22.453 -1.068 QT
22.453 -2.177 22.07 -2.888 QT
21.688 -3.599 20.672 -3.599 QT
19.641 -3.599 19.258 -2.888 QT
18.875 -2.177 18.875 -1.068 QT
18.875 -0.38 19.023 0.182 QT
19.172 0.745 19.563 1.104 QT
19.953 1.464 20.672 1.464 QT
cp
f
GR
GS
[0.75 0 0 0.75 314.11361 48.61029] CT
N
31.901 5.354 M
30.62 5.354 29.55 4.682 QT
28.479 4.011 27.862 2.886 QT
27.245 1.761 27.245 0.511 QT
27.245 -0.708 27.807 -1.818 QT
28.37 -2.927 29.37 -3.607 QT
30.37 -4.286 31.604 -4.286 QT
32.557 -4.286 33.276 -3.966 QT
33.995 -3.646 34.456 -3.075 QT
34.917 -2.505 35.151 -1.724 QT
35.385 -0.943 35.385 -0.005 QT
35.385 0.276 35.167 0.276 QT
29.089 0.276 L
29.089 0.495 L
29.089 2.245 29.792 3.495 QT
30.495 4.745 32.089 4.745 QT
32.729 4.745 33.276 4.456 QT
33.823 4.167 34.229 3.651 QT
34.635 3.136 34.776 2.557 QT
34.792 2.479 34.854 2.425 QT
34.917 2.37 34.979 2.37 QT
35.167 2.37 L
35.385 2.37 35.385 2.636 QT
35.089 3.823 34.104 4.589 QT
33.12 5.354 31.901 5.354 QT
cp
29.104 -0.255 M
33.901 -0.255 L
33.901 -1.036 33.675 -1.849 QT
33.448 -2.661 32.94 -3.2 QT
32.432 -3.739 31.604 -3.739 QT
30.417 -3.739 29.76 -2.63 QT
29.104 -1.521 29.104 -0.255 QT
cp
f
GR
GS
[0.75 0 0 0.75 314.11361 48.61029] CT
N
36.773 5.12 M
36.773 4.386 L
37.492 4.386 37.953 4.268 QT
38.414 4.151 38.414 3.714 QT
38.414 -2.021 L
38.414 -2.583 38.242 -2.833 QT
38.07 -3.083 37.758 -3.138 QT
37.445 -3.193 36.773 -3.193 QT
36.773 -3.927 L
39.82 -4.161 L
39.82 -2.114 L
40.242 -3.005 41.07 -3.583 QT
41.898 -4.161 42.867 -4.161 QT
44.32 -4.161 45.054 -3.466 QT
45.789 -2.771 45.789 -1.333 QT
45.789 3.714 L
45.789 4.151 46.25 4.268 QT
46.711 4.386 47.429 4.386 QT
47.429 5.12 L
42.617 5.12 L
42.617 4.386 L
43.336 4.386 43.797 4.268 QT
44.258 4.151 44.258 3.714 QT
44.258 -1.271 L
44.258 -2.286 43.961 -2.95 QT
43.664 -3.614 42.742 -3.614 QT
41.523 -3.614 40.734 -2.638 QT
39.945 -1.661 39.945 -0.427 QT
39.945 3.714 L
39.945 4.151 40.414 4.268 QT
40.883 4.386 41.586 4.386 QT
41.586 5.12 L
36.773 5.12 L
cp
f
GR
GS
[0.75 0 0 0.75 314.11361 48.61029] CT
N
49.548 2.604 M
49.548 -3.193 L
47.814 -3.193 L
47.814 -3.739 L
49.189 -3.739 49.829 -5.021 QT
50.47 -6.302 50.47 -7.802 QT
51.079 -7.802 L
51.079 -3.927 L
54.048 -3.927 L
54.048 -3.193 L
51.079 -3.193 L
51.079 2.557 L
51.079 3.432 51.368 4.089 QT
51.657 4.745 52.423 4.745 QT
53.142 4.745 53.462 4.05 QT
53.782 3.354 53.782 2.557 QT
53.782 1.323 L
54.376 1.323 L
54.376 2.604 L
54.376 3.261 54.134 3.901 QT
53.892 4.542 53.423 4.948 QT
52.954 5.354 52.282 5.354 QT
51.017 5.354 50.282 4.604 QT
49.548 3.854 49.548 2.604 QT
cp
f
GR
GS
[0.75 0 0 0.75 314.11361 48.61029] CT
N
64.768 5.12 M
64.768 4.386 L
67.393 4.386 67.393 3.714 QT
67.393 -7.302 L
66.299 -6.786 64.643 -6.786 QT
64.643 -7.521 L
67.221 -7.521 68.534 -8.864 QT
68.831 -8.864 L
68.893 -8.864 68.963 -8.81 QT
69.034 -8.755 69.034 -8.677 QT
69.034 3.714 L
69.034 4.386 71.659 4.386 QT
71.659 5.12 L
64.768 5.12 L
cp
f
GR
GS
[0.75 0 0 0.75 0 0] CT
0.2 0.702 0.2 RC
1 LJ
0.667 LW
N
375.985 64.814 M
415.83 64.814 L
S
GR
GS
[0.75 0 0 0.75 314.11361 68.20343] CT
N
/f-597267615{0.672 5.12 M
0.672 4.386 L
2.547 4.386 2.984 3.136 QT
7.391 -9.693 L
7.453 -9.911 7.734 -9.911 QT
8 -9.911 L
8.281 -9.911 8.344 -9.693 QT
12.938 3.714 L
13.141 4.151 13.688 4.268 QT
14.234 4.386 15.047 4.386 QT
15.047 5.12 L
9.203 5.12 L
9.203 4.386 L
10.938 4.386 10.938 3.823 QT
10.938 3.714 L
9.797 0.432 L
4.703 0.432 L
3.766 3.136 L
3.75 3.214 3.75 3.354 QT
3.75 3.886 4.242 4.136 QT
4.734 4.386 5.313 4.386 QT
5.313 5.12 L
0.672 5.12 L
cp
4.953 -0.302 M
9.563 -0.302 L
7.25 -7.005 L
4.953 -0.302 L
cp}def
f-597267615
f
GR
GS
[0.75 0 0 0.75 314.11361 68.20343] CT
N
/f-745240314{16.578 6.761 M
16.578 6.011 17.125 5.456 QT
17.672 4.901 18.422 4.651 QT
18 4.339 17.781 3.854 QT
17.563 3.37 17.563 2.839 QT
17.563 1.854 18.188 1.089 QT
17.219 0.151 17.219 -1.068 QT
17.219 -1.724 17.5 -2.302 QT
17.781 -2.88 18.289 -3.302 QT
18.797 -3.724 19.406 -3.943 QT
20.016 -4.161 20.672 -4.161 QT
21.922 -4.161 22.906 -3.427 QT
23.344 -3.896 23.93 -4.146 QT
24.516 -4.396 25.156 -4.396 QT
25.609 -4.396 25.898 -4.075 QT
26.188 -3.755 26.188 -3.302 QT
26.188 -3.036 25.992 -2.841 QT
25.797 -2.646 25.531 -2.646 QT
25.266 -2.646 25.07 -2.841 QT
24.875 -3.036 24.875 -3.302 QT
24.875 -3.693 25.141 -3.849 QT
24.047 -3.849 23.266 -3.099 QT
23.656 -2.708 23.883 -2.161 QT
24.109 -1.614 24.109 -1.068 QT
24.109 -0.177 23.617 0.534 QT
23.125 1.245 22.32 1.636 QT
21.516 2.026 20.672 2.026 QT
19.516 2.026 18.563 1.401 QT
18.266 1.823 18.266 2.323 QT
18.266 2.886 18.633 3.3 QT
19 3.714 19.547 3.714 QT
21.266 3.714 L
22.516 3.714 23.523 3.94 QT
24.531 4.167 25.211 4.846 QT
25.891 5.526 25.891 6.761 QT
25.891 7.682 25.117 8.292 QT
24.344 8.901 23.258 9.175 QT
22.172 9.448 21.25 9.448 QT
20.313 9.448 19.227 9.175 QT
18.141 8.901 17.359 8.292 QT
16.578 7.682 16.578 6.761 QT
cp
17.766 6.761 M
17.766 7.464 18.336 7.94 QT
18.906 8.417 19.719 8.651 QT
20.531 8.886 21.25 8.886 QT
21.953 8.886 22.766 8.651 QT
23.578 8.417 24.148 7.94 QT
24.719 7.464 24.719 6.761 QT
24.719 5.667 23.711 5.339 QT
22.703 5.011 21.266 5.011 QT
19.547 5.011 L
19.063 5.011 18.656 5.245 QT
18.25 5.479 18.008 5.893 QT
17.766 6.307 17.766 6.761 QT
cp
20.672 1.464 M
22.453 1.464 22.453 -1.068 QT
22.453 -2.177 22.07 -2.888 QT
21.688 -3.599 20.672 -3.599 QT
19.641 -3.599 19.258 -2.888 QT
18.875 -2.177 18.875 -1.068 QT
18.875 -0.38 19.023 0.182 QT
19.172 0.745 19.563 1.104 QT
19.953 1.464 20.672 1.464 QT
cp}def
f-745240314
f
GR
GS
[0.75 0 0 0.75 314.11361 68.20343] CT
N
/f1964844890{31.901 5.354 M
30.62 5.354 29.55 4.682 QT
28.479 4.011 27.862 2.886 QT
27.245 1.761 27.245 0.511 QT
27.245 -0.708 27.807 -1.818 QT
28.37 -2.927 29.37 -3.607 QT
30.37 -4.286 31.604 -4.286 QT
32.557 -4.286 33.276 -3.966 QT
33.995 -3.646 34.456 -3.075 QT
34.917 -2.505 35.151 -1.724 QT
35.385 -0.943 35.385 -0.005 QT
35.385 0.276 35.167 0.276 QT
29.089 0.276 L
29.089 0.495 L
29.089 2.245 29.792 3.495 QT
30.495 4.745 32.089 4.745 QT
32.729 4.745 33.276 4.456 QT
33.823 4.167 34.229 3.651 QT
34.635 3.136 34.776 2.557 QT
34.792 2.479 34.854 2.425 QT
34.917 2.37 34.979 2.37 QT
35.167 2.37 L
35.385 2.37 35.385 2.636 QT
35.089 3.823 34.104 4.589 QT
33.12 5.354 31.901 5.354 QT
cp
29.104 -0.255 M
33.901 -0.255 L
33.901 -1.036 33.675 -1.849 QT
33.448 -2.661 32.94 -3.2 QT
32.432 -3.739 31.604 -3.739 QT
30.417 -3.739 29.76 -2.63 QT
29.104 -1.521 29.104 -0.255 QT
cp}def
f1964844890
f
GR
GS
[0.75 0 0 0.75 314.11361 68.20343] CT
N
/f1881606250{36.773 5.12 M
36.773 4.386 L
37.492 4.386 37.953 4.268 QT
38.414 4.151 38.414 3.714 QT
38.414 -2.021 L
38.414 -2.583 38.242 -2.833 QT
38.07 -3.083 37.758 -3.138 QT
37.445 -3.193 36.773 -3.193 QT
36.773 -3.927 L
39.82 -4.161 L
39.82 -2.114 L
40.242 -3.005 41.07 -3.583 QT
41.898 -4.161 42.867 -4.161 QT
44.32 -4.161 45.054 -3.466 QT
45.789 -2.771 45.789 -1.333 QT
45.789 3.714 L
45.789 4.151 46.25 4.268 QT
46.711 4.386 47.429 4.386 QT
47.429 5.12 L
42.617 5.12 L
42.617 4.386 L
43.336 4.386 43.797 4.268 QT
44.258 4.151 44.258 3.714 QT
44.258 -1.271 L
44.258 -2.286 43.961 -2.95 QT
43.664 -3.614 42.742 -3.614 QT
41.523 -3.614 40.734 -2.638 QT
39.945 -1.661 39.945 -0.427 QT
39.945 3.714 L
39.945 4.151 40.414 4.268 QT
40.883 4.386 41.586 4.386 QT
41.586 5.12 L
36.773 5.12 L
cp}def
f1881606250
f
GR
GS
[0.75 0 0 0.75 314.11361 68.20343] CT
N
/f-1218143468{49.548 2.604 M
49.548 -3.193 L
47.814 -3.193 L
47.814 -3.739 L
49.189 -3.739 49.829 -5.021 QT
50.47 -6.302 50.47 -7.802 QT
51.079 -7.802 L
51.079 -3.927 L
54.048 -3.927 L
54.048 -3.193 L
51.079 -3.193 L
51.079 2.557 L
51.079 3.432 51.368 4.089 QT
51.657 4.745 52.423 4.745 QT
53.142 4.745 53.462 4.05 QT
53.782 3.354 53.782 2.557 QT
53.782 1.323 L
54.376 1.323 L
54.376 2.604 L
54.376 3.261 54.134 3.901 QT
53.892 4.542 53.423 4.948 QT
52.954 5.354 52.282 5.354 QT
51.017 5.354 50.282 4.604 QT
49.548 3.854 49.548 2.604 QT
cp}def
f-1218143468
f
GR
GS
[0.75 0 0 0.75 314.11361 68.20343] CT
N
/f-1429999007{63.862 5.12 M
63.862 4.557 L
63.862 4.511 63.909 4.448 QT
67.159 0.839 L
67.909 0.026 68.37 -0.513 QT
68.831 -1.052 69.276 -1.763 QT
69.721 -2.474 69.987 -3.2 QT
70.252 -3.927 70.252 -4.755 QT
70.252 -5.614 69.932 -6.404 QT
69.612 -7.193 68.979 -7.661 QT
68.346 -8.13 67.456 -8.13 QT
66.549 -8.13 65.823 -7.583 QT
65.096 -7.036 64.799 -6.161 QT
64.877 -6.177 65.018 -6.177 QT
65.487 -6.177 65.823 -5.864 QT
66.159 -5.552 66.159 -5.036 QT
66.159 -4.568 65.823 -4.232 QT
65.487 -3.896 65.018 -3.896 QT
64.534 -3.896 64.198 -4.239 QT
63.862 -4.583 63.862 -5.036 QT
63.862 -5.833 64.159 -6.521 QT
64.456 -7.208 65.018 -7.747 QT
65.581 -8.286 66.276 -8.575 QT
66.971 -8.864 67.768 -8.864 QT
68.971 -8.864 70.002 -8.357 QT
71.034 -7.849 71.643 -6.919 QT
72.252 -5.989 72.252 -4.755 QT
72.252 -3.849 71.854 -3.029 QT
71.456 -2.208 70.831 -1.536 QT
70.206 -0.864 69.229 -0.013 QT
68.252 0.839 67.94 1.136 QT
65.565 3.417 L
67.581 3.417 L
69.065 3.417 70.065 3.393 QT
71.065 3.37 71.127 3.307 QT
71.377 3.042 71.627 1.37 QT
72.252 1.37 L
71.659 5.12 L
63.862 5.12 L
cp}def
f-1429999007
f
GR
GS
[0.75 0 0 0.75 0 0] CT
1 LJ
0.667 LW
N
375.985 90.938 M
415.83 90.938 L
S
GR
GS
[0.75 0 0 0.75 314.11361 87.79657] CT
N
f-597267615
f
GR
GS
[0.75 0 0 0.75 314.11361 87.79657] CT
N
f-745240314
f
GR
GS
[0.75 0 0 0.75 314.11361 87.79657] CT
N
f1964844890
f
GR
GS
[0.75 0 0 0.75 314.11361 87.79657] CT
N
f1881606250
f
GR
GS
[0.75 0 0 0.75 314.11361 87.79657] CT
N
f-1218143468
f
GR
GS
[0.75 0 0 0.75 314.11361 87.79657] CT
N
/f300774680{64.815 3.495 M
65.299 4.214 66.135 4.565 QT
66.971 4.917 67.924 4.917 QT
69.143 4.917 69.659 3.878 QT
70.174 2.839 70.174 1.511 QT
70.174 0.917 70.065 0.323 QT
69.956 -0.271 69.698 -0.786 QT
69.44 -1.302 68.995 -1.607 QT
68.549 -1.911 67.909 -1.911 QT
66.502 -1.911 L
66.315 -1.911 66.315 -2.114 QT
66.315 -2.286 L
66.315 -2.458 66.502 -2.458 QT
67.659 -2.552 L
68.409 -2.552 68.893 -3.107 QT
69.377 -3.661 69.604 -4.45 QT
69.831 -5.239 69.831 -5.958 QT
69.831 -6.974 69.362 -7.614 QT
68.893 -8.255 67.924 -8.255 QT
67.127 -8.255 66.393 -7.958 QT
65.659 -7.661 65.237 -7.036 QT
65.284 -7.052 65.307 -7.06 QT
65.331 -7.068 65.377 -7.068 QT
65.846 -7.068 66.166 -6.739 QT
66.487 -6.411 66.487 -5.943 QT
66.487 -5.489 66.166 -5.161 QT
65.846 -4.833 65.377 -4.833 QT
64.924 -4.833 64.596 -5.161 QT
64.268 -5.489 64.268 -5.943 QT
64.268 -6.849 64.807 -7.513 QT
65.346 -8.177 66.206 -8.521 QT
67.065 -8.864 67.924 -8.864 QT
68.565 -8.864 69.268 -8.677 QT
69.971 -8.489 70.549 -8.138 QT
71.127 -7.786 71.487 -7.232 QT
71.846 -6.677 71.846 -5.958 QT
71.846 -5.083 71.456 -4.333 QT
71.065 -3.583 70.377 -3.044 QT
69.69 -2.505 68.862 -2.239 QT
69.784 -2.052 70.604 -1.544 QT
71.424 -1.036 71.916 -0.232 QT
72.409 0.573 72.409 1.495 QT
72.409 2.651 71.776 3.589 QT
71.143 4.526 70.104 5.057 QT
69.065 5.589 67.924 5.589 QT
66.94 5.589 65.948 5.214 QT
64.956 4.839 64.323 4.089 QT
63.69 3.339 63.69 2.292 QT
63.69 1.761 64.041 1.417 QT
64.393 1.073 64.924 1.073 QT
65.252 1.073 65.534 1.229 QT
65.815 1.386 65.979 1.675 QT
66.143 1.964 66.143 2.292 QT
66.143 2.807 65.784 3.151 QT
65.424 3.495 64.924 3.495 QT
64.815 3.495 L
cp}def
f300774680
f
GR
GS
[0.75 0 0 0.75 0 0] CT
0 0 1 RC
1 LJ
0.667 LW
N
375.985 117.062 M
415.83 117.062 L
S
GR
GS
[0.75 0 0 0.75 314.11361 107.38971] CT
N
f-597267615
f
GR
GS
[0.75 0 0 0.75 314.11361 107.38971] CT
N
f-745240314
f
GR
GS
[0.75 0 0 0.75 314.11361 107.38971] CT
N
f1964844890
f
GR
GS
[0.75 0 0 0.75 314.11361 107.38971] CT
N
f1881606250
f
GR
GS
[0.75 0 0 0.75 314.11361 107.38971] CT
N
f-1218143468
f
GR
GS
[0.75 0 0 0.75 314.11361 107.38971] CT
N
/f-1674298674{63.393 1.651 M
63.393 0.917 L
69.893 -8.771 L
69.956 -8.864 70.112 -8.864 QT
70.409 -8.864 L
70.643 -8.864 70.643 -8.63 QT
70.643 0.917 L
72.706 0.917 L
72.706 1.651 L
70.643 1.651 L
70.643 3.714 L
70.643 4.151 71.26 4.268 QT
71.877 4.386 72.69 4.386 QT
72.69 5.12 L
66.909 5.12 L
66.909 4.386 L
67.721 4.386 68.331 4.268 QT
68.94 4.151 68.94 3.714 QT
68.94 1.651 L
63.393 1.651 L
cp
64.096 0.917 M
69.065 0.917 L
69.065 -6.521 L
64.096 0.917 L
cp}def
f-1674298674
f
GR
GS
[0.75 0 0 0.75 0 0] CT
0.6 0.2 0.2 RC
1 LJ
0.667 LW
N
375.985 143.186 M
415.83 143.186 L
S
GR
GS
[0.75 0 0 0.75 0 0] CT
0.149 GC
10.0 ML
0.667 LW
N
372 158 M
372 50 L
496 50 L
496 158 L
cp
S
GR
%%Trailer
%%Pages: 1
%%EOF
