%!PS-Adobe-3.0 EPSF-3.0
%%Creator: (MATLAB, The Mathworks, Inc. Version 9.12.0.2529717 \(R2022a\) Update 8. Operating System: Linux)
%%Title: plots/Example7a_v_abs.eps
%%CreationDate: 2024-07-04T10:29:44
%%Pages: (atend)
%%BoundingBox:    18     3   390   335
%%LanguageLevel: 3
%%EndComments
%%BeginProlog
%%BeginResource: procset (Apache XML Graphics Std ProcSet) 1.2 0
%%Version: 1.2 0
%%Copyright: (Copyright 2001-2003,2010 The Apache Software Foundation. License terms: http://www.apache.org/licenses/LICENSE-2.0)
/bd{bind def}bind def
/ld{load def}bd
/GR/grestore ld
/GS/gsave ld
/RM/rmoveto ld
/C/curveto ld
/t/show ld
/L/lineto ld
/ML/setmiterlimit ld
/CT/concat ld
/f/fill ld
/N/newpath ld
/S/stroke ld
/CC/setcmykcolor ld
/A/ashow ld
/cp/closepath ld
/RC/setrgbcolor ld
/LJ/setlinejoin ld
/GC/setgray ld
/LW/setlinewidth ld
/M/moveto ld
/re {4 2 roll M
1 index 0 rlineto
0 exch rlineto
neg 0 rlineto
cp } bd
/_ctm matrix def
/_tm matrix def
/BT { _ctm currentmatrix pop matrix _tm copy pop 0 0 moveto } bd
/ET { _ctm setmatrix } bd
/iTm { _ctm setmatrix _tm concat } bd
/Tm { _tm astore pop iTm 0 0 moveto } bd
/ux 0.0 def
/uy 0.0 def
/F {
  /Tp exch def
  /Tf exch def
  Tf findfont Tp scalefont setfont
  /cf Tf def  /cs Tp def
} bd
/ULS {currentpoint /uy exch def /ux exch def} bd
/ULE {
  /Tcx currentpoint pop def
  gsave
  newpath
  cf findfont cs scalefont dup
  /FontMatrix get 0 get /Ts exch def /FontInfo get dup
  /UnderlinePosition get Ts mul /To exch def
  /UnderlineThickness get Ts mul /Tt exch def
  ux uy To add moveto  Tcx uy To add lineto
  Tt setlinewidth stroke
  grestore
} bd
/OLE {
  /Tcx currentpoint pop def
  gsave
  newpath
  cf findfont cs scalefont dup
  /FontMatrix get 0 get /Ts exch def /FontInfo get dup
  /UnderlinePosition get Ts mul /To exch def
  /UnderlineThickness get Ts mul /Tt exch def
  ux uy To add cs add moveto Tcx uy To add cs add lineto
  Tt setlinewidth stroke
  grestore
} bd
/SOE {
  /Tcx currentpoint pop def
  gsave
  newpath
  cf findfont cs scalefont dup
  /FontMatrix get 0 get /Ts exch def /FontInfo get dup
  /UnderlinePosition get Ts mul /To exch def
  /UnderlineThickness get Ts mul /Tt exch def
  ux uy To add cs 10 mul 26 idiv add moveto Tcx uy To add cs 10 mul 26 idiv add lineto
  Tt setlinewidth stroke
  grestore
} bd
/QT {
/Y22 exch store
/X22 exch store
/Y21 exch store
/X21 exch store
currentpoint
/Y21 load 2 mul add 3 div exch
/X21 load 2 mul add 3 div exch
/X21 load 2 mul /X22 load add 3 div
/Y21 load 2 mul /Y22 load add 3 div
/X22 load /Y22 load curveto
} bd
/SSPD {
dup length /d exch dict def
{
/v exch def
/k exch def
currentpagedevice k known {
/cpdv currentpagedevice k get def
v cpdv ne {
/upd false def
/nullv v type /nulltype eq def
/nullcpdv cpdv type /nulltype eq def
nullv nullcpdv or
{
/upd true def
} {
/sametype v type cpdv type eq def
sametype {
v type /arraytype eq {
/vlen v length def
/cpdvlen cpdv length def
vlen cpdvlen eq {
0 1 vlen 1 sub {
/i exch def
/obj v i get def
/cpdobj cpdv i get def
obj cpdobj ne {
/upd true def
exit
} if
} for
} {
/upd true def
} ifelse
} {
v type /dicttype eq {
v {
/dv exch def
/dk exch def
/cpddv cpdv dk get def
dv cpddv ne {
/upd true def
exit
} if
} forall
} {
/upd true def
} ifelse
} ifelse
} if
} ifelse
upd true eq {
d k v put
} if
} if
} if
} forall
d length 0 gt {
d setpagedevice
} if
} bd
/RE { % /NewFontName [NewEncodingArray] /FontName RE -
  findfont dup length dict begin
  {
    1 index /FID ne
    {def} {pop pop} ifelse
  } forall
  /Encoding exch def
  /FontName 1 index def
  currentdict definefont pop
  end
} bind def
%%EndResource
%%BeginResource: procset (Apache XML Graphics EPS ProcSet) 1.0 0
%%Version: 1.0 0
%%Copyright: (Copyright 2002-2003 The Apache Software Foundation. License terms: http://www.apache.org/licenses/LICENSE-2.0)
/BeginEPSF { %def
/b4_Inc_state save def         % Save state for cleanup
/dict_count countdictstack def % Count objects on dict stack
/op_count count 1 sub def      % Count objects on operand stack
userdict begin                 % Push userdict on dict stack
/showpage { } def              % Redefine showpage, { } = null proc
0 setgray 0 setlinecap         % Prepare graphics state
1 setlinewidth 0 setlinejoin
10 setmiterlimit [ ] 0 setdash newpath
/languagelevel where           % If level not equal to 1 then
{pop languagelevel             % set strokeadjust and
1 ne                           % overprint to their defaults.
{false setstrokeadjust false setoverprint
} if
} if
} bd
/EndEPSF { %def
count op_count sub {pop} repeat            % Clean up stacks
countdictstack dict_count sub {end} repeat
b4_Inc_state restore
} bd
%%EndResource
%FOPBeginFontDict
%%IncludeResource: font Courier-Oblique
%%IncludeResource: font Courier-BoldOblique
%%IncludeResource: font Courier-Bold
%%IncludeResource: font ZapfDingbats
%%IncludeResource: font Symbol
%%IncludeResource: font Helvetica
%%IncludeResource: font Helvetica-Oblique
%%IncludeResource: font Helvetica-Bold
%%IncludeResource: font Helvetica-BoldOblique
%%IncludeResource: font Times-Roman
%%IncludeResource: font Times-Italic
%%IncludeResource: font Times-Bold
%%IncludeResource: font Times-BoldItalic
%%IncludeResource: font Courier
%FOPEndFontDict
%%BeginResource: encoding WinAnsiEncoding
/WinAnsiEncoding [
/.notdef /.notdef /.notdef /.notdef /.notdef
/.notdef /.notdef /.notdef /.notdef /.notdef
/.notdef /.notdef /.notdef /.notdef /.notdef
/.notdef /.notdef /.notdef /.notdef /.notdef
/.notdef /.notdef /.notdef /.notdef /.notdef
/.notdef /.notdef /.notdef /.notdef /.notdef
/.notdef /.notdef /space /exclam /quotedbl
/numbersign /dollar /percent /ampersand /quotesingle
/parenleft /parenright /asterisk /plus /comma
/hyphen /period /slash /zero /one
/two /three /four /five /six
/seven /eight /nine /colon /semicolon
/less /equal /greater /question /at
/A /B /C /D /E
/F /G /H /I /J
/K /L /M /N /O
/P /Q /R /S /T
/U /V /W /X /Y
/Z /bracketleft /backslash /bracketright /asciicircum
/underscore /quoteleft /a /b /c
/d /e /f /g /h
/i /j /k /l /m
/n /o /p /q /r
/s /t /u /v /w
/x /y /z /braceleft /bar
/braceright /asciitilde /bullet /Euro /bullet
/quotesinglbase /florin /quotedblbase /ellipsis /dagger
/daggerdbl /circumflex /perthousand /Scaron /guilsinglleft
/OE /bullet /Zcaron /bullet /bullet
/quoteleft /quoteright /quotedblleft /quotedblright /bullet
/endash /emdash /asciitilde /trademark /scaron
/guilsinglright /oe /bullet /zcaron /Ydieresis
/space /exclamdown /cent /sterling /currency
/yen /brokenbar /section /dieresis /copyright
/ordfeminine /guillemotleft /logicalnot /sfthyphen /registered
/macron /degree /plusminus /twosuperior /threesuperior
/acute /mu /paragraph /middot /cedilla
/onesuperior /ordmasculine /guillemotright /onequarter /onehalf
/threequarters /questiondown /Agrave /Aacute /Acircumflex
/Atilde /Adieresis /Aring /AE /Ccedilla
/Egrave /Eacute /Ecircumflex /Edieresis /Igrave
/Iacute /Icircumflex /Idieresis /Eth /Ntilde
/Ograve /Oacute /Ocircumflex /Otilde /Odieresis
/multiply /Oslash /Ugrave /Uacute /Ucircumflex
/Udieresis /Yacute /Thorn /germandbls /agrave
/aacute /acircumflex /atilde /adieresis /aring
/ae /ccedilla /egrave /eacute /ecircumflex
/edieresis /igrave /iacute /icircumflex /idieresis
/eth /ntilde /ograve /oacute /ocircumflex
/otilde /odieresis /divide /oslash /ugrave
/uacute /ucircumflex /udieresis /yacute /thorn
/ydieresis
] def
%%EndResource
%FOPBeginFontReencode
/Courier-Oblique findfont
dup length dict begin
  {1 index /FID ne {def} {pop pop} ifelse} forall
  /Encoding WinAnsiEncoding def
  currentdict
end
/Courier-Oblique exch definefont pop
/Courier-BoldOblique findfont
dup length dict begin
  {1 index /FID ne {def} {pop pop} ifelse} forall
  /Encoding WinAnsiEncoding def
  currentdict
end
/Courier-BoldOblique exch definefont pop
/Courier-Bold findfont
dup length dict begin
  {1 index /FID ne {def} {pop pop} ifelse} forall
  /Encoding WinAnsiEncoding def
  currentdict
end
/Courier-Bold exch definefont pop
/Helvetica findfont
dup length dict begin
  {1 index /FID ne {def} {pop pop} ifelse} forall
  /Encoding WinAnsiEncoding def
  currentdict
end
/Helvetica exch definefont pop
/Helvetica-Oblique findfont
dup length dict begin
  {1 index /FID ne {def} {pop pop} ifelse} forall
  /Encoding WinAnsiEncoding def
  currentdict
end
/Helvetica-Oblique exch definefont pop
/Helvetica-Bold findfont
dup length dict begin
  {1 index /FID ne {def} {pop pop} ifelse} forall
  /Encoding WinAnsiEncoding def
  currentdict
end
/Helvetica-Bold exch definefont pop
/Helvetica-BoldOblique findfont
dup length dict begin
  {1 index /FID ne {def} {pop pop} ifelse} forall
  /Encoding WinAnsiEncoding def
  currentdict
end
/Helvetica-BoldOblique exch definefont pop
/Times-Roman findfont
dup length dict begin
  {1 index /FID ne {def} {pop pop} ifelse} forall
  /Encoding WinAnsiEncoding def
  currentdict
end
/Times-Roman exch definefont pop
/Times-Italic findfont
dup length dict begin
  {1 index /FID ne {def} {pop pop} ifelse} forall
  /Encoding WinAnsiEncoding def
  currentdict
end
/Times-Italic exch definefont pop
/Times-Bold findfont
dup length dict begin
  {1 index /FID ne {def} {pop pop} ifelse} forall
  /Encoding WinAnsiEncoding def
  currentdict
end
/Times-Bold exch definefont pop
/Times-BoldItalic findfont
dup length dict begin
  {1 index /FID ne {def} {pop pop} ifelse} forall
  /Encoding WinAnsiEncoding def
  currentdict
end
/Times-BoldItalic exch definefont pop
/Courier findfont
dup length dict begin
  {1 index /FID ne {def} {pop pop} ifelse} forall
  /Encoding WinAnsiEncoding def
  currentdict
end
/Courier exch definefont pop
%FOPEndFontReencode
%%EndProlog
%%Page: 1 1
%%PageBoundingBox: 0 0 428 338
%%BeginPageSetup
N
   18     3 M
  408     3 L
  408   338 L
   18   338 L
cp
clip
[1 0 0 -1 0 338] CT
%%EndPageSetup
GS
[0.75 0 0 0.75 0 0.5] CT
N
0 0 M
570 0 L
570 450 L
0 450 L
0 0 L
cp
clip
1 GC
N
0 0 570 450 re
f
GR
GS
[0.75 0 0 0.75 0 0.5] CT
1 GC
N
0 0 570 450 re
f
GR
GS
[0.75 0 0 0.75 0 0.5] CT
1 GC
N
74 390 M
516 390 L
516 38 L
74 38 L
cp
f
GR
GS
[0.75 0 0 0.75 0 0.5] CT
0.873 GC
1 LJ
0.667 LW
N
74 390 M
74 38 L
S
GR
GS
[0.75 0 0 0.75 0 0.5] CT
0.873 GC
1 LJ
0.667 LW
N
114.182 390 M
114.182 38 L
S
GR
GS
[0.75 0 0 0.75 0 0.5] CT
0.873 GC
1 LJ
0.667 LW
N
154.364 390 M
154.364 38 L
S
GR
GS
[0.75 0 0 0.75 0 0.5] CT
0.873 GC
1 LJ
0.667 LW
N
194.545 390 M
194.545 38 L
S
GR
GS
[0.75 0 0 0.75 0 0.5] CT
0.873 GC
1 LJ
0.667 LW
N
234.727 390 M
234.727 38 L
S
GR
GS
[0.75 0 0 0.75 0 0.5] CT
0.873 GC
1 LJ
0.667 LW
N
274.909 390 M
274.909 38 L
S
GR
GS
[0.75 0 0 0.75 0 0.5] CT
0.873 GC
1 LJ
0.667 LW
N
315.091 390 M
315.091 38 L
S
GR
GS
[0.75 0 0 0.75 0 0.5] CT
0.873 GC
1 LJ
0.667 LW
N
355.273 390 M
355.273 38 L
S
GR
GS
[0.75 0 0 0.75 0 0.5] CT
0.873 GC
1 LJ
0.667 LW
N
395.455 390 M
395.455 38 L
S
GR
GS
[0.75 0 0 0.75 0 0.5] CT
0.873 GC
1 LJ
0.667 LW
N
435.636 390 M
435.636 38 L
S
GR
GS
[0.75 0 0 0.75 0 0.5] CT
0.873 GC
1 LJ
0.667 LW
N
475.818 390 M
475.818 38 L
S
GR
GS
[0.75 0 0 0.75 0 0.5] CT
0.873 GC
1 LJ
0.667 LW
N
516 390 M
516 38 L
S
GR
GS
[0.75 0 0 0.75 0 0.5] CT
0.873 GC
1 LJ
0.667 LW
N
516 390 M
74 390 L
S
GR
GS
[0.75 0 0 0.75 0 0.5] CT
0.873 GC
1 LJ
0.667 LW
N
516 350.889 M
74 350.889 L
S
GR
GS
[0.75 0 0 0.75 0 0.5] CT
0.873 GC
1 LJ
0.667 LW
N
516 311.778 M
74 311.778 L
S
GR
GS
[0.75 0 0 0.75 0 0.5] CT
0.873 GC
1 LJ
0.667 LW
N
516 272.667 M
74 272.667 L
S
GR
GS
[0.75 0 0 0.75 0 0.5] CT
0.873 GC
1 LJ
0.667 LW
N
516 233.556 M
74 233.556 L
S
GR
GS
[0.75 0 0 0.75 0 0.5] CT
0.873 GC
1 LJ
0.667 LW
N
516 194.444 M
74 194.444 L
S
GR
GS
[0.75 0 0 0.75 0 0.5] CT
0.873 GC
1 LJ
0.667 LW
N
516 155.333 M
74 155.333 L
S
GR
GS
[0.75 0 0 0.75 0 0.5] CT
0.873 GC
1 LJ
0.667 LW
N
516 116.222 M
74 116.222 L
S
GR
GS
[0.75 0 0 0.75 0 0.5] CT
0.873 GC
1 LJ
0.667 LW
N
516 77.111 M
74 77.111 L
S
GR
GS
[0.75 0 0 0.75 0 0.5] CT
0.873 GC
1 LJ
0.667 LW
N
516 38 M
74 38 L
S
GR
GS
[0.75 0 0 0.75 0 0.5] CT
0.149 GC
2 setlinecap
1 LJ
0.667 LW
N
74 390 M
516 390 L
S
GR
GS
[0.75 0 0 0.75 0 0.5] CT
0.149 GC
2 setlinecap
1 LJ
0.667 LW
N
74 390 M
74 385.58 L
S
GR
GS
[0.75 0 0 0.75 0 0.5] CT
0.149 GC
2 setlinecap
1 LJ
0.667 LW
N
114.182 390 M
114.182 385.58 L
S
GR
GS
[0.75 0 0 0.75 0 0.5] CT
0.149 GC
2 setlinecap
1 LJ
0.667 LW
N
154.364 390 M
154.364 385.58 L
S
GR
GS
[0.75 0 0 0.75 0 0.5] CT
0.149 GC
2 setlinecap
1 LJ
0.667 LW
N
194.545 390 M
194.545 385.58 L
S
GR
GS
[0.75 0 0 0.75 0 0.5] CT
0.149 GC
2 setlinecap
1 LJ
0.667 LW
N
234.727 390 M
234.727 385.58 L
S
GR
GS
[0.75 0 0 0.75 0 0.5] CT
0.149 GC
2 setlinecap
1 LJ
0.667 LW
N
274.909 390 M
274.909 385.58 L
S
GR
GS
[0.75 0 0 0.75 0 0.5] CT
0.149 GC
2 setlinecap
1 LJ
0.667 LW
N
315.091 390 M
315.091 385.58 L
S
GR
GS
[0.75 0 0 0.75 0 0.5] CT
0.149 GC
2 setlinecap
1 LJ
0.667 LW
N
355.273 390 M
355.273 385.58 L
S
GR
GS
[0.75 0 0 0.75 0 0.5] CT
0.149 GC
2 setlinecap
1 LJ
0.667 LW
N
395.455 390 M
395.455 385.58 L
S
GR
GS
[0.75 0 0 0.75 0 0.5] CT
0.149 GC
2 setlinecap
1 LJ
0.667 LW
N
435.636 390 M
435.636 385.58 L
S
GR
GS
[0.75 0 0 0.75 0 0.5] CT
0.149 GC
2 setlinecap
1 LJ
0.667 LW
N
475.818 390 M
475.818 385.58 L
S
GR
GS
[0.75 0 0 0.75 0 0.5] CT
0.149 GC
2 setlinecap
1 LJ
0.667 LW
N
516 390 M
516 385.58 L
S
GR
GS
[0.75 0 0 0.75 55.5 297.00001] CT
0.149 GC
/Helvetica 13.333 F
GS
[1 0 0 1 0 0] CT
-4 15 moveto 
1 -1 scale
(0) t 
GR
GR
GS
[0.75 0 0 0.75 85.63636 297.00001] CT
0.149 GC
/Helvetica 13.333 F
GS
[1 0 0 1 0 0] CT
-4 15 moveto 
1 -1 scale
(1) t 
GR
GR
GS
[0.75 0 0 0.75 115.77272 297.00001] CT
0.149 GC
/Helvetica 13.333 F
GS
[1 0 0 1 0 0] CT
-4 15 moveto 
1 -1 scale
(2) t 
GR
GR
GS
[0.75 0 0 0.75 145.90909 297.00001] CT
0.149 GC
/Helvetica 13.333 F
GS
[1 0 0 1 0 0] CT
-4 15 moveto 
1 -1 scale
(3) t 
GR
GR
GS
[0.75 0 0 0.75 176.04546 297.00001] CT
0.149 GC
/Helvetica 13.333 F
GS
[1 0 0 1 0 0] CT
-4 15 moveto 
1 -1 scale
(4) t 
GR
GR
GS
[0.75 0 0 0.75 206.18182 297.00001] CT
0.149 GC
/Helvetica 13.333 F
GS
[1 0 0 1 0 0] CT
-4 15 moveto 
1 -1 scale
(5) t 
GR
GR
GS
[0.75 0 0 0.75 236.31818 297.00001] CT
0.149 GC
/Helvetica 13.333 F
GS
[1 0 0 1 0 0] CT
-4 15 moveto 
1 -1 scale
(6) t 
GR
GR
GS
[0.75 0 0 0.75 266.45455 297.00001] CT
0.149 GC
/Helvetica 13.333 F
GS
[1 0 0 1 0 0] CT
-4 15 moveto 
1 -1 scale
(7) t 
GR
GR
GS
[0.75 0 0 0.75 296.59092 297.00001] CT
0.149 GC
/Helvetica 13.333 F
GS
[1 0 0 1 0 0] CT
-4 15 moveto 
1 -1 scale
(8) t 
GR
GR
GS
[0.75 0 0 0.75 326.72726 297.00001] CT
0.149 GC
/Helvetica 13.333 F
GS
[1 0 0 1 0 0] CT
-4 15 moveto 
1 -1 scale
(9) t 
GR
GR
GS
[0.75 0 0 0.75 356.86363 297.00001] CT
0.149 GC
/Helvetica 13.333 F
GS
[1 0 0 1 0 0] CT
-8 15 moveto 
1 -1 scale
(10) t 
GR
GR
GS
[0.75 0 0 0.75 387 297.00001] CT
0.149 GC
/Helvetica 13.333 F
GS
[1 0 0 1 0 0] CT
-8 15 moveto 
1 -1 scale
(11) t 
GR
GR
GS
[0.75 0 0 0.75 221.25016 311.49999] CT
0.149 GC
N
-74.637 22.296 M
-74.637 21.859 -74.544 21.484 QT
-72.45 13.156 L
-75.497 13.156 L
-75.794 13.156 -75.794 12.781 QT
-75.684 12.14 -75.419 12.14 QT
-72.2 12.14 L
-71.044 7.406 L
-70.919 7.031 -70.583 6.757 QT
-70.247 6.484 -69.825 6.484 QT
-69.45 6.484 -69.2 6.702 QT
-68.95 6.921 -68.95 7.296 QT
-68.95 7.374 -68.958 7.429 QT
-68.965 7.484 -68.981 7.531 QT
-70.153 12.14 L
-67.153 12.14 L
-66.856 12.14 -66.856 12.515 QT
-66.872 12.593 -66.919 12.765 QT
-66.965 12.937 -67.036 13.046 QT
-67.106 13.156 -67.247 13.156 QT
-70.403 13.156 L
-72.481 21.546 L
-72.7 22.359 -72.7 22.952 QT
-72.7 24.202 -71.84 24.202 QT
-70.575 24.202 -69.59 23.007 QT
-68.606 21.812 -68.075 20.374 QT
-67.965 20.202 -67.856 20.202 QT
-67.497 20.202 L
-67.387 20.202 -67.317 20.281 QT
-67.247 20.359 -67.247 20.468 QT
-67.247 20.515 -67.278 20.546 QT
-67.903 22.296 -69.122 23.632 QT
-70.34 24.968 -71.919 24.968 QT
-73.059 24.968 -73.848 24.218 QT
-74.637 23.468 -74.637 22.296 QT
cp
f
GR
GS
[0.75 0 0 0.75 221.25016 311.49999] CT
0.149 GC
N
-63.576 22.562 M
-63.576 22.015 -63.342 21.421 QT
-60.998 15.187 L
-60.623 14.124 -60.623 13.437 QT
-60.623 12.577 -61.248 12.577 QT
-62.404 12.577 -63.146 13.757 QT
-63.889 14.937 -64.248 16.406 QT
-64.295 16.577 -64.482 16.577 QT
-64.826 16.577 L
-65.06 16.577 -65.06 16.312 QT
-65.06 16.234 L
-64.592 14.499 -63.631 13.163 QT
-62.67 11.827 -61.201 11.827 QT
-60.17 11.827 -59.451 12.507 QT
-58.732 13.187 -58.732 14.234 QT
-58.732 14.765 -58.967 15.359 QT
-61.326 21.593 L
-61.717 22.562 -61.717 23.343 QT
-61.717 24.202 -61.06 24.202 QT
-59.92 24.202 -59.162 22.991 QT
-58.404 21.781 -58.092 20.374 QT
-58.045 20.202 -57.873 20.202 QT
-57.514 20.202 L
-57.404 20.202 -57.334 20.281 QT
-57.264 20.359 -57.264 20.468 QT
-57.264 20.484 -57.295 20.546 QT
-57.685 22.187 -58.67 23.577 QT
-59.654 24.968 -61.107 24.968 QT
-62.139 24.968 -62.857 24.265 QT
-63.576 23.562 -63.576 22.562 QT
cp
-60.31 7.062 M
-60.31 6.452 -59.795 5.96 QT
-59.279 5.468 -58.67 5.468 QT
-58.185 5.468 -57.865 5.773 QT
-57.545 6.077 -57.545 6.546 QT
-57.545 7.187 -58.06 7.679 QT
-58.576 8.171 -59.201 8.171 QT
-59.67 8.171 -59.99 7.851 QT
-60.31 7.531 -60.31 7.062 QT
cp
f
GR
GS
[0.75 0 0 0.75 221.25016 311.49999] CT
0.149 GC
N
-53.502 24.14 M
-53.502 23.968 -53.47 23.89 QT
-51.298 15.234 L
-51.095 14.437 -51.095 13.827 QT
-51.095 12.577 -51.939 12.577 QT
-52.845 12.577 -53.283 13.663 QT
-53.72 14.749 -54.142 16.406 QT
-54.142 16.484 -54.22 16.531 QT
-54.298 16.577 -54.377 16.577 QT
-54.72 16.577 L
-54.814 16.577 -54.884 16.476 QT
-54.955 16.374 -54.955 16.281 QT
-54.642 15.031 -54.353 14.148 QT
-54.064 13.265 -53.447 12.546 QT
-52.83 11.827 -51.908 11.827 QT
-50.83 11.827 -49.994 12.515 QT
-49.158 13.202 -49.158 14.265 QT
-48.283 13.124 -47.127 12.476 QT
-45.97 11.827 -44.658 11.827 QT
-43.283 11.827 -42.291 12.531 QT
-41.298 13.234 -41.298 14.515 QT
-40.408 13.249 -39.205 12.538 QT
-38.002 11.827 -36.595 11.827 QT
-35.095 11.827 -34.181 12.64 QT
-33.267 13.452 -33.267 14.952 QT
-33.267 16.14 -33.798 17.827 QT
-34.33 19.515 -35.111 21.593 QT
-35.533 22.593 -35.533 23.343 QT
-35.533 24.202 -34.845 24.202 QT
-33.72 24.202 -32.97 22.984 QT
-32.22 21.765 -31.908 20.374 QT
-31.814 20.202 -31.658 20.202 QT
-31.33 20.202 L
-31.205 20.202 -31.127 20.281 QT
-31.048 20.359 -31.048 20.468 QT
-31.048 20.484 -31.08 20.546 QT
-31.486 22.187 -32.47 23.577 QT
-33.455 24.968 -34.923 24.968 QT
-35.939 24.968 -36.658 24.265 QT
-37.377 23.562 -37.377 22.562 QT
-37.377 22.046 -37.142 21.421 QT
-36.33 19.249 -35.783 17.531 QT
-35.236 15.812 -35.236 14.515 QT
-35.236 13.702 -35.556 13.14 QT
-35.877 12.577 -36.642 12.577 QT
-38.236 12.577 -39.392 13.546 QT
-40.548 14.515 -41.408 16.109 QT
-41.455 16.406 -41.486 16.562 QT
-43.361 23.999 L
-43.455 24.406 -43.806 24.687 QT
-44.158 24.968 -44.58 24.968 QT
-44.923 24.968 -45.181 24.741 QT
-45.439 24.515 -45.439 24.14 QT
-45.439 23.968 -45.408 23.89 QT
-43.564 16.499 L
-43.267 15.312 -43.267 14.515 QT
-43.267 13.702 -43.595 13.14 QT
-43.923 12.577 -44.72 12.577 QT
-45.783 12.577 -46.673 13.046 QT
-47.564 13.515 -48.228 14.281 QT
-48.892 15.046 -49.455 16.109 QT
-51.423 23.999 L
-51.517 24.406 -51.861 24.687 QT
-52.205 24.968 -52.642 24.968 QT
-52.986 24.968 -53.244 24.741 QT
-53.502 24.515 -53.502 24.14 QT
cp
f
GR
GS
[0.75 0 0 0.75 221.25016 311.49999] CT
0.149 GC
N
-24.153 24.968 M
-25.528 24.968 -26.575 24.241 QT
-27.621 23.515 -28.161 22.296 QT
-28.7 21.077 -28.7 19.718 QT
-28.7 17.64 -27.661 15.82 QT
-26.621 13.999 -24.84 12.913 QT
-23.059 11.827 -21.012 11.827 QT
-19.778 11.827 -18.848 12.468 QT
-17.918 13.109 -17.918 14.312 QT
-17.918 15.984 -19.246 16.796 QT
-20.575 17.609 -22.246 17.804 QT
-23.918 17.999 -25.95 17.999 QT
-26.028 17.999 L
-26.496 19.734 -26.496 20.952 QT
-26.496 22.249 -25.903 23.226 QT
-25.309 24.202 -24.09 24.202 QT
-22.356 24.202 -20.77 23.406 QT
-19.184 22.609 -18.168 21.218 QT
-18.09 21.124 -17.95 21.124 QT
-17.809 21.124 -17.661 21.288 QT
-17.512 21.452 -17.512 21.593 QT
-17.512 21.702 -17.559 21.765 QT
-18.621 23.249 -20.418 24.109 QT
-22.215 24.968 -24.153 24.968 QT
cp
-25.856 17.249 M
-24.168 17.249 -22.739 17.093 QT
-21.309 16.937 -20.153 16.304 QT
-18.996 15.671 -18.996 14.343 QT
-18.996 13.812 -19.293 13.406 QT
-19.59 12.999 -20.067 12.788 QT
-20.543 12.577 -21.043 12.577 QT
-22.278 12.577 -23.262 13.241 QT
-24.246 13.906 -24.887 14.976 QT
-25.528 16.046 -25.856 17.249 QT
cp
f
GR
GS
[0.75 0 0 0.75 221.25016 311.49999] CT
0.149 GC
N
-13.807 22.874 M
-13.026 24.202 -10.666 24.202 QT
-9.651 24.202 -8.729 23.851 QT
-7.807 23.499 -7.205 22.812 QT
-6.604 22.124 -6.604 21.124 QT
-6.604 20.374 -7.143 19.898 QT
-7.682 19.421 -8.463 19.249 QT
-10.041 18.937 L
-11.104 18.671 -11.799 17.929 QT
-12.494 17.187 -12.494 16.14 QT
-12.494 14.859 -11.799 13.866 QT
-11.104 12.874 -9.955 12.351 QT
-8.807 11.827 -7.572 11.827 QT
-6.26 11.827 -5.213 12.452 QT
-4.166 13.077 -4.166 14.312 QT
-4.166 14.984 -4.541 15.491 QT
-4.916 15.999 -5.588 15.999 QT
-5.979 15.999 -6.252 15.749 QT
-6.526 15.499 -6.526 15.124 QT
-6.526 14.781 -6.33 14.46 QT
-6.135 14.14 -5.822 13.952 QT
-5.51 13.765 -5.166 13.765 QT
-5.416 13.14 -6.119 12.859 QT
-6.822 12.577 -7.635 12.577 QT
-8.369 12.577 -9.104 12.874 QT
-9.838 13.171 -10.283 13.741 QT
-10.729 14.312 -10.729 15.093 QT
-10.729 15.624 -10.362 16.015 QT
-9.994 16.406 -9.447 16.577 QT
-7.776 16.921 L
-6.963 17.093 -6.291 17.523 QT
-5.619 17.952 -5.229 18.616 QT
-4.838 19.281 -4.838 20.124 QT
-4.838 21.202 -5.44 22.249 QT
-6.041 23.296 -6.916 23.921 QT
-8.463 24.968 -10.697 24.968 QT
-12.244 24.968 -13.533 24.257 QT
-14.822 23.546 -14.822 22.14 QT
-14.822 21.359 -14.362 20.773 QT
-13.901 20.187 -13.104 20.187 QT
-12.635 20.187 -12.322 20.468 QT
-12.01 20.749 -12.01 21.218 QT
-12.01 21.874 -12.502 22.374 QT
-12.994 22.874 -13.666 22.874 QT
-13.807 22.874 L
cp
f
GR
GS
[0.75 0 0 0.75 221.25016 311.49999] CT
0.149 GC
N
2.474 24.968 M
0.646 24.968 -0.408 23.585 QT
-1.463 22.202 -1.463 20.327 QT
-1.463 18.468 -0.502 16.468 QT
0.459 14.468 2.092 13.148 QT
3.724 11.827 5.615 11.827 QT
6.474 11.827 7.154 12.296 QT
7.834 12.765 8.224 13.562 QT
8.537 12.406 9.49 12.406 QT
9.865 12.406 10.107 12.624 QT
10.349 12.843 10.349 13.218 QT
10.349 13.296 10.349 13.343 QT
10.349 13.39 10.334 13.437 QT
8.303 21.546 L
8.099 22.406 8.099 22.952 QT
8.099 24.202 8.943 24.202 QT
9.849 24.202 10.326 23.046 QT
10.803 21.89 11.115 20.374 QT
11.178 20.202 11.349 20.202 QT
11.709 20.202 L
11.818 20.202 11.888 20.304 QT
11.959 20.406 11.959 20.484 QT
11.443 22.515 10.842 23.741 QT
10.24 24.968 8.881 24.968 QT
7.912 24.968 7.162 24.39 QT
6.412 23.812 6.224 22.874 QT
4.349 24.968 2.474 24.968 QT
cp
2.49 24.202 M
3.553 24.202 4.529 23.413 QT
5.506 22.624 6.224 21.562 QT
6.256 21.546 6.256 21.484 QT
7.803 15.187 L
7.834 15.093 L
7.662 14.062 7.092 13.32 QT
6.521 12.577 5.537 12.577 QT
4.568 12.577 3.724 13.374 QT
2.881 14.171 2.303 15.265 QT
1.74 16.421 1.217 18.452 QT
0.693 20.484 0.693 21.593 QT
0.693 22.593 1.131 23.398 QT
1.568 24.202 2.49 24.202 QT
cp
f
GR
GS
[0.75 0 0 0.75 221.25016 311.49999] CT
0.149 GC
N
15.167 24.14 M
15.167 23.968 15.198 23.89 QT
17.37 15.234 L
17.573 14.437 17.573 13.827 QT
17.573 12.577 16.73 12.577 QT
15.823 12.577 15.386 13.663 QT
14.948 14.749 14.527 16.406 QT
14.527 16.484 14.448 16.531 QT
14.37 16.577 14.292 16.577 QT
13.948 16.577 L
13.855 16.577 13.784 16.476 QT
13.714 16.374 13.714 16.281 QT
14.027 15.031 14.316 14.148 QT
14.605 13.265 15.222 12.546 QT
15.839 11.827 16.761 11.827 QT
17.839 11.827 18.675 12.515 QT
19.511 13.202 19.511 14.265 QT
20.386 13.124 21.542 12.476 QT
22.698 11.827 24.011 11.827 QT
25.386 11.827 26.378 12.531 QT
27.37 13.234 27.37 14.515 QT
28.261 13.249 29.464 12.538 QT
30.667 11.827 32.073 11.827 QT
33.573 11.827 34.487 12.64 QT
35.402 13.452 35.402 14.952 QT
35.402 16.14 34.87 17.827 QT
34.339 19.515 33.558 21.593 QT
33.136 22.593 33.136 23.343 QT
33.136 24.202 33.823 24.202 QT
34.948 24.202 35.698 22.984 QT
36.448 21.765 36.761 20.374 QT
36.855 20.202 37.011 20.202 QT
37.339 20.202 L
37.464 20.202 37.542 20.281 QT
37.62 20.359 37.62 20.468 QT
37.62 20.484 37.589 20.546 QT
37.183 22.187 36.198 23.577 QT
35.214 24.968 33.745 24.968 QT
32.73 24.968 32.011 24.265 QT
31.292 23.562 31.292 22.562 QT
31.292 22.046 31.527 21.421 QT
32.339 19.249 32.886 17.531 QT
33.433 15.812 33.433 14.515 QT
33.433 13.702 33.112 13.14 QT
32.792 12.577 32.027 12.577 QT
30.433 12.577 29.277 13.546 QT
28.12 14.515 27.261 16.109 QT
27.214 16.406 27.183 16.562 QT
25.308 23.999 L
25.214 24.406 24.862 24.687 QT
24.511 24.968 24.089 24.968 QT
23.745 24.968 23.487 24.741 QT
23.23 24.515 23.23 24.14 QT
23.23 23.968 23.261 23.89 QT
25.105 16.499 L
25.402 15.312 25.402 14.515 QT
25.402 13.702 25.073 13.14 QT
24.745 12.577 23.948 12.577 QT
22.886 12.577 21.995 13.046 QT
21.105 13.515 20.441 14.281 QT
19.777 15.046 19.214 16.109 QT
17.245 23.999 L
17.152 24.406 16.808 24.687 QT
16.464 24.968 16.027 24.968 QT
15.683 24.968 15.425 24.741 QT
15.167 24.515 15.167 24.14 QT
cp
f
GR
GS
[0.75 0 0 0.75 221.25016 311.49999] CT
0.149 GC
N
37.969 30.265 M
37.703 30.265 37.703 29.89 QT
37.797 29.249 38.078 29.249 QT
38.985 29.249 39.344 29.093 QT
39.703 28.937 39.907 28.265 QT
43.172 15.202 L
43.391 14.671 43.391 13.827 QT
43.391 12.577 42.547 12.577 QT
41.641 12.577 41.196 13.663 QT
40.75 14.749 40.344 16.406 QT
40.344 16.577 40.11 16.577 QT
39.766 16.577 L
39.688 16.577 39.602 16.476 QT
39.516 16.374 39.516 16.281 QT
39.828 15.031 40.125 14.148 QT
40.422 13.265 41.032 12.546 QT
41.641 11.827 42.563 11.827 QT
43.563 11.827 44.313 12.382 QT
45.063 12.937 45.266 13.906 QT
46.063 12.984 47.024 12.406 QT
47.985 11.827 49.016 11.827 QT
50.235 11.827 51.133 12.476 QT
52.032 13.124 52.485 14.179 QT
52.938 15.234 52.938 16.452 QT
52.938 18.327 51.977 20.32 QT
51.016 22.312 49.383 23.64 QT
47.75 24.968 45.875 24.968 QT
45.032 24.968 44.344 24.484 QT
43.657 23.999 43.282 23.218 QT
41.953 28.374 L
41.891 28.796 41.875 28.874 QT
41.875 29.249 43.782 29.249 QT
44.078 29.249 44.078 29.624 QT
43.985 29.999 43.922 30.132 QT
43.86 30.265 43.594 30.265 QT
37.969 30.265 L
cp
45.907 24.202 M
46.922 24.202 47.782 23.374 QT
48.641 22.546 49.188 21.515 QT
49.578 20.734 49.922 19.609 QT
50.266 18.484 50.524 17.21 QT
50.782 15.937 50.782 15.187 QT
50.782 14.515 50.602 13.937 QT
50.422 13.359 50.024 12.968 QT
49.625 12.577 48.953 12.577 QT
47.891 12.577 46.953 13.335 QT
46.016 14.093 45.25 15.202 QT
45.25 15.312 L
43.641 21.702 L
43.844 22.749 44.407 23.476 QT
44.969 24.202 45.907 24.202 QT
cp
f
GR
GS
[0.75 0 0 0.75 221.25016 311.49999] CT
0.149 GC
N
54.727 22.296 M
54.727 22.202 54.743 22.031 QT
54.759 21.859 54.782 21.702 QT
54.806 21.546 54.806 21.452 QT
58.399 7.093 L
58.509 6.593 58.54 6.312 QT
58.54 5.843 56.665 5.843 QT
56.384 5.843 56.384 5.468 QT
56.399 5.39 56.446 5.21 QT
56.493 5.031 56.571 4.929 QT
56.649 4.827 56.79 4.827 QT
60.696 4.515 L
61.056 4.515 61.056 4.89 QT
56.868 21.562 L
56.665 22.031 56.665 22.952 QT
56.665 24.202 57.509 24.202 QT
58.399 24.202 58.845 23.093 QT
59.29 21.984 59.649 20.374 QT
59.712 20.202 59.884 20.202 QT
60.227 20.202 L
60.337 20.202 60.415 20.296 QT
60.493 20.39 60.493 20.484 QT
60.165 21.89 59.884 22.702 QT
59.602 23.515 58.993 24.241 QT
58.384 24.968 57.446 24.968 QT
56.29 24.968 55.509 24.218 QT
54.727 23.468 54.727 22.296 QT
cp
f
GR
GS
[0.75 0 0 0.75 221.25016 311.49999] CT
0.149 GC
N
68.604 24.968 M
67.229 24.968 66.182 24.241 QT
65.135 23.515 64.596 22.296 QT
64.057 21.077 64.057 19.718 QT
64.057 17.64 65.096 15.82 QT
66.135 13.999 67.916 12.913 QT
69.698 11.827 71.745 11.827 QT
72.979 11.827 73.909 12.468 QT
74.838 13.109 74.838 14.312 QT
74.838 15.984 73.51 16.796 QT
72.182 17.609 70.51 17.804 QT
68.838 17.999 66.807 17.999 QT
66.729 17.999 L
66.26 19.734 66.26 20.952 QT
66.26 22.249 66.854 23.226 QT
67.448 24.202 68.666 24.202 QT
70.401 24.202 71.987 23.406 QT
73.573 22.609 74.588 21.218 QT
74.666 21.124 74.807 21.124 QT
74.948 21.124 75.096 21.288 QT
75.245 21.452 75.245 21.593 QT
75.245 21.702 75.198 21.765 QT
74.135 23.249 72.338 24.109 QT
70.541 24.968 68.604 24.968 QT
cp
66.901 17.249 M
68.588 17.249 70.018 17.093 QT
71.448 16.937 72.604 16.304 QT
73.76 15.671 73.76 14.343 QT
73.76 13.812 73.463 13.406 QT
73.166 12.999 72.69 12.788 QT
72.213 12.577 71.713 12.577 QT
70.479 12.577 69.495 13.241 QT
68.51 13.906 67.87 14.976 QT
67.229 16.046 66.901 17.249 QT
cp
f
GR
GS
[0.75 0 0 0.75 0 0.5] CT
0.149 GC
2 setlinecap
1 LJ
0.667 LW
N
74 390 M
74 38 L
S
GR
GS
[0.75 0 0 0.75 0 0.5] CT
0.149 GC
2 setlinecap
1 LJ
0.667 LW
N
74 390 M
78.42 390 L
S
GR
GS
[0.75 0 0 0.75 0 0.5] CT
0.149 GC
2 setlinecap
1 LJ
0.667 LW
N
74 350.889 M
78.42 350.889 L
S
GR
GS
[0.75 0 0 0.75 0 0.5] CT
0.149 GC
2 setlinecap
1 LJ
0.667 LW
N
74 311.778 M
78.42 311.778 L
S
GR
GS
[0.75 0 0 0.75 0 0.5] CT
0.149 GC
2 setlinecap
1 LJ
0.667 LW
N
74 272.667 M
78.42 272.667 L
S
GR
GS
[0.75 0 0 0.75 0 0.5] CT
0.149 GC
2 setlinecap
1 LJ
0.667 LW
N
74 233.556 M
78.42 233.556 L
S
GR
GS
[0.75 0 0 0.75 0 0.5] CT
0.149 GC
2 setlinecap
1 LJ
0.667 LW
N
74 194.444 M
78.42 194.444 L
S
GR
GS
[0.75 0 0 0.75 0 0.5] CT
0.149 GC
2 setlinecap
1 LJ
0.667 LW
N
74 155.333 M
78.42 155.333 L
S
GR
GS
[0.75 0 0 0.75 0 0.5] CT
0.149 GC
2 setlinecap
1 LJ
0.667 LW
N
74 116.222 M
78.42 116.222 L
S
GR
GS
[0.75 0 0 0.75 0 0.5] CT
0.149 GC
2 setlinecap
1 LJ
0.667 LW
N
74 77.111 M
78.42 77.111 L
S
GR
GS
[0.75 0 0 0.75 0 0.5] CT
0.149 GC
2 setlinecap
1 LJ
0.667 LW
N
74 38 M
78.42 38 L
S
GR
GS
[0.75 0 0 0.75 51.5 293] CT
0.149 GC
/Helvetica 13.333 F
GS
[1 0 0 1 0 0] CT
-8 5.5 moveto 
1 -1 scale
(0) t 
GR
GR
GS
[0.75 0 0 0.75 51.5 263.66666] CT
0.149 GC
/Helvetica 13.333 F
GS
[1 0 0 1 0 0] CT
-8 5.5 moveto 
1 -1 scale
(1) t 
GR
GR
GS
[0.75 0 0 0.75 51.5 234.33333] CT
0.149 GC
/Helvetica 13.333 F
GS
[1 0 0 1 0 0] CT
-8 5.5 moveto 
1 -1 scale
(2) t 
GR
GR
GS
[0.75 0 0 0.75 51.5 204.99999] CT
0.149 GC
/Helvetica 13.333 F
GS
[1 0 0 1 0 0] CT
-8 5.5 moveto 
1 -1 scale
(3) t 
GR
GR
GS
[0.75 0 0 0.75 51.5 175.66667] CT
0.149 GC
/Helvetica 13.333 F
GS
[1 0 0 1 0 0] CT
-8 5.5 moveto 
1 -1 scale
(4) t 
GR
GR
GS
[0.75 0 0 0.75 51.5 146.33333] CT
0.149 GC
/Helvetica 13.333 F
GS
[1 0 0 1 0 0] CT
-8 5.5 moveto 
1 -1 scale
(5) t 
GR
GR
GS
[0.75 0 0 0.75 51.5 117] CT
0.149 GC
/Helvetica 13.333 F
GS
[1 0 0 1 0 0] CT
-8 5.5 moveto 
1 -1 scale
(6) t 
GR
GR
GS
[0.75 0 0 0.75 51.5 87.66667] CT
0.149 GC
/Helvetica 13.333 F
GS
[1 0 0 1 0 0] CT
-8 5.5 moveto 
1 -1 scale
(7) t 
GR
GR
GS
[0.75 0 0 0.75 51.5 58.33334] CT
0.149 GC
/Helvetica 13.333 F
GS
[1 0 0 1 0 0] CT
-8 5.5 moveto 
1 -1 scale
(8) t 
GR
GR
GS
[0.75 0 0 0.75 51.5 29] CT
0.149 GC
/Helvetica 13.333 F
GS
[1 0 0 1 0 0] CT
-8 5.5 moveto 
1 -1 scale
(9) t 
GR
GR
GS
[0 -0.75 0.75 0 42.5 160.99987] CT
0.149 GC
N
-54.628 -13.826 M
-54.628 -14.482 -54.472 -15.263 QT
-54.316 -16.044 -54.16 -16.544 QT
-54.003 -17.044 -53.449 -18.505 QT
-52.894 -19.966 -52.878 -20.013 QT
-52.503 -21.076 -52.503 -21.763 QT
-52.503 -22.623 -53.128 -22.623 QT
-54.285 -22.623 -55.027 -21.443 QT
-55.769 -20.263 -56.128 -18.794 QT
-56.175 -18.623 -56.363 -18.623 QT
-56.706 -18.623 L
-56.941 -18.623 -56.941 -18.888 QT
-56.941 -18.966 L
-56.472 -20.701 -55.511 -22.037 QT
-54.55 -23.373 -53.081 -23.373 QT
-52.05 -23.373 -51.331 -22.693 QT
-50.613 -22.013 -50.613 -20.966 QT
-50.613 -20.435 -50.847 -19.841 QT
-51.425 -18.357 -51.746 -17.474 QT
-52.066 -16.591 -52.347 -15.498 QT
-52.628 -14.404 -52.628 -13.466 QT
-52.628 -12.373 -52.121 -11.685 QT
-51.613 -10.998 -50.55 -10.998 QT
-48.55 -10.998 -46.925 -14.107 QT
-46.425 -15.107 -45.972 -16.466 QT
-45.519 -17.826 -45.519 -18.669 QT
-45.519 -19.544 -45.8 -20.037 QT
-46.081 -20.529 -46.535 -21.06 QT
-46.988 -21.591 -46.988 -21.904 QT
-46.988 -22.466 -46.519 -22.935 QT
-46.05 -23.404 -45.488 -23.404 QT
-44.8 -23.404 -44.496 -22.763 QT
-44.191 -22.123 -44.191 -21.326 QT
-44.191 -20.357 -44.464 -19.029 QT
-44.738 -17.701 -45.222 -16.271 QT
-45.706 -14.841 -46.128 -14.013 QT
-48.035 -10.232 -50.581 -10.232 QT
-52.41 -10.232 -53.519 -11.146 QT
-54.628 -12.06 -54.628 -13.826 QT
cp
f
GR
GS
[0 -0.75 0.75 0 42.5 160.99987] CT
0.149 GC
N
-39.847 -5.926 M
-41.175 -5.926 -41.941 -6.926 QT
-42.707 -7.926 -42.707 -9.285 QT
-42.707 -10.629 -42.011 -12.074 QT
-41.316 -13.52 -40.129 -14.48 QT
-38.941 -15.441 -37.582 -15.441 QT
-36.957 -15.441 -36.465 -15.105 QT
-35.972 -14.77 -35.691 -14.176 QT
-35.457 -15.02 -34.769 -15.02 QT
-34.504 -15.02 -34.324 -14.863 QT
-34.144 -14.707 -34.144 -14.441 QT
-34.144 -14.379 -34.144 -14.348 QT
-34.144 -14.316 -34.16 -14.27 QT
-35.629 -8.41 L
-35.769 -7.785 -35.769 -7.379 QT
-35.769 -6.473 -35.16 -6.473 QT
-34.504 -6.473 -34.16 -7.309 QT
-33.816 -8.145 -33.582 -9.254 QT
-33.55 -9.363 -33.425 -9.363 QT
-33.16 -9.363 L
-33.082 -9.363 -33.035 -9.293 QT
-32.988 -9.223 -32.988 -9.16 QT
-33.347 -7.691 -33.785 -6.809 QT
-34.222 -5.926 -35.207 -5.926 QT
-35.91 -5.926 -36.457 -6.34 QT
-37.004 -6.754 -37.129 -7.441 QT
-38.488 -5.926 -39.847 -5.926 QT
cp
-39.832 -6.473 M
-39.066 -6.473 -38.355 -7.043 QT
-37.644 -7.613 -37.129 -8.379 QT
-37.113 -8.41 -37.113 -8.441 QT
-35.988 -13.004 L
-35.972 -13.066 L
-36.097 -13.816 -36.511 -14.355 QT
-36.925 -14.895 -37.629 -14.895 QT
-38.332 -14.895 -38.941 -14.316 QT
-39.55 -13.738 -39.972 -12.941 QT
-40.379 -12.113 -40.754 -10.645 QT
-41.129 -9.176 -41.129 -8.363 QT
-41.129 -7.645 -40.816 -7.059 QT
-40.504 -6.473 -39.832 -6.473 QT
cp
f
GR
GS
[0 -0.75 0.75 0 42.5 160.99987] CT
0.149 GC
N
-29.025 -5.926 M
-30.291 -5.926 -31.001 -6.918 QT
-31.712 -7.91 -31.712 -9.254 QT
-31.712 -9.441 -31.611 -10.012 QT
-31.509 -10.582 -31.509 -10.707 QT
-29.478 -18.863 L
-29.4 -19.223 -29.384 -19.426 QT
-29.384 -19.77 -30.744 -19.77 QT
-30.947 -19.77 -30.947 -20.051 QT
-30.931 -20.098 -30.9 -20.23 QT
-30.869 -20.363 -30.814 -20.434 QT
-30.759 -20.504 -30.65 -20.504 QT
-27.822 -20.738 L
-27.556 -20.738 -27.556 -20.457 QT
-29.119 -14.27 L
-27.931 -15.441 -26.728 -15.441 QT
-25.837 -15.441 -25.197 -14.973 QT
-24.556 -14.504 -24.236 -13.73 QT
-23.916 -12.957 -23.916 -12.082 QT
-23.916 -11.066 -24.306 -9.988 QT
-24.697 -8.91 -25.4 -7.98 QT
-26.103 -7.051 -27.033 -6.488 QT
-27.962 -5.926 -29.025 -5.926 QT
cp
-28.978 -6.473 M
-28.259 -6.473 -27.634 -7.074 QT
-27.009 -7.676 -26.619 -8.426 QT
-26.197 -9.27 -25.837 -10.707 QT
-25.478 -12.145 -25.478 -13.004 QT
-25.478 -13.754 -25.791 -14.324 QT
-26.103 -14.895 -26.775 -14.895 QT
-27.541 -14.895 -28.228 -14.34 QT
-28.916 -13.785 -29.447 -13.004 QT
-30.025 -10.629 L
-30.369 -9.301 -30.384 -8.504 QT
-30.384 -7.723 -30.041 -7.098 QT
-29.697 -6.473 -28.978 -6.473 QT
cp
f
GR
GS
[0 -0.75 0.75 0 42.5 160.99987] CT
0.149 GC
N
-22.01 -7.441 M
-21.447 -6.473 -19.744 -6.473 QT
-19.01 -6.473 -18.345 -6.73 QT
-17.681 -6.988 -17.244 -7.488 QT
-16.806 -7.988 -16.806 -8.707 QT
-16.806 -9.254 -17.197 -9.598 QT
-17.588 -9.941 -18.15 -10.066 QT
-19.291 -10.285 L
-20.056 -10.488 -20.564 -11.02 QT
-21.072 -11.551 -21.072 -12.316 QT
-21.072 -13.238 -20.564 -13.957 QT
-20.056 -14.676 -19.228 -15.059 QT
-18.4 -15.441 -17.494 -15.441 QT
-16.541 -15.441 -15.791 -14.988 QT
-15.041 -14.535 -15.041 -13.629 QT
-15.041 -13.16 -15.314 -12.785 QT
-15.588 -12.41 -16.072 -12.41 QT
-16.338 -12.41 -16.541 -12.59 QT
-16.744 -12.77 -16.744 -13.051 QT
-16.744 -13.301 -16.603 -13.527 QT
-16.463 -13.754 -16.236 -13.895 QT
-16.01 -14.035 -15.76 -14.035 QT
-15.947 -14.488 -16.455 -14.691 QT
-16.963 -14.895 -17.541 -14.895 QT
-18.072 -14.895 -18.603 -14.684 QT
-19.135 -14.473 -19.463 -14.051 QT
-19.791 -13.629 -19.791 -13.066 QT
-19.791 -12.691 -19.525 -12.402 QT
-19.26 -12.113 -18.869 -11.988 QT
-17.65 -11.754 L
-17.056 -11.629 -16.572 -11.316 QT
-16.088 -11.004 -15.806 -10.527 QT
-15.525 -10.051 -15.525 -9.426 QT
-15.525 -8.645 -15.963 -7.887 QT
-16.4 -7.129 -17.025 -6.676 QT
-18.15 -5.926 -19.76 -5.926 QT
-20.885 -5.926 -21.814 -6.441 QT
-22.744 -6.957 -22.744 -7.973 QT
-22.744 -8.535 -22.416 -8.965 QT
-22.088 -9.395 -21.51 -9.395 QT
-21.166 -9.395 -20.939 -9.184 QT
-20.713 -8.973 -20.713 -8.645 QT
-20.713 -8.16 -21.072 -7.801 QT
-21.431 -7.441 -21.916 -7.441 QT
-22.01 -7.441 L
cp
f
GR
GS
[0 -0.75 0.75 0 42.5 160.99987] CT
0.149 GC
N
-9.324 -3.31 M
-9.324 -32.31 L
-5.355 -32.31 L
-5.355 -31.154 L
-8.152 -31.154 L
-8.152 -4.466 L
-5.355 -4.466 L
-5.355 -3.31 L
-9.324 -3.31 L
cp
f
GR
GS
[0 -0.75 0.75 0 42.5 160.99987] CT
0.149 GC
N
-2.363 -11.06 M
-2.363 -11.232 -2.332 -11.31 QT
-0.16 -19.966 L
0.043 -20.763 0.043 -21.373 QT
0.043 -22.623 -0.801 -22.623 QT
-1.707 -22.623 -2.145 -21.537 QT
-2.582 -20.451 -3.004 -18.794 QT
-3.004 -18.716 -3.082 -18.669 QT
-3.16 -18.623 -3.238 -18.623 QT
-3.582 -18.623 L
-3.676 -18.623 -3.746 -18.724 QT
-3.817 -18.826 -3.817 -18.919 QT
-3.504 -20.169 -3.215 -21.052 QT
-2.926 -21.935 -2.309 -22.654 QT
-1.692 -23.373 -0.77 -23.373 QT
0.308 -23.373 1.144 -22.685 QT
1.98 -21.998 1.98 -20.935 QT
2.855 -22.076 4.012 -22.724 QT
5.168 -23.373 6.48 -23.373 QT
7.855 -23.373 8.847 -22.669 QT
9.84 -21.966 9.84 -20.685 QT
10.73 -21.951 11.933 -22.662 QT
13.137 -23.373 14.543 -23.373 QT
16.043 -23.373 16.957 -22.56 QT
17.871 -21.748 17.871 -20.248 QT
17.871 -19.06 17.34 -17.373 QT
16.808 -15.685 16.027 -13.607 QT
15.605 -12.607 15.605 -11.857 QT
15.605 -10.998 16.293 -10.998 QT
17.418 -10.998 18.168 -12.216 QT
18.918 -13.435 19.23 -14.826 QT
19.324 -14.998 19.48 -14.998 QT
19.808 -14.998 L
19.933 -14.998 20.012 -14.919 QT
20.09 -14.841 20.09 -14.732 QT
20.09 -14.716 20.058 -14.654 QT
19.652 -13.013 18.668 -11.623 QT
17.683 -10.232 16.215 -10.232 QT
15.199 -10.232 14.48 -10.935 QT
13.762 -11.638 13.762 -12.638 QT
13.762 -13.154 13.996 -13.779 QT
14.808 -15.951 15.355 -17.669 QT
15.902 -19.388 15.902 -20.685 QT
15.902 -21.498 15.582 -22.06 QT
15.262 -22.623 14.496 -22.623 QT
12.902 -22.623 11.746 -21.654 QT
10.59 -20.685 9.73 -19.091 QT
9.683 -18.794 9.652 -18.638 QT
7.777 -11.201 L
7.683 -10.794 7.332 -10.513 QT
6.98 -10.232 6.558 -10.232 QT
6.215 -10.232 5.957 -10.459 QT
5.699 -10.685 5.699 -11.06 QT
5.699 -11.232 5.73 -11.31 QT
7.574 -18.701 L
7.871 -19.888 7.871 -20.685 QT
7.871 -21.498 7.543 -22.06 QT
7.215 -22.623 6.418 -22.623 QT
5.355 -22.623 4.465 -22.154 QT
3.574 -21.685 2.91 -20.919 QT
2.246 -20.154 1.683 -19.091 QT
-0.285 -11.201 L
-0.379 -10.794 -0.723 -10.513 QT
-1.067 -10.232 -1.504 -10.232 QT
-1.848 -10.232 -2.106 -10.459 QT
-2.363 -10.685 -2.363 -11.06 QT
cp
f
GR
GS
[0 -0.75 0.75 0 42.5 160.99987] CT
0.149 GC
N
22.782 -3.888 M
22.782 -3.982 22.813 -3.998 QT
32.892 -31.951 L
32.954 -32.123 33.095 -32.216 QT
33.235 -32.31 33.423 -32.31 QT
33.673 -32.31 33.837 -32.154 QT
34.001 -31.998 34.001 -31.732 QT
34.001 -31.623 L
23.923 -3.669 L
23.751 -3.31 23.36 -3.31 QT
23.126 -3.31 22.954 -3.482 QT
22.782 -3.654 22.782 -3.888 QT
cp
f
GR
GS
[0 -0.75 0.75 0 42.5 160.99987] CT
0.149 GC
N
38.34 -12.326 M
39.121 -10.998 41.48 -10.998 QT
42.496 -10.998 43.418 -11.349 QT
44.34 -11.701 44.941 -12.388 QT
45.543 -13.076 45.543 -14.076 QT
45.543 -14.826 45.004 -15.302 QT
44.465 -15.779 43.683 -15.951 QT
42.105 -16.263 L
41.043 -16.529 40.347 -17.271 QT
39.652 -18.013 39.652 -19.06 QT
39.652 -20.341 40.347 -21.334 QT
41.043 -22.326 42.191 -22.849 QT
43.34 -23.373 44.574 -23.373 QT
45.886 -23.373 46.933 -22.748 QT
47.98 -22.123 47.98 -20.888 QT
47.98 -20.216 47.605 -19.709 QT
47.23 -19.201 46.558 -19.201 QT
46.168 -19.201 45.894 -19.451 QT
45.621 -19.701 45.621 -20.076 QT
45.621 -20.419 45.816 -20.74 QT
46.011 -21.06 46.324 -21.248 QT
46.636 -21.435 46.98 -21.435 QT
46.73 -22.06 46.027 -22.341 QT
45.324 -22.623 44.511 -22.623 QT
43.777 -22.623 43.043 -22.326 QT
42.308 -22.029 41.863 -21.459 QT
41.418 -20.888 41.418 -20.107 QT
41.418 -19.576 41.785 -19.185 QT
42.152 -18.794 42.699 -18.623 QT
44.371 -18.279 L
45.183 -18.107 45.855 -17.677 QT
46.527 -17.248 46.918 -16.584 QT
47.308 -15.919 47.308 -15.076 QT
47.308 -13.998 46.707 -12.951 QT
46.105 -11.904 45.23 -11.279 QT
43.683 -10.232 41.449 -10.232 QT
39.902 -10.232 38.613 -10.943 QT
37.324 -11.654 37.324 -13.06 QT
37.324 -13.841 37.785 -14.427 QT
38.246 -15.013 39.043 -15.013 QT
39.511 -15.013 39.824 -14.732 QT
40.136 -14.451 40.136 -13.982 QT
40.136 -13.326 39.644 -12.826 QT
39.152 -12.326 38.48 -12.326 QT
38.34 -12.326 L
cp
f
GR
GS
[0 -0.75 0.75 0 42.5 160.99987] CT
0.149 GC
N
50.215 -3.31 M
50.215 -4.466 L
53.027 -4.466 L
53.027 -31.154 L
50.215 -31.154 L
50.215 -32.31 L
54.183 -32.31 L
54.183 -3.31 L
50.215 -3.31 L
cp
f
GR
GS
[0.75 0 0 0.75 221.25021 25.22857] CT
N
-99.94 -9.6 M
-99.94 -10.553 L
-97.534 -10.553 -96.971 -12.147 QT
-91.315 -28.631 L
-91.237 -28.928 -90.878 -28.928 QT
-90.534 -28.928 L
-90.174 -28.928 -90.096 -28.631 QT
-84.174 -11.413 L
-83.924 -10.834 -83.221 -10.694 QT
-82.518 -10.553 -81.456 -10.553 QT
-81.456 -9.6 L
-88.987 -9.6 L
-88.987 -10.553 L
-86.753 -10.553 -86.753 -11.272 QT
-86.753 -11.413 L
-88.206 -15.631 L
-94.768 -15.631 L
-95.971 -12.147 L
-96.003 -12.053 -96.003 -11.866 QT
-96.003 -11.194 -95.362 -10.874 QT
-94.721 -10.553 -93.987 -10.553 QT
-93.987 -9.6 L
-99.94 -9.6 L
cp
-94.44 -16.569 M
-88.534 -16.569 L
-91.487 -25.178 L
-94.44 -16.569 L
cp
f
GR
GS
[0.75 0 0 0.75 221.25021 25.22857] CT
N
-78.002 -9.6 M
-78.002 -25.584 L
-78.002 -26.303 -78.221 -26.624 QT
-78.44 -26.944 -78.846 -27.022 QT
-79.252 -27.1 -80.112 -27.1 QT
-80.112 -28.038 L
-76.127 -28.334 L
-76.127 -19.881 L
-75.674 -20.381 -75.073 -20.756 QT
-74.471 -21.131 -73.784 -21.334 QT
-73.096 -21.538 -72.393 -21.538 QT
-71.174 -21.538 -70.143 -21.045 QT
-69.112 -20.553 -68.346 -19.694 QT
-67.581 -18.834 -67.151 -17.725 QT
-66.721 -16.616 -66.721 -15.428 QT
-66.721 -13.788 -67.518 -12.381 QT
-68.315 -10.975 -69.69 -10.139 QT
-71.065 -9.303 -72.721 -9.303 QT
-73.752 -9.303 -74.713 -9.827 QT
-75.674 -10.35 -76.299 -11.225 QT
-77.221 -9.6 L
-78.002 -9.6 L
cp
-76.049 -12.256 M
-75.596 -11.256 -74.752 -10.631 QT
-73.909 -10.006 -72.877 -10.006 QT
-71.487 -10.006 -70.62 -10.811 QT
-69.752 -11.616 -69.409 -12.842 QT
-69.065 -14.069 -69.065 -15.428 QT
-69.065 -17.709 -69.659 -18.897 QT
-69.924 -19.428 -70.377 -19.874 QT
-70.831 -20.319 -71.393 -20.577 QT
-71.956 -20.834 -72.581 -20.834 QT
-73.659 -20.834 -74.581 -20.256 QT
-75.502 -19.678 -76.049 -18.725 QT
-76.049 -12.256 L
cp
f
GR
GS
[0.75 0 0 0.75 221.25021 25.22857] CT
N
-65.109 -9.522 M
-65.109 -13.928 L
-65.109 -14.131 -64.859 -14.131 QT
-64.531 -14.131 L
-64.375 -14.131 -64.328 -13.928 QT
-63.578 -10.006 -60.688 -10.006 QT
-59.406 -10.006 -58.547 -10.584 QT
-57.688 -11.163 -57.688 -12.381 QT
-57.688 -13.256 -58.359 -13.866 QT
-59.031 -14.475 -59.953 -14.709 QT
-61.75 -15.053 L
-62.672 -15.256 -63.414 -15.663 QT
-64.156 -16.069 -64.633 -16.749 QT
-65.109 -17.428 -65.109 -18.334 QT
-65.109 -19.522 -64.477 -20.28 QT
-63.844 -21.038 -62.844 -21.374 QT
-61.844 -21.709 -60.688 -21.709 QT
-59.297 -21.709 -58.281 -20.959 QT
-57.5 -21.631 L
-57.5 -21.709 -57.359 -21.709 QT
-57.172 -21.709 L
-57.094 -21.709 -57.024 -21.631 QT
-56.953 -21.553 -56.953 -21.475 QT
-56.953 -17.944 L
-56.953 -17.694 -57.172 -17.694 QT
-57.5 -17.694 L
-57.734 -17.694 -57.734 -17.944 QT
-57.734 -19.35 -58.516 -20.209 QT
-59.297 -21.069 -60.719 -21.069 QT
-61.922 -21.069 -62.813 -20.624 QT
-63.703 -20.178 -63.703 -19.084 QT
-63.703 -18.334 -63.063 -17.85 QT
-62.422 -17.366 -61.563 -17.147 QT
-59.734 -16.819 L
-58.813 -16.6 -58.016 -16.1 QT
-57.219 -15.6 -56.75 -14.834 QT
-56.281 -14.069 -56.281 -13.1 QT
-56.281 -12.131 -56.617 -11.413 QT
-56.953 -10.694 -57.555 -10.217 QT
-58.156 -9.741 -58.977 -9.522 QT
-59.797 -9.303 -60.688 -9.303 QT
-62.375 -9.303 -63.578 -10.428 QT
-64.563 -9.366 L
-64.563 -9.303 -64.703 -9.303 QT
-64.859 -9.303 L
-65.109 -9.303 -65.109 -9.522 QT
cp
f
GR
GS
[0.75 0 0 0.75 221.25021 25.22857] CT
N
-48.732 -9.303 M
-50.357 -9.303 -51.739 -10.124 QT
-53.122 -10.944 -53.927 -12.327 QT
-54.732 -13.709 -54.732 -15.35 QT
-54.732 -16.584 -54.286 -17.733 QT
-53.841 -18.881 -53.021 -19.788 QT
-52.2 -20.694 -51.107 -21.202 QT
-50.013 -21.709 -48.732 -21.709 QT
-47.075 -21.709 -45.708 -20.827 QT
-44.341 -19.944 -43.552 -18.475 QT
-42.763 -17.006 -42.763 -15.35 QT
-42.763 -13.725 -43.568 -12.334 QT
-44.372 -10.944 -45.747 -10.124 QT
-47.122 -9.303 -48.732 -9.303 QT
cp
-48.732 -10.084 M
-46.575 -10.084 -45.849 -11.655 QT
-45.122 -13.225 -45.122 -15.647 QT
-45.122 -17.006 -45.263 -17.897 QT
-45.403 -18.788 -45.903 -19.522 QT
-46.2 -19.959 -46.669 -20.295 QT
-47.138 -20.631 -47.661 -20.811 QT
-48.185 -20.991 -48.732 -20.991 QT
-49.575 -20.991 -50.333 -20.608 QT
-51.091 -20.225 -51.591 -19.522 QT
-52.091 -18.756 -52.232 -17.834 QT
-52.372 -16.913 -52.372 -15.647 QT
-52.372 -14.131 -52.107 -12.928 QT
-51.841 -11.725 -51.044 -10.905 QT
-50.247 -10.084 -48.732 -10.084 QT
cp
f
GR
GS
[0.75 0 0 0.75 221.25021 25.22857] CT
N
-41.32 -9.6 M
-41.32 -10.553 L
-40.398 -10.553 -39.804 -10.694 QT
-39.211 -10.834 -39.211 -11.413 QT
-39.211 -25.584 L
-39.211 -26.303 -39.429 -26.624 QT
-39.648 -26.944 -40.054 -27.022 QT
-40.461 -27.1 -41.32 -27.1 QT
-41.32 -28.038 L
-37.304 -28.334 L
-37.304 -11.413 L
-37.304 -10.834 -36.711 -10.694 QT
-36.117 -10.553 -35.211 -10.553 QT
-35.211 -9.6 L
-41.32 -9.6 L
cp
f
GR
GS
[0.75 0 0 0.75 221.25021 25.22857] CT
N
-31.835 -12.819 M
-31.835 -18.772 L
-31.835 -19.506 -32.045 -19.827 QT
-32.256 -20.147 -32.67 -20.217 QT
-33.085 -20.288 -33.944 -20.288 QT
-33.944 -21.241 L
-29.85 -21.538 L
-29.85 -12.819 L
-29.85 -11.756 -29.702 -11.17 QT
-29.553 -10.584 -29.053 -10.295 QT
-28.553 -10.006 -27.475 -10.006 QT
-26.022 -10.006 -25.17 -11.217 QT
-24.319 -12.428 -24.319 -13.975 QT
-24.319 -18.772 L
-24.319 -19.506 -24.538 -19.827 QT
-24.756 -20.147 -25.163 -20.217 QT
-25.569 -20.288 -26.428 -20.288 QT
-26.428 -21.241 L
-22.35 -21.538 L
-22.35 -12.053 L
-22.35 -11.334 -22.131 -11.014 QT
-21.913 -10.694 -21.506 -10.624 QT
-21.1 -10.553 -20.241 -10.553 QT
-20.241 -9.6 L
-24.241 -9.303 L
-24.241 -11.584 L
-24.741 -10.569 -25.631 -9.936 QT
-26.522 -9.303 -27.616 -9.303 QT
-29.553 -9.303 -30.694 -10.124 QT
-31.835 -10.944 -31.835 -12.819 QT
cp
f
GR
GS
[0.75 0 0 0.75 221.25021 25.22857] CT
N
-17.176 -12.85 M
-17.176 -20.288 L
-19.41 -20.288 L
-19.41 -20.991 L
-17.645 -20.991 -16.817 -22.639 QT
-15.988 -24.288 -15.988 -26.209 QT
-15.207 -26.209 L
-15.207 -21.241 L
-11.395 -21.241 L
-11.395 -20.288 L
-15.207 -20.288 L
-15.207 -12.897 L
-15.207 -11.772 -14.832 -10.928 QT
-14.457 -10.084 -13.473 -10.084 QT
-12.551 -10.084 -12.145 -10.975 QT
-11.738 -11.866 -11.738 -12.897 QT
-11.738 -14.491 L
-10.957 -14.491 L
-10.957 -12.85 L
-10.957 -12.006 -11.27 -11.178 QT
-11.582 -10.35 -12.192 -9.827 QT
-12.801 -9.303 -13.66 -9.303 QT
-15.285 -9.303 -16.231 -10.272 QT
-17.176 -11.241 -17.176 -12.85 QT
cp
f
GR
GS
[0.75 0 0 0.75 221.25021 25.22857] CT
N
-2.837 -9.303 M
-4.477 -9.303 -5.852 -10.163 QT
-7.227 -11.022 -8.016 -12.467 QT
-8.806 -13.913 -8.806 -15.522 QT
-8.806 -17.1 -8.087 -18.522 QT
-7.368 -19.944 -6.079 -20.827 QT
-4.79 -21.709 -3.212 -21.709 QT
-1.977 -21.709 -1.063 -21.288 QT
-0.149 -20.866 0.444 -20.131 QT
1.038 -19.397 1.343 -18.397 QT
1.648 -17.397 1.648 -16.194 QT
1.648 -15.834 1.366 -15.834 QT
-6.446 -15.834 L
-6.446 -15.553 L
-6.446 -13.303 -5.54 -11.694 QT
-4.634 -10.084 -2.587 -10.084 QT
-1.759 -10.084 -1.056 -10.452 QT
-0.352 -10.819 0.171 -11.483 QT
0.694 -12.147 0.866 -12.897 QT
0.898 -12.991 0.968 -13.061 QT
1.038 -13.131 1.132 -13.131 QT
1.366 -13.131 L
1.648 -13.131 1.648 -12.788 QT
1.273 -11.256 0.007 -10.28 QT
-1.259 -9.303 -2.837 -9.303 QT
cp
-6.415 -16.506 M
-0.259 -16.506 L
-0.259 -17.522 -0.54 -18.561 QT
-0.821 -19.6 -1.485 -20.295 QT
-2.149 -20.991 -3.212 -20.991 QT
-4.743 -20.991 -5.579 -19.561 QT
-6.415 -18.131 -6.415 -16.506 QT
cp
f
GR
GS
[0.75 0 0 0.75 221.25021 25.22857] CT
N
17.779 -9.6 M
13.841 -19.522 L
13.591 -20.022 13.068 -20.155 QT
12.545 -20.288 11.701 -20.288 QT
11.701 -21.241 L
17.373 -21.241 L
17.373 -20.288 L
15.857 -20.288 15.857 -19.647 QT
15.857 -19.538 15.873 -19.491 QT
18.904 -11.866 L
21.638 -18.756 L
21.716 -18.959 21.716 -19.178 QT
21.716 -19.694 21.326 -19.991 QT
20.935 -20.288 20.42 -20.288 QT
20.42 -21.241 L
24.904 -21.241 L
24.904 -20.288 L
24.06 -20.288 23.435 -19.905 QT
22.81 -19.522 22.466 -18.772 QT
18.826 -9.6 L
18.732 -9.303 18.404 -9.303 QT
18.201 -9.303 L
17.873 -9.303 17.779 -9.6 QT
cp
f
GR
GS
[0.75 0 0 0.75 221.25021 25.22857] CT
N
31.237 -9.303 M
29.597 -9.303 28.222 -10.163 QT
26.847 -11.022 26.058 -12.467 QT
25.269 -13.913 25.269 -15.522 QT
25.269 -17.1 25.987 -18.522 QT
26.706 -19.944 27.995 -20.827 QT
29.284 -21.709 30.862 -21.709 QT
32.097 -21.709 33.011 -21.288 QT
33.925 -20.866 34.519 -20.131 QT
35.112 -19.397 35.417 -18.397 QT
35.722 -17.397 35.722 -16.194 QT
35.722 -15.834 35.44 -15.834 QT
27.628 -15.834 L
27.628 -15.553 L
27.628 -13.303 28.534 -11.694 QT
29.44 -10.084 31.487 -10.084 QT
32.315 -10.084 33.019 -10.452 QT
33.722 -10.819 34.245 -11.483 QT
34.769 -12.147 34.94 -12.897 QT
34.972 -12.991 35.042 -13.061 QT
35.112 -13.131 35.206 -13.131 QT
35.44 -13.131 L
35.722 -13.131 35.722 -12.788 QT
35.347 -11.256 34.081 -10.28 QT
32.815 -9.303 31.237 -9.303 QT
cp
27.659 -16.506 M
33.815 -16.506 L
33.815 -17.522 33.534 -18.561 QT
33.253 -19.6 32.589 -20.295 QT
31.925 -20.991 30.862 -20.991 QT
29.331 -20.991 28.495 -19.561 QT
27.659 -18.131 27.659 -16.506 QT
cp
f
GR
GS
[0.75 0 0 0.75 221.25021 25.22857] CT
N
37.199 -9.6 M
37.199 -10.553 L
38.12 -10.553 38.714 -10.694 QT
39.308 -10.834 39.308 -11.413 QT
39.308 -25.584 L
39.308 -26.303 39.089 -26.624 QT
38.87 -26.944 38.464 -27.022 QT
38.058 -27.1 37.199 -27.1 QT
37.199 -28.038 L
41.214 -28.334 L
41.214 -11.413 L
41.214 -10.834 41.808 -10.694 QT
42.402 -10.553 43.308 -10.553 QT
43.308 -9.6 L
37.199 -9.6 L
cp
f
GR
GS
[0.75 0 0 0.75 221.25021 25.22857] CT
N
50.528 -9.303 M
48.903 -9.303 47.52 -10.124 QT
46.137 -10.944 45.333 -12.327 QT
44.528 -13.709 44.528 -15.35 QT
44.528 -16.584 44.973 -17.733 QT
45.418 -18.881 46.239 -19.788 QT
47.059 -20.694 48.153 -21.202 QT
49.247 -21.709 50.528 -21.709 QT
52.184 -21.709 53.551 -20.827 QT
54.918 -19.944 55.708 -18.475 QT
56.497 -17.006 56.497 -15.35 QT
56.497 -13.725 55.692 -12.334 QT
54.887 -10.944 53.512 -10.124 QT
52.137 -9.303 50.528 -9.303 QT
cp
50.528 -10.084 M
52.684 -10.084 53.411 -11.655 QT
54.137 -13.225 54.137 -15.647 QT
54.137 -17.006 53.997 -17.897 QT
53.856 -18.788 53.356 -19.522 QT
53.059 -19.959 52.59 -20.295 QT
52.122 -20.631 51.598 -20.811 QT
51.075 -20.991 50.528 -20.991 QT
49.684 -20.991 48.926 -20.608 QT
48.168 -20.225 47.668 -19.522 QT
47.168 -18.756 47.028 -17.834 QT
46.887 -16.913 46.887 -15.647 QT
46.887 -14.131 47.153 -12.928 QT
47.418 -11.725 48.215 -10.905 QT
49.012 -10.084 50.528 -10.084 QT
cp
f
GR
GS
[0.75 0 0 0.75 221.25021 25.22857] CT
N
64.571 -9.303 M
62.946 -9.303 61.61 -10.147 QT
60.274 -10.991 59.508 -12.413 QT
58.743 -13.834 58.743 -15.428 QT
58.743 -17.022 59.5 -18.483 QT
60.258 -19.944 61.602 -20.827 QT
62.946 -21.709 64.571 -21.709 QT
66.164 -21.709 67.461 -21.084 QT
68.758 -20.459 68.758 -19.053 QT
68.758 -18.522 68.383 -18.131 QT
68.008 -17.741 67.461 -17.741 QT
66.93 -17.741 66.547 -18.131 QT
66.164 -18.522 66.164 -19.053 QT
66.164 -19.522 66.469 -19.874 QT
66.774 -20.225 67.227 -20.319 QT
66.289 -20.913 64.602 -20.913 QT
63.305 -20.913 62.516 -20.053 QT
61.727 -19.194 61.414 -17.928 QT
61.102 -16.663 61.102 -15.428 QT
61.102 -14.116 61.485 -12.897 QT
61.868 -11.678 62.735 -10.881 QT
63.602 -10.084 64.899 -10.084 QT
66.18 -10.084 67.079 -10.874 QT
67.977 -11.663 68.305 -12.928 QT
68.305 -13.084 68.524 -13.084 QT
68.852 -13.084 L
68.93 -13.084 68.993 -13.006 QT
69.055 -12.928 69.055 -12.85 QT
69.055 -12.772 L
68.649 -11.163 67.438 -10.233 QT
66.227 -9.303 64.571 -9.303 QT
cp
f
GR
GS
[0.75 0 0 0.75 221.25021 25.22857] CT
N
70.532 -9.6 M
70.532 -10.553 L
71.454 -10.553 72.048 -10.694 QT
72.641 -10.834 72.641 -11.413 QT
72.641 -18.772 L
72.641 -19.819 72.243 -20.053 QT
71.844 -20.288 70.657 -20.288 QT
70.657 -21.241 L
74.548 -21.538 L
74.548 -11.413 L
74.548 -10.834 75.055 -10.694 QT
75.563 -10.553 76.423 -10.553 QT
76.423 -9.6 L
70.532 -9.6 L
cp
71.688 -26.178 M
71.688 -26.772 72.134 -27.217 QT
72.579 -27.663 73.157 -27.663 QT
73.548 -27.663 73.899 -27.467 QT
74.251 -27.272 74.446 -26.913 QT
74.641 -26.553 74.641 -26.178 QT
74.641 -25.584 74.196 -25.139 QT
73.751 -24.694 73.157 -24.694 QT
72.579 -24.694 72.134 -25.139 QT
71.688 -25.584 71.688 -26.178 QT
cp
f
GR
GS
[0.75 0 0 0.75 221.25021 25.22857] CT
N
79.861 -12.85 M
79.861 -20.288 L
77.627 -20.288 L
77.627 -20.991 L
79.393 -20.991 80.221 -22.639 QT
81.049 -24.288 81.049 -26.209 QT
81.83 -26.209 L
81.83 -21.241 L
85.643 -21.241 L
85.643 -20.288 L
81.83 -20.288 L
81.83 -12.897 L
81.83 -11.772 82.205 -10.928 QT
82.58 -10.084 83.564 -10.084 QT
84.486 -10.084 84.893 -10.975 QT
85.299 -11.866 85.299 -12.897 QT
85.299 -14.491 L
86.08 -14.491 L
86.08 -12.85 L
86.08 -12.006 85.768 -11.178 QT
85.455 -10.35 84.846 -9.827 QT
84.236 -9.303 83.377 -9.303 QT
81.752 -9.303 80.807 -10.272 QT
79.861 -11.241 79.861 -12.85 QT
cp
f
GR
GS
[0.75 0 0 0.75 221.25021 25.22857] CT
N
88.6 -5.163 M
89.116 -4.756 89.741 -4.756 QT
91.428 -4.756 92.522 -7.334 QT
93.444 -9.6 L
89.397 -19.522 L
89.147 -20.022 88.632 -20.155 QT
88.116 -20.288 87.257 -20.288 QT
87.257 -21.241 L
92.928 -21.241 L
92.928 -20.288 L
91.428 -20.288 91.428 -19.647 QT
91.428 -19.538 91.46 -19.491 QT
94.46 -12.1 L
97.163 -18.756 L
97.241 -18.959 97.241 -19.209 QT
97.241 -19.538 97.069 -19.78 QT
96.897 -20.022 96.608 -20.155 QT
96.319 -20.288 95.975 -20.288 QT
95.975 -21.241 L
100.46 -21.241 L
100.46 -20.288 L
99.616 -20.288 98.991 -19.905 QT
98.366 -19.522 98.022 -18.772 QT
93.366 -7.334 L
92.991 -6.459 92.499 -5.733 QT
92.007 -5.006 91.296 -4.538 QT
90.585 -4.069 89.741 -4.069 QT
88.741 -4.069 87.999 -4.717 QT
87.257 -5.366 87.257 -6.334 QT
87.257 -6.834 87.6 -7.178 QT
87.944 -7.522 88.444 -7.522 QT
88.788 -7.522 89.053 -7.366 QT
89.319 -7.209 89.475 -6.952 QT
89.632 -6.694 89.632 -6.334 QT
89.632 -5.897 89.342 -5.553 QT
89.053 -5.209 88.6 -5.163 QT
cp
f
GR
GS
[0.75 0 0 0.75 0 0.5] CT
0.2 0.702 0.2 RC
1 LJ
0.667 LW
N
114.182 390 M
154.364 240.364 L
194.545 209.781 L
234.727 182.59 L
274.909 138.702 L
315.091 84.814 L
355.273 72.015 L
395.455 115.16 L
435.636 218.645 L
475.818 383.226 L
S
GR
GS
[0.75 0 0 0.75 0 0.5] CT
1 LJ
0.667 LW
N
114.182 390 M
154.364 221.379 L
194.545 180.491 L
234.727 207.935 L
274.909 193.072 L
315.091 152.614 L
355.273 136.201 L
395.455 166.138 L
435.636 248.563 L
475.818 383.792 L
S
GR
GS
[0.75 0 0 0.75 0 0.5] CT
0 0 1 RC
1 LJ
0.667 LW
N
114.182 390 M
154.364 211.178 L
194.545 127.644 L
234.727 81.435 L
274.909 78.686 L
315.091 68.965 L
355.273 42.889 L
395.455 74.455 L
435.636 186.071 L
475.818 383.226 L
S
GR
GS
[0.75 0 0 0.75 0 0.5] CT
0.6 0.2 0.2 RC
1 LJ
0.667 LW
N
114.182 390 M
154.364 344.122 L
194.545 310.979 L
234.727 290.56 L
274.909 282.842 L
315.091 287.774 L
355.273 302.945 L
395.455 325.844 L
435.636 353.469 L
475.818 384.301 L
S
GR
GS
[0.75 0 0 0.75 0 0.5] CT
1 GC
N
505 158 M
505 50 L
381 50 L
381 158 L
cp
f
GR
GS
[0.75 0 0 0.75 320.86361 49.11029] CT
N
0.672 5.12 M
0.672 4.386 L
2.547 4.386 2.984 3.136 QT
7.391 -9.693 L
7.453 -9.911 7.734 -9.911 QT
8 -9.911 L
8.281 -9.911 8.344 -9.693 QT
12.938 3.714 L
13.141 4.151 13.688 4.268 QT
14.234 4.386 15.047 4.386 QT
15.047 5.12 L
9.203 5.12 L
9.203 4.386 L
10.938 4.386 10.938 3.823 QT
10.938 3.714 L
9.797 0.432 L
4.703 0.432 L
3.766 3.136 L
3.75 3.214 3.75 3.354 QT
3.75 3.886 4.242 4.136 QT
4.734 4.386 5.313 4.386 QT
5.313 5.12 L
0.672 5.12 L
cp
4.953 -0.302 M
9.563 -0.302 L
7.25 -7.005 L
4.953 -0.302 L
cp
f
GR
GS
[0.75 0 0 0.75 320.86361 49.11029] CT
N
16.578 6.761 M
16.578 6.011 17.125 5.456 QT
17.672 4.901 18.422 4.651 QT
18 4.339 17.781 3.854 QT
17.563 3.37 17.563 2.839 QT
17.563 1.854 18.188 1.089 QT
17.219 0.151 17.219 -1.068 QT
17.219 -1.724 17.5 -2.302 QT
17.781 -2.88 18.289 -3.302 QT
18.797 -3.724 19.406 -3.943 QT
20.016 -4.161 20.672 -4.161 QT
21.922 -4.161 22.906 -3.427 QT
23.344 -3.896 23.93 -4.146 QT
24.516 -4.396 25.156 -4.396 QT
25.609 -4.396 25.898 -4.075 QT
26.188 -3.755 26.188 -3.302 QT
26.188 -3.036 25.992 -2.841 QT
25.797 -2.646 25.531 -2.646 QT
25.266 -2.646 25.07 -2.841 QT
24.875 -3.036 24.875 -3.302 QT
24.875 -3.693 25.141 -3.849 QT
24.047 -3.849 23.266 -3.099 QT
23.656 -2.708 23.883 -2.161 QT
24.109 -1.614 24.109 -1.068 QT
24.109 -0.177 23.617 0.534 QT
23.125 1.245 22.32 1.636 QT
21.516 2.026 20.672 2.026 QT
19.516 2.026 18.563 1.401 QT
18.266 1.823 18.266 2.323 QT
18.266 2.886 18.633 3.3 QT
19 3.714 19.547 3.714 QT
21.266 3.714 L
22.516 3.714 23.523 3.94 QT
24.531 4.167 25.211 4.846 QT
25.891 5.526 25.891 6.761 QT
25.891 7.682 25.117 8.292 QT
24.344 8.901 23.258 9.175 QT
22.172 9.448 21.25 9.448 QT
20.313 9.448 19.227 9.175 QT
18.141 8.901 17.359 8.292 QT
16.578 7.682 16.578 6.761 QT
cp
17.766 6.761 M
17.766 7.464 18.336 7.94 QT
18.906 8.417 19.719 8.651 QT
20.531 8.886 21.25 8.886 QT
21.953 8.886 22.766 8.651 QT
23.578 8.417 24.148 7.94 QT
24.719 7.464 24.719 6.761 QT
24.719 5.667 23.711 5.339 QT
22.703 5.011 21.266 5.011 QT
19.547 5.011 L
19.063 5.011 18.656 5.245 QT
18.25 5.479 18.008 5.893 QT
17.766 6.307 17.766 6.761 QT
cp
20.672 1.464 M
22.453 1.464 22.453 -1.068 QT
22.453 -2.177 22.07 -2.888 QT
21.688 -3.599 20.672 -3.599 QT
19.641 -3.599 19.258 -2.888 QT
18.875 -2.177 18.875 -1.068 QT
18.875 -0.38 19.023 0.182 QT
19.172 0.745 19.563 1.104 QT
19.953 1.464 20.672 1.464 QT
cp
f
GR
GS
[0.75 0 0 0.75 320.86361 49.11029] CT
N
31.901 5.354 M
30.62 5.354 29.55 4.682 QT
28.479 4.011 27.862 2.886 QT
27.245 1.761 27.245 0.511 QT
27.245 -0.708 27.807 -1.818 QT
28.37 -2.927 29.37 -3.607 QT
30.37 -4.286 31.604 -4.286 QT
32.557 -4.286 33.276 -3.966 QT
33.995 -3.646 34.456 -3.075 QT
34.917 -2.505 35.151 -1.724 QT
35.385 -0.943 35.385 -0.005 QT
35.385 0.276 35.167 0.276 QT
29.089 0.276 L
29.089 0.495 L
29.089 2.245 29.792 3.495 QT
30.495 4.745 32.089 4.745 QT
32.729 4.745 33.276 4.456 QT
33.823 4.167 34.229 3.651 QT
34.635 3.136 34.776 2.557 QT
34.792 2.479 34.854 2.425 QT
34.917 2.37 34.979 2.37 QT
35.167 2.37 L
35.385 2.37 35.385 2.636 QT
35.089 3.823 34.104 4.589 QT
33.12 5.354 31.901 5.354 QT
cp
29.104 -0.255 M
33.901 -0.255 L
33.901 -1.036 33.675 -1.849 QT
33.448 -2.661 32.94 -3.2 QT
32.432 -3.739 31.604 -3.739 QT
30.417 -3.739 29.76 -2.63 QT
29.104 -1.521 29.104 -0.255 QT
cp
f
GR
GS
[0.75 0 0 0.75 320.86361 49.11029] CT
N
36.773 5.12 M
36.773 4.386 L
37.492 4.386 37.953 4.268 QT
38.414 4.151 38.414 3.714 QT
38.414 -2.021 L
38.414 -2.583 38.242 -2.833 QT
38.07 -3.083 37.758 -3.138 QT
37.445 -3.193 36.773 -3.193 QT
36.773 -3.927 L
39.82 -4.161 L
39.82 -2.114 L
40.242 -3.005 41.07 -3.583 QT
41.898 -4.161 42.867 -4.161 QT
44.32 -4.161 45.054 -3.466 QT
45.789 -2.771 45.789 -1.333 QT
45.789 3.714 L
45.789 4.151 46.25 4.268 QT
46.711 4.386 47.429 4.386 QT
47.429 5.12 L
42.617 5.12 L
42.617 4.386 L
43.336 4.386 43.797 4.268 QT
44.258 4.151 44.258 3.714 QT
44.258 -1.271 L
44.258 -2.286 43.961 -2.95 QT
43.664 -3.614 42.742 -3.614 QT
41.523 -3.614 40.734 -2.638 QT
39.945 -1.661 39.945 -0.427 QT
39.945 3.714 L
39.945 4.151 40.414 4.268 QT
40.883 4.386 41.586 4.386 QT
41.586 5.12 L
36.773 5.12 L
cp
f
GR
GS
[0.75 0 0 0.75 320.86361 49.11029] CT
N
49.548 2.604 M
49.548 -3.193 L
47.814 -3.193 L
47.814 -3.739 L
49.189 -3.739 49.829 -5.021 QT
50.47 -6.302 50.47 -7.802 QT
51.079 -7.802 L
51.079 -3.927 L
54.048 -3.927 L
54.048 -3.193 L
51.079 -3.193 L
51.079 2.557 L
51.079 3.432 51.368 4.089 QT
51.657 4.745 52.423 4.745 QT
53.142 4.745 53.462 4.05 QT
53.782 3.354 53.782 2.557 QT
53.782 1.323 L
54.376 1.323 L
54.376 2.604 L
54.376 3.261 54.134 3.901 QT
53.892 4.542 53.423 4.948 QT
52.954 5.354 52.282 5.354 QT
51.017 5.354 50.282 4.604 QT
49.548 3.854 49.548 2.604 QT
cp
f
GR
GS
[0.75 0 0 0.75 320.86361 49.11029] CT
N
64.768 5.12 M
64.768 4.386 L
67.393 4.386 67.393 3.714 QT
67.393 -7.302 L
66.299 -6.786 64.643 -6.786 QT
64.643 -7.521 L
67.221 -7.521 68.534 -8.864 QT
68.831 -8.864 L
68.893 -8.864 68.963 -8.81 QT
69.034 -8.755 69.034 -8.677 QT
69.034 3.714 L
69.034 4.386 71.659 4.386 QT
71.659 5.12 L
64.768 5.12 L
cp
f
GR
GS
[0.75 0 0 0.75 0 0.5] CT
0.2 0.702 0.2 RC
1 LJ
0.667 LW
N
384.985 64.814 M
424.83 64.814 L
S
GR
GS
[0.75 0 0 0.75 320.86361 68.70343] CT
N
/f-597267615{0.672 5.12 M
0.672 4.386 L
2.547 4.386 2.984 3.136 QT
7.391 -9.693 L
7.453 -9.911 7.734 -9.911 QT
8 -9.911 L
8.281 -9.911 8.344 -9.693 QT
12.938 3.714 L
13.141 4.151 13.688 4.268 QT
14.234 4.386 15.047 4.386 QT
15.047 5.12 L
9.203 5.12 L
9.203 4.386 L
10.938 4.386 10.938 3.823 QT
10.938 3.714 L
9.797 0.432 L
4.703 0.432 L
3.766 3.136 L
3.75 3.214 3.75 3.354 QT
3.75 3.886 4.242 4.136 QT
4.734 4.386 5.313 4.386 QT
5.313 5.12 L
0.672 5.12 L
cp
4.953 -0.302 M
9.563 -0.302 L
7.25 -7.005 L
4.953 -0.302 L
cp}def
f-597267615
f
GR
GS
[0.75 0 0 0.75 320.86361 68.70343] CT
N
/f-745240314{16.578 6.761 M
16.578 6.011 17.125 5.456 QT
17.672 4.901 18.422 4.651 QT
18 4.339 17.781 3.854 QT
17.563 3.37 17.563 2.839 QT
17.563 1.854 18.188 1.089 QT
17.219 0.151 17.219 -1.068 QT
17.219 -1.724 17.5 -2.302 QT
17.781 -2.88 18.289 -3.302 QT
18.797 -3.724 19.406 -3.943 QT
20.016 -4.161 20.672 -4.161 QT
21.922 -4.161 22.906 -3.427 QT
23.344 -3.896 23.93 -4.146 QT
24.516 -4.396 25.156 -4.396 QT
25.609 -4.396 25.898 -4.075 QT
26.188 -3.755 26.188 -3.302 QT
26.188 -3.036 25.992 -2.841 QT
25.797 -2.646 25.531 -2.646 QT
25.266 -2.646 25.07 -2.841 QT
24.875 -3.036 24.875 -3.302 QT
24.875 -3.693 25.141 -3.849 QT
24.047 -3.849 23.266 -3.099 QT
23.656 -2.708 23.883 -2.161 QT
24.109 -1.614 24.109 -1.068 QT
24.109 -0.177 23.617 0.534 QT
23.125 1.245 22.32 1.636 QT
21.516 2.026 20.672 2.026 QT
19.516 2.026 18.563 1.401 QT
18.266 1.823 18.266 2.323 QT
18.266 2.886 18.633 3.3 QT
19 3.714 19.547 3.714 QT
21.266 3.714 L
22.516 3.714 23.523 3.94 QT
24.531 4.167 25.211 4.846 QT
25.891 5.526 25.891 6.761 QT
25.891 7.682 25.117 8.292 QT
24.344 8.901 23.258 9.175 QT
22.172 9.448 21.25 9.448 QT
20.313 9.448 19.227 9.175 QT
18.141 8.901 17.359 8.292 QT
16.578 7.682 16.578 6.761 QT
cp
17.766 6.761 M
17.766 7.464 18.336 7.94 QT
18.906 8.417 19.719 8.651 QT
20.531 8.886 21.25 8.886 QT
21.953 8.886 22.766 8.651 QT
23.578 8.417 24.148 7.94 QT
24.719 7.464 24.719 6.761 QT
24.719 5.667 23.711 5.339 QT
22.703 5.011 21.266 5.011 QT
19.547 5.011 L
19.063 5.011 18.656 5.245 QT
18.25 5.479 18.008 5.893 QT
17.766 6.307 17.766 6.761 QT
cp
20.672 1.464 M
22.453 1.464 22.453 -1.068 QT
22.453 -2.177 22.07 -2.888 QT
21.688 -3.599 20.672 -3.599 QT
19.641 -3.599 19.258 -2.888 QT
18.875 -2.177 18.875 -1.068 QT
18.875 -0.38 19.023 0.182 QT
19.172 0.745 19.563 1.104 QT
19.953 1.464 20.672 1.464 QT
cp}def
f-745240314
f
GR
GS
[0.75 0 0 0.75 320.86361 68.70343] CT
N
/f1964844890{31.901 5.354 M
30.62 5.354 29.55 4.682 QT
28.479 4.011 27.862 2.886 QT
27.245 1.761 27.245 0.511 QT
27.245 -0.708 27.807 -1.818 QT
28.37 -2.927 29.37 -3.607 QT
30.37 -4.286 31.604 -4.286 QT
32.557 -4.286 33.276 -3.966 QT
33.995 -3.646 34.456 -3.075 QT
34.917 -2.505 35.151 -1.724 QT
35.385 -0.943 35.385 -0.005 QT
35.385 0.276 35.167 0.276 QT
29.089 0.276 L
29.089 0.495 L
29.089 2.245 29.792 3.495 QT
30.495 4.745 32.089 4.745 QT
32.729 4.745 33.276 4.456 QT
33.823 4.167 34.229 3.651 QT
34.635 3.136 34.776 2.557 QT
34.792 2.479 34.854 2.425 QT
34.917 2.37 34.979 2.37 QT
35.167 2.37 L
35.385 2.37 35.385 2.636 QT
35.089 3.823 34.104 4.589 QT
33.12 5.354 31.901 5.354 QT
cp
29.104 -0.255 M
33.901 -0.255 L
33.901 -1.036 33.675 -1.849 QT
33.448 -2.661 32.94 -3.2 QT
32.432 -3.739 31.604 -3.739 QT
30.417 -3.739 29.76 -2.63 QT
29.104 -1.521 29.104 -0.255 QT
cp}def
f1964844890
f
GR
GS
[0.75 0 0 0.75 320.86361 68.70343] CT
N
/f1881606250{36.773 5.12 M
36.773 4.386 L
37.492 4.386 37.953 4.268 QT
38.414 4.151 38.414 3.714 QT
38.414 -2.021 L
38.414 -2.583 38.242 -2.833 QT
38.07 -3.083 37.758 -3.138 QT
37.445 -3.193 36.773 -3.193 QT
36.773 -3.927 L
39.82 -4.161 L
39.82 -2.114 L
40.242 -3.005 41.07 -3.583 QT
41.898 -4.161 42.867 -4.161 QT
44.32 -4.161 45.054 -3.466 QT
45.789 -2.771 45.789 -1.333 QT
45.789 3.714 L
45.789 4.151 46.25 4.268 QT
46.711 4.386 47.429 4.386 QT
47.429 5.12 L
42.617 5.12 L
42.617 4.386 L
43.336 4.386 43.797 4.268 QT
44.258 4.151 44.258 3.714 QT
44.258 -1.271 L
44.258 -2.286 43.961 -2.95 QT
43.664 -3.614 42.742 -3.614 QT
41.523 -3.614 40.734 -2.638 QT
39.945 -1.661 39.945 -0.427 QT
39.945 3.714 L
39.945 4.151 40.414 4.268 QT
40.883 4.386 41.586 4.386 QT
41.586 5.12 L
36.773 5.12 L
cp}def
f1881606250
f
GR
GS
[0.75 0 0 0.75 320.86361 68.70343] CT
N
/f-1218143468{49.548 2.604 M
49.548 -3.193 L
47.814 -3.193 L
47.814 -3.739 L
49.189 -3.739 49.829 -5.021 QT
50.47 -6.302 50.47 -7.802 QT
51.079 -7.802 L
51.079 -3.927 L
54.048 -3.927 L
54.048 -3.193 L
51.079 -3.193 L
51.079 2.557 L
51.079 3.432 51.368 4.089 QT
51.657 4.745 52.423 4.745 QT
53.142 4.745 53.462 4.05 QT
53.782 3.354 53.782 2.557 QT
53.782 1.323 L
54.376 1.323 L
54.376 2.604 L
54.376 3.261 54.134 3.901 QT
53.892 4.542 53.423 4.948 QT
52.954 5.354 52.282 5.354 QT
51.017 5.354 50.282 4.604 QT
49.548 3.854 49.548 2.604 QT
cp}def
f-1218143468
f
GR
GS
[0.75 0 0 0.75 320.86361 68.70343] CT
N
/f-1429999007{63.862 5.12 M
63.862 4.557 L
63.862 4.511 63.909 4.448 QT
67.159 0.839 L
67.909 0.026 68.37 -0.513 QT
68.831 -1.052 69.276 -1.763 QT
69.721 -2.474 69.987 -3.2 QT
70.252 -3.927 70.252 -4.755 QT
70.252 -5.614 69.932 -6.404 QT
69.612 -7.193 68.979 -7.661 QT
68.346 -8.13 67.456 -8.13 QT
66.549 -8.13 65.823 -7.583 QT
65.096 -7.036 64.799 -6.161 QT
64.877 -6.177 65.018 -6.177 QT
65.487 -6.177 65.823 -5.864 QT
66.159 -5.552 66.159 -5.036 QT
66.159 -4.568 65.823 -4.232 QT
65.487 -3.896 65.018 -3.896 QT
64.534 -3.896 64.198 -4.239 QT
63.862 -4.583 63.862 -5.036 QT
63.862 -5.833 64.159 -6.521 QT
64.456 -7.208 65.018 -7.747 QT
65.581 -8.286 66.276 -8.575 QT
66.971 -8.864 67.768 -8.864 QT
68.971 -8.864 70.002 -8.357 QT
71.034 -7.849 71.643 -6.919 QT
72.252 -5.989 72.252 -4.755 QT
72.252 -3.849 71.854 -3.029 QT
71.456 -2.208 70.831 -1.536 QT
70.206 -0.864 69.229 -0.013 QT
68.252 0.839 67.94 1.136 QT
65.565 3.417 L
67.581 3.417 L
69.065 3.417 70.065 3.393 QT
71.065 3.37 71.127 3.307 QT
71.377 3.042 71.627 1.37 QT
72.252 1.37 L
71.659 5.12 L
63.862 5.12 L
cp}def
f-1429999007
f
GR
GS
[0.75 0 0 0.75 0 0.5] CT
1 LJ
0.667 LW
N
384.985 90.938 M
424.83 90.938 L
S
GR
GS
[0.75 0 0 0.75 320.86361 88.29657] CT
N
f-597267615
f
GR
GS
[0.75 0 0 0.75 320.86361 88.29657] CT
N
f-745240314
f
GR
GS
[0.75 0 0 0.75 320.86361 88.29657] CT
N
f1964844890
f
GR
GS
[0.75 0 0 0.75 320.86361 88.29657] CT
N
f1881606250
f
GR
GS
[0.75 0 0 0.75 320.86361 88.29657] CT
N
f-1218143468
f
GR
GS
[0.75 0 0 0.75 320.86361 88.29657] CT
N
/f300774680{64.815 3.495 M
65.299 4.214 66.135 4.565 QT
66.971 4.917 67.924 4.917 QT
69.143 4.917 69.659 3.878 QT
70.174 2.839 70.174 1.511 QT
70.174 0.917 70.065 0.323 QT
69.956 -0.271 69.698 -0.786 QT
69.44 -1.302 68.995 -1.607 QT
68.549 -1.911 67.909 -1.911 QT
66.502 -1.911 L
66.315 -1.911 66.315 -2.114 QT
66.315 -2.286 L
66.315 -2.458 66.502 -2.458 QT
67.659 -2.552 L
68.409 -2.552 68.893 -3.107 QT
69.377 -3.661 69.604 -4.45 QT
69.831 -5.239 69.831 -5.958 QT
69.831 -6.974 69.362 -7.614 QT
68.893 -8.255 67.924 -8.255 QT
67.127 -8.255 66.393 -7.958 QT
65.659 -7.661 65.237 -7.036 QT
65.284 -7.052 65.307 -7.06 QT
65.331 -7.068 65.377 -7.068 QT
65.846 -7.068 66.166 -6.739 QT
66.487 -6.411 66.487 -5.943 QT
66.487 -5.489 66.166 -5.161 QT
65.846 -4.833 65.377 -4.833 QT
64.924 -4.833 64.596 -5.161 QT
64.268 -5.489 64.268 -5.943 QT
64.268 -6.849 64.807 -7.513 QT
65.346 -8.177 66.206 -8.521 QT
67.065 -8.864 67.924 -8.864 QT
68.565 -8.864 69.268 -8.677 QT
69.971 -8.489 70.549 -8.138 QT
71.127 -7.786 71.487 -7.232 QT
71.846 -6.677 71.846 -5.958 QT
71.846 -5.083 71.456 -4.333 QT
71.065 -3.583 70.377 -3.044 QT
69.69 -2.505 68.862 -2.239 QT
69.784 -2.052 70.604 -1.544 QT
71.424 -1.036 71.916 -0.232 QT
72.409 0.573 72.409 1.495 QT
72.409 2.651 71.776 3.589 QT
71.143 4.526 70.104 5.057 QT
69.065 5.589 67.924 5.589 QT
66.94 5.589 65.948 5.214 QT
64.956 4.839 64.323 4.089 QT
63.69 3.339 63.69 2.292 QT
63.69 1.761 64.041 1.417 QT
64.393 1.073 64.924 1.073 QT
65.252 1.073 65.534 1.229 QT
65.815 1.386 65.979 1.675 QT
66.143 1.964 66.143 2.292 QT
66.143 2.807 65.784 3.151 QT
65.424 3.495 64.924 3.495 QT
64.815 3.495 L
cp}def
f300774680
f
GR
GS
[0.75 0 0 0.75 0 0.5] CT
0 0 1 RC
1 LJ
0.667 LW
N
384.985 117.062 M
424.83 117.062 L
S
GR
GS
[0.75 0 0 0.75 320.86361 107.88971] CT
N
f-597267615
f
GR
GS
[0.75 0 0 0.75 320.86361 107.88971] CT
N
f-745240314
f
GR
GS
[0.75 0 0 0.75 320.86361 107.88971] CT
N
f1964844890
f
GR
GS
[0.75 0 0 0.75 320.86361 107.88971] CT
N
f1881606250
f
GR
GS
[0.75 0 0 0.75 320.86361 107.88971] CT
N
f-1218143468
f
GR
GS
[0.75 0 0 0.75 320.86361 107.88971] CT
N
/f-1674298674{63.393 1.651 M
63.393 0.917 L
69.893 -8.771 L
69.956 -8.864 70.112 -8.864 QT
70.409 -8.864 L
70.643 -8.864 70.643 -8.63 QT
70.643 0.917 L
72.706 0.917 L
72.706 1.651 L
70.643 1.651 L
70.643 3.714 L
70.643 4.151 71.26 4.268 QT
71.877 4.386 72.69 4.386 QT
72.69 5.12 L
66.909 5.12 L
66.909 4.386 L
67.721 4.386 68.331 4.268 QT
68.94 4.151 68.94 3.714 QT
68.94 1.651 L
63.393 1.651 L
cp
64.096 0.917 M
69.065 0.917 L
69.065 -6.521 L
64.096 0.917 L
cp}def
f-1674298674
f
GR
GS
[0.75 0 0 0.75 0 0.5] CT
0.6 0.2 0.2 RC
1 LJ
0.667 LW
N
384.985 143.186 M
424.83 143.186 L
S
GR
GS
[0.75 0 0 0.75 0 0.5] CT
0.149 GC
10.0 ML
0.667 LW
N
381 158 M
381 50 L
505 50 L
505 158 L
cp
S
GR
%%Trailer
%%Pages: 1
%%EOF
