module scraper

go 1.23.0

require (
	github.com/go-telegram-bot-api/telegram-bot-api/v5 v5.5.1
	github.com/gocolly/colly v1.2.0
	github.com/joho/godotenv v1.5.1
)

require (
	github.com/PuerkitoBio/goquery v1.10.2 // indirect
	github.com/andybalholm/cascadia v1.3.3 // indirect
	github.com/antchfx/htmlquery v1.3.4 // indirect
	github.com/antchfx/xmlquery v1.4.4 // indirect
	github.com/antchfx/xpath v1.3.3 // indirect
	github.com/dustin/go-humanize v1.0.1 // indirect
	github.com/gobwas/glob v0.2.3 // indirect
	github.com/golang/groupcache v0.0.0-20241129210726-2c02b8208cf8 // indirect
	github.com/golang/protobuf v1.5.4 // indirect
	github.com/google/uuid v1.6.0 // indirect
	github.com/kennygrant/sanitize v1.2.4 // indirect
	github.com/mattn/go-isatty v0.0.20 // indirect
	github.com/ncruces/go-strftime v0.1.9 // indirect
	github.com/remyoudompheng/bigfft v0.0.0-20230129092748-24d4a6f8daec // indirect
	github.com/saintfish/chardet v0.0.0-20230101081208-5e3ef4b5456d // indirect
	github.com/temoto/robotstxt v1.1.2 // indirect
	golang.org/x/exp v0.0.0-20230315142452-642cacee5cc0 // indirect
	golang.org/x/net v0.35.0 // indirect
	golang.org/x/sys v0.30.0 // indirect
	golang.org/x/text v0.22.0 // indirect
	google.golang.org/appengine v1.6.8 // indirect
	google.golang.org/protobuf v1.36.5 // indirect
	modernc.org/libc v1.61.13 // indirect
	modernc.org/mathutil v1.7.1 // indirect
	modernc.org/memory v1.8.2 // indirect
	modernc.org/sqlite v1.36.0 // indirect
)
