# Blender v2.76 (sub 0) OBJ File: 'vshapes.blend'
# www.blender.org
o NurbsPath_Mesh
v 0.043808 0.130244 -0.113260
v 0.159041 0.130245 -0.101155
v 0.253340 0.130245 -0.086748
v 0.326701 0.130245 -0.070480
v 0.379117 0.130245 -0.052794
v 0.410584 0.130245 -0.034130
v 0.421096 0.130245 -0.014932
v 0.410648 0.130245 0.004359
v 0.379233 0.130245 0.023301
v 0.326847 0.130245 0.041452
v 0.253485 0.130245 0.058370
v 0.159140 0.130245 0.073613
v 0.043808 0.130244 0.086740
v 0.043808 0.121734 -0.113260
v 0.159041 0.121734 -0.101155
v 0.253340 0.121734 -0.086748
v 0.326701 0.121734 -0.070480
v 0.379117 0.121734 -0.052794
v 0.410584 0.121734 -0.034130
v 0.421096 0.121734 -0.014932
v 0.410648 0.121734 0.004359
v 0.379233 0.121734 0.023301
v 0.326847 0.121734 0.041452
v 0.253485 0.121734 0.058370
v 0.159140 0.121734 0.073613
v 0.043808 0.121734 0.086740
v 0.043808 0.113223 -0.113260
v 0.159041 0.113223 -0.101155
v 0.253340 0.113223 -0.086748
v 0.326701 0.113223 -0.070480
v 0.379117 0.113223 -0.052794
v 0.410584 0.113223 -0.034130
v 0.421096 0.113223 -0.014932
v 0.410648 0.113223 0.004359
v 0.379233 0.113223 0.023301
v 0.326847 0.113223 0.041452
v 0.253485 0.113223 0.058370
v 0.159140 0.113223 0.073613
v 0.043808 0.113223 0.086740
v 0.043808 0.104713 -0.113260
v 0.159041 0.104713 -0.101155
v 0.253340 0.104713 -0.086748
v 0.326701 0.104713 -0.070480
v 0.379117 0.104713 -0.052794
v 0.410584 0.104713 -0.034130
v 0.421096 0.104713 -0.014932
v 0.410648 0.104713 0.004359
v 0.379233 0.104713 0.023301
v 0.326847 0.104713 0.041452
v 0.253485 0.104713 0.058370
v 0.159140 0.104713 0.073613
v 0.043808 0.104713 0.086740
v 0.043808 0.096202 -0.113260
v 0.159041 0.096202 -0.101155
v 0.253340 0.096202 -0.086748
v 0.326701 0.096202 -0.070480
v 0.379117 0.096202 -0.052794
v 0.410584 0.096202 -0.034130
v 0.421096 0.096202 -0.014932
v 0.410648 0.096202 0.004359
v 0.379233 0.096202 0.023301
v 0.326847 0.096202 0.041452
v 0.253485 0.096202 0.058370
v 0.159140 0.096202 0.073613
v 0.043808 0.096202 0.086740
v 0.043808 0.087691 -0.113260
v 0.159041 0.087691 -0.101155
v 0.253340 0.087691 -0.086748
v 0.326701 0.087691 -0.070480
v 0.379117 0.087691 -0.052794
v 0.410584 0.087691 -0.034130
v 0.421096 0.087691 -0.014932
v 0.410648 0.087691 0.004359
v 0.379233 0.087691 0.023301
v 0.326847 0.087691 0.041452
v 0.253485 0.087691 0.058370
v 0.159140 0.087691 0.073613
v 0.043808 0.087691 0.086740
v 0.043808 0.079181 -0.113260
v 0.159041 0.079181 -0.101155
v 0.253340 0.079181 -0.086748
v 0.326701 0.079181 -0.070480
v 0.379117 0.079181 -0.052794
v 0.410584 0.079181 -0.034130
v 0.421096 0.079181 -0.014932
v 0.410648 0.079181 0.004359
v 0.379233 0.079181 0.023301
v 0.326847 0.079181 0.041452
v 0.253485 0.079181 0.058370
v 0.159140 0.079181 0.073613
v 0.043808 0.079181 0.086740
v 0.043808 0.070670 -0.113260
v 0.159041 0.070670 -0.101155
v 0.253340 0.070670 -0.086748
v 0.326701 0.070670 -0.070480
v 0.379117 0.070670 -0.052794
v 0.410584 0.070670 -0.034130
v 0.421096 0.070670 -0.014932
v 0.410648 0.070670 0.004359
v 0.379233 0.070670 0.023301
v 0.326847 0.070670 0.041452
v 0.253485 0.070670 0.058370
v 0.159140 0.070670 0.073613
v 0.043808 0.070670 0.086740
v 0.043808 0.062159 -0.113260
v 0.159041 0.062159 -0.101155
v 0.253340 0.062159 -0.086748
v 0.326701 0.062159 -0.070480
v 0.379117 0.062159 -0.052794
v 0.410584 0.062159 -0.034130
v 0.421096 0.062159 -0.014932
v 0.410648 0.062159 0.004359
v 0.379233 0.062159 0.023301
v 0.326847 0.062159 0.041452
v 0.253485 0.062159 0.058370
v 0.159140 0.062159 0.073613
v 0.043808 0.062159 0.086740
v 0.043808 0.053649 -0.113260
v 0.159041 0.053649 -0.101155
v 0.253340 0.053649 -0.086748
v 0.326701 0.053649 -0.070480
v 0.379117 0.053649 -0.052794
v 0.410584 0.053649 -0.034130
v 0.421096 0.053649 -0.014932
v 0.410648 0.053649 0.004359
v 0.379233 0.053649 0.023301
v 0.326847 0.053649 0.041452
v 0.253485 0.053649 0.058370
v 0.159140 0.053649 0.073613
v 0.043808 0.053649 0.086740
v 0.043808 0.045138 -0.113260
v 0.159041 0.045138 -0.101155
v 0.253340 0.045138 -0.086748
v 0.326701 0.045138 -0.070480
v 0.379117 0.045138 -0.052794
v 0.410584 0.045138 -0.034130
v 0.421096 0.045138 -0.014932
v 0.410648 0.045138 0.004359
v 0.379233 0.045138 0.023301
v 0.326847 0.045138 0.041452
v 0.253485 0.045138 0.058370
v 0.159140 0.045138 0.073613
v 0.043808 0.045138 0.086740
v 0.043808 0.036627 -0.113260
v 0.159041 0.036627 -0.101155
v 0.253340 0.036627 -0.086748
v 0.326701 0.036627 -0.070480
v 0.379117 0.036627 -0.052794
v 0.410584 0.036627 -0.034130
v 0.421096 0.036627 -0.014932
v 0.410648 0.036627 0.004359
v 0.379233 0.036627 0.023301
v 0.326847 0.036627 0.041452
v 0.253485 0.036627 0.058370
v 0.159140 0.036627 0.073613
v 0.043808 0.036627 0.086740
v 0.043808 0.028117 -0.113260
v 0.159041 0.028117 -0.101155
v 0.253340 0.028117 -0.086748
v 0.326701 0.028117 -0.070480
v 0.379117 0.028117 -0.052794
v 0.410584 0.028117 -0.034130
v 0.421096 0.028117 -0.014932
v 0.410648 0.028117 0.004359
v 0.379233 0.028117 0.023301
v 0.326847 0.028117 0.041452
v 0.253485 0.028117 0.058370
v 0.159140 0.028117 0.073613
v 0.043808 0.028117 0.086740
v 0.043808 0.019606 -0.113260
v 0.159041 0.019606 -0.101155
v 0.253340 0.019606 -0.086748
v 0.326701 0.019606 -0.070480
v 0.379117 0.019606 -0.052794
v 0.410584 0.019606 -0.034130
v 0.421096 0.019606 -0.014932
v 0.410648 0.019606 0.004359
v 0.379233 0.019606 0.023301
v 0.326847 0.019606 0.041452
v 0.253485 0.019606 0.058370
v 0.159140 0.019606 0.073613
v 0.043808 0.019606 0.086740
v 0.043808 0.011096 -0.113260
v 0.159041 0.011096 -0.101155
v 0.253340 0.011096 -0.086748
v 0.326701 0.011096 -0.070480
v 0.379117 0.011096 -0.052794
v 0.410584 0.011096 -0.034130
v 0.421096 0.011096 -0.014932
v 0.410648 0.011096 0.004359
v 0.379233 0.011096 0.023301
v 0.326847 0.011096 0.041452
v 0.253485 0.011096 0.058370
v 0.159140 0.011096 0.073613
v 0.043808 0.011096 0.086740
v 0.043808 0.002585 -0.113260
v 0.159041 0.002585 -0.101155
v 0.253340 0.002585 -0.086748
v 0.326701 0.002585 -0.070480
v 0.379117 0.002585 -0.052794
v 0.410584 0.002585 -0.034130
v 0.421096 0.002585 -0.014932
v 0.410648 0.002585 0.004359
v 0.379233 0.002585 0.023301
v 0.326847 0.002585 0.041452
v 0.253485 0.002585 0.058370
v 0.159140 0.002585 0.073613
v 0.043808 0.002585 0.086740
v 0.043808 -0.005926 -0.113260
v 0.159041 -0.005926 -0.101155
v 0.253340 -0.005926 -0.086748
v 0.326701 -0.005926 -0.070480
v 0.379117 -0.005926 -0.052794
v 0.410584 -0.005926 -0.034130
v 0.421096 -0.005926 -0.014932
v 0.410648 -0.005926 0.004359
v 0.379233 -0.005926 0.023301
v 0.326847 -0.005926 0.041452
v 0.253485 -0.005926 0.058370
v 0.159140 -0.005926 0.073613
v 0.043808 -0.005926 0.086740
v 0.043808 -0.014436 -0.113260
v 0.159041 -0.014436 -0.101155
v 0.253340 -0.014436 -0.086748
v 0.326701 -0.014436 -0.070480
v 0.379117 -0.014436 -0.052794
v 0.410584 -0.014436 -0.034130
v 0.421096 -0.014436 -0.014932
v 0.410648 -0.014436 0.004359
v 0.379233 -0.014436 0.023301
v 0.326847 -0.014436 0.041452
v 0.253485 -0.014436 0.058370
v 0.159140 -0.014436 0.073613
v 0.043808 -0.014436 0.086740
v 0.043808 -0.022947 -0.113260
v 0.159041 -0.022947 -0.101155
v 0.253340 -0.022947 -0.086748
v 0.326701 -0.022947 -0.070480
v 0.379117 -0.022947 -0.052794
v 0.410584 -0.022947 -0.034130
v 0.421096 -0.022947 -0.014932
v 0.410648 -0.022947 0.004359
v 0.379233 -0.022947 0.023301
v 0.326847 -0.022947 0.041452
v 0.253485 -0.022947 0.058370
v 0.159140 -0.022947 0.073613
v 0.043808 -0.022947 0.086740
v 0.043808 -0.031458 -0.113260
v 0.159041 -0.031458 -0.101155
v 0.253340 -0.031458 -0.086748
v 0.326701 -0.031458 -0.070480
v 0.379117 -0.031458 -0.052794
v 0.410584 -0.031458 -0.034130
v 0.421096 -0.031458 -0.014932
v 0.410648 -0.031458 0.004359
v 0.379233 -0.031458 0.023301
v 0.326847 -0.031458 0.041452
v 0.253485 -0.031458 0.058370
v 0.159140 -0.031458 0.073613
v 0.043808 -0.031458 0.086740
v 0.043808 -0.039968 -0.113260
v 0.159041 -0.039968 -0.101155
v 0.253340 -0.039968 -0.086748
v 0.326701 -0.039968 -0.070480
v 0.379117 -0.039968 -0.052794
v 0.410584 -0.039968 -0.034130
v 0.421096 -0.039968 -0.014932
v 0.410648 -0.039968 0.004359
v 0.379233 -0.039968 0.023301
v 0.326847 -0.039968 0.041452
v 0.253485 -0.039968 0.058370
v 0.159140 -0.039968 0.073613
v 0.043808 -0.039968 0.086740
v 0.043808 -0.048479 -0.113260
v 0.159041 -0.048479 -0.101155
v 0.253340 -0.048479 -0.086748
v 0.326701 -0.048479 -0.070480
v 0.379117 -0.048479 -0.052794
v 0.410584 -0.048479 -0.034130
v 0.421096 -0.048479 -0.014932
v 0.410648 -0.048479 0.004359
v 0.379233 -0.048479 0.023301
v 0.326847 -0.048479 0.041452
v 0.253485 -0.048479 0.058370
v 0.159140 -0.048479 0.073613
v 0.043808 -0.048479 0.086740
v 0.043808 -0.056990 -0.113260
v 0.159041 -0.056990 -0.101155
v 0.253340 -0.056990 -0.086748
v 0.326701 -0.056990 -0.070480
v 0.379117 -0.056990 -0.052794
v 0.410584 -0.056990 -0.034130
v 0.421096 -0.056990 -0.014932
v 0.410648 -0.056990 0.004359
v 0.379233 -0.056990 0.023301
v 0.326847 -0.056990 0.041452
v 0.253485 -0.056990 0.058370
v 0.159140 -0.056990 0.073613
v 0.043808 -0.056990 0.086740
v 0.043808 -0.065500 -0.113260
v 0.159041 -0.065500 -0.101155
v 0.253340 -0.065500 -0.086748
v 0.326701 -0.065500 -0.070480
v 0.379117 -0.065500 -0.052794
v 0.410584 -0.065500 -0.034130
v 0.421096 -0.065500 -0.014932
v 0.410648 -0.065500 0.004359
v 0.379233 -0.065500 0.023301
v 0.326847 -0.065500 0.041452
v 0.253485 -0.065500 0.058370
v 0.159140 -0.065500 0.073613
v 0.043808 -0.065500 0.086740
v 0.043808 -0.074011 -0.113260
v 0.159041 -0.074011 -0.101155
v 0.253340 -0.074011 -0.086748
v 0.326701 -0.074011 -0.070480
v 0.379117 -0.074011 -0.052794
v 0.410584 -0.074011 -0.034130
v 0.421096 -0.074011 -0.014932
v 0.410648 -0.074011 0.004359
v 0.379233 -0.074011 0.023301
v 0.326847 -0.074011 0.041452
v 0.253485 -0.074011 0.058370
v 0.159140 -0.074011 0.073613
v 0.043808 -0.074011 0.086740
v 0.043808 -0.082522 -0.113260
v 0.159041 -0.082522 -0.101155
v 0.253340 -0.082521 -0.086748
v 0.326701 -0.082521 -0.070480
v 0.379117 -0.082521 -0.052794
v 0.410584 -0.082521 -0.034130
v 0.421096 -0.082521 -0.014932
v 0.410648 -0.082521 0.004359
v 0.379233 -0.082521 0.023301
v 0.326847 -0.082521 0.041452
v 0.253485 -0.082521 0.058370
v 0.159140 -0.082522 0.073613
v 0.043808 -0.082522 0.086740
v 0.043808 -0.091032 -0.113260
v 0.159041 -0.091032 -0.101155
v 0.253340 -0.091032 -0.086748
v 0.326701 -0.091032 -0.070480
v 0.379117 -0.091032 -0.052794
v 0.410584 -0.091032 -0.034130
v 0.421096 -0.091032 -0.014932
v 0.410648 -0.091032 0.004359
v 0.379233 -0.091032 0.023301
v 0.326847 -0.091032 0.041452
v 0.253485 -0.091032 0.058370
v 0.159140 -0.091032 0.073613
v 0.043808 -0.091032 0.086740
v 0.043808 -0.099543 -0.113260
v 0.159041 -0.099543 -0.101155
v 0.253340 -0.099543 -0.086748
v 0.326701 -0.099543 -0.070480
v 0.379117 -0.099543 -0.052794
v 0.410584 -0.099543 -0.034130
v 0.421096 -0.099543 -0.014932
v 0.410648 -0.099543 0.004359
v 0.379233 -0.099543 0.023301
v 0.326847 -0.099543 0.041452
v 0.253485 -0.099543 0.058370
v 0.159140 -0.099543 0.073613
v 0.043808 -0.099543 0.086740
v 0.043808 -0.108053 -0.113260
v 0.159041 -0.108053 -0.101155
v 0.253340 -0.108053 -0.086748
v 0.326701 -0.108053 -0.070480
v 0.379117 -0.108053 -0.052794
v 0.410584 -0.108053 -0.034130
v 0.421096 -0.108053 -0.014932
v 0.410648 -0.108053 0.004359
v 0.379233 -0.108053 0.023301
v 0.326847 -0.108053 0.041452
v 0.253485 -0.108053 0.058370
v 0.159140 -0.108053 0.073613
v 0.043808 -0.108053 0.086740
v 0.043808 -0.116564 -0.113260
v 0.159041 -0.116564 -0.101155
v 0.253340 -0.116564 -0.086748
v 0.326701 -0.116564 -0.070480
v 0.379117 -0.116564 -0.052794
v 0.410584 -0.116564 -0.034130
v 0.421096 -0.116564 -0.014932
v 0.410648 -0.116564 0.004359
v 0.379233 -0.116564 0.023301
v 0.326847 -0.116564 0.041452
v 0.253485 -0.116564 0.058370
v 0.159140 -0.116564 0.073613
v 0.043808 -0.116564 0.086740
v 0.043808 -0.125075 -0.113260
v 0.159041 -0.125075 -0.101155
v 0.253340 -0.125075 -0.086748
v 0.326701 -0.125075 -0.070480
v 0.379117 -0.125075 -0.052794
v 0.410584 -0.125075 -0.034130
v 0.421096 -0.125075 -0.014932
v 0.410648 -0.125075 0.004359
v 0.379233 -0.125075 0.023301
v 0.326847 -0.125075 0.041452
v 0.253485 -0.125075 0.058370
v 0.159140 -0.125075 0.073613
v 0.043808 -0.125075 0.086740
v 0.043808 -0.133585 -0.113260
v 0.159041 -0.133585 -0.101155
v 0.253340 -0.133585 -0.086748
v 0.326701 -0.133585 -0.070480
v 0.379117 -0.133585 -0.052794
v 0.410584 -0.133585 -0.034130
v 0.421096 -0.133585 -0.014932
v 0.410648 -0.133585 0.004359
v 0.379233 -0.133585 0.023301
v 0.326847 -0.133585 0.041452
v 0.253485 -0.133585 0.058370
v 0.159140 -0.133585 0.073613
v 0.043808 -0.133585 0.086740
v 0.043808 -0.142096 -0.113260
v 0.159041 -0.142096 -0.101155
v 0.253340 -0.142096 -0.086748
v 0.326701 -0.142096 -0.070480
v 0.379117 -0.142096 -0.052794
v 0.410584 -0.142096 -0.034130
v 0.421096 -0.142096 -0.014932
v 0.410648 -0.142096 0.004359
v 0.379233 -0.142096 0.023301
v 0.326847 -0.142096 0.041452
v 0.253485 -0.142096 0.058370
v 0.159140 -0.142096 0.073613
v 0.043808 -0.142096 0.086740
v 0.043808 -0.150607 -0.113260
v 0.159041 -0.150607 -0.101155
v 0.253340 -0.150607 -0.086748
v 0.326701 -0.150607 -0.070480
v 0.379117 -0.150607 -0.052794
v 0.410584 -0.150607 -0.034130
v 0.421096 -0.150607 -0.014932
v 0.410648 -0.150607 0.004359
v 0.379233 -0.150607 0.023301
v 0.326847 -0.150607 0.041452
v 0.253485 -0.150607 0.058370
v 0.159140 -0.150607 0.073613
v 0.043808 -0.150607 0.086740
v 0.043808 -0.159117 -0.113260
v 0.159041 -0.159117 -0.101155
v 0.253340 -0.159117 -0.086748
v 0.326701 -0.159117 -0.070480
v 0.379117 -0.159117 -0.052794
v 0.410584 -0.159117 -0.034130
v 0.421096 -0.159117 -0.014932
v 0.410648 -0.159117 0.004359
v 0.379233 -0.159117 0.023301
v 0.326847 -0.159117 0.041452
v 0.253485 -0.159117 0.058370
v 0.159140 -0.159117 0.073613
v 0.043808 -0.159117 0.086740
v 0.043808 -0.167628 -0.113260
v 0.159041 -0.167628 -0.101155
v 0.253340 -0.167628 -0.086748
v 0.326701 -0.167628 -0.070480
v 0.379117 -0.167628 -0.052794
v 0.410584 -0.167628 -0.034130
v 0.421096 -0.167628 -0.014932
v 0.410648 -0.167628 0.004359
v 0.379233 -0.167628 0.023301
v 0.326847 -0.167628 0.041452
v 0.253485 -0.167628 0.058370
v 0.159140 -0.167628 0.073613
v 0.043808 -0.167628 0.086740
v 0.043808 -0.176139 -0.113260
v 0.159041 -0.176139 -0.101155
v 0.253340 -0.176139 -0.086748
v 0.326701 -0.176139 -0.070480
v 0.379117 -0.176139 -0.052794
v 0.410584 -0.176139 -0.034130
v 0.421096 -0.176139 -0.014932
v 0.410648 -0.176139 0.004359
v 0.379233 -0.176139 0.023301
v 0.326847 -0.176139 0.041452
v 0.253485 -0.176139 0.058370
v 0.159140 -0.176139 0.073613
v 0.043808 -0.176139 0.086740
v 0.043808 -0.184649 -0.113260
v 0.159041 -0.184649 -0.101155
v 0.253340 -0.184649 -0.086748
v 0.326701 -0.184649 -0.070480
v 0.379117 -0.184649 -0.052794
v 0.410584 -0.184649 -0.034130
v 0.421096 -0.184649 -0.014932
v 0.410648 -0.184649 0.004359
v 0.379233 -0.184649 0.023301
v 0.326847 -0.184649 0.041452
v 0.253485 -0.184649 0.058370
v 0.159140 -0.184649 0.073613
v 0.043808 -0.184649 0.086740
v 0.043808 -0.193160 -0.113260
v 0.159041 -0.193160 -0.101155
v 0.253340 -0.193160 -0.086748
v 0.326701 -0.193160 -0.070480
v 0.379117 -0.193160 -0.052794
v 0.410584 -0.193160 -0.034130
v 0.421096 -0.193160 -0.014932
v 0.410648 -0.193160 0.004359
v 0.379233 -0.193160 0.023301
v 0.326847 -0.193160 0.041452
v 0.253485 -0.193160 0.058370
v 0.159140 -0.193160 0.073613
v 0.043808 -0.193160 0.086740
v 0.043808 -0.201670 -0.113260
v 0.159041 -0.201670 -0.101155
v 0.253340 -0.201670 -0.086748
v 0.326701 -0.201670 -0.070480
v 0.379117 -0.201670 -0.052794
v 0.410584 -0.201670 -0.034130
v 0.421096 -0.201670 -0.014932
v 0.410648 -0.201670 0.004359
v 0.379233 -0.201670 0.023301
v 0.326847 -0.201670 0.041452
v 0.253485 -0.201670 0.058370
v 0.159140 -0.201670 0.073613
v 0.043808 -0.201670 0.086740
v 0.043808 -0.210181 -0.113260
v 0.159041 -0.210181 -0.101155
v 0.253340 -0.210181 -0.086748
v 0.326701 -0.210181 -0.070480
v 0.379117 -0.210181 -0.052794
v 0.410584 -0.210181 -0.034130
v 0.421096 -0.210181 -0.014932
v 0.410648 -0.210181 0.004359
v 0.379233 -0.210181 0.023301
v 0.326847 -0.210181 0.041452
v 0.253485 -0.210181 0.058370
v 0.159140 -0.210181 0.073613
v 0.043808 -0.210181 0.086740
v 0.043808 -0.218692 -0.113260
v 0.159041 -0.218692 -0.101155
v 0.253340 -0.218692 -0.086748
v 0.326701 -0.218692 -0.070480
v 0.379117 -0.218692 -0.052794
v 0.410584 -0.218692 -0.034130
v 0.421096 -0.218692 -0.014932
v 0.410648 -0.218692 0.004359
v 0.379233 -0.218692 0.023301
v 0.326847 -0.218692 0.041452
v 0.253485 -0.218692 0.058370
v 0.159140 -0.218692 0.073613
v 0.043808 -0.218692 0.086740
v 0.043808 -0.227202 -0.113260
v 0.159041 -0.227202 -0.101155
v 0.253340 -0.227202 -0.086748
v 0.326701 -0.227202 -0.070480
v 0.379117 -0.227202 -0.052794
v 0.410584 -0.227202 -0.034130
v 0.421096 -0.227202 -0.014932
v 0.410648 -0.227202 0.004359
v 0.379233 -0.227202 0.023301
v 0.326847 -0.227202 0.041452
v 0.253485 -0.227202 0.058370
v 0.159140 -0.227202 0.073613
v 0.043808 -0.227202 0.086740
v 0.043808 -0.235713 -0.113260
v 0.159041 -0.235713 -0.101155
v 0.253340 -0.235713 -0.086748
v 0.326701 -0.235713 -0.070480
v 0.379117 -0.235713 -0.052794
v 0.410584 -0.235713 -0.034130
v 0.421096 -0.235713 -0.014932
v 0.410648 -0.235713 0.004359
v 0.379233 -0.235713 0.023301
v 0.326847 -0.235713 0.041452
v 0.253485 -0.235713 0.058370
v 0.159140 -0.235713 0.073613
v 0.043808 -0.235713 0.086740
v 0.043808 -0.244224 -0.113260
v 0.159041 -0.244224 -0.101155
v 0.253340 -0.244224 -0.086748
v 0.326701 -0.244224 -0.070480
v 0.379117 -0.244224 -0.052794
v 0.410584 -0.244224 -0.034130
v 0.421096 -0.244224 -0.014932
v 0.410648 -0.244224 0.004359
v 0.379233 -0.244224 0.023301
v 0.326847 -0.244224 0.041452
v 0.253485 -0.244224 0.058370
v 0.159140 -0.244224 0.073613
v 0.043808 -0.244224 0.086740
v 0.043808 -0.252734 -0.113260
v 0.159041 -0.252734 -0.101155
v 0.253340 -0.252734 -0.086748
v 0.326701 -0.252734 -0.070480
v 0.379117 -0.252734 -0.052794
v 0.410584 -0.252734 -0.034130
v 0.421096 -0.252734 -0.014932
v 0.410648 -0.252734 0.004359
v 0.379233 -0.252734 0.023301
v 0.326847 -0.252734 0.041452
v 0.253485 -0.252734 0.058370
v 0.159140 -0.252734 0.073613
v 0.043808 -0.252734 0.086740
v 0.043808 -0.261245 -0.113260
v 0.159041 -0.261245 -0.101155
v 0.253340 -0.261245 -0.086748
v 0.326701 -0.261245 -0.070480
v 0.379117 -0.261245 -0.052794
v 0.410584 -0.261245 -0.034130
v 0.421096 -0.261245 -0.014932
v 0.410648 -0.261245 0.004359
v 0.379233 -0.261245 0.023301
v 0.326847 -0.261245 0.041452
v 0.253485 -0.261245 0.058370
v 0.159140 -0.261245 0.073613
v 0.043808 -0.261245 0.086740
v 0.043808 -0.269756 -0.113260
v 0.159041 -0.269756 -0.101155
v 0.253340 -0.269756 -0.086748
v 0.326701 -0.269756 -0.070480
v 0.379117 -0.269756 -0.052794
v 0.410584 -0.269756 -0.034130
v 0.421096 -0.269756 -0.014932
v 0.410648 -0.269756 0.004359
v 0.379233 -0.269756 0.023301
v 0.326847 -0.269756 0.041452
v 0.253485 -0.269756 0.058370
v 0.159140 -0.269756 0.073613
v 0.043808 -0.269756 0.086740
s 1
f 15 14 1
f 16 15 2
f 17 16 3
f 18 17 4
f 19 18 5
f 7 20 19
f 21 20 7
f 22 21 8
f 23 22 9
f 24 23 10
f 25 24 11
f 26 25 12
f 15 28 27
f 16 29 28
f 17 30 29
f 18 31 30
f 19 32 31
f 20 33 32
f 34 33 20
f 35 34 21
f 36 35 22
f 37 36 23
f 38 37 24
f 39 38 25
f 41 40 27
f 42 41 28
f 43 42 29
f 44 43 30
f 45 44 31
f 46 45 32
f 34 47 46
f 35 48 47
f 36 49 48
f 37 50 49
f 38 51 50
f 52 51 38
f 54 53 40
f 55 54 41
f 56 55 42
f 57 56 43
f 58 57 44
f 59 58 45
f 47 60 59
f 61 60 47
f 62 61 48
f 50 63 62
f 64 63 50
f 52 65 64
f 67 66 53
f 55 68 67
f 56 69 68
f 57 70 69
f 58 71 70
f 59 72 71
f 73 72 59
f 61 74 73
f 62 75 74
f 76 75 62
f 64 77 76
f 65 78 77
f 67 80 79
f 68 81 80
f 69 82 81
f 70 83 82
f 71 84 83
f 72 85 84
f 86 85 72
f 87 86 73
f 88 87 74
f 89 88 75
f 90 89 76
f 91 90 77
f 93 92 79
f 81 94 93
f 95 94 81
f 96 95 82
f 97 96 83
f 98 97 84
f 99 98 85
f 100 99 86
f 101 100 87
f 102 101 88
f 103 102 89
f 104 103 90
f 106 105 92
f 107 106 93
f 108 107 94
f 109 108 95
f 110 109 96
f 111 110 97
f 99 112 111
f 100 113 112
f 101 114 113
f 102 115 114
f 103 116 115
f 117 116 103
f 106 119 118
f 107 120 119
f 108 121 120
f 109 122 121
f 110 123 122
f 111 124 123
f 125 124 111
f 126 125 112
f 127 126 113
f 128 127 114
f 129 128 115
f 130 129 116
f 132 131 118
f 133 132 119
f 134 133 120
f 135 134 121
f 136 135 122
f 137 136 123
f 138 137 124
f 139 138 125
f 140 139 126
f 141 140 127
f 142 141 128
f 143 142 129
f 145 144 131
f 146 145 132
f 147 146 133
f 148 147 134
f 149 148 135
f 150 149 136
f 138 151 150
f 139 152 151
f 140 153 152
f 141 154 153
f 142 155 154
f 156 155 142
f 145 158 157
f 146 159 158
f 147 160 159
f 148 161 160
f 149 162 161
f 150 163 162
f 164 163 150
f 165 164 151
f 166 165 152
f 167 166 153
f 168 167 154
f 169 168 155
f 171 170 157
f 172 171 158
f 173 172 159
f 174 173 160
f 175 174 161
f 176 175 162
f 177 176 163
f 178 177 164
f 179 178 165
f 180 179 166
f 181 180 167
f 182 181 168
f 171 184 183
f 185 184 171
f 186 185 172
f 187 186 173
f 175 188 187
f 189 188 175
f 190 189 176
f 178 191 190
f 192 191 178
f 193 192 179
f 194 193 180
f 195 194 181
f 197 196 183
f 198 197 184
f 199 198 185
f 200 199 186
f 188 201 200
f 202 201 188
f 203 202 189
f 191 204 203
f 205 204 191
f 206 205 192
f 207 206 193
f 208 207 194
f 210 209 196
f 198 211 210
f 199 212 211
f 200 213 212
f 201 214 213
f 202 215 214
f 216 215 202
f 217 216 203
f 218 217 204
f 219 218 205
f 207 220 219
f 221 220 207
f 223 222 209
f 224 223 210
f 225 224 211
f 226 225 212
f 214 227 226
f 228 227 214
f 216 229 228
f 230 229 216
f 231 230 217
f 232 231 218
f 233 232 219
f 234 233 220
f 223 236 235
f 237 236 223
f 238 237 224
f 239 238 225
f 240 239 226
f 241 240 227
f 229 242 241
f 230 243 242
f 231 244 243
f 232 245 244
f 246 245 232
f 247 246 233
f 249 248 235
f 250 249 236
f 251 250 237
f 252 251 238
f 253 252 239
f 254 253 240
f 242 255 254
f 243 256 255
f 244 257 256
f 245 258 257
f 259 258 245
f 260 259 246
f 262 261 248
f 263 262 249
f 264 263 250
f 252 265 264
f 253 266 265
f 254 267 266
f 268 267 254
f 269 268 255
f 270 269 256
f 271 270 257
f 272 271 258
f 273 272 259
f 275 274 261
f 276 275 262
f 277 276 263
f 278 277 264
f 279 278 265
f 280 279 266
f 281 280 267
f 282 281 268
f 283 282 269
f 284 283 270
f 285 284 271
f 286 285 272
f 288 287 274
f 289 288 275
f 290 289 276
f 291 290 277
f 292 291 278
f 293 292 279
f 294 293 280
f 295 294 281
f 296 295 282
f 297 296 283
f 298 297 284
f 299 298 285
f 301 300 287
f 302 301 288
f 303 302 289
f 304 303 290
f 305 304 291
f 306 305 292
f 307 306 293
f 295 308 307
f 309 308 295
f 310 309 296
f 311 310 297
f 312 311 298
f 314 313 300
f 315 314 301
f 316 315 302
f 317 316 303
f 318 317 304
f 319 318 305
f 307 320 319
f 308 321 320
f 309 322 321
f 310 323 322
f 324 323 310
f 312 325 324
f 314 327 326
f 328 327 314
f 329 328 315
f 330 329 316
f 331 330 317
f 332 331 318
f 333 332 319
f 334 333 320
f 335 334 321
f 336 335 322
f 337 336 323
f 338 337 324
f 327 340 339
f 341 340 327
f 342 341 328
f 330 343 342
f 331 344 343
f 332 345 344
f 346 345 332
f 347 346 333
f 348 347 334
f 349 348 335
f 350 349 336
f 338 351 350
f 353 352 339
f 354 353 340
f 355 354 341
f 356 355 342
f 357 356 343
f 358 357 344
f 359 358 345
f 360 359 346
f 361 360 347
f 362 361 348
f 363 362 349
f 351 364 363
f 353 366 365
f 367 366 353
f 368 367 354
f 369 368 355
f 370 369 356
f 371 370 357
f 372 371 358
f 373 372 359
f 374 373 360
f 375 374 361
f 376 375 362
f 377 376 363
f 379 378 365
f 380 379 366
f 381 380 367
f 382 381 368
f 383 382 369
f 384 383 370
f 372 385 384
f 373 386 385
f 374 387 386
f 375 388 387
f 389 388 375
f 390 389 376
f 392 391 378
f 393 392 379
f 394 393 380
f 395 394 381
f 396 395 382
f 397 396 383
f 398 397 384
f 399 398 385
f 400 399 386
f 401 400 387
f 402 401 388
f 403 402 389
f 405 404 391
f 406 405 392
f 407 406 393
f 408 407 394
f 409 408 395
f 410 409 396
f 411 410 397
f 412 411 398
f 413 412 399
f 414 413 400
f 415 414 401
f 416 415 402
f 418 417 404
f 419 418 405
f 420 419 406
f 421 420 407
f 422 421 408
f 423 422 409
f 424 423 410
f 412 425 424
f 426 425 412
f 427 426 413
f 428 427 414
f 429 428 415
f 431 430 417
f 432 431 418
f 433 432 419
f 434 433 420
f 435 434 421
f 436 435 422
f 437 436 423
f 438 437 424
f 439 438 425
f 440 439 426
f 441 440 427
f 442 441 428
f 444 443 430
f 432 445 444
f 446 445 432
f 447 446 433
f 448 447 434
f 449 448 435
f 450 449 436
f 451 450 437
f 452 451 438
f 453 452 439
f 454 453 440
f 455 454 441
f 457 456 443
f 458 457 444
f 459 458 445
f 460 459 446
f 461 460 447
f 462 461 448
f 463 462 449
f 464 463 450
f 465 464 451
f 453 466 465
f 454 467 466
f 468 467 454
f 457 470 469
f 458 471 470
f 459 472 471
f 460 473 472
f 461 474 473
f 462 475 474
f 476 475 462
f 464 477 476
f 465 478 477
f 479 478 465
f 480 479 466
f 481 480 467
f 483 482 469
f 471 484 483
f 485 484 471
f 486 485 472
f 487 486 473
f 488 487 474
f 489 488 475
f 490 489 476
f 491 490 477
f 492 491 478
f 493 492 479
f 494 493 480
f 496 495 482
f 497 496 483
f 498 497 484
f 499 498 485
f 500 499 486
f 501 500 487
f 502 501 488
f 490 503 502
f 504 503 490
f 492 505 504
f 506 505 492
f 507 506 493
f 509 508 495
f 510 509 496
f 511 510 497
f 512 511 498
f 513 512 499
f 514 513 500
f 515 514 501
f 516 515 502
f 517 516 503
f 505 518 517
f 519 518 505
f 520 519 506
f 522 521 508
f 523 522 509
f 524 523 510
f 525 524 511
f 526 525 512
f 527 526 513
f 528 527 514
f 529 528 515
f 530 529 516
f 531 530 517
f 532 531 518
f 533 532 519
f 535 534 521
f 536 535 522
f 537 536 523
f 538 537 524
f 539 538 525
f 540 539 526
f 541 540 527
f 542 541 528
f 530 543 542
f 531 544 543
f 545 544 531
f 546 545 532
f 535 548 547
f 536 549 548
f 537 550 549
f 538 551 550
f 539 552 551
f 540 553 552
f 554 553 540
f 555 554 541
f 543 556 555
f 557 556 543
f 558 557 544
f 546 559 558
f 561 560 547
f 562 561 548
f 563 562 549
f 564 563 550
f 565 564 551
f 566 565 552
f 567 566 553
f 568 567 554
f 556 569 568
f 570 569 556
f 571 570 557
f 572 571 558
f 574 573 560
f 575 574 561
f 576 575 562
f 577 576 563
f 578 577 564
f 579 578 565
f 580 579 566
f 581 580 567
f 582 581 568
f 583 582 569
f 584 583 570
f 572 585 584
f 587 586 573
f 588 587 574
f 589 588 575
f 590 589 576
f 591 590 577
f 592 591 578
f 593 592 579
f 594 593 580
f 595 594 581
f 596 595 582
f 597 596 583
f 598 597 584
f 600 599 586
f 601 600 587
f 602 601 588
f 603 602 589
f 604 603 590
f 605 604 591
f 606 605 592
f 607 606 593
f 595 608 607
f 609 608 595
f 610 609 596
f 611 610 597
f 613 612 599
f 614 613 600
f 602 615 614
f 603 616 615
f 617 616 603
f 605 618 617
f 619 618 605
f 620 619 606
f 621 620 607
f 622 621 608
f 623 622 609
f 624 623 610
f 2 15 1
f 3 16 2
f 4 17 3
f 5 18 4
f 6 19 5
f 6 7 19
f 8 21 7
f 9 22 8
f 10 23 9
f 11 24 10
f 12 25 11
f 13 26 12
f 14 15 27
f 15 16 28
f 16 17 29
f 17 18 30
f 18 19 31
f 19 20 32
f 21 34 20
f 22 35 21
f 23 36 22
f 24 37 23
f 25 38 24
f 26 39 25
f 28 41 27
f 29 42 28
f 30 43 29
f 31 44 30
f 32 45 31
f 33 46 32
f 33 34 46
f 34 35 47
f 35 36 48
f 36 37 49
f 37 38 50
f 39 52 38
f 41 54 40
f 42 55 41
f 43 56 42
f 44 57 43
f 45 58 44
f 46 59 45
f 46 47 59
f 48 61 47
f 49 62 48
f 49 50 62
f 51 64 50
f 51 52 64
f 54 67 53
f 54 55 67
f 55 56 68
f 56 57 69
f 57 58 70
f 58 59 71
f 60 73 59
f 60 61 73
f 61 62 74
f 63 76 62
f 63 64 76
f 64 65 77
f 66 67 79
f 67 68 80
f 68 69 81
f 69 70 82
f 70 71 83
f 71 72 84
f 73 86 72
f 74 87 73
f 75 88 74
f 76 89 75
f 77 90 76
f 78 91 77
f 80 93 79
f 80 81 93
f 82 95 81
f 83 96 82
f 84 97 83
f 85 98 84
f 86 99 85
f 87 100 86
f 88 101 87
f 89 102 88
f 90 103 89
f 91 104 90
f 93 106 92
f 94 107 93
f 95 108 94
f 96 109 95
f 97 110 96
f 98 111 97
f 98 99 111
f 99 100 112
f 100 101 113
f 101 102 114
f 102 103 115
f 104 117 103
f 105 106 118
f 106 107 119
f 107 108 120
f 108 109 121
f 109 110 122
f 110 111 123
f 112 125 111
f 113 126 112
f 114 127 113
f 115 128 114
f 116 129 115
f 117 130 116
f 119 132 118
f 120 133 119
f 121 134 120
f 122 135 121
f 123 136 122
f 124 137 123
f 125 138 124
f 126 139 125
f 127 140 126
f 128 141 127
f 129 142 128
f 130 143 129
f 132 145 131
f 133 146 132
f 134 147 133
f 135 148 134
f 136 149 135
f 137 150 136
f 137 138 150
f 138 139 151
f 139 140 152
f 140 141 153
f 141 142 154
f 143 156 142
f 144 145 157
f 145 146 158
f 146 147 159
f 147 148 160
f 148 149 161
f 149 150 162
f 151 164 150
f 152 165 151
f 153 166 152
f 154 167 153
f 155 168 154
f 156 169 155
f 158 171 157
f 159 172 158
f 160 173 159
f 161 174 160
f 162 175 161
f 163 176 162
f 164 177 163
f 165 178 164
f 166 179 165
f 167 180 166
f 168 181 167
f 169 182 168
f 170 171 183
f 172 185 171
f 173 186 172
f 174 187 173
f 174 175 187
f 176 189 175
f 177 190 176
f 177 178 190
f 179 192 178
f 180 193 179
f 181 194 180
f 182 195 181
f 184 197 183
f 185 198 184
f 186 199 185
f 187 200 186
f 187 188 200
f 189 202 188
f 190 203 189
f 190 191 203
f 192 205 191
f 193 206 192
f 194 207 193
f 195 208 194
f 197 210 196
f 197 198 210
f 198 199 211
f 199 200 212
f 200 201 213
f 201 202 214
f 203 216 202
f 204 217 203
f 205 218 204
f 206 219 205
f 206 207 219
f 208 221 207
f 210 223 209
f 211 224 210
f 212 225 211
f 213 226 212
f 213 214 226
f 215 228 214
f 215 216 228
f 217 230 216
f 218 231 217
f 219 232 218
f 220 233 219
f 221 234 220
f 222 223 235
f 224 237 223
f 225 238 224
f 226 239 225
f 227 240 226
f 228 241 227
f 228 229 241
f 229 230 242
f 230 231 243
f 231 232 244
f 233 246 232
f 234 247 233
f 236 249 235
f 237 250 236
f 238 251 237
f 239 252 238
f 240 253 239
f 241 254 240
f 241 242 254
f 242 243 255
f 243 244 256
f 244 245 257
f 246 259 245
f 247 260 246
f 249 262 248
f 250 263 249
f 251 264 250
f 251 252 264
f 252 253 265
f 253 254 266
f 255 268 254
f 256 269 255
f 257 270 256
f 258 271 257
f 259 272 258
f 260 273 259
f 262 275 261
f 263 276 262
f 264 277 263
f 265 278 264
f 266 279 265
f 267 280 266
f 268 281 267
f 269 282 268
f 270 283 269
f 271 284 270
f 272 285 271
f 273 286 272
f 275 288 274
f 276 289 275
f 277 290 276
f 278 291 277
f 279 292 278
f 280 293 279
f 281 294 280
f 282 295 281
f 283 296 282
f 284 297 283
f 285 298 284
f 286 299 285
f 288 301 287
f 289 302 288
f 290 303 289
f 291 304 290
f 292 305 291
f 293 306 292
f 294 307 293
f 294 295 307
f 296 309 295
f 297 310 296
f 298 311 297
f 299 312 298
f 301 314 300
f 302 315 301
f 303 316 302
f 304 317 303
f 305 318 304
f 306 319 305
f 306 307 319
f 307 308 320
f 308 309 321
f 309 310 322
f 311 324 310
f 311 312 324
f 313 314 326
f 315 328 314
f 316 329 315
f 317 330 316
f 318 331 317
f 319 332 318
f 320 333 319
f 321 334 320
f 322 335 321
f 323 336 322
f 324 337 323
f 325 338 324
f 326 327 339
f 328 341 327
f 329 342 328
f 329 330 342
f 330 331 343
f 331 332 344
f 333 346 332
f 334 347 333
f 335 348 334
f 336 349 335
f 337 350 336
f 337 338 350
f 340 353 339
f 341 354 340
f 342 355 341
f 343 356 342
f 344 357 343
f 345 358 344
f 346 359 345
f 347 360 346
f 348 361 347
f 349 362 348
f 350 363 349
f 350 351 363
f 352 353 365
f 354 367 353
f 355 368 354
f 356 369 355
f 357 370 356
f 358 371 357
f 359 372 358
f 360 373 359
f 361 374 360
f 362 375 361
f 363 376 362
f 364 377 363
f 366 379 365
f 367 380 366
f 368 381 367
f 369 382 368
f 370 383 369
f 371 384 370
f 371 372 384
f 372 373 385
f 373 374 386
f 374 375 387
f 376 389 375
f 377 390 376
f 379 392 378
f 380 393 379
f 381 394 380
f 382 395 381
f 383 396 382
f 384 397 383
f 385 398 384
f 386 399 385
f 387 400 386
f 388 401 387
f 389 402 388
f 390 403 389
f 392 405 391
f 393 406 392
f 394 407 393
f 395 408 394
f 396 409 395
f 397 410 396
f 398 411 397
f 399 412 398
f 400 413 399
f 401 414 400
f 402 415 401
f 403 416 402
f 405 418 404
f 406 419 405
f 407 420 406
f 408 421 407
f 409 422 408
f 410 423 409
f 411 424 410
f 411 412 424
f 413 426 412
f 414 427 413
f 415 428 414
f 416 429 415
f 418 431 417
f 419 432 418
f 420 433 419
f 421 434 420
f 422 435 421
f 423 436 422
f 424 437 423
f 425 438 424
f 426 439 425
f 427 440 426
f 428 441 427
f 429 442 428
f 431 444 430
f 431 432 444
f 433 446 432
f 434 447 433
f 435 448 434
f 436 449 435
f 437 450 436
f 438 451 437
f 439 452 438
f 440 453 439
f 441 454 440
f 442 455 441
f 444 457 443
f 445 458 444
f 446 459 445
f 447 460 446
f 448 461 447
f 449 462 448
f 450 463 449
f 451 464 450
f 452 465 451
f 452 453 465
f 453 454 466
f 455 468 454
f 456 457 469
f 457 458 470
f 458 459 471
f 459 460 472
f 460 461 473
f 461 462 474
f 463 476 462
f 463 464 476
f 464 465 477
f 466 479 465
f 467 480 466
f 468 481 467
f 470 483 469
f 470 471 483
f 472 485 471
f 473 486 472
f 474 487 473
f 475 488 474
f 476 489 475
f 477 490 476
f 478 491 477
f 479 492 478
f 480 493 479
f 481 494 480
f 483 496 482
f 484 497 483
f 485 498 484
f 486 499 485
f 487 500 486
f 488 501 487
f 489 502 488
f 489 490 502
f 491 504 490
f 491 492 504
f 493 506 492
f 494 507 493
f 496 509 495
f 497 510 496
f 498 511 497
f 499 512 498
f 500 513 499
f 501 514 500
f 502 515 501
f 503 516 502
f 504 517 503
f 504 505 517
f 506 519 505
f 507 520 506
f 509 522 508
f 510 523 509
f 511 524 510
f 512 525 511
f 513 526 512
f 514 527 513
f 515 528 514
f 516 529 515
f 517 530 516
f 518 531 517
f 519 532 518
f 520 533 519
f 522 535 521
f 523 536 522
f 524 537 523
f 525 538 524
f 526 539 525
f 527 540 526
f 528 541 527
f 529 542 528
f 529 530 542
f 530 531 543
f 532 545 531
f 533 546 532
f 534 535 547
f 535 536 548
f 536 537 549
f 537 538 550
f 538 539 551
f 539 540 552
f 541 554 540
f 542 555 541
f 542 543 555
f 544 557 543
f 545 558 544
f 545 546 558
f 548 561 547
f 549 562 548
f 550 563 549
f 551 564 550
f 552 565 551
f 553 566 552
f 554 567 553
f 555 568 554
f 555 556 568
f 557 570 556
f 558 571 557
f 559 572 558
f 561 574 560
f 562 575 561
f 563 576 562
f 564 577 563
f 565 578 564
f 566 579 565
f 567 580 566
f 568 581 567
f 569 582 568
f 570 583 569
f 571 584 570
f 571 572 584
f 574 587 573
f 575 588 574
f 576 589 575
f 577 590 576
f 578 591 577
f 579 592 578
f 580 593 579
f 581 594 580
f 582 595 581
f 583 596 582
f 584 597 583
f 585 598 584
f 587 600 586
f 588 601 587
f 589 602 588
f 590 603 589
f 591 604 590
f 592 605 591
f 593 606 592
f 594 607 593
f 594 595 607
f 596 609 595
f 597 610 596
f 598 611 597
f 600 613 599
f 601 614 600
f 601 602 614
f 602 603 615
f 604 617 603
f 604 605 617
f 606 619 605
f 607 620 606
f 608 621 607
f 609 622 608
f 610 623 609
f 611 624 610
