# Blender v2.76 (sub 0) OBJ File: ''
# www.blender.org
o Cylinder
v -0.066215 -0.069270 -0.093762
v -0.072535 -0.061823 -0.093762
v -0.075927 -0.057689 -0.093762
v -0.069687 -0.065295 -0.093762
v -0.058769 -0.075590 -0.093762
v -0.062240 -0.072741 -0.093762
v -0.054634 -0.078982 -0.093762
v -0.066215 -0.069270 -0.086819
v -0.066215 -0.069270 -0.079876
v -0.066215 -0.069270 -0.072933
v -0.066215 -0.069270 -0.065990
v -0.072535 -0.061823 -0.086819
v -0.072535 -0.061823 -0.079876
v -0.075927 -0.057689 -0.086819
v -0.075927 -0.057689 -0.079876
v -0.069687 -0.065295 -0.086819
v -0.069687 -0.065295 -0.079876
v -0.072535 -0.061823 -0.072933
v -0.072535 -0.061823 -0.065990
v -0.075927 -0.057689 -0.072933
v -0.075927 -0.057689 -0.065990
v -0.069687 -0.065295 -0.072933
v -0.069687 -0.065295 -0.065990
v -0.058769 -0.075590 -0.086819
v -0.058769 -0.075590 -0.079876
v -0.062240 -0.072741 -0.086819
v -0.062240 -0.072741 -0.079876
v -0.054634 -0.078982 -0.086819
v -0.054634 -0.078982 -0.079876
v -0.058769 -0.075590 -0.072933
v -0.058769 -0.075590 -0.065990
v -0.062240 -0.072741 -0.072933
v -0.062240 -0.072741 -0.065990
v -0.054634 -0.078982 -0.072933
v -0.054634 -0.078982 -0.065990
v -0.066215 -0.069270 -0.059047
v -0.066215 -0.069270 -0.052104
v -0.066215 -0.069270 -0.045162
v -0.066215 -0.069270 -0.038219
v -0.072535 -0.061823 -0.059047
v -0.072535 -0.061823 -0.052104
v -0.075927 -0.057689 -0.059047
v -0.075927 -0.057689 -0.052104
v -0.069687 -0.065295 -0.059047
v -0.069687 -0.065295 -0.052104
v -0.072535 -0.061823 -0.045162
v -0.072535 -0.061823 -0.038219
v -0.075927 -0.057689 -0.045162
v -0.075927 -0.057689 -0.038219
v -0.069687 -0.065295 -0.045162
v -0.069687 -0.065295 -0.038219
v -0.058769 -0.075590 -0.059047
v -0.058769 -0.075590 -0.052104
v -0.062240 -0.072741 -0.059047
v -0.062240 -0.072741 -0.052104
v -0.054634 -0.078982 -0.059047
v -0.054634 -0.078982 -0.052104
v -0.058769 -0.075590 -0.045162
v -0.058769 -0.075590 -0.038219
v -0.062240 -0.072741 -0.045162
v -0.062240 -0.072741 -0.038219
v -0.054634 -0.078982 -0.045162
v -0.054634 -0.078982 -0.038219
v -0.066215 -0.069270 -0.031276
v -0.066215 -0.069270 -0.024333
v -0.066215 -0.069270 -0.017390
v -0.066215 -0.069270 -0.010447
v -0.072535 -0.061823 -0.031276
v -0.072535 -0.061823 -0.024333
v -0.075927 -0.057689 -0.031276
v -0.075927 -0.057689 -0.024333
v -0.069687 -0.065295 -0.031276
v -0.069687 -0.065295 -0.024333
v -0.072535 -0.061823 -0.017390
v -0.072535 -0.061823 -0.010447
v -0.075927 -0.057689 -0.017390
v -0.075927 -0.057689 -0.010447
v -0.069687 -0.065295 -0.017390
v -0.069687 -0.065295 -0.010447
v -0.058769 -0.075590 -0.031276
v -0.058769 -0.075590 -0.024333
v -0.062240 -0.072741 -0.031276
v -0.062240 -0.072741 -0.024333
v -0.054634 -0.078982 -0.031276
v -0.054634 -0.078982 -0.024333
v -0.058769 -0.075590 -0.017390
v -0.058769 -0.075590 -0.010447
v -0.062240 -0.072741 -0.017390
v -0.062240 -0.072741 -0.010447
v -0.054634 -0.078982 -0.017390
v -0.054634 -0.078982 -0.010447
v -0.086036 -0.040630 -0.093762
v -0.080709 -0.050596 -0.093762
v -0.084181 -0.044101 -0.093762
v -0.087641 -0.036860 -0.093762
v -0.090138 -0.029917 -0.093762
v -0.086036 -0.040630 -0.086819
v -0.086036 -0.040630 -0.079876
v -0.080709 -0.050596 -0.086819
v -0.080709 -0.050596 -0.079876
v -0.084181 -0.044101 -0.086819
v -0.084181 -0.044101 -0.079876
v -0.086036 -0.040630 -0.072933
v -0.086036 -0.040630 -0.065990
v -0.080709 -0.050596 -0.072933
v -0.080709 -0.050596 -0.065990
v -0.084181 -0.044101 -0.072933
v -0.084181 -0.044101 -0.065990
v -0.087641 -0.036860 -0.086819
v -0.087641 -0.036860 -0.079876
v -0.090138 -0.029917 -0.086819
v -0.090138 -0.029917 -0.079876
v -0.087641 -0.036860 -0.072933
v -0.087641 -0.036860 -0.065990
v -0.090138 -0.029917 -0.072933
v -0.090138 -0.029917 -0.065990
v -0.093059 -0.020290 -0.093762
v -0.093775 -0.016031 -0.093762
v -0.094594 -0.009088 -0.093762
v -0.095277 -0.002145 -0.093762
v -0.092006 -0.023762 -0.093762
v -0.093059 -0.020290 -0.086819
v -0.093059 -0.020290 -0.079876
v -0.093775 -0.016031 -0.086819
v -0.093775 -0.016031 -0.079876
v -0.093059 -0.020290 -0.072933
v -0.093059 -0.020290 -0.065990
v -0.093775 -0.016031 -0.072933
v -0.093775 -0.016031 -0.065990
v -0.094594 -0.009088 -0.086819
v -0.094594 -0.009088 -0.079876
v -0.095277 -0.002145 -0.086819
v -0.095277 -0.002145 -0.079876
v -0.094594 -0.009088 -0.072933
v -0.094594 -0.009088 -0.065990
v -0.095277 -0.002145 -0.072933
v -0.095277 -0.002145 -0.065990
v -0.092006 -0.023762 -0.086819
v -0.092006 -0.023762 -0.079876
v -0.092006 -0.023762 -0.072933
v -0.092006 -0.023762 -0.065990
v -0.078854 -0.054067 -0.093762
v -0.078854 -0.054067 -0.086819
v -0.078854 -0.054067 -0.079876
v -0.078854 -0.054067 -0.072933
v -0.078854 -0.054067 -0.065990
v -0.086036 -0.040630 -0.059047
v -0.086036 -0.040630 -0.052104
v -0.080709 -0.050596 -0.059047
v -0.080709 -0.050596 -0.052104
v -0.084181 -0.044101 -0.059047
v -0.084181 -0.044101 -0.052104
v -0.086036 -0.040630 -0.045162
v -0.086036 -0.040630 -0.038219
v -0.080709 -0.050596 -0.045162
v -0.080709 -0.050596 -0.038219
v -0.084181 -0.044101 -0.045162
v -0.084181 -0.044101 -0.038219
v -0.087641 -0.036860 -0.059047
v -0.087641 -0.036860 -0.052104
v -0.090138 -0.029917 -0.059047
v -0.090138 -0.029917 -0.052104
v -0.087641 -0.036860 -0.045162
v -0.087641 -0.036860 -0.038219
v -0.090138 -0.029917 -0.045162
v -0.090138 -0.029917 -0.038219
v -0.086036 -0.040630 -0.031276
v -0.086036 -0.040630 -0.024333
v -0.080709 -0.050596 -0.031276
v -0.080709 -0.050596 -0.024333
v -0.084181 -0.044101 -0.031276
v -0.084181 -0.044101 -0.024333
v -0.086036 -0.040630 -0.017390
v -0.086036 -0.040630 -0.010447
v -0.080709 -0.050596 -0.017390
v -0.080709 -0.050596 -0.010447
v -0.084181 -0.044101 -0.017390
v -0.084181 -0.044101 -0.010447
v -0.087641 -0.036860 -0.031276
v -0.087641 -0.036860 -0.024333
v -0.090138 -0.029917 -0.031276
v -0.090138 -0.029917 -0.024333
v -0.087641 -0.036860 -0.017390
v -0.087641 -0.036860 -0.010447
v -0.090138 -0.029917 -0.017390
v -0.090138 -0.029917 -0.010447
v -0.093059 -0.020290 -0.059047
v -0.093059 -0.020290 -0.052104
v -0.093775 -0.016031 -0.059047
v -0.093775 -0.016031 -0.052104
v -0.093059 -0.020290 -0.045162
v -0.093059 -0.020290 -0.038219
v -0.093775 -0.016031 -0.045162
v -0.093775 -0.016031 -0.038219
v -0.094594 -0.009088 -0.059047
v -0.094594 -0.009088 -0.052104
v -0.095277 -0.002145 -0.059047
v -0.095277 -0.002145 -0.052104
v -0.094594 -0.009088 -0.045162
v -0.094594 -0.009088 -0.038219
v -0.095277 -0.002145 -0.045162
v -0.095277 -0.002145 -0.038219
v -0.092006 -0.023762 -0.059047
v -0.092006 -0.023762 -0.052104
v -0.092006 -0.023762 -0.045162
v -0.092006 -0.023762 -0.038219
v -0.093059 -0.020290 -0.031276
v -0.093059 -0.020290 -0.024333
v -0.093775 -0.016031 -0.031276
v -0.093775 -0.016031 -0.024333
v -0.093059 -0.020290 -0.017390
v -0.093059 -0.020290 -0.010447
v -0.093775 -0.016031 -0.017390
v -0.093775 -0.016031 -0.010447
v -0.094594 -0.009088 -0.031276
v -0.094594 -0.009088 -0.024333
v -0.095277 -0.002145 -0.031276
v -0.095277 -0.002145 -0.024333
v -0.094594 -0.009088 -0.017390
v -0.094594 -0.009088 -0.010447
v -0.095277 -0.002145 -0.017390
v -0.095277 -0.002145 -0.010447
v -0.092006 -0.023762 -0.031276
v -0.092006 -0.023762 -0.024333
v -0.092006 -0.023762 -0.017390
v -0.092006 -0.023762 -0.010447
v -0.078854 -0.054067 -0.059047
v -0.078854 -0.054067 -0.052104
v -0.078854 -0.054067 -0.045162
v -0.078854 -0.054067 -0.038219
v -0.078854 -0.054067 -0.031276
v -0.078854 -0.054067 -0.024333
v -0.078854 -0.054067 -0.017390
v -0.078854 -0.054067 -0.010447
v -0.047541 -0.083764 -0.093762
v -0.037575 -0.089091 -0.093762
v -0.041046 -0.087236 -0.093762
v -0.033805 -0.090695 -0.093762
v -0.026862 -0.093193 -0.093762
v -0.047541 -0.083764 -0.086819
v -0.047541 -0.083764 -0.079876
v -0.037575 -0.089091 -0.086819
v -0.037575 -0.089091 -0.079876
v -0.041046 -0.087236 -0.086819
v -0.041046 -0.087236 -0.079876
v -0.047541 -0.083764 -0.072933
v -0.047541 -0.083764 -0.065990
v -0.037575 -0.089091 -0.072933
v -0.037575 -0.089091 -0.065990
v -0.041046 -0.087236 -0.072933
v -0.041046 -0.087236 -0.065990
v -0.033805 -0.090695 -0.086819
v -0.033805 -0.090695 -0.079876
v -0.026862 -0.093193 -0.086819
v -0.026862 -0.093193 -0.079876
v -0.033805 -0.090695 -0.072933
v -0.033805 -0.090695 -0.065990
v -0.026862 -0.093193 -0.072933
v -0.026862 -0.093193 -0.065990
v -0.051012 -0.081909 -0.093762
v -0.051012 -0.081909 -0.086819
v -0.051012 -0.081909 -0.079876
v -0.051012 -0.081909 -0.072933
v -0.051012 -0.081909 -0.065990
v -0.017235 -0.096114 -0.093762
v -0.012976 -0.096829 -0.093762
v -0.020707 -0.095060 -0.093762
v -0.006034 -0.097648 -0.093762
v 0.000909 -0.098332 -0.093762
v -0.017235 -0.096114 -0.086819
v -0.017235 -0.096114 -0.079876
v -0.012976 -0.096829 -0.086819
v -0.012976 -0.096829 -0.079876
v -0.017235 -0.096114 -0.072933
v -0.017235 -0.096114 -0.065990
v -0.012976 -0.096829 -0.072933
v -0.012976 -0.096829 -0.065990
v -0.020707 -0.095060 -0.086819
v -0.020707 -0.095060 -0.079876
v -0.020707 -0.095060 -0.072933
v -0.020707 -0.095060 -0.065990
v -0.006034 -0.097648 -0.086819
v -0.006034 -0.097648 -0.079876
v 0.000909 -0.098332 -0.086819
v 0.000909 -0.098332 -0.079876
v -0.006034 -0.097648 -0.072933
v -0.006034 -0.097648 -0.065990
v 0.000909 -0.098332 -0.072933
v 0.000909 -0.098332 -0.065990
v -0.047541 -0.083764 -0.059047
v -0.047541 -0.083764 -0.052104
v -0.037575 -0.089091 -0.059047
v -0.037575 -0.089091 -0.052104
v -0.041046 -0.087236 -0.059047
v -0.041046 -0.087236 -0.052104
v -0.047541 -0.083764 -0.045162
v -0.047541 -0.083764 -0.038219
v -0.037575 -0.089091 -0.045162
v -0.037575 -0.089091 -0.038219
v -0.041046 -0.087236 -0.045162
v -0.041046 -0.087236 -0.038219
v -0.033805 -0.090695 -0.059047
v -0.033805 -0.090695 -0.052104
v -0.026862 -0.093193 -0.059047
v -0.026862 -0.093193 -0.052104
v -0.033805 -0.090695 -0.045162
v -0.033805 -0.090695 -0.038219
v -0.026862 -0.093193 -0.045162
v -0.026862 -0.093193 -0.038219
v -0.047541 -0.083764 -0.031276
v -0.047541 -0.083764 -0.024333
v -0.037575 -0.089091 -0.031276
v -0.037575 -0.089091 -0.024333
v -0.041046 -0.087236 -0.031276
v -0.041046 -0.087236 -0.024333
v -0.047541 -0.083764 -0.017390
v -0.047541 -0.083764 -0.010447
v -0.037575 -0.089091 -0.017390
v -0.037575 -0.089091 -0.010447
v -0.041046 -0.087236 -0.017390
v -0.041046 -0.087236 -0.010447
v -0.033805 -0.090695 -0.031276
v -0.033805 -0.090695 -0.024333
v -0.026862 -0.093193 -0.031276
v -0.026862 -0.093193 -0.024333
v -0.033805 -0.090695 -0.017390
v -0.033805 -0.090695 -0.010447
v -0.026862 -0.093193 -0.017390
v -0.026862 -0.093193 -0.010447
v -0.051012 -0.081909 -0.059047
v -0.051012 -0.081909 -0.052104
v -0.051012 -0.081909 -0.045162
v -0.051012 -0.081909 -0.038219
v -0.051012 -0.081909 -0.031276
v -0.051012 -0.081909 -0.024333
v -0.051012 -0.081909 -0.017390
v -0.051012 -0.081909 -0.010447
v -0.017235 -0.096114 -0.059047
v -0.017235 -0.096114 -0.052104
v -0.012976 -0.096829 -0.059047
v -0.012976 -0.096829 -0.052104
v -0.017235 -0.096114 -0.045162
v -0.017235 -0.096114 -0.038219
v -0.012976 -0.096829 -0.045162
v -0.012976 -0.096829 -0.038219
v -0.020707 -0.095060 -0.059047
v -0.020707 -0.095060 -0.052104
v -0.020707 -0.095060 -0.045162
v -0.020707 -0.095060 -0.038219
v -0.006034 -0.097648 -0.059047
v -0.006034 -0.097648 -0.052104
v 0.000909 -0.098332 -0.059047
v 0.000909 -0.098332 -0.052104
v -0.006034 -0.097648 -0.045162
v -0.006034 -0.097648 -0.038219
v 0.000909 -0.098332 -0.045162
v 0.000909 -0.098332 -0.038219
v -0.017235 -0.096114 -0.031276
v -0.017235 -0.096114 -0.024333
v -0.012976 -0.096829 -0.031276
v -0.012976 -0.096829 -0.024333
v -0.017235 -0.096114 -0.017390
v -0.017235 -0.096114 -0.010447
v -0.012976 -0.096829 -0.017390
v -0.012976 -0.096829 -0.010447
v -0.020707 -0.095060 -0.031276
v -0.020707 -0.095060 -0.024333
v -0.020707 -0.095060 -0.017390
v -0.020707 -0.095060 -0.010447
v -0.006034 -0.097648 -0.031276
v -0.006034 -0.097648 -0.024333
v 0.000909 -0.098332 -0.031276
v 0.000909 -0.098332 -0.024333
v -0.006034 -0.097648 -0.017390
v -0.006034 -0.097648 -0.010447
v 0.000909 -0.098332 -0.017390
v 0.000909 -0.098332 -0.010447
v -0.066215 -0.069270 -0.003504
v -0.066215 -0.069270 0.003439
v -0.066215 -0.069270 0.010382
v -0.066215 -0.069270 0.017325
v -0.072535 -0.061823 -0.003504
v -0.072535 -0.061823 0.003439
v -0.075927 -0.057689 -0.003504
v -0.075927 -0.057689 0.003439
v -0.069687 -0.065295 -0.003504
v -0.069687 -0.065295 0.003439
v -0.072535 -0.061823 0.010382
v -0.072535 -0.061823 0.017325
v -0.075927 -0.057689 0.010382
v -0.075927 -0.057689 0.017325
v -0.069687 -0.065295 0.010382
v -0.069687 -0.065295 0.017325
v -0.058769 -0.075590 -0.003504
v -0.058769 -0.075590 0.003439
v -0.062240 -0.072741 -0.003504
v -0.062240 -0.072741 0.003439
v -0.054634 -0.078982 -0.003504
v -0.054634 -0.078982 0.003439
v -0.058769 -0.075590 0.010382
v -0.058769 -0.075590 0.017325
v -0.062240 -0.072741 0.010382
v -0.062240 -0.072741 0.017325
v -0.054634 -0.078982 0.010382
v -0.054634 -0.078982 0.017325
v -0.066215 -0.069270 0.024268
v -0.066215 -0.069270 0.031210
v -0.066215 -0.069270 0.038153
v -0.066215 -0.069270 0.045096
v -0.072535 -0.061823 0.024268
v -0.072535 -0.061823 0.031210
v -0.075927 -0.057689 0.024268
v -0.075927 -0.057689 0.031210
v -0.069687 -0.065295 0.024268
v -0.069687 -0.065295 0.031210
v -0.072535 -0.061823 0.038153
v -0.072535 -0.061823 0.045096
v -0.075927 -0.057689 0.038153
v -0.075927 -0.057689 0.045096
v -0.069687 -0.065295 0.038153
v -0.069687 -0.065295 0.045096
v -0.058769 -0.075590 0.024268
v -0.058769 -0.075590 0.031210
v -0.062240 -0.072741 0.024268
v -0.062240 -0.072741 0.031210
v -0.054634 -0.078982 0.024268
v -0.054634 -0.078982 0.031210
v -0.058769 -0.075590 0.038153
v -0.058769 -0.075590 0.045096
v -0.062240 -0.072741 0.038153
v -0.062240 -0.072741 0.045096
v -0.054634 -0.078982 0.038153
v -0.054634 -0.078982 0.045096
v -0.066215 -0.069270 0.052039
v -0.066215 -0.069270 0.058982
v -0.066215 -0.069270 0.065925
v -0.066215 -0.069270 0.072868
v -0.072535 -0.061823 0.052039
v -0.072535 -0.061823 0.058982
v -0.075927 -0.057689 0.052039
v -0.075927 -0.057689 0.058982
v -0.069687 -0.065295 0.052039
v -0.069687 -0.065295 0.058982
v -0.072535 -0.061823 0.065925
v -0.072535 -0.061823 0.072868
v -0.075927 -0.057689 0.065925
v -0.075927 -0.057689 0.072868
v -0.069687 -0.065295 0.065925
v -0.069687 -0.065295 0.072868
v -0.058769 -0.075590 0.052039
v -0.058769 -0.075590 0.058982
v -0.062240 -0.072741 0.052039
v -0.062240 -0.072741 0.058982
v -0.054634 -0.078982 0.052039
v -0.054634 -0.078982 0.058982
v -0.058769 -0.075590 0.065925
v -0.058769 -0.075590 0.072868
v -0.062240 -0.072741 0.065925
v -0.062240 -0.072741 0.072868
v -0.054634 -0.078982 0.065925
v -0.054634 -0.078982 0.072868
v -0.066215 -0.069270 0.079811
v -0.072535 -0.061823 0.079811
v -0.075927 -0.057689 0.079811
v -0.069687 -0.065295 0.079811
v -0.058769 -0.075590 0.079811
v -0.062240 -0.072741 0.079811
v -0.054634 -0.078982 0.079811
v -0.086036 -0.040630 -0.003504
v -0.086036 -0.040630 0.003439
v -0.080709 -0.050596 -0.003504
v -0.080709 -0.050596 0.003439
v -0.084181 -0.044101 -0.003504
v -0.084181 -0.044101 0.003439
v -0.086036 -0.040630 0.010382
v -0.086036 -0.040630 0.017325
v -0.080709 -0.050596 0.010382
v -0.080709 -0.050596 0.017325
v -0.084181 -0.044101 0.010382
v -0.084181 -0.044101 0.017325
v -0.087641 -0.036860 -0.003504
v -0.087641 -0.036860 0.003439
v -0.090138 -0.029917 -0.003504
v -0.090138 -0.029917 0.003439
v -0.087641 -0.036860 0.010382
v -0.087641 -0.036860 0.017325
v -0.090138 -0.029917 0.010382
v -0.090138 -0.029917 0.017325
v -0.086036 -0.040630 0.024268
v -0.086036 -0.040630 0.031210
v -0.080709 -0.050596 0.024268
v -0.080709 -0.050596 0.031210
v -0.084181 -0.044101 0.024268
v -0.084181 -0.044101 0.031210
v -0.086036 -0.040630 0.038153
v -0.086036 -0.040630 0.045096
v -0.080709 -0.050596 0.038153
v -0.080709 -0.050596 0.045096
v -0.084181 -0.044101 0.038153
v -0.084181 -0.044101 0.045096
v -0.087641 -0.036860 0.024268
v -0.087641 -0.036860 0.031210
v -0.090138 -0.029917 0.024268
v -0.090138 -0.029917 0.031210
v -0.087641 -0.036860 0.038153
v -0.087641 -0.036860 0.045096
v -0.090138 -0.029917 0.038153
v -0.090138 -0.029917 0.045096
v -0.093059 -0.020290 -0.003504
v -0.093059 -0.020290 0.003439
v -0.093775 -0.016031 -0.003504
v -0.093775 -0.016031 0.003439
v -0.093059 -0.020290 0.010382
v -0.093059 -0.020290 0.017325
v -0.093775 -0.016031 0.010382
v -0.093775 -0.016031 0.017325
v -0.094594 -0.009088 -0.003504
v -0.094594 -0.009088 0.003439
v -0.095277 -0.002145 -0.003504
v -0.095277 -0.002145 0.003439
v -0.094594 -0.009088 0.010382
v -0.094594 -0.009088 0.017325
v -0.095277 -0.002145 0.010382
v -0.095277 -0.002145 0.017325
v -0.092006 -0.023762 -0.003504
v -0.092006 -0.023762 0.003439
v -0.092006 -0.023762 0.010382
v -0.092006 -0.023762 0.017325
v -0.093059 -0.020290 0.024268
v -0.093059 -0.020290 0.031210
v -0.093775 -0.016031 0.024268
v -0.093775 -0.016031 0.031210
v -0.093059 -0.020290 0.038153
v -0.093059 -0.020290 0.045096
v -0.093775 -0.016031 0.038153
v -0.093775 -0.016031 0.045096
v -0.094594 -0.009088 0.024268
v -0.094594 -0.009088 0.031210
v -0.095277 -0.002145 0.024268
v -0.095277 -0.002145 0.031210
v -0.094594 -0.009088 0.038153
v -0.094594 -0.009088 0.045096
v -0.095277 -0.002145 0.038153
v -0.095277 -0.002145 0.045096
v -0.092006 -0.023762 0.024268
v -0.092006 -0.023762 0.031210
v -0.092006 -0.023762 0.038153
v -0.092006 -0.023762 0.045096
v -0.078854 -0.054067 -0.003504
v -0.078854 -0.054067 0.003439
v -0.078854 -0.054067 0.010382
v -0.078854 -0.054067 0.017325
v -0.078854 -0.054067 0.024268
v -0.078854 -0.054067 0.031210
v -0.078854 -0.054067 0.038153
v -0.078854 -0.054067 0.045096
v -0.086036 -0.040630 0.052039
v -0.086036 -0.040630 0.058982
v -0.080709 -0.050596 0.052039
v -0.080709 -0.050596 0.058982
v -0.084181 -0.044101 0.052039
v -0.084181 -0.044101 0.058982
v -0.086036 -0.040630 0.065925
v -0.086036 -0.040630 0.072868
v -0.080709 -0.050596 0.065925
v -0.080709 -0.050596 0.072868
v -0.084181 -0.044101 0.065925
v -0.084181 -0.044101 0.072868
v -0.087641 -0.036860 0.052039
v -0.087641 -0.036860 0.058982
v -0.090138 -0.029917 0.052039
v -0.090138 -0.029917 0.058982
v -0.087641 -0.036860 0.065925
v -0.087641 -0.036860 0.072868
v -0.090138 -0.029917 0.065925
v -0.090138 -0.029917 0.072868
v -0.086036 -0.040630 0.079811
v -0.080709 -0.050596 0.079811
v -0.084181 -0.044101 0.079811
v -0.087641 -0.036860 0.079811
v -0.090138 -0.029917 0.079811
v -0.093059 -0.020290 0.052039
v -0.093059 -0.020290 0.058982
v -0.093775 -0.016031 0.052039
v -0.093775 -0.016031 0.058982
v -0.093059 -0.020290 0.065925
v -0.093059 -0.020290 0.072868
v -0.093775 -0.016031 0.065925
v -0.093775 -0.016031 0.072868
v -0.094594 -0.009088 0.052039
v -0.094594 -0.009088 0.058982
v -0.095277 -0.002145 0.052039
v -0.095277 -0.002145 0.058982
v -0.094594 -0.009088 0.065925
v -0.094594 -0.009088 0.072868
v -0.095277 -0.002145 0.065925
v -0.095277 -0.002145 0.072868
v -0.092006 -0.023762 0.052039
v -0.092006 -0.023762 0.058982
v -0.092006 -0.023762 0.065925
v -0.092006 -0.023762 0.072868
v -0.093059 -0.020290 0.079811
v -0.093775 -0.016031 0.079811
v -0.094594 -0.009088 0.079811
v -0.095277 -0.002145 0.079811
v -0.092006 -0.023762 0.079811
v -0.078854 -0.054067 0.052039
v -0.078854 -0.054067 0.058982
v -0.078854 -0.054067 0.065925
v -0.078854 -0.054067 0.072868
v -0.078854 -0.054067 0.079811
v -0.047541 -0.083764 -0.003504
v -0.047541 -0.083764 0.003439
v -0.037575 -0.089091 -0.003504
v -0.037575 -0.089091 0.003439
v -0.041046 -0.087236 -0.003504
v -0.041046 -0.087236 0.003439
v -0.047541 -0.083764 0.010382
v -0.047541 -0.083764 0.017325
v -0.037575 -0.089091 0.010382
v -0.037575 -0.089091 0.017325
v -0.041046 -0.087236 0.010382
v -0.041046 -0.087236 0.017325
v -0.033805 -0.090695 -0.003504
v -0.033805 -0.090695 0.003439
v -0.026862 -0.093193 -0.003504
v -0.026862 -0.093193 0.003439
v -0.033805 -0.090695 0.010382
v -0.033805 -0.090695 0.017325
v -0.026862 -0.093193 0.010382
v -0.026862 -0.093193 0.017325
v -0.047541 -0.083764 0.024268
v -0.047541 -0.083764 0.031210
v -0.037575 -0.089091 0.024268
v -0.037575 -0.089091 0.031210
v -0.041046 -0.087236 0.024268
v -0.041046 -0.087236 0.031210
v -0.047541 -0.083764 0.038153
v -0.047541 -0.083764 0.045096
v -0.037575 -0.089091 0.038153
v -0.037575 -0.089091 0.045096
v -0.041046 -0.087236 0.038153
v -0.041046 -0.087236 0.045096
v -0.033805 -0.090695 0.024268
v -0.033805 -0.090695 0.031210
v -0.026862 -0.093193 0.024268
v -0.026862 -0.093193 0.031210
v -0.033805 -0.090695 0.038153
v -0.033805 -0.090695 0.045096
v -0.026862 -0.093193 0.038153
v -0.026862 -0.093193 0.045096
v -0.051012 -0.081909 -0.003504
v -0.051012 -0.081909 0.003439
v -0.051012 -0.081909 0.010382
v -0.051012 -0.081909 0.017325
v -0.051012 -0.081909 0.024268
v -0.051012 -0.081909 0.031210
v -0.051012 -0.081909 0.038153
v -0.051012 -0.081909 0.045096
v -0.017235 -0.096114 -0.003504
v -0.017235 -0.096114 0.003439
v -0.012976 -0.096829 -0.003504
v -0.012976 -0.096829 0.003439
v -0.017235 -0.096114 0.010382
v -0.017235 -0.096114 0.017325
v -0.012976 -0.096829 0.010382
v -0.012976 -0.096829 0.017325
v -0.020707 -0.095060 -0.003504
v -0.020707 -0.095060 0.003439
v -0.020707 -0.095060 0.010382
v -0.020707 -0.095060 0.017325
v -0.006034 -0.097648 -0.003504
v -0.006034 -0.097648 0.003439
v 0.000909 -0.098332 -0.003504
v 0.000909 -0.098332 0.003439
v -0.006034 -0.097648 0.010382
v -0.006034 -0.097648 0.017325
v 0.000909 -0.098332 0.010382
v 0.000909 -0.098332 0.017325
v -0.017235 -0.096114 0.024268
v -0.017235 -0.096114 0.031210
v -0.012976 -0.096829 0.024268
v -0.012976 -0.096829 0.031210
v -0.017235 -0.096114 0.038153
v -0.017235 -0.096114 0.045096
v -0.012976 -0.096829 0.038153
v -0.012976 -0.096829 0.045096
v -0.020707 -0.095060 0.024268
v -0.020707 -0.095060 0.031210
v -0.020707 -0.095060 0.038153
v -0.020707 -0.095060 0.045096
v -0.006034 -0.097648 0.024268
v -0.006034 -0.097648 0.031210
v 0.000909 -0.098332 0.024268
v 0.000909 -0.098332 0.031210
v -0.006034 -0.097648 0.038153
v -0.006034 -0.097648 0.045096
v 0.000909 -0.098332 0.038153
v 0.000909 -0.098332 0.045096
v -0.047541 -0.083764 0.052039
v -0.047541 -0.083764 0.058982
v -0.037575 -0.089091 0.052039
v -0.037575 -0.089091 0.058982
v -0.041046 -0.087236 0.052039
v -0.041046 -0.087236 0.058982
v -0.047541 -0.083764 0.065925
v -0.047541 -0.083764 0.072868
v -0.037575 -0.089091 0.065925
v -0.037575 -0.089091 0.072868
v -0.041046 -0.087236 0.065925
v -0.041046 -0.087236 0.072868
v -0.033805 -0.090695 0.052039
v -0.033805 -0.090695 0.058982
v -0.026862 -0.093193 0.052039
v -0.026862 -0.093193 0.058982
v -0.033805 -0.090695 0.065925
v -0.033805 -0.090695 0.072868
v -0.026862 -0.093193 0.065925
v -0.026862 -0.093193 0.072868
v -0.047541 -0.083764 0.079811
v -0.037575 -0.089091 0.079811
v -0.041046 -0.087236 0.079811
v -0.033805 -0.090695 0.079811
v -0.026862 -0.093193 0.079811
v -0.051012 -0.081909 0.052039
v -0.051012 -0.081909 0.058982
v -0.051012 -0.081909 0.065925
v -0.051012 -0.081909 0.072868
v -0.051012 -0.081909 0.079811
v -0.017235 -0.096114 0.052039
v -0.017235 -0.096114 0.058982
v -0.012976 -0.096829 0.052039
v -0.012976 -0.096829 0.058982
v -0.017235 -0.096114 0.065925
v -0.017235 -0.096114 0.072868
v -0.012976 -0.096829 0.065925
v -0.012976 -0.096829 0.072868
v -0.020707 -0.095060 0.052039
v -0.020707 -0.095060 0.058982
v -0.020707 -0.095060 0.065925
v -0.020707 -0.095060 0.072868
v -0.006034 -0.097648 0.052039
v -0.006034 -0.097648 0.058982
v 0.000909 -0.098332 0.052039
v 0.000909 -0.098332 0.058982
v -0.006034 -0.097648 0.065925
v -0.006034 -0.097648 0.072868
v 0.000909 -0.098332 0.065925
v 0.000909 -0.098332 0.072868
v -0.017235 -0.096114 0.079811
v -0.012976 -0.096829 0.079811
v -0.020707 -0.095060 0.079811
v -0.006034 -0.097648 0.079811
v 0.000909 -0.098332 0.079811
v -0.095277 0.004797 -0.093762
v -0.094594 0.011740 -0.093762
v -0.093775 0.018683 -0.093762
v -0.093059 0.022942 -0.093762
v -0.092006 0.026414 -0.093762
v -0.095277 0.004797 -0.086819
v -0.095277 0.004797 -0.079876
v -0.094594 0.011740 -0.086819
v -0.094594 0.011740 -0.079876
v -0.095277 0.004797 -0.072933
v -0.095277 0.004797 -0.065990
v -0.094594 0.011740 -0.072933
v -0.094594 0.011740 -0.065990
v -0.093775 0.018683 -0.086819
v -0.093775 0.018683 -0.079876
v -0.093059 0.022942 -0.086819
v -0.093059 0.022942 -0.079876
v -0.093775 0.018683 -0.072933
v -0.093775 0.018683 -0.065990
v -0.093059 0.022942 -0.072933
v -0.093059 0.022942 -0.065990
v -0.092006 0.026414 -0.086819
v -0.092006 0.026414 -0.079876
v -0.092006 0.026414 -0.072933
v -0.092006 0.026414 -0.065990
v -0.090138 0.032569 -0.093762
v -0.087640 0.039512 -0.093762
v -0.086036 0.043282 -0.093762
v -0.084181 0.046753 -0.093762
v -0.080709 0.053248 -0.093762
v -0.090138 0.032569 -0.086819
v -0.090138 0.032569 -0.079876
v -0.087640 0.039512 -0.086819
v -0.087640 0.039512 -0.079876
v -0.090138 0.032569 -0.072933
v -0.090138 0.032569 -0.065990
v -0.087640 0.039512 -0.072933
v -0.087640 0.039512 -0.065990
v -0.086036 0.043282 -0.086819
v -0.086036 0.043282 -0.079876
v -0.084181 0.046753 -0.086819
v -0.084181 0.046753 -0.079876
v -0.080709 0.053248 -0.086819
v -0.080709 0.053248 -0.079876
v -0.086036 0.043282 -0.072933
v -0.086036 0.043282 -0.065990
v -0.084181 0.046753 -0.072933
v -0.084181 0.046753 -0.065990
v -0.080709 0.053248 -0.072933
v -0.080709 0.053248 -0.065990
v -0.078854 0.056719 -0.093762
v -0.078854 0.056719 -0.086819
v -0.078854 0.056719 -0.079876
v -0.078854 0.056719 -0.072933
v -0.078854 0.056719 -0.065990
v -0.095277 0.004797 -0.059047
v -0.095277 0.004797 -0.052104
v -0.094594 0.011740 -0.059047
v -0.094594 0.011740 -0.052104
v -0.095277 0.004797 -0.045162
v -0.095277 0.004797 -0.038219
v -0.094594 0.011740 -0.045162
v -0.094594 0.011740 -0.038219
v -0.093775 0.018683 -0.059047
v -0.093775 0.018683 -0.052104
v -0.093059 0.022942 -0.059047
v -0.093059 0.022942 -0.052104
v -0.093775 0.018683 -0.045162
v -0.093775 0.018683 -0.038219
v -0.093059 0.022942 -0.045162
v -0.093059 0.022942 -0.038219
v -0.092006 0.026414 -0.059047
v -0.092006 0.026414 -0.052104
v -0.092006 0.026414 -0.045162
v -0.092006 0.026414 -0.038219
v -0.095277 0.004797 -0.031276
v -0.095277 0.004797 -0.024333
v -0.094594 0.011740 -0.031276
v -0.094594 0.011740 -0.024333
v -0.095277 0.004797 -0.017390
v -0.095277 0.004797 -0.010447
v -0.094594 0.011740 -0.017390
v -0.094594 0.011740 -0.010447
v -0.093775 0.018683 -0.031276
v -0.093775 0.018683 -0.024333
v -0.093059 0.022942 -0.031276
v -0.093059 0.022942 -0.024333
v -0.093775 0.018683 -0.017390
v -0.093775 0.018683 -0.010447
v -0.093059 0.022942 -0.017390
v -0.093059 0.022942 -0.010447
v -0.092006 0.026414 -0.031276
v -0.092006 0.026414 -0.024333
v -0.092006 0.026414 -0.017390
v -0.092006 0.026414 -0.010447
v -0.090138 0.032569 -0.059047
v -0.090138 0.032569 -0.052104
v -0.087640 0.039512 -0.059047
v -0.087640 0.039512 -0.052104
v -0.090138 0.032569 -0.045162
v -0.090138 0.032569 -0.038219
v -0.087640 0.039512 -0.045162
v -0.087640 0.039512 -0.038219
v -0.086036 0.043282 -0.059047
v -0.086036 0.043282 -0.052104
v -0.084181 0.046753 -0.059047
v -0.084181 0.046753 -0.052104
v -0.080709 0.053248 -0.059047
v -0.080709 0.053248 -0.052104
v -0.086036 0.043282 -0.045162
v -0.086036 0.043282 -0.038219
v -0.084181 0.046753 -0.045162
v -0.084181 0.046753 -0.038219
v -0.080709 0.053248 -0.045162
v -0.080709 0.053248 -0.038219
v -0.090138 0.032569 -0.031276
v -0.090138 0.032569 -0.024333
v -0.087640 0.039512 -0.031276
v -0.087640 0.039512 -0.024333
v -0.090138 0.032569 -0.017390
v -0.090138 0.032569 -0.010447
v -0.087640 0.039512 -0.017390
v -0.087640 0.039512 -0.010447
v -0.086036 0.043282 -0.031276
v -0.086036 0.043282 -0.024333
v -0.084181 0.046753 -0.031276
v -0.084181 0.046753 -0.024333
v -0.080709 0.053248 -0.031276
v -0.080709 0.053248 -0.024333
v -0.086036 0.043282 -0.017390
v -0.086036 0.043282 -0.010447
v -0.084181 0.046753 -0.017390
v -0.084181 0.046753 -0.010447
v -0.080709 0.053248 -0.017390
v -0.080709 0.053248 -0.010447
v -0.078854 0.056719 -0.059047
v -0.078854 0.056719 -0.052104
v -0.078854 0.056719 -0.045162
v -0.078854 0.056719 -0.038219
v -0.078854 0.056719 -0.031276
v -0.078854 0.056719 -0.024333
v -0.078854 0.056719 -0.017390
v -0.078854 0.056719 -0.010447
v -0.075927 0.060341 -0.093762
v -0.072535 0.064475 -0.093762
v -0.069686 0.067947 -0.093762
v -0.066215 0.071922 -0.093762
v -0.062240 0.075393 -0.093762
v -0.058768 0.078242 -0.093762
v -0.054634 0.081633 -0.093762
v -0.075927 0.060341 -0.086819
v -0.075927 0.060341 -0.079876
v -0.072535 0.064475 -0.086819
v -0.072535 0.064475 -0.079876
v -0.069686 0.067947 -0.086819
v -0.069686 0.067947 -0.079876
v -0.075927 0.060341 -0.072933
v -0.075927 0.060341 -0.065990
v -0.072535 0.064475 -0.072933
v -0.072535 0.064475 -0.065990
v -0.069686 0.067947 -0.072933
v -0.069686 0.067947 -0.065990
v -0.066215 0.071922 -0.086819
v -0.066215 0.071922 -0.079876
v -0.066215 0.071922 -0.072933
v -0.066215 0.071922 -0.065990
v -0.062240 0.075393 -0.086819
v -0.062240 0.075393 -0.079876
v -0.058768 0.078242 -0.086819
v -0.058768 0.078242 -0.079876
v -0.054634 0.081633 -0.086819
v -0.054634 0.081633 -0.079876
v -0.062240 0.075393 -0.072933
v -0.062240 0.075393 -0.065990
v -0.058768 0.078242 -0.072933
v -0.058768 0.078242 -0.065990
v -0.054634 0.081633 -0.072933
v -0.054634 0.081633 -0.065990
v -0.075927 0.060341 -0.059047
v -0.075927 0.060341 -0.052104
v -0.072535 0.064475 -0.059047
v -0.072535 0.064475 -0.052104
v -0.069686 0.067947 -0.059047
v -0.069686 0.067947 -0.052104
v -0.075927 0.060341 -0.045162
v -0.075927 0.060341 -0.038219
v -0.072535 0.064475 -0.045162
v -0.072535 0.064475 -0.038219
v -0.069686 0.067947 -0.045162
v -0.069686 0.067947 -0.038219
v -0.066215 0.071922 -0.059047
v -0.066215 0.071922 -0.052104
v -0.066215 0.071922 -0.045162
v -0.066215 0.071922 -0.038219
v -0.062240 0.075393 -0.059047
v -0.062240 0.075393 -0.052104
v -0.058768 0.078242 -0.059047
v -0.058768 0.078242 -0.052104
v -0.054634 0.081633 -0.059047
v -0.054634 0.081633 -0.052104
v -0.062240 0.075393 -0.045162
v -0.062240 0.075393 -0.038219
v -0.058768 0.078242 -0.045162
v -0.058768 0.078242 -0.038219
v -0.054634 0.081633 -0.045162
v -0.054634 0.081633 -0.038219
v -0.075927 0.060341 -0.031276
v -0.075927 0.060341 -0.024333
v -0.072535 0.064475 -0.031276
v -0.072535 0.064475 -0.024333
v -0.069686 0.067947 -0.031276
v -0.069686 0.067947 -0.024333
v -0.075927 0.060341 -0.017390
v -0.075927 0.060341 -0.010447
v -0.072535 0.064475 -0.017390
v -0.072535 0.064475 -0.010447
v -0.069686 0.067947 -0.017390
v -0.069686 0.067947 -0.010447
v -0.066215 0.071922 -0.031276
v -0.066215 0.071922 -0.024333
v -0.066215 0.071922 -0.017390
v -0.066215 0.071922 -0.010447
v -0.062240 0.075393 -0.031276
v -0.062240 0.075393 -0.024333
v -0.058768 0.078242 -0.031276
v -0.058768 0.078242 -0.024333
v -0.054634 0.081633 -0.031276
v -0.054634 0.081633 -0.024333
v -0.062240 0.075393 -0.017390
v -0.062240 0.075393 -0.010447
v -0.058768 0.078242 -0.017390
v -0.058768 0.078242 -0.010447
v -0.054634 0.081633 -0.017390
v -0.054634 0.081633 -0.010447
v -0.051012 0.084561 -0.093762
v -0.051012 0.084561 -0.086819
v -0.051012 0.084561 -0.079876
v -0.051012 0.084561 -0.072933
v -0.051012 0.084561 -0.065990
v -0.047541 0.086416 -0.093762
v -0.041046 0.089888 -0.093762
v -0.037575 0.091743 -0.093762
v -0.033805 0.093347 -0.093762
v -0.026862 0.095845 -0.093762
v -0.047541 0.086416 -0.086819
v -0.047541 0.086416 -0.079876
v -0.041046 0.089888 -0.086819
v -0.041046 0.089888 -0.079876
v -0.037575 0.091743 -0.086819
v -0.037575 0.091743 -0.079876
v -0.047541 0.086416 -0.072933
v -0.047541 0.086416 -0.065990
v -0.041046 0.089888 -0.072933
v -0.041046 0.089888 -0.065990
v -0.037575 0.091743 -0.072933
v -0.037575 0.091743 -0.065990
v -0.033805 0.093347 -0.086819
v -0.033805 0.093347 -0.079876
v -0.026862 0.095845 -0.086819
v -0.026862 0.095845 -0.079876
v -0.033805 0.093347 -0.072933
v -0.033805 0.093347 -0.065990
v -0.026862 0.095845 -0.072933
v -0.026862 0.095845 -0.065990
v -0.020706 0.097712 -0.093762
v -0.017235 0.098765 -0.093762
v -0.012976 0.099481 -0.093762
v -0.006034 0.100300 -0.093762
v 0.000909 0.100984 -0.093762
v -0.020706 0.097712 -0.086819
v -0.020706 0.097712 -0.079876
v -0.020706 0.097712 -0.072933
v -0.020706 0.097712 -0.065990
v -0.017235 0.098765 -0.086819
v -0.017235 0.098765 -0.079876
v -0.012976 0.099481 -0.086819
v -0.012976 0.099481 -0.079876
v -0.017235 0.098765 -0.072933
v -0.017235 0.098765 -0.065990
v -0.012976 0.099481 -0.072933
v -0.012976 0.099481 -0.065990
v -0.006034 0.100300 -0.086819
v -0.006034 0.100300 -0.079876
v 0.000909 0.100984 -0.086819
v 0.000909 0.100984 -0.079876
v -0.006034 0.100300 -0.072933
v -0.006034 0.100300 -0.065990
v 0.000909 0.100984 -0.072933
v 0.000909 0.100984 -0.065990
v -0.051012 0.084561 -0.059047
v -0.051012 0.084561 -0.052104
v -0.051012 0.084561 -0.045162
v -0.051012 0.084561 -0.038219
v -0.051012 0.084561 -0.031276
v -0.051012 0.084561 -0.024333
v -0.051012 0.084561 -0.017390
v -0.051012 0.084561 -0.010447
v -0.047541 0.086416 -0.059047
v -0.047541 0.086416 -0.052104
v -0.041046 0.089888 -0.059047
v -0.041046 0.089888 -0.052104
v -0.037575 0.091743 -0.059047
v -0.037575 0.091743 -0.052104
v -0.047541 0.086416 -0.045162
v -0.047541 0.086416 -0.038219
v -0.041046 0.089888 -0.045162
v -0.041046 0.089888 -0.038219
v -0.037575 0.091743 -0.045162
v -0.037575 0.091743 -0.038219
v -0.033805 0.093347 -0.059047
v -0.033805 0.093347 -0.052104
v -0.026862 0.095845 -0.059047
v -0.026862 0.095845 -0.052104
v -0.033805 0.093347 -0.045162
v -0.033805 0.093347 -0.038219
v -0.026862 0.095845 -0.045162
v -0.026862 0.095845 -0.038219
v -0.047541 0.086416 -0.031276
v -0.047541 0.086416 -0.024333
v -0.041046 0.089888 -0.031276
v -0.041046 0.089888 -0.024333
v -0.037575 0.091743 -0.031276
v -0.037575 0.091743 -0.024333
v -0.047541 0.086416 -0.017390
v -0.047541 0.086416 -0.010447
v -0.041046 0.089888 -0.017390
v -0.041046 0.089888 -0.010447
v -0.037575 0.091743 -0.017390
v -0.037575 0.091743 -0.010447
v -0.033805 0.093347 -0.031276
v -0.033805 0.093347 -0.024333
v -0.026862 0.095845 -0.031276
v -0.026862 0.095845 -0.024333
v -0.033805 0.093347 -0.017390
v -0.033805 0.093347 -0.010447
v -0.026862 0.095845 -0.017390
v -0.026862 0.095845 -0.010447
v -0.020706 0.097712 -0.059047
v -0.020706 0.097712 -0.052104
v -0.020706 0.097712 -0.045162
v -0.020706 0.097712 -0.038219
v -0.017235 0.098765 -0.059047
v -0.017235 0.098765 -0.052104
v -0.012976 0.099481 -0.059047
v -0.012976 0.099481 -0.052104
v -0.017235 0.098765 -0.045162
v -0.017235 0.098765 -0.038219
v -0.012976 0.099481 -0.045162
v -0.012976 0.099481 -0.038219
v -0.006034 0.100300 -0.059047
v -0.006034 0.100300 -0.052104
v 0.000909 0.100984 -0.059047
v 0.000909 0.100984 -0.052104
v -0.006034 0.100300 -0.045162
v -0.006034 0.100300 -0.038219
v 0.000909 0.100984 -0.045162
v 0.000909 0.100984 -0.038219
v -0.020706 0.097712 -0.031276
v -0.020706 0.097712 -0.024333
v -0.020706 0.097712 -0.017390
v -0.020706 0.097712 -0.010447
v -0.017235 0.098765 -0.031276
v -0.017235 0.098765 -0.024333
v -0.012976 0.099481 -0.031276
v -0.012976 0.099481 -0.024333
v -0.017235 0.098765 -0.017390
v -0.017235 0.098765 -0.010447
v -0.012976 0.099481 -0.017390
v -0.012976 0.099481 -0.010447
v -0.006034 0.100300 -0.031276
v -0.006034 0.100300 -0.024333
v 0.000909 0.100984 -0.031276
v 0.000909 0.100984 -0.024333
v -0.006034 0.100300 -0.017390
v -0.006034 0.100300 -0.010447
v 0.000909 0.100984 -0.017390
v 0.000909 0.100984 -0.010447
v -0.095277 0.004797 -0.003504
v -0.095277 0.004797 0.003439
v -0.094594 0.011740 -0.003504
v -0.094594 0.011740 0.003439
v -0.095277 0.004797 0.010382
v -0.095277 0.004797 0.017325
v -0.094594 0.011740 0.010382
v -0.094594 0.011740 0.017325
v -0.093775 0.018683 -0.003504
v -0.093775 0.018683 0.003439
v -0.093059 0.022942 -0.003504
v -0.093059 0.022942 0.003439
v -0.093775 0.018683 0.010382
v -0.093775 0.018683 0.017325
v -0.093059 0.022942 0.010382
v -0.093059 0.022942 0.017325
v -0.092006 0.026414 -0.003504
v -0.092006 0.026414 0.003439
v -0.092006 0.026414 0.010382
v -0.092006 0.026414 0.017325
v -0.095277 0.004797 0.024268
v -0.095277 0.004797 0.031210
v -0.094594 0.011740 0.024268
v -0.094594 0.011740 0.031210
v -0.095277 0.004797 0.038153
v -0.095277 0.004797 0.045096
v -0.094594 0.011740 0.038153
v -0.094594 0.011740 0.045096
v -0.093775 0.018683 0.024268
v -0.093775 0.018683 0.031210
v -0.093059 0.022942 0.024268
v -0.093059 0.022942 0.031210
v -0.093775 0.018683 0.038153
v -0.093775 0.018683 0.045096
v -0.093059 0.022942 0.038153
v -0.093059 0.022942 0.045096
v -0.092006 0.026414 0.024268
v -0.092006 0.026414 0.031210
v -0.092006 0.026414 0.038153
v -0.092006 0.026414 0.045096
v -0.090138 0.032569 -0.003504
v -0.090138 0.032569 0.003439
v -0.087640 0.039512 -0.003504
v -0.087640 0.039512 0.003439
v -0.090138 0.032569 0.010382
v -0.090138 0.032569 0.017325
v -0.087640 0.039512 0.010382
v -0.087640 0.039512 0.017325
v -0.086036 0.043282 -0.003504
v -0.086036 0.043282 0.003439
v -0.084181 0.046753 -0.003504
v -0.084181 0.046753 0.003439
v -0.080709 0.053248 -0.003504
v -0.080709 0.053248 0.003439
v -0.086036 0.043282 0.010382
v -0.086036 0.043282 0.017325
v -0.084181 0.046753 0.010382
v -0.084181 0.046753 0.017325
v -0.080709 0.053248 0.010382
v -0.080709 0.053248 0.017325
v -0.090138 0.032569 0.024268
v -0.090138 0.032569 0.031210
v -0.087640 0.039512 0.024268
v -0.087640 0.039512 0.031210
v -0.090138 0.032569 0.038153
v -0.090138 0.032569 0.045096
v -0.087640 0.039512 0.038153
v -0.087640 0.039512 0.045096
v -0.086036 0.043282 0.024268
v -0.086036 0.043282 0.031210
v -0.084181 0.046753 0.024268
v -0.084181 0.046753 0.031210
v -0.080709 0.053248 0.024268
v -0.080709 0.053248 0.031210
v -0.086036 0.043282 0.038153
v -0.086036 0.043282 0.045096
v -0.084181 0.046753 0.038153
v -0.084181 0.046753 0.045096
v -0.080709 0.053248 0.038153
v -0.080709 0.053248 0.045096
v -0.078854 0.056719 -0.003504
v -0.078854 0.056719 0.003439
v -0.078854 0.056719 0.010382
v -0.078854 0.056719 0.017325
v -0.078854 0.056719 0.024268
v -0.078854 0.056719 0.031210
v -0.078854 0.056719 0.038153
v -0.078854 0.056719 0.045096
v -0.095277 0.004797 0.052039
v -0.095277 0.004797 0.058982
v -0.094594 0.011740 0.052039
v -0.094594 0.011740 0.058982
v -0.095277 0.004797 0.065925
v -0.095277 0.004797 0.072868
v -0.094594 0.011740 0.065925
v -0.094594 0.011740 0.072868
v -0.093775 0.018683 0.052039
v -0.093775 0.018683 0.058982
v -0.093059 0.022942 0.052039
v -0.093059 0.022942 0.058982
v -0.093775 0.018683 0.065925
v -0.093775 0.018683 0.072868
v -0.093059 0.022942 0.065925
v -0.093059 0.022942 0.072868
v -0.092006 0.026414 0.052039
v -0.092006 0.026414 0.058982
v -0.092006 0.026414 0.065925
v -0.092006 0.026414 0.072868
v -0.095277 0.004797 0.079811
v -0.094594 0.011740 0.079811
v -0.093775 0.018683 0.079811
v -0.093059 0.022942 0.079811
v -0.092006 0.026414 0.079811
v -0.090138 0.032569 0.052039
v -0.090138 0.032569 0.058982
v -0.087640 0.039512 0.052039
v -0.087640 0.039512 0.058982
v -0.090138 0.032569 0.065925
v -0.090138 0.032569 0.072868
v -0.087640 0.039512 0.065925
v -0.087640 0.039512 0.072868
v -0.086036 0.043282 0.052039
v -0.086036 0.043282 0.058982
v -0.084181 0.046753 0.052039
v -0.084181 0.046753 0.058982
v -0.080709 0.053248 0.052039
v -0.080709 0.053248 0.058982
v -0.086036 0.043282 0.065925
v -0.086036 0.043282 0.072868
v -0.084181 0.046753 0.065925
v -0.084181 0.046753 0.072868
v -0.080709 0.053248 0.065925
v -0.080709 0.053248 0.072868
v -0.090138 0.032569 0.079811
v -0.087640 0.039512 0.079811
v -0.086036 0.043282 0.079811
v -0.084181 0.046753 0.079811
v -0.080709 0.053248 0.079811
v -0.078854 0.056719 0.052039
v -0.078854 0.056719 0.058982
v -0.078854 0.056719 0.065925
v -0.078854 0.056719 0.072868
v -0.078854 0.056719 0.079811
v -0.075927 0.060341 -0.003504
v -0.075927 0.060341 0.003439
v -0.072535 0.064475 -0.003504
v -0.072535 0.064475 0.003439
v -0.069686 0.067947 -0.003504
v -0.069686 0.067947 0.003439
v -0.075927 0.060341 0.010382
v -0.075927 0.060341 0.017325
v -0.072535 0.064475 0.010382
v -0.072535 0.064475 0.017325
v -0.069686 0.067947 0.010382
v -0.069686 0.067947 0.017325
v -0.066215 0.071922 -0.003504
v -0.066215 0.071922 0.003439
v -0.066215 0.071922 0.010382
v -0.066215 0.071922 0.017325
v -0.062240 0.075393 -0.003504
v -0.062240 0.075393 0.003439
v -0.058768 0.078242 -0.003504
v -0.058768 0.078242 0.003439
v -0.054634 0.081633 -0.003504
v -0.054634 0.081633 0.003439
v -0.062240 0.075393 0.010382
v -0.062240 0.075393 0.017325
v -0.058768 0.078242 0.010382
v -0.058768 0.078242 0.017325
v -0.054634 0.081633 0.010382
v -0.054634 0.081633 0.017325
v -0.075927 0.060341 0.024268
v -0.075927 0.060341 0.031210
v -0.072535 0.064475 0.024268
v -0.072535 0.064475 0.031210
v -0.069686 0.067947 0.024268
v -0.069686 0.067947 0.031210
v -0.075927 0.060341 0.038153
v -0.075927 0.060341 0.045096
v -0.072535 0.064475 0.038153
v -0.072535 0.064475 0.045096
v -0.069686 0.067947 0.038153
v -0.069686 0.067947 0.045096
v -0.066215 0.071922 0.024268
v -0.066215 0.071922 0.031210
v -0.066215 0.071922 0.038153
v -0.066215 0.071922 0.045096
v -0.062240 0.075393 0.024268
v -0.062240 0.075393 0.031210
v -0.058768 0.078242 0.024268
v -0.058768 0.078242 0.031210
v -0.054634 0.081633 0.024268
v -0.054634 0.081633 0.031210
v -0.062240 0.075393 0.038153
v -0.062240 0.075393 0.045096
v -0.058768 0.078242 0.038153
v -0.058768 0.078242 0.045096
v -0.054634 0.081633 0.038153
v -0.054634 0.081633 0.045096
v -0.075927 0.060341 0.052039
v -0.075927 0.060341 0.058982
v -0.072535 0.064475 0.052039
v -0.072535 0.064475 0.058982
v -0.069686 0.067947 0.052039
v -0.069686 0.067947 0.058982
v -0.075927 0.060341 0.065925
v -0.075927 0.060341 0.072868
v -0.072535 0.064475 0.065925
v -0.072535 0.064475 0.072868
v -0.069686 0.067947 0.065925
v -0.069686 0.067947 0.072868
v -0.066215 0.071922 0.052039
v -0.066215 0.071922 0.058982
v -0.066215 0.071922 0.065925
v -0.066215 0.071922 0.072868
v -0.062240 0.075393 0.052039
v -0.062240 0.075393 0.058982
v -0.058768 0.078242 0.052039
v -0.058768 0.078242 0.058982
v -0.054634 0.081633 0.052039
v -0.054634 0.081633 0.058982
v -0.062240 0.075393 0.065925
v -0.062240 0.075393 0.072868
v -0.058768 0.078242 0.065925
v -0.058768 0.078242 0.072868
v -0.054634 0.081633 0.065925
v -0.054634 0.081633 0.072868
v -0.075927 0.060341 0.079811
v -0.072535 0.064475 0.079811
v -0.069686 0.067947 0.079811
v -0.066215 0.071922 0.079811
v -0.062240 0.075393 0.079811
v -0.058768 0.078242 0.079811
v -0.054634 0.081633 0.079811
v -0.051012 0.084561 -0.003504
v -0.051012 0.084561 0.003439
v -0.051012 0.084561 0.010382
v -0.051012 0.084561 0.017325
v -0.051012 0.084561 0.024268
v -0.051012 0.084561 0.031210
v -0.051012 0.084561 0.038153
v -0.051012 0.084561 0.045096
v -0.047541 0.086416 -0.003504
v -0.047541 0.086416 0.003439
v -0.041046 0.089888 -0.003504
v -0.041046 0.089888 0.003439
v -0.037575 0.091743 -0.003504
v -0.037575 0.091743 0.003439
v -0.047541 0.086416 0.010382
v -0.047541 0.086416 0.017325
v -0.041046 0.089888 0.010382
v -0.041046 0.089888 0.017325
v -0.037575 0.091743 0.010382
v -0.037575 0.091743 0.017325
v -0.033805 0.093347 -0.003504
v -0.033805 0.093347 0.003439
v -0.026862 0.095845 -0.003504
v -0.026862 0.095845 0.003439
v -0.033805 0.093347 0.010382
v -0.033805 0.093347 0.017325
v -0.026862 0.095845 0.010382
v -0.026862 0.095845 0.017325
v -0.047541 0.086416 0.024268
v -0.047541 0.086416 0.031210
v -0.041046 0.089888 0.024268
v -0.041046 0.089888 0.031210
v -0.037575 0.091743 0.024268
v -0.037575 0.091743 0.031210
v -0.047541 0.086416 0.038153
v -0.047541 0.086416 0.045096
v -0.041046 0.089888 0.038153
v -0.041046 0.089888 0.045096
v -0.037575 0.091743 0.038153
v -0.037575 0.091743 0.045096
v -0.033805 0.093347 0.024268
v -0.033805 0.093347 0.031210
v -0.026862 0.095845 0.024268
v -0.026862 0.095845 0.031210
v -0.033805 0.093347 0.038153
v -0.033805 0.093347 0.045096
v -0.026862 0.095845 0.038153
v -0.026862 0.095845 0.045096
v -0.020706 0.097712 -0.003504
v -0.020706 0.097712 0.003439
v -0.020706 0.097712 0.010382
v -0.020706 0.097712 0.017325
v -0.017235 0.098765 -0.003504
v -0.017235 0.098765 0.003439
v -0.012976 0.099481 -0.003504
v -0.012976 0.099481 0.003439
v -0.017235 0.098765 0.010382
v -0.017235 0.098765 0.017325
v -0.012976 0.099481 0.010382
v -0.012976 0.099481 0.017325
v -0.006034 0.100300 -0.003504
v -0.006034 0.100300 0.003439
v 0.000909 0.100984 -0.003504
v 0.000909 0.100984 0.003439
v -0.006034 0.100300 0.010382
v -0.006034 0.100300 0.017325
v 0.000909 0.100984 0.010382
v 0.000909 0.100984 0.017325
v -0.020706 0.097712 0.024268
v -0.020706 0.097712 0.031210
v -0.020706 0.097712 0.038153
v -0.020706 0.097712 0.045096
v -0.017235 0.098765 0.024268
v -0.017235 0.098765 0.031210
v -0.012976 0.099481 0.024268
v -0.012976 0.099481 0.031210
v -0.017235 0.098765 0.038153
v -0.017235 0.098765 0.045096
v -0.012976 0.099481 0.038153
v -0.012976 0.099481 0.045096
v -0.006034 0.100300 0.024268
v -0.006034 0.100300 0.031210
v 0.000909 0.100984 0.024268
v 0.000909 0.100984 0.031210
v -0.006034 0.100300 0.038153
v -0.006034 0.100300 0.045096
v 0.000909 0.100984 0.038153
v 0.000909 0.100984 0.045096
v -0.051012 0.084561 0.052039
v -0.051012 0.084561 0.058982
v -0.051012 0.084561 0.065925
v -0.051012 0.084561 0.072868
v -0.051012 0.084561 0.079811
v -0.047541 0.086416 0.052039
v -0.047541 0.086416 0.058982
v -0.041046 0.089888 0.052039
v -0.041046 0.089888 0.058982
v -0.037575 0.091743 0.052039
v -0.037575 0.091743 0.058982
v -0.047541 0.086416 0.065925
v -0.047541 0.086416 0.072868
v -0.041046 0.089888 0.065925
v -0.041046 0.089888 0.072868
v -0.037575 0.091743 0.065925
v -0.037575 0.091743 0.072868
v -0.033805 0.093347 0.052039
v -0.033805 0.093347 0.058982
v -0.026862 0.095845 0.052039
v -0.026862 0.095845 0.058982
v -0.033805 0.093347 0.065925
v -0.033805 0.093347 0.072868
v -0.026862 0.095845 0.065925
v -0.026862 0.095845 0.072868
v -0.047541 0.086416 0.079811
v -0.041046 0.089888 0.079811
v -0.037575 0.091743 0.079811
v -0.033805 0.093347 0.079811
v -0.026862 0.095845 0.079811
v -0.020706 0.097712 0.052039
v -0.020706 0.097712 0.058982
v -0.020706 0.097712 0.065925
v -0.020706 0.097712 0.072868
v -0.017235 0.098765 0.052039
v -0.017235 0.098765 0.058982
v -0.012976 0.099481 0.052039
v -0.012976 0.099481 0.058982
v -0.017235 0.098765 0.065925
v -0.017235 0.098765 0.072868
v -0.012976 0.099481 0.065925
v -0.012976 0.099481 0.072868
v -0.006034 0.100300 0.052039
v -0.006034 0.100300 0.058982
v 0.000909 0.100984 0.052039
v 0.000909 0.100984 0.058982
v -0.006034 0.100300 0.065925
v -0.006034 0.100300 0.072868
v 0.000909 0.100984 0.065925
v 0.000909 0.100984 0.072868
v -0.020706 0.097712 0.079811
v -0.017235 0.098765 0.079811
v -0.012976 0.099481 0.079811
v -0.006034 0.100300 0.079811
v 0.000909 0.100984 0.079811
s off
f 13 15 14
f 16 17 13
f 19 21 20
f 22 23 19
f 25 27 26
f 28 29 25
f 31 33 32
f 34 35 31
f 26 27 9
f 32 33 11
f 9 17 16
f 11 23 22
f 18 20 15
f 17 22 18
f 30 32 27
f 29 34 30
f 10 22 17
f 27 32 10
f 12 14 3
f 4 16 12
f 24 26 6
f 7 28 24
f 8 16 4
f 6 26 8
f 41 43 42
f 44 45 41
f 47 49 48
f 50 51 47
f 53 55 54
f 56 57 53
f 59 61 60
f 62 63 59
f 54 55 37
f 60 61 39
f 37 45 44
f 39 51 50
f 46 48 43
f 45 50 46
f 58 60 55
f 57 62 58
f 38 50 45
f 55 60 38
f 69 71 70
f 72 73 69
f 75 77 76
f 78 79 75
f 81 83 82
f 84 85 81
f 87 89 88
f 90 91 87
f 82 83 65
f 88 89 67
f 65 73 72
f 67 79 78
f 74 76 71
f 73 78 74
f 86 88 83
f 85 90 86
f 66 78 73
f 83 88 66
f 68 70 49
f 51 72 68
f 80 82 61
f 63 84 80
f 64 72 51
f 61 82 64
f 100 102 101
f 101 102 98
f 106 108 107
f 107 108 104
f 110 112 111
f 114 116 115
f 98 110 109
f 104 114 113
f 105 107 102
f 102 107 103
f 113 115 112
f 103 113 110
f 123 125 124
f 127 129 128
f 131 133 132
f 135 137 136
f 138 139 123
f 140 141 127
f 125 131 130
f 129 135 134
f 126 128 125
f 134 136 133
f 128 134 131
f 139 140 126
f 143 144 100
f 145 146 106
f 144 145 105
f 112 139 138
f 116 141 140
f 115 140 139
f 99 101 94
f 94 101 97
f 109 111 96
f 97 109 95
f 122 124 118
f 130 132 120
f 124 130 119
f 121 138 122
f 111 138 121
f 142 143 99
f 150 152 151
f 151 152 148
f 156 158 157
f 157 158 154
f 160 162 161
f 164 166 165
f 148 160 159
f 154 164 163
f 155 157 152
f 152 157 153
f 163 165 162
f 153 163 160
f 170 172 171
f 171 172 168
f 176 178 177
f 177 178 174
f 180 182 181
f 184 186 185
f 168 180 179
f 174 184 183
f 175 177 172
f 172 177 173
f 183 185 182
f 173 183 180
f 188 190 189
f 192 194 193
f 196 198 197
f 200 202 201
f 203 204 188
f 205 206 192
f 190 196 195
f 194 200 199
f 191 193 190
f 199 201 198
f 193 199 196
f 204 205 191
f 208 210 209
f 212 214 213
f 216 218 217
f 220 222 221
f 223 224 208
f 225 226 212
f 210 216 215
f 214 220 219
f 211 213 210
f 219 221 218
f 213 219 216
f 224 225 211
f 227 228 150
f 229 230 156
f 228 229 155
f 231 232 170
f 233 234 176
f 232 233 175
f 162 204 203
f 166 206 205
f 165 205 204
f 182 224 223
f 186 226 225
f 185 225 224
f 169 171 158
f 158 171 167
f 179 181 166
f 167 179 164
f 207 209 194
f 215 217 202
f 209 215 200
f 206 223 207
f 181 223 206
f 230 231 169
f 243 245 244
f 244 245 241
f 249 251 250
f 250 251 247
f 254 255 253
f 258 259 257
f 252 253 243
f 256 257 249
f 248 250 245
f 245 250 246
f 255 258 256
f 253 256 248
f 272 273 271
f 276 277 275
f 284 285 283
f 288 289 287
f 282 283 273
f 286 287 277
f 271 279 278
f 275 281 280
f 273 276 274
f 285 288 286
f 274 280 279
f 283 286 276
f 278 279 255
f 280 281 259
f 279 280 258
f 241 262 261
f 247 264 263
f 246 263 262
f 242 244 237
f 237 244 240
f 239 254 252
f 238 252 242
f 266 272 270
f 269 284 282
f 270 278 267
f 268 282 272
f 240 261 260
f 267 278 254
f 293 295 294
f 294 295 291
f 299 301 300
f 300 301 297
f 304 305 303
f 308 309 307
f 302 303 293
f 306 307 299
f 298 300 295
f 295 300 296
f 305 308 306
f 303 306 298
f 313 315 314
f 314 315 311
f 319 321 320
f 320 321 317
f 324 325 323
f 328 329 327
f 322 323 313
f 326 327 319
f 318 320 315
f 315 320 316
f 325 328 326
f 323 326 318
f 340 341 339
f 344 345 343
f 352 353 351
f 356 357 355
f 350 351 341
f 354 355 345
f 339 347 346
f 343 349 348
f 341 344 342
f 353 356 354
f 342 348 347
f 351 354 344
f 360 361 359
f 364 365 363
f 372 373 371
f 376 377 375
f 370 371 361
f 374 375 365
f 359 367 366
f 363 369 368
f 361 364 362
f 373 376 374
f 362 368 367
f 371 374 364
f 346 347 305
f 348 349 309
f 347 348 308
f 366 367 325
f 368 369 329
f 367 368 328
f 291 331 330
f 297 333 332
f 296 332 331
f 311 335 334
f 317 337 336
f 316 336 335
f 312 314 301
f 301 314 310
f 309 324 322
f 307 322 312
f 345 360 358
f 357 372 370
f 358 366 349
f 355 370 360
f 310 334 333
f 349 366 324
f 261 262 29
f 263 264 35
f 262 263 34
f 260 261 28
f 330 331 57
f 332 333 63
f 331 332 62
f 334 335 85
f 336 337 91
f 335 336 90
f 333 334 84
f 15 144 143
f 21 146 145
f 20 145 144
f 14 143 142
f 43 228 227
f 49 230 229
f 48 229 228
f 71 232 231
f 77 234 233
f 76 233 232
f 70 231 230
f 40 42 21
f 23 44 40
f 52 54 33
f 35 56 52
f 36 44 23
f 33 54 36
f 149 151 108
f 108 151 147
f 159 161 116
f 147 159 114
f 187 189 129
f 195 197 137
f 189 195 135
f 141 203 187
f 161 203 141
f 146 227 149
f 292 294 251
f 251 294 290
f 259 304 302
f 257 302 292
f 277 340 338
f 289 352 350
f 338 346 281
f 287 350 340
f 290 330 264
f 281 346 304
f 42 227 146
f 264 330 56
f 383 385 384
f 386 387 383
f 389 391 390
f 392 393 389
f 395 397 396
f 398 399 395
f 401 403 402
f 404 405 401
f 396 397 379
f 402 403 381
f 379 387 386
f 381 393 392
f 388 390 385
f 387 392 388
f 400 402 397
f 399 404 400
f 380 392 387
f 397 402 380
f 411 413 412
f 414 415 411
f 417 419 418
f 420 421 417
f 423 425 424
f 426 427 423
f 429 431 430
f 432 433 429
f 424 425 407
f 430 431 409
f 407 415 414
f 409 421 420
f 416 418 413
f 415 420 416
f 428 430 425
f 427 432 428
f 408 420 415
f 425 430 408
f 410 412 391
f 393 414 410
f 422 424 403
f 405 426 422
f 406 414 393
f 403 424 406
f 439 441 440
f 442 443 439
f 445 447 446
f 448 449 445
f 451 453 452
f 454 455 451
f 457 459 458
f 460 461 457
f 452 453 435
f 458 459 437
f 435 443 442
f 437 449 448
f 444 446 441
f 443 448 444
f 456 458 453
f 455 460 456
f 436 448 443
f 453 458 436
f 463 464 447
f 449 465 463
f 466 467 459
f 461 468 466
f 462 465 449
f 459 467 462
f 472 474 473
f 473 474 470
f 478 480 479
f 479 480 476
f 482 484 483
f 486 488 487
f 470 482 481
f 476 486 485
f 477 479 474
f 474 479 475
f 485 487 484
f 475 485 482
f 492 494 493
f 493 494 490
f 498 500 499
f 499 500 496
f 502 504 503
f 506 508 507
f 490 502 501
f 496 506 505
f 497 499 494
f 494 499 495
f 505 507 504
f 495 505 502
f 510 512 511
f 514 516 515
f 518 520 519
f 522 524 523
f 525 526 510
f 527 528 514
f 512 518 517
f 516 522 521
f 513 515 512
f 521 523 520
f 515 521 518
f 526 527 513
f 530 532 531
f 534 536 535
f 538 540 539
f 542 544 543
f 545 546 530
f 547 548 534
f 532 538 537
f 536 542 541
f 533 535 532
f 541 543 540
f 535 541 538
f 546 547 533
f 549 550 472
f 551 552 478
f 550 551 477
f 553 554 492
f 555 556 498
f 554 555 497
f 484 526 525
f 488 528 527
f 487 527 526
f 504 546 545
f 508 548 547
f 507 547 546
f 491 493 480
f 480 493 489
f 501 503 488
f 489 501 486
f 529 531 516
f 537 539 524
f 531 537 522
f 528 545 529
f 503 545 528
f 552 553 491
f 560 562 561
f 561 562 558
f 566 568 567
f 567 568 564
f 570 572 571
f 574 576 575
f 558 570 569
f 564 574 573
f 565 567 562
f 562 567 563
f 573 575 572
f 563 573 570
f 583 585 584
f 587 589 588
f 591 593 592
f 595 597 596
f 598 599 583
f 600 601 587
f 585 591 590
f 589 595 594
f 586 588 585
f 594 596 593
f 588 594 591
f 599 600 586
f 607 608 560
f 609 610 566
f 608 609 565
f 572 599 598
f 576 601 600
f 575 600 599
f 578 579 568
f 568 579 577
f 580 581 576
f 577 580 574
f 602 603 589
f 604 605 597
f 603 604 595
f 601 606 602
f 581 606 601
f 610 611 578
f 615 617 616
f 616 617 613
f 621 623 622
f 622 623 619
f 626 627 625
f 630 631 629
f 624 625 615
f 628 629 621
f 620 622 617
f 617 622 618
f 627 630 628
f 625 628 620
f 635 637 636
f 636 637 633
f 641 643 642
f 642 643 639
f 646 647 645
f 650 651 649
f 644 645 635
f 648 649 641
f 640 642 637
f 637 642 638
f 647 650 648
f 645 648 640
f 662 663 661
f 666 667 665
f 674 675 673
f 678 679 677
f 672 673 663
f 676 677 667
f 661 669 668
f 665 671 670
f 663 666 664
f 675 678 676
f 664 670 669
f 673 676 666
f 682 683 681
f 686 687 685
f 694 695 693
f 698 699 697
f 692 693 683
f 696 697 687
f 681 689 688
f 685 691 690
f 683 686 684
f 695 698 696
f 684 690 689
f 693 696 686
f 668 669 627
f 670 671 631
f 669 670 630
f 688 689 647
f 690 691 651
f 689 690 650
f 613 653 652
f 619 655 654
f 618 654 653
f 633 657 656
f 639 659 658
f 638 658 657
f 634 636 623
f 623 636 632
f 631 646 644
f 629 644 634
f 667 682 680
f 679 694 692
f 680 688 671
f 677 692 682
f 632 656 655
f 671 688 646
f 703 705 704
f 704 705 701
f 709 711 710
f 710 711 707
f 714 715 713
f 718 719 717
f 712 713 703
f 716 717 709
f 708 710 705
f 705 710 706
f 715 718 716
f 713 716 708
f 732 733 731
f 736 737 735
f 744 745 743
f 748 749 747
f 742 743 733
f 746 747 737
f 731 739 738
f 735 741 740
f 733 736 734
f 745 748 746
f 734 740 739
f 743 746 736
f 738 739 715
f 740 741 719
f 739 740 718
f 701 726 725
f 707 728 727
f 706 727 726
f 721 722 711
f 711 722 720
f 719 724 723
f 717 723 721
f 737 751 750
f 749 754 753
f 750 752 741
f 747 753 751
f 720 729 728
f 741 752 724
f 652 653 399
f 654 655 405
f 653 654 404
f 656 657 427
f 658 659 433
f 657 658 432
f 655 656 426
f 725 726 455
f 727 728 461
f 726 727 460
f 728 729 468
f 385 550 549
f 391 552 551
f 390 551 550
f 413 554 553
f 419 556 555
f 418 555 554
f 412 553 552
f 441 608 607
f 447 610 609
f 446 609 608
f 464 611 610
f 438 440 419
f 421 442 438
f 450 452 431
f 433 454 450
f 434 442 421
f 431 452 434
f 559 561 500
f 500 561 557
f 569 571 508
f 557 569 506
f 582 584 536
f 590 592 544
f 584 590 542
f 548 598 582
f 571 598 548
f 556 607 559
f 702 704 643
f 643 704 700
f 651 714 712
f 649 712 702
f 687 732 730
f 699 744 742
f 730 738 691
f 697 742 732
f 700 725 659
f 691 738 714
f 440 607 556
f 659 725 454
f 761 763 762
f 765 767 766
f 769 771 770
f 773 775 774
f 777 776 770
f 779 778 774
f 763 769 768
f 767 773 772
f 764 766 763
f 772 774 771
f 766 772 769
f 778 777 771
f 786 788 787
f 790 792 791
f 796 798 797
f 796 795 793
f 802 804 803
f 802 801 799
f 788 794 793
f 792 800 799
f 789 791 788
f 801 803 798
f 801 796 794
f 791 799 794
f 807 806 797
f 809 808 803
f 808 807 798
f 777 786 785
f 779 790 789
f 778 789 786
f 760 762 756
f 768 770 758
f 762 768 757
f 776 759 758
f 785 787 781
f 795 797 784
f 795 783 782
f 787 793 782
f 776 785 780
f 806 805 784
f 811 813 812
f 815 817 816
f 819 821 820
f 823 825 824
f 827 826 820
f 829 828 824
f 813 819 818
f 817 823 822
f 814 816 813
f 822 824 821
f 816 822 819
f 828 827 821
f 831 833 832
f 835 837 836
f 839 841 840
f 843 845 844
f 847 846 840
f 849 848 844
f 833 839 838
f 837 843 842
f 834 836 833
f 842 844 841
f 836 842 839
f 848 847 841
f 851 853 852
f 855 857 856
f 861 863 862
f 861 860 858
f 867 869 868
f 867 866 864
f 853 859 858
f 857 865 864
f 854 856 853
f 866 868 863
f 866 861 859
f 856 864 859
f 871 873 872
f 875 877 876
f 881 883 882
f 881 880 878
f 887 889 888
f 887 886 884
f 873 879 878
f 877 885 884
f 874 876 873
f 886 888 883
f 886 881 879
f 876 884 879
f 891 890 862
f 893 892 868
f 892 891 863
f 895 894 882
f 897 896 888
f 896 895 883
f 827 851 850
f 829 855 854
f 828 854 851
f 847 871 870
f 849 875 874
f 848 874 871
f 830 832 817
f 838 840 825
f 832 838 823
f 846 829 825
f 870 872 857
f 880 882 869
f 880 867 865
f 872 878 865
f 846 870 855
f 894 893 869
f 906 908 907
f 910 909 907
f 912 914 913
f 916 915 913
f 922 924 923
f 926 925 923
f 928 930 929
f 932 931 929
f 922 921 917
f 928 927 919
f 910 918 917
f 916 920 919
f 911 913 908
f 915 910 908
f 927 929 924
f 931 926 924
f 915 919 918
f 927 922 918
f 905 907 899
f 909 900 899
f 921 923 903
f 925 904 903
f 909 917 901
f 921 902 901
f 934 936 935
f 938 937 935
f 940 942 941
f 944 943 941
f 950 952 951
f 954 953 951
f 956 958 957
f 960 959 957
f 950 949 945
f 956 955 947
f 938 946 945
f 944 948 947
f 939 941 936
f 943 938 936
f 955 957 952
f 959 954 952
f 943 947 946
f 955 950 946
f 962 964 963
f 966 965 963
f 968 970 969
f 972 971 969
f 978 980 979
f 982 981 979
f 984 986 985
f 988 987 985
f 978 977 973
f 984 983 975
f 966 974 973
f 972 976 975
f 967 969 964
f 971 966 964
f 983 985 980
f 987 982 980
f 971 975 974
f 983 978 974
f 961 963 942
f 965 944 942
f 977 979 958
f 981 960 958
f 965 973 948
f 977 956 948
f 1002 1004 1003
f 1002 1001 999
f 1008 1010 1009
f 1008 1007 1005
f 1014 1013 1011
f 1018 1017 1015
f 1012 1011 1003
f 1016 1015 1009
f 1007 1009 1004
f 1007 1002 1000
f 1017 1014 1012
f 1015 1012 1004
f 1031 1030 1028
f 1035 1034 1032
f 1039 1038 1036
f 1043 1042 1040
f 1037 1036 1030
f 1041 1040 1034
f 1025 1029 1028
f 1027 1033 1032
f 1034 1031 1029
f 1042 1039 1037
f 1026 1032 1029
f 1040 1037 1031
f 1025 1024 1013
f 1027 1026 1017
f 1026 1025 1014
f 991 1000 999
f 993 1006 1005
f 992 1005 1000
f 1001 1003 996
f 1001 995 994
f 1013 998 997
f 1011 997 996
f 1030 1021 1020
f 1038 1023 1022
f 1024 1028 1020
f 1036 1022 1021
f 990 999 994
f 1024 1019 998
f 1055 1057 1056
f 1055 1054 1052
f 1061 1063 1062
f 1061 1060 1058
f 1067 1066 1064
f 1071 1070 1068
f 1065 1064 1056
f 1069 1068 1062
f 1060 1062 1057
f 1060 1055 1053
f 1070 1067 1065
f 1068 1065 1057
f 1075 1077 1076
f 1075 1074 1072
f 1081 1083 1082
f 1081 1080 1078
f 1087 1086 1084
f 1091 1090 1088
f 1085 1084 1076
f 1089 1088 1082
f 1080 1082 1077
f 1080 1075 1073
f 1090 1087 1085
f 1088 1085 1077
f 1099 1098 1096
f 1103 1102 1100
f 1107 1106 1104
f 1111 1110 1108
f 1105 1104 1098
f 1109 1108 1102
f 1093 1097 1096
f 1095 1101 1100
f 1102 1099 1097
f 1110 1107 1105
f 1094 1100 1097
f 1108 1105 1099
f 1119 1118 1116
f 1123 1122 1120
f 1127 1126 1124
f 1131 1130 1128
f 1125 1124 1118
f 1129 1128 1122
f 1113 1117 1116
f 1115 1121 1120
f 1122 1119 1117
f 1130 1127 1125
f 1114 1120 1117
f 1128 1125 1119
f 1093 1092 1066
f 1095 1094 1070
f 1094 1093 1067
f 1113 1112 1086
f 1115 1114 1090
f 1114 1113 1087
f 1045 1053 1052
f 1047 1059 1058
f 1046 1058 1053
f 1049 1073 1072
f 1051 1079 1078
f 1050 1078 1073
f 1074 1076 1063
f 1074 1061 1059
f 1086 1071 1069
f 1084 1069 1063
f 1118 1103 1101
f 1126 1111 1109
f 1112 1116 1101
f 1124 1109 1103
f 1048 1072 1059
f 1112 1095 1071
f 991 990 925
f 993 992 931
f 992 991 926
f 990 989 904
f 1045 1044 953
f 1047 1046 959
f 1046 1045 954
f 1049 1048 981
f 1051 1050 987
f 1050 1049 982
f 1048 1047 960
f 807 906 905
f 809 912 911
f 808 911 906
f 806 905 898
f 891 934 933
f 893 940 939
f 892 939 934
f 895 962 961
f 897 968 967
f 896 967 962
f 894 961 940
f 810 812 767
f 818 820 775
f 812 818 773
f 826 779 775
f 850 852 792
f 860 862 804
f 860 802 800
f 852 858 800
f 826 850 790
f 890 809 804
f 933 935 914
f 937 916 914
f 949 951 930
f 953 932 930
f 937 945 920
f 949 928 920
f 1054 1056 1010
f 1054 1008 1006
f 1066 1018 1016
f 1064 1016 1010
f 1098 1035 1033
f 1106 1043 1041
f 1092 1096 1033
f 1104 1041 1035
f 1044 1052 1006
f 1092 1027 1018
f 890 933 912
f 1044 993 932
f 1133 1135 1134
f 1137 1139 1138
f 1141 1143 1142
f 1145 1147 1146
f 1149 1148 1142
f 1151 1150 1146
f 1135 1141 1140
f 1139 1145 1144
f 1136 1138 1135
f 1144 1146 1143
f 1138 1144 1141
f 1150 1149 1143
f 1153 1155 1154
f 1157 1159 1158
f 1161 1163 1162
f 1165 1167 1166
f 1169 1168 1162
f 1171 1170 1166
f 1155 1161 1160
f 1159 1165 1164
f 1156 1158 1155
f 1164 1166 1163
f 1158 1164 1161
f 1170 1169 1163
f 1173 1175 1174
f 1177 1179 1178
f 1183 1185 1184
f 1183 1182 1180
f 1189 1191 1190
f 1189 1188 1186
f 1175 1181 1180
f 1179 1187 1186
f 1176 1178 1175
f 1188 1190 1185
f 1188 1183 1181
f 1178 1186 1181
f 1193 1195 1194
f 1197 1199 1198
f 1203 1205 1204
f 1203 1202 1200
f 1209 1211 1210
f 1209 1208 1206
f 1195 1201 1200
f 1199 1207 1206
f 1196 1198 1195
f 1208 1210 1205
f 1208 1203 1201
f 1198 1206 1201
f 1213 1212 1184
f 1215 1214 1190
f 1214 1213 1185
f 1217 1216 1204
f 1219 1218 1210
f 1218 1217 1205
f 1149 1173 1172
f 1151 1177 1176
f 1150 1176 1173
f 1169 1193 1192
f 1171 1197 1196
f 1170 1196 1193
f 1152 1154 1139
f 1160 1162 1147
f 1154 1160 1145
f 1168 1151 1147
f 1192 1194 1179
f 1202 1204 1191
f 1202 1189 1187
f 1194 1200 1187
f 1168 1192 1177
f 1216 1215 1191
f 1221 1223 1222
f 1225 1227 1226
f 1229 1231 1230
f 1233 1235 1234
f 1237 1236 1230
f 1239 1238 1234
f 1223 1229 1228
f 1227 1233 1232
f 1224 1226 1223
f 1232 1234 1231
f 1226 1232 1229
f 1238 1237 1231
f 1246 1248 1247
f 1250 1252 1251
f 1256 1258 1257
f 1256 1255 1253
f 1262 1264 1263
f 1262 1261 1259
f 1248 1254 1253
f 1252 1260 1259
f 1249 1251 1248
f 1261 1263 1258
f 1261 1256 1254
f 1251 1259 1254
f 1271 1270 1257
f 1273 1272 1263
f 1272 1271 1258
f 1237 1246 1245
f 1239 1250 1249
f 1238 1249 1246
f 1240 1241 1227
f 1242 1243 1235
f 1241 1242 1233
f 1244 1239 1235
f 1265 1266 1252
f 1268 1269 1264
f 1268 1262 1260
f 1266 1267 1260
f 1244 1265 1250
f 1274 1273 1264
f 1276 1278 1277
f 1280 1279 1277
f 1282 1284 1283
f 1286 1285 1283
f 1292 1294 1293
f 1296 1295 1293
f 1298 1300 1299
f 1302 1301 1299
f 1292 1291 1287
f 1298 1297 1289
f 1280 1288 1287
f 1286 1290 1289
f 1281 1283 1278
f 1285 1280 1278
f 1297 1299 1294
f 1301 1296 1294
f 1285 1289 1288
f 1297 1292 1288
f 1304 1306 1305
f 1308 1307 1305
f 1310 1312 1311
f 1314 1313 1311
f 1320 1322 1321
f 1324 1323 1321
f 1326 1328 1327
f 1330 1329 1327
f 1320 1319 1315
f 1326 1325 1317
f 1308 1316 1315
f 1314 1318 1317
f 1309 1311 1306
f 1313 1308 1306
f 1325 1327 1322
f 1329 1324 1322
f 1313 1317 1316
f 1325 1320 1316
f 1303 1305 1284
f 1307 1286 1284
f 1319 1321 1300
f 1323 1302 1300
f 1307 1315 1290
f 1319 1298 1290
f 1332 1334 1333
f 1336 1335 1333
f 1338 1340 1339
f 1342 1341 1339
f 1348 1350 1349
f 1352 1351 1349
f 1354 1356 1355
f 1358 1357 1355
f 1348 1347 1343
f 1354 1353 1345
f 1336 1344 1343
f 1342 1346 1345
f 1337 1339 1334
f 1341 1336 1334
f 1353 1355 1350
f 1357 1352 1350
f 1341 1345 1344
f 1353 1348 1344
f 1359 1360 1340
f 1361 1342 1340
f 1363 1364 1356
f 1365 1358 1356
f 1361 1362 1346
f 1363 1354 1346
f 1377 1379 1378
f 1377 1376 1374
f 1383 1385 1384
f 1383 1382 1380
f 1389 1388 1386
f 1393 1392 1390
f 1387 1386 1378
f 1391 1390 1384
f 1382 1384 1379
f 1382 1377 1375
f 1392 1389 1387
f 1390 1387 1379
f 1397 1399 1398
f 1397 1396 1394
f 1403 1405 1404
f 1403 1402 1400
f 1409 1408 1406
f 1413 1412 1410
f 1407 1406 1398
f 1411 1410 1404
f 1402 1404 1399
f 1402 1397 1395
f 1412 1409 1407
f 1410 1407 1399
f 1421 1420 1418
f 1425 1424 1422
f 1429 1428 1426
f 1433 1432 1430
f 1427 1426 1420
f 1431 1430 1424
f 1415 1419 1418
f 1417 1423 1422
f 1424 1421 1419
f 1432 1429 1427
f 1416 1422 1419
f 1430 1427 1421
f 1441 1440 1438
f 1445 1444 1442
f 1449 1448 1446
f 1453 1452 1450
f 1447 1446 1440
f 1451 1450 1444
f 1435 1439 1438
f 1437 1443 1442
f 1444 1441 1439
f 1452 1449 1447
f 1436 1442 1439
f 1450 1447 1441
f 1415 1414 1388
f 1417 1416 1392
f 1416 1415 1389
f 1435 1434 1408
f 1437 1436 1412
f 1436 1435 1409
f 1367 1375 1374
f 1369 1381 1380
f 1368 1380 1375
f 1371 1395 1394
f 1373 1401 1400
f 1372 1400 1395
f 1396 1398 1385
f 1396 1383 1381
f 1408 1393 1391
f 1406 1391 1385
f 1440 1425 1423
f 1448 1433 1431
f 1434 1438 1423
f 1446 1431 1425
f 1370 1394 1381
f 1434 1417 1393
f 1462 1464 1463
f 1462 1461 1459
f 1468 1470 1469
f 1468 1467 1465
f 1474 1473 1471
f 1478 1477 1475
f 1472 1471 1463
f 1476 1475 1469
f 1467 1469 1464
f 1467 1462 1460
f 1477 1474 1472
f 1475 1472 1464
f 1491 1490 1488
f 1495 1494 1492
f 1499 1498 1496
f 1503 1502 1500
f 1497 1496 1490
f 1501 1500 1494
f 1485 1489 1488
f 1487 1493 1492
f 1494 1491 1489
f 1502 1499 1497
f 1486 1492 1489
f 1500 1497 1491
f 1485 1484 1473
f 1487 1486 1477
f 1486 1485 1474
f 1455 1460 1459
f 1457 1466 1465
f 1456 1465 1460
f 1480 1481 1470
f 1480 1468 1466
f 1483 1478 1476
f 1482 1476 1470
f 1506 1495 1493
f 1508 1503 1501
f 1504 1505 1493
f 1507 1501 1495
f 1458 1479 1466
f 1504 1487 1478
f 1367 1366 1295
f 1369 1368 1301
f 1368 1367 1296
f 1371 1370 1323
f 1373 1372 1329
f 1372 1371 1324
f 1370 1369 1302
f 1455 1454 1351
f 1457 1456 1357
f 1456 1455 1352
f 1458 1457 1358
f 1213 1276 1275
f 1215 1282 1281
f 1214 1281 1276
f 1217 1304 1303
f 1219 1310 1309
f 1218 1309 1304
f 1216 1303 1282
f 1271 1332 1331
f 1273 1338 1337
f 1272 1337 1332
f 1274 1359 1338
f 1220 1222 1159
f 1228 1230 1167
f 1222 1228 1165
f 1236 1171 1167
f 1245 1247 1199
f 1255 1257 1211
f 1255 1209 1207
f 1247 1253 1207
f 1236 1245 1197
f 1270 1219 1211
f 1331 1333 1312
f 1335 1314 1312
f 1347 1349 1328
f 1351 1330 1328
f 1335 1343 1318
f 1347 1326 1318
f 1461 1463 1405
f 1461 1403 1401
f 1473 1413 1411
f 1471 1411 1405
f 1490 1445 1443
f 1498 1453 1451
f 1484 1488 1443
f 1496 1451 1445
f 1454 1459 1401
f 1484 1437 1413
f 1270 1331 1310
f 1454 1373 1330
f 133 761 760
f 137 765 764
f 136 764 761
f 132 760 755
f 198 811 810
f 202 815 814
f 201 814 811
f 218 831 830
f 222 835 834
f 221 834 831
f 217 830 815
f 197 810 765
f 520 1133 1132
f 524 1137 1136
f 523 1136 1133
f 540 1153 1152
f 544 1157 1156
f 543 1156 1153
f 539 1152 1137
f 593 1221 1220
f 597 1225 1224
f 596 1224 1221
f 605 1240 1225
f 592 1220 1157
f 382 384 77
f 79 386 382
f 394 396 89
f 91 398 394
f 378 386 79
f 89 396 378
f 471 473 178
f 178 473 469
f 481 483 186
f 469 481 184
f 509 511 214
f 517 519 222
f 511 517 220
f 226 525 509
f 483 525 226
f 234 549 471
f 614 616 321
f 321 616 612
f 329 626 624
f 327 624 614
f 365 662 660
f 377 674 672
f 660 668 369
f 375 672 662
f 612 652 337
f 369 668 626
f 384 549 234
f 337 652 398
f 1132 1134 837
f 1140 1142 845
f 1134 1140 843
f 1148 849 845
f 1172 1174 877
f 1182 1184 889
f 1182 887 885
f 1174 1180 885
f 1148 1172 875
f 1212 897 889
f 1275 1277 970
f 1279 972 970
f 1291 1293 986
f 1295 988 986
f 1279 1287 976
f 1291 984 976
f 1376 1378 1083
f 1376 1081 1079
f 1388 1091 1089
f 1386 1089 1083
f 1420 1123 1121
f 1428 1131 1129
f 1414 1418 1121
f 1426 1129 1123
f 1366 1374 1079
f 1414 1115 1091
f 1212 1275 968
f 1366 1051 988
f 519 1132 835
f 12 13 14
f 12 16 13
f 18 19 20
f 18 22 19
f 24 25 26
f 24 28 25
f 30 31 32
f 30 34 31
f 8 26 9
f 10 32 11
f 8 9 16
f 10 11 22
f 13 18 15
f 13 17 18
f 25 30 27
f 25 29 30
f 9 10 17
f 9 27 10
f 2 12 3
f 2 4 12
f 5 24 6
f 5 7 24
f 1 8 4
f 1 6 8
f 40 41 42
f 40 44 41
f 46 47 48
f 46 50 47
f 52 53 54
f 52 56 53
f 58 59 60
f 58 62 59
f 36 54 37
f 38 60 39
f 36 37 44
f 38 39 50
f 41 46 43
f 41 45 46
f 53 58 55
f 53 57 58
f 37 38 45
f 37 55 38
f 68 69 70
f 68 72 69
f 74 75 76
f 74 78 75
f 80 81 82
f 80 84 81
f 86 87 88
f 86 90 87
f 64 82 65
f 66 88 67
f 64 65 72
f 66 67 78
f 69 74 71
f 69 73 74
f 81 86 83
f 81 85 86
f 65 66 73
f 65 83 66
f 47 68 49
f 47 51 68
f 59 80 61
f 59 63 80
f 39 64 51
f 39 61 64
f 99 100 101
f 97 101 98
f 105 106 107
f 103 107 104
f 109 110 111
f 113 114 115
f 97 98 109
f 103 104 113
f 100 105 102
f 98 102 103
f 110 113 112
f 98 103 110
f 122 123 124
f 126 127 128
f 130 131 132
f 134 135 136
f 122 138 123
f 126 140 127
f 124 125 130
f 128 129 134
f 123 126 125
f 131 134 133
f 125 128 131
f 123 139 126
f 99 143 100
f 105 145 106
f 100 144 105
f 111 112 138
f 115 116 140
f 112 115 139
f 93 99 94
f 92 94 97
f 95 109 96
f 92 97 95
f 117 122 118
f 119 130 120
f 118 124 119
f 117 121 122
f 96 111 121
f 93 142 99
f 149 150 151
f 147 151 148
f 155 156 157
f 153 157 154
f 159 160 161
f 163 164 165
f 147 148 159
f 153 154 163
f 150 155 152
f 148 152 153
f 160 163 162
f 148 153 160
f 169 170 171
f 167 171 168
f 175 176 177
f 173 177 174
f 179 180 181
f 183 184 185
f 167 168 179
f 173 174 183
f 170 175 172
f 168 172 173
f 180 183 182
f 168 173 180
f 187 188 189
f 191 192 193
f 195 196 197
f 199 200 201
f 187 203 188
f 191 205 192
f 189 190 195
f 193 194 199
f 188 191 190
f 196 199 198
f 190 193 196
f 188 204 191
f 207 208 209
f 211 212 213
f 215 216 217
f 219 220 221
f 207 223 208
f 211 225 212
f 209 210 215
f 213 214 219
f 208 211 210
f 216 219 218
f 210 213 216
f 208 224 211
f 149 227 150
f 155 229 156
f 150 228 155
f 169 231 170
f 175 233 176
f 170 232 175
f 161 162 203
f 165 166 205
f 162 165 204
f 181 182 223
f 185 186 225
f 182 185 224
f 156 169 158
f 154 158 167
f 164 179 166
f 154 167 164
f 192 207 194
f 200 215 202
f 194 209 200
f 192 206 207
f 166 181 206
f 156 230 169
f 242 243 244
f 240 244 241
f 248 249 250
f 246 250 247
f 252 254 253
f 256 258 257
f 242 252 243
f 248 256 249
f 243 248 245
f 241 245 246
f 253 255 256
f 243 253 248
f 270 272 271
f 274 276 275
f 282 284 283
f 286 288 287
f 272 282 273
f 276 286 277
f 270 271 278
f 274 275 280
f 271 273 274
f 283 285 286
f 271 274 279
f 273 283 276
f 254 278 255
f 258 280 259
f 255 279 258
f 240 241 261
f 246 247 263
f 241 246 262
f 236 242 237
f 235 237 240
f 238 239 252
f 236 238 242
f 265 266 270
f 268 269 282
f 265 270 267
f 266 268 272
f 235 240 260
f 239 267 254
f 292 293 294
f 290 294 291
f 298 299 300
f 296 300 297
f 302 304 303
f 306 308 307
f 292 302 293
f 298 306 299
f 293 298 295
f 291 295 296
f 303 305 306
f 293 303 298
f 312 313 314
f 310 314 311
f 318 319 320
f 316 320 317
f 322 324 323
f 326 328 327
f 312 322 313
f 318 326 319
f 313 318 315
f 311 315 316
f 323 325 326
f 313 323 318
f 338 340 339
f 342 344 343
f 350 352 351
f 354 356 355
f 340 350 341
f 344 354 345
f 338 339 346
f 342 343 348
f 339 341 342
f 351 353 354
f 339 342 347
f 341 351 344
f 358 360 359
f 362 364 363
f 370 372 371
f 374 376 375
f 360 370 361
f 364 374 365
f 358 359 366
f 362 363 368
f 359 361 362
f 371 373 374
f 359 362 367
f 361 371 364
f 304 346 305
f 308 348 309
f 305 347 308
f 324 366 325
f 328 368 329
f 325 367 328
f 290 291 330
f 296 297 332
f 291 296 331
f 310 311 334
f 316 317 336
f 311 316 335
f 299 312 301
f 297 301 310
f 307 309 322
f 299 307 312
f 343 345 358
f 355 357 370
f 343 358 349
f 345 355 360
f 297 310 333
f 309 349 324
f 28 261 29
f 34 263 35
f 29 262 34
f 7 260 28
f 56 330 57
f 62 332 63
f 57 331 62
f 84 334 85
f 90 336 91
f 85 335 90
f 63 333 84
f 14 15 143
f 20 21 145
f 15 20 144
f 3 14 142
f 42 43 227
f 48 49 229
f 43 48 228
f 70 71 231
f 76 77 233
f 71 76 232
f 49 70 230
f 19 40 21
f 19 23 40
f 31 52 33
f 31 35 52
f 11 36 23
f 11 33 36
f 106 149 108
f 104 108 147
f 114 159 116
f 104 147 114
f 127 187 129
f 135 195 137
f 129 189 135
f 127 141 187
f 116 161 141
f 106 146 149
f 249 292 251
f 247 251 290
f 257 259 302
f 249 257 292
f 275 277 338
f 287 289 350
f 275 338 281
f 277 287 340
f 247 290 264
f 259 281 304
f 21 42 146
f 35 264 56
f 382 383 384
f 382 386 383
f 388 389 390
f 388 392 389
f 394 395 396
f 394 398 395
f 400 401 402
f 400 404 401
f 378 396 379
f 380 402 381
f 378 379 386
f 380 381 392
f 383 388 385
f 383 387 388
f 395 400 397
f 395 399 400
f 379 380 387
f 379 397 380
f 410 411 412
f 410 414 411
f 416 417 418
f 416 420 417
f 422 423 424
f 422 426 423
f 428 429 430
f 428 432 429
f 406 424 407
f 408 430 409
f 406 407 414
f 408 409 420
f 411 416 413
f 411 415 416
f 423 428 425
f 423 427 428
f 407 408 415
f 407 425 408
f 389 410 391
f 389 393 410
f 401 422 403
f 401 405 422
f 381 406 393
f 381 403 406
f 438 439 440
f 438 442 439
f 444 445 446
f 444 448 445
f 450 451 452
f 450 454 451
f 456 457 458
f 456 460 457
f 434 452 435
f 436 458 437
f 434 435 442
f 436 437 448
f 439 444 441
f 439 443 444
f 451 456 453
f 451 455 456
f 435 436 443
f 435 453 436
f 445 463 447
f 445 449 463
f 457 466 459
f 457 461 466
f 437 462 449
f 437 459 462
f 471 472 473
f 469 473 470
f 477 478 479
f 475 479 476
f 481 482 483
f 485 486 487
f 469 470 481
f 475 476 485
f 472 477 474
f 470 474 475
f 482 485 484
f 470 475 482
f 491 492 493
f 489 493 490
f 497 498 499
f 495 499 496
f 501 502 503
f 505 506 507
f 489 490 501
f 495 496 505
f 492 497 494
f 490 494 495
f 502 505 504
f 490 495 502
f 509 510 511
f 513 514 515
f 517 518 519
f 521 522 523
f 509 525 510
f 513 527 514
f 511 512 517
f 515 516 521
f 510 513 512
f 518 521 520
f 512 515 518
f 510 526 513
f 529 530 531
f 533 534 535
f 537 538 539
f 541 542 543
f 529 545 530
f 533 547 534
f 531 532 537
f 535 536 541
f 530 533 532
f 538 541 540
f 532 535 538
f 530 546 533
f 471 549 472
f 477 551 478
f 472 550 477
f 491 553 492
f 497 555 498
f 492 554 497
f 483 484 525
f 487 488 527
f 484 487 526
f 503 504 545
f 507 508 547
f 504 507 546
f 478 491 480
f 476 480 489
f 486 501 488
f 476 489 486
f 514 529 516
f 522 537 524
f 516 531 522
f 514 528 529
f 488 503 528
f 478 552 491
f 559 560 561
f 557 561 558
f 565 566 567
f 563 567 564
f 569 570 571
f 573 574 575
f 557 558 569
f 563 564 573
f 560 565 562
f 558 562 563
f 570 573 572
f 558 563 570
f 582 583 584
f 586 587 588
f 590 591 592
f 594 595 596
f 582 598 583
f 586 600 587
f 584 585 590
f 588 589 594
f 583 586 585
f 591 594 593
f 585 588 591
f 583 599 586
f 559 607 560
f 565 609 566
f 560 608 565
f 571 572 598
f 575 576 600
f 572 575 599
f 566 578 568
f 564 568 577
f 574 580 576
f 564 577 574
f 587 602 589
f 595 604 597
f 589 603 595
f 587 601 602
f 576 581 601
f 566 610 578
f 614 615 616
f 612 616 613
f 620 621 622
f 618 622 619
f 624 626 625
f 628 630 629
f 614 624 615
f 620 628 621
f 615 620 617
f 613 617 618
f 625 627 628
f 615 625 620
f 634 635 636
f 632 636 633
f 640 641 642
f 638 642 639
f 644 646 645
f 648 650 649
f 634 644 635
f 640 648 641
f 635 640 637
f 633 637 638
f 645 647 648
f 635 645 640
f 660 662 661
f 664 666 665
f 672 674 673
f 676 678 677
f 662 672 663
f 666 676 667
f 660 661 668
f 664 665 670
f 661 663 664
f 673 675 676
f 661 664 669
f 663 673 666
f 680 682 681
f 684 686 685
f 692 694 693
f 696 698 697
f 682 692 683
f 686 696 687
f 680 681 688
f 684 685 690
f 681 683 684
f 693 695 696
f 681 684 689
f 683 693 686
f 626 668 627
f 630 670 631
f 627 669 630
f 646 688 647
f 650 690 651
f 647 689 650
f 612 613 652
f 618 619 654
f 613 618 653
f 632 633 656
f 638 639 658
f 633 638 657
f 621 634 623
f 619 623 632
f 629 631 644
f 621 629 634
f 665 667 680
f 677 679 692
f 665 680 671
f 667 677 682
f 619 632 655
f 631 671 646
f 702 703 704
f 700 704 701
f 708 709 710
f 706 710 707
f 712 714 713
f 716 718 717
f 702 712 703
f 708 716 709
f 703 708 705
f 701 705 706
f 713 715 716
f 703 713 708
f 730 732 731
f 734 736 735
f 742 744 743
f 746 748 747
f 732 742 733
f 736 746 737
f 730 731 738
f 734 735 740
f 731 733 734
f 743 745 746
f 731 734 739
f 733 743 736
f 714 738 715
f 718 740 719
f 715 739 718
f 700 701 725
f 706 707 727
f 701 706 726
f 709 721 711
f 707 711 720
f 717 719 723
f 709 717 721
f 735 737 750
f 747 749 753
f 735 750 741
f 737 747 751
f 707 720 728
f 719 741 724
f 398 652 399
f 404 654 405
f 399 653 404
f 426 656 427
f 432 658 433
f 427 657 432
f 405 655 426
f 454 725 455
f 460 727 461
f 455 726 460
f 461 728 468
f 384 385 549
f 390 391 551
f 385 390 550
f 412 413 553
f 418 419 555
f 413 418 554
f 391 412 552
f 440 441 607
f 446 447 609
f 441 446 608
f 447 464 610
f 417 438 419
f 417 421 438
f 429 450 431
f 429 433 450
f 409 434 421
f 409 431 434
f 498 559 500
f 496 500 557
f 506 569 508
f 496 557 506
f 534 582 536
f 542 590 544
f 536 584 542
f 534 548 582
f 508 571 548
f 498 556 559
f 641 702 643
f 639 643 700
f 649 651 712
f 641 649 702
f 685 687 730
f 697 699 742
f 685 730 691
f 687 697 732
f 639 700 659
f 651 691 714
f 419 440 556
f 433 659 454
f 760 761 762
f 764 765 766
f 768 769 770
f 772 773 774
f 771 777 770
f 775 779 774
f 762 763 768
f 766 767 772
f 761 764 763
f 769 772 771
f 763 766 769
f 774 778 771
f 785 786 787
f 789 790 791
f 795 796 797
f 794 796 793
f 801 802 803
f 800 802 799
f 787 788 793
f 791 792 799
f 786 789 788
f 796 801 798
f 799 801 794
f 788 791 794
f 798 807 797
f 804 809 803
f 803 808 798
f 776 777 785
f 778 779 789
f 777 778 786
f 755 760 756
f 757 768 758
f 756 762 757
f 770 776 758
f 780 785 781
f 783 795 784
f 793 795 782
f 781 787 782
f 759 776 780
f 797 806 784
f 810 811 812
f 814 815 816
f 818 819 820
f 822 823 824
f 821 827 820
f 825 829 824
f 812 813 818
f 816 817 822
f 811 814 813
f 819 822 821
f 813 816 819
f 824 828 821
f 830 831 832
f 834 835 836
f 838 839 840
f 842 843 844
f 841 847 840
f 845 849 844
f 832 833 838
f 836 837 842
f 831 834 833
f 839 842 841
f 833 836 839
f 844 848 841
f 850 851 852
f 854 855 856
f 860 861 862
f 859 861 858
f 866 867 868
f 865 867 864
f 852 853 858
f 856 857 864
f 851 854 853
f 861 866 863
f 864 866 859
f 853 856 859
f 870 871 872
f 874 875 876
f 880 881 882
f 879 881 878
f 886 887 888
f 885 887 884
f 872 873 878
f 876 877 884
f 871 874 873
f 881 886 883
f 884 886 879
f 873 876 879
f 863 891 862
f 869 893 868
f 868 892 863
f 883 895 882
f 889 897 888
f 888 896 883
f 826 827 850
f 828 829 854
f 827 828 851
f 846 847 870
f 848 849 874
f 847 848 871
f 815 830 817
f 823 838 825
f 817 832 823
f 840 846 825
f 855 870 857
f 867 880 869
f 878 880 865
f 857 872 865
f 829 846 855
f 882 894 869
f 905 906 907
f 908 910 907
f 911 912 913
f 914 916 913
f 921 922 923
f 924 926 923
f 927 928 929
f 930 932 929
f 918 922 917
f 920 928 919
f 909 910 917
f 915 916 919
f 906 911 908
f 913 915 908
f 922 927 924
f 929 931 924
f 910 915 918
f 919 927 918
f 898 905 899
f 907 909 899
f 902 921 903
f 923 925 903
f 900 909 901
f 917 921 901
f 933 934 935
f 936 938 935
f 939 940 941
f 942 944 941
f 949 950 951
f 952 954 951
f 955 956 957
f 958 960 957
f 946 950 945
f 948 956 947
f 937 938 945
f 943 944 947
f 934 939 936
f 941 943 936
f 950 955 952
f 957 959 952
f 938 943 946
f 947 955 946
f 961 962 963
f 964 966 963
f 967 968 969
f 970 972 969
f 977 978 979
f 980 982 979
f 983 984 985
f 986 988 985
f 974 978 973
f 976 984 975
f 965 966 973
f 971 972 975
f 962 967 964
f 969 971 964
f 978 983 980
f 985 987 980
f 966 971 974
f 975 983 974
f 940 961 942
f 963 965 942
f 956 977 958
f 979 981 958
f 944 965 948
f 973 977 948
f 1001 1002 1003
f 1000 1002 999
f 1007 1008 1009
f 1006 1008 1005
f 1012 1014 1011
f 1016 1018 1015
f 1004 1012 1003
f 1010 1016 1009
f 1002 1007 1004
f 1005 1007 1000
f 1015 1017 1012
f 1009 1015 1004
f 1029 1031 1028
f 1033 1035 1032
f 1037 1039 1036
f 1041 1043 1040
f 1031 1037 1030
f 1035 1041 1034
f 1024 1025 1028
f 1026 1027 1032
f 1032 1034 1029
f 1040 1042 1037
f 1025 1026 1029
f 1034 1040 1031
f 1014 1025 1013
f 1018 1027 1017
f 1017 1026 1014
f 990 991 999
f 992 993 1005
f 991 992 1000
f 995 1001 996
f 999 1001 994
f 1011 1013 997
f 1003 1011 996
f 1028 1030 1020
f 1036 1038 1022
f 1019 1024 1020
f 1030 1036 1021
f 989 990 994
f 1013 1024 998
f 1054 1055 1056
f 1053 1055 1052
f 1060 1061 1062
f 1059 1061 1058
f 1065 1067 1064
f 1069 1071 1068
f 1057 1065 1056
f 1063 1069 1062
f 1055 1060 1057
f 1058 1060 1053
f 1068 1070 1065
f 1062 1068 1057
f 1074 1075 1076
f 1073 1075 1072
f 1080 1081 1082
f 1079 1081 1078
f 1085 1087 1084
f 1089 1091 1088
f 1077 1085 1076
f 1083 1089 1082
f 1075 1080 1077
f 1078 1080 1073
f 1088 1090 1085
f 1082 1088 1077
f 1097 1099 1096
f 1101 1103 1100
f 1105 1107 1104
f 1109 1111 1108
f 1099 1105 1098
f 1103 1109 1102
f 1092 1093 1096
f 1094 1095 1100
f 1100 1102 1097
f 1108 1110 1105
f 1093 1094 1097
f 1102 1108 1099
f 1117 1119 1116
f 1121 1123 1120
f 1125 1127 1124
f 1129 1131 1128
f 1119 1125 1118
f 1123 1129 1122
f 1112 1113 1116
f 1114 1115 1120
f 1120 1122 1117
f 1128 1130 1125
f 1113 1114 1117
f 1122 1128 1119
f 1067 1093 1066
f 1071 1095 1070
f 1070 1094 1067
f 1087 1113 1086
f 1091 1115 1090
f 1090 1114 1087
f 1044 1045 1052
f 1046 1047 1058
f 1045 1046 1053
f 1048 1049 1072
f 1050 1051 1078
f 1049 1050 1073
f 1061 1074 1063
f 1072 1074 1059
f 1084 1086 1069
f 1076 1084 1063
f 1116 1118 1101
f 1124 1126 1109
f 1095 1112 1101
f 1118 1124 1103
f 1047 1048 1059
f 1086 1112 1071
f 926 991 925
f 932 993 931
f 931 992 926
f 925 990 904
f 954 1045 953
f 960 1047 959
f 959 1046 954
f 982 1049 981
f 988 1051 987
f 987 1050 982
f 981 1048 960
f 806 807 905
f 808 809 911
f 807 808 906
f 805 806 898
f 890 891 933
f 892 893 939
f 891 892 934
f 894 895 961
f 896 897 967
f 895 896 962
f 893 894 940
f 765 810 767
f 773 818 775
f 767 812 773
f 820 826 775
f 790 850 792
f 802 860 804
f 858 860 800
f 792 852 800
f 779 826 790
f 862 890 804
f 912 933 914
f 935 937 914
f 928 949 930
f 951 953 930
f 916 937 920
f 945 949 920
f 1008 1054 1010
f 1052 1054 1006
f 1064 1066 1016
f 1056 1064 1010
f 1096 1098 1033
f 1104 1106 1041
f 1027 1092 1033
f 1098 1104 1035
f 993 1044 1006
f 1066 1092 1018
f 809 890 912
f 953 1044 932
f 1132 1133 1134
f 1136 1137 1138
f 1140 1141 1142
f 1144 1145 1146
f 1143 1149 1142
f 1147 1151 1146
f 1134 1135 1140
f 1138 1139 1144
f 1133 1136 1135
f 1141 1144 1143
f 1135 1138 1141
f 1146 1150 1143
f 1152 1153 1154
f 1156 1157 1158
f 1160 1161 1162
f 1164 1165 1166
f 1163 1169 1162
f 1167 1171 1166
f 1154 1155 1160
f 1158 1159 1164
f 1153 1156 1155
f 1161 1164 1163
f 1155 1158 1161
f 1166 1170 1163
f 1172 1173 1174
f 1176 1177 1178
f 1182 1183 1184
f 1181 1183 1180
f 1188 1189 1190
f 1187 1189 1186
f 1174 1175 1180
f 1178 1179 1186
f 1173 1176 1175
f 1183 1188 1185
f 1186 1188 1181
f 1175 1178 1181
f 1192 1193 1194
f 1196 1197 1198
f 1202 1203 1204
f 1201 1203 1200
f 1208 1209 1210
f 1207 1209 1206
f 1194 1195 1200
f 1198 1199 1206
f 1193 1196 1195
f 1203 1208 1205
f 1206 1208 1201
f 1195 1198 1201
f 1185 1213 1184
f 1191 1215 1190
f 1190 1214 1185
f 1205 1217 1204
f 1211 1219 1210
f 1210 1218 1205
f 1148 1149 1172
f 1150 1151 1176
f 1149 1150 1173
f 1168 1169 1192
f 1170 1171 1196
f 1169 1170 1193
f 1137 1152 1139
f 1145 1160 1147
f 1139 1154 1145
f 1162 1168 1147
f 1177 1192 1179
f 1189 1202 1191
f 1200 1202 1187
f 1179 1194 1187
f 1151 1168 1177
f 1204 1216 1191
f 1220 1221 1222
f 1224 1225 1226
f 1228 1229 1230
f 1232 1233 1234
f 1231 1237 1230
f 1235 1239 1234
f 1222 1223 1228
f 1226 1227 1232
f 1221 1224 1223
f 1229 1232 1231
f 1223 1226 1229
f 1234 1238 1231
f 1245 1246 1247
f 1249 1250 1251
f 1255 1256 1257
f 1254 1256 1253
f 1261 1262 1263
f 1260 1262 1259
f 1247 1248 1253
f 1251 1252 1259
f 1246 1249 1248
f 1256 1261 1258
f 1259 1261 1254
f 1248 1251 1254
f 1258 1271 1257
f 1264 1273 1263
f 1263 1272 1258
f 1236 1237 1245
f 1238 1239 1249
f 1237 1238 1246
f 1225 1240 1227
f 1233 1242 1235
f 1227 1241 1233
f 1243 1244 1235
f 1250 1265 1252
f 1262 1268 1264
f 1267 1268 1260
f 1252 1266 1260
f 1239 1244 1250
f 1269 1274 1264
f 1275 1276 1277
f 1278 1280 1277
f 1281 1282 1283
f 1284 1286 1283
f 1291 1292 1293
f 1294 1296 1293
f 1297 1298 1299
f 1300 1302 1299
f 1288 1292 1287
f 1290 1298 1289
f 1279 1280 1287
f 1285 1286 1289
f 1276 1281 1278
f 1283 1285 1278
f 1292 1297 1294
f 1299 1301 1294
f 1280 1285 1288
f 1289 1297 1288
f 1303 1304 1305
f 1306 1308 1305
f 1309 1310 1311
f 1312 1314 1311
f 1319 1320 1321
f 1322 1324 1321
f 1325 1326 1327
f 1328 1330 1327
f 1316 1320 1315
f 1318 1326 1317
f 1307 1308 1315
f 1313 1314 1317
f 1304 1309 1306
f 1311 1313 1306
f 1320 1325 1322
f 1327 1329 1322
f 1308 1313 1316
f 1317 1325 1316
f 1282 1303 1284
f 1305 1307 1284
f 1298 1319 1300
f 1321 1323 1300
f 1286 1307 1290
f 1315 1319 1290
f 1331 1332 1333
f 1334 1336 1333
f 1337 1338 1339
f 1340 1342 1339
f 1347 1348 1349
f 1350 1352 1349
f 1353 1354 1355
f 1356 1358 1355
f 1344 1348 1343
f 1346 1354 1345
f 1335 1336 1343
f 1341 1342 1345
f 1332 1337 1334
f 1339 1341 1334
f 1348 1353 1350
f 1355 1357 1350
f 1336 1341 1344
f 1345 1353 1344
f 1338 1359 1340
f 1360 1361 1340
f 1354 1363 1356
f 1364 1365 1356
f 1342 1361 1346
f 1362 1363 1346
f 1376 1377 1378
f 1375 1377 1374
f 1382 1383 1384
f 1381 1383 1380
f 1387 1389 1386
f 1391 1393 1390
f 1379 1387 1378
f 1385 1391 1384
f 1377 1382 1379
f 1380 1382 1375
f 1390 1392 1387
f 1384 1390 1379
f 1396 1397 1398
f 1395 1397 1394
f 1402 1403 1404
f 1401 1403 1400
f 1407 1409 1406
f 1411 1413 1410
f 1399 1407 1398
f 1405 1411 1404
f 1397 1402 1399
f 1400 1402 1395
f 1410 1412 1407
f 1404 1410 1399
f 1419 1421 1418
f 1423 1425 1422
f 1427 1429 1426
f 1431 1433 1430
f 1421 1427 1420
f 1425 1431 1424
f 1414 1415 1418
f 1416 1417 1422
f 1422 1424 1419
f 1430 1432 1427
f 1415 1416 1419
f 1424 1430 1421
f 1439 1441 1438
f 1443 1445 1442
f 1447 1449 1446
f 1451 1453 1450
f 1441 1447 1440
f 1445 1451 1444
f 1434 1435 1438
f 1436 1437 1442
f 1442 1444 1439
f 1450 1452 1447
f 1435 1436 1439
f 1444 1450 1441
f 1389 1415 1388
f 1393 1417 1392
f 1392 1416 1389
f 1409 1435 1408
f 1413 1437 1412
f 1412 1436 1409
f 1366 1367 1374
f 1368 1369 1380
f 1367 1368 1375
f 1370 1371 1394
f 1372 1373 1400
f 1371 1372 1395
f 1383 1396 1385
f 1394 1396 1381
f 1406 1408 1391
f 1398 1406 1385
f 1438 1440 1423
f 1446 1448 1431
f 1417 1434 1423
f 1440 1446 1425
f 1369 1370 1381
f 1408 1434 1393
f 1461 1462 1463
f 1460 1462 1459
f 1467 1468 1469
f 1466 1468 1465
f 1472 1474 1471
f 1476 1478 1475
f 1464 1472 1463
f 1470 1476 1469
f 1462 1467 1464
f 1465 1467 1460
f 1475 1477 1472
f 1469 1475 1464
f 1489 1491 1488
f 1493 1495 1492
f 1497 1499 1496
f 1501 1503 1500
f 1491 1497 1490
f 1495 1501 1494
f 1484 1485 1488
f 1486 1487 1492
f 1492 1494 1489
f 1500 1502 1497
f 1485 1486 1489
f 1494 1500 1491
f 1474 1485 1473
f 1478 1487 1477
f 1477 1486 1474
f 1454 1455 1459
f 1456 1457 1465
f 1455 1456 1460
f 1468 1480 1470
f 1479 1480 1466
f 1482 1483 1476
f 1481 1482 1470
f 1505 1506 1493
f 1507 1508 1501
f 1487 1504 1493
f 1506 1507 1495
f 1457 1458 1466
f 1483 1504 1478
f 1296 1367 1295
f 1302 1369 1301
f 1301 1368 1296
f 1324 1371 1323
f 1330 1373 1329
f 1329 1372 1324
f 1323 1370 1302
f 1352 1455 1351
f 1358 1457 1357
f 1357 1456 1352
f 1365 1458 1358
f 1212 1213 1275
f 1214 1215 1281
f 1213 1214 1276
f 1216 1217 1303
f 1218 1219 1309
f 1217 1218 1304
f 1215 1216 1282
f 1270 1271 1331
f 1272 1273 1337
f 1271 1272 1332
f 1273 1274 1338
f 1157 1220 1159
f 1165 1228 1167
f 1159 1222 1165
f 1230 1236 1167
f 1197 1245 1199
f 1209 1255 1211
f 1253 1255 1207
f 1199 1247 1207
f 1171 1236 1197
f 1257 1270 1211
f 1310 1331 1312
f 1333 1335 1312
f 1326 1347 1328
f 1349 1351 1328
f 1314 1335 1318
f 1343 1347 1318
f 1403 1461 1405
f 1459 1461 1401
f 1471 1473 1411
f 1463 1471 1405
f 1488 1490 1443
f 1496 1498 1451
f 1437 1484 1443
f 1490 1496 1445
f 1373 1454 1401
f 1473 1484 1413
f 1219 1270 1310
f 1351 1454 1330
f 132 133 760
f 136 137 764
f 133 136 761
f 120 132 755
f 197 198 810
f 201 202 814
f 198 201 811
f 217 218 830
f 221 222 834
f 218 221 831
f 202 217 815
f 137 197 765
f 519 520 1132
f 523 524 1136
f 520 523 1133
f 539 540 1152
f 543 544 1156
f 540 543 1153
f 524 539 1137
f 592 593 1220
f 596 597 1224
f 593 596 1221
f 597 605 1225
f 544 592 1157
f 75 382 77
f 75 79 382
f 87 394 89
f 87 91 394
f 67 378 79
f 67 89 378
f 176 471 178
f 174 178 469
f 184 481 186
f 174 469 184
f 212 509 214
f 220 517 222
f 214 511 220
f 212 226 509
f 186 483 226
f 176 234 471
f 319 614 321
f 317 321 612
f 327 329 624
f 319 327 614
f 363 365 660
f 375 377 672
f 363 660 369
f 365 375 662
f 317 612 337
f 329 369 626
f 77 384 234
f 91 337 398
f 835 1132 837
f 843 1140 845
f 837 1134 843
f 1142 1148 845
f 875 1172 877
f 887 1182 889
f 1180 1182 885
f 877 1174 885
f 849 1148 875
f 1184 1212 889
f 968 1275 970
f 1277 1279 970
f 984 1291 986
f 1293 1295 986
f 972 1279 976
f 1287 1291 976
f 1081 1376 1083
f 1374 1376 1079
f 1386 1388 1089
f 1378 1386 1083
f 1418 1420 1121
f 1426 1428 1129
f 1115 1414 1121
f 1420 1426 1123
f 1051 1366 1079
f 1388 1414 1091
f 897 1212 968
f 1295 1366 988
f 222 519 835
