{
    "use_gpu": true,
    "computation_space": 1, // 0 (full), 1 (linear), 2 (reduced), 3 (turbulent reduced)
    "compute_lyapunov":true,
    "duration": 5,
    "dt_substeps": 1,
    "render": true,
    "write_meshes": false,
    "Animation":
    {
        "name": "waterbottle_cymbal_drop",
        "add_to_sim": true,
        "force_scale": 1
    },
    "ReducedThinShells":
    [
        {
            "ThinShell":
            {
                "filename": "water_bottle.obj",
                "bending_type": 0
            },
            "material": "Polycarbonate",
            "modes_to_compute": 300,
            "lowfreq_modes": 30,
            "highfreq_modes": 150,
            "prunning_threshold": 1e-3,
            "Impacts": // ok only if no Animation defined
            [
                {
                    "time": 0,
                    "radius": 0.0001,
                    "magnitude": -1e3,
                    "spread": 0.001,
                    "center_idx": 10
                    //"center_vec": [0,0,0],
                    "repeat": 10,
                    "repeat_dt": 0.01,
                    "repeat_df": 2,
                },
                {
                    "time": 1,
                    "radius": 0.0001,
                    "magnitude": -1e3,
                    "spread": 0.001,
                    "center_idx": 10
                    //"center_vec": [0,0,0]
                }
            ]
        },
        {
            "ThinShell":
            {
                "filename": "cymbal.obj",
                "use_isometric_bending": true
            },
            "material": "Bronze",
            "modes_to_compute": 300,
            "lowfreq_modes": 30,
            "highfreq_modes": 90
        }
    ],
    "ThinShells":
    [
        {
            "filename": "water_bottle.obj",
            "bending_type": 2 // isometric
        },
        {
            "filename": "", // default
            "bending_type": 1 // nl hinge
        }
    ]
}
