{
    "definitions": {
        "SiteEditorIntegrationProps": {
            "title": "Site Editor Integration",
            "description": "Integration Example",
            "type": "object",
            "properties": {
                "text": {
                    "title": "Text",
                    "description": "You can put your text here!",
                    "type": "string",
                    "default": "Hello World!!!!!"
                },
                "isH1": {
                    "title": "Is h1?",
                    "description": "You can decide whether it is a H1 or not",
                    "type": "boolean",
                    "default": false
                },
                "items": {
                    "minItems": 0,
                    "type": "array",
                    "title": "Items",
                    "items": {
                        "$ref": "app:agenciam3.pepegangacustom#/definitions/SiteEditorIntegrationItems"
                    }
                }
            }
        },
        "SiteEditorIntegrationItems": {
            "title": "Items de integracion",
            "properties": {
                "text": {
                    "title": "Text",
                    "type": "string",
                    "default": null
                },
                "image": {
                    "title": "Image",
                    "$ref": "app:vtex.native-types#/definitions/url",
                    "widget": {
                        "ui:widget": "image-uploader"
                    }
                }
            }
        }
    }
}