2008.06.01 14:28 B C:\Documents and Settings\osmirovichd\es-AR\Ordinals\031.vox <-- 172.29.247.141 /temp/TASA76/UNNVentas/Languages/es-AR/Ordinals 031.vox
2008.06.01 14:28 B C:\Documents and Settings\osmirovichd\es-AR\Ordinals\030.vox <-- 172.29.247.141 /temp/TASA76/UNNVentas/Languages/es-AR/Ordinals 030.vox
2008.06.01 14:28 B C:\Documents and Settings\osmirovichd\es-AR\Ordinals\029.vox <-- 172.29.247.141 /temp/TASA76/UNNVentas/Languages/es-AR/Ordinals 029.vox
2008.06.01 14:28 B C:\Documents and Settings\osmirovichd\es-AR\Ordinals\028.vox <-- 172.29.247.141 /temp/TASA76/UNNVentas/Languages/es-AR/Ordinals 028.vox
2008.06.01 14:28 B C:\Documents and Settings\osmirovichd\es-AR\Ordinals\027.vox <-- 172.29.247.141 /temp/TASA76/UNNVentas/Languages/es-AR/Ordinals 027.vox
2008.06.01 14:28 B C:\Documents and Settings\osmirovichd\es-AR\Ordinals\026.vox <-- 172.29.247.141 /temp/TASA76/UNNVentas/Languages/es-AR/Ordinals 026.vox
2008.06.01 14:28 B C:\Documents and Settings\osmirovichd\es-AR\Ordinals\025.vox <-- 172.29.247.141 /temp/TASA76/UNNVentas/Languages/es-AR/Ordinals 025.vox
2008.06.01 14:28 B C:\Documents and Settings\osmirovichd\es-AR\Ordinals\024.vox <-- 172.29.247.141 /temp/TASA76/UNNVentas/Languages/es-AR/Ordinals 024.vox
2008.06.01 14:28 B C:\Documents and Settings\osmirovichd\es-AR\Ordinals\023.vox <-- 172.29.247.141 /temp/TASA76/UNNVentas/Languages/es-AR/Ordinals 023.vox
2008.06.01 14:28 B C:\Documents and Settings\osmirovichd\es-AR\Ordinals\022.vox <-- 172.29.247.141 /temp/TASA76/UNNVentas/Languages/es-AR/Ordinals 022.vox
2008.06.01 14:28 B C:\Documents and Settings\osmirovichd\es-AR\Ordinals\021.vox <-- 172.29.247.141 /temp/TASA76/UNNVentas/Languages/es-AR/Ordinals 021.vox
2008.06.01 14:28 B C:\Documents and Settings\osmirovichd\es-AR\Ordinals\020.vox <-- 172.29.247.141 /temp/TASA76/UNNVentas/Languages/es-AR/Ordinals 020.vox
2008.06.01 14:28 B C:\Documents and Settings\osmirovichd\es-AR\Ordinals\019.vox <-- 172.29.247.141 /temp/TASA76/UNNVentas/Languages/es-AR/Ordinals 019.vox
2008.06.01 14:28 B C:\Documents and Settings\osmirovichd\es-AR\Ordinals\018.vox <-- 172.29.247.141 /temp/TASA76/UNNVentas/Languages/es-AR/Ordinals 018.vox
2008.06.01 14:28 B C:\Documents and Settings\osmirovichd\es-AR\Ordinals\017.vox <-- 172.29.247.141 /temp/TASA76/UNNVentas/Languages/es-AR/Ordinals 017.vox
2008.06.01 14:28 B C:\Documents and Settings\osmirovichd\es-AR\Ordinals\016.vox <-- 172.29.247.141 /temp/TASA76/UNNVentas/Languages/es-AR/Ordinals 016.vox
2008.06.01 14:28 B C:\Documents and Settings\osmirovichd\es-AR\Ordinals\015.vox <-- 172.29.247.141 /temp/TASA76/UNNVentas/Languages/es-AR/Ordinals 015.vox
2008.06.01 14:28 B C:\Documents and Settings\osmirovichd\es-AR\Ordinals\014.vox <-- 172.29.247.141 /temp/TASA76/UNNVentas/Languages/es-AR/Ordinals 014.vox
2008.06.01 14:28 B C:\Documents and Settings\osmirovichd\es-AR\Ordinals\013.vox <-- 172.29.247.141 /temp/TASA76/UNNVentas/Languages/es-AR/Ordinals 013.vox
2008.06.01 14:28 B C:\Documents and Settings\osmirovichd\es-AR\Ordinals\012.vox <-- 172.29.247.141 /temp/TASA76/UNNVentas/Languages/es-AR/Ordinals 012.vox
2008.06.01 14:28 B C:\Documents and Settings\osmirovichd\es-AR\Ordinals\011.vox <-- 172.29.247.141 /temp/TASA76/UNNVentas/Languages/es-AR/Ordinals 011.vox
2008.06.01 14:28 B C:\Documents and Settings\osmirovichd\es-AR\Ordinals\010.vox <-- 172.29.247.141 /temp/TASA76/UNNVentas/Languages/es-AR/Ordinals 010.vox
2008.06.01 14:28 B C:\Documents and Settings\osmirovichd\es-AR\Ordinals\009.vox <-- 172.29.247.141 /temp/TASA76/UNNVentas/Languages/es-AR/Ordinals 009.vox
2008.06.01 14:28 B C:\Documents and Settings\osmirovichd\es-AR\Ordinals\008.vox <-- 172.29.247.141 /temp/TASA76/UNNVentas/Languages/es-AR/Ordinals 008.vox
2008.06.01 14:28 B C:\Documents and Settings\osmirovichd\es-AR\Ordinals\007.vox <-- 172.29.247.141 /temp/TASA76/UNNVentas/Languages/es-AR/Ordinals 007.vox
2008.06.01 14:28 B C:\Documents and Settings\osmirovichd\es-AR\Ordinals\006.vox <-- 172.29.247.141 /temp/TASA76/UNNVentas/Languages/es-AR/Ordinals 006.vox
2008.06.01 14:29 B C:\Documents and Settings\osmirovichd\es-AR\Ordinals\005.vox <-- 172.29.247.141 /temp/TASA76/UNNVentas/Languages/es-AR/Ordinals 005.vox
2008.06.01 14:29 B C:\Documents and Settings\osmirovichd\es-AR\Ordinals\004.vox <-- 172.29.247.141 /temp/TASA76/UNNVentas/Languages/es-AR/Ordinals 004.vox
2008.06.01 14:29 B C:\Documents and Settings\osmirovichd\es-AR\Ordinals\003.vox <-- 172.29.247.141 /temp/TASA76/UNNVentas/Languages/es-AR/Ordinals 003.vox
2008.06.01 14:29 B C:\Documents and Settings\osmirovichd\es-AR\Ordinals\002.vox <-- 172.29.247.141 /temp/TASA76/UNNVentas/Languages/es-AR/Ordinals 002.vox
2008.06.01 14:29 B C:\Documents and Settings\osmirovichd\es-AR\Ordinals\001.vox <-- 172.29.247.141 /temp/TASA76/UNNVentas/Languages/es-AR/Ordinals 001.vox
2008.06.01 15:35 B C:\Documents and Settings\osmirovichd\Escritorio\es-AR\Ordinals\001.vox --> 172.29.247.141 /temp/TASA76/UNNVentas/Languages/es-AR/Ordinals 001.vox
2008.06.01 15:35 B C:\Documents and Settings\osmirovichd\Escritorio\es-AR\Ordinals\002.vox --> 172.29.247.141 /temp/TASA76/UNNVentas/Languages/es-AR/Ordinals 002.vox
2008.06.01 15:35 B C:\Documents and Settings\osmirovichd\Escritorio\es-AR\Ordinals\003.vox --> 172.29.247.141 /temp/TASA76/UNNVentas/Languages/es-AR/Ordinals 003.vox
2008.06.01 15:35 B C:\Documents and Settings\osmirovichd\Escritorio\es-AR\Ordinals\004.vox --> 172.29.247.141 /temp/TASA76/UNNVentas/Languages/es-AR/Ordinals 004.vox
2008.06.01 15:35 B C:\Documents and Settings\osmirovichd\Escritorio\es-AR\Ordinals\005.vox --> 172.29.247.141 /temp/TASA76/UNNVentas/Languages/es-AR/Ordinals 005.vox
2008.06.01 15:35 B C:\Documents and Settings\osmirovichd\Escritorio\es-AR\Ordinals\006.vox --> 172.29.247.141 /temp/TASA76/UNNVentas/Languages/es-AR/Ordinals 006.vox
2008.06.01 15:35 B C:\Documents and Settings\osmirovichd\Escritorio\es-AR\Ordinals\007.vox --> 172.29.247.141 /temp/TASA76/UNNVentas/Languages/es-AR/Ordinals 007.vox
2008.06.01 15:35 B C:\Documents and Settings\osmirovichd\Escritorio\es-AR\Ordinals\008.vox --> 172.29.247.141 /temp/TASA76/UNNVentas/Languages/es-AR/Ordinals 008.vox
2008.06.01 15:35 B C:\Documents and Settings\osmirovichd\Escritorio\es-AR\Ordinals\009.vox --> 172.29.247.141 /temp/TASA76/UNNVentas/Languages/es-AR/Ordinals 009.vox
2008.06.01 15:35 B C:\Documents and Settings\osmirovichd\Escritorio\es-AR\Ordinals\010.vox --> 172.29.247.141 /temp/TASA76/UNNVentas/Languages/es-AR/Ordinals 010.vox
2008.06.01 15:35 B C:\Documents and Settings\osmirovichd\Escritorio\es-AR\Ordinals\011.vox --> 172.29.247.141 /temp/TASA76/UNNVentas/Languages/es-AR/Ordinals 011.vox
2008.06.01 15:35 B C:\Documents and Settings\osmirovichd\Escritorio\es-AR\Ordinals\012.vox --> 172.29.247.141 /temp/TASA76/UNNVentas/Languages/es-AR/Ordinals 012.vox
2008.06.01 15:35 B C:\Documents and Settings\osmirovichd\Escritorio\es-AR\Ordinals\013.vox --> 172.29.247.141 /temp/TASA76/UNNVentas/Languages/es-AR/Ordinals 013.vox
2008.06.01 15:35 B C:\Documents and Settings\osmirovichd\Escritorio\es-AR\Ordinals\014.vox --> 172.29.247.141 /temp/TASA76/UNNVentas/Languages/es-AR/Ordinals 014.vox
2008.06.01 15:35 B C:\Documents and Settings\osmirovichd\Escritorio\es-AR\Ordinals\015.vox --> 172.29.247.141 /temp/TASA76/UNNVentas/Languages/es-AR/Ordinals 015.vox
2008.06.01 15:35 B C:\Documents and Settings\osmirovichd\Escritorio\es-AR\Ordinals\016.vox --> 172.29.247.141 /temp/TASA76/UNNVentas/Languages/es-AR/Ordinals 016.vox
2008.06.01 15:35 B C:\Documents and Settings\osmirovichd\Escritorio\es-AR\Ordinals\017.vox --> 172.29.247.141 /temp/TASA76/UNNVentas/Languages/es-AR/Ordinals 017.vox
2008.06.01 15:35 B C:\Documents and Settings\osmirovichd\Escritorio\es-AR\Ordinals\018.vox --> 172.29.247.141 /temp/TASA76/UNNVentas/Languages/es-AR/Ordinals 018.vox
2008.06.01 15:35 B C:\Documents and Settings\osmirovichd\Escritorio\es-AR\Ordinals\019.vox --> 172.29.247.141 /temp/TASA76/UNNVentas/Languages/es-AR/Ordinals 019.vox
2008.06.01 15:35 B C:\Documents and Settings\osmirovichd\Escritorio\es-AR\Ordinals\020.vox --> 172.29.247.141 /temp/TASA76/UNNVentas/Languages/es-AR/Ordinals 020.vox
2008.06.01 15:35 B C:\Documents and Settings\osmirovichd\Escritorio\es-AR\Ordinals\021.vox --> 172.29.247.141 /temp/TASA76/UNNVentas/Languages/es-AR/Ordinals 021.vox
2008.06.01 15:35 B C:\Documents and Settings\osmirovichd\Escritorio\es-AR\Ordinals\022.vox --> 172.29.247.141 /temp/TASA76/UNNVentas/Languages/es-AR/Ordinals 022.vox
2008.06.01 15:35 B C:\Documents and Settings\osmirovichd\Escritorio\es-AR\Ordinals\023.vox --> 172.29.247.141 /temp/TASA76/UNNVentas/Languages/es-AR/Ordinals 023.vox
2008.06.01 15:35 B C:\Documents and Settings\osmirovichd\Escritorio\es-AR\Ordinals\024.vox --> 172.29.247.141 /temp/TASA76/UNNVentas/Languages/es-AR/Ordinals 024.vox
2008.06.01 15:35 B C:\Documents and Settings\osmirovichd\Escritorio\es-AR\Ordinals\025.vox --> 172.29.247.141 /temp/TASA76/UNNVentas/Languages/es-AR/Ordinals 025.vox
2008.06.01 15:35 B C:\Documents and Settings\osmirovichd\Escritorio\es-AR\Ordinals\026.vox --> 172.29.247.141 /temp/TASA76/UNNVentas/Languages/es-AR/Ordinals 026.vox
2008.06.01 15:35 B C:\Documents and Settings\osmirovichd\Escritorio\es-AR\Ordinals\027.vox --> 172.29.247.141 /temp/TASA76/UNNVentas/Languages/es-AR/Ordinals 027.vox
2008.06.01 15:35 B C:\Documents and Settings\osmirovichd\Escritorio\es-AR\Ordinals\028.vox --> 172.29.247.141 /temp/TASA76/UNNVentas/Languages/es-AR/Ordinals 028.vox
2008.06.01 15:35 B C:\Documents and Settings\osmirovichd\Escritorio\es-AR\Ordinals\029.vox --> 172.29.247.141 /temp/TASA76/UNNVentas/Languages/es-AR/Ordinals 029.vox
2008.06.01 15:35 B C:\Documents and Settings\osmirovichd\Escritorio\es-AR\Ordinals\030.vox --> 172.29.247.141 /temp/TASA76/UNNVentas/Languages/es-AR/Ordinals 030.vox
2008.06.01 15:35 B C:\Documents and Settings\osmirovichd\Escritorio\es-AR\Ordinals\031.vox --> 172.29.247.141 /temp/TASA76/UNNVentas/Languages/es-AR/Ordinals 031.vox
