 Volume in drive C has no label.
 Volume Serial Number is 0892-68DF

 Directory of C:\workspace\AudiosCastellanoFija\Resources\Prompts\es-AR\days

30-May-16  14:31    <DIR>          .
30-May-16  14:31    <DIR>          ..
24-Sep-07  18:37             6,400 0.vox
24-Sep-07  18:37             5,376 1.vox
24-Sep-07  18:37             6,656 2.vox
24-Sep-07  18:37             7,510 3.vox
24-Sep-07  18:37             5,972 4.vox
24-Sep-07  18:37             6,996 5.vox
24-Sep-07  18:37             5,204 6.vox
30-May-16  14:31                 0 days.txt
               8 File(s)         44,114 bytes
               2 Dir(s)  27,952,066,560 bytes free
