2008.06.01 14:29 B C:\Documents and Settings\osmirovichd\es-AR\dtmf\star.vox <-- 172.29.247.141 /temp/TASA76/UNNVentas/Languages/es-AR/dtmf star.vox
2008.06.01 14:29 B C:\Documents and Settings\osmirovichd\es-AR\dtmf\pound.vox <-- 172.29.247.141 /temp/TASA76/UNNVentas/Languages/es-AR/dtmf pound.vox
2008.06.01 14:29 B C:\Documents and Settings\osmirovichd\es-AR\dtmf\d.vox <-- 172.29.247.141 /temp/TASA76/UNNVentas/Languages/es-AR/dtmf d.vox
2008.06.01 14:29 B C:\Documents and Settings\osmirovichd\es-AR\dtmf\c.vox <-- 172.29.247.141 /temp/TASA76/UNNVentas/Languages/es-AR/dtmf c.vox
2008.06.01 14:29 B C:\Documents and Settings\osmirovichd\es-AR\dtmf\b.vox <-- 172.29.247.141 /temp/TASA76/UNNVentas/Languages/es-AR/dtmf b.vox
2008.06.01 14:29 B C:\Documents and Settings\osmirovichd\es-AR\dtmf\a.vox <-- 172.29.247.141 /temp/TASA76/UNNVentas/Languages/es-AR/dtmf a.vox
2008.06.01 14:29 B C:\Documents and Settings\osmirovichd\es-AR\dtmf\9.vox <-- 172.29.247.141 /temp/TASA76/UNNVentas/Languages/es-AR/dtmf 9.vox
2008.06.01 14:29 B C:\Documents and Settings\osmirovichd\es-AR\dtmf\8.vox <-- 172.29.247.141 /temp/TASA76/UNNVentas/Languages/es-AR/dtmf 8.vox
2008.06.01 14:29 B C:\Documents and Settings\osmirovichd\es-AR\dtmf\7.vox <-- 172.29.247.141 /temp/TASA76/UNNVentas/Languages/es-AR/dtmf 7.vox
2008.06.01 14:29 B C:\Documents and Settings\osmirovichd\es-AR\dtmf\6.vox <-- 172.29.247.141 /temp/TASA76/UNNVentas/Languages/es-AR/dtmf 6.vox
2008.06.01 14:29 B C:\Documents and Settings\osmirovichd\es-AR\dtmf\5.vox <-- 172.29.247.141 /temp/TASA76/UNNVentas/Languages/es-AR/dtmf 5.vox
2008.06.01 14:29 B C:\Documents and Settings\osmirovichd\es-AR\dtmf\4.vox <-- 172.29.247.141 /temp/TASA76/UNNVentas/Languages/es-AR/dtmf 4.vox
2008.06.01 14:29 B C:\Documents and Settings\osmirovichd\es-AR\dtmf\3.vox <-- 172.29.247.141 /temp/TASA76/UNNVentas/Languages/es-AR/dtmf 3.vox
2008.06.01 14:29 B C:\Documents and Settings\osmirovichd\es-AR\dtmf\2.vox <-- 172.29.247.141 /temp/TASA76/UNNVentas/Languages/es-AR/dtmf 2.vox
2008.06.01 14:29 B C:\Documents and Settings\osmirovichd\es-AR\dtmf\1.vox <-- 172.29.247.141 /temp/TASA76/UNNVentas/Languages/es-AR/dtmf 1.vox
2008.06.01 14:29 B C:\Documents and Settings\osmirovichd\es-AR\dtmf\0.vox <-- 172.29.247.141 /temp/TASA76/UNNVentas/Languages/es-AR/dtmf 0.vox
2008.06.01 15:33 B C:\Documents and Settings\osmirovichd\Escritorio\es-AR\dtmf\0.vox --> 172.29.247.141 /temp/TASA76/UNNVentas/Languages/es-AR/dtmf 0.vox
2008.06.01 15:33 B C:\Documents and Settings\osmirovichd\Escritorio\es-AR\dtmf\1.vox --> 172.29.247.141 /temp/TASA76/UNNVentas/Languages/es-AR/dtmf 1.vox
2008.06.01 15:33 B C:\Documents and Settings\osmirovichd\Escritorio\es-AR\dtmf\2.vox --> 172.29.247.141 /temp/TASA76/UNNVentas/Languages/es-AR/dtmf 2.vox
2008.06.01 15:33 B C:\Documents and Settings\osmirovichd\Escritorio\es-AR\dtmf\3.vox --> 172.29.247.141 /temp/TASA76/UNNVentas/Languages/es-AR/dtmf 3.vox
2008.06.01 15:33 B C:\Documents and Settings\osmirovichd\Escritorio\es-AR\dtmf\4.vox --> 172.29.247.141 /temp/TASA76/UNNVentas/Languages/es-AR/dtmf 4.vox
2008.06.01 15:33 B C:\Documents and Settings\osmirovichd\Escritorio\es-AR\dtmf\5.vox --> 172.29.247.141 /temp/TASA76/UNNVentas/Languages/es-AR/dtmf 5.vox
2008.06.01 15:33 B C:\Documents and Settings\osmirovichd\Escritorio\es-AR\dtmf\6.vox --> 172.29.247.141 /temp/TASA76/UNNVentas/Languages/es-AR/dtmf 6.vox
2008.06.01 15:33 B C:\Documents and Settings\osmirovichd\Escritorio\es-AR\dtmf\7.vox --> 172.29.247.141 /temp/TASA76/UNNVentas/Languages/es-AR/dtmf 7.vox
2008.06.01 15:33 B C:\Documents and Settings\osmirovichd\Escritorio\es-AR\dtmf\8.vox --> 172.29.247.141 /temp/TASA76/UNNVentas/Languages/es-AR/dtmf 8.vox
2008.06.01 15:33 B C:\Documents and Settings\osmirovichd\Escritorio\es-AR\dtmf\9.vox --> 172.29.247.141 /temp/TASA76/UNNVentas/Languages/es-AR/dtmf 9.vox
2008.06.01 15:34 B C:\Documents and Settings\osmirovichd\Escritorio\es-AR\dtmf\a.vox --> 172.29.247.141 /temp/TASA76/UNNVentas/Languages/es-AR/dtmf a.vox
2008.06.01 15:34 B C:\Documents and Settings\osmirovichd\Escritorio\es-AR\dtmf\b.vox --> 172.29.247.141 /temp/TASA76/UNNVentas/Languages/es-AR/dtmf b.vox
2008.06.01 15:34 B C:\Documents and Settings\osmirovichd\Escritorio\es-AR\dtmf\c.vox --> 172.29.247.141 /temp/TASA76/UNNVentas/Languages/es-AR/dtmf c.vox
2008.06.01 15:34 B C:\Documents and Settings\osmirovichd\Escritorio\es-AR\dtmf\d.vox --> 172.29.247.141 /temp/TASA76/UNNVentas/Languages/es-AR/dtmf d.vox
2008.06.01 15:34 B C:\Documents and Settings\osmirovichd\Escritorio\es-AR\dtmf\pound.vox --> 172.29.247.141 /temp/TASA76/UNNVentas/Languages/es-AR/dtmf pound.vox
2008.06.01 15:34 B C:\Documents and Settings\osmirovichd\Escritorio\es-AR\dtmf\star.vox --> 172.29.247.141 /temp/TASA76/UNNVentas/Languages/es-AR/dtmf star.vox
