2008.06.01 14:29 B C:\Documents and Settings\osmirovichd\es-AR\Months\Septiembre.vox <-- 172.29.247.141 /temp/TASA76/UNNVentas/Languages/es-AR/Months Septiembre.vox
2008.06.01 14:29 B C:\Documents and Settings\osmirovichd\es-AR\Months\Octubre.vox <-- 172.29.247.141 /temp/TASA76/UNNVentas/Languages/es-AR/Months Octubre.vox
2008.06.01 14:29 B C:\Documents and Settings\osmirovichd\es-AR\Months\Noviembre.vox <-- 172.29.247.141 /temp/TASA76/UNNVentas/Languages/es-AR/Months Noviembre.vox
2008.06.01 14:29 B C:\Documents and Settings\osmirovichd\es-AR\Months\Mayo.vox <-- 172.29.247.141 /temp/TASA76/UNNVentas/Languages/es-AR/Months Mayo.vox
2008.06.01 14:29 B C:\Documents and Settings\osmirovichd\es-AR\Months\Marzo.vox <-- 172.29.247.141 /temp/TASA76/UNNVentas/Languages/es-AR/Months Marzo.vox
2008.06.01 14:29 B C:\Documents and Settings\osmirovichd\es-AR\Months\Junio.vox <-- 172.29.247.141 /temp/TASA76/UNNVentas/Languages/es-AR/Months Junio.vox
2008.06.01 14:29 B C:\Documents and Settings\osmirovichd\es-AR\Months\Julio.vox <-- 172.29.247.141 /temp/TASA76/UNNVentas/Languages/es-AR/Months Julio.vox
2008.06.01 14:29 B C:\Documents and Settings\osmirovichd\es-AR\Months\Febrero.vox <-- 172.29.247.141 /temp/TASA76/UNNVentas/Languages/es-AR/Months Febrero.vox
2008.06.01 14:29 B C:\Documents and Settings\osmirovichd\es-AR\Months\Enero.vox <-- 172.29.247.141 /temp/TASA76/UNNVentas/Languages/es-AR/Months Enero.vox
2008.06.01 14:29 B C:\Documents and Settings\osmirovichd\es-AR\Months\Diciembre.vox <-- 172.29.247.141 /temp/TASA76/UNNVentas/Languages/es-AR/Months Diciembre.vox
2008.06.01 14:29 B C:\Documents and Settings\osmirovichd\es-AR\Months\and.vox <-- 172.29.247.141 /temp/TASA76/UNNVentas/Languages/es-AR/Months and.vox
2008.06.01 14:29 B C:\Documents and Settings\osmirovichd\es-AR\Months\Agosto.vox <-- 172.29.247.141 /temp/TASA76/UNNVentas/Languages/es-AR/Months Agosto.vox
2008.06.01 14:29 B C:\Documents and Settings\osmirovichd\es-AR\Months\Abril.vox <-- 172.29.247.141 /temp/TASA76/UNNVentas/Languages/es-AR/Months Abril.vox
2008.06.01 15:35 B C:\Documents and Settings\osmirovichd\Escritorio\es-AR\Months\Abril.vox --> 172.29.247.141 /temp/TASA76/UNNVentas/Languages/es-AR/Months Abril.vox
2008.06.01 15:35 B C:\Documents and Settings\osmirovichd\Escritorio\es-AR\Months\Agosto.vox --> 172.29.247.141 /temp/TASA76/UNNVentas/Languages/es-AR/Months Agosto.vox
2008.06.01 15:35 B C:\Documents and Settings\osmirovichd\Escritorio\es-AR\Months\and.vox --> 172.29.247.141 /temp/TASA76/UNNVentas/Languages/es-AR/Months and.vox
2008.06.01 15:35 B C:\Documents and Settings\osmirovichd\Escritorio\es-AR\Months\Diciembre.vox --> 172.29.247.141 /temp/TASA76/UNNVentas/Languages/es-AR/Months Diciembre.vox
2008.06.01 15:35 B C:\Documents and Settings\osmirovichd\Escritorio\es-AR\Months\Enero.vox --> 172.29.247.141 /temp/TASA76/UNNVentas/Languages/es-AR/Months Enero.vox
2008.06.01 15:35 B C:\Documents and Settings\osmirovichd\Escritorio\es-AR\Months\Febrero.vox --> 172.29.247.141 /temp/TASA76/UNNVentas/Languages/es-AR/Months Febrero.vox
2008.06.01 15:35 B C:\Documents and Settings\osmirovichd\Escritorio\es-AR\Months\Julio.vox --> 172.29.247.141 /temp/TASA76/UNNVentas/Languages/es-AR/Months Julio.vox
2008.06.01 15:35 B C:\Documents and Settings\osmirovichd\Escritorio\es-AR\Months\Junio.vox --> 172.29.247.141 /temp/TASA76/UNNVentas/Languages/es-AR/Months Junio.vox
2008.06.01 15:35 B C:\Documents and Settings\osmirovichd\Escritorio\es-AR\Months\Marzo.vox --> 172.29.247.141 /temp/TASA76/UNNVentas/Languages/es-AR/Months Marzo.vox
2008.06.01 15:35 B C:\Documents and Settings\osmirovichd\Escritorio\es-AR\Months\Mayo.vox --> 172.29.247.141 /temp/TASA76/UNNVentas/Languages/es-AR/Months Mayo.vox
2008.06.01 15:35 B C:\Documents and Settings\osmirovichd\Escritorio\es-AR\Months\Noviembre.vox --> 172.29.247.141 /temp/TASA76/UNNVentas/Languages/es-AR/Months Noviembre.vox
2008.06.01 15:35 B C:\Documents and Settings\osmirovichd\Escritorio\es-AR\Months\Octubre.vox --> 172.29.247.141 /temp/TASA76/UNNVentas/Languages/es-AR/Months Octubre.vox
2008.06.01 15:35 B C:\Documents and Settings\osmirovichd\Escritorio\es-AR\Months\Septiembre.vox --> 172.29.247.141 /temp/TASA76/UNNVentas/Languages/es-AR/Months Septiembre.vox
