 Volume in drive C has no label.
 Volume Serial Number is 0892-68DF

 Directory of C:\workspace\AudiosCastellanoFija\Resources\Prompts\es-AR\ordinals

30-May-16  14:35    <DIR>          .
30-May-16  14:35    <DIR>          ..
25-Jul-08  15:58             6,886 001.vox
25-Jul-08  15:59             6,462 002.vox
25-Jul-08  15:59             6,488 003.vox
25-Jul-08  16:00             6,517 004.vox
25-Jul-08  16:00             6,778 005.vox
25-Jul-08  16:00             7,134 006.vox
25-Jul-08  16:01             6,363 007.vox
25-Jul-08  16:01             5,310 008.vox
25-Jul-08  16:01             5,646 009.vox
25-Jul-08  16:02             6,336 010.vox
25-Jul-08  16:02             6,017 011.vox
25-Jul-08  16:03             5,635 012.vox
25-Jul-08  16:03             6,422 013.vox
25-Jul-08  16:03             7,686 014.vox
25-Jul-08  16:04             7,395 015.vox
25-Jul-08  16:04             9,641 016.vox
25-Jul-08  16:04             9,033 017.vox
25-Jul-08  16:05             8,656 018.vox
25-Jul-08  16:05             9,283 019.vox
25-Jul-08  16:05             7,043 020.vox
25-Jul-08  16:15             9,274 021.vox
25-Jul-08  16:16             9,825 022.vox
25-Jul-08  16:16            10,229 023.vox
25-Jul-08  16:17             9,517 024.vox
25-Jul-08  16:17            12,301 025.vox
25-Jul-08  16:18            10,677 026.vox
25-Jul-08  16:18             9,558 027.vox
25-Jul-08  16:18             9,127 028.vox
25-Jul-08  16:19             8,988 029.vox
25-Jul-08  16:19             7,554 030.vox
25-Jul-08  16:19             8,714 031.vox
30-May-16  14:35                 0 ordinals.txt
01-Jun-08  15:35            10,013 WS_FTP.LOG
              33 File(s)        256,508 bytes
               2 Dir(s)  27,951,218,688 bytes free
