2008.06.01 14:29 B C:\Documents and Settings\osmirovichd\es-AR\Cardinals\y.vox <-- 172.29.247.141 /temp/TASA76/UNNVentas/Languages/es-AR/Cardinals y.vox
2008.06.01 14:29 B C:\Documents and Settings\osmirovichd\es-AR\Cardinals\thousand.vox <-- 172.29.247.141 /temp/TASA76/UNNVentas/Languages/es-AR/Cardinals thousand.vox
2008.06.01 14:29 B C:\Documents and Settings\osmirovichd\es-AR\Cardinals\pesoscon.vox <-- 172.29.247.141 /temp/TASA76/UNNVentas/Languages/es-AR/Cardinals pesoscon.vox
2008.06.01 14:29 B C:\Documents and Settings\osmirovichd\es-AR\Cardinals\Millones.vox <-- 172.29.247.141 /temp/TASA76/UNNVentas/Languages/es-AR/Cardinals Millones.vox
2008.06.01 14:29 B C:\Documents and Settings\osmirovichd\es-AR\Cardinals\millon.vox <-- 172.29.247.141 /temp/TASA76/UNNVentas/Languages/es-AR/Cardinals millon.vox
2008.06.01 14:29 B C:\Documents and Settings\osmirovichd\es-AR\Cardinals\con!.vox <-- 172.29.247.141 /temp/TASA76/UNNVentas/Languages/es-AR/Cardinals con!.vox
2008.06.01 14:29 B C:\Documents and Settings\osmirovichd\es-AR\Cardinals\Cientos.vox <-- 172.29.247.141 /temp/TASA76/UNNVentas/Languages/es-AR/Cardinals Cientos.vox
2008.06.01 14:29 B C:\Documents and Settings\osmirovichd\es-AR\Cardinals\Ciento.vox <-- 172.29.247.141 /temp/TASA76/UNNVentas/Languages/es-AR/Cardinals Ciento.vox
2008.06.01 14:29 B C:\Documents and Settings\osmirovichd\es-AR\Cardinals\Centavos.vox <-- 172.29.247.141 /temp/TASA76/UNNVentas/Languages/es-AR/Cardinals Centavos.vox
2008.06.01 14:29 B C:\Documents and Settings\osmirovichd\es-AR\Cardinals\and.vox <-- 172.29.247.141 /temp/TASA76/UNNVentas/Languages/es-AR/Cardinals and.vox
2008.06.01 14:29 B C:\Documents and Settings\osmirovichd\es-AR\Cardinals\9000.vox <-- 172.29.247.141 /temp/TASA76/UNNVentas/Languages/es-AR/Cardinals 9000.vox
2008.06.01 14:29 B C:\Documents and Settings\osmirovichd\es-AR\Cardinals\900.vox <-- 172.29.247.141 /temp/TASA76/UNNVentas/Languages/es-AR/Cardinals 900.vox
2008.06.01 14:29 B C:\Documents and Settings\osmirovichd\es-AR\Cardinals\8000.vox <-- 172.29.247.141 /temp/TASA76/UNNVentas/Languages/es-AR/Cardinals 8000.vox
2008.06.01 14:29 B C:\Documents and Settings\osmirovichd\es-AR\Cardinals\800.vox <-- 172.29.247.141 /temp/TASA76/UNNVentas/Languages/es-AR/Cardinals 800.vox
2008.06.01 14:29 B C:\Documents and Settings\osmirovichd\es-AR\Cardinals\7000.vox <-- 172.29.247.141 /temp/TASA76/UNNVentas/Languages/es-AR/Cardinals 7000.vox
2008.06.01 14:29 B C:\Documents and Settings\osmirovichd\es-AR\Cardinals\700.vox <-- 172.29.247.141 /temp/TASA76/UNNVentas/Languages/es-AR/Cardinals 700.vox
2008.06.01 14:29 B C:\Documents and Settings\osmirovichd\es-AR\Cardinals\6000.vox <-- 172.29.247.141 /temp/TASA76/UNNVentas/Languages/es-AR/Cardinals 6000.vox
2008.06.01 14:29 B C:\Documents and Settings\osmirovichd\es-AR\Cardinals\600.vox <-- 172.29.247.141 /temp/TASA76/UNNVentas/Languages/es-AR/Cardinals 600.vox
2008.06.01 14:29 B C:\Documents and Settings\osmirovichd\es-AR\Cardinals\5000.vox <-- 172.29.247.141 /temp/TASA76/UNNVentas/Languages/es-AR/Cardinals 5000.vox
2008.06.01 14:29 B C:\Documents and Settings\osmirovichd\es-AR\Cardinals\500.vox <-- 172.29.247.141 /temp/TASA76/UNNVentas/Languages/es-AR/Cardinals 500.vox
2008.06.01 14:29 B C:\Documents and Settings\osmirovichd\es-AR\Cardinals\4000.vox <-- 172.29.247.141 /temp/TASA76/UNNVentas/Languages/es-AR/Cardinals 4000.vox
2008.06.01 14:29 B C:\Documents and Settings\osmirovichd\es-AR\Cardinals\400.vox <-- 172.29.247.141 /temp/TASA76/UNNVentas/Languages/es-AR/Cardinals 400.vox
2008.06.01 14:29 B C:\Documents and Settings\osmirovichd\es-AR\Cardinals\3000.vox <-- 172.29.247.141 /temp/TASA76/UNNVentas/Languages/es-AR/Cardinals 3000.vox
2008.06.01 14:29 B C:\Documents and Settings\osmirovichd\es-AR\Cardinals\300.vox <-- 172.29.247.141 /temp/TASA76/UNNVentas/Languages/es-AR/Cardinals 300.vox
2008.06.01 14:29 B C:\Documents and Settings\osmirovichd\es-AR\Cardinals\2000.vox <-- 172.29.247.141 /temp/TASA76/UNNVentas/Languages/es-AR/Cardinals 2000.vox
2008.06.01 14:29 B C:\Documents and Settings\osmirovichd\es-AR\Cardinals\200.vox <-- 172.29.247.141 /temp/TASA76/UNNVentas/Languages/es-AR/Cardinals 200.vox
2008.06.01 14:29 B C:\Documents and Settings\osmirovichd\es-AR\Cardinals\1000.vox <-- 172.29.247.141 /temp/TASA76/UNNVentas/Languages/es-AR/Cardinals 1000.vox
2008.06.01 14:29 B C:\Documents and Settings\osmirovichd\es-AR\Cardinals\100.vox <-- 172.29.247.141 /temp/TASA76/UNNVentas/Languages/es-AR/Cardinals 100.vox
2008.06.01 14:29 B C:\Documents and Settings\osmirovichd\es-AR\Cardinals\099.vox <-- 172.29.247.141 /temp/TASA76/UNNVentas/Languages/es-AR/Cardinals 099.vox
2008.06.01 14:29 B C:\Documents and Settings\osmirovichd\es-AR\Cardinals\098.vox <-- 172.29.247.141 /temp/TASA76/UNNVentas/Languages/es-AR/Cardinals 098.vox
2008.06.01 14:29 B C:\Documents and Settings\osmirovichd\es-AR\Cardinals\097.vox <-- 172.29.247.141 /temp/TASA76/UNNVentas/Languages/es-AR/Cardinals 097.vox
2008.06.01 14:29 B C:\Documents and Settings\osmirovichd\es-AR\Cardinals\096.vox <-- 172.29.247.141 /temp/TASA76/UNNVentas/Languages/es-AR/Cardinals 096.vox
2008.06.01 14:29 B C:\Documents and Settings\osmirovichd\es-AR\Cardinals\095.vox <-- 172.29.247.141 /temp/TASA76/UNNVentas/Languages/es-AR/Cardinals 095.vox
2008.06.01 14:29 B C:\Documents and Settings\osmirovichd\es-AR\Cardinals\094.vox <-- 172.29.247.141 /temp/TASA76/UNNVentas/Languages/es-AR/Cardinals 094.vox
2008.06.01 14:29 B C:\Documents and Settings\osmirovichd\es-AR\Cardinals\093.vox <-- 172.29.247.141 /temp/TASA76/UNNVentas/Languages/es-AR/Cardinals 093.vox
2008.06.01 14:29 B C:\Documents and Settings\osmirovichd\es-AR\Cardinals\092.vox <-- 172.29.247.141 /temp/TASA76/UNNVentas/Languages/es-AR/Cardinals 092.vox
2008.06.01 14:29 B C:\Documents and Settings\osmirovichd\es-AR\Cardinals\091.vox <-- 172.29.247.141 /temp/TASA76/UNNVentas/Languages/es-AR/Cardinals 091.vox
2008.06.01 14:29 B C:\Documents and Settings\osmirovichd\es-AR\Cardinals\090.vox <-- 172.29.247.141 /temp/TASA76/UNNVentas/Languages/es-AR/Cardinals 090.vox
2008.06.01 14:29 B C:\Documents and Settings\osmirovichd\es-AR\Cardinals\089.vox <-- 172.29.247.141 /temp/TASA76/UNNVentas/Languages/es-AR/Cardinals 089.vox
2008.06.01 14:29 B C:\Documents and Settings\osmirovichd\es-AR\Cardinals\088.vox <-- 172.29.247.141 /temp/TASA76/UNNVentas/Languages/es-AR/Cardinals 088.vox
2008.06.01 14:29 B C:\Documents and Settings\osmirovichd\es-AR\Cardinals\087.vox <-- 172.29.247.141 /temp/TASA76/UNNVentas/Languages/es-AR/Cardinals 087.vox
2008.06.01 14:29 B C:\Documents and Settings\osmirovichd\es-AR\Cardinals\086.vox <-- 172.29.247.141 /temp/TASA76/UNNVentas/Languages/es-AR/Cardinals 086.vox
2008.06.01 14:29 B C:\Documents and Settings\osmirovichd\es-AR\Cardinals\085.vox <-- 172.29.247.141 /temp/TASA76/UNNVentas/Languages/es-AR/Cardinals 085.vox
2008.06.01 14:29 B C:\Documents and Settings\osmirovichd\es-AR\Cardinals\084.vox <-- 172.29.247.141 /temp/TASA76/UNNVentas/Languages/es-AR/Cardinals 084.vox
2008.06.01 14:29 B C:\Documents and Settings\osmirovichd\es-AR\Cardinals\083.vox <-- 172.29.247.141 /temp/TASA76/UNNVentas/Languages/es-AR/Cardinals 083.vox
2008.06.01 14:29 B C:\Documents and Settings\osmirovichd\es-AR\Cardinals\082.vox <-- 172.29.247.141 /temp/TASA76/UNNVentas/Languages/es-AR/Cardinals 082.vox
2008.06.01 14:29 B C:\Documents and Settings\osmirovichd\es-AR\Cardinals\081.vox <-- 172.29.247.141 /temp/TASA76/UNNVentas/Languages/es-AR/Cardinals 081.vox
2008.06.01 14:29 B C:\Documents and Settings\osmirovichd\es-AR\Cardinals\080.vox <-- 172.29.247.141 /temp/TASA76/UNNVentas/Languages/es-AR/Cardinals 080.vox
2008.06.01 14:29 B C:\Documents and Settings\osmirovichd\es-AR\Cardinals\079.vox <-- 172.29.247.141 /temp/TASA76/UNNVentas/Languages/es-AR/Cardinals 079.vox
2008.06.01 14:29 B C:\Documents and Settings\osmirovichd\es-AR\Cardinals\078.vox <-- 172.29.247.141 /temp/TASA76/UNNVentas/Languages/es-AR/Cardinals 078.vox
2008.06.01 14:30 B C:\Documents and Settings\osmirovichd\es-AR\Cardinals\077.vox <-- 172.29.247.141 /temp/TASA76/UNNVentas/Languages/es-AR/Cardinals 077.vox
2008.06.01 14:30 B C:\Documents and Settings\osmirovichd\es-AR\Cardinals\076.vox <-- 172.29.247.141 /temp/TASA76/UNNVentas/Languages/es-AR/Cardinals 076.vox
2008.06.01 14:30 B C:\Documents and Settings\osmirovichd\es-AR\Cardinals\075.vox <-- 172.29.247.141 /temp/TASA76/UNNVentas/Languages/es-AR/Cardinals 075.vox
2008.06.01 14:30 B C:\Documents and Settings\osmirovichd\es-AR\Cardinals\074.vox <-- 172.29.247.141 /temp/TASA76/UNNVentas/Languages/es-AR/Cardinals 074.vox
2008.06.01 14:30 B C:\Documents and Settings\osmirovichd\es-AR\Cardinals\073.vox <-- 172.29.247.141 /temp/TASA76/UNNVentas/Languages/es-AR/Cardinals 073.vox
2008.06.01 14:30 B C:\Documents and Settings\osmirovichd\es-AR\Cardinals\072.vox <-- 172.29.247.141 /temp/TASA76/UNNVentas/Languages/es-AR/Cardinals 072.vox
2008.06.01 14:30 B C:\Documents and Settings\osmirovichd\es-AR\Cardinals\071.vox <-- 172.29.247.141 /temp/TASA76/UNNVentas/Languages/es-AR/Cardinals 071.vox
2008.06.01 14:30 B C:\Documents and Settings\osmirovichd\es-AR\Cardinals\070.vox <-- 172.29.247.141 /temp/TASA76/UNNVentas/Languages/es-AR/Cardinals 070.vox
2008.06.01 14:30 B C:\Documents and Settings\osmirovichd\es-AR\Cardinals\069.vox <-- 172.29.247.141 /temp/TASA76/UNNVentas/Languages/es-AR/Cardinals 069.vox
2008.06.01 14:30 B C:\Documents and Settings\osmirovichd\es-AR\Cardinals\068.vox <-- 172.29.247.141 /temp/TASA76/UNNVentas/Languages/es-AR/Cardinals 068.vox
2008.06.01 14:30 B C:\Documents and Settings\osmirovichd\es-AR\Cardinals\067.vox <-- 172.29.247.141 /temp/TASA76/UNNVentas/Languages/es-AR/Cardinals 067.vox
2008.06.01 14:30 B C:\Documents and Settings\osmirovichd\es-AR\Cardinals\066.vox <-- 172.29.247.141 /temp/TASA76/UNNVentas/Languages/es-AR/Cardinals 066.vox
2008.06.01 14:30 B C:\Documents and Settings\osmirovichd\es-AR\Cardinals\065.vox <-- 172.29.247.141 /temp/TASA76/UNNVentas/Languages/es-AR/Cardinals 065.vox
2008.06.01 14:30 B C:\Documents and Settings\osmirovichd\es-AR\Cardinals\064.vox <-- 172.29.247.141 /temp/TASA76/UNNVentas/Languages/es-AR/Cardinals 064.vox
2008.06.01 14:30 B C:\Documents and Settings\osmirovichd\es-AR\Cardinals\063.vox <-- 172.29.247.141 /temp/TASA76/UNNVentas/Languages/es-AR/Cardinals 063.vox
2008.06.01 14:30 B C:\Documents and Settings\osmirovichd\es-AR\Cardinals\062.vox <-- 172.29.247.141 /temp/TASA76/UNNVentas/Languages/es-AR/Cardinals 062.vox
2008.06.01 14:30 B C:\Documents and Settings\osmirovichd\es-AR\Cardinals\061.vox <-- 172.29.247.141 /temp/TASA76/UNNVentas/Languages/es-AR/Cardinals 061.vox
2008.06.01 14:30 B C:\Documents and Settings\osmirovichd\es-AR\Cardinals\060.vox <-- 172.29.247.141 /temp/TASA76/UNNVentas/Languages/es-AR/Cardinals 060.vox
2008.06.01 14:30 B C:\Documents and Settings\osmirovichd\es-AR\Cardinals\059.vox <-- 172.29.247.141 /temp/TASA76/UNNVentas/Languages/es-AR/Cardinals 059.vox
2008.06.01 14:30 B C:\Documents and Settings\osmirovichd\es-AR\Cardinals\058.vox <-- 172.29.247.141 /temp/TASA76/UNNVentas/Languages/es-AR/Cardinals 058.vox
2008.06.01 14:30 B C:\Documents and Settings\osmirovichd\es-AR\Cardinals\057.vox <-- 172.29.247.141 /temp/TASA76/UNNVentas/Languages/es-AR/Cardinals 057.vox
2008.06.01 14:30 B C:\Documents and Settings\osmirovichd\es-AR\Cardinals\056.vox <-- 172.29.247.141 /temp/TASA76/UNNVentas/Languages/es-AR/Cardinals 056.vox
2008.06.01 14:30 B C:\Documents and Settings\osmirovichd\es-AR\Cardinals\055.vox <-- 172.29.247.141 /temp/TASA76/UNNVentas/Languages/es-AR/Cardinals 055.vox
2008.06.01 14:30 B C:\Documents and Settings\osmirovichd\es-AR\Cardinals\054.vox <-- 172.29.247.141 /temp/TASA76/UNNVentas/Languages/es-AR/Cardinals 054.vox
2008.06.01 14:30 B C:\Documents and Settings\osmirovichd\es-AR\Cardinals\053.vox <-- 172.29.247.141 /temp/TASA76/UNNVentas/Languages/es-AR/Cardinals 053.vox
2008.06.01 14:30 B C:\Documents and Settings\osmirovichd\es-AR\Cardinals\052.vox <-- 172.29.247.141 /temp/TASA76/UNNVentas/Languages/es-AR/Cardinals 052.vox
2008.06.01 14:30 B C:\Documents and Settings\osmirovichd\es-AR\Cardinals\051.vox <-- 172.29.247.141 /temp/TASA76/UNNVentas/Languages/es-AR/Cardinals 051.vox
2008.06.01 14:30 B C:\Documents and Settings\osmirovichd\es-AR\Cardinals\050.vox <-- 172.29.247.141 /temp/TASA76/UNNVentas/Languages/es-AR/Cardinals 050.vox
2008.06.01 14:30 B C:\Documents and Settings\osmirovichd\es-AR\Cardinals\049.vox <-- 172.29.247.141 /temp/TASA76/UNNVentas/Languages/es-AR/Cardinals 049.vox
2008.06.01 14:30 B C:\Documents and Settings\osmirovichd\es-AR\Cardinals\048.vox <-- 172.29.247.141 /temp/TASA76/UNNVentas/Languages/es-AR/Cardinals 048.vox
2008.06.01 14:30 B C:\Documents and Settings\osmirovichd\es-AR\Cardinals\047.vox <-- 172.29.247.141 /temp/TASA76/UNNVentas/Languages/es-AR/Cardinals 047.vox
2008.06.01 14:30 B C:\Documents and Settings\osmirovichd\es-AR\Cardinals\046.vox <-- 172.29.247.141 /temp/TASA76/UNNVentas/Languages/es-AR/Cardinals 046.vox
2008.06.01 14:30 B C:\Documents and Settings\osmirovichd\es-AR\Cardinals\045.vox <-- 172.29.247.141 /temp/TASA76/UNNVentas/Languages/es-AR/Cardinals 045.vox
2008.06.01 14:30 B C:\Documents and Settings\osmirovichd\es-AR\Cardinals\044.vox <-- 172.29.247.141 /temp/TASA76/UNNVentas/Languages/es-AR/Cardinals 044.vox
2008.06.01 14:30 B C:\Documents and Settings\osmirovichd\es-AR\Cardinals\043.vox <-- 172.29.247.141 /temp/TASA76/UNNVentas/Languages/es-AR/Cardinals 043.vox
2008.06.01 14:30 B C:\Documents and Settings\osmirovichd\es-AR\Cardinals\042.vox <-- 172.29.247.141 /temp/TASA76/UNNVentas/Languages/es-AR/Cardinals 042.vox
2008.06.01 14:30 B C:\Documents and Settings\osmirovichd\es-AR\Cardinals\041.vox <-- 172.29.247.141 /temp/TASA76/UNNVentas/Languages/es-AR/Cardinals 041.vox
2008.06.01 14:30 B C:\Documents and Settings\osmirovichd\es-AR\Cardinals\040.vox <-- 172.29.247.141 /temp/TASA76/UNNVentas/Languages/es-AR/Cardinals 040.vox
2008.06.01 14:30 B C:\Documents and Settings\osmirovichd\es-AR\Cardinals\039.vox <-- 172.29.247.141 /temp/TASA76/UNNVentas/Languages/es-AR/Cardinals 039.vox
2008.06.01 14:30 B C:\Documents and Settings\osmirovichd\es-AR\Cardinals\038.vox <-- 172.29.247.141 /temp/TASA76/UNNVentas/Languages/es-AR/Cardinals 038.vox
2008.06.01 14:30 B C:\Documents and Settings\osmirovichd\es-AR\Cardinals\037.vox <-- 172.29.247.141 /temp/TASA76/UNNVentas/Languages/es-AR/Cardinals 037.vox
2008.06.01 14:30 B C:\Documents and Settings\osmirovichd\es-AR\Cardinals\036.vox <-- 172.29.247.141 /temp/TASA76/UNNVentas/Languages/es-AR/Cardinals 036.vox
2008.06.01 14:30 B C:\Documents and Settings\osmirovichd\es-AR\Cardinals\035.vox <-- 172.29.247.141 /temp/TASA76/UNNVentas/Languages/es-AR/Cardinals 035.vox
2008.06.01 14:30 B C:\Documents and Settings\osmirovichd\es-AR\Cardinals\034.vox <-- 172.29.247.141 /temp/TASA76/UNNVentas/Languages/es-AR/Cardinals 034.vox
2008.06.01 14:30 B C:\Documents and Settings\osmirovichd\es-AR\Cardinals\033.vox <-- 172.29.247.141 /temp/TASA76/UNNVentas/Languages/es-AR/Cardinals 033.vox
2008.06.01 14:30 B C:\Documents and Settings\osmirovichd\es-AR\Cardinals\032.vox <-- 172.29.247.141 /temp/TASA76/UNNVentas/Languages/es-AR/Cardinals 032.vox
2008.06.01 14:30 B C:\Documents and Settings\osmirovichd\es-AR\Cardinals\031.vox <-- 172.29.247.141 /temp/TASA76/UNNVentas/Languages/es-AR/Cardinals 031.vox
2008.06.01 14:30 B C:\Documents and Settings\osmirovichd\es-AR\Cardinals\030.vox <-- 172.29.247.141 /temp/TASA76/UNNVentas/Languages/es-AR/Cardinals 030.vox
2008.06.01 14:30 B C:\Documents and Settings\osmirovichd\es-AR\Cardinals\029.vox <-- 172.29.247.141 /temp/TASA76/UNNVentas/Languages/es-AR/Cardinals 029.vox
2008.06.01 14:30 B C:\Documents and Settings\osmirovichd\es-AR\Cardinals\028.vox <-- 172.29.247.141 /temp/TASA76/UNNVentas/Languages/es-AR/Cardinals 028.vox
2008.06.01 14:30 B C:\Documents and Settings\osmirovichd\es-AR\Cardinals\027.vox <-- 172.29.247.141 /temp/TASA76/UNNVentas/Languages/es-AR/Cardinals 027.vox
2008.06.01 14:30 B C:\Documents and Settings\osmirovichd\es-AR\Cardinals\026.vox <-- 172.29.247.141 /temp/TASA76/UNNVentas/Languages/es-AR/Cardinals 026.vox
2008.06.01 14:30 B C:\Documents and Settings\osmirovichd\es-AR\Cardinals\025.vox <-- 172.29.247.141 /temp/TASA76/UNNVentas/Languages/es-AR/Cardinals 025.vox
2008.06.01 14:30 B C:\Documents and Settings\osmirovichd\es-AR\Cardinals\024.vox <-- 172.29.247.141 /temp/TASA76/UNNVentas/Languages/es-AR/Cardinals 024.vox
2008.06.01 14:30 B C:\Documents and Settings\osmirovichd\es-AR\Cardinals\023.vox <-- 172.29.247.141 /temp/TASA76/UNNVentas/Languages/es-AR/Cardinals 023.vox
2008.06.01 14:30 B C:\Documents and Settings\osmirovichd\es-AR\Cardinals\022.vox <-- 172.29.247.141 /temp/TASA76/UNNVentas/Languages/es-AR/Cardinals 022.vox
2008.06.01 14:30 B C:\Documents and Settings\osmirovichd\es-AR\Cardinals\021.vox <-- 172.29.247.141 /temp/TASA76/UNNVentas/Languages/es-AR/Cardinals 021.vox
2008.06.01 14:30 B C:\Documents and Settings\osmirovichd\es-AR\Cardinals\020.vox <-- 172.29.247.141 /temp/TASA76/UNNVentas/Languages/es-AR/Cardinals 020.vox
2008.06.01 14:30 B C:\Documents and Settings\osmirovichd\es-AR\Cardinals\019.vox <-- 172.29.247.141 /temp/TASA76/UNNVentas/Languages/es-AR/Cardinals 019.vox
2008.06.01 14:30 B C:\Documents and Settings\osmirovichd\es-AR\Cardinals\018.vox <-- 172.29.247.141 /temp/TASA76/UNNVentas/Languages/es-AR/Cardinals 018.vox
2008.06.01 14:30 B C:\Documents and Settings\osmirovichd\es-AR\Cardinals\017.vox <-- 172.29.247.141 /temp/TASA76/UNNVentas/Languages/es-AR/Cardinals 017.vox
2008.06.01 14:30 B C:\Documents and Settings\osmirovichd\es-AR\Cardinals\016.vox <-- 172.29.247.141 /temp/TASA76/UNNVentas/Languages/es-AR/Cardinals 016.vox
2008.06.01 14:30 B C:\Documents and Settings\osmirovichd\es-AR\Cardinals\015.vox <-- 172.29.247.141 /temp/TASA76/UNNVentas/Languages/es-AR/Cardinals 015.vox
2008.06.01 14:30 B C:\Documents and Settings\osmirovichd\es-AR\Cardinals\014.vox <-- 172.29.247.141 /temp/TASA76/UNNVentas/Languages/es-AR/Cardinals 014.vox
2008.06.01 14:30 B C:\Documents and Settings\osmirovichd\es-AR\Cardinals\013.vox <-- 172.29.247.141 /temp/TASA76/UNNVentas/Languages/es-AR/Cardinals 013.vox
2008.06.01 14:30 B C:\Documents and Settings\osmirovichd\es-AR\Cardinals\012.vox <-- 172.29.247.141 /temp/TASA76/UNNVentas/Languages/es-AR/Cardinals 012.vox
2008.06.01 14:30 B C:\Documents and Settings\osmirovichd\es-AR\Cardinals\011.vox <-- 172.29.247.141 /temp/TASA76/UNNVentas/Languages/es-AR/Cardinals 011.vox
2008.06.01 14:30 B C:\Documents and Settings\osmirovichd\es-AR\Cardinals\010.vox <-- 172.29.247.141 /temp/TASA76/UNNVentas/Languages/es-AR/Cardinals 010.vox
2008.06.01 14:30 B C:\Documents and Settings\osmirovichd\es-AR\Cardinals\009.vox <-- 172.29.247.141 /temp/TASA76/UNNVentas/Languages/es-AR/Cardinals 009.vox
2008.06.01 14:30 B C:\Documents and Settings\osmirovichd\es-AR\Cardinals\008.vox <-- 172.29.247.141 /temp/TASA76/UNNVentas/Languages/es-AR/Cardinals 008.vox
2008.06.01 14:30 B C:\Documents and Settings\osmirovichd\es-AR\Cardinals\007.vox <-- 172.29.247.141 /temp/TASA76/UNNVentas/Languages/es-AR/Cardinals 007.vox
2008.06.01 14:30 B C:\Documents and Settings\osmirovichd\es-AR\Cardinals\006.vox <-- 172.29.247.141 /temp/TASA76/UNNVentas/Languages/es-AR/Cardinals 006.vox
2008.06.01 14:30 B C:\Documents and Settings\osmirovichd\es-AR\Cardinals\005.vox <-- 172.29.247.141 /temp/TASA76/UNNVentas/Languages/es-AR/Cardinals 005.vox
2008.06.01 14:30 B C:\Documents and Settings\osmirovichd\es-AR\Cardinals\004.vox <-- 172.29.247.141 /temp/TASA76/UNNVentas/Languages/es-AR/Cardinals 004.vox
2008.06.01 14:30 B C:\Documents and Settings\osmirovichd\es-AR\Cardinals\003.vox <-- 172.29.247.141 /temp/TASA76/UNNVentas/Languages/es-AR/Cardinals 003.vox
2008.06.01 14:30 B C:\Documents and Settings\osmirovichd\es-AR\Cardinals\002.vox <-- 172.29.247.141 /temp/TASA76/UNNVentas/Languages/es-AR/Cardinals 002.vox
2008.06.01 14:30 B C:\Documents and Settings\osmirovichd\es-AR\Cardinals\001.vox <-- 172.29.247.141 /temp/TASA76/UNNVentas/Languages/es-AR/Cardinals 001.vox
2008.06.01 14:30 B C:\Documents and Settings\osmirovichd\es-AR\Cardinals\000.vox <-- 172.29.247.141 /temp/TASA76/UNNVentas/Languages/es-AR/Cardinals 000.vox
2008.06.01 15:31 B C:\Documents and Settings\osmirovichd\Escritorio\es-AR\Cardinals\000.vox --> 172.29.247.141 /temp/TASA76/UNNVentas/Languages/es-AR/Cardinals 000.vox
2008.06.01 15:31 B C:\Documents and Settings\osmirovichd\Escritorio\es-AR\Cardinals\001.vox --> 172.29.247.141 /temp/TASA76/UNNVentas/Languages/es-AR/Cardinals 001.vox
2008.06.01 15:31 B C:\Documents and Settings\osmirovichd\Escritorio\es-AR\Cardinals\002.vox --> 172.29.247.141 /temp/TASA76/UNNVentas/Languages/es-AR/Cardinals 002.vox
2008.06.01 15:31 B C:\Documents and Settings\osmirovichd\Escritorio\es-AR\Cardinals\003.vox --> 172.29.247.141 /temp/TASA76/UNNVentas/Languages/es-AR/Cardinals 003.vox
2008.06.01 15:31 B C:\Documents and Settings\osmirovichd\Escritorio\es-AR\Cardinals\004.vox --> 172.29.247.141 /temp/TASA76/UNNVentas/Languages/es-AR/Cardinals 004.vox
2008.06.01 15:31 B C:\Documents and Settings\osmirovichd\Escritorio\es-AR\Cardinals\005.vox --> 172.29.247.141 /temp/TASA76/UNNVentas/Languages/es-AR/Cardinals 005.vox
2008.06.01 15:31 B C:\Documents and Settings\osmirovichd\Escritorio\es-AR\Cardinals\006.vox --> 172.29.247.141 /temp/TASA76/UNNVentas/Languages/es-AR/Cardinals 006.vox
2008.06.01 15:31 B C:\Documents and Settings\osmirovichd\Escritorio\es-AR\Cardinals\007.vox --> 172.29.247.141 /temp/TASA76/UNNVentas/Languages/es-AR/Cardinals 007.vox
2008.06.01 15:31 B C:\Documents and Settings\osmirovichd\Escritorio\es-AR\Cardinals\008.vox --> 172.29.247.141 /temp/TASA76/UNNVentas/Languages/es-AR/Cardinals 008.vox
2008.06.01 15:31 B C:\Documents and Settings\osmirovichd\Escritorio\es-AR\Cardinals\009.vox --> 172.29.247.141 /temp/TASA76/UNNVentas/Languages/es-AR/Cardinals 009.vox
2008.06.01 15:31 B C:\Documents and Settings\osmirovichd\Escritorio\es-AR\Cardinals\010.vox --> 172.29.247.141 /temp/TASA76/UNNVentas/Languages/es-AR/Cardinals 010.vox
2008.06.01 15:31 B C:\Documents and Settings\osmirovichd\Escritorio\es-AR\Cardinals\011.vox --> 172.29.247.141 /temp/TASA76/UNNVentas/Languages/es-AR/Cardinals 011.vox
2008.06.01 15:31 B C:\Documents and Settings\osmirovichd\Escritorio\es-AR\Cardinals\012.vox --> 172.29.247.141 /temp/TASA76/UNNVentas/Languages/es-AR/Cardinals 012.vox
2008.06.01 15:31 B C:\Documents and Settings\osmirovichd\Escritorio\es-AR\Cardinals\013.vox --> 172.29.247.141 /temp/TASA76/UNNVentas/Languages/es-AR/Cardinals 013.vox
2008.06.01 15:31 B C:\Documents and Settings\osmirovichd\Escritorio\es-AR\Cardinals\014.vox --> 172.29.247.141 /temp/TASA76/UNNVentas/Languages/es-AR/Cardinals 014.vox
2008.06.01 15:31 B C:\Documents and Settings\osmirovichd\Escritorio\es-AR\Cardinals\015.vox --> 172.29.247.141 /temp/TASA76/UNNVentas/Languages/es-AR/Cardinals 015.vox
2008.06.01 15:31 B C:\Documents and Settings\osmirovichd\Escritorio\es-AR\Cardinals\016.vox --> 172.29.247.141 /temp/TASA76/UNNVentas/Languages/es-AR/Cardinals 016.vox
2008.06.01 15:31 B C:\Documents and Settings\osmirovichd\Escritorio\es-AR\Cardinals\017.vox --> 172.29.247.141 /temp/TASA76/UNNVentas/Languages/es-AR/Cardinals 017.vox
2008.06.01 15:31 B C:\Documents and Settings\osmirovichd\Escritorio\es-AR\Cardinals\018.vox --> 172.29.247.141 /temp/TASA76/UNNVentas/Languages/es-AR/Cardinals 018.vox
2008.06.01 15:31 B C:\Documents and Settings\osmirovichd\Escritorio\es-AR\Cardinals\019.vox --> 172.29.247.141 /temp/TASA76/UNNVentas/Languages/es-AR/Cardinals 019.vox
2008.06.01 15:31 B C:\Documents and Settings\osmirovichd\Escritorio\es-AR\Cardinals\020.vox --> 172.29.247.141 /temp/TASA76/UNNVentas/Languages/es-AR/Cardinals 020.vox
2008.06.01 15:31 B C:\Documents and Settings\osmirovichd\Escritorio\es-AR\Cardinals\021.vox --> 172.29.247.141 /temp/TASA76/UNNVentas/Languages/es-AR/Cardinals 021.vox
2008.06.01 15:31 B C:\Documents and Settings\osmirovichd\Escritorio\es-AR\Cardinals\022.vox --> 172.29.247.141 /temp/TASA76/UNNVentas/Languages/es-AR/Cardinals 022.vox
2008.06.01 15:31 B C:\Documents and Settings\osmirovichd\Escritorio\es-AR\Cardinals\024.vox --> 172.29.247.141 /temp/TASA76/UNNVentas/Languages/es-AR/Cardinals 024.vox
2008.06.01 15:32 B C:\Documents and Settings\osmirovichd\Escritorio\es-AR\Cardinals\025.vox --> 172.29.247.141 /temp/TASA76/UNNVentas/Languages/es-AR/Cardinals 025.vox
2008.06.01 15:32 B C:\Documents and Settings\osmirovichd\Escritorio\es-AR\Cardinals\026.vox --> 172.29.247.141 /temp/TASA76/UNNVentas/Languages/es-AR/Cardinals 026.vox
2008.06.01 15:32 B C:\Documents and Settings\osmirovichd\Escritorio\es-AR\Cardinals\027.vox --> 172.29.247.141 /temp/TASA76/UNNVentas/Languages/es-AR/Cardinals 027.vox
2008.06.01 15:32 B C:\Documents and Settings\osmirovichd\Escritorio\es-AR\Cardinals\028.vox --> 172.29.247.141 /temp/TASA76/UNNVentas/Languages/es-AR/Cardinals 028.vox
2008.06.01 15:32 B C:\Documents and Settings\osmirovichd\Escritorio\es-AR\Cardinals\029.vox --> 172.29.247.141 /temp/TASA76/UNNVentas/Languages/es-AR/Cardinals 029.vox
2008.06.01 15:32 B C:\Documents and Settings\osmirovichd\Escritorio\es-AR\Cardinals\030.vox --> 172.29.247.141 /temp/TASA76/UNNVentas/Languages/es-AR/Cardinals 030.vox
2008.06.01 15:32 B C:\Documents and Settings\osmirovichd\Escritorio\es-AR\Cardinals\031.vox --> 172.29.247.141 /temp/TASA76/UNNVentas/Languages/es-AR/Cardinals 031.vox
2008.06.01 15:32 B C:\Documents and Settings\osmirovichd\Escritorio\es-AR\Cardinals\032.vox --> 172.29.247.141 /temp/TASA76/UNNVentas/Languages/es-AR/Cardinals 032.vox
2008.06.01 15:32 B C:\Documents and Settings\osmirovichd\Escritorio\es-AR\Cardinals\033.vox --> 172.29.247.141 /temp/TASA76/UNNVentas/Languages/es-AR/Cardinals 033.vox
2008.06.01 15:32 B C:\Documents and Settings\osmirovichd\Escritorio\es-AR\Cardinals\034.vox --> 172.29.247.141 /temp/TASA76/UNNVentas/Languages/es-AR/Cardinals 034.vox
2008.06.01 15:32 B C:\Documents and Settings\osmirovichd\Escritorio\es-AR\Cardinals\035.vox --> 172.29.247.141 /temp/TASA76/UNNVentas/Languages/es-AR/Cardinals 035.vox
2008.06.01 15:32 B C:\Documents and Settings\osmirovichd\Escritorio\es-AR\Cardinals\036.vox --> 172.29.247.141 /temp/TASA76/UNNVentas/Languages/es-AR/Cardinals 036.vox
2008.06.01 15:32 B C:\Documents and Settings\osmirovichd\Escritorio\es-AR\Cardinals\037.vox --> 172.29.247.141 /temp/TASA76/UNNVentas/Languages/es-AR/Cardinals 037.vox
2008.06.01 15:32 B C:\Documents and Settings\osmirovichd\Escritorio\es-AR\Cardinals\038.vox --> 172.29.247.141 /temp/TASA76/UNNVentas/Languages/es-AR/Cardinals 038.vox
2008.06.01 15:32 B C:\Documents and Settings\osmirovichd\Escritorio\es-AR\Cardinals\039.vox --> 172.29.247.141 /temp/TASA76/UNNVentas/Languages/es-AR/Cardinals 039.vox
2008.06.01 15:32 B C:\Documents and Settings\osmirovichd\Escritorio\es-AR\Cardinals\040.vox --> 172.29.247.141 /temp/TASA76/UNNVentas/Languages/es-AR/Cardinals 040.vox
2008.06.01 15:32 B C:\Documents and Settings\osmirovichd\Escritorio\es-AR\Cardinals\041.vox --> 172.29.247.141 /temp/TASA76/UNNVentas/Languages/es-AR/Cardinals 041.vox
2008.06.01 15:32 B C:\Documents and Settings\osmirovichd\Escritorio\es-AR\Cardinals\042.vox --> 172.29.247.141 /temp/TASA76/UNNVentas/Languages/es-AR/Cardinals 042.vox
2008.06.01 15:32 B C:\Documents and Settings\osmirovichd\Escritorio\es-AR\Cardinals\043.vox --> 172.29.247.141 /temp/TASA76/UNNVentas/Languages/es-AR/Cardinals 043.vox
2008.06.01 15:32 B C:\Documents and Settings\osmirovichd\Escritorio\es-AR\Cardinals\044.vox --> 172.29.247.141 /temp/TASA76/UNNVentas/Languages/es-AR/Cardinals 044.vox
2008.06.01 15:32 B C:\Documents and Settings\osmirovichd\Escritorio\es-AR\Cardinals\045.vox --> 172.29.247.141 /temp/TASA76/UNNVentas/Languages/es-AR/Cardinals 045.vox
2008.06.01 15:32 B C:\Documents and Settings\osmirovichd\Escritorio\es-AR\Cardinals\046.vox --> 172.29.247.141 /temp/TASA76/UNNVentas/Languages/es-AR/Cardinals 046.vox
2008.06.01 15:32 B C:\Documents and Settings\osmirovichd\Escritorio\es-AR\Cardinals\047.vox --> 172.29.247.141 /temp/TASA76/UNNVentas/Languages/es-AR/Cardinals 047.vox
2008.06.01 15:32 B C:\Documents and Settings\osmirovichd\Escritorio\es-AR\Cardinals\048.vox --> 172.29.247.141 /temp/TASA76/UNNVentas/Languages/es-AR/Cardinals 048.vox
2008.06.01 15:32 B C:\Documents and Settings\osmirovichd\Escritorio\es-AR\Cardinals\049.vox --> 172.29.247.141 /temp/TASA76/UNNVentas/Languages/es-AR/Cardinals 049.vox
2008.06.01 15:32 B C:\Documents and Settings\osmirovichd\Escritorio\es-AR\Cardinals\050.vox --> 172.29.247.141 /temp/TASA76/UNNVentas/Languages/es-AR/Cardinals 050.vox
2008.06.01 15:32 B C:\Documents and Settings\osmirovichd\Escritorio\es-AR\Cardinals\051.vox --> 172.29.247.141 /temp/TASA76/UNNVentas/Languages/es-AR/Cardinals 051.vox
2008.06.01 15:32 B C:\Documents and Settings\osmirovichd\Escritorio\es-AR\Cardinals\052.vox --> 172.29.247.141 /temp/TASA76/UNNVentas/Languages/es-AR/Cardinals 052.vox
2008.06.01 15:32 B C:\Documents and Settings\osmirovichd\Escritorio\es-AR\Cardinals\053.vox --> 172.29.247.141 /temp/TASA76/UNNVentas/Languages/es-AR/Cardinals 053.vox
2008.06.01 15:32 B C:\Documents and Settings\osmirovichd\Escritorio\es-AR\Cardinals\054.vox --> 172.29.247.141 /temp/TASA76/UNNVentas/Languages/es-AR/Cardinals 054.vox
2008.06.01 15:32 B C:\Documents and Settings\osmirovichd\Escritorio\es-AR\Cardinals\055.vox --> 172.29.247.141 /temp/TASA76/UNNVentas/Languages/es-AR/Cardinals 055.vox
2008.06.01 15:32 B C:\Documents and Settings\osmirovichd\Escritorio\es-AR\Cardinals\056.vox --> 172.29.247.141 /temp/TASA76/UNNVentas/Languages/es-AR/Cardinals 056.vox
2008.06.01 15:32 B C:\Documents and Settings\osmirovichd\Escritorio\es-AR\Cardinals\057.vox --> 172.29.247.141 /temp/TASA76/UNNVentas/Languages/es-AR/Cardinals 057.vox
2008.06.01 15:32 B C:\Documents and Settings\osmirovichd\Escritorio\es-AR\Cardinals\058.vox --> 172.29.247.141 /temp/TASA76/UNNVentas/Languages/es-AR/Cardinals 058.vox
2008.06.01 15:32 B C:\Documents and Settings\osmirovichd\Escritorio\es-AR\Cardinals\059.vox --> 172.29.247.141 /temp/TASA76/UNNVentas/Languages/es-AR/Cardinals 059.vox
2008.06.01 15:32 B C:\Documents and Settings\osmirovichd\Escritorio\es-AR\Cardinals\060.vox --> 172.29.247.141 /temp/TASA76/UNNVentas/Languages/es-AR/Cardinals 060.vox
2008.06.01 15:32 B C:\Documents and Settings\osmirovichd\Escritorio\es-AR\Cardinals\061.vox --> 172.29.247.141 /temp/TASA76/UNNVentas/Languages/es-AR/Cardinals 061.vox
2008.06.01 15:32 B C:\Documents and Settings\osmirovichd\Escritorio\es-AR\Cardinals\062.vox --> 172.29.247.141 /temp/TASA76/UNNVentas/Languages/es-AR/Cardinals 062.vox
2008.06.01 15:32 B C:\Documents and Settings\osmirovichd\Escritorio\es-AR\Cardinals\063.vox --> 172.29.247.141 /temp/TASA76/UNNVentas/Languages/es-AR/Cardinals 063.vox
2008.06.01 15:32 B C:\Documents and Settings\osmirovichd\Escritorio\es-AR\Cardinals\064.vox --> 172.29.247.141 /temp/TASA76/UNNVentas/Languages/es-AR/Cardinals 064.vox
2008.06.01 15:32 B C:\Documents and Settings\osmirovichd\Escritorio\es-AR\Cardinals\065.vox --> 172.29.247.141 /temp/TASA76/UNNVentas/Languages/es-AR/Cardinals 065.vox
2008.06.01 15:32 B C:\Documents and Settings\osmirovichd\Escritorio\es-AR\Cardinals\066.vox --> 172.29.247.141 /temp/TASA76/UNNVentas/Languages/es-AR/Cardinals 066.vox
2008.06.01 15:32 B C:\Documents and Settings\osmirovichd\Escritorio\es-AR\Cardinals\067.vox --> 172.29.247.141 /temp/TASA76/UNNVentas/Languages/es-AR/Cardinals 067.vox
2008.06.01 15:32 B C:\Documents and Settings\osmirovichd\Escritorio\es-AR\Cardinals\068.vox --> 172.29.247.141 /temp/TASA76/UNNVentas/Languages/es-AR/Cardinals 068.vox
2008.06.01 15:32 B C:\Documents and Settings\osmirovichd\Escritorio\es-AR\Cardinals\069.vox --> 172.29.247.141 /temp/TASA76/UNNVentas/Languages/es-AR/Cardinals 069.vox
2008.06.01 15:32 B C:\Documents and Settings\osmirovichd\Escritorio\es-AR\Cardinals\070.vox --> 172.29.247.141 /temp/TASA76/UNNVentas/Languages/es-AR/Cardinals 070.vox
2008.06.01 15:33 B C:\Documents and Settings\osmirovichd\Escritorio\es-AR\Cardinals\071.vox --> 172.29.247.141 /temp/TASA76/UNNVentas/Languages/es-AR/Cardinals 071.vox
2008.06.01 15:33 B C:\Documents and Settings\osmirovichd\Escritorio\es-AR\Cardinals\072.vox --> 172.29.247.141 /temp/TASA76/UNNVentas/Languages/es-AR/Cardinals 072.vox
2008.06.01 15:33 B C:\Documents and Settings\osmirovichd\Escritorio\es-AR\Cardinals\073.vox --> 172.29.247.141 /temp/TASA76/UNNVentas/Languages/es-AR/Cardinals 073.vox
2008.06.01 15:33 B C:\Documents and Settings\osmirovichd\Escritorio\es-AR\Cardinals\074.vox --> 172.29.247.141 /temp/TASA76/UNNVentas/Languages/es-AR/Cardinals 074.vox
2008.06.01 15:33 B C:\Documents and Settings\osmirovichd\Escritorio\es-AR\Cardinals\075.vox --> 172.29.247.141 /temp/TASA76/UNNVentas/Languages/es-AR/Cardinals 075.vox
2008.06.01 15:33 B C:\Documents and Settings\osmirovichd\Escritorio\es-AR\Cardinals\076.vox --> 172.29.247.141 /temp/TASA76/UNNVentas/Languages/es-AR/Cardinals 076.vox
2008.06.01 15:33 B C:\Documents and Settings\osmirovichd\Escritorio\es-AR\Cardinals\077.vox --> 172.29.247.141 /temp/TASA76/UNNVentas/Languages/es-AR/Cardinals 077.vox
2008.06.01 15:33 B C:\Documents and Settings\osmirovichd\Escritorio\es-AR\Cardinals\078.vox --> 172.29.247.141 /temp/TASA76/UNNVentas/Languages/es-AR/Cardinals 078.vox
2008.06.01 15:33 B C:\Documents and Settings\osmirovichd\Escritorio\es-AR\Cardinals\079.vox --> 172.29.247.141 /temp/TASA76/UNNVentas/Languages/es-AR/Cardinals 079.vox
2008.06.01 15:33 B C:\Documents and Settings\osmirovichd\Escritorio\es-AR\Cardinals\080.vox --> 172.29.247.141 /temp/TASA76/UNNVentas/Languages/es-AR/Cardinals 080.vox
2008.06.01 15:33 B C:\Documents and Settings\osmirovichd\Escritorio\es-AR\Cardinals\081.vox --> 172.29.247.141 /temp/TASA76/UNNVentas/Languages/es-AR/Cardinals 081.vox
2008.06.01 15:33 B C:\Documents and Settings\osmirovichd\Escritorio\es-AR\Cardinals\082.vox --> 172.29.247.141 /temp/TASA76/UNNVentas/Languages/es-AR/Cardinals 082.vox
2008.06.01 15:33 B C:\Documents and Settings\osmirovichd\Escritorio\es-AR\Cardinals\083.vox --> 172.29.247.141 /temp/TASA76/UNNVentas/Languages/es-AR/Cardinals 083.vox
2008.06.01 15:33 B C:\Documents and Settings\osmirovichd\Escritorio\es-AR\Cardinals\084.vox --> 172.29.247.141 /temp/TASA76/UNNVentas/Languages/es-AR/Cardinals 084.vox
2008.06.01 15:33 B C:\Documents and Settings\osmirovichd\Escritorio\es-AR\Cardinals\085.vox --> 172.29.247.141 /temp/TASA76/UNNVentas/Languages/es-AR/Cardinals 085.vox
2008.06.01 15:33 B C:\Documents and Settings\osmirovichd\Escritorio\es-AR\Cardinals\086.vox --> 172.29.247.141 /temp/TASA76/UNNVentas/Languages/es-AR/Cardinals 086.vox
2008.06.01 15:33 B C:\Documents and Settings\osmirovichd\Escritorio\es-AR\Cardinals\087.vox --> 172.29.247.141 /temp/TASA76/UNNVentas/Languages/es-AR/Cardinals 087.vox
2008.06.01 15:33 B C:\Documents and Settings\osmirovichd\Escritorio\es-AR\Cardinals\088.vox --> 172.29.247.141 /temp/TASA76/UNNVentas/Languages/es-AR/Cardinals 088.vox
2008.06.01 15:33 B C:\Documents and Settings\osmirovichd\Escritorio\es-AR\Cardinals\089.vox --> 172.29.247.141 /temp/TASA76/UNNVentas/Languages/es-AR/Cardinals 089.vox
2008.06.01 15:33 B C:\Documents and Settings\osmirovichd\Escritorio\es-AR\Cardinals\090.vox --> 172.29.247.141 /temp/TASA76/UNNVentas/Languages/es-AR/Cardinals 090.vox
2008.06.01 15:33 B C:\Documents and Settings\osmirovichd\Escritorio\es-AR\Cardinals\091.vox --> 172.29.247.141 /temp/TASA76/UNNVentas/Languages/es-AR/Cardinals 091.vox
2008.06.01 15:33 B C:\Documents and Settings\osmirovichd\Escritorio\es-AR\Cardinals\092.vox --> 172.29.247.141 /temp/TASA76/UNNVentas/Languages/es-AR/Cardinals 092.vox
2008.06.01 15:33 B C:\Documents and Settings\osmirovichd\Escritorio\es-AR\Cardinals\093.vox --> 172.29.247.141 /temp/TASA76/UNNVentas/Languages/es-AR/Cardinals 093.vox
2008.06.01 15:33 B C:\Documents and Settings\osmirovichd\Escritorio\es-AR\Cardinals\094.vox --> 172.29.247.141 /temp/TASA76/UNNVentas/Languages/es-AR/Cardinals 094.vox
2008.06.01 15:33 B C:\Documents and Settings\osmirovichd\Escritorio\es-AR\Cardinals\095.vox --> 172.29.247.141 /temp/TASA76/UNNVentas/Languages/es-AR/Cardinals 095.vox
2008.06.01 15:33 B C:\Documents and Settings\osmirovichd\Escritorio\es-AR\Cardinals\096.vox --> 172.29.247.141 /temp/TASA76/UNNVentas/Languages/es-AR/Cardinals 096.vox
2008.06.01 15:33 B C:\Documents and Settings\osmirovichd\Escritorio\es-AR\Cardinals\097.vox --> 172.29.247.141 /temp/TASA76/UNNVentas/Languages/es-AR/Cardinals 097.vox
2008.06.01 15:33 B C:\Documents and Settings\osmirovichd\Escritorio\es-AR\Cardinals\098.vox --> 172.29.247.141 /temp/TASA76/UNNVentas/Languages/es-AR/Cardinals 098.vox
2008.06.01 15:33 B C:\Documents and Settings\osmirovichd\Escritorio\es-AR\Cardinals\099.vox --> 172.29.247.141 /temp/TASA76/UNNVentas/Languages/es-AR/Cardinals 099.vox
2008.06.01 15:33 B C:\Documents and Settings\osmirovichd\Escritorio\es-AR\Cardinals\100.vox --> 172.29.247.141 /temp/TASA76/UNNVentas/Languages/es-AR/Cardinals 100.vox
2008.06.01 15:33 B C:\Documents and Settings\osmirovichd\Escritorio\es-AR\Cardinals\1000.vox --> 172.29.247.141 /temp/TASA76/UNNVentas/Languages/es-AR/Cardinals 1000.vox
2008.06.01 15:33 B C:\Documents and Settings\osmirovichd\Escritorio\es-AR\Cardinals\200.vox --> 172.29.247.141 /temp/TASA76/UNNVentas/Languages/es-AR/Cardinals 200.vox
2008.06.01 15:33 B C:\Documents and Settings\osmirovichd\Escritorio\es-AR\Cardinals\2000.vox --> 172.29.247.141 /temp/TASA76/UNNVentas/Languages/es-AR/Cardinals 2000.vox
2008.06.01 15:33 B C:\Documents and Settings\osmirovichd\Escritorio\es-AR\Cardinals\300.vox --> 172.29.247.141 /temp/TASA76/UNNVentas/Languages/es-AR/Cardinals 300.vox
2008.06.01 15:33 B C:\Documents and Settings\osmirovichd\Escritorio\es-AR\Cardinals\3000.vox --> 172.29.247.141 /temp/TASA76/UNNVentas/Languages/es-AR/Cardinals 3000.vox
2008.06.01 15:33 B C:\Documents and Settings\osmirovichd\Escritorio\es-AR\Cardinals\400.vox --> 172.29.247.141 /temp/TASA76/UNNVentas/Languages/es-AR/Cardinals 400.vox
2008.06.01 15:33 B C:\Documents and Settings\osmirovichd\Escritorio\es-AR\Cardinals\4000.vox --> 172.29.247.141 /temp/TASA76/UNNVentas/Languages/es-AR/Cardinals 4000.vox
2008.06.01 15:33 B C:\Documents and Settings\osmirovichd\Escritorio\es-AR\Cardinals\500.vox --> 172.29.247.141 /temp/TASA76/UNNVentas/Languages/es-AR/Cardinals 500.vox
2008.06.01 15:33 B C:\Documents and Settings\osmirovichd\Escritorio\es-AR\Cardinals\5000.vox --> 172.29.247.141 /temp/TASA76/UNNVentas/Languages/es-AR/Cardinals 5000.vox
2008.06.01 15:33 B C:\Documents and Settings\osmirovichd\Escritorio\es-AR\Cardinals\600.vox --> 172.29.247.141 /temp/TASA76/UNNVentas/Languages/es-AR/Cardinals 600.vox
2008.06.01 15:33 B C:\Documents and Settings\osmirovichd\Escritorio\es-AR\Cardinals\6000.vox --> 172.29.247.141 /temp/TASA76/UNNVentas/Languages/es-AR/Cardinals 6000.vox
2008.06.01 15:33 B C:\Documents and Settings\osmirovichd\Escritorio\es-AR\Cardinals\700.vox --> 172.29.247.141 /temp/TASA76/UNNVentas/Languages/es-AR/Cardinals 700.vox
2008.06.01 15:33 B C:\Documents and Settings\osmirovichd\Escritorio\es-AR\Cardinals\7000.vox --> 172.29.247.141 /temp/TASA76/UNNVentas/Languages/es-AR/Cardinals 7000.vox
2008.06.01 15:33 B C:\Documents and Settings\osmirovichd\Escritorio\es-AR\Cardinals\800.vox --> 172.29.247.141 /temp/TASA76/UNNVentas/Languages/es-AR/Cardinals 800.vox
2008.06.01 15:33 B C:\Documents and Settings\osmirovichd\Escritorio\es-AR\Cardinals\8000.vox --> 172.29.247.141 /temp/TASA76/UNNVentas/Languages/es-AR/Cardinals 8000.vox
2008.06.01 15:33 B C:\Documents and Settings\osmirovichd\Escritorio\es-AR\Cardinals\900.vox --> 172.29.247.141 /temp/TASA76/UNNVentas/Languages/es-AR/Cardinals 900.vox
2008.06.01 15:33 B C:\Documents and Settings\osmirovichd\Escritorio\es-AR\Cardinals\9000.vox --> 172.29.247.141 /temp/TASA76/UNNVentas/Languages/es-AR/Cardinals 9000.vox
2008.06.01 15:33 B C:\Documents and Settings\osmirovichd\Escritorio\es-AR\Cardinals\and.vox --> 172.29.247.141 /temp/TASA76/UNNVentas/Languages/es-AR/Cardinals and.vox
2008.06.01 15:33 B C:\Documents and Settings\osmirovichd\Escritorio\es-AR\Cardinals\Centavos.vox --> 172.29.247.141 /temp/TASA76/UNNVentas/Languages/es-AR/Cardinals Centavos.vox
2008.06.01 15:33 B C:\Documents and Settings\osmirovichd\Escritorio\es-AR\Cardinals\Ciento.vox --> 172.29.247.141 /temp/TASA76/UNNVentas/Languages/es-AR/Cardinals Ciento.vox
2008.06.01 15:33 B C:\Documents and Settings\osmirovichd\Escritorio\es-AR\Cardinals\Cientos.vox --> 172.29.247.141 /temp/TASA76/UNNVentas/Languages/es-AR/Cardinals Cientos.vox
2008.06.01 15:33 B C:\Documents and Settings\osmirovichd\Escritorio\es-AR\Cardinals\con!.vox --> 172.29.247.141 /temp/TASA76/UNNVentas/Languages/es-AR/Cardinals con!.vox
2008.06.01 15:33 B C:\Documents and Settings\osmirovichd\Escritorio\es-AR\Cardinals\millon.vox --> 172.29.247.141 /temp/TASA76/UNNVentas/Languages/es-AR/Cardinals millon.vox
2008.06.01 15:33 B C:\Documents and Settings\osmirovichd\Escritorio\es-AR\Cardinals\Millones.vox --> 172.29.247.141 /temp/TASA76/UNNVentas/Languages/es-AR/Cardinals Millones.vox
2008.06.01 15:33 B C:\Documents and Settings\osmirovichd\Escritorio\es-AR\Cardinals\pesoscon.vox --> 172.29.247.141 /temp/TASA76/UNNVentas/Languages/es-AR/Cardinals pesoscon.vox
2008.06.01 15:33 B C:\Documents and Settings\osmirovichd\Escritorio\es-AR\Cardinals\thousand.vox --> 172.29.247.141 /temp/TASA76/UNNVentas/Languages/es-AR/Cardinals thousand.vox
