Running: xsim.dir/compN_Testbench_behav/xsimk -simmode gui -wdb compN_Testbench_behav.wdb -simrunnum 0 -socket 37597
Design successfully loaded
Design Loading Memory Usage: 33388 KB (Peak: 33388 KB)
Design Loading CPU Usage: 20 ms
