# compile vhdl design source files
vhdl xil_defaultlib  "../../../TP2.srcs/sources_1/imports/TP2/hex7seg.vhd"
vhdl xil_defaultlib  "../../../TP2.srcs/sources_1/imports/TP2/hex7seg_top.vhd"
vhdl xil_defaultlib  "../../../TP2.srcs/sources_1/new/tp2_tb.vhd"

# Do not sort compile order
nosort
