\relax 
\providecommand\zref@newlabel[2]{}
\providecommand\hyper@newdestlabel[2]{}
\catcode `:\active 
\catcode `;\active 
\catcode `!\active 
\catcode `?\active 
\providecommand\HyperFirstAtBeginDocument{\AtBeginDocument}
\HyperFirstAtBeginDocument{\ifx\hyper@anchor\@undefined
\global\let\oldcontentsline\contentsline
\gdef\contentsline#1#2#3#4{\oldcontentsline{#1}{#2}{#3}}
\global\let\oldnewlabel\newlabel
\gdef\newlabel#1#2{\newlabelxx{#1}#2}
\gdef\newlabelxx#1#2#3#4#5#6{\oldnewlabel{#1}{{#2}{#3}}}
\AtEndDocument{\ifx\hyper@anchor\@undefined
\let\contentsline\oldcontentsline
\let\newlabel\oldnewlabel
\fi}
\fi}
\global\let\hyper@last\relax 
\gdef\HyperFirstAtBeginDocument#1{#1}
\providecommand\HyField@AuxAddToFields[1]{}
\providecommand\HyField@AuxAddToCoFields[2]{}
\providecommand\@newglossary[4]{}
\@newglossary{main}{glg}{gls}{glo}
\@newglossary{acronym}{alg}{acr}{acn}
\providecommand\@glsorder[1]{}
\providecommand\@istfilename[1]{}
\@istfilename{main.ist}
\@glsorder{word}
\babel@aux{french}{}
\@writefile{toc}{\contentsline {chapter}{Introduction}{3}{chapter*.2}\protected@file@percent }
\@writefile{lof}{\contentsline {figure}{\numberline {1}{\ignorespaces IES Synergy, Si\IeC {\`e}ge Social et Bureau d'\IeC {\'e}tude, Saint-Aun\IeC {\`e}s, France\relax }}{3}{figure.caption.3}\protected@file@percent }
\providecommand*\caption@xref[2]{\@setref\relax\@undefined{#1}}
\newlabel{ies}{{1}{3}{IES Synergy, Siège Social et Bureau d'étude, Saint-Aunès, France\relax }{figure.caption.3}{}}
\@writefile{toc}{\contentsline {paragraph}{}{3}{paragraph*.4}\protected@file@percent }
\@writefile{toc}{\contentsline {paragraph}{}{3}{paragraph*.5}\protected@file@percent }
\@writefile{toc}{\contentsline {paragraph}{}{3}{paragraph*.6}\protected@file@percent }
\@writefile{toc}{\contentsline {paragraph}{}{3}{paragraph*.7}\protected@file@percent }
\@writefile{toc}{\contentsline {paragraph}{}{3}{paragraph*.8}\protected@file@percent }
\@writefile{toc}{\contentsline {paragraph}{}{3}{paragraph*.9}\protected@file@percent }
\@writefile{toc}{\contentsline {chapter}{IES Synergy, acteur de la charge en France}{4}{chapter*.10}\protected@file@percent }
\@writefile{toc}{\contentsline {section}{\numberline {I}Pr\IeC {\'e}sent depuis 1992}{4}{section.0.1}\protected@file@percent }
\@writefile{toc}{\contentsline {paragraph}{}{4}{paragraph*.11}\protected@file@percent }
\@writefile{toc}{\contentsline {paragraph}{}{4}{paragraph*.12}\protected@file@percent }
\@writefile{toc}{\contentsline {paragraph}{}{4}{paragraph*.13}\protected@file@percent }
\@writefile{toc}{\contentsline {paragraph}{}{4}{paragraph*.14}\protected@file@percent }
\@writefile{toc}{\contentsline {paragraph}{}{4}{paragraph*.15}\protected@file@percent }
\@writefile{lof}{\contentsline {figure}{\numberline {2}{\ignorespaces Chronologie des \IeC {\'e}v\IeC {\`e}nements cl\IeC {\'e}s \IeC {\`a} IES Synergy\relax }}{4}{figure.caption.16}\protected@file@percent }
\newlabel{chronologie}{{2}{4}{Chronologie des évènements clés à IES Synergy\relax }{figure.caption.16}{}}
\@writefile{toc}{\contentsline {section}{\numberline {II}La vision de la recharge actuelle d'IES Synergy}{5}{section.0.2}\protected@file@percent }
\@writefile{lof}{\contentsline {figure}{\numberline {3}{\ignorespaces Ellips 3000\relax }}{5}{figure.caption.17}\protected@file@percent }
\newlabel{el3000}{{3}{5}{Ellips 3000\relax }{figure.caption.17}{}}
\@writefile{toc}{\contentsline {paragraph}{}{5}{paragraph*.18}\protected@file@percent }
\@writefile{lof}{\contentsline {figure}{\numberline {4}{\ignorespaces Trolley\relax }}{5}{figure.caption.19}\protected@file@percent }
\newlabel{trolley}{{4}{5}{Trolley\relax }{figure.caption.19}{}}
\@writefile{toc}{\contentsline {paragraph}{}{5}{paragraph*.20}\protected@file@percent }
\@writefile{toc}{\contentsline {paragraph}{}{5}{paragraph*.22}\protected@file@percent }
\@writefile{lof}{\contentsline {figure}{\numberline {5}{\ignorespaces Station 24 kW\relax }}{5}{figure.caption.21}\protected@file@percent }
\newlabel{st24}{{5}{5}{Station 24 kW\relax }{figure.caption.21}{}}
\@writefile{toc}{\contentsline {section}{\numberline {III}Le D\IeC {\'e}veloppement durable et la Responsabilit\IeC {\'e} soci\IeC {\'e}tale de l'entreprise}{6}{section.0.3}\protected@file@percent }
\@writefile{toc}{\contentsline {paragraph}{}{6}{paragraph*.23}\protected@file@percent }
\@writefile{toc}{\contentsline {subsection}{\numberline {1 }La gestion des d\IeC {\'e}chets chez IES Synergy}{6}{subsection.0.3.1}\protected@file@percent }
\@writefile{toc}{\contentsline {paragraph}{}{6}{paragraph*.24}\protected@file@percent }
\@writefile{toc}{\contentsline {paragraph}{}{6}{paragraph*.25}\protected@file@percent }
\@writefile{lof}{\contentsline {figure}{\numberline {6}{\ignorespaces \IeC {\'E}volution de la gestion des d\IeC {\'e}chets \IeC {\`a} IES\relax }}{6}{figure.caption.26}\protected@file@percent }
\newlabel{waste-evo}{{6}{6}{Évolution de la gestion des déchets à IES\relax }{figure.caption.26}{}}
\@writefile{toc}{\contentsline {paragraph}{}{6}{paragraph*.27}\protected@file@percent }
\@writefile{toc}{\contentsline {paragraph}{}{6}{paragraph*.28}\protected@file@percent }
\@writefile{toc}{\contentsline {subsection}{\numberline {2 }Comment les ressources sont d\IeC {\'e}pens\IeC {\'e}es chez IES}{7}{subsection.0.3.2}\protected@file@percent }
\@writefile{toc}{\contentsline {paragraph}{}{7}{paragraph*.29}\protected@file@percent }
\@writefile{toc}{\contentsline {paragraph}{}{7}{paragraph*.30}\protected@file@percent }
\@writefile{toc}{\contentsline {paragraph}{}{7}{paragraph*.31}\protected@file@percent }
\@writefile{toc}{\contentsline {subsection}{\numberline {3 }L'emploi et l'organisation sociale dans l'entreprise}{7}{subsection.0.3.3}\protected@file@percent }
\@writefile{toc}{\contentsline {paragraph}{}{7}{paragraph*.32}\protected@file@percent }
\@writefile{toc}{\contentsline {paragraph}{}{7}{paragraph*.33}\protected@file@percent }
\@writefile{toc}{\contentsline {paragraph}{}{7}{paragraph*.34}\protected@file@percent }
\@writefile{toc}{\contentsline {paragraph}{}{7}{paragraph*.35}\protected@file@percent }
\@writefile{toc}{\contentsline {subsection}{\numberline {4 }Les objectifs 2020 d'IES pour le DDRS}{7}{subsection.0.3.4}\protected@file@percent }
\@writefile{toc}{\contentsline {paragraph}{}{7}{paragraph*.36}\protected@file@percent }
\@writefile{toc}{\contentsline {paragraph}{}{7}{paragraph*.37}\protected@file@percent }
\@writefile{toc}{\contentsline {chapter}{Travailler chez IES}{8}{chapter*.38}\protected@file@percent }
\@writefile{toc}{\contentsline {section}{\numberline {I}Le p\IeC {\^o}le Software}{8}{section.0.1}\protected@file@percent }
\@writefile{lof}{\contentsline {figure}{\numberline {7}{\ignorespaces Organigramme du p\IeC {\^o}le d\IeC {\'e}veloppement logiciel\relax }}{8}{figure.caption.39}\protected@file@percent }
\newlabel{soft}{{7}{8}{Organigramme du pôle développement logiciel\relax }{figure.caption.39}{}}
\@writefile{toc}{\contentsline {section}{\numberline {II}Les tests}{8}{section.0.2}\protected@file@percent }
\@writefile{toc}{\contentsline {paragraph}{}{8}{paragraph*.40}\protected@file@percent }
\@writefile{lof}{\contentsline {figure}{\numberline {8}{\ignorespaces Photographie d'un test en laboratoire (gauche) et sur table (droite)\relax }}{8}{figure.caption.41}\protected@file@percent }
\newlabel{tests}{{8}{8}{Photographie d'un test en laboratoire (gauche) et sur table (droite)\relax }{figure.caption.41}{}}
\@writefile{toc}{\contentsline {section}{\numberline {III}Les outils de d\IeC {\'e}veloppement}{9}{section.0.3}\protected@file@percent }
\@writefile{toc}{\contentsline {paragraph}{}{9}{paragraph*.42}\protected@file@percent }
\@writefile{lof}{\contentsline {figure}{\numberline {9}{\ignorespaces Diff\IeC {\'e}rents outils utilis\IeC {\'e}s pour le d\IeC {\'e}veloppement au sein de l'\IeC {\'e}quipe Soft\relax }}{9}{figure.caption.43}\protected@file@percent }
\newlabel{tools}{{9}{9}{Différents outils utilisés pour le développement au sein de l'équipe Soft\relax }{figure.caption.43}{}}
\@writefile{toc}{\contentsline {chapter}{Le projet simulateur de v\IeC {\'e}hicule}{10}{chapter*.44}\protected@file@percent }
\@writefile{toc}{\contentsline {paragraph}{}{10}{paragraph*.45}\protected@file@percent }
\@writefile{toc}{\contentsline {paragraph}{}{10}{paragraph*.46}\protected@file@percent }
\@writefile{toc}{\contentsline {paragraph}{}{10}{paragraph*.47}\protected@file@percent }
\@writefile{lof}{\contentsline {figure}{\numberline {10}{\ignorespaces Photographie d'un simulateur de v\IeC {\'e}hicule connect\IeC {\'e} \IeC {\`a} un trolley en CHAdeMO\relax }}{10}{figure.caption.48}\protected@file@percent }
\newlabel{ev_sim}{{10}{10}{Photographie d'un simulateur de véhicule connecté à un trolley en CHAdeMO\relax }{figure.caption.48}{}}
\@writefile{toc}{\contentsline {paragraph}{}{10}{paragraph*.49}\protected@file@percent }
\@writefile{toc}{\contentsline {paragraph}{}{10}{paragraph*.50}\protected@file@percent }
\@writefile{toc}{\contentsline {paragraph}{}{10}{paragraph*.51}\protected@file@percent }
\@writefile{toc}{\contentsline {chapter}{Les missions de ce premier semestre}{11}{chapter*.52}\protected@file@percent }
\@writefile{toc}{\contentsline {paragraph}{}{11}{paragraph*.53}\protected@file@percent }
\@writefile{toc}{\contentsline {section}{\numberline {I}\IeC {\'E}laboration d'un boitier simulateur}{11}{section.0.1}\protected@file@percent }
\@writefile{lof}{\contentsline {figure}{\numberline {11}{\ignorespaces Photographie du boitier de simulation v\IeC {\'e}hicule\relax }}{11}{figure.caption.54}\protected@file@percent }
\newlabel{ev_sim_box}{{11}{11}{Photographie du boitier de simulation véhicule\relax }{figure.caption.54}{}}
\@writefile{toc}{\contentsline {section}{\numberline {II}Conception d'une maquette de d\IeC {\'e}veloppement}{12}{section.0.2}\protected@file@percent }
\@writefile{toc}{\contentsline {paragraph}{}{12}{paragraph*.55}\protected@file@percent }
\@writefile{toc}{\contentsline {section}{\numberline {III}EV Interface Commander v2}{12}{section.0.3}\protected@file@percent }
\@writefile{lof}{\contentsline {figure}{\numberline {12}{\ignorespaces Circuit imprim\IeC {\'e} de l'EVIC v1 (\IeC {\`a} gauche) et v2 (\IeC {\`a} droite)\relax }}{12}{figure.caption.56}\protected@file@percent }
\newlabel{EVIC_PCB}{{12}{12}{Circuit imprimé de l'EVIC v1 (à gauche) et v2 (à droite)\relax }{figure.caption.56}{}}
\@writefile{toc}{\contentsline {chapter}{Conclusion}{13}{chapter*.57}\protected@file@percent }
\@writefile{toc}{\contentsline {chapter}{Bibliographie}{14}{chapter*.58}\protected@file@percent }
\@writefile{toc}{\contentsline {chapter}{Cr\IeC {\'e}dits}{14}{chapter*.59}\protected@file@percent }
\@writefile{toc}{\contentsline {chapter}{Glossaire}{15}{section*.61}\protected@file@percent }
\@writefile{toc}{\contentsline {chapter}{Annexes}{16}{chapter*.63}\protected@file@percent }
\zref@newlabel{LastPage}{\default{III}\page{16}\abspage{16}}
