Amplificateur a uA741
* Simule un mpli a base de 741
* fichier TP1.cir
.lib eval.lib ; contient ua741
* circuit :
Vplus  10  0  DC 15
Vmoins  11  0   DC -15
Ve    1  0  sin (0 0.1 1k 0 0 0) ac 1 
X1    0  3  10  11  4  uA741  ; e+ e- V+ V- S
C1    2  3  100n ; filtre composante continue
R1    1  2  10k ; entree
R2    3  4   100k ; contre reaction
.AC dec 10 0.1 10meg  ; pour harmonique
.TRAN 1u 3m 0 1u
.probe
.END
