\relax 
\bbl@beforestart
\catcode `:\active 
\catcode `;\active 
\catcode `!\active 
\catcode `?\active 
\babel@aux{french}{}
\@writefile{toc}{\contentsline {section}{\numberline {1}Greetings !}{2}\protected@file@percent }
\@writefile{toc}{\contentsline {section}{\numberline {2}Who ?}{3}\protected@file@percent }
\@writefile{toc}{\contentsline {section}{\numberline {6}Exactly ?}{4}\protected@file@percent }
\newlabel{LastPage}{{}{4}}
\xdef\lastpage@lastpage{4}
\gdef\lastpage@lastpageHy{}
