\relax 
\bbl@beforestart
\catcode `:\active 
\catcode `;\active 
\catcode `!\active 
\catcode `?\active 
\babel@aux{french}{}
\@writefile{toc}{\contentsline {section}{\numberline {1}Exercice 4}{1}\protected@file@percent }
\@writefile{toc}{\contentsline {subsection}{\numberline {1.1}Diagramme de Bode}{1}\protected@file@percent }
\@writefile{toc}{\contentsline {subsection}{\numberline {1.2}Étude temporelle à 1kHz}{2}\protected@file@percent }
\@writefile{toc}{\contentsline {section}{\numberline {2}Exercice 8}{3}\protected@file@percent }
\@writefile{toc}{\contentsline {subsection}{\numberline {2.1}Diagramme de Bode}{3}\protected@file@percent }
\@writefile{toc}{\contentsline {subsection}{\numberline {2.2}Étude temporelle à 1kHz}{4}\protected@file@percent }
\newlabel{LastPage}{{}{4}}
\xdef\lastpage@lastpage{4}
\gdef\lastpage@lastpageHy{}
\gdef\minted@oldcachelist{,
  default-pyg-prefix.pygstyle,
  default.pygstyle,
  A6329C52533A9CCA5BCFB921F7F83F19CFDD237C17A5B5B5E7E41182E0B7EB91.pygtex,
  DAB844FCBE1888F3F584A879717298E560D12581934771064C5A76FDFD8FFE27.pygtex}
