\relax 
\catcode `:\active 
\catcode `;\active 
\catcode `!\active 
\catcode `?\active 
\babel@aux{french}{}
\newlabel{LastPage}{{}{7}}
\xdef\lastpage@lastpage{7}
\gdef\lastpage@lastpageHy{}
\gdef\minted@oldcachelist{,
  default-pyg-prefix.pygstyle,
  default.pygstyle,
  0D2DCBF39F90E25FC7514D8AB712E79D5C938D9CEB197A0816A3CDDA5E978DBE.pygtex,
  1427DA21D72CC364ADAA4BBA16F723D244EFF0E948083373CA19A1C470AA26CA.pygtex,
  70A00A0E1912D75B3E62D57EEA4A5AE010A97A8A03912039FEF3E0FB7A5CFFF8.pygtex,
  E992BB9AEA9AC1C25CD9A4815C3C7DF3B5DAF515DCDCB27F5B5B74207B24293C.pygtex}
