# compile vhdl design source files
vhdl xil_defaultlib  \
"../../../../TD5.srcs/sources_1/new/comp.vhd" \
"../../../../TD5.srcs/sources_1/new/comp_tb.vhd" \
"../../../../TD5.srcs/sources_1/new/decode24a.vhd" \
"../../../../TD5.srcs/sources_1/new/decode38.vhd" \
"../../../../TD5.srcs/sources_1/new/decode24b.vhd" \
"../../../../TD5.srcs/sources_1/new/decode3to8_tb.vhd" \
"../../../../TD5.srcs/sources_1/new/encode42a.vhd" \
"../../../../TD5.srcs/sources_1/new/encode42a_tb.vhd" \
"../../../../TD5.srcs/sources_1/new/encode8to3_tb.vhd" \
"../../../../TD5.srcs/sources_1/new/encode8to_3P.vhd" \
"../../../../TD5.srcs/sources_1/new/encode8to_3P_tb.vhd" \
"../../../../TD5.srcs/sources_1/new/encode8to3.vhd" \

# Do not sort compile order
nosort
