\babel@toc {french}{}
\contentsline {chapter}{Introduction}{3}{chapter*.2}% 
\contentsline {paragraph}{}{3}{paragraph*.4}% 
\contentsline {paragraph}{}{3}{paragraph*.5}% 
\contentsline {paragraph}{}{3}{paragraph*.6}% 
\contentsline {paragraph}{}{3}{paragraph*.7}% 
\contentsline {paragraph}{}{3}{paragraph*.8}% 
\contentsline {paragraph}{}{3}{paragraph*.9}% 
\contentsline {chapter}{IES Synergy, acteur de la charge en France}{4}{chapter*.10}% 
\contentsline {section}{\numberline {I}Pr\IeC {\'e}sent depuis 1992}{4}{section.0.1}% 
\contentsline {paragraph}{}{4}{paragraph*.11}% 
\contentsline {paragraph}{}{4}{paragraph*.12}% 
\contentsline {paragraph}{}{4}{paragraph*.13}% 
\contentsline {paragraph}{}{4}{paragraph*.14}% 
\contentsline {paragraph}{}{4}{paragraph*.15}% 
\contentsline {section}{\numberline {II}La vision de la recharge actuelle d'IES Synergy}{5}{section.0.2}% 
\contentsline {paragraph}{}{5}{paragraph*.18}% 
\contentsline {paragraph}{}{5}{paragraph*.20}% 
\contentsline {paragraph}{}{5}{paragraph*.22}% 
\contentsline {section}{\numberline {III}Le D\IeC {\'e}veloppement durable et la Responsabilit\IeC {\'e} soci\IeC {\'e}tale de l'entreprise}{6}{section.0.3}% 
\contentsline {paragraph}{}{6}{paragraph*.23}% 
\contentsline {subsection}{\numberline {1 }La gestion des d\IeC {\'e}chets chez IES Synergy}{6}{subsection.0.3.1}% 
\contentsline {paragraph}{}{6}{paragraph*.24}% 
\contentsline {paragraph}{}{6}{paragraph*.25}% 
\contentsline {paragraph}{}{6}{paragraph*.27}% 
\contentsline {paragraph}{}{6}{paragraph*.28}% 
\contentsline {subsection}{\numberline {2 }Comment les ressources sont d\IeC {\'e}pens\IeC {\'e}es chez IES}{7}{subsection.0.3.2}% 
\contentsline {paragraph}{}{7}{paragraph*.29}% 
\contentsline {paragraph}{}{7}{paragraph*.30}% 
\contentsline {paragraph}{}{7}{paragraph*.31}% 
\contentsline {subsection}{\numberline {3 }L'emploi et l'organisation sociale dans l'entreprise}{7}{subsection.0.3.3}% 
\contentsline {paragraph}{}{7}{paragraph*.32}% 
\contentsline {paragraph}{}{7}{paragraph*.33}% 
\contentsline {paragraph}{}{7}{paragraph*.34}% 
\contentsline {paragraph}{}{7}{paragraph*.35}% 
\contentsline {subsection}{\numberline {4 }Les objectifs 2020 d'IES pour le DDRS}{7}{subsection.0.3.4}% 
\contentsline {paragraph}{}{7}{paragraph*.36}% 
\contentsline {paragraph}{}{7}{paragraph*.37}% 
\contentsline {chapter}{Travailler chez IES}{8}{chapter*.38}% 
\contentsline {section}{\numberline {I}Le p\IeC {\^o}le Software}{8}{section.0.1}% 
\contentsline {section}{\numberline {II}Les tests}{8}{section.0.2}% 
\contentsline {paragraph}{}{8}{paragraph*.40}% 
\contentsline {section}{\numberline {III}Les outils de d\IeC {\'e}veloppement}{9}{section.0.3}% 
\contentsline {paragraph}{}{9}{paragraph*.42}% 
\contentsline {chapter}{Le projet simulateur de v\IeC {\'e}hicule}{10}{chapter*.44}% 
\contentsline {paragraph}{}{10}{paragraph*.45}% 
\contentsline {paragraph}{}{10}{paragraph*.46}% 
\contentsline {paragraph}{}{10}{paragraph*.47}% 
\contentsline {paragraph}{}{10}{paragraph*.49}% 
\contentsline {paragraph}{}{10}{paragraph*.50}% 
\contentsline {paragraph}{}{10}{paragraph*.51}% 
\contentsline {chapter}{Les missions de ce premier semestre}{11}{chapter*.52}% 
\contentsline {paragraph}{}{11}{paragraph*.53}% 
\contentsline {section}{\numberline {I}\IeC {\'E}laboration d'un boitier simulateur}{11}{section.0.1}% 
\contentsline {section}{\numberline {II}Conception d'une maquette de d\IeC {\'e}veloppement}{12}{section.0.2}% 
\contentsline {paragraph}{}{12}{paragraph*.55}% 
\contentsline {section}{\numberline {III}EV Interface Commander v2}{12}{section.0.3}% 
\contentsline {chapter}{Conclusion}{13}{chapter*.57}% 
\contentsline {chapter}{Bibliographie}{14}{chapter*.58}% 
\contentsline {chapter}{Cr\IeC {\'e}dits}{14}{chapter*.59}% 
\contentsline {chapter}{Glossaire}{15}{section*.61}% 
\contentsline {chapter}{Annexes}{16}{chapter*.63}% 
