Inverseur TTL
* fichier inverseur TTL.cir
.model Qex NPN (BF=75 Rb=100 Cje=1p Cjc=3p Tf=2.8n)

.model Dex D

.subckt INV 2 3 5 ; entree sortie alim
Q1 1 4 2 Qex
DP 0 2 Dex
R1 5 4 4k
R2 5 6 1.6k
Q2 6 1 7 Qex
R3 7 0 1k
R4 5 8 130
Q4 8 6 9 Qex
D 9 3 Dex
Q3 3 7 0 Qex
.ENDS
VCC 5 0 5 ; alim 


X1 S0 S1 5 INV
X2 S1 S2 5 INV
X3 S2 S3 5 INV
X4 S3 S4 5 INV
X5 S4 S5 5 INV
X6 S5 S6 5 INV
X7 S6 S7 5 INV
X8 S7 S8 5 INV
X9 S8 S0 5 INV

.IC V(S0)=0
Cosc 0 S0 120p

.tran 100p 500n
.probe 
.end