\relax 
\catcode `:\active 
\catcode `;\active 
\catcode `!\active 
\catcode `?\active 
\babel@aux{french}{}
\newlabel{LastPage}{{}{3}}
\xdef\lastpage@lastpage{3}
\gdef\lastpage@lastpageHy{}
\gdef\minted@oldcachelist{,
  default-pyg-prefix.pygstyle,
  default.pygstyle,
  6E2BB7A689BEEC26B0C49E7CEEDA5C3C9A753D7B056610F8E353BCBC14923000.pygtex,
  1700DE544E5902813EC613D0E3BED794B25CFE8CFEA27C573A41C2D84923051C.pygtex}
