Running: xsim.dir/C1_Testbench_behav/xsimk -simmode gui -wdb C1_Testbench_behav.wdb -simrunnum 0 -socket 39073
Design successfully loaded
Design Loading Memory Usage: 33384 KB (Peak: 33384 KB)
Design Loading CPU Usage: 10 ms
Simulation completed
Simulation Memory Usage: 115120 KB (Peak: 172652 KB)
Simulation CPU Usage: 10 ms
