\BOOKMARK [0][-]{chapter*.2}{Introduction}{}% 1
\BOOKMARK [0][-]{chapter*.10}{IES Synergy, acteur de la charge en France}{}% 2
\BOOKMARK [1][-]{section.0.1}{Pr\351sent depuis 1992}{chapter*.10}% 3
\BOOKMARK [1][-]{section.0.2}{La vision de la recharge actuelle d'IES Synergy}{chapter*.10}% 4
\BOOKMARK [1][-]{section.0.3}{Le D\351veloppement durable et la Responsabilit\351 soci\351tale de l'entreprise}{chapter*.10}% 5
\BOOKMARK [2][-]{subsection.0.3.1}{La gestion des d\351chets chez IES Synergy}{section.0.3}% 6
\BOOKMARK [2][-]{subsection.0.3.2}{Comment les ressources sont d\351pens\351es chez IES}{section.0.3}% 7
\BOOKMARK [2][-]{subsection.0.3.3}{L'emploi et l'organisation sociale dans l'entreprise}{section.0.3}% 8
\BOOKMARK [2][-]{subsection.0.3.4}{Les objectifs 2020 d'IES pour le DDRS}{section.0.3}% 9
\BOOKMARK [0][-]{chapter*.38}{Travailler chez IES}{}% 10
\BOOKMARK [1][-]{section.0.1}{Le p\364le Software}{chapter*.38}% 11
\BOOKMARK [1][-]{section.0.2}{Les tests}{chapter*.38}% 12
\BOOKMARK [1][-]{section.0.3}{Les outils de d\351veloppement}{chapter*.38}% 13
\BOOKMARK [0][-]{chapter*.44}{Le projet simulateur de v\351hicule}{}% 14
\BOOKMARK [0][-]{chapter*.52}{Les missions de ce premier semestre}{}% 15
\BOOKMARK [1][-]{section.0.1}{\311laboration d'un boitier simulateur}{chapter*.52}% 16
\BOOKMARK [1][-]{section.0.2}{Conception d'une maquette de d\351veloppement}{chapter*.52}% 17
\BOOKMARK [1][-]{section.0.3}{EV Interface Commander v2}{chapter*.52}% 18
\BOOKMARK [0][-]{chapter*.57}{Conclusion}{}% 19
\BOOKMARK [0][-]{chapter*.58}{Bibliographie}{}% 20
\BOOKMARK [0][-]{chapter*.59}{Cr\351dits}{}% 21
\BOOKMARK [0][-]{section*.61}{Glossaire}{}% 22
\BOOKMARK [0][-]{chapter*.63}{Annexes}{}% 23
