\relax 
\bbl@beforestart
\catcode `:\active 
\catcode `;\active 
\catcode `!\active 
\catcode `?\active 
\babel@aux{french}{}
\@writefile{toc}{\contentsline {section}{\numberline {1}Évaluations}{1}\protected@file@percent }
\@writefile{toc}{\contentsline {section}{\numberline {2}La préstation Orale}{1}\protected@file@percent }
\@writefile{toc}{\contentsline {subsection}{\numberline {2.1}Les évidences}{1}\protected@file@percent }
\@writefile{toc}{\contentsline {section}{\numberline {3}Travail de présentation individuel}{1}\protected@file@percent }
\@writefile{toc}{\contentsline {subsection}{\numberline {3.1}Olivia}{1}\protected@file@percent }
\@writefile{toc}{\contentsline {subsection}{\numberline {3.2}Liam}{1}\protected@file@percent }
\@writefile{toc}{\contentsline {subsection}{\numberline {3.3}Laura}{2}\protected@file@percent }
\@writefile{toc}{\contentsline {subsection}{\numberline {3.4}Gabin}{2}\protected@file@percent }
\@writefile{toc}{\contentsline {section}{\numberline {4}Travail de présentation groupé}{2}\protected@file@percent }
\@writefile{toc}{\contentsline {section}{\numberline {5}Retour des groupes}{2}\protected@file@percent }
\@writefile{toc}{\contentsline {subsection}{\numberline {5.1}Groupe 1 : Les Locaux}{2}\protected@file@percent }
\@writefile{toc}{\contentsline {subsection}{\numberline {5.2}Groupe 2 : Les Athés}{3}\protected@file@percent }
\@writefile{toc}{\contentsline {subsection}{\numberline {5.3}Groupe 3 : Le mollet cardinal}{3}\protected@file@percent }
\@writefile{toc}{\contentsline {subsection}{\numberline {5.4}Groupe 4 : Voix de la sagesse}{3}\protected@file@percent }
\newlabel{LastPage}{{}{3}}
\xdef\lastpage@lastpage{3}
\gdef\lastpage@lastpageHy{}
