inverseur CMOS
* fichier inverseurCMOS.cir

.model MODN nmos ( Level=1 Kp=3m Vto=2
+ Cgdo=70n Cgso=70n lambda=0.002 )

.model MODP pmos ( Level=1 Kp=2m Vto=-3
+ Cgdo=70n Cgso=70n lambda=0.002 )

* sous-circuit :
.subckt INVCMOS in out vdd
Mp out in vdd vdd MODP W=40u L=40u
Mn out in 0 0 MODN W=20u L=60u
.ends

* circuit :
Vdd vdd 0 dc 12 ; alim
Xinv in S1 vdd INVCMOS
VA in 0 DC 0 ; niveau bas par défaut

Cosc 0 S1 120p

.DC VA 0 12 1m
.PROBE
.END
