# compile vhdl design source files
vhdl xil_defaultlib  \
"../../../../TD2.srcs/sources_1/new/c1.vhd" \
"../../../../TD2.srcs/sources_1/new/c2.vhd" \
"../../../../TD2.srcs/sources_1/new/c3.vhd" \
"../../../../TD2.srcs/sources_1/new/c3_tb.vhd" \

# Do not sort compile order
nosort
