\relax 
\bbl@beforestart
\catcode `:\active 
\catcode `;\active 
\catcode `!\active 
\catcode `?\active 
\babel@aux{french}{}
\newlabel{LastPage}{{}{6}}
\xdef\lastpage@lastpage{6}
\gdef\lastpage@lastpageHy{}
\gdef\minted@oldcachelist{,
  default-pyg-prefix.pygstyle,
  default.pygstyle,
  391B1BED873CD6FAAE51A659E16EA8F5C39CF4330C941CB7EAF7D3E775E00B51.pygtex,
  C5D8283433C6E5937DD19C99B67140D128F489992642C4EFDEF645C1B53F5C5E.pygtex,
  0F873BFA8132C54DF77B19A22E3E041FE9340B2FE5406988644A957634B49C84.pygtex}
