\relax 
\bbl@beforestart
\catcode `:\active 
\catcode `;\active 
\catcode `!\active 
\catcode `?\active 
\babel@aux{french}{}
\@writefile{toc}{\contentsline {section}{\numberline {1}Greetings !}{2}\protected@file@percent }
\@writefile{toc}{\contentsline {section}{\numberline {2}Who ?}{2}\protected@file@percent }
\@writefile{toc}{\contentsline {section}{\numberline {6}Exactly ?}{2}\protected@file@percent }
\newlabel{LastPage}{{}{2}}
\xdef\lastpage@lastpage{2}
\gdef\lastpage@lastpageHy{}
