-- Merging decision tree log ---
manifest
ADDED from C:\Users\Beatriz\Awesome\android\app\src\main\AndroidManifest.xml:1:1-26:12
INJECTED from C:\Users\Beatriz\Awesome\android\app\src\main\AndroidManifest.xml:1:1-26:12
INJECTED from C:\Users\Beatriz\Awesome\android\app\src\main\AndroidManifest.xml:1:1-26:12
INJECTED from C:\Users\Beatriz\Awesome\android\app\src\main\AndroidManifest.xml:1:1-26:12
MERGED from [com.facebook.react:react-native:0.57.4] C:\Users\Beatriz\.gradle\caches\transforms-1\files-1.1\react-native-0.57.4.aar\2e696ee0df86d0d80577d8bc5de5c22a\AndroidManifest.xml:2:1-15:12
MERGED from [com.android.support:appcompat-v7:27.1.1] C:\Users\Beatriz\.gradle\caches\transforms-1\files-1.1\appcompat-v7-27.1.1.aar\eb6a24ec45b2e40787a877323b7faab5\AndroidManifest.xml:17:1-22:12
MERGED from [com.android.support:support-fragment:27.1.1] C:\Users\Beatriz\.gradle\caches\transforms-1\files-1.1\support-fragment-27.1.1.aar\a6cf7ee31a325a8b77192625c6ea07e0\AndroidManifest.xml:17:1-22:12
MERGED from [com.android.support:animated-vector-drawable:27.1.1] C:\Users\Beatriz\.gradle\caches\transforms-1\files-1.1\animated-vector-drawable-27.1.1.aar\ad5b210fac6f3c148ea7fe8c1a7fb87a\AndroidManifest.xml:17:1-22:12
MERGED from [com.android.support:support-core-ui:27.1.1] C:\Users\Beatriz\.gradle\caches\transforms-1\files-1.1\support-core-ui-27.1.1.aar\74cb8b5312610b26cb7b3588065e6cac\AndroidManifest.xml:17:1-22:12
MERGED from [com.android.support:support-core-utils:27.1.1] C:\Users\Beatriz\.gradle\caches\transforms-1\files-1.1\support-core-utils-27.1.1.aar\e4d9953429a5a39360f36f2e0b3b2b55\AndroidManifest.xml:17:1-22:12
MERGED from [com.android.support:support-vector-drawable:27.1.1] C:\Users\Beatriz\.gradle\caches\transforms-1\files-1.1\support-vector-drawable-27.1.1.aar\804c2efc0a7821a5b1423498a5e022e8\AndroidManifest.xml:17:1-22:12
MERGED from [com.android.support:support-compat:27.1.1] C:\Users\Beatriz\.gradle\caches\transforms-1\files-1.1\support-compat-27.1.1.aar\5ecafbddfe839e54c76c0ae200a5ed99\AndroidManifest.xml:17:1-22:12
MERGED from [com.facebook.fresco:fresco:1.10.0] C:\Users\Beatriz\.gradle\caches\transforms-1\files-1.1\fresco-1.10.0.aar\85944c54d1a34cabdb51792e14afe8c1\AndroidManifest.xml:2:1-9:12
MERGED from [com.facebook.fresco:imagepipeline-okhttp3:1.10.0] C:\Users\Beatriz\.gradle\caches\transforms-1\files-1.1\imagepipeline-okhttp3-1.10.0.aar\b167494fa31e00036655b9f32d673596\AndroidManifest.xml:2:1-9:12
MERGED from [com.facebook.fresco:drawee:1.10.0] C:\Users\Beatriz\.gradle\caches\transforms-1\files-1.1\drawee-1.10.0.aar\daff67b2a3cf366603033bfb02bb938f\AndroidManifest.xml:2:1-9:12
MERGED from [com.facebook.fresco:imagepipeline:1.10.0] C:\Users\Beatriz\.gradle\caches\transforms-1\files-1.1\imagepipeline-1.10.0.aar\670db29556b257da3b54f5801e13dc00\AndroidManifest.xml:2:1-9:12
MERGED from [com.facebook.fresco:imagepipeline-base:1.10.0] C:\Users\Beatriz\.gradle\caches\transforms-1\files-1.1\imagepipeline-base-1.10.0.aar\adc195ef063550c5e26bb6952b211a34\AndroidManifest.xml:2:1-9:12
MERGED from [com.facebook.soloader:soloader:0.5.1] C:\Users\Beatriz\.gradle\caches\transforms-1\files-1.1\soloader-0.5.1.aar\ca5d34d7e66ed26c83f35389d62ca84f\AndroidManifest.xml:2:1-13:12
MERGED from [org.webkit:android-jsc:r174650] C:\Users\Beatriz\.gradle\caches\transforms-1\files-1.1\android-jsc-r174650.aar\d156e63017826a34dbb7c741a2205794\AndroidManifest.xml:1:1-3:12
MERGED from [android.arch.lifecycle:livedata-core:1.1.0] C:\Users\Beatriz\.gradle\caches\transforms-1\files-1.1\livedata-core-1.1.0.aar\a51e88a018e7fe38680208dcc72f885f\AndroidManifest.xml:17:1-22:12
MERGED from [android.arch.lifecycle:viewmodel:1.1.0] C:\Users\Beatriz\.gradle\caches\transforms-1\files-1.1\viewmodel-1.1.0.aar\6a0136a3ee7a6d9749066faac8f89725\AndroidManifest.xml:17:1-22:12
MERGED from [com.facebook.fresco:fbcore:1.10.0] C:\Users\Beatriz\.gradle\caches\transforms-1\files-1.1\fbcore-1.10.0.aar\45555316e2d384bb07ca8fe8c01b3cf3\AndroidManifest.xml:2:1-9:12
MERGED from [android.arch.lifecycle:runtime:1.1.0] C:\Users\Beatriz\.gradle\caches\transforms-1\files-1.1\runtime-1.1.0.aar\8a565eba4f3c9cebdecff6e1a1c9440c\AndroidManifest.xml:17:1-22:12
MERGED from [android.arch.core:runtime:1.1.0] C:\Users\Beatriz\.gradle\caches\transforms-1\files-1.1\runtime-1.1.0.aar\0d228a968f4da6f77f577af2017bbe3e\AndroidManifest.xml:17:1-22:12
INJECTED from C:\Users\Beatriz\Awesome\android\app\src\main\AndroidManifest.xml:1:1-26:12
INJECTED from C:\Users\Beatriz\Awesome\android\app\src\main\AndroidManifest.xml:1:1-26:12
INJECTED from C:\Users\Beatriz\Awesome\android\app\src\main\AndroidManifest.xml:1:1-26:12
	package
		ADDED from C:\Users\Beatriz\Awesome\android\app\src\main\AndroidManifest.xml:2:5-26
		INJECTED from C:\Users\Beatriz\Awesome\android\app\src\main\AndroidManifest.xml
		INJECTED from C:\Users\Beatriz\Awesome\android\app\src\main\AndroidManifest.xml
	android:versionName
		INJECTED from C:\Users\Beatriz\Awesome\android\app\src\main\AndroidManifest.xml
		ADDED from C:\Users\Beatriz\Awesome\android\app\src\main\AndroidManifest.xml:1:1-26:12
		INJECTED from C:\Users\Beatriz\Awesome\android\app\src\main\AndroidManifest.xml
	android:versionCode
		INJECTED from C:\Users\Beatriz\Awesome\android\app\src\main\AndroidManifest.xml
		ADDED from C:\Users\Beatriz\Awesome\android\app\src\main\AndroidManifest.xml:1:1-26:12
		INJECTED from C:\Users\Beatriz\Awesome\android\app\src\main\AndroidManifest.xml
	xmlns:android
		ADDED from C:\Users\Beatriz\Awesome\android\app\src\main\AndroidManifest.xml:1:11-69
uses-permission#android.permission.INTERNET
ADDED from C:\Users\Beatriz\Awesome\android\app\src\main\AndroidManifest.xml:4:5-67
	android:name
		ADDED from C:\Users\Beatriz\Awesome\android\app\src\main\AndroidManifest.xml:4:22-64
uses-permission#android.permission.SYSTEM_ALERT_WINDOW
ADDED from C:\Users\Beatriz\Awesome\android\app\src\main\AndroidManifest.xml:5:5-77
MERGED from [com.facebook.react:react-native:0.57.4] C:\Users\Beatriz\.gradle\caches\transforms-1\files-1.1\react-native-0.57.4.aar\2e696ee0df86d0d80577d8bc5de5c22a\AndroidManifest.xml:11:5-78
MERGED from [com.facebook.react:react-native:0.57.4] C:\Users\Beatriz\.gradle\caches\transforms-1\files-1.1\react-native-0.57.4.aar\2e696ee0df86d0d80577d8bc5de5c22a\AndroidManifest.xml:11:5-78
	android:name
		ADDED from C:\Users\Beatriz\Awesome\android\app\src\main\AndroidManifest.xml:5:22-75
application
ADDED from C:\Users\Beatriz\Awesome\android\app\src\main\AndroidManifest.xml:7:5-24:19
MERGED from [com.facebook.react:react-native:0.57.4] C:\Users\Beatriz\.gradle\caches\transforms-1\files-1.1\react-native-0.57.4.aar\2e696ee0df86d0d80577d8bc5de5c22a\AndroidManifest.xml:13:5-20
MERGED from [com.facebook.react:react-native:0.57.4] C:\Users\Beatriz\.gradle\caches\transforms-1\files-1.1\react-native-0.57.4.aar\2e696ee0df86d0d80577d8bc5de5c22a\AndroidManifest.xml:13:5-20
MERGED from [com.facebook.soloader:soloader:0.5.1] C:\Users\Beatriz\.gradle\caches\transforms-1\files-1.1\soloader-0.5.1.aar\ca5d34d7e66ed26c83f35389d62ca84f\AndroidManifest.xml:11:5-20
MERGED from [com.facebook.soloader:soloader:0.5.1] C:\Users\Beatriz\.gradle\caches\transforms-1\files-1.1\soloader-0.5.1.aar\ca5d34d7e66ed26c83f35389d62ca84f\AndroidManifest.xml:11:5-20
MERGED from [org.webkit:android-jsc:r174650] C:\Users\Beatriz\.gradle\caches\transforms-1\files-1.1\android-jsc-r174650.aar\d156e63017826a34dbb7c741a2205794\AndroidManifest.xml:2:3-17
MERGED from [org.webkit:android-jsc:r174650] C:\Users\Beatriz\.gradle\caches\transforms-1\files-1.1\android-jsc-r174650.aar\d156e63017826a34dbb7c741a2205794\AndroidManifest.xml:2:3-17
	android:label
		ADDED from C:\Users\Beatriz\Awesome\android\app\src\main\AndroidManifest.xml:9:7-39
	android:icon
		ADDED from C:\Users\Beatriz\Awesome\android\app\src\main\AndroidManifest.xml:10:7-41
	android:allowBackup
		ADDED from C:\Users\Beatriz\Awesome\android\app\src\main\AndroidManifest.xml:11:7-34
	android:theme
		ADDED from C:\Users\Beatriz\Awesome\android\app\src\main\AndroidManifest.xml:12:7-38
	android:name
		ADDED from C:\Users\Beatriz\Awesome\android\app\src\main\AndroidManifest.xml:8:7-38
activity#com.awesome.MainActivity
ADDED from C:\Users\Beatriz\Awesome\android\app\src\main\AndroidManifest.xml:13:7-22:18
	android:label
		ADDED from C:\Users\Beatriz\Awesome\android\app\src\main\AndroidManifest.xml:15:9-41
	android:windowSoftInputMode
		ADDED from C:\Users\Beatriz\Awesome\android\app\src\main\AndroidManifest.xml:17:9-51
	android:configChanges
		ADDED from C:\Users\Beatriz\Awesome\android\app\src\main\AndroidManifest.xml:16:9-79
	android:name
		ADDED from C:\Users\Beatriz\Awesome\android\app\src\main\AndroidManifest.xml:14:9-37
intent-filter#action:name:android.intent.action.MAIN+category:name:android.intent.category.LAUNCHER
ADDED from C:\Users\Beatriz\Awesome\android\app\src\main\AndroidManifest.xml:18:9-21:25
action#android.intent.action.MAIN
ADDED from C:\Users\Beatriz\Awesome\android\app\src\main\AndroidManifest.xml:19:13-65
	android:name
		ADDED from C:\Users\Beatriz\Awesome\android\app\src\main\AndroidManifest.xml:19:21-62
category#android.intent.category.LAUNCHER
ADDED from C:\Users\Beatriz\Awesome\android\app\src\main\AndroidManifest.xml:20:13-73
	android:name
		ADDED from C:\Users\Beatriz\Awesome\android\app\src\main\AndroidManifest.xml:20:23-70
activity#com.facebook.react.devsupport.DevSettingsActivity
ADDED from C:\Users\Beatriz\Awesome\android\app\src\main\AndroidManifest.xml:23:7-84
	android:name
		ADDED from C:\Users\Beatriz\Awesome\android\app\src\main\AndroidManifest.xml:23:17-81
uses-sdk
INJECTED from C:\Users\Beatriz\Awesome\android\app\src\main\AndroidManifest.xml reason: use-sdk injection requested
INJECTED from C:\Users\Beatriz\Awesome\android\app\src\main\AndroidManifest.xml
INJECTED from C:\Users\Beatriz\Awesome\android\app\src\main\AndroidManifest.xml
MERGED from [com.facebook.react:react-native:0.57.4] C:\Users\Beatriz\.gradle\caches\transforms-1\files-1.1\react-native-0.57.4.aar\2e696ee0df86d0d80577d8bc5de5c22a\AndroidManifest.xml:7:5-9:41
MERGED from [com.facebook.react:react-native:0.57.4] C:\Users\Beatriz\.gradle\caches\transforms-1\files-1.1\react-native-0.57.4.aar\2e696ee0df86d0d80577d8bc5de5c22a\AndroidManifest.xml:7:5-9:41
MERGED from [com.android.support:appcompat-v7:27.1.1] C:\Users\Beatriz\.gradle\caches\transforms-1\files-1.1\appcompat-v7-27.1.1.aar\eb6a24ec45b2e40787a877323b7faab5\AndroidManifest.xml:20:5-44
MERGED from [com.android.support:appcompat-v7:27.1.1] C:\Users\Beatriz\.gradle\caches\transforms-1\files-1.1\appcompat-v7-27.1.1.aar\eb6a24ec45b2e40787a877323b7faab5\AndroidManifest.xml:20:5-44
MERGED from [com.android.support:support-fragment:27.1.1] C:\Users\Beatriz\.gradle\caches\transforms-1\files-1.1\support-fragment-27.1.1.aar\a6cf7ee31a325a8b77192625c6ea07e0\AndroidManifest.xml:20:5-44
MERGED from [com.android.support:support-fragment:27.1.1] C:\Users\Beatriz\.gradle\caches\transforms-1\files-1.1\support-fragment-27.1.1.aar\a6cf7ee31a325a8b77192625c6ea07e0\AndroidManifest.xml:20:5-44
MERGED from [com.android.support:animated-vector-drawable:27.1.1] C:\Users\Beatriz\.gradle\caches\transforms-1\files-1.1\animated-vector-drawable-27.1.1.aar\ad5b210fac6f3c148ea7fe8c1a7fb87a\AndroidManifest.xml:20:5-44
MERGED from [com.android.support:animated-vector-drawable:27.1.1] C:\Users\Beatriz\.gradle\caches\transforms-1\files-1.1\animated-vector-drawable-27.1.1.aar\ad5b210fac6f3c148ea7fe8c1a7fb87a\AndroidManifest.xml:20:5-44
MERGED from [com.android.support:support-core-ui:27.1.1] C:\Users\Beatriz\.gradle\caches\transforms-1\files-1.1\support-core-ui-27.1.1.aar\74cb8b5312610b26cb7b3588065e6cac\AndroidManifest.xml:20:5-44
MERGED from [com.android.support:support-core-ui:27.1.1] C:\Users\Beatriz\.gradle\caches\transforms-1\files-1.1\support-core-ui-27.1.1.aar\74cb8b5312610b26cb7b3588065e6cac\AndroidManifest.xml:20:5-44
MERGED from [com.android.support:support-core-utils:27.1.1] C:\Users\Beatriz\.gradle\caches\transforms-1\files-1.1\support-core-utils-27.1.1.aar\e4d9953429a5a39360f36f2e0b3b2b55\AndroidManifest.xml:20:5-44
MERGED from [com.android.support:support-core-utils:27.1.1] C:\Users\Beatriz\.gradle\caches\transforms-1\files-1.1\support-core-utils-27.1.1.aar\e4d9953429a5a39360f36f2e0b3b2b55\AndroidManifest.xml:20:5-44
MERGED from [com.android.support:support-vector-drawable:27.1.1] C:\Users\Beatriz\.gradle\caches\transforms-1\files-1.1\support-vector-drawable-27.1.1.aar\804c2efc0a7821a5b1423498a5e022e8\AndroidManifest.xml:20:5-44
MERGED from [com.android.support:support-vector-drawable:27.1.1] C:\Users\Beatriz\.gradle\caches\transforms-1\files-1.1\support-vector-drawable-27.1.1.aar\804c2efc0a7821a5b1423498a5e022e8\AndroidManifest.xml:20:5-44
MERGED from [com.android.support:support-compat:27.1.1] C:\Users\Beatriz\.gradle\caches\transforms-1\files-1.1\support-compat-27.1.1.aar\5ecafbddfe839e54c76c0ae200a5ed99\AndroidManifest.xml:20:5-44
MERGED from [com.android.support:support-compat:27.1.1] C:\Users\Beatriz\.gradle\caches\transforms-1\files-1.1\support-compat-27.1.1.aar\5ecafbddfe839e54c76c0ae200a5ed99\AndroidManifest.xml:20:5-44
MERGED from [com.facebook.fresco:fresco:1.10.0] C:\Users\Beatriz\.gradle\caches\transforms-1\files-1.1\fresco-1.10.0.aar\85944c54d1a34cabdb51792e14afe8c1\AndroidManifest.xml:5:5-7:41
MERGED from [com.facebook.fresco:fresco:1.10.0] C:\Users\Beatriz\.gradle\caches\transforms-1\files-1.1\fresco-1.10.0.aar\85944c54d1a34cabdb51792e14afe8c1\AndroidManifest.xml:5:5-7:41
MERGED from [com.facebook.fresco:imagepipeline-okhttp3:1.10.0] C:\Users\Beatriz\.gradle\caches\transforms-1\files-1.1\imagepipeline-okhttp3-1.10.0.aar\b167494fa31e00036655b9f32d673596\AndroidManifest.xml:5:5-7:41
MERGED from [com.facebook.fresco:imagepipeline-okhttp3:1.10.0] C:\Users\Beatriz\.gradle\caches\transforms-1\files-1.1\imagepipeline-okhttp3-1.10.0.aar\b167494fa31e00036655b9f32d673596\AndroidManifest.xml:5:5-7:41
MERGED from [com.facebook.fresco:drawee:1.10.0] C:\Users\Beatriz\.gradle\caches\transforms-1\files-1.1\drawee-1.10.0.aar\daff67b2a3cf366603033bfb02bb938f\AndroidManifest.xml:5:5-7:41
MERGED from [com.facebook.fresco:drawee:1.10.0] C:\Users\Beatriz\.gradle\caches\transforms-1\files-1.1\drawee-1.10.0.aar\daff67b2a3cf366603033bfb02bb938f\AndroidManifest.xml:5:5-7:41
MERGED from [com.facebook.fresco:imagepipeline:1.10.0] C:\Users\Beatriz\.gradle\caches\transforms-1\files-1.1\imagepipeline-1.10.0.aar\670db29556b257da3b54f5801e13dc00\AndroidManifest.xml:5:5-7:41
MERGED from [com.facebook.fresco:imagepipeline:1.10.0] C:\Users\Beatriz\.gradle\caches\transforms-1\files-1.1\imagepipeline-1.10.0.aar\670db29556b257da3b54f5801e13dc00\AndroidManifest.xml:5:5-7:41
MERGED from [com.facebook.fresco:imagepipeline-base:1.10.0] C:\Users\Beatriz\.gradle\caches\transforms-1\files-1.1\imagepipeline-base-1.10.0.aar\adc195ef063550c5e26bb6952b211a34\AndroidManifest.xml:5:5-7:41
MERGED from [com.facebook.fresco:imagepipeline-base:1.10.0] C:\Users\Beatriz\.gradle\caches\transforms-1\files-1.1\imagepipeline-base-1.10.0.aar\adc195ef063550c5e26bb6952b211a34\AndroidManifest.xml:5:5-7:41
MERGED from [com.facebook.soloader:soloader:0.5.1] C:\Users\Beatriz\.gradle\caches\transforms-1\files-1.1\soloader-0.5.1.aar\ca5d34d7e66ed26c83f35389d62ca84f\AndroidManifest.xml:7:5-9:41
MERGED from [com.facebook.soloader:soloader:0.5.1] C:\Users\Beatriz\.gradle\caches\transforms-1\files-1.1\soloader-0.5.1.aar\ca5d34d7e66ed26c83f35389d62ca84f\AndroidManifest.xml:7:5-9:41
MERGED from [android.arch.lifecycle:livedata-core:1.1.0] C:\Users\Beatriz\.gradle\caches\transforms-1\files-1.1\livedata-core-1.1.0.aar\a51e88a018e7fe38680208dcc72f885f\AndroidManifest.xml:20:5-44
MERGED from [android.arch.lifecycle:livedata-core:1.1.0] C:\Users\Beatriz\.gradle\caches\transforms-1\files-1.1\livedata-core-1.1.0.aar\a51e88a018e7fe38680208dcc72f885f\AndroidManifest.xml:20:5-44
MERGED from [android.arch.lifecycle:viewmodel:1.1.0] C:\Users\Beatriz\.gradle\caches\transforms-1\files-1.1\viewmodel-1.1.0.aar\6a0136a3ee7a6d9749066faac8f89725\AndroidManifest.xml:20:5-44
MERGED from [android.arch.lifecycle:viewmodel:1.1.0] C:\Users\Beatriz\.gradle\caches\transforms-1\files-1.1\viewmodel-1.1.0.aar\6a0136a3ee7a6d9749066faac8f89725\AndroidManifest.xml:20:5-44
MERGED from [com.facebook.fresco:fbcore:1.10.0] C:\Users\Beatriz\.gradle\caches\transforms-1\files-1.1\fbcore-1.10.0.aar\45555316e2d384bb07ca8fe8c01b3cf3\AndroidManifest.xml:5:5-7:41
MERGED from [com.facebook.fresco:fbcore:1.10.0] C:\Users\Beatriz\.gradle\caches\transforms-1\files-1.1\fbcore-1.10.0.aar\45555316e2d384bb07ca8fe8c01b3cf3\AndroidManifest.xml:5:5-7:41
MERGED from [android.arch.lifecycle:runtime:1.1.0] C:\Users\Beatriz\.gradle\caches\transforms-1\files-1.1\runtime-1.1.0.aar\8a565eba4f3c9cebdecff6e1a1c9440c\AndroidManifest.xml:20:5-44
MERGED from [android.arch.lifecycle:runtime:1.1.0] C:\Users\Beatriz\.gradle\caches\transforms-1\files-1.1\runtime-1.1.0.aar\8a565eba4f3c9cebdecff6e1a1c9440c\AndroidManifest.xml:20:5-44
MERGED from [android.arch.core:runtime:1.1.0] C:\Users\Beatriz\.gradle\caches\transforms-1\files-1.1\runtime-1.1.0.aar\0d228a968f4da6f77f577af2017bbe3e\AndroidManifest.xml:20:5-44
MERGED from [android.arch.core:runtime:1.1.0] C:\Users\Beatriz\.gradle\caches\transforms-1\files-1.1\runtime-1.1.0.aar\0d228a968f4da6f77f577af2017bbe3e\AndroidManifest.xml:20:5-44
INJECTED from C:\Users\Beatriz\Awesome\android\app\src\main\AndroidManifest.xml
INJECTED from C:\Users\Beatriz\Awesome\android\app\src\main\AndroidManifest.xml
	android:targetSdkVersion
		INJECTED from C:\Users\Beatriz\Awesome\android\app\src\main\AndroidManifest.xml
		ADDED from C:\Users\Beatriz\Awesome\android\app\src\main\AndroidManifest.xml
		INJECTED from C:\Users\Beatriz\Awesome\android\app\src\main\AndroidManifest.xml
	android:minSdkVersion
		INJECTED from C:\Users\Beatriz\Awesome\android\app\src\main\AndroidManifest.xml
		ADDED from C:\Users\Beatriz\Awesome\android\app\src\main\AndroidManifest.xml
		INJECTED from C:\Users\Beatriz\Awesome\android\app\src\main\AndroidManifest.xml
uses-permission#android.permission.WRITE_EXTERNAL_STORAGE
IMPLIED from C:\Users\Beatriz\Awesome\android\app\src\main\AndroidManifest.xml:1:1-26:12 reason: org.webkit.android_jsc has a targetSdkVersion < 4
uses-permission#android.permission.READ_PHONE_STATE
IMPLIED from C:\Users\Beatriz\Awesome\android\app\src\main\AndroidManifest.xml:1:1-26:12 reason: org.webkit.android_jsc has a targetSdkVersion < 4
uses-permission#android.permission.READ_EXTERNAL_STORAGE
IMPLIED from C:\Users\Beatriz\Awesome\android\app\src\main\AndroidManifest.xml:1:1-26:12 reason: org.webkit.android_jsc requested WRITE_EXTERNAL_STORAGE
