<?xml version="1.0" encoding="UTF-8"?>
<session version="1.0">
<refactoring comment="Rename resource &apos;vga_update/main&apos; to &apos;main.c&apos;" description="Rename resource &apos;main&apos;" flags="7" id="org.eclipse.ltk.core.refactoring.rename.resource" input="main" name="main.c" stamp="1615184985813" updateReferences="true"/>
</session>