+-----------------------------------------------------------------------------------------------------------------------------------------------------------------------------------------------------------------------------------------------------------------------------------------------------------------+
; Legal Partition Candidates                                                                                                                                                                                                                                                                                      ;
+------------------------------------------------------------------------------------------------------------+-------+----------------+--------------+----------------+--------+-----------------+---------------+-----------------+-------+----------------+--------------+------------------+-------------------+
; Hierarchy                                                                                                  ; Input ; Constant Input ; Unused Input ; Floating Input ; Output ; Constant Output ; Unused Output ; Floating Output ; Bidir ; Constant Bidir ; Unused Bidir ; Input only Bidir ; Output only Bidir ;
+------------------------------------------------------------------------------------------------------------+-------+----------------+--------------+----------------+--------+-----------------+---------------+-----------------+-------+----------------+--------------+------------------+-------------------+
; inst|rst_controller_002|alt_rst_req_sync_uq1                                                               ; 2     ; 1              ; 0            ; 1              ; 1      ; 1               ; 1             ; 1               ; 0     ; 0              ; 0            ; 0                ; 0                 ;
; inst|rst_controller_002|alt_rst_sync_uq1                                                                   ; 2     ; 0              ; 0            ; 0              ; 1      ; 0               ; 0             ; 0               ; 0     ; 0              ; 0            ; 0                ; 0                 ;
; inst|rst_controller_002                                                                                    ; 33    ; 30             ; 0            ; 30             ; 2      ; 30              ; 30            ; 30              ; 0     ; 0              ; 0            ; 0                ; 0                 ;
; inst|rst_controller_001|alt_rst_req_sync_uq1                                                               ; 2     ; 1              ; 0            ; 1              ; 1      ; 1               ; 1             ; 1               ; 0     ; 0              ; 0            ; 0                ; 0                 ;
; inst|rst_controller_001|alt_rst_sync_uq1                                                                   ; 2     ; 0              ; 0            ; 0              ; 1      ; 0               ; 0             ; 0               ; 0     ; 0              ; 0            ; 0                ; 0                 ;
; inst|rst_controller_001                                                                                    ; 33    ; 30             ; 0            ; 30             ; 1      ; 30              ; 30            ; 30              ; 0     ; 0              ; 0            ; 0                ; 0                 ;
; inst|rst_controller|alt_rst_req_sync_uq1                                                                   ; 2     ; 1              ; 0            ; 1              ; 1      ; 1               ; 1             ; 1               ; 0     ; 0              ; 0            ; 0                ; 0                 ;
; inst|rst_controller|alt_rst_sync_uq1                                                                       ; 2     ; 0              ; 0            ; 0              ; 1      ; 0               ; 0             ; 0               ; 0     ; 0              ; 0            ; 0                ; 0                 ;
; inst|rst_controller                                                                                        ; 33    ; 30             ; 0            ; 30             ; 1      ; 30              ; 30            ; 30              ; 0     ; 0              ; 0            ; 0                ; 0                 ;
; inst|irq_synchronizer_002                                                                                  ; 5     ; 0              ; 2            ; 0              ; 1      ; 0               ; 0             ; 0               ; 0     ; 0              ; 0            ; 0                ; 0                 ;
; inst|irq_synchronizer_001                                                                                  ; 5     ; 0              ; 2            ; 0              ; 1      ; 0               ; 0             ; 0               ; 0     ; 0              ; 0            ; 0                ; 0                 ;
; inst|irq_synchronizer                                                                                      ; 5     ; 0              ; 2            ; 0              ; 1      ; 0               ; 0             ; 0               ; 0     ; 0              ; 0            ; 0                ; 0                 ;
; inst|irq_mapper                                                                                            ; 5     ; 29             ; 2            ; 29             ; 32     ; 29              ; 29            ; 29              ; 0     ; 0              ; 0            ; 0                ; 0                 ;
; inst|mm_interconnect_1|avalon_st_adapter_004|error_adapter_0                                               ; 38    ; 1              ; 2            ; 1              ; 37     ; 1               ; 1             ; 1               ; 0     ; 0              ; 0            ; 0                ; 0                 ;
; inst|mm_interconnect_1|avalon_st_adapter_004                                                               ; 38    ; 0              ; 0            ; 0              ; 37     ; 0               ; 0             ; 0               ; 0     ; 0              ; 0            ; 0                ; 0                 ;
; inst|mm_interconnect_1|avalon_st_adapter_003|error_adapter_0                                               ; 38    ; 1              ; 2            ; 1              ; 37     ; 1               ; 1             ; 1               ; 0     ; 0              ; 0            ; 0                ; 0                 ;
; inst|mm_interconnect_1|avalon_st_adapter_003                                                               ; 38    ; 0              ; 0            ; 0              ; 37     ; 0               ; 0             ; 0               ; 0     ; 0              ; 0            ; 0                ; 0                 ;
; inst|mm_interconnect_1|avalon_st_adapter_002|error_adapter_0                                               ; 38    ; 1              ; 2            ; 1              ; 37     ; 1               ; 1             ; 1               ; 0     ; 0              ; 0            ; 0                ; 0                 ;
; inst|mm_interconnect_1|avalon_st_adapter_002                                                               ; 38    ; 0              ; 0            ; 0              ; 37     ; 0               ; 0             ; 0               ; 0     ; 0              ; 0            ; 0                ; 0                 ;
; inst|mm_interconnect_1|avalon_st_adapter_001|error_adapter_0                                               ; 38    ; 1              ; 2            ; 1              ; 37     ; 1               ; 1             ; 1               ; 0     ; 0              ; 0            ; 0                ; 0                 ;
; inst|mm_interconnect_1|avalon_st_adapter_001                                                               ; 38    ; 0              ; 0            ; 0              ; 37     ; 0               ; 0             ; 0               ; 0     ; 0              ; 0            ; 0                ; 0                 ;
; inst|mm_interconnect_1|avalon_st_adapter|error_adapter_0                                                   ; 38    ; 1              ; 2            ; 1              ; 37     ; 1               ; 1             ; 1               ; 0     ; 0              ; 0            ; 0                ; 0                 ;
; inst|mm_interconnect_1|avalon_st_adapter                                                                   ; 38    ; 0              ; 0            ; 0              ; 37     ; 0               ; 0             ; 0               ; 0     ; 0              ; 0            ; 0                ; 0                 ;
; inst|mm_interconnect_1|rsp_mux|arb|adder                                                                   ; 20    ; 10             ; 0            ; 10             ; 10     ; 10              ; 10            ; 10              ; 0     ; 0              ; 0            ; 0                ; 0                 ;
; inst|mm_interconnect_1|rsp_mux|arb                                                                         ; 9     ; 0              ; 4            ; 0              ; 5      ; 0               ; 0             ; 0               ; 0     ; 0              ; 0            ; 0                ; 0                 ;
; inst|mm_interconnect_1|rsp_mux                                                                             ; 473   ; 0              ; 0            ; 0              ; 99     ; 0               ; 0             ; 0               ; 0     ; 0              ; 0            ; 0                ; 0                 ;
; inst|mm_interconnect_1|rsp_demux_004                                                                       ; 97    ; 1              ; 2            ; 1              ; 95     ; 1               ; 1             ; 1               ; 0     ; 0              ; 0            ; 0                ; 0                 ;
; inst|mm_interconnect_1|rsp_demux_003                                                                       ; 97    ; 1              ; 2            ; 1              ; 95     ; 1               ; 1             ; 1               ; 0     ; 0              ; 0            ; 0                ; 0                 ;
; inst|mm_interconnect_1|rsp_demux_002                                                                       ; 97    ; 1              ; 2            ; 1              ; 95     ; 1               ; 1             ; 1               ; 0     ; 0              ; 0            ; 0                ; 0                 ;
; inst|mm_interconnect_1|rsp_demux_001                                                                       ; 97    ; 1              ; 2            ; 1              ; 95     ; 1               ; 1             ; 1               ; 0     ; 0              ; 0            ; 0                ; 0                 ;
; inst|mm_interconnect_1|rsp_demux                                                                           ; 97    ; 1              ; 2            ; 1              ; 95     ; 1               ; 1             ; 1               ; 0     ; 0              ; 0            ; 0                ; 0                 ;
; inst|mm_interconnect_1|cmd_mux_004                                                                         ; 97    ; 0              ; 2            ; 0              ; 95     ; 0               ; 0             ; 0               ; 0     ; 0              ; 0            ; 0                ; 0                 ;
; inst|mm_interconnect_1|cmd_mux_003                                                                         ; 97    ; 0              ; 2            ; 0              ; 95     ; 0               ; 0             ; 0               ; 0     ; 0              ; 0            ; 0                ; 0                 ;
; inst|mm_interconnect_1|cmd_mux_002                                                                         ; 97    ; 0              ; 2            ; 0              ; 95     ; 0               ; 0             ; 0               ; 0     ; 0              ; 0            ; 0                ; 0                 ;
; inst|mm_interconnect_1|cmd_mux_001                                                                         ; 97    ; 0              ; 2            ; 0              ; 95     ; 0               ; 0             ; 0               ; 0     ; 0              ; 0            ; 0                ; 0                 ;
; inst|mm_interconnect_1|cmd_mux                                                                             ; 97    ; 0              ; 2            ; 0              ; 95     ; 0               ; 0             ; 0               ; 0     ; 0              ; 0            ; 0                ; 0                 ;
; inst|mm_interconnect_1|cmd_demux                                                                           ; 105   ; 25             ; 2            ; 25             ; 471    ; 25              ; 25            ; 25              ; 0     ; 0              ; 0            ; 0                ; 0                 ;
; inst|mm_interconnect_1|slow_peripheral_bridges_m0_limiter                                                  ; 192   ; 0              ; 0            ; 0              ; 194    ; 0               ; 0             ; 0               ; 0     ; 0              ; 0            ; 0                ; 0                 ;
; inst|mm_interconnect_1|router_005|the_default_decode                                                       ; 0     ; 5              ; 0            ; 5              ; 5      ; 5               ; 5             ; 5               ; 0     ; 0              ; 0            ; 0                ; 0                 ;
; inst|mm_interconnect_1|router_005                                                                          ; 92    ; 0              ; 2            ; 0              ; 95     ; 0               ; 0             ; 0               ; 0     ; 0              ; 0            ; 0                ; 0                 ;
; inst|mm_interconnect_1|router_004|the_default_decode                                                       ; 0     ; 5              ; 0            ; 5              ; 5      ; 5               ; 5             ; 5               ; 0     ; 0              ; 0            ; 0                ; 0                 ;
; inst|mm_interconnect_1|router_004                                                                          ; 92    ; 0              ; 2            ; 0              ; 95     ; 0               ; 0             ; 0               ; 0     ; 0              ; 0            ; 0                ; 0                 ;
; inst|mm_interconnect_1|router_003|the_default_decode                                                       ; 0     ; 5              ; 0            ; 5              ; 5      ; 5               ; 5             ; 5               ; 0     ; 0              ; 0            ; 0                ; 0                 ;
; inst|mm_interconnect_1|router_003                                                                          ; 92    ; 0              ; 2            ; 0              ; 95     ; 0               ; 0             ; 0               ; 0     ; 0              ; 0            ; 0                ; 0                 ;
; inst|mm_interconnect_1|router_002|the_default_decode                                                       ; 0     ; 5              ; 0            ; 5              ; 5      ; 5               ; 5             ; 5               ; 0     ; 0              ; 0            ; 0                ; 0                 ;
; inst|mm_interconnect_1|router_002                                                                          ; 92    ; 0              ; 2            ; 0              ; 95     ; 0               ; 0             ; 0               ; 0     ; 0              ; 0            ; 0                ; 0                 ;
; inst|mm_interconnect_1|router_001|the_default_decode                                                       ; 0     ; 5              ; 0            ; 5              ; 5      ; 5               ; 5             ; 5               ; 0     ; 0              ; 0            ; 0                ; 0                 ;
; inst|mm_interconnect_1|router_001                                                                          ; 92    ; 0              ; 2            ; 0              ; 95     ; 0               ; 0             ; 0               ; 0     ; 0              ; 0            ; 0                ; 0                 ;
; inst|mm_interconnect_1|router|the_default_decode                                                           ; 0     ; 8              ; 0            ; 8              ; 8      ; 8               ; 8             ; 8               ; 0     ; 0              ; 0            ; 0                ; 0                 ;
; inst|mm_interconnect_1|router                                                                              ; 92    ; 0              ; 5            ; 0              ; 95     ; 0               ; 0             ; 0               ; 0     ; 0              ; 0            ; 0                ; 0                 ;
; inst|mm_interconnect_1|timer_0_s1_agent_rsp_fifo                                                           ; 132   ; 39             ; 0            ; 39             ; 91     ; 39              ; 39            ; 39              ; 0     ; 0              ; 0            ; 0                ; 0                 ;
; inst|mm_interconnect_1|timer_0_s1_agent|uncompressor                                                       ; 26    ; 1              ; 0            ; 1              ; 24     ; 1               ; 1             ; 1               ; 0     ; 0              ; 0            ; 0                ; 0                 ;
; inst|mm_interconnect_1|timer_0_s1_agent                                                                    ; 262   ; 39             ; 42           ; 39             ; 272    ; 39              ; 39            ; 39              ; 0     ; 0              ; 0            ; 0                ; 0                 ;
; inst|mm_interconnect_1|button_pio_s1_agent_rsp_fifo                                                        ; 132   ; 39             ; 0            ; 39             ; 91     ; 39              ; 39            ; 39              ; 0     ; 0              ; 0            ; 0                ; 0                 ;
; inst|mm_interconnect_1|button_pio_s1_agent|uncompressor                                                    ; 26    ; 1              ; 0            ; 1              ; 24     ; 1               ; 1             ; 1               ; 0     ; 0              ; 0            ; 0                ; 0                 ;
; inst|mm_interconnect_1|button_pio_s1_agent                                                                 ; 262   ; 39             ; 42           ; 39             ; 272    ; 39              ; 39            ; 39              ; 0     ; 0              ; 0            ; 0                ; 0                 ;
; inst|mm_interconnect_1|led_pio_s1_agent_rsp_fifo                                                           ; 132   ; 39             ; 0            ; 39             ; 91     ; 39              ; 39            ; 39              ; 0     ; 0              ; 0            ; 0                ; 0                 ;
; inst|mm_interconnect_1|led_pio_s1_agent|uncompressor                                                       ; 26    ; 1              ; 0            ; 1              ; 24     ; 1               ; 1             ; 1               ; 0     ; 0              ; 0            ; 0                ; 0                 ;
; inst|mm_interconnect_1|led_pio_s1_agent                                                                    ; 262   ; 39             ; 42           ; 39             ; 272    ; 39              ; 39            ; 39              ; 0     ; 0              ; 0            ; 0                ; 0                 ;
; inst|mm_interconnect_1|sysid_control_slave_agent_rsp_fifo                                                  ; 132   ; 39             ; 0            ; 39             ; 91     ; 39              ; 39            ; 39              ; 0     ; 0              ; 0            ; 0                ; 0                 ;
; inst|mm_interconnect_1|sysid_control_slave_agent|uncompressor                                              ; 26    ; 1              ; 0            ; 1              ; 24     ; 1               ; 1             ; 1               ; 0     ; 0              ; 0            ; 0                ; 0                 ;
; inst|mm_interconnect_1|sysid_control_slave_agent                                                           ; 262   ; 39             ; 42           ; 39             ; 272    ; 39              ; 39            ; 39              ; 0     ; 0              ; 0            ; 0                ; 0                 ;
; inst|mm_interconnect_1|jtag_uart_0_avalon_jtag_slave_agent_rsp_fifo                                        ; 132   ; 39             ; 0            ; 39             ; 91     ; 39              ; 39            ; 39              ; 0     ; 0              ; 0            ; 0                ; 0                 ;
; inst|mm_interconnect_1|jtag_uart_0_avalon_jtag_slave_agent|uncompressor                                    ; 26    ; 1              ; 0            ; 1              ; 24     ; 1               ; 1             ; 1               ; 0     ; 0              ; 0            ; 0                ; 0                 ;
; inst|mm_interconnect_1|jtag_uart_0_avalon_jtag_slave_agent                                                 ; 262   ; 39             ; 42           ; 39             ; 272    ; 39              ; 39            ; 39              ; 0     ; 0              ; 0            ; 0                ; 0                 ;
; inst|mm_interconnect_1|slow_peripheral_bridges_m0_agent                                                    ; 152   ; 35             ; 63           ; 35             ; 124    ; 35              ; 35            ; 35              ; 0     ; 0              ; 0            ; 0                ; 0                 ;
; inst|mm_interconnect_1|timer_0_s1_translator                                                               ; 79    ; 22             ; 28           ; 22             ; 55     ; 22              ; 22            ; 22              ; 0     ; 0              ; 0            ; 0                ; 0                 ;
; inst|mm_interconnect_1|button_pio_s1_translator                                                            ; 95    ; 6              ; 13           ; 6              ; 70     ; 6               ; 6             ; 6               ; 0     ; 0              ; 0            ; 0                ; 0                 ;
; inst|mm_interconnect_1|led_pio_s1_translator                                                               ; 95    ; 6              ; 13           ; 6              ; 70     ; 6               ; 6             ; 6               ; 0     ; 0              ; 0            ; 0                ; 0                 ;
; inst|mm_interconnect_1|sysid_control_slave_translator                                                      ; 95    ; 6              ; 11           ; 6              ; 35     ; 6               ; 6             ; 6               ; 0     ; 0              ; 0            ; 0                ; 0                 ;
; inst|mm_interconnect_1|jtag_uart_0_avalon_jtag_slave_translator                                            ; 95    ; 5              ; 14           ; 5              ; 70     ; 5               ; 5             ; 5               ; 0     ; 0              ; 0            ; 0                ; 0                 ;
; inst|mm_interconnect_1|slow_peripheral_bridges_m0_translator                                               ; 94    ; 12             ; 2            ; 12             ; 89     ; 12              ; 12            ; 12              ; 0     ; 0              ; 0            ; 0                ; 0                 ;
; inst|mm_interconnect_1                                                                                     ; 197   ; 0              ; 0            ; 0              ; 164    ; 0               ; 0             ; 0               ; 0     ; 0              ; 0            ; 0                ; 0                 ;
; inst|mm_interconnect_0|avalon_st_adapter_005|error_adapter_0                                               ; 38    ; 1              ; 2            ; 1              ; 37     ; 1               ; 1             ; 1               ; 0     ; 0              ; 0            ; 0                ; 0                 ;
; inst|mm_interconnect_0|avalon_st_adapter_005                                                               ; 38    ; 0              ; 0            ; 0              ; 37     ; 0               ; 0             ; 0               ; 0     ; 0              ; 0            ; 0                ; 0                 ;
; inst|mm_interconnect_0|avalon_st_adapter_004|error_adapter_0                                               ; 38    ; 1              ; 2            ; 1              ; 37     ; 1               ; 1             ; 1               ; 0     ; 0              ; 0            ; 0                ; 0                 ;
; inst|mm_interconnect_0|avalon_st_adapter_004                                                               ; 38    ; 0              ; 0            ; 0              ; 37     ; 0               ; 0             ; 0               ; 0     ; 0              ; 0            ; 0                ; 0                 ;
; inst|mm_interconnect_0|avalon_st_adapter_003|error_adapter_0                                               ; 38    ; 1              ; 2            ; 1              ; 37     ; 1               ; 1             ; 1               ; 0     ; 0              ; 0            ; 0                ; 0                 ;
; inst|mm_interconnect_0|avalon_st_adapter_003                                                               ; 38    ; 0              ; 0            ; 0              ; 37     ; 0               ; 0             ; 0               ; 0     ; 0              ; 0            ; 0                ; 0                 ;
; inst|mm_interconnect_0|avalon_st_adapter_002|error_adapter_0                                               ; 38    ; 1              ; 2            ; 1              ; 37     ; 1               ; 1             ; 1               ; 0     ; 0              ; 0            ; 0                ; 0                 ;
; inst|mm_interconnect_0|avalon_st_adapter_002                                                               ; 38    ; 0              ; 0            ; 0              ; 37     ; 0               ; 0             ; 0               ; 0     ; 0              ; 0            ; 0                ; 0                 ;
; inst|mm_interconnect_0|avalon_st_adapter_001|error_adapter_0                                               ; 38    ; 1              ; 2            ; 1              ; 37     ; 1               ; 1             ; 1               ; 0     ; 0              ; 0            ; 0                ; 0                 ;
; inst|mm_interconnect_0|avalon_st_adapter_001                                                               ; 38    ; 0              ; 0            ; 0              ; 37     ; 0               ; 0             ; 0               ; 0     ; 0              ; 0            ; 0                ; 0                 ;
; inst|mm_interconnect_0|avalon_st_adapter|error_adapter_0                                                   ; 38    ; 1              ; 2            ; 1              ; 37     ; 1               ; 1             ; 1               ; 0     ; 0              ; 0            ; 0                ; 0                 ;
; inst|mm_interconnect_0|avalon_st_adapter                                                                   ; 38    ; 0              ; 0            ; 0              ; 37     ; 0               ; 0             ; 0               ; 0     ; 0              ; 0            ; 0                ; 0                 ;
; inst|mm_interconnect_0|crosser_001|clock_xer|out_to_in_synchronizer                                        ; 3     ; 0              ; 0            ; 0              ; 1      ; 0               ; 0             ; 0               ; 0     ; 0              ; 0            ; 0                ; 0                 ;
; inst|mm_interconnect_0|crosser_001|clock_xer|in_to_out_synchronizer                                        ; 3     ; 0              ; 0            ; 0              ; 1      ; 0               ; 0             ; 0               ; 0     ; 0              ; 0            ; 0                ; 0                 ;
; inst|mm_interconnect_0|crosser_001|clock_xer                                                               ; 115   ; 0              ; 0            ; 0              ; 111    ; 0               ; 0             ; 0               ; 0     ; 0              ; 0            ; 0                ; 0                 ;
; inst|mm_interconnect_0|crosser_001                                                                         ; 117   ; 2              ; 0            ; 2              ; 111    ; 2               ; 2             ; 2               ; 0     ; 0              ; 0            ; 0                ; 0                 ;
; inst|mm_interconnect_0|crosser|clock_xer|out_to_in_synchronizer                                            ; 3     ; 0              ; 0            ; 0              ; 1      ; 0               ; 0             ; 0               ; 0     ; 0              ; 0            ; 0                ; 0                 ;
; inst|mm_interconnect_0|crosser|clock_xer|in_to_out_synchronizer                                            ; 3     ; 0              ; 0            ; 0              ; 1      ; 0               ; 0             ; 0               ; 0     ; 0              ; 0            ; 0                ; 0                 ;
; inst|mm_interconnect_0|crosser|clock_xer                                                                   ; 115   ; 0              ; 0            ; 0              ; 111    ; 0               ; 0             ; 0               ; 0     ; 0              ; 0            ; 0                ; 0                 ;
; inst|mm_interconnect_0|crosser                                                                             ; 117   ; 2              ; 0            ; 2              ; 111    ; 2               ; 2             ; 2               ; 0     ; 0              ; 0            ; 0                ; 0                 ;
; inst|mm_interconnect_0|rsp_mux_001|arb|adder                                                               ; 12    ; 6              ; 0            ; 6              ; 6      ; 6               ; 6             ; 6               ; 0     ; 0              ; 0            ; 0                ; 0                 ;
; inst|mm_interconnect_0|rsp_mux_001|arb                                                                     ; 7     ; 0              ; 4            ; 0              ; 3      ; 0               ; 0             ; 0               ; 0     ; 0              ; 0            ; 0                ; 0                 ;
; inst|mm_interconnect_0|rsp_mux_001                                                                         ; 333   ; 0              ; 0            ; 0              ; 113    ; 0               ; 0             ; 0               ; 0     ; 0              ; 0            ; 0                ; 0                 ;
; inst|mm_interconnect_0|rsp_mux|arb|adder                                                                   ; 24    ; 12             ; 0            ; 12             ; 12     ; 12              ; 12            ; 12              ; 0     ; 0              ; 0            ; 0                ; 0                 ;
; inst|mm_interconnect_0|rsp_mux|arb                                                                         ; 10    ; 0              ; 4            ; 0              ; 6      ; 0               ; 0             ; 0               ; 0     ; 0              ; 0            ; 0                ; 0                 ;
; inst|mm_interconnect_0|rsp_mux                                                                             ; 663   ; 0              ; 0            ; 0              ; 116    ; 0               ; 0             ; 0               ; 0     ; 0              ; 0            ; 0                ; 0                 ;
; inst|mm_interconnect_0|rsp_demux_005                                                                       ; 114   ; 4              ; 2            ; 4              ; 221    ; 4               ; 4             ; 4               ; 0     ; 0              ; 0            ; 0                ; 0                 ;
; inst|mm_interconnect_0|rsp_demux_004                                                                       ; 113   ; 1              ; 2            ; 1              ; 111    ; 1               ; 1             ; 1               ; 0     ; 0              ; 0            ; 0                ; 0                 ;
; inst|mm_interconnect_0|rsp_demux_003                                                                       ; 113   ; 1              ; 2            ; 1              ; 111    ; 1               ; 1             ; 1               ; 0     ; 0              ; 0            ; 0                ; 0                 ;
; inst|mm_interconnect_0|rsp_demux_002                                                                       ; 114   ; 4              ; 2            ; 4              ; 221    ; 4               ; 4             ; 4               ; 0     ; 0              ; 0            ; 0                ; 0                 ;
; inst|mm_interconnect_0|rsp_demux_001                                                                       ; 114   ; 4              ; 2            ; 4              ; 221    ; 4               ; 4             ; 4               ; 0     ; 0              ; 0            ; 0                ; 0                 ;
; inst|mm_interconnect_0|rsp_demux                                                                           ; 113   ; 1              ; 2            ; 1              ; 111    ; 1               ; 1             ; 1               ; 0     ; 0              ; 0            ; 0                ; 0                 ;
; inst|mm_interconnect_0|cmd_mux_005|arb|adder                                                               ; 8     ; 2              ; 0            ; 2              ; 4      ; 2               ; 2             ; 2               ; 0     ; 0              ; 0            ; 0                ; 0                 ;
; inst|mm_interconnect_0|cmd_mux_005|arb                                                                     ; 6     ; 0              ; 1            ; 0              ; 2      ; 0               ; 0             ; 0               ; 0     ; 0              ; 0            ; 0                ; 0                 ;
; inst|mm_interconnect_0|cmd_mux_005                                                                         ; 223   ; 0              ; 0            ; 0              ; 112    ; 0               ; 0             ; 0               ; 0     ; 0              ; 0            ; 0                ; 0                 ;
; inst|mm_interconnect_0|cmd_mux_004                                                                         ; 113   ; 0              ; 2            ; 0              ; 111    ; 0               ; 0             ; 0               ; 0     ; 0              ; 0            ; 0                ; 0                 ;
; inst|mm_interconnect_0|cmd_mux_003                                                                         ; 113   ; 0              ; 2            ; 0              ; 111    ; 0               ; 0             ; 0               ; 0     ; 0              ; 0            ; 0                ; 0                 ;
; inst|mm_interconnect_0|cmd_mux_002|arb|adder                                                               ; 8     ; 2              ; 0            ; 2              ; 4      ; 2               ; 2             ; 2               ; 0     ; 0              ; 0            ; 0                ; 0                 ;
; inst|mm_interconnect_0|cmd_mux_002|arb                                                                     ; 6     ; 0              ; 1            ; 0              ; 2      ; 0               ; 0             ; 0               ; 0     ; 0              ; 0            ; 0                ; 0                 ;
; inst|mm_interconnect_0|cmd_mux_002                                                                         ; 223   ; 0              ; 0            ; 0              ; 112    ; 0               ; 0             ; 0               ; 0     ; 0              ; 0            ; 0                ; 0                 ;
; inst|mm_interconnect_0|cmd_mux_001|arb|adder                                                               ; 8     ; 2              ; 0            ; 2              ; 4      ; 2               ; 2             ; 2               ; 0     ; 0              ; 0            ; 0                ; 0                 ;
; inst|mm_interconnect_0|cmd_mux_001|arb                                                                     ; 6     ; 0              ; 1            ; 0              ; 2      ; 0               ; 0             ; 0               ; 0     ; 0              ; 0            ; 0                ; 0                 ;
; inst|mm_interconnect_0|cmd_mux_001                                                                         ; 223   ; 0              ; 0            ; 0              ; 112    ; 0               ; 0             ; 0               ; 0     ; 0              ; 0            ; 0                ; 0                 ;
; inst|mm_interconnect_0|cmd_mux                                                                             ; 113   ; 0              ; 2            ; 0              ; 111    ; 0               ; 0             ; 0               ; 0     ; 0              ; 0            ; 0                ; 0                 ;
; inst|mm_interconnect_0|cmd_demux_001                                                                       ; 120   ; 9              ; 5            ; 9              ; 331    ; 9               ; 9             ; 9               ; 0     ; 0              ; 0            ; 0                ; 0                 ;
; inst|mm_interconnect_0|cmd_demux                                                                           ; 123   ; 36             ; 2            ; 36             ; 661    ; 36              ; 36            ; 36              ; 0     ; 0              ; 0            ; 0                ; 0                 ;
; inst|mm_interconnect_0|nios2_cpu_instruction_master_limiter                                                ; 224   ; 0              ; 0            ; 0              ; 227    ; 0               ; 0             ; 0               ; 0     ; 0              ; 0            ; 0                ; 0                 ;
; inst|mm_interconnect_0|nios2_cpu_data_master_limiter                                                       ; 224   ; 0              ; 0            ; 0              ; 227    ; 0               ; 0             ; 0               ; 0     ; 0              ; 0            ; 0                ; 0                 ;
; inst|mm_interconnect_0|router_007|the_default_decode                                                       ; 0     ; 6              ; 0            ; 6              ; 6      ; 6               ; 6             ; 6               ; 0     ; 0              ; 0            ; 0                ; 0                 ;
; inst|mm_interconnect_0|router_007                                                                          ; 107   ; 0              ; 2            ; 0              ; 111    ; 0               ; 0             ; 0               ; 0     ; 0              ; 0            ; 0                ; 0                 ;
; inst|mm_interconnect_0|router_006|the_default_decode                                                       ; 0     ; 6              ; 0            ; 6              ; 6      ; 6               ; 6             ; 6               ; 0     ; 0              ; 0            ; 0                ; 0                 ;
; inst|mm_interconnect_0|router_006                                                                          ; 107   ; 0              ; 2            ; 0              ; 111    ; 0               ; 0             ; 0               ; 0     ; 0              ; 0            ; 0                ; 0                 ;
; inst|mm_interconnect_0|router_005|the_default_decode                                                       ; 0     ; 6              ; 0            ; 6              ; 6      ; 6               ; 6             ; 6               ; 0     ; 0              ; 0            ; 0                ; 0                 ;
; inst|mm_interconnect_0|router_005                                                                          ; 107   ; 0              ; 2            ; 0              ; 111    ; 0               ; 0             ; 0               ; 0     ; 0              ; 0            ; 0                ; 0                 ;
; inst|mm_interconnect_0|router_004|the_default_decode                                                       ; 0     ; 6              ; 0            ; 6              ; 6      ; 6               ; 6             ; 6               ; 0     ; 0              ; 0            ; 0                ; 0                 ;
; inst|mm_interconnect_0|router_004                                                                          ; 107   ; 0              ; 2            ; 0              ; 111    ; 0               ; 0             ; 0               ; 0     ; 0              ; 0            ; 0                ; 0                 ;
; inst|mm_interconnect_0|router_003|the_default_decode                                                       ; 0     ; 6              ; 0            ; 6              ; 6      ; 6               ; 6             ; 6               ; 0     ; 0              ; 0            ; 0                ; 0                 ;
; inst|mm_interconnect_0|router_003                                                                          ; 107   ; 0              ; 2            ; 0              ; 111    ; 0               ; 0             ; 0               ; 0     ; 0              ; 0            ; 0                ; 0                 ;
; inst|mm_interconnect_0|router_002|the_default_decode                                                       ; 0     ; 6              ; 0            ; 6              ; 6      ; 6               ; 6             ; 6               ; 0     ; 0              ; 0            ; 0                ; 0                 ;
; inst|mm_interconnect_0|router_002                                                                          ; 107   ; 0              ; 2            ; 0              ; 111    ; 0               ; 0             ; 0               ; 0     ; 0              ; 0            ; 0                ; 0                 ;
; inst|mm_interconnect_0|router_001|the_default_decode                                                       ; 0     ; 9              ; 0            ; 9              ; 9      ; 9               ; 9             ; 9               ; 0     ; 0              ; 0            ; 0                ; 0                 ;
; inst|mm_interconnect_0|router_001                                                                          ; 107   ; 0              ; 5            ; 0              ; 111    ; 0               ; 0             ; 0               ; 0     ; 0              ; 0            ; 0                ; 0                 ;
; inst|mm_interconnect_0|router|the_default_decode                                                           ; 0     ; 9              ; 0            ; 9              ; 9      ; 9               ; 9             ; 9               ; 0     ; 0              ; 0            ; 0                ; 0                 ;
; inst|mm_interconnect_0|router                                                                              ; 107   ; 0              ; 5            ; 0              ; 111    ; 0               ; 0             ; 0               ; 0     ; 0              ; 0            ; 0                ; 0                 ;
; inst|mm_interconnect_0|onchip_ram_s1_agent_rsp_fifo                                                        ; 147   ; 39             ; 0            ; 39             ; 106    ; 39              ; 39            ; 39              ; 0     ; 0              ; 0            ; 0                ; 0                 ;
; inst|mm_interconnect_0|onchip_ram_s1_agent|uncompressor                                                    ; 41    ; 1              ; 0            ; 1              ; 39     ; 1               ; 1             ; 1               ; 0     ; 0              ; 0            ; 0                ; 0                 ;
; inst|mm_interconnect_0|onchip_ram_s1_agent                                                                 ; 293   ; 39             ; 43           ; 39             ; 312    ; 39              ; 39            ; 39              ; 0     ; 0              ; 0            ; 0                ; 0                 ;
; inst|mm_interconnect_0|slow_peripheral_bridges_s0_agent_rsp_fifo                                           ; 147   ; 39             ; 0            ; 39             ; 106    ; 39              ; 39            ; 39              ; 0     ; 0              ; 0            ; 0                ; 0                 ;
; inst|mm_interconnect_0|slow_peripheral_bridges_s0_agent|uncompressor                                       ; 41    ; 1              ; 0            ; 1              ; 39     ; 1               ; 1             ; 1               ; 0     ; 0              ; 0            ; 0                ; 0                 ;
; inst|mm_interconnect_0|slow_peripheral_bridges_s0_agent                                                    ; 293   ; 39             ; 43           ; 39             ; 312    ; 39              ; 39            ; 39              ; 0     ; 0              ; 0            ; 0                ; 0                 ;
; inst|mm_interconnect_0|altpll_0_pll_slave_agent_rdata_fifo                                                 ; 79    ; 41             ; 0            ; 41             ; 36     ; 41              ; 41            ; 41              ; 0     ; 0              ; 0            ; 0                ; 0                 ;
; inst|mm_interconnect_0|altpll_0_pll_slave_agent_rsp_fifo                                                   ; 147   ; 39             ; 0            ; 39             ; 106    ; 39              ; 39            ; 39              ; 0     ; 0              ; 0            ; 0                ; 0                 ;
; inst|mm_interconnect_0|altpll_0_pll_slave_agent|uncompressor                                               ; 41    ; 1              ; 0            ; 1              ; 39     ; 1               ; 1             ; 1               ; 0     ; 0              ; 0            ; 0                ; 0                 ;
; inst|mm_interconnect_0|altpll_0_pll_slave_agent                                                            ; 293   ; 39             ; 43           ; 39             ; 312    ; 39              ; 39            ; 39              ; 0     ; 0              ; 0            ; 0                ; 0                 ;
; inst|mm_interconnect_0|nios2_cpu_debug_mem_slave_agent_rsp_fifo                                            ; 147   ; 39             ; 0            ; 39             ; 106    ; 39              ; 39            ; 39              ; 0     ; 0              ; 0            ; 0                ; 0                 ;
; inst|mm_interconnect_0|nios2_cpu_debug_mem_slave_agent|uncompressor                                        ; 41    ; 1              ; 0            ; 1              ; 39     ; 1               ; 1             ; 1               ; 0     ; 0              ; 0            ; 0                ; 0                 ;
; inst|mm_interconnect_0|nios2_cpu_debug_mem_slave_agent                                                     ; 293   ; 39             ; 43           ; 39             ; 312    ; 39              ; 39            ; 39              ; 0     ; 0              ; 0            ; 0                ; 0                 ;
; inst|mm_interconnect_0|onchip_flash_0_data_agent_rsp_fifo                                                  ; 147   ; 39             ; 0            ; 39             ; 106    ; 39              ; 39            ; 39              ; 0     ; 0              ; 0            ; 0                ; 0                 ;
; inst|mm_interconnect_0|onchip_flash_0_data_agent|uncompressor                                              ; 41    ; 1              ; 0            ; 1              ; 39     ; 1               ; 1             ; 1               ; 0     ; 0              ; 0            ; 0                ; 0                 ;
; inst|mm_interconnect_0|onchip_flash_0_data_agent                                                           ; 293   ; 39             ; 43           ; 39             ; 315    ; 39              ; 39            ; 39              ; 0     ; 0              ; 0            ; 0                ; 0                 ;
; inst|mm_interconnect_0|onchip_flash_0_csr_agent_rsp_fifo                                                   ; 147   ; 39             ; 0            ; 39             ; 106    ; 39              ; 39            ; 39              ; 0     ; 0              ; 0            ; 0                ; 0                 ;
; inst|mm_interconnect_0|onchip_flash_0_csr_agent|uncompressor                                               ; 41    ; 1              ; 0            ; 1              ; 39     ; 1               ; 1             ; 1               ; 0     ; 0              ; 0            ; 0                ; 0                 ;
; inst|mm_interconnect_0|onchip_flash_0_csr_agent                                                            ; 293   ; 39             ; 43           ; 39             ; 312    ; 39              ; 39            ; 39              ; 0     ; 0              ; 0            ; 0                ; 0                 ;
; inst|mm_interconnect_0|nios2_cpu_instruction_master_agent                                                  ; 178   ; 40             ; 79           ; 40             ; 139    ; 40              ; 40            ; 40              ; 0     ; 0              ; 0            ; 0                ; 0                 ;
; inst|mm_interconnect_0|nios2_cpu_data_master_agent                                                         ; 178   ; 40             ; 79           ; 40             ; 139    ; 40              ; 40            ; 40              ; 0     ; 0              ; 0            ; 0                ; 0                 ;
; inst|mm_interconnect_0|onchip_ram_s1_translator                                                            ; 105   ; 7              ; 12           ; 7              ; 83     ; 7               ; 7             ; 7               ; 0     ; 0              ; 0            ; 0                ; 0                 ;
; inst|mm_interconnect_0|slow_peripheral_bridges_s0_translator                                               ; 105   ; 4              ; 12           ; 4              ; 84     ; 4               ; 4             ; 4               ; 0     ; 0              ; 0            ; 0                ; 0                 ;
; inst|mm_interconnect_0|altpll_0_pll_slave_translator                                                       ; 105   ; 6              ; 20           ; 6              ; 70     ; 6               ; 6             ; 6               ; 0     ; 0              ; 0            ; 0                ; 0                 ;
; inst|mm_interconnect_0|nios2_cpu_debug_mem_slave_translator                                                ; 105   ; 5              ; 13           ; 5              ; 82     ; 5               ; 5             ; 5               ; 0     ; 0              ; 0            ; 0                ; 0                 ;
; inst|mm_interconnect_0|onchip_flash_0_data_translator                                                      ; 108   ; 4              ; 5            ; 4              ; 89     ; 4               ; 4             ; 4               ; 0     ; 0              ; 0            ; 0                ; 0                 ;
; inst|mm_interconnect_0|onchip_flash_0_csr_translator                                                       ; 105   ; 6              ; 21           ; 6              ; 69     ; 6               ; 6             ; 6               ; 0     ; 0              ; 0            ; 0                ; 0                 ;
; inst|mm_interconnect_0|nios2_cpu_instruction_master_translator                                             ; 106   ; 51             ; 2            ; 51             ; 99     ; 51              ; 51            ; 51              ; 0     ; 0              ; 0            ; 0                ; 0                 ;
; inst|mm_interconnect_0|nios2_cpu_data_master_translator                                                    ; 106   ; 12             ; 2            ; 12             ; 99     ; 12              ; 12            ; 12              ; 0     ; 0              ; 0            ; 0                ; 0                 ;
; inst|mm_interconnect_0                                                                                     ; 285   ; 0              ; 0            ; 0              ; 341    ; 0               ; 0             ; 0               ; 0     ; 0              ; 0            ; 0                ; 0                 ;
; inst|timer_0                                                                                               ; 23    ; 0              ; 0            ; 0              ; 17     ; 0               ; 0             ; 0               ; 0     ; 0              ; 0            ; 0                ; 0                 ;
; inst|sysid                                                                                                 ; 3     ; 13             ; 2            ; 13             ; 32     ; 13              ; 13            ; 13              ; 0     ; 0              ; 0            ; 0                ; 0                 ;
; inst|slow_peripheral_bridges|rsp_fifo|read_crosser|sync[5].u                                               ; 3     ; 0              ; 0            ; 0              ; 1      ; 0               ; 0             ; 0               ; 0     ; 0              ; 0            ; 0                ; 0                 ;
; inst|slow_peripheral_bridges|rsp_fifo|read_crosser|sync[4].u                                               ; 3     ; 0              ; 0            ; 0              ; 1      ; 0               ; 0             ; 0               ; 0     ; 0              ; 0            ; 0                ; 0                 ;
; inst|slow_peripheral_bridges|rsp_fifo|read_crosser|sync[3].u                                               ; 3     ; 0              ; 0            ; 0              ; 1      ; 0               ; 0             ; 0               ; 0     ; 0              ; 0            ; 0                ; 0                 ;
; inst|slow_peripheral_bridges|rsp_fifo|read_crosser|sync[2].u                                               ; 3     ; 0              ; 0            ; 0              ; 1      ; 0               ; 0             ; 0               ; 0     ; 0              ; 0            ; 0                ; 0                 ;
; inst|slow_peripheral_bridges|rsp_fifo|read_crosser|sync[1].u                                               ; 3     ; 0              ; 0            ; 0              ; 1      ; 0               ; 0             ; 0               ; 0     ; 0              ; 0            ; 0                ; 0                 ;
; inst|slow_peripheral_bridges|rsp_fifo|read_crosser|sync[0].u                                               ; 3     ; 0              ; 0            ; 0              ; 1      ; 0               ; 0             ; 0               ; 0     ; 0              ; 0            ; 0                ; 0                 ;
; inst|slow_peripheral_bridges|rsp_fifo|read_crosser                                                         ; 8     ; 0              ; 0            ; 0              ; 6      ; 0               ; 0             ; 0               ; 0     ; 0              ; 0            ; 0                ; 0                 ;
; inst|slow_peripheral_bridges|rsp_fifo|write_crosser|sync[5].u                                              ; 3     ; 0              ; 0            ; 0              ; 1      ; 0               ; 0             ; 0               ; 0     ; 0              ; 0            ; 0                ; 0                 ;
; inst|slow_peripheral_bridges|rsp_fifo|write_crosser|sync[4].u                                              ; 3     ; 0              ; 0            ; 0              ; 1      ; 0               ; 0             ; 0               ; 0     ; 0              ; 0            ; 0                ; 0                 ;
; inst|slow_peripheral_bridges|rsp_fifo|write_crosser|sync[3].u                                              ; 3     ; 0              ; 0            ; 0              ; 1      ; 0               ; 0             ; 0               ; 0     ; 0              ; 0            ; 0                ; 0                 ;
; inst|slow_peripheral_bridges|rsp_fifo|write_crosser|sync[2].u                                              ; 3     ; 0              ; 0            ; 0              ; 1      ; 0               ; 0             ; 0               ; 0     ; 0              ; 0            ; 0                ; 0                 ;
; inst|slow_peripheral_bridges|rsp_fifo|write_crosser|sync[1].u                                              ; 3     ; 0              ; 0            ; 0              ; 1      ; 0               ; 0             ; 0               ; 0     ; 0              ; 0            ; 0                ; 0                 ;
; inst|slow_peripheral_bridges|rsp_fifo|write_crosser|sync[0].u                                              ; 3     ; 0              ; 0            ; 0              ; 1      ; 0               ; 0             ; 0               ; 0     ; 0              ; 0            ; 0                ; 0                 ;
; inst|slow_peripheral_bridges|rsp_fifo|write_crosser                                                        ; 8     ; 0              ; 0            ; 0              ; 6      ; 0               ; 0             ; 0               ; 0     ; 0              ; 0            ; 0                ; 0                 ;
; inst|slow_peripheral_bridges|rsp_fifo                                                                      ; 113   ; 76             ; 0            ; 76             ; 40     ; 76              ; 76            ; 76              ; 0     ; 0              ; 0            ; 0                ; 0                 ;
; inst|slow_peripheral_bridges|cmd_fifo|read_crosser|sync[3].u                                               ; 3     ; 0              ; 0            ; 0              ; 1      ; 0               ; 0             ; 0               ; 0     ; 0              ; 0            ; 0                ; 0                 ;
; inst|slow_peripheral_bridges|cmd_fifo|read_crosser|sync[2].u                                               ; 3     ; 0              ; 0            ; 0              ; 1      ; 0               ; 0             ; 0               ; 0     ; 0              ; 0            ; 0                ; 0                 ;
; inst|slow_peripheral_bridges|cmd_fifo|read_crosser|sync[1].u                                               ; 3     ; 0              ; 0            ; 0              ; 1      ; 0               ; 0             ; 0               ; 0     ; 0              ; 0            ; 0                ; 0                 ;
; inst|slow_peripheral_bridges|cmd_fifo|read_crosser|sync[0].u                                               ; 3     ; 0              ; 0            ; 0              ; 1      ; 0               ; 0             ; 0               ; 0     ; 0              ; 0            ; 0                ; 0                 ;
; inst|slow_peripheral_bridges|cmd_fifo|read_crosser                                                         ; 6     ; 0              ; 0            ; 0              ; 4      ; 0               ; 0             ; 0               ; 0     ; 0              ; 0            ; 0                ; 0                 ;
; inst|slow_peripheral_bridges|cmd_fifo|write_crosser|sync[3].u                                              ; 3     ; 0              ; 0            ; 0              ; 1      ; 0               ; 0             ; 0               ; 0     ; 0              ; 0            ; 0                ; 0                 ;
; inst|slow_peripheral_bridges|cmd_fifo|write_crosser|sync[2].u                                              ; 3     ; 0              ; 0            ; 0              ; 1      ; 0               ; 0             ; 0               ; 0     ; 0              ; 0            ; 0                ; 0                 ;
; inst|slow_peripheral_bridges|cmd_fifo|write_crosser|sync[1].u                                              ; 3     ; 0              ; 0            ; 0              ; 1      ; 0               ; 0             ; 0               ; 0     ; 0              ; 0            ; 0                ; 0                 ;
; inst|slow_peripheral_bridges|cmd_fifo|write_crosser|sync[0].u                                              ; 3     ; 0              ; 0            ; 0              ; 1      ; 0               ; 0             ; 0               ; 0     ; 0              ; 0            ; 0                ; 0                 ;
; inst|slow_peripheral_bridges|cmd_fifo|write_crosser                                                        ; 6     ; 0              ; 0            ; 0              ; 4      ; 0               ; 0             ; 0               ; 0     ; 0              ; 0            ; 0                ; 0                 ;
; inst|slow_peripheral_bridges|cmd_fifo                                                                      ; 131   ; 75             ; 0            ; 75             ; 52     ; 75              ; 75            ; 75              ; 0     ; 0              ; 0            ; 0                ; 0                 ;
; inst|slow_peripheral_bridges                                                                               ; 88    ; 0              ; 0            ; 0              ; 84     ; 0               ; 0             ; 0               ; 0     ; 0              ; 0            ; 0                ; 0                 ;
; inst|onchip_ram|the_altsyncram|auto_generated                                                              ; 49    ; 0              ; 0            ; 0              ; 32     ; 0               ; 0             ; 0               ; 0     ; 0              ; 0            ; 0                ; 0                 ;
; inst|onchip_ram                                                                                            ; 53    ; 1              ; 1            ; 1              ; 32     ; 1               ; 1             ; 1               ; 0     ; 0              ; 0            ; 0                ; 0                 ;
; inst|onchip_flash_0|altera_onchip_flash_block                                                              ; 34    ; 2              ; 0            ; 2              ; 36     ; 2               ; 2             ; 2               ; 0     ; 0              ; 0            ; 0                ; 0                 ;
; inst|onchip_flash_0|avmm_data_controller|sector_convertor                                                  ; 3     ; 0              ; 0            ; 0              ; 3      ; 0               ; 0             ; 0               ; 0     ; 0              ; 0            ; 0                ; 0                 ;
; inst|onchip_flash_0|avmm_data_controller|sector_address_write_protection_checker                           ; 8     ; 0              ; 0            ; 0              ; 1      ; 0               ; 0             ; 0               ; 0     ; 0              ; 0            ; 0                ; 0                 ;
; inst|onchip_flash_0|avmm_data_controller|access_address_write_protection_checker                           ; 28    ; 0              ; 0            ; 0              ; 1      ; 0               ; 0             ; 0               ; 0     ; 0              ; 0            ; 0                ; 0                 ;
; inst|onchip_flash_0|avmm_data_controller|address_convertor                                                 ; 23    ; 0              ; 0            ; 0              ; 23     ; 0               ; 0             ; 0               ; 0     ; 0              ; 0            ; 0                ; 0                 ;
; inst|onchip_flash_0|avmm_data_controller|address_range_checker                                             ; 23    ; 6              ; 0            ; 6              ; 1      ; 6               ; 6             ; 6               ; 0     ; 0              ; 0            ; 0                ; 0                 ;
; inst|onchip_flash_0|avmm_data_controller                                                                   ; 125   ; 6              ; 3            ; 6              ; 76     ; 6               ; 6             ; 6               ; 0     ; 0              ; 0            ; 0                ; 0                 ;
; inst|onchip_flash_0|avmm_csr_controller                                                                    ; 47    ; 4              ; 4            ; 4              ; 64     ; 4               ; 4             ; 4               ; 0     ; 0              ; 0            ; 0                ; 0                 ;
; inst|onchip_flash_0                                                                                        ; 92    ; 0              ; 0            ; 0              ; 66     ; 0               ; 0             ; 0               ; 0     ; 0              ; 0            ; 0                ; 0                 ;
; inst|nios2_cpu|cpu                                                                                         ; 0     ; 0              ; 0            ; 0              ; 0      ; 0               ; 0             ; 0               ; 0     ; 0              ; 0            ; 0                ; 0                 ;
; inst|nios2_cpu                                                                                             ; 151   ; 0              ; 0            ; 0              ; 118    ; 0               ; 0             ; 0               ; 0     ; 0              ; 0            ; 0                ; 0                 ;
; inst|jtag_uart_0|the_nios2_control_jtag_uart_0_scfifo_r|rfifo|auto_generated|dpfifo|wr_ptr                 ; 4     ; 0              ; 0            ; 0              ; 6      ; 0               ; 0             ; 0               ; 0     ; 0              ; 0            ; 0                ; 0                 ;
; inst|jtag_uart_0|the_nios2_control_jtag_uart_0_scfifo_r|rfifo|auto_generated|dpfifo|rd_ptr_count           ; 4     ; 0              ; 0            ; 0              ; 6      ; 0               ; 0             ; 0               ; 0     ; 0              ; 0            ; 0                ; 0                 ;
; inst|jtag_uart_0|the_nios2_control_jtag_uart_0_scfifo_r|rfifo|auto_generated|dpfifo|FIFOram                ; 24    ; 0              ; 0            ; 0              ; 8      ; 0               ; 0             ; 0               ; 0     ; 0              ; 0            ; 0                ; 0                 ;
; inst|jtag_uart_0|the_nios2_control_jtag_uart_0_scfifo_r|rfifo|auto_generated|dpfifo|fifo_state|count_usedw ; 5     ; 0              ; 0            ; 0              ; 6      ; 0               ; 0             ; 0               ; 0     ; 0              ; 0            ; 0                ; 0                 ;
; inst|jtag_uart_0|the_nios2_control_jtag_uart_0_scfifo_r|rfifo|auto_generated|dpfifo|fifo_state             ; 5     ; 0              ; 0            ; 0              ; 8      ; 0               ; 0             ; 0               ; 0     ; 0              ; 0            ; 0                ; 0                 ;
; inst|jtag_uart_0|the_nios2_control_jtag_uart_0_scfifo_r|rfifo|auto_generated|dpfifo                        ; 13    ; 0              ; 0            ; 0              ; 16     ; 0               ; 0             ; 0               ; 0     ; 0              ; 0            ; 0                ; 0                 ;
; inst|jtag_uart_0|the_nios2_control_jtag_uart_0_scfifo_r|rfifo|auto_generated                               ; 12    ; 0              ; 0            ; 0              ; 16     ; 0               ; 0             ; 0               ; 0     ; 0              ; 0            ; 0                ; 0                 ;
; inst|jtag_uart_0|the_nios2_control_jtag_uart_0_scfifo_r                                                    ; 13    ; 0              ; 1            ; 0              ; 16     ; 0               ; 0             ; 0               ; 0     ; 0              ; 0            ; 0                ; 0                 ;
; inst|jtag_uart_0|the_nios2_control_jtag_uart_0_scfifo_w|wfifo|auto_generated|dpfifo|wr_ptr                 ; 4     ; 0              ; 0            ; 0              ; 6      ; 0               ; 0             ; 0               ; 0     ; 0              ; 0            ; 0                ; 0                 ;
; inst|jtag_uart_0|the_nios2_control_jtag_uart_0_scfifo_w|wfifo|auto_generated|dpfifo|rd_ptr_count           ; 4     ; 0              ; 0            ; 0              ; 6      ; 0               ; 0             ; 0               ; 0     ; 0              ; 0            ; 0                ; 0                 ;
; inst|jtag_uart_0|the_nios2_control_jtag_uart_0_scfifo_w|wfifo|auto_generated|dpfifo|FIFOram                ; 24    ; 0              ; 0            ; 0              ; 8      ; 0               ; 0             ; 0               ; 0     ; 0              ; 0            ; 0                ; 0                 ;
; inst|jtag_uart_0|the_nios2_control_jtag_uart_0_scfifo_w|wfifo|auto_generated|dpfifo|fifo_state|count_usedw ; 5     ; 0              ; 0            ; 0              ; 6      ; 0               ; 0             ; 0               ; 0     ; 0              ; 0            ; 0                ; 0                 ;
; inst|jtag_uart_0|the_nios2_control_jtag_uart_0_scfifo_w|wfifo|auto_generated|dpfifo|fifo_state             ; 5     ; 0              ; 0            ; 0              ; 8      ; 0               ; 0             ; 0               ; 0     ; 0              ; 0            ; 0                ; 0                 ;
; inst|jtag_uart_0|the_nios2_control_jtag_uart_0_scfifo_w|wfifo|auto_generated|dpfifo                        ; 13    ; 0              ; 0            ; 0              ; 16     ; 0               ; 0             ; 0               ; 0     ; 0              ; 0            ; 0                ; 0                 ;
; inst|jtag_uart_0|the_nios2_control_jtag_uart_0_scfifo_w|wfifo|auto_generated                               ; 12    ; 0              ; 0            ; 0              ; 16     ; 0               ; 0             ; 0               ; 0     ; 0              ; 0            ; 0                ; 0                 ;
; inst|jtag_uart_0|the_nios2_control_jtag_uart_0_scfifo_w                                                    ; 12    ; 0              ; 0            ; 0              ; 16     ; 0               ; 0             ; 0               ; 0     ; 0              ; 0            ; 0                ; 0                 ;
; inst|jtag_uart_0                                                                                           ; 38    ; 10             ; 23           ; 10             ; 34     ; 10              ; 10            ; 10              ; 0     ; 0              ; 0            ; 0                ; 0                 ;
; inst|button_pio                                                                                            ; 42    ; 0              ; 28           ; 0              ; 33     ; 0               ; 0             ; 0               ; 0     ; 0              ; 0            ; 0                ; 0                 ;
; inst|altpll_0|sd1                                                                                          ; 3     ; 1              ; 0            ; 1              ; 6      ; 1               ; 1             ; 1               ; 0     ; 0              ; 0            ; 0                ; 0                 ;
; inst|altpll_0|stdsync2|dffpipe3                                                                            ; 3     ; 0              ; 0            ; 0              ; 1      ; 0               ; 0             ; 0               ; 0     ; 0              ; 0            ; 0                ; 0                 ;
; inst|altpll_0|stdsync2                                                                                     ; 3     ; 0              ; 0            ; 0              ; 1      ; 0               ; 0             ; 0               ; 0     ; 0              ; 0            ; 0                ; 0                 ;
; inst|altpll_0                                                                                              ; 48    ; 40             ; 30           ; 40             ; 34     ; 40              ; 40            ; 40              ; 0     ; 0              ; 0            ; 0                ; 0                 ;
; inst|led_pio                                                                                               ; 38    ; 24             ; 24           ; 24             ; 40     ; 24              ; 24            ; 24              ; 0     ; 0              ; 0            ; 0                ; 0                 ;
; inst                                                                                                       ; 6     ; 0              ; 0            ; 0              ; 8      ; 0               ; 0             ; 0               ; 0     ; 0              ; 0            ; 0                ; 0                 ;
+------------------------------------------------------------------------------------------------------------+-------+----------------+--------------+----------------+--------+-----------------+---------------+-----------------+-------+----------------+--------------+------------------+-------------------+
