<?xml version="1.0" encoding="UTF-8" standalone="no"?>
<!-- Created with Inkscape (http://www.inkscape.org/) -->
<svg
   xmlns:dc="http://purl.org/dc/elements/1.1/"
   xmlns:cc="http://web.resource.org/cc/"
   xmlns:rdf="http://www.w3.org/1999/02/22-rdf-syntax-ns#"
   xmlns:svg="http://www.w3.org/2000/svg"
   xmlns="http://www.w3.org/2000/svg"
   xmlns:xlink="http://www.w3.org/1999/xlink"
   xmlns:sodipodi="http://sodipodi.sourceforge.net/DTD/sodipodi-0.dtd"
   xmlns:inkscape="http://www.inkscape.org/namespaces/inkscape"
   width="1350"
   height="1500"
   id="svg2"
   sodipodi:version="0.32"
   inkscape:version="0.45"
   version="1.0"
   sodipodi:docname="Zodiac-Pg2_dialog.svg"
   sodipodi:docbase="/home/morgul/Documents/Zodiac/Art/Finals"
   inkscape:output_extension="org.inkscape.output.svg.inkscape"
   inkscape:export-filename="/home/morgul/Documents/Zodiac/Art/Finals/Zodiac-Pg2_dialog.png"
   inkscape:export-xdpi="90"
   inkscape:export-ydpi="90"
   sodipodi:modified="true">
  <defs
     id="defs4" />
  <sodipodi:namedview
     id="base"
     pagecolor="#ffffff"
     bordercolor="#666666"
     borderopacity="1.0"
     gridtolerance="10000"
     guidetolerance="10"
     objecttolerance="10"
     inkscape:pageopacity="0.0"
     inkscape:pageshadow="2"
     inkscape:zoom="0.70710678"
     inkscape:cx="671.73684"
     inkscape:cy="1203.6564"
     inkscape:document-units="px"
     inkscape:current-layer="layer1"
     width="1350px"
     height="1500px"
     inkscape:showpageshadow="false"
     borderlayer="true"
     inkscape:window-width="1392"
     inkscape:window-height="1026"
     inkscape:window-x="0"
     inkscape:window-y="0" />
  <metadata
     id="metadata7">
    <rdf:RDF>
      <cc:Work
         rdf:about="">
        <dc:format>image/svg+xml</dc:format>
        <dc:type
           rdf:resource="http://purl.org/dc/dcmitype/StillImage" />
      </cc:Work>
    </rdf:RDF>
  </metadata>
  <g
     inkscape:label="Layer 1"
     inkscape:groupmode="layer"
     id="layer1"
     style="display:inline"
     sodipodi:insensitive="true">
    <image
       y="0"
       x="0"
       id="image2289"
       height="1500"
       width="1350"
       sodipodi:absref="/home/morgul/Documents/Zodiac/Art/Finals/Zodiac-Pg2.png"
       xlink:href="Zodiac-Pg2.png" />
  </g>
  <g
     inkscape:groupmode="layer"
     id="layer3"
     inkscape:label="Dialog">
    <g
       style="display:inline"
       id="g5292"
       transform="translate(5.60412,-15.437046)">
      <rect
         ry="5.7605305"
         rx="8.6126699"
         y="100.77827"
         x="85.778275"
         height="65.39502"
         width="540.79932"
         id="rect4317"
         style="fill:#323200;fill-opacity:0.68627451;stroke:#000000;stroke-width:1.05655324;stroke-miterlimit:4;stroke-dasharray:none;stroke-opacity:1" />
      <text
         sodipodi:linespacing="125%"
         id="text5288"
         y="124.63789"
         x="96.33699"
         style="font-size:12px;font-style:normal;font-weight:normal;line-height:125%;fill:#ffffff;fill-opacity:1;stroke:none;stroke-width:1px;stroke-linecap:butt;stroke-linejoin:miter;stroke-opacity:1;font-family:Bitstream Vera Sans"
         xml:space="preserve"><tspan
           style="font-size:22px;font-style:normal;font-variant:normal;font-weight:normal;font-stretch:normal;text-align:start;line-height:125%;writing-mode:lr-tb;text-anchor:start;fill:#ffffff;fill-opacity:1;font-family:Spirit Medium"
           y="124.63789"
           x="96.33699"
           id="tspan5290"
           sodipodi:role="line">My mastery of the Ares language was marginal at best. However, </tspan><tspan
           style="font-size:22px;font-style:normal;font-variant:normal;font-weight:normal;font-stretch:normal;text-align:start;line-height:125%;writing-mode:lr-tb;text-anchor:start;fill:#ffffff;fill-opacity:1;font-family:Spirit Medium"
           y="152.13789"
           x="96.33699"
           sodipodi:role="line"
           id="tspan2425">my skill speaking Drunken Ares was nothing short of godlike.</tspan></text>
    </g>
    <g
       style="display:inline"
       id="g3416"
       transform="translate(-34,-22)">
      <path
         d="M 1292.3777 336.86441 A 114.71428 36.847458 0 1 1  1062.9492,336.86441 A 114.71428 36.847458 0 1 1  1292.3777 336.86441 z"
         sodipodi:ry="36.847458"
         sodipodi:rx="114.71428"
         sodipodi:cy="336.86441"
         sodipodi:cx="1177.6635"
         id="path2427"
         style="fill:#e1e1cd;fill-opacity:0.68627451;stroke:#000000;stroke-width:1.5;stroke-miterlimit:4;stroke-dasharray:none;stroke-opacity:1"
         sodipodi:type="arc" />
      <text
         id="text3398"
         y="333.8566"
         x="1177.2123"
         style="font-size:12px;font-style:normal;font-weight:normal;text-align:center;text-anchor:middle;fill:#000000;fill-opacity:1;stroke:none;stroke-width:1px;stroke-linecap:butt;stroke-linejoin:miter;stroke-opacity:1;font-family:Bitstream Vera Sans"
         xml:space="preserve"><tspan
           style="font-size:22px;font-style:normal;font-variant:normal;font-weight:normal;font-stretch:normal;text-align:center;line-height:125%;writing-mode:lr-tb;text-anchor:middle;font-family:Yoshitoshi"
           y="333.8566"
           x="1183.1205"
           id="tspan3400"
           sodipodi:role="line">Mind iffin' I buy </tspan><tspan
           id="tspan3406"
           style="font-size:22px;font-style:normal;font-variant:normal;font-weight:normal;font-stretch:normal;text-align:center;line-height:125%;writing-mode:lr-tb;text-anchor:middle;font-family:Yoshitoshi"
           y="361.3566"
           x="1177.2123"
           sodipodi:role="line">your next round, Cap'n?</tspan></text>
    </g>
    <g
       style="display:inline"
       transform="translate(-574,606)"
       id="g3502">
      <path
         sodipodi:type="arc"
         style="fill:#e1e1cd;fill-opacity:0.68627451;stroke:#000000;stroke-width:1.5;stroke-miterlimit:4;stroke-dasharray:none;stroke-opacity:1"
         id="path3504"
         sodipodi:cx="1177.6635"
         sodipodi:cy="336.86441"
         sodipodi:rx="130.71428"
         sodipodi:ry="54.847458"
         d="M 1308.3777 336.86441 A 130.71428 54.847458 0 1 1  1046.9492,336.86441 A 130.71428 54.847458 0 1 1  1308.3777 336.86441 z"
         transform="translate(-2,12)" />
      <text
         xml:space="preserve"
         style="font-size:12px;font-style:normal;font-weight:normal;text-align:center;text-anchor:middle;fill:#000000;fill-opacity:1;stroke:none;stroke-width:1px;stroke-linecap:butt;stroke-linejoin:miter;stroke-opacity:1;font-family:Bitstream Vera Sans"
         x="1177.2123"
         y="333.8566"
         id="text3506"><tspan
           sodipodi:role="line"
           x="1177.2123"
           y="333.8566"
           style="font-size:22px;font-style:normal;font-variant:normal;font-weight:normal;font-stretch:normal;text-align:center;line-height:125%;writing-mode:lr-tb;text-anchor:middle;font-family:Yoshitoshi"
           id="tspan3510">Brain bugged cat shits.</tspan><tspan
           sodipodi:role="line"
           x="1177.2123"
           y="361.3566"
           style="font-size:22px;font-style:normal;font-variant:normal;font-weight:normal;font-stretch:normal;text-align:center;line-height:125%;writing-mode:lr-tb;text-anchor:middle;font-family:Yoshitoshi"
           id="tspan3578">Scorpio humpers, the lot of</tspan><tspan
           sodipodi:role="line"
           x="1177.2123"
           y="388.8566"
           style="font-size:22px;font-style:normal;font-variant:normal;font-weight:normal;font-stretch:normal;text-align:center;line-height:125%;writing-mode:lr-tb;text-anchor:middle;font-family:Yoshitoshi"
           id="tspan3580">'em. On bring the piss!</tspan></text>
    </g>
    <g
       style="display:inline"
       id="g3512"
       transform="translate(-146,604)">
      <path
         d="M 1306.3777 336.86441 A 128.71428 46.847458 0 1 1  1048.9492,336.86441 A 128.71428 46.847458 0 1 1  1306.3777 336.86441 z"
         sodipodi:ry="46.847458"
         sodipodi:rx="128.71428"
         sodipodi:cy="336.86441"
         sodipodi:cx="1177.6635"
         id="path3514"
         style="fill:#e1e1cd;fill-opacity:0.68627451;stroke:#000000;stroke-width:1.5;stroke-miterlimit:4;stroke-dasharray:none;stroke-opacity:1"
         sodipodi:type="arc" />
      <text
         id="text3516"
         y="325.8566"
         x="1177.2123"
         style="font-size:12px;font-style:normal;font-weight:normal;text-align:center;text-anchor:middle;fill:#000000;fill-opacity:1;stroke:none;stroke-width:1px;stroke-linecap:butt;stroke-linejoin:miter;stroke-opacity:1;font-family:Bitstream Vera Sans"
         xml:space="preserve"><tspan
           id="tspan3520"
           style="font-size:20px;font-style:italic;font-variant:normal;font-weight:normal;font-stretch:normal;text-align:center;line-height:125%;writing-mode:lr-tb;text-anchor:middle;font-family:Yoshitoshi"
           y="325.8566"
           x="1182.5834"
           sodipodi:role="line">Sounds like the Cap'n's </tspan><tspan
           style="font-size:20px;font-style:italic;font-variant:normal;font-weight:normal;font-stretch:normal;text-align:center;line-height:125%;writing-mode:lr-tb;text-anchor:middle;font-family:Yoshitoshi"
           y="350.8566"
           x="1177.2123"
           sodipodi:role="line"
           id="tspan3584">been drinking too much of the</tspan><tspan
           style="font-size:20px;font-style:italic;font-variant:normal;font-weight:normal;font-stretch:normal;text-align:center;line-height:125%;writing-mode:lr-tb;text-anchor:middle;font-family:Yoshitoshi"
           y="375.8566"
           x="1177.2123"
           sodipodi:role="line"
           id="tspan3586">local 'piss water'.</tspan></text>
    </g>
    <g
       style="display:inline"
       transform="translate(-340,186)"
       id="g3544">
      <path
         sodipodi:type="arc"
         style="fill:#e1e1cd;fill-opacity:0.68627451;stroke:#000000;stroke-width:1.5;stroke-miterlimit:4;stroke-dasharray:none;stroke-opacity:1"
         id="path3546"
         sodipodi:cx="1177.6635"
         sodipodi:cy="336.86441"
         sodipodi:rx="87.793762"
         sodipodi:ry="19.165613"
         d="M 1265.4572 336.86441 A 87.793762 19.165613 0 1 1  1089.8697,336.86441 A 87.793762 19.165613 0 1 1  1265.4572 336.86441 z" />
      <text
         xml:space="preserve"
         style="font-size:12px;font-style:normal;font-weight:normal;text-align:center;text-anchor:middle;fill:#000000;fill-opacity:1;stroke:none;stroke-width:1px;stroke-linecap:butt;stroke-linejoin:miter;stroke-opacity:1;font-family:Bitstream Vera Sans"
         x="1177.6224"
         y="350.98746"
         id="text3548"><tspan
           sodipodi:role="line"
           x="1177.6224"
           y="350.98746"
           style="font-size:24px;font-style:normal;font-variant:normal;font-weight:normal;font-stretch:normal;text-align:center;line-height:125%;writing-mode:lr-tb;text-anchor:middle;font-family:Yoshitoshi"
           id="tspan3552">...Yeah. Drink me.</tspan></text>
    </g>
    <g
       style="display:inline"
       transform="translate(-397.23294,142.71591)"
       id="g3482">
      <path
         sodipodi:type="arc"
         style="fill:#e1e1cd;fill-opacity:0.68627451;stroke:#000000;stroke-width:1.5;stroke-miterlimit:4;stroke-dasharray:none;stroke-opacity:1"
         id="path3484"
         sodipodi:cx="1177.6635"
         sodipodi:cy="336.86441"
         sodipodi:rx="91.969933"
         sodipodi:ry="34.290627"
         d="M 1269.6334 336.86441 A 91.969933 34.290627 0 1 1  1085.6935,336.86441 A 91.969933 34.290627 0 1 1  1269.6334 336.86441 z"
         transform="translate(0,0.6811237)" />
      <text
         xml:space="preserve"
         style="font-size:12px;font-style:normal;font-weight:normal;text-align:center;text-anchor:middle;fill:#000000;fill-opacity:1;stroke:none;stroke-width:1px;stroke-linecap:butt;stroke-linejoin:miter;stroke-opacity:1;font-family:Bitstream Vera Sans"
         x="1178.8705"
         y="342.70764"
         id="text3486"><tspan
           sodipodi:role="line"
           x="1184.7787"
           y="342.70764"
           style="font-size:22px;font-style:normal;font-variant:normal;font-weight:normal;font-stretch:normal;text-align:center;line-height:125%;writing-mode:lr-tb;text-anchor:middle;font-family:Yoshitoshi"
           id="tspan3490">Damn pissed water </tspan><tspan
           sodipodi:role="line"
           x="1178.8705"
           y="370.20764"
           style="font-size:22px;font-style:normal;font-variant:normal;font-weight:normal;font-stretch:normal;text-align:center;line-height:125%;writing-mode:lr-tb;text-anchor:middle;font-family:Yoshitoshi"
           id="tspan3556">colored...</tspan></text>
    </g>
    <g
       style="display:inline"
       transform="translate(30,194)"
       id="g3562">
      <path
         sodipodi:type="arc"
         style="fill:#e1e1cd;fill-opacity:0.68627451;stroke:#000000;stroke-width:1.5;stroke-miterlimit:4;stroke-dasharray:none;stroke-opacity:1"
         id="path3564"
         sodipodi:cx="1177.6635"
         sodipodi:cy="336.86441"
         sodipodi:rx="127.71428"
         sodipodi:ry="33.847458"
         d="M 1305.3777 336.86441 A 127.71428 33.847458 0 1 1  1049.9492,336.86441 A 127.71428 33.847458 0 1 1  1305.3777 336.86441 z" />
      <text
         xml:space="preserve"
         style="font-size:12px;font-style:normal;font-weight:normal;text-align:center;text-anchor:middle;fill:#000000;fill-opacity:1;stroke:none;stroke-width:1px;stroke-linecap:butt;stroke-linejoin:miter;stroke-opacity:1;font-family:Bitstream Vera Sans"
         x="1177.39"
         y="337.4191"
         id="text3566"><tspan
           sodipodi:role="line"
           x="1177.39"
           y="337.4191"
           style="font-size:22px;font-style:normal;font-variant:normal;font-weight:normal;font-stretch:normal;text-align:center;line-height:125%;writing-mode:lr-tb;text-anchor:middle;font-family:Yoshitoshi"
           id="tspan3570">Best shit those damned</tspan><tspan
           sodipodi:role="line"
           x="1177.39"
           y="364.9191"
           style="font-size:22px;font-style:normal;font-variant:normal;font-weight:normal;font-stretch:normal;text-align:center;line-height:125%;writing-mode:lr-tb;text-anchor:middle;font-family:Yoshitoshi"
           id="tspan3574">Leos'll let us have.</tspan></text>
    </g>
    <g
       style="display:inline"
       id="g3492"
       transform="translate(-42,140)">
      <path
         d="M 1323.3777 336.86441 A 145.71428 32.847458 0 1 1  1031.9492,336.86441 A 145.71428 32.847458 0 1 1  1323.3777 336.86441 z"
         sodipodi:ry="32.847458"
         sodipodi:rx="145.71428"
         sodipodi:cy="336.86441"
         sodipodi:cx="1177.6635"
         id="path3494"
         style="fill:#e1e1cd;fill-opacity:0.68627451;stroke:#000000;stroke-width:1.5;stroke-miterlimit:4;stroke-dasharray:none;stroke-opacity:1"
         sodipodi:type="arc" />
      <text
         id="text3496"
         y="339.8566"
         x="1181.4447"
         style="font-size:12px;font-style:normal;font-weight:normal;text-align:center;text-anchor:middle;fill:#000000;fill-opacity:1;stroke:none;stroke-width:1px;stroke-linecap:butt;stroke-linejoin:miter;stroke-opacity:1;font-family:Bitstream Vera Sans"
         xml:space="preserve"><tspan
           id="tspan3500"
           style="font-size:22px;font-style:normal;font-variant:normal;font-weight:normal;font-stretch:normal;text-align:center;line-height:125%;writing-mode:lr-tb;text-anchor:middle;font-family:Yoshitoshi"
           y="339.8566"
           x="1181.4447"
           sodipodi:role="line">Sounds like the Cap'n needs</tspan><tspan
           style="font-size:22px;font-style:normal;font-variant:normal;font-weight:normal;font-stretch:normal;text-align:center;line-height:125%;writing-mode:lr-tb;text-anchor:middle;font-family:Yoshitoshi"
           y="367.3566"
           x="1181.4447"
           sodipodi:role="line"
           id="tspan3560">to try the house beer.</tspan></text>
    </g>
    <g
       style="display:inline"
       transform="translate(30,662)"
       id="g3588">
      <path
         sodipodi:type="arc"
         style="fill:#e1e1cd;fill-opacity:0.68627451;stroke:#000000;stroke-width:1.5;stroke-miterlimit:4;stroke-dasharray:none;stroke-opacity:1"
         id="path3590"
         sodipodi:cx="1177.6635"
         sodipodi:cy="336.86441"
         sodipodi:rx="94.714279"
         sodipodi:ry="32.847458"
         d="M 1272.3777 336.86441 A 94.714279 32.847458 0 1 1  1082.9492,336.86441 A 94.714279 32.847458 0 1 1  1272.3777 336.86441 z" />
      <text
         xml:space="preserve"
         style="font-size:12px;font-style:normal;font-weight:normal;text-align:center;text-anchor:middle;fill:#000000;fill-opacity:1;stroke:none;stroke-width:1px;stroke-linecap:butt;stroke-linejoin:miter;stroke-opacity:1;font-family:Bitstream Vera Sans"
         x="1179.2123"
         y="339.8566"
         id="text3592"><tspan
           id="tspan3598"
           sodipodi:role="line"
           x="1184.5834"
           y="339.8566"
           style="font-size:20px;font-style:italic;font-variant:normal;font-weight:normal;font-stretch:normal;text-align:center;line-height:125%;writing-mode:lr-tb;text-anchor:middle;font-family:Yoshitoshi">Shut it, or he'll have </tspan><tspan
           sodipodi:role="line"
           x="1179.2123"
           y="364.8566"
           style="font-size:20px;font-style:italic;font-variant:normal;font-weight:normal;font-stretch:normal;text-align:center;line-height:125%;writing-mode:lr-tb;text-anchor:middle;font-family:Yoshitoshi"
           id="tspan3605">us both wipped!</tspan></text>
    </g>
    <g
       style="display:inline"
       id="g3611"
       transform="translate(52,744)">
      <path
         d="M 1290.3777 336.86441 A 112.71428 35.847458 0 1 1  1064.9492,336.86441 A 112.71428 35.847458 0 1 1  1290.3777 336.86441 z"
         sodipodi:ry="35.847458"
         sodipodi:rx="112.71428"
         sodipodi:cy="336.86441"
         sodipodi:cx="1177.6635"
         id="path3613"
         style="fill:#e1e1cd;fill-opacity:0.68627451;stroke:#000000;stroke-width:1.5;stroke-miterlimit:4;stroke-dasharray:none;stroke-opacity:1"
         sodipodi:type="arc"
         transform="translate(4,2)" />
      <text
         id="text3615"
         y="337.8566"
         x="1179.2123"
         style="font-size:12px;font-style:normal;font-weight:normal;text-align:center;text-anchor:middle;fill:#000000;fill-opacity:1;stroke:none;stroke-width:1px;stroke-linecap:butt;stroke-linejoin:miter;stroke-opacity:1;font-family:Bitstream Vera Sans"
         xml:space="preserve"><tspan
           id="tspan3619"
           style="font-size:20px;font-style:italic;font-variant:normal;font-weight:normal;font-stretch:normal;text-align:center;line-height:125%;writing-mode:lr-tb;text-anchor:middle;font-family:Yoshitoshi"
           y="337.8566"
           x="1179.2123"
           sodipodi:role="line">Assumin' he could get</tspan><tspan
           style="font-size:20px;font-style:italic;font-variant:normal;font-weight:normal;font-stretch:normal;text-align:center;line-height:125%;writing-mode:lr-tb;text-anchor:middle;font-family:Yoshitoshi"
           y="362.8566"
           x="1179.2123"
           sodipodi:role="line"
           id="tspan3631">the orders out straight.</tspan></text>
    </g>
  </g>
</svg>
