^D:\UNIVERSIDAD\SEPTIMO_SEMESTRE\SISTEMAS INTELIGENTES\REINASREFACTORIZADO\REINASREFACTORIZADO\DEBUG\SOURCE.OBJ|D:\UNIVERSIDAD\SEPTIMO_SEMESTRE\SISTEMAS INTELIGENTES\REINASREFACTORIZADO\REINASREFACTORIZADO\DEBUG\TABLERO.OBJ
D:\UNIVERSIDAD\SEPTIMO_SEMESTRE\SISTEMAS INTELIGENTES\REINASREFACTORIZADO\DEBUG\REINASREFACTORIZADO.EXE
D:\UNIVERSIDAD\SEPTIMO_SEMESTRE\SISTEMAS INTELIGENTES\REINASREFACTORIZADO\DEBUG\REINASREFACTORIZADO.ILK
D:\UNIVERSIDAD\SEPTIMO_SEMESTRE\SISTEMAS INTELIGENTES\REINASREFACTORIZADO\DEBUG\REINASREFACTORIZADO.PDB
