{
	"info": {
		"_postman_id": "c694d493-2018-4ed0-b1b5-d6985e022626",
		"name": "InnovationClubsAPI",
		"schema": "https://schema.getpostman.com/json/collection/v2.1.0/collection.json"
	},
	"item": [
		{
			"name": "GETAdvisers",
			"request": {
				"method": "GET",
				"header": [],
				"url": {
					"raw": "http://localhost:50568/api/advisers",
					"protocol": "http",
					"host": [
						"localhost"
					],
					"port": "50568",
					"path": [
						"api",
						"advisers"
					]
				}
			},
			"response": []
		},
		{
			"name": "GETFacilitators",
			"request": {
				"method": "GET",
				"header": [],
				"url": {
					"raw": "http://localhost:50568/api/facilitators",
					"protocol": "http",
					"host": [
						"localhost"
					],
					"port": "50568",
					"path": [
						"api",
						"facilitators"
					]
				}
			},
			"response": []
		},
		{
			"name": "GETVolunteers",
			"request": {
				"method": "GET",
				"header": [],
				"url": {
					"raw": "http://localhost:50568/api/volunteers",
					"protocol": "http",
					"host": [
						"localhost"
					],
					"port": "50568",
					"path": [
						"api",
						"volunteers"
					]
				}
			},
			"response": []
		},
		{
			"name": "GETAdviser",
			"request": {
				"method": "GET",
				"header": [],
				"url": {
					"raw": "http://localhost:50568/api/advisers/2",
					"protocol": "http",
					"host": [
						"localhost"
					],
					"port": "50568",
					"path": [
						"api",
						"advisers",
						"2"
					]
				}
			},
			"response": []
		},
		{
			"name": "GETFacilitator",
			"request": {
				"method": "GET",
				"header": [],
				"url": {
					"raw": "http://localhost:50568/api/facilitators/1",
					"protocol": "http",
					"host": [
						"localhost"
					],
					"port": "50568",
					"path": [
						"api",
						"facilitators",
						"1"
					]
				}
			},
			"response": []
		},
		{
			"name": "GET Admins",
			"request": {
				"method": "GET",
				"header": [],
				"url": {
					"raw": "http://localhost:50568/api/admins/1",
					"protocol": "http",
					"host": [
						"localhost"
					],
					"port": "50568",
					"path": [
						"api",
						"admins",
						"1"
					]
				}
			},
			"response": []
		},
		{
			"name": "GET Mentors",
			"request": {
				"method": "GET",
				"header": [],
				"url": {
					"raw": "http://localhost:50568/api/mentors",
					"protocol": "http",
					"host": [
						"localhost"
					],
					"port": "50568",
					"path": [
						"api",
						"mentors"
					]
				}
			},
			"response": []
		},
		{
			"name": "GETVolunteer",
			"request": {
				"method": "GET",
				"header": [],
				"url": {
					"raw": "http://localhost:50568/api/volunteers/1",
					"protocol": "http",
					"host": [
						"localhost"
					],
					"port": "50568",
					"path": [
						"api",
						"volunteers",
						"1"
					]
				}
			},
			"response": []
		},
		{
			"name": "GET Students",
			"request": {
				"method": "GET",
				"header": [],
				"url": {
					"raw": "http://localhost:50568/api/students",
					"protocol": "http",
					"host": [
						"localhost"
					],
					"port": "50568",
					"path": [
						"api",
						"students"
					]
				}
			},
			"response": []
		},
		{
			"name": "GET Mentor",
			"request": {
				"method": "GET",
				"header": [],
				"url": {
					"raw": "http://localhost:50568/api/mentors/1",
					"protocol": "http",
					"host": [
						"localhost"
					],
					"port": "50568",
					"path": [
						"api",
						"mentors",
						"1"
					]
				}
			},
			"response": []
		},
		{
			"name": "GET Student",
			"request": {
				"method": "GET",
				"header": [],
				"url": {
					"raw": "http://localhost:50568/api/students/2",
					"protocol": "http",
					"host": [
						"localhost"
					],
					"port": "50568",
					"path": [
						"api",
						"students",
						"2"
					]
				}
			},
			"response": []
		},
		{
			"name": "GET Admin",
			"request": {
				"method": "GET",
				"header": [],
				"url": {
					"raw": "http://localhost:50568/api/admins",
					"protocol": "http",
					"host": [
						"localhost"
					],
					"port": "50568",
					"path": [
						"api",
						"admins"
					]
				}
			},
			"response": []
		},
		{
			"name": "GET Courses",
			"request": {
				"method": "GET",
				"header": [],
				"url": {
					"raw": "http://localhost:50568/api/facilitators/1/courses",
					"protocol": "http",
					"host": [
						"localhost"
					],
					"port": "50568",
					"path": [
						"api",
						"facilitators",
						"1",
						"courses"
					]
				}
			},
			"response": []
		},
		{
			"name": "GET course",
			"request": {
				"method": "GET",
				"header": [],
				"url": {
					"raw": "http://localhost:50568/api/facilitators/1/courses/1",
					"protocol": "http",
					"host": [
						"localhost"
					],
					"port": "50568",
					"path": [
						"api",
						"facilitators",
						"1",
						"courses",
						"1"
					]
				}
			},
			"response": []
		},
		{
			"name": "GET Modules",
			"request": {
				"method": "GET",
				"header": [],
				"url": {
					"raw": "http://localhost:50568/api/facilitators/2/courses/2/modules",
					"protocol": "http",
					"host": [
						"localhost"
					],
					"port": "50568",
					"path": [
						"api",
						"facilitators",
						"2",
						"courses",
						"2",
						"modules"
					]
				}
			},
			"response": []
		},
		{
			"name": "GET module",
			"request": {
				"method": "GET",
				"header": [],
				"url": {
					"raw": "http://localhost:50568/api/facilitators/1/courses/1/modules/2",
					"protocol": "http",
					"host": [
						"localhost"
					],
					"port": "50568",
					"path": [
						"api",
						"facilitators",
						"1",
						"courses",
						"1",
						"modules",
						"2"
					]
				}
			},
			"response": []
		},
		{
			"name": "POSTVolunteer",
			"request": {
				"method": "POST",
				"header": [],
				"body": {
					"mode": "raw",
					"raw": "{\r\n    \"name\": \"Lala\",\r\n    \"lastName\": \"Pedrazas\",\r\n    \"birthDate\": \"2015-03-22T00:00:00\",\r\n    \"genre\": 1,\r\n    \"cellphoneNumber\": 12334567,\r\n    \"emailAddress\": \"something@domain.com\"\r\n}",
					"options": {
						"raw": {
							"language": "json"
						}
					}
				},
				"url": {
					"raw": "http://localhost:50568/api/volunteers",
					"protocol": "http",
					"host": [
						"localhost"
					],
					"port": "50568",
					"path": [
						"api",
						"volunteers"
					]
				}
			},
			"response": []
		},
		{
			"name": "POSTFacilitator",
			"request": {
				"method": "POST",
				"header": [],
				"body": {
					"mode": "raw",
					"raw": "{\r\n        \"name\": \"Carla\",\r\n        \"lastName\": \"Pedrazas\",\r\n        \"birthDate\": \"2015-03-22T00:00:00\",\r\n        \"genre\": 1,\r\n        \"speciality\": \"Robotics\",\r\n        \"country\": \"Spain\",\r\n        \"cellphoneNumber\": 12334567,\r\n        \"emailAddress\": \"something@domain.com\"\r\n    }",
					"options": {
						"raw": {
							"language": "json"
						}
					}
				},
				"url": {
					"raw": "http://localhost:50568/api/facilitators",
					"protocol": "http",
					"host": [
						"localhost"
					],
					"port": "50568",
					"path": [
						"api",
						"facilitators"
					]
				}
			},
			"response": []
		},
		{
			"name": "POST Admin",
			"request": {
				"method": "POST",
				"header": [
					{
						"key": "Content-Type",
						"name": "Content-Type",
						"value": "application/json",
						"type": "text"
					}
				],
				"body": {
					"mode": "raw",
					"raw": "{\r\n    \"userName\": \"Maria\"\r\n}",
					"options": {
						"raw": {
							"language": "json"
						}
					}
				},
				"url": {
					"raw": "http://localhost:50568/api/admins",
					"protocol": "http",
					"host": [
						"localhost"
					],
					"port": "50568",
					"path": [
						"api",
						"admins"
					]
				}
			},
			"response": []
		},
		{
			"name": "POST Mentor",
			"request": {
				"method": "POST",
				"header": [
					{
						"key": "Content-Type",
						"name": "Content-Type",
						"value": "application/json",
						"type": "text"
					}
				],
				"body": {
					"mode": "raw",
					"raw": "    {\r\n        \"name\": \"Mariana\",\r\n        \"lastName\": \"Normalin\",\r\n        \"birthDate\": \"2019-02-22T00:00:00\",\r\n        \"genre\": 1,\r\n        \"country\": \"Spain\",\r\n        \"phoneNumber\": 2112122,\r\n        \"email\": \"dewecom\"\r\n    }",
					"options": {
						"raw": {
							"language": "json"
						}
					}
				},
				"url": {
					"raw": "http://localhost:50568/api/mentors",
					"protocol": "http",
					"host": [
						"localhost"
					],
					"port": "50568",
					"path": [
						"api",
						"mentors"
					]
				}
			},
			"response": []
		},
		{
			"name": "POST Student",
			"request": {
				"method": "POST",
				"header": [
					{
						"key": "Content-Type",
						"name": "Content-Type",
						"value": "application/json",
						"type": "text"
					}
				],
				"body": {
					"mode": "raw",
					"raw": "{   \r\n    \"name\": \"Ana\",\r\n    \"lastName\": \"Banana\",\r\n    \"birthDate\": \"2018-02-21\",\r\n    \"genre\": 1,\r\n    \"school\": \"Santa Cruz\",\r\n    \"userName\":\"Ana123\"\r\n}",
					"options": {
						"raw": {
							"language": "json"
						}
					}
				},
				"url": {
					"raw": "http://localhost:50568/api/students",
					"protocol": "http",
					"host": [
						"localhost"
					],
					"port": "50568",
					"path": [
						"api",
						"students"
					]
				}
			},
			"response": []
		},
		{
			"name": "POSTAdvicer",
			"request": {
				"method": "POST",
				"header": [],
				"body": {
					"mode": "raw",
					"raw": "{\r\n    \"name\": \"Lila\",\r\n    \"lastName\": \"Pedrazas\",\r\n    \"birthDate\": \"2015-03-22T00:00:00\",\r\n    \"genre\": 1,\r\n    \"subject\": \"Math\",\r\n    \"cellphoneNumber\": 123345672,\r\n    \"emailAddress\": \"something@domain.com\"\r\n}",
					"options": {
						"raw": {
							"language": "json"
						}
					}
				},
				"url": {
					"raw": "http://localhost:50568/api/advisers",
					"protocol": "http",
					"host": [
						"localhost"
					],
					"port": "50568",
					"path": [
						"api",
						"advisers"
					]
				}
			},
			"response": []
		},
		{
			"name": "POST Course",
			"request": {
				"method": "POST",
				"header": [
					{
						"key": "Content-Type",
						"name": "Content-Type",
						"value": "application/json",
						"type": "text"
					}
				],
				"body": {
					"mode": "raw",
					"raw": " {\r\n    \"title\": \"Title 4434\",\r\n    \"description\": \"No Description\"\r\n}",
					"options": {
						"raw": {
							"language": "json"
						}
					}
				},
				"url": {
					"raw": "http://localhost:50568/api/facilitators/1/courses",
					"protocol": "http",
					"host": [
						"localhost"
					],
					"port": "50568",
					"path": [
						"api",
						"facilitators",
						"1",
						"courses"
					]
				}
			},
			"response": []
		},
		{
			"name": "POST Module",
			"request": {
				"method": "POST",
				"header": [],
				"body": {
					"mode": "raw",
					"raw": "{\r\n    \"idFacilitator\": 1,\r\n    \"titleModule\": \"TITLE MODULE 3 TEST POST\",\r\n    \"content\": \"TEXT 3 TEST POST\"\r\n}",
					"options": {
						"raw": {
							"language": "json"
						}
					}
				},
				"url": {
					"raw": "http://localhost:50568/api/facilitators/2/courses/2/modules",
					"protocol": "http",
					"host": [
						"localhost"
					],
					"port": "50568",
					"path": [
						"api",
						"facilitators",
						"2",
						"courses",
						"2",
						"modules"
					]
				}
			},
			"response": []
		}
	],
	"protocolProfileBehavior": {}
}