%YAML 1.1
%TAG !u! tag:unity3d.com,2011:
--- !u!1045 &1
EditorBuildSettings:
  m_ObjectHideFlags: 0
  serializedVersion: 2
  m_Scenes:
  - enabled: 1
    path: Assets/Scenes/scene1-Initialisation.unity
    guid: 8dccce7224fce4744ae262be4af1271d
  - enabled: 1
    path: Assets/Scenes/scene2-Menu.unity
    guid: 2cda990e2423bbf4892e6590ba056729
  - enabled: 1
    path: Assets/Scenes/scene3-Game.unity
    guid: f1170ecd9d7d82945b247d50bceaa415
  - enabled: 1
    path: Assets/Scenes/scene4-End.unity
    guid: 0bc3a6102993cdf41a64a59d39fa9981
  m_configObjects: {}
