{
  "name": "actech-users-service",
  "script": "dist/main.js",
  "instances": 1,
  "env": {
    "NODE_ENV": "development",
    "DEBUG": "actech:*",
    "APP_NAME": "actech:users-service",
    "SITE_URL": "http://dev.actech.alx"
  },
  "env_production" : {
    "NODE_ENV": "production",
    "DEBUG": "actech:*",
    "APP_NAME": "actech:users-service",
    "SITE_URL": "http://dev.actech.alx"
  }
}
