{
    "window.zoomLevel": 0,
    "workbench.startupEditor": "newUntitledFile",
    "files.autoSave": "off",
    "terminal.integrated.shellArgs.osx": [
        "-l"
    ],
    "python.linting.pylintEnabled": false,
    "editor.minimap.enabled": false,
    "editor.wordWrap": "off",
    "editor.multiCursorModifier": "ctrlCmd",
    "workbench.editor.enablePreview": false,
    "python.linter": "",
    "python.linting.flake8Args": [
       "--ignore=E501"
    ],
    "[python]": {
        "editor.defaultFormatter": "ms-python.python"
    },
    "python.linting.flake8Enabled": true,
    "javascript.updateImportsOnFileMove.enabled": "always",
    "code-runner.executorMap": {
        "kotlin": "cd $dir && kotlinc $fileName -include-runtime -d $fileNameWithoutExt.jar && java -jar $fileNameWithoutExt.jar"
    }
}
