300.00000  350.00000  1.506296659726e-06
350.00000  400.00000  0.000000000000e+00
400.00000  450.00000  1.506296659726e-06
450.00000  500.00000  1.506296659726e-06
500.00000  550.00000  9.790928288217e-06
550.00000  600.00000  7.531483298628e-07
600.00000  650.00000  4.518889979177e-06
650.00000  700.00000  7.531483298628e-07
700.00000  750.00000  3.012593319451e-06
750.00000  800.00000  3.012593319451e-06
800.00000  850.00000  1.129722494794e-05
850.00000  900.00000  2.259444989588e-06
900.00000  950.00000  7.531483298628e-07
950.00000  1000.00000  1.506296659726e-06
1000.00000  1050.00000  3.012593319451e-06
1050.00000  1100.00000  1.506296659726e-06
1100.00000  1150.00000  7.531483298628e-07
1150.00000  1200.00000  7.531483298628e-07
1200.00000  1250.00000  7.531483298628e-07
1250.00000  1300.00000  9.037779958354e-06
1300.00000  1350.00000  2.259444989588e-06
1350.00000  1400.00000  1.506296659726e-06
1400.00000  1450.00000  3.765741649314e-06
1450.00000  1500.00000  3.012593319451e-06
1500.00000  1550.00000  3.765741649314e-06
1550.00000  1600.00000  7.531483298628e-07
1600.00000  1650.00000  3.765741649314e-06
1650.00000  1700.00000  3.012593319451e-06
1700.00000  1750.00000  2.410074655561e-05
1750.00000  1800.00000  7.531483298628e-06
1800.00000  1850.00000  3.012593319451e-06
1850.00000  1900.00000  4.518889979177e-06
1900.00000  1950.00000  3.012593319451e-06
1950.00000  2000.00000  1.506296659726e-06
2000.00000  2050.00000  3.012593319451e-06
2050.00000  2100.00000  7.531483298628e-07
2100.00000  2150.00000  4.518889979177e-06
2150.00000  2200.00000  4.518889979177e-06
2200.00000  2250.00000  3.012593319451e-06
2250.00000  2300.00000  7.531483298628e-06
2300.00000  2350.00000  3.389167484383e-05
2350.00000  2400.00000  4.518889979177e-06
2400.00000  2450.00000  4.518889979177e-06
2450.00000  2500.00000  6.778334968765e-06
2500.00000  2550.00000  6.025186638903e-06
2550.00000  2600.00000  2.259444989588e-06
2600.00000  2650.00000  7.531483298628e-06
2650.00000  2700.00000  6.778334968765e-06
2700.00000  2750.00000  6.778334968765e-06
2750.00000  2800.00000  3.765741649314e-06
2800.00000  2850.00000  8.284631628491e-06
2850.00000  2900.00000  5.272038309040e-06
2900.00000  2950.00000  9.790928288217e-06
2950.00000  3000.00000  2.334759822575e-05
3000.00000  3050.00000  9.790928288217e-06
3050.00000  3100.00000  9.790928288217e-06
3100.00000  3150.00000  1.054407661808e-05
3150.00000  3200.00000  6.025186638903e-06
3200.00000  3250.00000  9.037779958354e-06
3250.00000  3300.00000  1.054407661808e-05
3300.00000  3350.00000  1.205037327781e-05
3350.00000  3400.00000  1.280352160767e-05
3400.00000  3450.00000  1.280352160767e-05
3450.00000  3500.00000  1.054407661808e-05
3500.00000  3550.00000  1.732241158684e-05
3550.00000  3600.00000  1.882870824657e-05
3600.00000  3650.00000  2.108815323616e-05
3650.00000  3700.00000  2.711333987506e-05
3700.00000  3750.00000  1.506296659726e-05
3750.00000  3800.00000  1.807555991671e-05
3800.00000  3850.00000  2.259444989588e-05
3850.00000  3900.00000  1.807555991671e-05
3900.00000  3950.00000  2.108815323616e-05
3950.00000  4000.00000  3.238537818410e-05
4000.00000  4050.00000  3.841056482300e-05
4050.00000  4100.00000  2.786648820492e-05
4100.00000  4150.00000  2.861963653479e-05
4150.00000  4200.00000  3.389167484383e-05
4200.00000  4250.00000  3.765741649314e-05
4250.00000  4300.00000  3.690426816328e-05
4300.00000  4350.00000  3.765741649314e-05
4350.00000  4400.00000  5.121408643067e-05
4400.00000  4450.00000  4.217630647232e-05
4450.00000  4500.00000  5.196723476053e-05
4500.00000  4550.00000  6.251131137861e-05
4550.00000  4600.00000  6.928964634738e-05
4600.00000  4650.00000  6.025186638903e-05
4650.00000  4700.00000  6.477075636820e-05
4700.00000  4750.00000  6.100501471889e-05
4750.00000  4800.00000  8.284631628491e-05
4800.00000  4850.00000  7.380853632656e-05
4850.00000  4900.00000  7.380853632656e-05
4900.00000  4950.00000  8.962465125367e-05
4950.00000  5000.00000  8.359946461477e-05
5000.00000  5050.00000  8.661205793422e-05
5050.00000  5100.00000  1.122191011496e-04
5100.00000  5150.00000  9.263724457313e-05
5150.00000  5200.00000  8.134001962518e-05
5200.00000  5250.00000  9.941557954189e-05
5250.00000  5300.00000  9.414354123285e-05
5300.00000  5350.00000  1.212568811079e-04
5350.00000  5400.00000  1.122191011496e-04
5400.00000  5450.00000  1.197505844482e-04
5450.00000  5500.00000  1.001687278718e-04
5500.00000  5550.00000  1.272820677468e-04
5550.00000  5600.00000  1.310478093961e-04
5600.00000  5650.00000  1.446044793337e-04
5650.00000  5700.00000  1.280352160767e-04
5700.00000  5750.00000  1.189974361183e-04
5750.00000  5800.00000  1.521359626323e-04
5800.00000  5850.00000  1.295415127364e-04
5850.00000  5900.00000  1.671989292295e-04
5900.00000  5950.00000  1.468639243232e-04
5950.00000  6000.00000  1.446044793337e-04
6000.00000  6050.00000  1.250226227572e-04
6050.00000  6100.00000  1.415918860142e-04
6100.00000  6150.00000  1.385792926948e-04
6150.00000  6200.00000  1.604205942608e-04
6200.00000  6250.00000  1.506296659726e-04
6250.00000  6300.00000  1.528891109622e-04
6300.00000  6350.00000  1.626800392504e-04
6350.00000  6400.00000  4.918058594004e-04
6400.00000  6450.00000  1.664457808997e-04
6450.00000  6500.00000  1.265289194170e-04
6500.00000  6550.00000  1.596674459309e-04
6550.00000  6600.00000  1.385792926948e-04
6600.00000  6650.00000  1.687052258893e-04
6650.00000  6700.00000  1.536422592920e-04
6700.00000  6750.00000  1.438513310038e-04
6750.00000  6800.00000  1.400855893545e-04
6800.00000  6850.00000  1.415918860142e-04
6850.00000  6900.00000  1.430981826739e-04
6900.00000  6950.00000  1.468639243232e-04
6950.00000  7000.00000  1.378261443649e-04
7000.00000  7050.00000  1.272820677468e-04
7050.00000  7100.00000  1.935591207747e-04
7100.00000  7150.00000  6.326445970848e-05
7150.00000  7200.00000  5.874556972930e-05
7200.00000  7250.00000  5.573297640985e-05
7250.00000  7300.00000  5.497982807999e-05
7300.00000  7350.00000  7.079594300710e-05
7350.00000  7400.00000  6.175816304875e-05
7400.00000  7450.00000  6.401760803834e-05
7450.00000  7500.00000  6.100501471889e-05
7500.00000  7550.00000  5.497982807999e-05
7550.00000  7600.00000  5.949871805916e-05
7600.00000  7650.00000  6.477075636820e-05
7650.00000  7700.00000  6.401760803834e-05
7700.00000  7750.00000  5.573297640985e-05
7750.00000  7800.00000  5.648612473971e-05
7800.00000  7850.00000  6.401760803834e-05
7850.00000  7900.00000  6.552390469806e-05
7900.00000  7950.00000  5.874556972930e-05
7950.00000  8000.00000  7.757427797587e-05
8000.00000  8050.00000  7.380853632656e-05
8050.00000  8100.00000  7.305538799669e-05
8100.00000  8150.00000  5.799242139944e-05
8150.00000  8200.00000  5.799242139944e-05
8200.00000  8250.00000  6.401760803834e-05
8250.00000  8300.00000  7.456168465642e-05
8300.00000  8350.00000  5.121408643067e-05
8350.00000  8400.00000  7.531483298628e-05
8400.00000  8450.00000  6.025186638903e-05
8450.00000  8500.00000  7.380853632656e-05
8500.00000  8550.00000  6.627705302793e-05
8550.00000  8600.00000  7.380853632656e-05
8600.00000  8650.00000  5.648612473971e-05
8650.00000  8700.00000  6.552390469806e-05
8700.00000  8750.00000  5.949871805916e-05
8750.00000  8800.00000  5.723927306957e-05
8800.00000  8850.00000  5.874556972930e-05
8850.00000  8900.00000  6.477075636820e-05
8900.00000  8950.00000  5.949871805916e-05
8950.00000  9000.00000  5.573297640985e-05
9000.00000  9050.00000  7.004279467724e-05
9050.00000  9100.00000  5.497982807999e-05
9100.00000  9150.00000  5.121408643067e-05
9150.00000  9200.00000  5.347353142026e-05
9200.00000  9250.00000  5.949871805916e-05
9250.00000  9300.00000  5.874556972930e-05
9300.00000  9350.00000  6.251131137861e-05
9350.00000  9400.00000  6.100501471889e-05
9400.00000  9450.00000  6.025186638903e-05
9450.00000  9500.00000  6.853649801752e-05
9500.00000  9550.00000  5.422667975012e-05
9550.00000  9600.00000  5.723927306957e-05
9600.00000  9650.00000  6.552390469806e-05
9650.00000  9700.00000  5.196723476053e-05
9700.00000  9750.00000  5.497982807999e-05
9750.00000  9800.00000  4.820149311122e-05
9800.00000  9850.00000  5.874556972930e-05
9850.00000  9900.00000  6.251131137861e-05
9900.00000  9950.00000  5.497982807999e-05
9950.00000  10000.00000  5.573297640985e-05
