300.00000  350.00000  3.058629776238e-04
350.00000  400.00000  2.627939664548e-04
400.00000  450.00000  1.737360111562e-04
450.00000  500.00000  1.693561117153e-04
500.00000  550.00000  6.672046814991e-04
550.00000  600.00000  8.540803909781e-05
600.00000  650.00000  1.664361787547e-04
650.00000  700.00000  8.394807261750e-05
700.00000  750.00000  1.292070335069e-04
750.00000  800.00000  9.781775418039e-05
800.00000  850.00000  2.496542681321e-04
850.00000  900.00000  7.372830725537e-05
900.00000  950.00000  6.277855865309e-05
950.00000  1000.00000  6.934840781446e-05
1000.00000  1050.00000  6.788844133415e-05
1050.00000  1100.00000  6.788844133415e-05
1100.00000  1150.00000  5.766867597202e-05
1150.00000  1200.00000  7.007839105461e-05
1200.00000  1250.00000  5.766867597202e-05
1250.00000  1300.00000  1.328569497077e-04
1300.00000  1350.00000  6.058860893263e-05
1350.00000  1400.00000  4.671892736974e-05
1400.00000  1450.00000  5.839865921218e-05
1450.00000  1500.00000  7.080837429476e-05
1500.00000  1550.00000  5.912864245233e-05
1550.00000  1600.00000  5.620870949172e-05
1600.00000  1650.00000  3.649916200761e-05
1650.00000  1700.00000  4.598894412959e-05
1700.00000  1750.00000  1.102274692630e-04
1750.00000  1800.00000  4.598894412959e-05
1800.00000  1850.00000  4.890887709020e-05
1850.00000  1900.00000  4.087906144852e-05
1900.00000  1950.00000  4.306901116898e-05
1950.00000  2000.00000  5.328877653111e-05
2000.00000  2050.00000  5.036884357050e-05
2050.00000  2100.00000  6.204857541294e-05
2100.00000  2150.00000  4.890887709020e-05
2150.00000  2200.00000  5.182881005081e-05
2200.00000  2250.00000  5.839865921218e-05
2250.00000  2300.00000  4.525896088944e-05
2300.00000  2350.00000  1.372368491486e-04
2350.00000  2400.00000  5.182881005081e-05
2400.00000  2450.00000  4.087906144852e-05
2450.00000  2500.00000  4.671892736974e-05
2500.00000  2550.00000  4.306901116898e-05
2550.00000  2600.00000  4.233902792883e-05
2600.00000  2650.00000  4.379899440913e-05
2650.00000  2700.00000  4.525896088944e-05
2700.00000  2750.00000  4.379899440913e-05
2750.00000  2800.00000  3.941909496822e-05
2800.00000  2850.00000  4.306901116898e-05
2850.00000  2900.00000  4.379899440913e-05
2900.00000  2950.00000  4.014907820837e-05
2950.00000  3000.00000  6.204857541294e-05
3000.00000  3050.00000  4.525896088944e-05
3050.00000  3100.00000  3.795912848791e-05
3100.00000  3150.00000  4.525896088944e-05
3150.00000  3200.00000  4.087906144852e-05
3200.00000  3250.00000  3.503919552731e-05
3250.00000  3300.00000  4.014907820837e-05
3300.00000  3350.00000  3.795912848791e-05
3350.00000  3400.00000  4.525896088944e-05
3400.00000  3450.00000  4.671892736974e-05
3450.00000  3500.00000  5.036884357050e-05
3500.00000  3550.00000  3.649916200761e-05
3550.00000  3600.00000  3.795912848791e-05
3600.00000  3650.00000  4.014907820837e-05
3650.00000  3700.00000  6.350854189324e-05
3700.00000  3750.00000  4.306901116898e-05
3750.00000  3800.00000  4.160904468868e-05
3800.00000  3850.00000  4.087906144852e-05
3850.00000  3900.00000  4.014907820837e-05
3900.00000  3950.00000  5.036884357050e-05
3950.00000  4000.00000  3.430921228715e-05
4000.00000  4050.00000  4.598894412959e-05
4050.00000  4100.00000  3.941909496822e-05
4100.00000  4150.00000  4.890887709020e-05
4150.00000  4200.00000  3.503919552731e-05
4200.00000  4250.00000  3.065929608639e-05
4250.00000  4300.00000  3.722914524776e-05
4300.00000  4350.00000  4.306901116898e-05
4350.00000  4400.00000  4.525896088944e-05
4400.00000  4450.00000  4.598894412959e-05
4450.00000  4500.00000  2.992931284624e-05
4500.00000  4550.00000  4.306901116898e-05
4550.00000  4600.00000  4.087906144852e-05
4600.00000  4650.00000  4.306901116898e-05
4650.00000  4700.00000  3.868911172807e-05
4700.00000  4750.00000  4.160904468868e-05
4750.00000  4800.00000  4.233902792883e-05
4800.00000  4850.00000  3.211926256670e-05
4850.00000  4900.00000  3.795912848791e-05
4900.00000  4950.00000  4.598894412959e-05
4950.00000  5000.00000  4.671892736974e-05
5000.00000  5050.00000  5.182881005081e-05
5050.00000  5100.00000  4.598894412959e-05
5100.00000  5150.00000  4.160904468868e-05
5150.00000  5200.00000  3.868911172807e-05
5200.00000  5250.00000  3.795912848791e-05
5250.00000  5300.00000  4.817889385005e-05
5300.00000  5350.00000  3.722914524776e-05
5350.00000  5400.00000  4.014907820837e-05
5400.00000  5450.00000  3.795912848791e-05
5450.00000  5500.00000  4.525896088944e-05
5500.00000  5550.00000  3.722914524776e-05
5550.00000  5600.00000  4.160904468868e-05
5600.00000  5650.00000  4.598894412959e-05
5650.00000  5700.00000  4.890887709020e-05
5700.00000  5750.00000  3.284924580685e-05
5750.00000  5800.00000  4.598894412959e-05
5800.00000  5850.00000  3.649916200761e-05
5850.00000  5900.00000  4.744891060989e-05
5900.00000  5950.00000  3.941909496822e-05
5950.00000  6000.00000  3.503919552731e-05
6000.00000  6050.00000  4.817889385005e-05
6050.00000  6100.00000  4.233902792883e-05
6100.00000  6150.00000  5.766867597202e-05
6150.00000  6200.00000  4.744891060989e-05
6200.00000  6250.00000  6.423852513339e-05
6250.00000  6300.00000  7.956817317659e-05
6300.00000  6350.00000  8.759798881826e-05
6350.00000  6400.00000  5.934763742437e-04
6400.00000  6450.00000  4.890887709020e-05
6450.00000  6500.00000  3.430921228715e-05
6500.00000  6550.00000  5.474874301141e-05
6550.00000  6600.00000  4.233902792883e-05
6600.00000  6650.00000  4.160904468868e-05
6650.00000  6700.00000  4.744891060989e-05
6700.00000  6750.00000  3.795912848791e-05
6750.00000  6800.00000  3.795912848791e-05
6800.00000  6850.00000  4.160904468868e-05
6850.00000  6900.00000  4.233902792883e-05
6900.00000  6950.00000  4.160904468868e-05
6950.00000  7000.00000  5.255879329096e-05
7000.00000  7050.00000  4.379899440913e-05
7050.00000  7100.00000  9.635778770009e-05
7100.00000  7150.00000  2.627939664548e-05
7150.00000  7200.00000  2.043953072426e-05
7200.00000  7250.00000  2.043953072426e-05
7250.00000  7300.00000  2.116951396441e-05
7300.00000  7350.00000  2.189949720457e-05
7350.00000  7400.00000  2.919932960609e-05
7400.00000  7450.00000  2.335946368487e-05
7450.00000  7500.00000  4.452897764928e-05
7500.00000  7550.00000  3.065929608639e-05
7550.00000  7600.00000  1.751959776365e-05
7600.00000  7650.00000  2.481943016517e-05
7650.00000  7700.00000  1.532964804320e-05
7700.00000  7750.00000  2.335946368487e-05
7750.00000  7800.00000  2.919932960609e-05
7800.00000  7850.00000  2.627939664548e-05
7850.00000  7900.00000  2.773936312578e-05
7900.00000  7950.00000  2.189949720457e-05
7950.00000  8000.00000  2.481943016517e-05
8000.00000  8050.00000  2.335946368487e-05
8050.00000  8100.00000  2.189949720457e-05
8100.00000  8150.00000  2.408944692502e-05
8150.00000  8200.00000  2.554941340533e-05
8200.00000  8250.00000  1.970954748411e-05
8250.00000  8300.00000  2.773936312578e-05
8300.00000  8350.00000  1.970954748411e-05
8350.00000  8400.00000  2.554941340533e-05
8400.00000  8450.00000  1.897956424396e-05
8450.00000  8500.00000  1.897956424396e-05
8500.00000  8550.00000  1.970954748411e-05
8550.00000  8600.00000  2.189949720457e-05
8600.00000  8650.00000  1.605963128335e-05
8650.00000  8700.00000  2.919932960609e-05
8700.00000  8750.00000  2.554941340533e-05
8750.00000  8800.00000  2.189949720457e-05
8800.00000  8850.00000  2.262948044472e-05
8850.00000  8900.00000  2.116951396441e-05
8900.00000  8950.00000  1.970954748411e-05
8950.00000  9000.00000  1.897956424396e-05
9000.00000  9050.00000  1.605963128335e-05
9050.00000  9100.00000  2.262948044472e-05
9100.00000  9150.00000  2.043953072426e-05
9150.00000  9200.00000  2.043953072426e-05
9200.00000  9250.00000  1.459966480304e-05
9250.00000  9300.00000  2.335946368487e-05
9300.00000  9350.00000  2.554941340533e-05
9350.00000  9400.00000  2.262948044472e-05
9400.00000  9450.00000  1.751959776365e-05
9450.00000  9500.00000  2.919932960609e-05
9500.00000  9550.00000  2.043953072426e-05
9550.00000  9600.00000  2.116951396441e-05
9600.00000  9650.00000  1.386968156289e-05
9650.00000  9700.00000  1.897956424396e-05
9700.00000  9750.00000  2.043953072426e-05
9750.00000  9800.00000  2.919932960609e-05
9800.00000  9850.00000  1.751959776365e-05
9850.00000  9900.00000  2.627939664548e-05
9900.00000  9950.00000  1.751959776365e-05
9950.00000  10000.00000  2.992931284624e-05
