300.00000  350.00000  1.445003954159e-05
350.00000  400.00000  2.809729910864e-05
400.00000  450.00000  5.780015816635e-05
450.00000  500.00000  4.471484458147e-04
500.00000  550.00000  1.476312373166e-03
550.00000  600.00000  7.241075370285e-04
600.00000  650.00000  2.309597986731e-03
650.00000  700.00000  4.800624247706e-03
700.00000  750.00000  6.867782682127e-03
750.00000  800.00000  1.021778351585e-02
800.00000  850.00000  1.416746099055e-02
850.00000  900.00000  1.464832619530e-02
900.00000  950.00000  1.653325357550e-02
950.00000  1000.00000  1.945778102272e-02
1000.00000  1050.00000  2.177861792910e-02
1050.00000  1100.00000  2.392685714095e-02
1100.00000  1150.00000  2.518963004089e-02
1150.00000  1200.00000  2.666273129415e-02
1200.00000  1250.00000  2.739968331078e-02
1250.00000  1300.00000  2.785164843644e-02
1300.00000  1350.00000  2.644999460090e-02
1350.00000  1400.00000  2.641386950205e-02
1400.00000  1450.00000  2.621638562831e-02
1450.00000  1500.00000  2.567691748543e-02
1500.00000  1550.00000  2.550030589103e-02
1550.00000  1600.00000  2.480670399304e-02
1600.00000  1650.00000  2.387628200255e-02
1650.00000  1700.00000  2.303416580927e-02
1700.00000  1750.00000  2.243047526842e-02
1750.00000  1800.00000  2.141977528048e-02
1800.00000  1850.00000  2.047811437035e-02
1850.00000  1900.00000  1.943931708331e-02
1900.00000  1950.00000  1.896487411836e-02
1950.00000  2000.00000  1.834673353797e-02
2000.00000  2050.00000  1.719956095436e-02
2050.00000  2100.00000  1.663038995242e-02
2100.00000  2150.00000  1.605800783058e-02
2150.00000  2200.00000  1.527770569533e-02
2200.00000  2250.00000  1.489638520743e-02
2250.00000  2300.00000  1.422445836874e-02
2300.00000  2350.00000  1.388247409959e-02
2350.00000  2400.00000  1.325470015951e-02
2400.00000  2450.00000  1.278346831446e-02
2450.00000  2500.00000  1.207300803700e-02
2500.00000  2550.00000  1.138502559882e-02
2550.00000  2600.00000  1.107515252865e-02
2600.00000  2650.00000  1.086241583540e-02
2650.00000  2700.00000  1.020092513639e-02
2700.00000  2750.00000  9.846096387644e-03
2750.00000  2800.00000  9.515351038136e-03
2800.00000  2850.00000  9.006388534282e-03
2850.00000  2900.00000  8.863493698816e-03
2900.00000  2950.00000  8.407514673281e-03
2950.00000  3000.00000  8.128950022118e-03
3000.00000  3050.00000  7.861624290599e-03
3050.00000  3100.00000  7.524456701295e-03
3100.00000  3150.00000  7.370322946185e-03
3150.00000  3200.00000  6.976157978689e-03
3200.00000  3250.00000  6.849318742713e-03
3250.00000  3300.00000  6.639793169360e-03
3300.00000  3350.00000  6.329920099190e-03
3350.00000  3400.00000  6.236797622145e-03
3400.00000  3450.00000  5.964655210778e-03
3450.00000  3500.00000  5.868321613834e-03
3500.00000  3550.00000  5.739876817909e-03
3550.00000  3600.00000  5.301558951814e-03
3600.00000  3650.00000  5.353739650159e-03
3650.00000  3700.00000  5.088019478588e-03
3700.00000  3750.00000  4.976433062128e-03
3750.00000  3800.00000  4.738007409692e-03
3800.00000  3850.00000  4.575043074862e-03
3850.00000  3900.00000  4.534101296161e-03
3900.00000  3950.00000  4.398431480465e-03
3950.00000  4000.00000  4.325378502782e-03
4000.00000  4050.00000  4.099797329939e-03
4050.00000  4100.00000  3.963324734268e-03
4100.00000  4150.00000  3.859766117553e-03
4150.00000  4200.00000  3.787515919845e-03
4200.00000  4250.00000  3.722490741908e-03
4250.00000  4300.00000  3.603679305677e-03
4300.00000  4350.00000  3.443123310771e-03
4350.00000  4400.00000  3.448742770592e-03
4400.00000  4450.00000  3.237611637290e-03
4450.00000  4500.00000  3.218344917902e-03
4500.00000  4550.00000  3.114786301187e-03
4550.00000  4600.00000  3.122011320958e-03
4600.00000  4650.00000  2.978313705516e-03
4650.00000  4700.00000  2.883585668521e-03
4700.00000  4750.00000  2.832207750151e-03
4750.00000  4800.00000  2.731860253335e-03
4800.00000  4850.00000  2.645160016085e-03
4850.00000  4900.00000  2.584951517995e-03
4900.00000  4950.00000  2.543206959320e-03
4950.00000  5000.00000  2.483801241204e-03
5000.00000  5050.00000  2.488617921051e-03
5050.00000  5100.00000  2.377834284566e-03
5100.00000  5150.00000  2.335286945916e-03
5150.00000  5200.00000  2.310400766705e-03
5200.00000  5250.00000  2.271064547953e-03
5250.00000  5300.00000  2.142619752028e-03
5300.00000  5350.00000  2.095255733530e-03
5350.00000  5400.00000  2.080002914014e-03
5400.00000  5450.00000  2.004541596408e-03
5450.00000  5500.00000  1.894560739897e-03
5500.00000  5550.00000  1.900982979693e-03
5550.00000  5600.00000  1.821507762215e-03
5600.00000  5650.00000  1.835155021782e-03
5650.00000  5700.00000  1.783777103412e-03
5700.00000  5750.00000  1.770129843845e-03
5750.00000  5800.00000  1.720357485424e-03
5800.00000  5850.00000  1.707513005831e-03
5850.00000  5900.00000  1.660148987334e-03
5900.00000  5950.00000  1.575054310033e-03
5950.00000  6000.00000  1.606362729040e-03
6000.00000  6050.00000  1.532506971383e-03
6050.00000  6100.00000  1.491565192682e-03
6100.00000  6150.00000  1.459453993700e-03
6150.00000  6200.00000  1.422526114872e-03
6200.00000  6250.00000  1.419314994974e-03
6250.00000  6300.00000  1.418512214999e-03
6300.00000  6350.00000  1.349473137189e-03
6350.00000  6400.00000  1.511634692045e-03
6400.00000  6450.00000  1.314150818310e-03
6450.00000  6500.00000  1.335023097648e-03
6500.00000  6550.00000  1.261167339991e-03
6550.00000  6600.00000  1.243506180551e-03
6600.00000  6650.00000  1.261167339991e-03
6650.00000  6700.00000  1.214606101468e-03
6700.00000  6750.00000  1.164030963072e-03
6750.00000  6800.00000  1.120680844448e-03
6800.00000  6850.00000  1.146369803633e-03
6850.00000  6900.00000  1.111850264728e-03
6900.00000  6950.00000  1.098203005161e-03
6950.00000  7000.00000  1.090977985390e-03
7000.00000  7050.00000  1.054852886536e-03
7050.00000  7100.00000  1.059669566383e-03
7100.00000  7150.00000  9.793915689299e-04
7150.00000  7200.00000  9.842082487771e-04
7200.00000  7250.00000  9.416609101269e-04
7250.00000  7300.00000  9.183802908654e-04
7300.00000  7350.00000  9.585192895920e-04
7350.00000  7400.00000  9.336331103815e-04
7400.00000  7450.00000  9.119580510691e-04
7450.00000  7500.00000  8.830579719860e-04
7500.00000  7550.00000  8.686079324444e-04
7550.00000  7600.00000  8.653968125463e-04
7600.00000  7650.00000  8.421161932848e-04
7650.00000  7700.00000  8.774385121642e-04
7700.00000  7750.00000  8.718190523425e-04
7750.00000  7800.00000  8.051883144563e-04
7800.00000  7850.00000  7.883299349911e-04
7850.00000  7900.00000  7.514020561626e-04
7900.00000  7950.00000  7.401631365192e-04
7950.00000  8000.00000  7.738798954495e-04
8000.00000  8050.00000  7.497964962135e-04
8050.00000  8100.00000  7.698659955769e-04
8100.00000  8150.00000  6.831657583273e-04
8150.00000  8200.00000  7.409659164937e-04
8200.00000  8250.00000  7.505992761881e-04
8250.00000  8300.00000  7.144741773341e-04
8300.00000  8350.00000  6.944046779708e-04
8350.00000  8400.00000  6.486462194224e-04
8400.00000  8450.00000  6.542656792442e-04
8450.00000  8500.00000  6.542656792442e-04
8500.00000  8550.00000  6.358017398299e-04
8550.00000  8600.00000  6.149294604920e-04
8600.00000  8650.00000  6.229572602374e-04
8650.00000  8700.00000  6.213517002883e-04
8700.00000  8750.00000  5.852266014343e-04
8750.00000  8800.00000  5.619459821729e-04
8800.00000  8850.00000  5.820154815362e-04
8850.00000  8900.00000  5.563265223512e-04
8900.00000  8950.00000  5.763960217145e-04
8950.00000  9000.00000  5.876349413579e-04
9000.00000  9050.00000  5.474959426313e-04
9050.00000  9100.00000  5.282292232425e-04
9100.00000  9150.00000  4.880902245159e-04
9150.00000  9200.00000  4.945124643121e-04
9200.00000  9250.00000  4.856818845923e-04
9250.00000  9300.00000  5.234125433953e-04
9300.00000  9350.00000  4.921041243885e-04
9350.00000  9400.00000  4.752457449234e-04
9400.00000  9450.00000  4.937096843376e-04
9450.00000  9500.00000  4.784568648215e-04
9500.00000  9550.00000  5.057513839556e-04
9550.00000  9600.00000  4.487540057638e-04
9600.00000  9650.00000  4.375150861203e-04
9650.00000  9700.00000  4.359095261713e-04
9700.00000  9750.00000  4.503595657128e-04
9750.00000  9800.00000  4.439373259166e-04
9800.00000  9850.00000  4.375150861203e-04
9850.00000  9900.00000  4.335011862477e-04
9900.00000  9950.00000  4.166428067825e-04
9950.00000  10000.00000  4.262761664769e-04
