10001.00000  11001.00000  9.990188174984e-04
11001.00000  12001.00000  8.772357349153e-04
12001.00000  13001.00000  7.652748070024e-04
13001.00000  14001.00000  6.801914829844e-04
14001.00000  15001.00000  6.055993449022e-04
15001.00000  16001.00000  5.386962183240e-04
16001.00000  17001.00000  4.860657587491e-04
17001.00000  18001.00000  4.420939212081e-04
18001.00000  19001.00000  4.039106585320e-04
19001.00000  20001.00000  3.680059806017e-04
20001.00000  21001.00000  3.385492126966e-04
21001.00000  22001.00000  3.089276110015e-04
22001.00000  23001.00000  2.874313455487e-04
23001.00000  24001.00000  2.676609868396e-04
24001.00000  25001.00000  2.502564778239e-04
25001.00000  26001.00000  2.309709243798e-04
26001.00000  27001.00000  2.142257505247e-04
27001.00000  28001.00000  2.006027225765e-04
28001.00000  29001.00000  1.878814324213e-04
29001.00000  30001.00000  1.779041400664e-04
30001.00000  31001.00000  1.671414631821e-04
31001.00000  32001.00000  1.575229267233e-04
32001.00000  33001.00000  1.501635827997e-04
33001.00000  34001.00000  1.394590825471e-04
34001.00000  35001.00000  1.340680479997e-04
35001.00000  36001.00000  1.273001664994e-04
36001.00000  37001.00000  1.206583343681e-04
37001.00000  38001.00000  1.161593415084e-04
38001.00000  39001.00000  1.095465976929e-04
39001.00000  40001.00000  1.030986876676e-04
40001.00000  41001.00000  1.009461522908e-04
41001.00000  42001.00000  9.417827079054e-05
42001.00000  43001.00000  9.159910678042e-05
43001.00000  44001.00000  8.788549845006e-05
44001.00000  45001.00000  8.416219401440e-05
45001.00000  46001.00000  7.986681936597e-05
46001.00000  47001.00000  7.669619293248e-05
47001.00000  48001.00000  7.281775081200e-05
48001.00000  49001.00000  7.051977385562e-05
49001.00000  50001.00000  6.680616552526e-05
50001.00000  51001.00000  6.556506404670e-05
51001.00000  52001.00000  6.150239592550e-05
52001.00000  53001.00000  6.029038276285e-05
53001.00000  54001.00000  5.819602401779e-05
54001.00000  55001.00000  5.630528348406e-05
55001.00000  56001.00000  5.442423905563e-05
56001.00000  57001.00000  5.307648041876e-05
57001.00000  58001.00000  4.960527472093e-05
58001.00000  59001.00000  4.897502787635e-05
59001.00000  60001.00000  4.769514197659e-05
60001.00000  61001.00000  4.583348975876e-05
61001.00000  62001.00000  4.350642448648e-05
62001.00000  63001.00000  4.263377500937e-05
63001.00000  64001.00000  4.143145795202e-05
64001.00000  65001.00000  3.988977720913e-05
65001.00000  66001.00000  3.881350952070e-05
66001.00000  67001.00000  3.760149635805e-05
67001.00000  68001.00000  3.662218972263e-05
68001.00000  69001.00000  3.576893245612e-05
69001.00000  70001.00000  3.405272181781e-05
70001.00000  71001.00000  3.387819192239e-05
71001.00000  72001.00000  3.246256054841e-05
72001.00000  73001.00000  3.094996812143e-05
73001.00000  74001.00000  3.040698622456e-05
74001.00000  75001.00000  2.858411842793e-05
75001.00000  76001.00000  2.910770811420e-05
76001.00000  77001.00000  2.904953148239e-05
77001.00000  78001.00000  2.707152600095e-05
78001.00000  79001.00000  2.716848705396e-05
79001.00000  80001.00000  2.500625557179e-05
80001.00000  81001.00000  2.508382441420e-05
81001.00000  82001.00000  2.461841135974e-05
82001.00000  83001.00000  2.302825009035e-05
83001.00000  84001.00000  2.255314093059e-05
84001.00000  85001.00000  2.150596155806e-05
85001.00000  86001.00000  2.177745250649e-05
86001.00000  87001.00000  2.211681619203e-05
87001.00000  88001.00000  2.080784197637e-05
88001.00000  89001.00000  2.042969386963e-05
89001.00000  90001.00000  1.969278986673e-05
90001.00000  91001.00000  1.938251449710e-05
91001.00000  92001.00000  1.886862091613e-05
92001.00000  93001.00000  1.869409102071e-05
93001.00000  94001.00000  1.865530659951e-05
94001.00000  95001.00000  1.728815575204e-05
95001.00000  96001.00000  1.612462311589e-05
96001.00000  97001.00000  1.643489848553e-05
97001.00000  98001.00000  1.601796595758e-05
98001.00000  99001.00000  1.584343606216e-05
99001.00000  100001.00000  1.548468016601e-05
100001.00000  101001.00000  1.538771911300e-05
101001.00000  102001.00000  1.406904879204e-05
102001.00000  103001.00000  1.425327479276e-05
103001.00000  104001.00000  1.456355016240e-05
104001.00000  105001.00000  1.409813710794e-05
105001.00000  106001.00000  1.386543058071e-05
106001.00000  107001.00000  1.274068236577e-05
107001.00000  108001.00000  1.285703562939e-05
108001.00000  109001.00000  1.270189794457e-05
109001.00000  110001.00000  1.201347446818e-05
110001.00000  111001.00000  1.243040699614e-05
111001.00000  112001.00000  1.207165109999e-05
112001.00000  113001.00000  1.190681730987e-05
113001.00000  114001.00000  1.126687435999e-05
114001.00000  115001.00000  1.116021720168e-05
115001.00000  116001.00000  1.124748214939e-05
116001.00000  117001.00000  1.070450025252e-05
117001.00000  118001.00000  1.027787161927e-05
118001.00000  119001.00000  9.899723512524e-06
119001.00000  120001.00000  9.938507933728e-06
120001.00000  121001.00000  9.570055932283e-06
121001.00000  122001.00000  9.686409195897e-06
122001.00000  123001.00000  9.356741615656e-06
123001.00000  124001.00000  1.010334172385e-05
124001.00000  125001.00000  9.385829931560e-06
125001.00000  126001.00000  8.464699927946e-06
126001.00000  127001.00000  8.736190876380e-06
127001.00000  128001.00000  8.135032347705e-06
128001.00000  129001.00000  8.290170032525e-06
129001.00000  130001.00000  8.222297295416e-06
130001.00000  131001.00000  7.979894662886e-06
131001.00000  132001.00000  7.834453083368e-06
132001.00000  133001.00000  7.262382870598e-06
133001.00000  134001.00000  8.154424558308e-06
134001.00000  135001.00000  7.640530977344e-06
135001.00000  136001.00000  7.495089397826e-06
136001.00000  137001.00000  7.485393292525e-06
137001.00000  138001.00000  6.341252866984e-06
138001.00000  139001.00000  6.835754237345e-06
139001.00000  140001.00000  6.758185394935e-06
140001.00000  141001.00000  6.738793184333e-06
141001.00000  142001.00000  6.467302235899e-06
142001.00000  143001.00000  6.205507392767e-06
143001.00000  144001.00000  6.215203498068e-06
144001.00000  145001.00000  6.273380129875e-06
145001.00000  146001.00000  6.021281392044e-06
146001.00000  147001.00000  6.283076235177e-06
147001.00000  148001.00000  6.166722971562e-06
148001.00000  149001.00000  5.623741074695e-06
149001.00000  150001.00000  5.778878759514e-06
150001.00000  151001.00000  5.381338442165e-06
151001.00000  152001.00000  5.623741074695e-06
152001.00000  153001.00000  5.381338442165e-06
153001.00000  154001.00000  5.041974756623e-06
154001.00000  155001.00000  5.226200757346e-06
155001.00000  156001.00000  4.964405914214e-06
156001.00000  157001.00000  4.673522755178e-06
157001.00000  158001.00000  4.712307176382e-06
158001.00000  159001.00000  4.644434439274e-06
159001.00000  160001.00000  4.780179913491e-06
160001.00000  161001.00000  4.857748755900e-06
161001.00000  162001.00000  4.605650018069e-06
162001.00000  163001.00000  4.324462964334e-06
163001.00000  164001.00000  4.324462964334e-06
164001.00000  165001.00000  4.537777280961e-06
165001.00000  166001.00000  4.179021384817e-06
166001.00000  167001.00000  4.547473386262e-06
167001.00000  168001.00000  4.275982437828e-06
168001.00000  169001.00000  4.246894121925e-06
169001.00000  170001.00000  4.179021384817e-06
170001.00000  171001.00000  3.810569383371e-06
171001.00000  172001.00000  3.878442120479e-06
172001.00000  173001.00000  3.752392751564e-06
173001.00000  174001.00000  3.665127803853e-06
174001.00000  175001.00000  3.490597908431e-06
175001.00000  176001.00000  3.742696646263e-06
176001.00000  177001.00000  3.529382329636e-06
177001.00000  178001.00000  3.383940750118e-06
178001.00000  179001.00000  3.403332960721e-06
179001.00000  180001.00000  3.393636855419e-06
180001.00000  181001.00000  3.180322538793e-06
181001.00000  182001.00000  3.228803065299e-06
182001.00000  183001.00000  3.083361485781e-06
183001.00000  184001.00000  3.219106959998e-06
184001.00000  185001.00000  3.131842012287e-06
185001.00000  186001.00000  2.889439379757e-06
186001.00000  187001.00000  3.471205697829e-06
187001.00000  188001.00000  3.025184853974e-06
188001.00000  189001.00000  2.908831590360e-06
189001.00000  190001.00000  2.773086116143e-06
190001.00000  191001.00000  2.520987378312e-06
191001.00000  192001.00000  2.695517273733e-06
192001.00000  193001.00000  2.666428957830e-06
193001.00000  194001.00000  2.569467904818e-06
194001.00000  195001.00000  2.734301694938e-06
195001.00000  196001.00000  2.763390010842e-06
196001.00000  197001.00000  2.162231482167e-06
197001.00000  198001.00000  2.433722430601e-06
198001.00000  199001.00000  2.424026325300e-06
