10001.00000  11001.00000  1.406319518711e-05
11001.00000  12001.00000  1.632173831137e-05
12001.00000  13001.00000  1.892157239664e-05
13001.00000  14001.00000  2.299698798977e-05
14001.00000  15001.00000  2.547636644174e-05
15001.00000  16001.00000  2.898965574616e-05
16001.00000  17001.00000  3.019421207910e-05
17001.00000  18001.00000  3.090690790942e-05
18001.00000  19001.00000  3.183040109801e-05
19001.00000  20001.00000  3.086675603166e-05
20001.00000  21001.00000  2.992318690419e-05
21001.00000  22001.00000  2.859817493795e-05
22001.00000  23001.00000  2.581765740274e-05
23001.00000  24001.00000  2.443241761986e-05
24001.00000  25001.00000  2.252520342603e-05
25001.00000  26001.00000  2.077859674326e-05
26001.00000  27001.00000  1.940339492982e-05
27001.00000  28001.00000  1.678348490567e-05
28001.00000  29001.00000  1.571946014490e-05
29001.00000  30001.00000  1.413346097319e-05
30001.00000  31001.00000  1.359141062337e-05
31001.00000  32001.00000  1.189499378781e-05
32001.00000  33001.00000  1.179461409340e-05
33001.00000  34001.00000  9.957665685660e-06
34001.00000  35001.00000  8.943830772100e-06
35001.00000  36001.00000  8.150831186246e-06
36001.00000  37001.00000  7.478287233686e-06
37001.00000  38001.00000  7.317679722627e-06
38001.00000  39001.00000  6.243616992420e-06
39001.00000  40001.00000  5.641338825949e-06
40001.00000  41001.00000  5.370313651036e-06
41001.00000  42001.00000  4.727883606800e-06
42001.00000  43001.00000  4.316326859712e-06
43001.00000  44001.00000  4.456858431888e-06
44001.00000  45001.00000  4.015187776476e-06
45001.00000  46001.00000  3.663858846034e-06
46001.00000  47001.00000  3.111770526769e-06
47001.00000  48001.00000  2.830707382415e-06
48001.00000  49001.00000  2.890935199063e-06
49001.00000  50001.00000  2.519530329739e-06
50001.00000  51001.00000  2.469340482533e-06
51001.00000  52001.00000  2.238467185385e-06
52001.00000  53001.00000  1.987517949356e-06
53001.00000  54001.00000  1.796796529973e-06
54001.00000  55001.00000  1.686378866120e-06
55001.00000  56001.00000  1.857024346620e-06
56001.00000  57001.00000  1.475581507855e-06
57001.00000  58001.00000  1.435429630090e-06
58001.00000  59001.00000  1.244708210708e-06
59001.00000  60001.00000  1.144328516296e-06
60001.00000  61001.00000  1.264784149590e-06
61001.00000  62001.00000  1.134290546854e-06
62001.00000  63001.00000  9.234931885894e-07
63001.00000  64001.00000  9.435691274718e-07
64001.00000  65001.00000  1.053986791325e-06
65001.00000  66001.00000  8.030375552952e-07
66001.00000  67001.00000  9.034172497071e-07
67001.00000  68001.00000  7.428097386480e-07
68001.00000  69001.00000  7.528477080892e-07
69001.00000  70001.00000  6.022781664714e-07
70001.00000  71001.00000  5.922401970302e-07
71001.00000  72001.00000  6.123161359126e-07
72001.00000  73001.00000  4.818225331771e-07
73001.00000  74001.00000  5.621262887066e-07
74001.00000  75001.00000  5.420503498242e-07
75001.00000  76001.00000  4.215947165300e-07
76001.00000  77001.00000  4.717845637359e-07
77001.00000  78001.00000  4.215947165300e-07
78001.00000  79001.00000  5.018984720595e-07
79001.00000  80001.00000  3.212150221181e-07
80001.00000  81001.00000  3.312529915593e-07
81001.00000  82001.00000  3.312529915593e-07
82001.00000  83001.00000  3.212150221181e-07
83001.00000  84001.00000  2.007593888238e-07
84001.00000  85001.00000  1.806834499414e-07
85001.00000  86001.00000  2.609872054709e-07
86001.00000  87001.00000  1.606075110590e-07
87001.00000  88001.00000  2.007593888238e-07
88001.00000  89001.00000  2.710251749121e-07
89001.00000  90001.00000  2.208353277062e-07
90001.00000  91001.00000  1.907214193826e-07
91001.00000  92001.00000  2.308732971474e-07
92001.00000  93001.00000  1.304936027355e-07
93001.00000  94001.00000  2.710251749121e-07
94001.00000  95001.00000  1.606075110590e-07
95001.00000  96001.00000  1.405315721767e-07
96001.00000  97001.00000  1.907214193826e-07
97001.00000  98001.00000  1.204556332943e-07
98001.00000  99001.00000  1.003796944119e-07
99001.00000  100001.00000  1.003796944119e-07
100001.00000  101001.00000  1.304936027355e-07
101001.00000  102001.00000  6.022781664714e-08
102001.00000  103001.00000  1.003796944119e-07
103001.00000  104001.00000  8.030375552952e-08
104001.00000  105001.00000  1.003796944119e-07
105001.00000  106001.00000  1.003796944119e-07
106001.00000  107001.00000  1.706454805002e-07
107001.00000  108001.00000  6.022781664714e-08
108001.00000  109001.00000  1.706454805002e-07
109001.00000  110001.00000  6.022781664714e-08
110001.00000  111001.00000  9.034172497071e-08
111001.00000  112001.00000  7.026578608833e-08
112001.00000  113001.00000  9.034172497071e-08
113001.00000  114001.00000  5.018984720595e-08
114001.00000  115001.00000  4.015187776476e-08
115001.00000  116001.00000  3.011390832357e-08
116001.00000  117001.00000  4.015187776476e-08
117001.00000  118001.00000  1.003796944119e-07
118001.00000  119001.00000  4.015187776476e-08
119001.00000  120001.00000  3.011390832357e-08
120001.00000  121001.00000  5.018984720595e-08
121001.00000  122001.00000  3.011390832357e-08
122001.00000  123001.00000  6.022781664714e-08
123001.00000  124001.00000  2.007593888238e-08
124001.00000  125001.00000  3.011390832357e-08
125001.00000  126001.00000  1.003796944119e-08
126001.00000  127001.00000  4.015187776476e-08
127001.00000  128001.00000  7.026578608833e-08
128001.00000  129001.00000  6.022781664714e-08
129001.00000  130001.00000  6.022781664714e-08
130001.00000  131001.00000  3.011390832357e-08
131001.00000  132001.00000  4.015187776476e-08
132001.00000  133001.00000  1.003796944119e-08
133001.00000  134001.00000  4.015187776476e-08
134001.00000  135001.00000  3.011390832357e-08
135001.00000  136001.00000  1.003796944119e-08
136001.00000  137001.00000  5.018984720595e-08
137001.00000  138001.00000  0.000000000000e+00
138001.00000  139001.00000  4.015187776476e-08
139001.00000  140001.00000  2.007593888238e-08
140001.00000  141001.00000  4.015187776476e-08
141001.00000  142001.00000  0.000000000000e+00
142001.00000  143001.00000  3.011390832357e-08
143001.00000  144001.00000  2.007593888238e-08
144001.00000  145001.00000  0.000000000000e+00
145001.00000  146001.00000  2.007593888238e-08
146001.00000  147001.00000  0.000000000000e+00
147001.00000  148001.00000  4.015187776476e-08
148001.00000  149001.00000  2.007593888238e-08
149001.00000  150001.00000  3.011390832357e-08
150001.00000  151001.00000  0.000000000000e+00
151001.00000  152001.00000  2.007593888238e-08
152001.00000  153001.00000  0.000000000000e+00
153001.00000  154001.00000  0.000000000000e+00
154001.00000  155001.00000  1.003796944119e-08
155001.00000  156001.00000  0.000000000000e+00
156001.00000  157001.00000  0.000000000000e+00
157001.00000  158001.00000  1.003796944119e-08
158001.00000  159001.00000  1.003796944119e-08
159001.00000  160001.00000  1.003796944119e-08
160001.00000  161001.00000  0.000000000000e+00
161001.00000  162001.00000  1.003796944119e-08
162001.00000  163001.00000  0.000000000000e+00
163001.00000  164001.00000  2.007593888238e-08
164001.00000  165001.00000  0.000000000000e+00
165001.00000  166001.00000  2.007593888238e-08
166001.00000  167001.00000  1.003796944119e-08
167001.00000  168001.00000  1.003796944119e-08
168001.00000  169001.00000  1.003796944119e-08
169001.00000  170001.00000  0.000000000000e+00
170001.00000  171001.00000  0.000000000000e+00
171001.00000  172001.00000  0.000000000000e+00
172001.00000  173001.00000  0.000000000000e+00
173001.00000  174001.00000  0.000000000000e+00
174001.00000  175001.00000  0.000000000000e+00
175001.00000  176001.00000  0.000000000000e+00
176001.00000  177001.00000  0.000000000000e+00
177001.00000  178001.00000  0.000000000000e+00
178001.00000  179001.00000  0.000000000000e+00
179001.00000  180001.00000  0.000000000000e+00
180001.00000  181001.00000  0.000000000000e+00
181001.00000  182001.00000  0.000000000000e+00
182001.00000  183001.00000  1.003796944119e-08
183001.00000  184001.00000  0.000000000000e+00
184001.00000  185001.00000  1.003796944119e-08
185001.00000  186001.00000  2.007593888238e-08
186001.00000  187001.00000  1.003796944119e-08
187001.00000  188001.00000  0.000000000000e+00
188001.00000  189001.00000  0.000000000000e+00
189001.00000  190001.00000  1.003796944119e-08
190001.00000  191001.00000  0.000000000000e+00
191001.00000  192001.00000  0.000000000000e+00
192001.00000  193001.00000  0.000000000000e+00
193001.00000  194001.00000  0.000000000000e+00
194001.00000  195001.00000  0.000000000000e+00
195001.00000  196001.00000  0.000000000000e+00
196001.00000  197001.00000  0.000000000000e+00
197001.00000  198001.00000  0.000000000000e+00
198001.00000  199001.00000  0.000000000000e+00
