300.00000  350.00000  1.789366094491e-06
350.00000  400.00000  4.652351845677e-06
400.00000  450.00000  5.010225064575e-06
450.00000  500.00000  6.799591159067e-06
500.00000  550.00000  5.761758824262e-05
550.00000  600.00000  3.936605407881e-06
600.00000  650.00000  1.395705553703e-05
650.00000  700.00000  6.799591159067e-06
700.00000  750.00000  1.324130909923e-05
750.00000  800.00000  1.002045012915e-05
800.00000  850.00000  3.471370223313e-05
850.00000  900.00000  1.073619656695e-05
900.00000  950.00000  9.662576910252e-06
950.00000  1000.00000  1.037832334805e-05
1000.00000  1050.00000  9.662576910252e-06
1050.00000  1100.00000  1.145194300474e-05
1100.00000  1150.00000  1.324130909923e-05
1150.00000  1200.00000  1.359918231813e-05
1200.00000  1250.00000  1.646216806932e-05
1250.00000  1300.00000  3.471370223313e-05
1300.00000  1350.00000  1.145194300474e-05
1350.00000  1400.00000  1.395705553703e-05
1400.00000  1450.00000  1.610429485042e-05
1450.00000  1500.00000  1.789366094491e-05
1500.00000  1550.00000  1.574642163152e-05
1550.00000  1600.00000  1.860940738271e-05
1600.00000  1650.00000  1.753578772601e-05
1650.00000  1700.00000  1.538854841262e-05
1700.00000  1750.00000  5.260736317804e-05
1750.00000  1800.00000  1.860940738271e-05
1800.00000  1850.00000  1.753578772601e-05
1850.00000  1900.00000  1.860940738271e-05
1900.00000  1950.00000  1.359918231813e-05
1950.00000  2000.00000  2.004090025830e-05
2000.00000  2050.00000  2.254601279059e-05
2050.00000  2100.00000  2.183026635279e-05
2100.00000  2150.00000  2.469325210398e-05
2150.00000  2200.00000  2.862985751186e-05
2200.00000  2250.00000  2.361963244728e-05
2250.00000  2300.00000  2.505112532288e-05
2300.00000  2350.00000  8.696319219227e-05
2350.00000  2400.00000  3.006135038745e-05
2400.00000  2450.00000  2.648261819847e-05
2450.00000  2500.00000  3.149284326304e-05
2500.00000  2550.00000  2.505112532288e-05
2550.00000  2600.00000  2.898773073076e-05
2600.00000  2650.00000  3.149284326304e-05
2650.00000  2700.00000  2.934560394966e-05
2700.00000  2750.00000  3.435582901423e-05
2750.00000  2800.00000  3.471370223313e-05
2800.00000  2850.00000  3.936605407881e-05
2850.00000  2900.00000  3.578732188982e-05
2900.00000  2950.00000  4.258691304889e-05
2950.00000  3000.00000  6.906953124736e-05
3000.00000  3050.00000  4.759713811347e-05
3050.00000  3100.00000  5.797546146151e-05
3100.00000  3150.00000  5.081799708355e-05
3150.00000  3200.00000  6.799591159067e-05
3200.00000  3250.00000  5.618609536702e-05
3250.00000  3300.00000  6.942740446626e-05
3300.00000  3350.00000  8.016360103321e-05
3350.00000  3400.00000  8.374233322219e-05
3400.00000  3450.00000  8.767893863007e-05
3450.00000  3500.00000  1.019938673860e-04
3500.00000  3550.00000  1.066462192317e-04
3550.00000  3600.00000  1.234662605199e-04
3600.00000  3650.00000  1.427914143404e-04
3650.00000  3700.00000  1.850204541704e-04
3700.00000  3750.00000  1.392126821514e-04
3750.00000  3800.00000  1.696319057578e-04
3800.00000  3850.00000  1.871676934838e-04
3850.00000  3900.00000  1.828732148570e-04
3900.00000  3950.00000  2.215235224980e-04
3950.00000  4000.00000  2.161554242145e-04
4000.00000  4050.00000  2.469325210398e-04
4050.00000  4100.00000  2.344069583783e-04
4100.00000  4150.00000  2.508691264477e-04
4150.00000  4200.00000  2.580265908256e-04
4200.00000  4250.00000  2.769938714272e-04
4250.00000  4300.00000  2.794989839595e-04
4300.00000  4350.00000  2.909509269643e-04
4350.00000  4400.00000  3.041922360635e-04
4400.00000  4450.00000  3.392638115155e-04
4450.00000  4500.00000  3.560838528037e-04
4500.00000  4550.00000  3.521472473959e-04
4550.00000  4600.00000  3.632413171817e-04
4600.00000  4650.00000  3.700409083408e-04
4650.00000  4700.00000  3.961656533203e-04
4700.00000  4750.00000  3.900818085991e-04
4750.00000  4800.00000  4.144171874842e-04
4800.00000  4850.00000  4.194274125487e-04
4850.00000  4900.00000  4.387525663692e-04
4900.00000  4950.00000  4.434049182149e-04
4950.00000  5000.00000  4.580777201897e-04
5000.00000  5050.00000  4.469836504039e-04
5050.00000  5100.00000  4.859918312638e-04
5100.00000  5150.00000  4.741820150402e-04
5150.00000  5200.00000  4.820552258559e-04
5200.00000  5250.00000  4.834867187315e-04
5250.00000  5300.00000  5.092535904922e-04
5300.00000  5350.00000  5.078220976166e-04
5350.00000  5400.00000  5.228527728103e-04
5400.00000  5450.00000  5.647239394214e-04
5450.00000  5500.00000  5.142638155568e-04
5500.00000  5550.00000  5.536298696356e-04
5550.00000  5600.00000  5.525562499789e-04
5600.00000  5650.00000  5.300102371883e-04
5650.00000  5700.00000  5.572086018246e-04
5700.00000  5750.00000  5.131901959001e-04
5750.00000  5800.00000  5.385991944418e-04
5800.00000  5850.00000  5.514826303222e-04
5850.00000  5900.00000  5.833333468041e-04
5900.00000  5950.00000  5.772495020829e-04
5950.00000  6000.00000  5.976482755601e-04
6000.00000  6050.00000  5.672290519537e-04
6050.00000  6100.00000  5.661554322970e-04
6100.00000  6150.00000  5.622188268891e-04
6150.00000  6200.00000  5.847648396797e-04
6200.00000  6250.00000  6.660020603696e-04
6250.00000  6300.00000  6.813906087822e-04
6300.00000  6350.00000  6.957055375382e-04
6350.00000  6400.00000  2.394887580867e-03
6400.00000  6450.00000  5.897750647443e-04
6450.00000  6500.00000  5.765337556451e-04
6500.00000  6550.00000  5.844069664608e-04
6550.00000  6600.00000  5.761758824262e-04
6600.00000  6650.00000  5.725971502372e-04
6650.00000  6700.00000  5.819018539285e-04
6700.00000  6750.00000  5.740286431128e-04
6750.00000  6800.00000  5.640081929836e-04
6800.00000  6850.00000  5.579243482624e-04
6850.00000  6900.00000  5.654396858592e-04
6900.00000  6950.00000  5.751022627695e-04
6950.00000  7000.00000  5.944274165900e-04
7000.00000  7050.00000  5.944274165900e-04
7050.00000  7100.00000  7.662065616611e-04
7100.00000  7150.00000  3.396216847344e-04
7150.00000  7200.00000  3.152863058493e-04
7200.00000  7250.00000  3.296012346053e-04
7250.00000  7300.00000  3.270961220730e-04
7300.00000  7350.00000  3.256646291974e-04
7350.00000  7400.00000  3.313906006998e-04
7400.00000  7450.00000  3.442740365801e-04
7450.00000  7500.00000  3.993865122904e-04
7500.00000  7550.00000  3.449897830179e-04
7550.00000  7600.00000  3.557259795848e-04
7600.00000  7650.00000  3.421267972667e-04
7650.00000  7700.00000  3.432004169234e-04
7700.00000  7750.00000  3.170756719438e-04
7750.00000  7800.00000  3.457055294557e-04
7800.00000  7850.00000  3.356850793265e-04
7850.00000  7900.00000  3.356850793265e-04
7900.00000  7950.00000  3.406953043911e-04
7950.00000  8000.00000  3.496421348636e-04
8000.00000  8050.00000  3.528629938337e-04
8050.00000  8100.00000  3.564417260226e-04
8100.00000  8150.00000  3.567995992415e-04
8150.00000  8200.00000  3.542944867093e-04
8200.00000  8250.00000  3.467791491124e-04
8250.00000  8300.00000  3.525051206148e-04
8300.00000  8350.00000  3.539366134904e-04
8350.00000  8400.00000  3.367586989832e-04
8400.00000  8450.00000  3.439161633612e-04
8450.00000  8500.00000  3.303169810431e-04
8500.00000  8550.00000  3.367586989832e-04
8550.00000  8600.00000  3.399795579533e-04
8600.00000  8650.00000  3.374744454210e-04
8650.00000  8700.00000  3.406953043911e-04
8700.00000  8750.00000  3.403374311722e-04
8750.00000  8800.00000  3.321063471376e-04
8800.00000  8850.00000  3.253067559785e-04
8850.00000  8900.00000  3.260225024163e-04
8900.00000  8950.00000  3.124233200982e-04
8950.00000  9000.00000  3.338957132321e-04
9000.00000  9050.00000  3.152863058493e-04
9050.00000  9100.00000  3.346114596699e-04
9100.00000  9150.00000  3.371165722021e-04
9150.00000  9200.00000  3.381901918588e-04
9200.00000  9250.00000  3.199386576950e-04
9250.00000  9300.00000  3.385480650777e-04
9300.00000  9350.00000  3.202965309139e-04
9350.00000  9400.00000  3.303169810431e-04
9400.00000  9450.00000  3.127811933171e-04
9450.00000  9500.00000  3.117075736604e-04
9500.00000  9550.00000  3.160020522871e-04
9550.00000  9600.00000  3.217280237895e-04
9600.00000  9650.00000  3.095603343470e-04
9650.00000  9700.00000  3.063394753769e-04
9700.00000  9750.00000  3.385480650777e-04
9750.00000  9800.00000  3.066973485958e-04
9800.00000  9850.00000  3.138548129738e-04
9850.00000  9900.00000  3.317484739187e-04
9900.00000  9950.00000  3.117075736604e-04
9950.00000  10000.00000  3.059816021580e-04
