300.00000  350.00000  6.147884356521e-06
350.00000  400.00000  7.594445381585e-06
400.00000  450.00000  6.871164869053e-06
450.00000  500.00000  3.978042818925e-06
500.00000  550.00000  2.278333614475e-05
550.00000  600.00000  2.531481793862e-06
600.00000  650.00000  6.509524612787e-06
650.00000  700.00000  6.147884356521e-06
700.00000  750.00000  4.339683075191e-06
750.00000  800.00000  2.531481793862e-06
800.00000  850.00000  1.193412845678e-05
850.00000  900.00000  2.893122050128e-06
900.00000  950.00000  3.616402562659e-06
950.00000  1000.00000  3.254762306394e-06
1000.00000  1050.00000  7.232805125319e-06
1050.00000  1100.00000  3.254762306394e-06
1100.00000  1150.00000  2.531481793862e-06
1150.00000  1200.00000  4.339683075191e-06
1200.00000  1250.00000  4.701323331457e-06
1250.00000  1300.00000  1.048756743171e-05
1300.00000  1350.00000  4.339683075191e-06
1350.00000  1400.00000  4.701323331457e-06
1400.00000  1450.00000  5.424603843989e-06
1450.00000  1500.00000  4.339683075191e-06
1500.00000  1550.00000  5.062963587723e-06
1550.00000  1600.00000  3.616402562659e-06
1600.00000  1650.00000  5.786244100255e-06
1650.00000  1700.00000  6.147884356521e-06
1700.00000  1750.00000  1.012592717545e-05
1750.00000  1800.00000  8.679366150383e-06
1800.00000  1850.00000  6.147884356521e-06
1850.00000  1900.00000  4.701323331457e-06
1900.00000  1950.00000  7.594445381585e-06
1950.00000  2000.00000  2.169841537596e-06
2000.00000  2050.00000  1.012592717545e-05
2050.00000  2100.00000  7.232805125319e-06
2100.00000  2150.00000  6.509524612787e-06
2150.00000  2200.00000  6.147884356521e-06
2200.00000  2250.00000  5.786244100255e-06
2250.00000  2300.00000  8.679366150383e-06
2300.00000  2350.00000  1.699709204450e-05
2350.00000  2400.00000  9.041006406649e-06
2400.00000  2450.00000  1.084920768798e-05
2450.00000  2500.00000  9.402646662915e-06
2500.00000  2550.00000  5.062963587723e-06
2550.00000  2600.00000  7.594445381585e-06
2600.00000  2650.00000  1.121084794424e-05
2650.00000  2700.00000  8.317725894117e-06
2700.00000  2750.00000  1.338068948184e-05
2750.00000  2800.00000  8.317725894117e-06
2800.00000  2850.00000  1.338068948184e-05
2850.00000  2900.00000  1.121084794424e-05
2900.00000  2950.00000  1.374232973811e-05
2950.00000  3000.00000  1.555053101944e-05
3000.00000  3050.00000  9.402646662915e-06
3050.00000  3100.00000  7.232805125319e-06
3100.00000  3150.00000  9.402646662915e-06
3150.00000  3200.00000  1.048756743171e-05
3200.00000  3250.00000  1.482725050690e-05
3250.00000  3300.00000  1.518889076317e-05
3300.00000  3350.00000  1.193412845678e-05
3350.00000  3400.00000  1.157248820051e-05
3400.00000  3450.00000  1.446561025064e-05
3450.00000  3500.00000  1.301904922557e-05
3500.00000  3550.00000  1.446561025064e-05
3550.00000  3600.00000  1.952857383836e-05
3600.00000  3650.00000  1.772037255703e-05
3650.00000  3700.00000  2.278333614475e-05
3700.00000  3750.00000  1.301904922557e-05
3750.00000  3800.00000  1.627381153197e-05
3800.00000  3850.00000  1.844365306956e-05
3850.00000  3900.00000  1.518889076317e-05
3900.00000  3950.00000  1.844365306956e-05
3950.00000  4000.00000  1.663545178823e-05
4000.00000  4050.00000  1.591217127570e-05
4050.00000  4100.00000  2.025185435089e-05
4100.00000  4150.00000  1.410396999437e-05
4150.00000  4200.00000  1.446561025064e-05
4200.00000  4250.00000  2.061349460716e-05
4250.00000  4300.00000  1.916693358210e-05
4300.00000  4350.00000  1.663545178823e-05
4350.00000  4400.00000  1.482725050690e-05
4400.00000  4450.00000  1.699709204450e-05
4450.00000  4500.00000  1.989021409463e-05
4500.00000  4550.00000  1.555053101944e-05
4550.00000  4600.00000  2.386825691355e-05
4600.00000  4650.00000  1.735873230077e-05
4650.00000  4700.00000  1.808201281330e-05
4700.00000  4750.00000  1.844365306956e-05
4750.00000  4800.00000  1.735873230077e-05
4800.00000  4850.00000  2.242169588849e-05
4850.00000  4900.00000  2.314497640102e-05
4900.00000  4950.00000  1.591217127570e-05
4950.00000  5000.00000  2.531481793862e-05
5000.00000  5050.00000  2.350661665729e-05
5050.00000  5100.00000  1.663545178823e-05
5100.00000  5150.00000  2.242169588849e-05
5150.00000  5200.00000  1.772037255703e-05
5200.00000  5250.00000  2.133677511969e-05
5250.00000  5300.00000  2.025185435089e-05
5300.00000  5350.00000  1.410396999437e-05
5350.00000  5400.00000  2.133677511969e-05
5400.00000  5450.00000  2.278333614475e-05
5450.00000  5500.00000  2.169841537596e-05
5500.00000  5550.00000  1.772037255703e-05
5550.00000  5600.00000  1.772037255703e-05
5600.00000  5650.00000  2.495317768235e-05
5650.00000  5700.00000  2.242169588849e-05
5700.00000  5750.00000  2.169841537596e-05
5750.00000  5800.00000  1.989021409463e-05
5800.00000  5850.00000  1.880529332583e-05
5850.00000  5900.00000  2.567645819488e-05
5900.00000  5950.00000  1.772037255703e-05
5950.00000  6000.00000  2.495317768235e-05
6000.00000  6050.00000  2.422989716982e-05
6050.00000  6100.00000  2.712301921995e-05
6100.00000  6150.00000  2.025185435089e-05
6150.00000  6200.00000  2.676137896368e-05
6200.00000  6250.00000  2.422989716982e-05
6250.00000  6300.00000  4.014206844552e-05
6300.00000  6350.00000  4.050370870179e-05
6350.00000  6400.00000  2.701452714307e-04
6400.00000  6450.00000  1.663545178823e-05
6450.00000  6500.00000  1.952857383836e-05
6500.00000  6550.00000  2.314497640102e-05
6550.00000  6600.00000  2.061349460716e-05
6600.00000  6650.00000  2.242169588849e-05
6650.00000  6700.00000  2.025185435089e-05
6700.00000  6750.00000  2.097513486343e-05
6750.00000  6800.00000  2.169841537596e-05
6800.00000  6850.00000  2.314497640102e-05
6850.00000  6900.00000  2.386825691355e-05
6900.00000  6950.00000  2.025185435089e-05
6950.00000  7000.00000  2.531481793862e-05
7000.00000  7050.00000  2.061349460716e-05
7050.00000  7100.00000  4.484339177698e-05
7100.00000  7150.00000  1.048756743171e-05
7150.00000  7200.00000  1.338068948184e-05
7200.00000  7250.00000  1.301904922557e-05
7250.00000  7300.00000  1.229576871304e-05
7300.00000  7350.00000  1.229576871304e-05
7350.00000  7400.00000  1.229576871304e-05
7400.00000  7450.00000  1.374232973811e-05
7450.00000  7500.00000  2.061349460716e-05
7500.00000  7550.00000  1.229576871304e-05
7550.00000  7600.00000  1.265740896931e-05
7600.00000  7650.00000  1.265740896931e-05
7650.00000  7700.00000  1.121084794424e-05
7700.00000  7750.00000  1.084920768798e-05
7750.00000  7800.00000  1.012592717545e-05
7800.00000  7850.00000  1.482725050690e-05
7850.00000  7900.00000  1.121084794424e-05
7900.00000  7950.00000  1.048756743171e-05
7950.00000  8000.00000  1.193412845678e-05
8000.00000  8050.00000  9.402646662915e-06
8050.00000  8100.00000  1.265740896931e-05
8100.00000  8150.00000  1.555053101944e-05
8150.00000  8200.00000  1.265740896931e-05
8200.00000  8250.00000  1.048756743171e-05
8250.00000  8300.00000  1.084920768798e-05
8300.00000  8350.00000  9.041006406649e-06
8350.00000  8400.00000  1.048756743171e-05
8400.00000  8450.00000  7.956085637851e-06
8450.00000  8500.00000  1.157248820051e-05
8500.00000  8550.00000  1.229576871304e-05
8550.00000  8600.00000  1.121084794424e-05
8600.00000  8650.00000  9.764286919181e-06
8650.00000  8700.00000  1.301904922557e-05
8700.00000  8750.00000  1.265740896931e-05
8750.00000  8800.00000  1.482725050690e-05
8800.00000  8850.00000  9.402646662915e-06
8850.00000  8900.00000  1.410396999437e-05
8900.00000  8950.00000  9.764286919181e-06
8950.00000  9000.00000  1.084920768798e-05
9000.00000  9050.00000  1.012592717545e-05
9050.00000  9100.00000  7.232805125319e-06
9100.00000  9150.00000  1.157248820051e-05
9150.00000  9200.00000  1.157248820051e-05
9200.00000  9250.00000  1.374232973811e-05
9250.00000  9300.00000  1.084920768798e-05
9300.00000  9350.00000  1.048756743171e-05
9350.00000  9400.00000  9.041006406649e-06
9400.00000  9450.00000  1.265740896931e-05
9450.00000  9500.00000  1.193412845678e-05
9500.00000  9550.00000  7.594445381585e-06
9550.00000  9600.00000  1.265740896931e-05
9600.00000  9650.00000  1.193412845678e-05
9650.00000  9700.00000  9.402646662915e-06
9700.00000  9750.00000  1.121084794424e-05
9750.00000  9800.00000  8.679366150383e-06
9800.00000  9850.00000  1.121084794424e-05
9850.00000  9900.00000  8.317725894117e-06
9900.00000  9950.00000  8.679366150383e-06
9950.00000  10000.00000  9.402646662915e-06
