300.00000  350.00000  8.892324902291e-06
350.00000  400.00000  1.314517594252e-05
400.00000  450.00000  8.312390669533e-06
450.00000  500.00000  1.179199606608e-05
500.00000  550.00000  7.481151602579e-05
550.00000  600.00000  7.539145025855e-06
600.00000  650.00000  2.203750084481e-05
650.00000  700.00000  1.005219336781e-05
700.00000  750.00000  1.527160146263e-05
750.00000  800.00000  1.140537324424e-05
800.00000  850.00000  5.180745812639e-05
850.00000  900.00000  1.295186453160e-05
900.00000  950.00000  1.024550477873e-05
950.00000  1000.00000  1.217861888792e-05
1000.00000  1050.00000  1.488497864079e-05
1050.00000  1100.00000  1.546491287355e-05
1100.00000  1150.00000  1.875120685918e-05
1150.00000  1200.00000  1.739802698274e-05
1200.00000  1250.00000  1.565822428447e-05
1250.00000  1300.00000  5.316063800283e-05
1300.00000  1350.00000  1.623815851723e-05
1350.00000  1400.00000  1.952445250286e-05
1400.00000  1450.00000  2.107094379021e-05
1450.00000  1500.00000  2.145756661205e-05
1500.00000  1550.00000  2.339068072124e-05
1550.00000  1600.00000  2.107094379021e-05
1600.00000  1650.00000  2.551710624136e-05
1650.00000  1700.00000  2.667697470687e-05
1700.00000  1750.00000  8.467039798268e-05
1750.00000  1800.00000  2.590372906319e-05
1800.00000  1850.00000  2.764353176147e-05
1850.00000  1900.00000  2.551710624136e-05
1900.00000  1950.00000  3.073651433618e-05
1950.00000  2000.00000  3.015658010342e-05
2000.00000  2050.00000  2.861008881607e-05
2050.00000  2100.00000  3.247631703445e-05
2100.00000  2150.00000  3.034989151434e-05
2150.00000  2200.00000  3.556929960916e-05
2200.00000  2250.00000  3.634254525284e-05
2250.00000  2300.00000  3.769572512928e-05
2300.00000  2350.00000  1.053547189511e-04
2350.00000  2400.00000  3.962883923847e-05
2400.00000  2450.00000  4.059539629307e-05
2450.00000  2500.00000  3.904890500571e-05
2500.00000  2550.00000  4.136864193674e-05
2550.00000  2600.00000  3.866228218387e-05
2600.00000  2650.00000  4.098201911491e-05
2650.00000  2700.00000  4.117533052582e-05
2700.00000  2750.00000  4.156195334766e-05
2750.00000  2800.00000  3.730910230744e-05
2800.00000  2850.00000  4.291513322410e-05
2850.00000  2900.00000  3.672916807468e-05
2900.00000  2950.00000  4.059539629307e-05
2950.00000  3000.00000  5.973322597408e-05
3000.00000  3050.00000  4.407500168962e-05
3050.00000  3100.00000  3.846897077295e-05
3100.00000  3150.00000  4.330175604594e-05
3150.00000  3200.00000  4.407500168962e-05
3200.00000  3250.00000  3.982215064939e-05
3250.00000  3300.00000  5.006765542812e-05
3300.00000  3350.00000  4.291513322410e-05
3350.00000  3400.00000  4.117533052582e-05
3400.00000  3450.00000  4.484824733329e-05
3450.00000  3500.00000  4.330175604594e-05
3500.00000  3550.00000  4.156195334766e-05
3550.00000  3600.00000  3.962883923847e-05
3600.00000  3650.00000  4.040208488215e-05
3650.00000  3700.00000  5.412719505742e-05
3700.00000  3750.00000  4.194857616950e-05
3750.00000  3800.00000  4.504155874421e-05
3800.00000  3850.00000  3.595592243100e-05
3850.00000  3900.00000  4.020877347123e-05
3900.00000  3950.00000  4.388169027870e-05
3950.00000  4000.00000  4.020877347123e-05
4000.00000  4050.00000  3.556929960916e-05
4050.00000  4100.00000  3.537598819824e-05
4100.00000  4150.00000  3.866228218387e-05
4150.00000  4200.00000  4.001546206031e-05
4200.00000  4250.00000  3.653585666376e-05
4250.00000  4300.00000  3.672916807468e-05
4300.00000  4350.00000  3.556929960916e-05
4350.00000  4400.00000  3.866228218387e-05
4400.00000  4450.00000  3.885559359479e-05
4450.00000  4500.00000  3.305625126721e-05
4500.00000  4550.00000  3.537598819824e-05
4550.00000  4600.00000  3.286293985629e-05
4600.00000  4650.00000  3.537598819824e-05
4650.00000  4700.00000  3.498936537641e-05
4700.00000  4750.00000  2.861008881607e-05
4750.00000  4800.00000  3.344287408905e-05
4800.00000  4850.00000  3.324956267813e-05
4850.00000  4900.00000  3.073651433618e-05
4900.00000  4950.00000  3.344287408905e-05
4950.00000  5000.00000  3.189638280170e-05
5000.00000  5050.00000  2.919002304882e-05
5050.00000  5100.00000  3.170307139078e-05
5100.00000  5150.00000  2.474386059768e-05
5150.00000  5200.00000  2.919002304882e-05
5200.00000  5250.00000  3.131644856894e-05
5250.00000  5300.00000  2.358399213216e-05
5300.00000  5350.00000  3.034989151434e-05
5350.00000  5400.00000  2.242412366665e-05
5400.00000  5450.00000  2.725690893963e-05
5450.00000  5500.00000  2.783684317239e-05
5500.00000  5550.00000  2.996326869250e-05
5550.00000  5600.00000  2.706359752871e-05
5600.00000  5650.00000  2.551710624136e-05
5650.00000  5700.00000  2.339068072124e-05
5700.00000  5750.00000  2.339068072124e-05
5750.00000  5800.00000  2.474386059768e-05
5800.00000  5850.00000  2.223081225573e-05
5850.00000  5900.00000  2.803015458331e-05
5900.00000  5950.00000  2.551710624136e-05
5950.00000  6000.00000  2.416392636492e-05
6000.00000  6050.00000  2.107094379021e-05
6050.00000  6100.00000  2.435723777584e-05
6100.00000  6150.00000  2.126425520113e-05
6150.00000  6200.00000  2.493717200860e-05
6200.00000  6250.00000  2.281074648849e-05
6250.00000  6300.00000  3.034989151434e-05
6300.00000  6350.00000  2.126425520113e-05
6350.00000  6400.00000  2.412526408274e-04
6400.00000  6450.00000  1.991107532469e-05
6450.00000  6500.00000  1.952445250286e-05
6500.00000  6550.00000  2.377730354308e-05
6550.00000  6600.00000  1.971776391378e-05
6600.00000  6650.00000  2.377730354308e-05
6650.00000  6700.00000  2.261743507757e-05
6700.00000  6750.00000  1.933114109194e-05
6750.00000  6800.00000  1.913782968102e-05
6800.00000  6850.00000  1.933114109194e-05
6850.00000  6900.00000  1.913782968102e-05
6900.00000  6950.00000  2.029769814653e-05
6950.00000  7000.00000  1.759133839366e-05
7000.00000  7050.00000  1.913782968102e-05
7050.00000  7100.00000  4.330175604594e-05
7100.00000  7150.00000  1.681809274998e-05
7150.00000  7200.00000  1.604484710631e-05
7200.00000  7250.00000  1.855789544826e-05
7250.00000  7300.00000  2.145756661205e-05
7300.00000  7350.00000  1.604484710631e-05
7350.00000  7400.00000  1.507829005171e-05
7400.00000  7450.00000  1.778464980458e-05
7450.00000  7500.00000  2.455054918676e-05
7500.00000  7550.00000  1.469166722987e-05
7550.00000  7600.00000  1.449835581895e-05
7600.00000  7650.00000  1.643146992815e-05
7650.00000  7700.00000  2.049100955745e-05
7700.00000  7750.00000  1.933114109194e-05
7750.00000  7800.00000  1.701140416090e-05
7800.00000  7850.00000  1.430504440803e-05
7850.00000  7900.00000  1.739802698274e-05
7900.00000  7950.00000  1.449835581895e-05
7950.00000  8000.00000  1.507829005171e-05
8000.00000  8050.00000  1.720471557182e-05
8050.00000  8100.00000  1.198530747700e-05
8100.00000  8150.00000  1.469166722987e-05
8150.00000  8200.00000  1.353179876436e-05
8200.00000  8250.00000  1.681809274998e-05
8250.00000  8300.00000  1.449835581895e-05
8300.00000  8350.00000  1.411173299711e-05
8350.00000  8400.00000  1.623815851723e-05
8400.00000  8450.00000  1.469166722987e-05
8450.00000  8500.00000  1.237193029884e-05
8500.00000  8550.00000  1.643146992815e-05
8550.00000  8600.00000  1.333848735344e-05
8600.00000  8650.00000  1.198530747700e-05
8650.00000  8700.00000  1.256524170976e-05
8700.00000  8750.00000  1.372511017527e-05
8750.00000  8800.00000  1.140537324424e-05
8800.00000  8850.00000  1.063212760057e-05
8850.00000  8900.00000  1.469166722987e-05
8900.00000  8950.00000  1.198530747700e-05
8950.00000  9000.00000  1.101875042240e-05
9000.00000  9050.00000  1.256524170976e-05
9050.00000  9100.00000  1.295186453160e-05
9100.00000  9150.00000  1.063212760057e-05
9150.00000  9200.00000  1.140537324424e-05
9200.00000  9250.00000  1.159868465516e-05
9250.00000  9300.00000  9.085636313210e-06
9300.00000  9350.00000  1.353179876436e-05
9350.00000  9400.00000  1.140537324424e-05
9400.00000  9450.00000  1.217861888792e-05
9450.00000  9500.00000  1.005219336781e-05
9500.00000  9550.00000  1.275855312068e-05
9550.00000  9600.00000  9.665570545968e-06
9600.00000  9650.00000  1.024550477873e-05
9650.00000  9700.00000  1.256524170976e-05
9700.00000  9750.00000  1.024550477873e-05
9750.00000  9800.00000  1.082543901148e-05
9800.00000  9850.00000  1.101875042240e-05
9850.00000  9900.00000  1.179199606608e-05
9900.00000  9950.00000  1.024550477873e-05
9950.00000  10000.00000  9.858881956888e-06
