10001.00000  11001.00000  5.151125873634e-04
11001.00000  12001.00000  4.255206625617e-04
12001.00000  13001.00000  3.590598100304e-04
13001.00000  14001.00000  3.059129841367e-04
14001.00000  15001.00000  2.657159160259e-04
15001.00000  16001.00000  2.286879869505e-04
16001.00000  17001.00000  2.022967084310e-04
17001.00000  18001.00000  1.766703945062e-04
18001.00000  19001.00000  1.565081134012e-04
19001.00000  20001.00000  1.423016280698e-04
20001.00000  21001.00000  1.272026840445e-04
21001.00000  22001.00000  1.131601196976e-04
22001.00000  23001.00000  1.031245127520e-04
23001.00000  24001.00000  9.039331628189e-05
24001.00000  25001.00000  8.656849330804e-05
25001.00000  26001.00000  7.605933685133e-05
26001.00000  27001.00000  7.230736764842e-05
27001.00000  28001.00000  6.817291614812e-05
28001.00000  29001.00000  6.090575249781e-05
29001.00000  30001.00000  5.600633640274e-05
30001.00000  31001.00000  5.234543441349e-05
31001.00000  32001.00000  4.926736259168e-05
32001.00000  33001.00000  4.598894289981e-05
33001.00000  34001.00000  4.338442058905e-05
34001.00000  35001.00000  3.955959761520e-05
35001.00000  36001.00000  3.770182645648e-05
36001.00000  37001.00000  3.429591266548e-05
37001.00000  38001.00000  3.322131954426e-05
38001.00000  39001.00000  3.243814150676e-05
39001.00000  40001.00000  2.950577722681e-05
40001.00000  41001.00000  2.801227492274e-05
41001.00000  42001.00000  2.733837754163e-05
42001.00000  43001.00000  2.464278801721e-05
43001.00000  44001.00000  2.540775261198e-05
44001.00000  45001.00000  2.209290603464e-05
45001.00000  46001.00000  2.218397324831e-05
46001.00000  47001.00000  2.027156176138e-05
47001.00000  48001.00000  1.941552995295e-05
48001.00000  49001.00000  1.735741092417e-05
49001.00000  50001.00000  1.702956895498e-05
50001.00000  51001.00000  1.701135551225e-05
51001.00000  52001.00000  1.524465156719e-05
52001.00000  53001.00000  1.539035910905e-05
53001.00000  54001.00000  1.437040631602e-05
54001.00000  55001.00000  1.478931549887e-05
55001.00000  56001.00000  1.309546532474e-05
56001.00000  57001.00000  1.236692761543e-05
57001.00000  58001.00000  1.218479318811e-05
58001.00000  59001.00000  1.254906204276e-05
59001.00000  60001.00000  1.149268236427e-05
60001.00000  61001.00000  1.143804203607e-05
61001.00000  62001.00000  1.065486399857e-05
62001.00000  63001.00000  1.047272957124e-05
63001.00000  64001.00000  9.634911205545e-06
64001.00000  65001.00000  8.487464313391e-06
65001.00000  66001.00000  8.487464313391e-06
66001.00000  67001.00000  8.560318084321e-06
67001.00000  68001.00000  7.777140046820e-06
68001.00000  69001.00000  7.941061031413e-06
69001.00000  70001.00000  7.449298077633e-06
70001.00000  71001.00000  7.540365291296e-06
71001.00000  72001.00000  6.429345284607e-06
72001.00000  73001.00000  7.449298077633e-06
73001.00000  74001.00000  7.085029222981e-06
74001.00000  75001.00000  6.738973811061e-06
75001.00000  76001.00000  6.283637742747e-06
76001.00000  77001.00000  5.974009216292e-06
77001.00000  78001.00000  6.101503315421e-06
78001.00000  79001.00000  5.755447903501e-06
79001.00000  80001.00000  5.573313476175e-06
80001.00000  81001.00000  5.209044621523e-06
81001.00000  82001.00000  5.008696751465e-06
82001.00000  83001.00000  4.735495110476e-06
83001.00000  84001.00000  5.117977407860e-06
84001.00000  85001.00000  4.170878385765e-06
85001.00000  86001.00000  4.644427896813e-06
86001.00000  87001.00000  4.280159042161e-06
87001.00000  88001.00000  4.079811172102e-06
88001.00000  89001.00000  3.679115431985e-06
89001.00000  90001.00000  3.897676744776e-06
90001.00000  91001.00000  4.189091828498e-06
91001.00000  92001.00000  4.061597729369e-06
92001.00000  93001.00000  3.150925592740e-06
93001.00000  94001.00000  3.515194447392e-06
94001.00000  95001.00000  3.150925592740e-06
95001.00000  96001.00000  3.150925592740e-06
96001.00000  97001.00000  3.278419691868e-06
97001.00000  98001.00000  2.950577722681e-06
98001.00000  99001.00000  2.877723951751e-06
99001.00000  100001.00000  3.223779363670e-06
100001.00000  101001.00000  2.895937394483e-06
101001.00000  102001.00000  2.932364279948e-06
102001.00000  103001.00000  2.823083623553e-06
103001.00000  104001.00000  2.877723951751e-06
104001.00000  105001.00000  2.440601326168e-06
105001.00000  106001.00000  2.604522310762e-06
106001.00000  107001.00000  2.185613127912e-06
107001.00000  108001.00000  2.367747555238e-06
108001.00000  109001.00000  2.604522310762e-06
109001.00000  110001.00000  2.531668539831e-06
110001.00000  111001.00000  2.385960997970e-06
111001.00000  112001.00000  2.313107227040e-06
112001.00000  113001.00000  1.894198044190e-06
113001.00000  114001.00000  2.331320669773e-06
114001.00000  115001.00000  2.003478700586e-06
115001.00000  116001.00000  2.276680341575e-06
116001.00000  117001.00000  2.003478700586e-06
117001.00000  118001.00000  1.675636731399e-06
118001.00000  119001.00000  1.912411486923e-06
119001.00000  120001.00000  1.912411486923e-06
120001.00000  121001.00000  1.639209845934e-06
121001.00000  122001.00000  1.620996403201e-06
122001.00000  123001.00000  1.566356075003e-06
123001.00000  124001.00000  1.584569517736e-06
124001.00000  125001.00000  1.347794762212e-06
125001.00000  126001.00000  1.821344273260e-06
126001.00000  127001.00000  2.003478700586e-06
127001.00000  128001.00000  1.657423288666e-06
128001.00000  129001.00000  1.457075418608e-06
129001.00000  130001.00000  1.384221647677e-06
130001.00000  131001.00000  1.620996403201e-06
131001.00000  132001.00000  1.274940991282e-06
132001.00000  133001.00000  1.402435090410e-06
133001.00000  134001.00000  1.475288861340e-06
134001.00000  135001.00000  1.129233449421e-06
135001.00000  136001.00000  1.202087220352e-06
136001.00000  137001.00000  1.274940991282e-06
137001.00000  138001.00000  1.074593121223e-06
138001.00000  139001.00000  1.366008204945e-06
139001.00000  140001.00000  1.256727548549e-06
140001.00000  141001.00000  1.311367876747e-06
141001.00000  142001.00000  1.092806563956e-06
142001.00000  143001.00000  9.653124648277e-07
143001.00000  144001.00000  1.001739350293e-06
144001.00000  145001.00000  1.111020006689e-06
145001.00000  146001.00000  7.831780375017e-07
146001.00000  147001.00000  8.196049229669e-07
147001.00000  148001.00000  1.092806563956e-06
148001.00000  149001.00000  8.742452511647e-07
149001.00000  150001.00000  8.924586938973e-07
150001.00000  151001.00000  1.111020006689e-06
151001.00000  152001.00000  1.074593121223e-06
152001.00000  153001.00000  8.742452511647e-07
153001.00000  154001.00000  8.742452511647e-07
154001.00000  155001.00000  8.924586938973e-07
155001.00000  156001.00000  7.831780375017e-07
156001.00000  157001.00000  5.828301674432e-07
157001.00000  158001.00000  8.013914802343e-07
158001.00000  159001.00000  8.560318084321e-07
159001.00000  160001.00000  6.738973811061e-07
160001.00000  161001.00000  6.374704956410e-07
161001.00000  162001.00000  5.464032819780e-07
162001.00000  163001.00000  7.831780375017e-07
163001.00000  164001.00000  7.831780375017e-07
164001.00000  165001.00000  7.467511520365e-07
165001.00000  166001.00000  8.013914802343e-07
166001.00000  167001.00000  7.103242665713e-07
167001.00000  168001.00000  6.374704956410e-07
168001.00000  169001.00000  6.921108238387e-07
169001.00000  170001.00000  6.192570529084e-07
170001.00000  171001.00000  6.010436101758e-07
171001.00000  172001.00000  4.917629537802e-07
172001.00000  173001.00000  6.556839383735e-07
173001.00000  174001.00000  3.278419691868e-07
174001.00000  175001.00000  6.192570529084e-07
175001.00000  176001.00000  5.099763965128e-07
176001.00000  177001.00000  5.099763965128e-07
177001.00000  178001.00000  5.828301674432e-07
178001.00000  179001.00000  5.828301674432e-07
179001.00000  180001.00000  5.099763965128e-07
180001.00000  181001.00000  5.646167247106e-07
181001.00000  182001.00000  5.464032819780e-07
182001.00000  183001.00000  5.099763965128e-07
183001.00000  184001.00000  3.824822973846e-07
184001.00000  185001.00000  3.460554119194e-07
185001.00000  186001.00000  4.371226255824e-07
186001.00000  187001.00000  4.371226255824e-07
187001.00000  188001.00000  3.278419691868e-07
188001.00000  189001.00000  4.189091828498e-07
189001.00000  190001.00000  4.006957401172e-07
190001.00000  191001.00000  5.464032819780e-07
191001.00000  192001.00000  4.006957401172e-07
192001.00000  193001.00000  5.464032819780e-07
193001.00000  194001.00000  4.371226255824e-07
194001.00000  195001.00000  3.096285264542e-07
195001.00000  196001.00000  3.642688546520e-07
196001.00000  197001.00000  2.914150837216e-07
197001.00000  198001.00000  3.824822973846e-07
198001.00000  199001.00000  3.460554119194e-07
