10001.00000  11001.00000  5.657239750848e-05
11001.00000  12001.00000  5.841229550134e-05
12001.00000  13001.00000  5.687606999274e-05
13001.00000  14001.00000  5.603650488920e-05
14001.00000  15001.00000  5.348208340398e-05
15001.00000  16001.00000  5.242816125273e-05
16001.00000  17001.00000  4.926639479899e-05
17001.00000  18001.00000  4.742649680613e-05
18001.00000  19001.00000  4.610462834525e-05
19001.00000  20001.00000  4.133518403367e-05
20001.00000  21001.00000  4.144236255752e-05
21001.00000  22001.00000  3.749462026217e-05
22001.00000  23001.00000  3.499378803888e-05
23001.00000  24001.00000  3.233218802979e-05
24001.00000  25001.00000  2.908110613950e-05
25001.00000  26001.00000  2.800932090095e-05
26001.00000  27001.00000  2.507977458223e-05
27001.00000  28001.00000  2.463319739949e-05
28001.00000  29001.00000  2.086408597724e-05
29001.00000  30001.00000  2.048896114374e-05
30001.00000  31001.00000  1.814889670623e-05
31001.00000  32001.00000  1.845256919048e-05
32001.00000  33001.00000  1.571951683216e-05
33001.00000  34001.00000  1.539798126060e-05
34001.00000  35001.00000  1.450482689513e-05
35001.00000  36001.00000  1.264706581497e-05
36001.00000  37001.00000  1.262920272766e-05
37001.00000  38001.00000  1.196826849722e-05
38001.00000  39001.00000  1.111084030637e-05
39001.00000  40001.00000  9.556751710464e-06
40001.00000  41001.00000  8.556418821144e-06
41001.00000  42001.00000  8.913680567330e-06
42001.00000  43001.00000  8.502829559216e-06
43001.00000  44001.00000  7.984800027247e-06
44001.00000  45001.00000  7.538222844515e-06
45001.00000  46001.00000  6.859425526763e-06
46001.00000  47001.00000  6.805836264835e-06
47001.00000  48001.00000  6.198491296319e-06
48001.00000  49001.00000  5.698324851660e-06
49001.00000  50001.00000  6.001997335917e-06
50001.00000  51001.00000  5.555420153185e-06
51001.00000  52001.00000  4.965938271979e-06
52001.00000  53001.00000  4.626539613103e-06
53001.00000  54001.00000  4.840896660814e-06
54001.00000  55001.00000  4.376456390773e-06
55001.00000  56001.00000  4.233551692299e-06
56001.00000  57001.00000  4.072783906515e-06
57001.00000  58001.00000  3.983468469969e-06
58001.00000  59001.00000  3.715522160330e-06
59001.00000  60001.00000  3.483302025309e-06
60001.00000  61001.00000  3.447575850691e-06
61001.00000  62001.00000  2.893820144103e-06
62001.00000  63001.00000  2.929546318722e-06
63001.00000  64001.00000  2.608010747155e-06
64001.00000  65001.00000  2.590147659845e-06
65001.00000  66001.00000  2.375790612134e-06
66001.00000  67001.00000  2.482969135990e-06
67001.00000  68001.00000  1.964939604021e-06
68001.00000  69001.00000  2.590147659845e-06
69001.00000  70001.00000  1.929213429402e-06
70001.00000  71001.00000  2.054255040567e-06
71001.00000  72001.00000  1.822034905546e-06
72001.00000  73001.00000  2.286475175588e-06
73001.00000  74001.00000  1.768445643618e-06
74001.00000  75001.00000  1.625540945144e-06
75001.00000  76001.00000  1.554088595907e-06
76001.00000  77001.00000  1.589814770526e-06
77001.00000  78001.00000  1.607677857835e-06
78001.00000  79001.00000  1.571951683216e-06
79001.00000  80001.00000  1.446910072051e-06
80001.00000  81001.00000  1.286142286268e-06
81001.00000  82001.00000  1.196826849722e-06
82001.00000  83001.00000  1.036059063938e-06
83001.00000  84001.00000  1.446910072051e-06
84001.00000  85001.00000  1.000332889320e-06
85001.00000  86001.00000  1.232553024340e-06
86001.00000  87001.00000  1.125374500484e-06
87001.00000  88001.00000  9.288805400824e-07
88001.00000  89001.00000  1.214689937031e-06
89001.00000  90001.00000  9.288805400824e-07
90001.00000  91001.00000  7.502496669897e-07
91001.00000  92001.00000  6.787973177526e-07
92001.00000  93001.00000  7.502496669897e-07
93001.00000  94001.00000  8.931543654639e-07
94001.00000  95001.00000  8.574281908453e-07
95001.00000  96001.00000  7.859758416082e-07
96001.00000  97001.00000  6.252080558247e-07
97001.00000  98001.00000  5.716187938969e-07
98001.00000  99001.00000  5.894818812062e-07
99001.00000  100001.00000  7.502496669897e-07
100001.00000  101001.00000  8.931543654639e-07
101001.00000  102001.00000  5.001664446598e-07
102001.00000  103001.00000  4.823033573505e-07
103001.00000  104001.00000  6.252080558247e-07
104001.00000  105001.00000  4.465771827319e-07
105001.00000  106001.00000  6.073449685154e-07
106001.00000  107001.00000  3.215355715670e-07
107001.00000  108001.00000  4.823033573505e-07
108001.00000  109001.00000  3.215355715670e-07
109001.00000  110001.00000  3.929879208041e-07
110001.00000  111001.00000  5.180295319691e-07
111001.00000  112001.00000  3.572617461856e-07
112001.00000  113001.00000  4.108510081134e-07
113001.00000  114001.00000  3.572617461856e-07
114001.00000  115001.00000  3.572617461856e-07
115001.00000  116001.00000  3.036724842577e-07
116001.00000  117001.00000  2.500832223299e-07
117001.00000  118001.00000  2.679463096392e-07
118001.00000  119001.00000  3.751248334948e-07
119001.00000  120001.00000  2.143570477113e-07
120001.00000  121001.00000  1.607677857835e-07
121001.00000  122001.00000  3.393986588763e-07
122001.00000  123001.00000  2.143570477113e-07
123001.00000  124001.00000  2.500832223299e-07
124001.00000  125001.00000  2.679463096392e-07
125001.00000  126001.00000  3.036724842577e-07
126001.00000  127001.00000  1.964939604021e-07
127001.00000  128001.00000  1.786308730928e-07
128001.00000  129001.00000  1.429046984742e-07
129001.00000  130001.00000  8.931543654639e-08
130001.00000  131001.00000  2.143570477113e-07
131001.00000  132001.00000  1.429046984742e-07
132001.00000  133001.00000  7.145234923711e-08
133001.00000  134001.00000  1.786308730928e-07
134001.00000  135001.00000  1.607677857835e-07
135001.00000  136001.00000  1.964939604021e-07
136001.00000  137001.00000  1.071785238557e-07
137001.00000  138001.00000  7.145234923711e-08
138001.00000  139001.00000  1.607677857835e-07
139001.00000  140001.00000  1.786308730928e-07
140001.00000  141001.00000  1.071785238557e-07
141001.00000  142001.00000  1.071785238557e-07
142001.00000  143001.00000  1.071785238557e-07
143001.00000  144001.00000  7.145234923711e-08
144001.00000  145001.00000  1.071785238557e-07
145001.00000  146001.00000  7.145234923711e-08
146001.00000  147001.00000  1.071785238557e-07
147001.00000  148001.00000  8.931543654639e-08
148001.00000  149001.00000  1.429046984742e-07
149001.00000  150001.00000  1.786308730928e-08
150001.00000  151001.00000  5.358926192783e-08
151001.00000  152001.00000  1.250416111649e-07
152001.00000  153001.00000  8.931543654639e-08
153001.00000  154001.00000  5.358926192783e-08
154001.00000  155001.00000  7.145234923711e-08
155001.00000  156001.00000  1.786308730928e-08
156001.00000  157001.00000  7.145234923711e-08
157001.00000  158001.00000  7.145234923711e-08
158001.00000  159001.00000  3.572617461856e-08
159001.00000  160001.00000  8.931543654639e-08
160001.00000  161001.00000  3.572617461856e-08
161001.00000  162001.00000  7.145234923711e-08
162001.00000  163001.00000  1.786308730928e-08
163001.00000  164001.00000  8.931543654639e-08
164001.00000  165001.00000  3.572617461856e-08
165001.00000  166001.00000  7.145234923711e-08
166001.00000  167001.00000  3.572617461856e-08
167001.00000  168001.00000  1.786308730928e-08
168001.00000  169001.00000  8.931543654639e-08
169001.00000  170001.00000  8.931543654639e-08
170001.00000  171001.00000  7.145234923711e-08
171001.00000  172001.00000  0.000000000000e+00
172001.00000  173001.00000  1.786308730928e-08
173001.00000  174001.00000  8.931543654639e-08
174001.00000  175001.00000  3.572617461856e-08
175001.00000  176001.00000  5.358926192783e-08
176001.00000  177001.00000  5.358926192783e-08
177001.00000  178001.00000  0.000000000000e+00
178001.00000  179001.00000  3.572617461856e-08
179001.00000  180001.00000  1.786308730928e-08
180001.00000  181001.00000  5.358926192783e-08
181001.00000  182001.00000  3.572617461856e-08
182001.00000  183001.00000  1.786308730928e-08
183001.00000  184001.00000  0.000000000000e+00
184001.00000  185001.00000  3.572617461856e-08
185001.00000  186001.00000  7.145234923711e-08
186001.00000  187001.00000  5.358926192783e-08
187001.00000  188001.00000  1.786308730928e-08
188001.00000  189001.00000  0.000000000000e+00
189001.00000  190001.00000  3.572617461856e-08
190001.00000  191001.00000  1.786308730928e-08
191001.00000  192001.00000  3.572617461856e-08
192001.00000  193001.00000  1.786308730928e-08
193001.00000  194001.00000  5.358926192783e-08
194001.00000  195001.00000  1.786308730928e-08
195001.00000  196001.00000  0.000000000000e+00
196001.00000  197001.00000  3.572617461856e-08
197001.00000  198001.00000  1.786308730928e-08
198001.00000  199001.00000  0.000000000000e+00
