300.00000  350.00000  1.815667403074e-01
350.00000  400.00000  1.278687918067e-01
400.00000  450.00000  9.486036253280e-02
450.00000  500.00000  7.232312001727e-02
500.00000  550.00000  5.683258690678e-02
550.00000  600.00000  4.572435829560e-02
600.00000  650.00000  3.719901738623e-02
650.00000  700.00000  3.115542246269e-02
700.00000  750.00000  2.619947838027e-02
750.00000  800.00000  2.227457596959e-02
800.00000  850.00000  1.905766557067e-02
850.00000  900.00000  1.658950578549e-02
900.00000  950.00000  1.443156424853e-02
950.00000  1000.00000  1.292198639827e-02
1000.00000  1050.00000  1.151355026397e-02
1050.00000  1100.00000  1.007869651729e-02
1100.00000  1150.00000  9.090677814296e-03
1150.00000  1200.00000  8.187950259837e-03
1200.00000  1250.00000  7.424858656528e-03
1250.00000  1300.00000  6.669314942471e-03
1300.00000  1350.00000  6.254935822573e-03
1350.00000  1400.00000  5.532602821221e-03
1400.00000  1450.00000  5.129545535201e-03
1450.00000  1500.00000  4.718185571003e-03
1500.00000  1550.00000  4.390607177496e-03
1550.00000  1600.00000  3.980756791149e-03
1600.00000  1650.00000  3.705258833475e-03
1650.00000  1700.00000  3.493163145513e-03
1700.00000  1750.00000  3.204833776113e-03
1750.00000  1800.00000  3.035761056883e-03
1800.00000  1850.00000  2.863669181953e-03
1850.00000  1900.00000  2.644025604739e-03
1900.00000  1950.00000  2.500615708964e-03
1950.00000  2000.00000  2.256818886146e-03
2000.00000  2050.00000  2.211531550638e-03
2050.00000  2100.00000  2.095294056168e-03
2100.00000  2150.00000  1.984340084173e-03
2150.00000  2200.00000  1.869612167553e-03
2200.00000  2250.00000  1.743562417056e-03
2250.00000  2300.00000  1.682424514120e-03
2300.00000  2350.00000  1.597888154506e-03
2350.00000  2400.00000  1.489198549286e-03
2400.00000  2450.00000  1.447685158404e-03
2450.00000  2500.00000  1.336731186410e-03
2500.00000  2550.00000  1.329938086083e-03
2550.00000  2600.00000  1.174451567506e-03
2600.00000  2650.00000  1.182754245683e-03
2650.00000  2700.00000  1.119351975972e-03
2700.00000  2750.00000  1.113313664570e-03
2750.00000  2800.00000  1.022738993555e-03
2800.00000  2850.00000  1.037834772057e-03
2850.00000  2900.00000  9.472601010413e-04
2900.00000  2950.00000  8.642333192767e-04
2950.00000  3000.00000  8.664976860521e-04
3000.00000  3050.00000  8.136624612928e-04
3050.00000  3100.00000  7.993214717153e-04
3100.00000  3150.00000  8.204555616190e-04
3150.00000  3200.00000  7.630916033090e-04
3200.00000  3250.00000  7.140303231754e-04
3250.00000  3300.00000  6.876127107957e-04
3300.00000  3350.00000  6.642142541166e-04
3350.00000  3400.00000  6.649690430417e-04
3400.00000  3450.00000  5.909997283788e-04
3450.00000  3500.00000  6.091146625819e-04
3500.00000  3550.00000  5.713752163253e-04
3550.00000  3600.00000  5.902449394536e-04
3600.00000  3650.00000  5.268426697425e-04
3650.00000  3700.00000  5.585438045981e-04
3700.00000  3750.00000  4.974059016623e-04
3750.00000  3800.00000  5.004250573629e-04
3800.00000  3850.00000  4.626856111062e-04
3850.00000  3900.00000  4.611760332560e-04
3900.00000  3950.00000  4.589116664806e-04
3950.00000  4000.00000  4.453254658282e-04
4000.00000  4050.00000  4.136243309726e-04
4050.00000  4100.00000  4.015477081705e-04
4100.00000  4150.00000  4.045668638710e-04
4150.00000  4200.00000  3.487124834112e-04
4200.00000  4250.00000  3.902258742935e-04
4250.00000  4300.00000  3.562603726625e-04
4300.00000  4350.00000  3.713561511652e-04
4350.00000  4400.00000  3.607891062133e-04
4400.00000  4450.00000  3.396550163096e-04
4450.00000  4500.00000  3.192757153311e-04
4500.00000  4550.00000  3.147469817803e-04
4550.00000  4600.00000  2.996512032776e-04
4600.00000  4650.00000  3.207852931813e-04
4650.00000  4700.00000  3.026703589781e-04
4700.00000  4750.00000  2.973868365022e-04
4750.00000  4800.00000  2.898389472509e-04
4800.00000  4850.00000  2.747431687482e-04
4850.00000  4900.00000  2.687048573472e-04
4900.00000  4950.00000  2.815362690744e-04
4950.00000  5000.00000  2.724788019728e-04
5000.00000  5050.00000  2.792719022990e-04
5050.00000  5100.00000  2.709692241226e-04
5100.00000  5150.00000  2.437968228178e-04
5150.00000  5200.00000  2.309654110905e-04
5200.00000  5250.00000  2.407776671173e-04
5250.00000  5300.00000  2.453064006681e-04
5300.00000  5350.00000  2.279462553900e-04
5350.00000  5400.00000  2.362489335665e-04
5400.00000  5450.00000  2.219079439890e-04
5450.00000  5500.00000  2.045477987109e-04
5500.00000  5550.00000  2.105861101120e-04
5550.00000  5600.00000  2.053025876360e-04
5600.00000  5650.00000  1.879424423580e-04
5650.00000  5700.00000  2.053025876360e-04
5700.00000  5750.00000  2.030382208606e-04
5750.00000  5800.00000  1.902068091334e-04
5800.00000  5850.00000  1.751110306307e-04
5850.00000  5900.00000  1.668083524543e-04
5900.00000  5950.00000  1.758658195559e-04
5950.00000  6000.00000  1.796397641815e-04
6000.00000  6050.00000  1.736014527805e-04
6050.00000  6100.00000  1.517125739516e-04
6100.00000  6150.00000  1.713370860051e-04
6150.00000  6200.00000  1.607700410532e-04
6200.00000  6250.00000  1.517125739516e-04
6250.00000  6300.00000  1.547317296522e-04
6300.00000  6350.00000  1.532221518019e-04
6350.00000  6400.00000  2.136052658125e-04
6400.00000  6450.00000  1.177470723207e-04
6450.00000  6500.00000  1.434098957752e-04
6500.00000  6550.00000  1.607700410532e-04
6550.00000  6600.00000  1.200114390961e-04
6600.00000  6650.00000  1.449194736254e-04
6650.00000  6700.00000  1.366167954490e-04
6700.00000  6750.00000  1.366167954490e-04
6750.00000  6800.00000  1.275593283474e-04
6800.00000  6850.00000  1.298236951228e-04
6850.00000  6900.00000  1.207662280212e-04
6900.00000  6950.00000  1.381263732992e-04
6950.00000  7000.00000  1.237853837217e-04
7000.00000  7050.00000  1.162374944704e-04
7050.00000  7100.00000  1.169922833955e-04
7100.00000  7150.00000  8.604593746511e-05
7150.00000  7200.00000  9.736777134209e-05
7200.00000  7250.00000  1.041608716683e-04
7250.00000  7300.00000  9.510340456670e-05
7300.00000  7350.00000  1.064252384437e-04
7350.00000  7400.00000  1.018965048929e-04
7400.00000  7450.00000  1.147279166201e-04
7450.00000  7500.00000  1.034060827432e-04
7500.00000  7550.00000  1.109539719945e-04
7550.00000  7600.00000  8.755551531537e-05
7600.00000  7650.00000  9.208424886617e-05
7650.00000  7700.00000  8.604593746511e-05
7700.00000  7750.00000  9.283903779130e-05
7750.00000  7800.00000  8.151720391431e-05
7800.00000  7850.00000  8.000762606405e-05
7850.00000  7900.00000  7.321452573785e-05
7900.00000  7950.00000  8.076241498918e-05
7950.00000  8000.00000  9.057467101590e-05
8000.00000  8050.00000  8.831030424050e-05
8050.00000  8100.00000  1.034060827432e-04
8100.00000  8150.00000  7.623368143838e-05
8150.00000  8200.00000  6.868579218706e-05
8200.00000  8250.00000  6.793100326193e-05
8250.00000  8300.00000  6.868579218706e-05
8300.00000  8350.00000  6.566663648653e-05
8350.00000  8400.00000  8.227199283944e-05
8400.00000  8450.00000  6.868579218706e-05
8450.00000  8500.00000  8.151720391431e-05
8500.00000  8550.00000  7.396931466299e-05
8550.00000  8600.00000  7.472410358812e-05
8600.00000  8650.00000  6.038311401060e-05
8650.00000  8700.00000  7.849804821378e-05
8700.00000  8750.00000  6.264748078600e-05
8750.00000  8800.00000  6.717621433679e-05
8800.00000  8850.00000  6.189269186087e-05
8850.00000  8900.00000  6.868579218706e-05
8900.00000  8950.00000  7.019537003732e-05
8950.00000  9000.00000  5.962832508547e-05
9000.00000  9050.00000  4.906128013361e-05
9050.00000  9100.00000  6.189269186087e-05
9100.00000  9150.00000  6.038311401060e-05
9150.00000  9200.00000  5.359001368441e-05
9200.00000  9250.00000  6.340226971113e-05
9250.00000  9300.00000  6.264748078600e-05
9300.00000  9350.00000  5.811874723520e-05
9350.00000  9400.00000  4.755170228335e-05
9400.00000  9450.00000  6.038311401060e-05
9450.00000  9500.00000  5.359001368441e-05
9500.00000  9550.00000  5.283522475928e-05
9550.00000  9600.00000  5.434480260954e-05
9600.00000  9650.00000  5.585438045981e-05
9650.00000  9700.00000  5.736395831007e-05
9700.00000  9750.00000  5.132564690901e-05
9750.00000  9800.00000  4.906128013361e-05
9800.00000  9850.00000  5.359001368441e-05
9850.00000  9900.00000  4.755170228335e-05
9900.00000  9950.00000  5.736395831007e-05
9950.00000  10000.00000  4.981606905875e-05
