300.00000  350.00000  3.592237935684e-07
350.00000  400.00000  2.873790348547e-06
400.00000  450.00000  2.155342761411e-06
450.00000  500.00000  2.155342761411e-06
500.00000  550.00000  4.885443592531e-05
550.00000  600.00000  3.592237935684e-06
600.00000  650.00000  1.293205656846e-05
650.00000  700.00000  5.747580697095e-06
700.00000  750.00000  1.077671380705e-05
750.00000  800.00000  5.029133109958e-06
800.00000  850.00000  3.843694591182e-05
850.00000  900.00000  6.466028284232e-06
900.00000  950.00000  3.951461729253e-06
950.00000  1000.00000  6.466028284232e-06
1000.00000  1050.00000  8.980594839211e-06
1050.00000  1100.00000  7.184475871369e-06
1100.00000  1150.00000  7.543699664937e-06
1150.00000  1200.00000  1.149516139419e-05
1200.00000  1250.00000  1.221360898133e-05
1250.00000  1300.00000  5.891270214522e-05
1300.00000  1350.00000  2.514566554979e-05
1350.00000  1400.00000  4.238840764108e-05
1400.00000  1450.00000  7.220398250726e-05
1450.00000  1500.00000  1.088448094512e-04
1500.00000  1550.00000  1.469225315695e-04
1550.00000  1600.00000  1.929031771463e-04
1600.00000  1650.00000  2.794761113962e-04
1650.00000  1700.00000  3.398257087157e-04
1700.00000  1750.00000  5.675735938381e-04
1750.00000  1800.00000  5.697289365995e-04
1800.00000  1850.00000  6.060105397500e-04
1850.00000  1900.00000  6.045736445757e-04
1900.00000  1950.00000  7.170106919626e-04
1950.00000  2000.00000  8.150787876068e-04
2000.00000  2050.00000  9.199721353288e-04
2050.00000  2100.00000  1.019117902354e-03
2100.00000  2150.00000  1.100302479700e-03
2150.00000  2200.00000  1.176817147730e-03
2200.00000  2250.00000  1.248661906444e-03
2250.00000  2300.00000  1.355351373134e-03
2300.00000  2350.00000  1.569448754100e-03
2350.00000  2400.00000  1.488982624341e-03
2400.00000  2450.00000  1.506943814020e-03
2450.00000  2500.00000  1.438691293242e-03
2500.00000  2550.00000  1.380137814890e-03
2550.00000  2600.00000  1.491497190896e-03
2600.00000  2650.00000  1.456652482920e-03
2650.00000  2700.00000  1.434380607719e-03
2700.00000  2750.00000  1.450904902223e-03
2750.00000  2800.00000  1.483594267438e-03
2800.00000  2850.00000  1.470302987076e-03
2850.00000  2900.00000  1.427914579435e-03
2900.00000  2950.00000  1.412108732518e-03
2950.00000  3000.00000  1.473895225011e-03
3000.00000  3050.00000  1.421089327357e-03
3050.00000  3100.00000  1.372234891431e-03
3100.00000  3150.00000  1.343856211740e-03
3150.00000  3200.00000  1.348526121056e-03
3200.00000  3250.00000  1.265545424742e-03
3250.00000  3300.00000  1.278477481310e-03
3300.00000  3350.00000  1.245788116095e-03
3350.00000  3400.00000  1.221001674339e-03
3400.00000  3450.00000  1.213457974674e-03
3450.00000  3500.00000  1.156341391497e-03
3500.00000  3550.00000  1.134069516296e-03
3550.00000  3600.00000  1.101380151081e-03
3600.00000  3650.00000  1.088088870719e-03
3650.00000  3700.00000  1.048215029633e-03
3700.00000  3750.00000  1.017681007179e-03
3750.00000  3800.00000  1.015166440624e-03
3800.00000  3850.00000  9.372148774201e-04
3850.00000  3900.00000  9.303896253423e-04
3900.00000  3950.00000  8.987779315082e-04
3950.00000  4000.00000  8.908750080497e-04
4000.00000  4050.00000  8.427390197116e-04
4050.00000  4100.00000  8.104088782904e-04
4100.00000  4150.00000  7.673020230622e-04
4150.00000  4200.00000  8.114865496711e-04
4200.00000  4250.00000  7.629913375394e-04
4250.00000  4300.00000  7.331757626732e-04
4300.00000  4350.00000  7.263505105954e-04
4350.00000  4400.00000  6.609717801659e-04
4400.00000  4450.00000  6.871951170964e-04
4450.00000  4500.00000  6.422921429004e-04
4500.00000  4550.00000  6.257678483962e-04
4550.00000  4600.00000  6.214571628734e-04
4600.00000  4650.00000  6.078066587178e-04
4650.00000  4700.00000  5.815833217873e-04
4700.00000  4750.00000  5.618260131410e-04
4750.00000  4800.00000  5.787095314388e-04
4800.00000  4850.00000  5.305735431006e-04
4850.00000  4900.00000  5.126123534222e-04
4900.00000  4950.00000  4.849521213174e-04
4950.00000  5000.00000  4.889035830466e-04
5000.00000  5050.00000  4.978841778859e-04
5050.00000  5100.00000  4.490297419605e-04
5100.00000  5150.00000  4.400491471213e-04
5150.00000  5200.00000  4.149034815715e-04
5200.00000  5250.00000  4.113112436359e-04
5250.00000  5300.00000  4.156219291587e-04
5300.00000  5350.00000  4.170588243330e-04
5350.00000  5400.00000  3.861655780861e-04
5400.00000  5450.00000  3.980199632738e-04
5450.00000  5500.00000  3.635344790913e-04
5500.00000  5550.00000  3.484470797614e-04
5550.00000  5600.00000  3.495247511421e-04
5600.00000  5650.00000  3.286897711151e-04
5650.00000  5700.00000  3.085732386753e-04
5700.00000  5750.00000  3.351557993994e-04
5750.00000  5800.00000  3.089324624689e-04
5800.00000  5850.00000  2.988741962489e-04
5850.00000  5900.00000  2.960004059004e-04
5900.00000  5950.00000  2.819906779512e-04
5950.00000  6000.00000  2.902528252033e-04
6000.00000  6050.00000  2.633110406857e-04
6050.00000  6100.00000  2.809130065705e-04
6100.00000  6150.00000  2.590003551628e-04
6150.00000  6200.00000  2.607964741307e-04
6200.00000  6250.00000  2.435537320394e-04
6250.00000  6300.00000  2.406799416909e-04
6300.00000  6350.00000  2.590003551628e-04
6350.00000  6400.00000  7.888554506763e-04
6400.00000  6450.00000  2.230779758060e-04
6450.00000  6500.00000  2.198449616639e-04
6500.00000  6550.00000  2.137381571732e-04
6550.00000  6600.00000  2.202041854575e-04
6600.00000  6650.00000  1.860779250685e-04
6650.00000  6700.00000  2.026022195726e-04
6700.00000  6750.00000  1.893109392106e-04
6750.00000  6800.00000  1.885924916234e-04
6800.00000  6850.00000  1.864371488620e-04
6850.00000  6900.00000  1.857187012749e-04
6900.00000  6950.00000  1.745827636743e-04
6950.00000  7000.00000  1.648837212479e-04
7000.00000  7050.00000  1.810487919585e-04
7050.00000  7100.00000  2.263109899481e-04
7100.00000  7150.00000  1.375827129367e-04
7150.00000  7200.00000  1.311166846525e-04
7200.00000  7250.00000  1.386603843174e-04
7250.00000  7300.00000  1.383011605238e-04
7300.00000  7350.00000  1.286021180975e-04
7350.00000  7400.00000  1.354273701753e-04
7400.00000  7450.00000  1.429710698402e-04
7450.00000  7500.00000  1.433302936338e-04
7500.00000  7550.00000  1.307574608589e-04
7550.00000  7600.00000  1.145923901483e-04
7600.00000  7650.00000  1.228545374004e-04
7650.00000  7700.00000  1.120778235934e-04
7700.00000  7750.00000  1.221360898133e-04
7750.00000  7800.00000  1.099224808319e-04
7800.00000  7850.00000  1.113593760062e-04
7850.00000  7900.00000  1.135147187676e-04
7900.00000  7950.00000  1.038156763413e-04
7950.00000  8000.00000  1.117185997998e-04
8000.00000  8050.00000  1.034564525477e-04
8050.00000  8100.00000  9.411663391493e-05
8100.00000  8150.00000  1.070486904834e-04
8150.00000  8200.00000  8.729138183713e-05
8200.00000  8250.00000  9.519430529564e-05
8250.00000  8300.00000  9.914576702489e-05
8300.00000  8350.00000  9.519430529564e-05
8350.00000  8400.00000  9.483508150207e-05
8400.00000  8450.00000  9.016517218568e-05
8450.00000  8500.00000  8.836905321784e-05
8500.00000  8550.00000  8.621371045642e-05
8550.00000  8600.00000  8.477681528215e-05
8600.00000  8650.00000  8.082535355290e-05
8650.00000  8700.00000  7.687389182365e-05
8700.00000  8750.00000  8.405836769501e-05
8750.00000  8800.00000  6.897096836514e-05
8800.00000  8850.00000  7.256320630082e-05
8850.00000  8900.00000  8.082535355290e-05
8900.00000  8950.00000  8.010690596576e-05
8950.00000  9000.00000  6.645640181016e-05
9000.00000  9050.00000  6.825252077800e-05
9050.00000  9100.00000  7.292243009439e-05
9100.00000  9150.00000  8.118457734647e-05
9150.00000  9200.00000  7.004863974585e-05
9200.00000  9250.00000  6.322338766804e-05
9250.00000  9300.00000  6.394183525518e-05
9300.00000  9350.00000  5.747580697095e-05
9350.00000  9400.00000  6.286416387448e-05
9400.00000  9450.00000  6.214571628734e-05
9450.00000  9500.00000  5.172822627385e-05
9500.00000  9550.00000  6.825252077800e-05
9550.00000  9600.00000  5.819425455809e-05
9600.00000  9650.00000  6.717484939730e-05
9650.00000  9700.00000  6.322338766804e-05
9700.00000  9750.00000  6.609717801659e-05
9750.00000  9800.00000  5.352434524170e-05
9800.00000  9850.00000  5.675735938381e-05
9850.00000  9900.00000  5.460201662240e-05
9900.00000  9950.00000  5.029133109958e-05
9950.00000  10000.00000  5.496124041597e-05
