10001.00000  11001.00000  3.811339695655e-04
11001.00000  12001.00000  3.669002298929e-04
12001.00000  13001.00000  3.476644026012e-04
13001.00000  14001.00000  3.253288260321e-04
14001.00000  15001.00000  3.017282427486e-04
15001.00000  16001.00000  2.823861935191e-04
16001.00000  17001.00000  2.566128887794e-04
17001.00000  18001.00000  2.355712885442e-04
18001.00000  19001.00000  2.233267960714e-04
19001.00000  20001.00000  2.056070455291e-04
20001.00000  21001.00000  1.918078501477e-04
21001.00000  22001.00000  1.765408607159e-04
22001.00000  23001.00000  1.629058265112e-04
23001.00000  24001.00000  1.546494849779e-04
24001.00000  25001.00000  1.431388895302e-04
25001.00000  26001.00000  1.351529311115e-04
26001.00000  27001.00000  1.253611997492e-04
27001.00000  28001.00000  1.203591121301e-04
28001.00000  29001.00000  1.118613571017e-04
29001.00000  30001.00000  1.039333379217e-04
30001.00000  31001.00000  9.926922919591e-05
31001.00000  32001.00000  9.500103860208e-05
32001.00000  33001.00000  9.018242523936e-05
33001.00000  34001.00000  8.510308530190e-05
34001.00000  35001.00000  8.142394363618e-05
35001.00000  36001.00000  7.818900280149e-05
36001.00000  37001.00000  7.033823593998e-05
37001.00000  38001.00000  6.877387649156e-05
38001.00000  39001.00000  6.483400825110e-05
39001.00000  40001.00000  6.274819565321e-05
40001.00000  41001.00000  6.012161682624e-05
41001.00000  42001.00000  5.712808948667e-05
42001.00000  43001.00000  5.452082373931e-05
43001.00000  44001.00000  5.241569806181e-05
44001.00000  45001.00000  4.986637155328e-05
45001.00000  46001.00000  4.799300283110e-05
46001.00000  47001.00000  4.623551258658e-05
47001.00000  48001.00000  4.630310836521e-05
48001.00000  49001.00000  4.327095486643e-05
49001.00000  50001.00000  4.151346462191e-05
50001.00000  51001.00000  3.891585541435e-05
51001.00000  52001.00000  3.823024108819e-05
52001.00000  53001.00000  3.654034662231e-05
53001.00000  54001.00000  3.557469264180e-05
54001.00000  55001.00000  3.487942177584e-05
55001.00000  56001.00000  3.243631720516e-05
56001.00000  57001.00000  3.217559063043e-05
57001.00000  58001.00000  3.117131049070e-05
58001.00000  59001.00000  2.939450716657e-05
59001.00000  60001.00000  2.878614515885e-05
60001.00000  61001.00000  2.804259159386e-05
61001.00000  62001.00000  2.725075532985e-05
62001.00000  63001.00000  2.604368785422e-05
63001.00000  64001.00000  2.444070224658e-05
64001.00000  65001.00000  2.398684487574e-05
65001.00000  66001.00000  2.389027947769e-05
66001.00000  67001.00000  2.257699006421e-05
67001.00000  68001.00000  2.136026604877e-05
68001.00000  69001.00000  2.161133608370e-05
69001.00000  70001.00000  2.159202300409e-05
70001.00000  71001.00000  2.031735974982e-05
71001.00000  72001.00000  1.945792770717e-05
72001.00000  73001.00000  1.892681801790e-05
73001.00000  74001.00000  1.939033192854e-05
74001.00000  75001.00000  1.812532521408e-05
75001.00000  76001.00000  1.832811254998e-05
76001.00000  77001.00000  1.724658009182e-05
77001.00000  78001.00000  1.628092611131e-05
78001.00000  79001.00000  1.596226029775e-05
79001.00000  80001.00000  1.581741220067e-05
80001.00000  81001.00000  1.583672528028e-05
81001.00000  82001.00000  1.486141475997e-05
82001.00000  83001.00000  1.415648735420e-05
83001.00000  84001.00000  1.388610423966e-05
84001.00000  85001.00000  1.375091268239e-05
85001.00000  86001.00000  1.351915572707e-05
86001.00000  87001.00000  1.313289413487e-05
87001.00000  88001.00000  1.271766292325e-05
88001.00000  89001.00000  1.279491524169e-05
89001.00000  90001.00000  1.242796672910e-05
90001.00000  91001.00000  1.197410935826e-05
91001.00000  92001.00000  1.156853468645e-05
92001.00000  93001.00000  1.152025198742e-05
93001.00000  94001.00000  1.150093890781e-05
94001.00000  95001.00000  1.072841572341e-05
95001.00000  96001.00000  1.081532458166e-05
96001.00000  97001.00000  1.077669842244e-05
97001.00000  98001.00000  1.009108409628e-05
98001.00000  99001.00000  1.020696257394e-05
99001.00000  100001.00000  1.009108409628e-05
100001.00000  101001.00000  9.791731362320e-06
101001.00000  102001.00000  9.772418282710e-06
102001.00000  103001.00000  9.453752469143e-06
103001.00000  104001.00000  8.121149976047e-06
104001.00000  105001.00000  8.990238558501e-06
105001.00000  106001.00000  8.497755028444e-06
106001.00000  107001.00000  8.323937311953e-06
107001.00000  108001.00000  7.995614958581e-06
108001.00000  109001.00000  7.590040286769e-06
109001.00000  110001.00000  7.667292605209e-06
110001.00000  111001.00000  7.570727207159e-06
111001.00000  112001.00000  7.454848729498e-06
112001.00000  113001.00000  7.493474888718e-06
113001.00000  114001.00000  7.029960978076e-06
114001.00000  115001.00000  7.242404853787e-06
115001.00000  116001.00000  6.972021739246e-06
116001.00000  117001.00000  6.769234403340e-06
117001.00000  118001.00000  6.749921323730e-06
118001.00000  119001.00000  6.431255510163e-06
119001.00000  120001.00000  6.334690112112e-06
120001.00000  121001.00000  5.764954263615e-06
121001.00000  122001.00000  5.832550042250e-06
122001.00000  123001.00000  5.813236962640e-06
123001.00000  124001.00000  5.311096892777e-06
124001.00000  125001.00000  5.523540768488e-06
125001.00000  126001.00000  5.320753432582e-06
126001.00000  127001.00000  5.011744158821e-06
127001.00000  128001.00000  5.571823467514e-06
128001.00000  129001.00000  4.847582982135e-06
129001.00000  130001.00000  5.117966096676e-06
130001.00000  131001.00000  5.050370318041e-06
131001.00000  132001.00000  4.779987203500e-06
132001.00000  133001.00000  4.461321389933e-06
133001.00000  134001.00000  4.866896061745e-06
134001.00000  135001.00000  4.702734885059e-06
135001.00000  136001.00000  4.413038690908e-06
136001.00000  137001.00000  4.384069071492e-06
137001.00000  138001.00000  4.673765265644e-06
138001.00000  139001.00000  4.065403257926e-06
139001.00000  140001.00000  4.152312116171e-06
140001.00000  141001.00000  4.171625195781e-06
141001.00000  142001.00000  4.007464019096e-06
142001.00000  143001.00000  3.978494399680e-06
143001.00000  144001.00000  3.679141665724e-06
144001.00000  145001.00000  4.036433638511e-06
145001.00000  146001.00000  3.495667409428e-06
146001.00000  147001.00000  3.843302842410e-06
147001.00000  148001.00000  3.746737444359e-06
148001.00000  149001.00000  3.872272461825e-06
149001.00000  150001.00000  3.582576267673e-06
150001.00000  151001.00000  3.350819312352e-06
151001.00000  152001.00000  3.717767824944e-06
152001.00000  153001.00000  3.196314675471e-06
153001.00000  154001.00000  3.321849692937e-06
154001.00000  155001.00000  3.205971215276e-06
155001.00000  156001.00000  3.051466578396e-06
156001.00000  157001.00000  3.360475852157e-06
157001.00000  158001.00000  2.732800764829e-06
158001.00000  159001.00000  2.983870799760e-06
159001.00000  160001.00000  2.964557720150e-06
160001.00000  161001.00000  3.234940834692e-06
161001.00000  162001.00000  3.012840419175e-06
162001.00000  163001.00000  2.694174605609e-06
163001.00000  164001.00000  3.109405817226e-06
164001.00000  165001.00000  2.549326508533e-06
165001.00000  166001.00000  2.867992322100e-06
166001.00000  167001.00000  2.684518065804e-06
167001.00000  168001.00000  2.684518065804e-06
168001.00000  169001.00000  2.172721456136e-06
169001.00000  170001.00000  2.249973774577e-06
170001.00000  171001.00000  2.616922287168e-06
171001.00000  172001.00000  2.472074190093e-06
172001.00000  173001.00000  2.530013428923e-06
173001.00000  174001.00000  2.510700349313e-06
174001.00000  175001.00000  2.240317234771e-06
175001.00000  176001.00000  2.307913013407e-06
176001.00000  177001.00000  2.172721456136e-06
177001.00000  178001.00000  2.423791491067e-06
178001.00000  179001.00000  2.018216819255e-06
179001.00000  180001.00000  2.211347615356e-06
180001.00000  181001.00000  1.940964500815e-06
181001.00000  182001.00000  2.008560279450e-06
182001.00000  183001.00000  1.738177164909e-06
183001.00000  184001.00000  1.863712182375e-06
184001.00000  185001.00000  1.854055642570e-06
185001.00000  186001.00000  1.854055642570e-06
186001.00000  187001.00000  2.027873359060e-06
187001.00000  188001.00000  1.911994881400e-06
188001.00000  189001.00000  2.056842978476e-06
189001.00000  190001.00000  1.554702908613e-06
190001.00000  191001.00000  1.902338341595e-06
191001.00000  192001.00000  1.602985607638e-06
192001.00000  193001.00000  1.805772943544e-06
193001.00000  194001.00000  1.718864085299e-06
194001.00000  195001.00000  1.689894465884e-06
195001.00000  196001.00000  1.516076749393e-06
196001.00000  197001.00000  1.602985607638e-06
197001.00000  198001.00000  1.458137510562e-06
198001.00000  199001.00000  1.380885192122e-06
