10001.00000  11001.00000  3.977175557105e-04
11001.00000  12001.00000  3.124980434735e-04
12001.00000  13001.00000  2.501335776620e-04
13001.00000  14001.00000  2.054171824817e-04
14001.00000  15001.00000  1.721084365607e-04
15001.00000  16001.00000  1.414230524903e-04
16001.00000  17001.00000  1.200784265242e-04
17001.00000  18001.00000  9.996598566979e-05
18001.00000  19001.00000  8.537850386430e-05
19001.00000  20001.00000  7.373236716400e-05
20001.00000  21001.00000  6.431211324601e-05
21001.00000  22001.00000  5.473286770072e-05
22001.00000  23001.00000  4.781673191283e-05
23001.00000  24001.00000  4.320597472090e-05
24001.00000  25001.00000  3.740278032416e-05
25001.00000  26001.00000  3.386521661657e-05
26001.00000  27001.00000  3.064563616358e-05
27001.00000  28001.00000  2.718756826964e-05
28001.00000  29001.00000  2.086765108415e-05
29001.00000  30001.00000  2.142412177973e-05
30001.00000  31001.00000  1.967521387934e-05
31001.00000  32001.00000  1.693260830828e-05
32001.00000  33001.00000  1.637613761271e-05
33001.00000  34001.00000  1.502470878059e-05
34001.00000  35001.00000  1.407075901674e-05
35001.00000  36001.00000  1.192437204809e-05
36001.00000  37001.00000  1.172563251395e-05
37001.00000  38001.00000  1.017546414770e-05
38001.00000  39001.00000  9.022774849719e-06
39001.00000  40001.00000  7.552102297121e-06
40001.00000  41001.00000  7.870085551737e-06
41001.00000  42001.00000  6.717396253755e-06
42001.00000  43001.00000  6.757144160582e-06
43001.00000  44001.00000  6.439160905967e-06
44001.00000  45001.00000  5.564706955774e-06
45001.00000  46001.00000  5.405715328466e-06
46001.00000  47001.00000  5.127479980677e-06
47001.00000  48001.00000  3.935042775868e-06
48001.00000  49001.00000  4.213278123657e-06
49001.00000  50001.00000  3.974790682695e-06
50001.00000  51001.00000  3.458067893945e-06
51001.00000  52001.00000  3.140084639329e-06
52001.00000  53001.00000  3.815799055388e-06
53001.00000  54001.00000  2.901597198368e-06
54001.00000  55001.00000  2.742605571060e-06
55001.00000  56001.00000  1.788655807213e-06
56001.00000  57001.00000  1.987395341348e-06
57001.00000  58001.00000  2.464370223271e-06
58001.00000  59001.00000  1.669412086732e-06
59001.00000  60001.00000  2.146386968656e-06
60001.00000  61001.00000  1.669412086732e-06
61001.00000  62001.00000  2.066891155002e-06
62001.00000  63001.00000  1.430924645770e-06
63001.00000  64001.00000  1.311680925289e-06
64001.00000  65001.00000  1.430924645770e-06
65001.00000  66001.00000  9.142018570199e-07
66001.00000  67001.00000  9.142018570199e-07
67001.00000  68001.00000  1.192437204809e-06
68001.00000  69001.00000  9.936976706739e-07
69001.00000  70001.00000  6.359665092313e-07
70001.00000  71001.00000  8.744539501930e-07
71001.00000  72001.00000  1.073193484328e-06
72001.00000  73001.00000  8.347060433660e-07
73001.00000  74001.00000  4.769748819235e-07
74001.00000  75001.00000  6.359665092313e-07
75001.00000  76001.00000  6.757144160582e-07
76001.00000  77001.00000  5.962186024043e-07
77001.00000  78001.00000  5.962186024043e-07
78001.00000  79001.00000  6.757144160582e-07
79001.00000  80001.00000  4.769748819235e-07
80001.00000  81001.00000  4.769748819235e-07
81001.00000  82001.00000  6.359665092313e-07
82001.00000  83001.00000  7.552102297121e-07
83001.00000  84001.00000  5.167227887504e-07
84001.00000  85001.00000  4.769748819235e-07
85001.00000  86001.00000  3.974790682695e-07
86001.00000  87001.00000  4.769748819235e-07
87001.00000  88001.00000  2.782353477887e-07
88001.00000  89001.00000  3.179832546156e-07
89001.00000  90001.00000  1.589916273078e-07
90001.00000  91001.00000  3.974790682695e-07
91001.00000  92001.00000  1.589916273078e-07
92001.00000  93001.00000  1.987395341348e-07
93001.00000  94001.00000  2.782353477887e-07
94001.00000  95001.00000  1.589916273078e-07
95001.00000  96001.00000  1.192437204809e-07
96001.00000  97001.00000  1.987395341348e-07
97001.00000  98001.00000  3.974790682695e-07
98001.00000  99001.00000  7.949581365391e-08
99001.00000  100001.00000  1.987395341348e-07
100001.00000  101001.00000  1.192437204809e-07
101001.00000  102001.00000  1.987395341348e-07
102001.00000  103001.00000  1.987395341348e-07
103001.00000  104001.00000  1.589916273078e-07
104001.00000  105001.00000  3.974790682695e-08
105001.00000  106001.00000  7.949581365391e-08
106001.00000  107001.00000  1.987395341348e-07
107001.00000  108001.00000  2.782353477887e-07
108001.00000  109001.00000  1.192437204809e-07
109001.00000  110001.00000  7.949581365391e-08
110001.00000  111001.00000  1.589916273078e-07
111001.00000  112001.00000  7.949581365391e-08
112001.00000  113001.00000  7.949581365391e-08
113001.00000  114001.00000  3.974790682695e-08
114001.00000  115001.00000  1.987395341348e-07
115001.00000  116001.00000  1.589916273078e-07
116001.00000  117001.00000  3.974790682695e-08
117001.00000  118001.00000  1.987395341348e-07
118001.00000  119001.00000  7.949581365391e-08
119001.00000  120001.00000  1.589916273078e-07
120001.00000  121001.00000  1.192437204809e-07
121001.00000  122001.00000  7.949581365391e-08
122001.00000  123001.00000  1.589916273078e-07
123001.00000  124001.00000  2.384874409617e-07
124001.00000  125001.00000  3.974790682695e-08
125001.00000  126001.00000  3.974790682695e-08
126001.00000  127001.00000  0.000000000000e+00
127001.00000  128001.00000  3.974790682695e-08
128001.00000  129001.00000  3.974790682695e-08
129001.00000  130001.00000  0.000000000000e+00
130001.00000  131001.00000  0.000000000000e+00
131001.00000  132001.00000  3.974790682695e-08
132001.00000  133001.00000  3.974790682695e-08
133001.00000  134001.00000  3.974790682695e-08
134001.00000  135001.00000  0.000000000000e+00
135001.00000  136001.00000  1.192437204809e-07
136001.00000  137001.00000  3.974790682695e-08
137001.00000  138001.00000  0.000000000000e+00
138001.00000  139001.00000  3.974790682695e-08
139001.00000  140001.00000  7.949581365391e-08
140001.00000  141001.00000  0.000000000000e+00
141001.00000  142001.00000  7.949581365391e-08
142001.00000  143001.00000  0.000000000000e+00
143001.00000  144001.00000  0.000000000000e+00
144001.00000  145001.00000  0.000000000000e+00
145001.00000  146001.00000  0.000000000000e+00
146001.00000  147001.00000  0.000000000000e+00
147001.00000  148001.00000  3.974790682695e-08
148001.00000  149001.00000  0.000000000000e+00
149001.00000  150001.00000  0.000000000000e+00
150001.00000  151001.00000  0.000000000000e+00
151001.00000  152001.00000  3.974790682695e-08
152001.00000  153001.00000  3.974790682695e-08
153001.00000  154001.00000  7.949581365391e-08
154001.00000  155001.00000  0.000000000000e+00
155001.00000  156001.00000  0.000000000000e+00
156001.00000  157001.00000  0.000000000000e+00
157001.00000  158001.00000  0.000000000000e+00
158001.00000  159001.00000  3.974790682695e-08
159001.00000  160001.00000  0.000000000000e+00
160001.00000  161001.00000  0.000000000000e+00
161001.00000  162001.00000  0.000000000000e+00
162001.00000  163001.00000  0.000000000000e+00
163001.00000  164001.00000  0.000000000000e+00
164001.00000  165001.00000  0.000000000000e+00
165001.00000  166001.00000  0.000000000000e+00
166001.00000  167001.00000  0.000000000000e+00
167001.00000  168001.00000  0.000000000000e+00
168001.00000  169001.00000  0.000000000000e+00
169001.00000  170001.00000  0.000000000000e+00
170001.00000  171001.00000  3.974790682695e-08
171001.00000  172001.00000  0.000000000000e+00
172001.00000  173001.00000  0.000000000000e+00
173001.00000  174001.00000  0.000000000000e+00
174001.00000  175001.00000  0.000000000000e+00
175001.00000  176001.00000  0.000000000000e+00
176001.00000  177001.00000  3.974790682695e-08
177001.00000  178001.00000  0.000000000000e+00
178001.00000  179001.00000  7.949581365391e-08
179001.00000  180001.00000  0.000000000000e+00
180001.00000  181001.00000  0.000000000000e+00
181001.00000  182001.00000  0.000000000000e+00
182001.00000  183001.00000  0.000000000000e+00
183001.00000  184001.00000  0.000000000000e+00
184001.00000  185001.00000  0.000000000000e+00
185001.00000  186001.00000  0.000000000000e+00
186001.00000  187001.00000  0.000000000000e+00
187001.00000  188001.00000  0.000000000000e+00
188001.00000  189001.00000  0.000000000000e+00
189001.00000  190001.00000  0.000000000000e+00
190001.00000  191001.00000  0.000000000000e+00
191001.00000  192001.00000  7.949581365391e-08
192001.00000  193001.00000  0.000000000000e+00
193001.00000  194001.00000  0.000000000000e+00
194001.00000  195001.00000  0.000000000000e+00
195001.00000  196001.00000  0.000000000000e+00
196001.00000  197001.00000  3.974790682695e-08
197001.00000  198001.00000  3.974790682695e-08
198001.00000  199001.00000  0.000000000000e+00
