300.00000  350.00000  4.354680048556e-05
350.00000  400.00000  5.097183098310e-05
400.00000  450.00000  2.929876899029e-05
450.00000  500.00000  3.030215148995e-05
500.00000  550.00000  1.749899079420e-04
550.00000  600.00000  1.926494399361e-05
600.00000  650.00000  5.739347898097e-05
650.00000  700.00000  2.388050349208e-05
700.00000  750.00000  3.612176998802e-05
750.00000  800.00000  2.087035599308e-05
800.00000  850.00000  9.491998446853e-05
850.00000  900.00000  2.588726849142e-05
900.00000  950.00000  2.408117999202e-05
950.00000  1000.00000  2.247576799255e-05
1000.00000  1050.00000  2.648929799122e-05
1050.00000  1100.00000  2.508456249168e-05
1100.00000  1150.00000  2.488388599175e-05
1150.00000  1200.00000  2.367982699215e-05
1200.00000  1250.00000  2.227509149261e-05
1250.00000  1300.00000  6.040362647997e-05
1300.00000  1350.00000  2.729200399095e-05
1350.00000  1400.00000  2.889741599042e-05
1400.00000  1450.00000  2.769335699082e-05
1450.00000  1500.00000  3.592109348809e-05
1500.00000  1550.00000  2.869673949049e-05
1550.00000  1600.00000  2.347915049222e-05
1600.00000  1650.00000  2.970012199015e-05
1650.00000  1700.00000  2.508456249168e-05
1700.00000  1750.00000  8.127398247305e-05
1750.00000  1800.00000  2.809470999068e-05
1800.00000  1850.00000  3.271026948915e-05
1850.00000  1900.00000  2.909809249035e-05
1900.00000  1950.00000  2.689065099108e-05
1950.00000  2000.00000  2.448253299188e-05
2000.00000  2050.00000  3.190756348942e-05
2050.00000  2100.00000  2.147238549288e-05
2100.00000  2150.00000  2.970012199015e-05
2150.00000  2200.00000  3.070350448982e-05
2200.00000  2250.00000  2.809470999068e-05
2250.00000  2300.00000  3.110485748969e-05
2300.00000  2350.00000  8.930104247039e-05
2350.00000  2400.00000  2.648929799122e-05
2400.00000  2450.00000  3.090418098975e-05
2450.00000  2500.00000  3.130553398962e-05
2500.00000  2550.00000  2.648929799122e-05
2550.00000  2600.00000  3.271026948915e-05
2600.00000  2650.00000  2.869673949049e-05
2650.00000  2700.00000  2.689065099108e-05
2700.00000  2750.00000  2.628862149128e-05
2750.00000  2800.00000  3.010147499002e-05
2800.00000  2850.00000  2.809470999068e-05
2850.00000  2900.00000  2.628862149128e-05
2900.00000  2950.00000  3.010147499002e-05
2950.00000  3000.00000  5.358062548223e-05
3000.00000  3050.00000  3.210823998935e-05
3050.00000  3100.00000  3.311162248902e-05
3100.00000  3150.00000  3.391432848876e-05
3150.00000  3200.00000  3.150621048955e-05
3200.00000  3250.00000  3.210823998935e-05
3250.00000  3300.00000  3.391432848876e-05
3300.00000  3350.00000  3.431568148862e-05
3350.00000  3400.00000  3.110485748969e-05
3400.00000  3450.00000  3.712515248769e-05
3450.00000  3500.00000  3.752650548756e-05
3500.00000  3550.00000  3.692447598776e-05
3550.00000  3600.00000  3.672379948782e-05
3600.00000  3650.00000  3.431568148862e-05
3650.00000  3700.00000  5.879821448050e-05
3700.00000  3750.00000  3.572041698816e-05
3750.00000  3800.00000  3.371365198882e-05
3800.00000  3850.00000  2.949944549022e-05
3850.00000  3900.00000  3.732582898762e-05
3900.00000  3950.00000  3.893124098709e-05
3950.00000  4000.00000  3.271026948915e-05
4000.00000  4050.00000  4.334612398563e-05
4050.00000  4100.00000  3.170688698949e-05
4100.00000  4150.00000  3.812853498736e-05
4150.00000  4200.00000  3.893124098709e-05
4200.00000  4250.00000  4.515221248503e-05
4250.00000  4300.00000  4.013529998669e-05
4300.00000  4350.00000  4.555356548490e-05
4350.00000  4400.00000  3.913191748703e-05
4400.00000  4450.00000  4.334612398563e-05
4450.00000  4500.00000  3.371365198882e-05
4500.00000  4550.00000  4.274409448583e-05
4550.00000  4600.00000  4.033597648663e-05
4600.00000  4650.00000  4.033597648663e-05
4650.00000  4700.00000  3.732582898762e-05
4700.00000  4750.00000  4.214206498603e-05
4750.00000  4800.00000  4.154003548623e-05
4800.00000  4850.00000  4.093800598643e-05
4850.00000  4900.00000  4.294477098576e-05
4900.00000  4950.00000  4.394815348543e-05
4950.00000  5000.00000  4.515221248503e-05
5000.00000  5050.00000  4.334612398563e-05
5050.00000  5100.00000  5.197521348277e-05
5100.00000  5150.00000  4.756033048423e-05
5150.00000  5200.00000  4.936641898363e-05
5200.00000  5250.00000  5.036980148330e-05
5250.00000  5300.00000  4.294477098576e-05
5300.00000  5350.00000  4.735965398430e-05
5350.00000  5400.00000  4.535288898496e-05
5400.00000  5450.00000  6.100565597977e-05
5450.00000  5500.00000  4.354680048556e-05
5500.00000  5550.00000  4.936641898363e-05
5550.00000  5600.00000  5.077115448317e-05
5600.00000  5650.00000  4.695830098443e-05
5650.00000  5700.00000  4.776100698416e-05
5700.00000  5750.00000  5.137318398297e-05
5750.00000  5800.00000  5.699212598110e-05
5800.00000  5850.00000  5.458400798190e-05
5850.00000  5900.00000  6.020294998004e-05
5900.00000  5950.00000  5.317927248237e-05
5950.00000  6000.00000  5.598874348144e-05
6000.00000  6050.00000  4.936641898363e-05
6050.00000  6100.00000  5.819618498070e-05
6100.00000  6150.00000  5.799550848077e-05
6150.00000  6200.00000  6.923339247704e-05
6200.00000  6250.00000  9.853216146733e-05
6250.00000  6300.00000  1.444870799521e-04
6300.00000  6350.00000  1.260248419582e-04
6350.00000  6400.00000  1.085057835140e-03
6400.00000  6450.00000  5.498536098177e-05
6450.00000  6500.00000  5.679144948117e-05
6500.00000  6550.00000  5.458400798190e-05
6550.00000  6600.00000  5.980159698017e-05
6600.00000  6650.00000  6.200903847944e-05
6650.00000  6700.00000  5.538671398164e-05
6700.00000  6750.00000  5.799550848077e-05
6750.00000  6800.00000  6.582189197818e-05
6800.00000  6850.00000  5.859753798057e-05
6850.00000  6900.00000  7.224353997605e-05
6900.00000  6950.00000  7.063812797658e-05
6950.00000  7000.00000  5.799550848077e-05
7000.00000  7050.00000  5.639009648130e-05
7050.00000  7100.00000  1.685682599441e-04
7100.00000  7150.00000  3.110485748969e-05
7150.00000  7200.00000  3.612176998802e-05
7200.00000  7250.00000  3.190756348942e-05
7250.00000  7300.00000  3.170688698949e-05
7300.00000  7350.00000  3.050282798989e-05
7350.00000  7400.00000  3.471703448849e-05
7400.00000  7450.00000  3.471703448849e-05
7450.00000  7500.00000  7.665842297458e-05
7500.00000  7550.00000  3.672379948782e-05
7550.00000  7600.00000  3.531906398829e-05
7600.00000  7650.00000  3.351297548889e-05
7650.00000  7700.00000  3.572041698816e-05
7700.00000  7750.00000  3.913191748703e-05
7750.00000  7800.00000  3.491771098842e-05
7800.00000  7850.00000  4.254341798589e-05
7850.00000  7900.00000  3.010147499002e-05
7900.00000  7950.00000  3.712515248769e-05
7950.00000  8000.00000  3.411500498869e-05
8000.00000  8050.00000  3.692447598776e-05
8050.00000  8100.00000  3.692447598776e-05
8100.00000  8150.00000  2.929876899029e-05
8150.00000  8200.00000  3.692447598776e-05
8200.00000  8250.00000  3.592109348809e-05
8250.00000  8300.00000  3.993462348676e-05
8300.00000  8350.00000  3.531906398829e-05
8350.00000  8400.00000  3.632244648796e-05
8400.00000  8450.00000  2.990079849009e-05
8450.00000  8500.00000  3.371365198882e-05
8500.00000  8550.00000  3.391432848876e-05
8550.00000  8600.00000  3.572041698816e-05
8600.00000  8650.00000  3.852988798722e-05
8650.00000  8700.00000  3.712515248769e-05
8700.00000  8750.00000  3.632244648796e-05
8750.00000  8800.00000  3.291094598909e-05
8800.00000  8850.00000  3.351297548889e-05
8850.00000  8900.00000  3.451635798856e-05
8900.00000  8950.00000  3.351297548889e-05
8950.00000  9000.00000  3.371365198882e-05
9000.00000  9050.00000  3.592109348809e-05
9050.00000  9100.00000  3.471703448849e-05
9100.00000  9150.00000  3.712515248769e-05
9150.00000  9200.00000  3.491771098842e-05
9200.00000  9250.00000  3.832921148729e-05
9250.00000  9300.00000  3.672379948782e-05
9300.00000  9350.00000  3.893124098709e-05
9350.00000  9400.00000  3.331229898895e-05
9400.00000  9450.00000  3.592109348809e-05
9450.00000  9500.00000  4.073732948649e-05
9500.00000  9550.00000  4.033597648663e-05
9550.00000  9600.00000  3.993462348676e-05
9600.00000  9650.00000  4.374747698549e-05
9650.00000  9700.00000  3.712515248769e-05
9700.00000  9750.00000  3.812853498736e-05
9750.00000  9800.00000  3.832921148729e-05
9800.00000  9850.00000  3.852988798722e-05
9850.00000  9900.00000  3.792785848742e-05
9900.00000  9950.00000  4.174071198616e-05
9950.00000  10000.00000  3.893124098709e-05
