300.00000  350.00000  8.951083246012e-06
350.00000  400.00000  2.536140253037e-05
400.00000  450.00000  2.461547892653e-05
450.00000  500.00000  2.312363171886e-05
500.00000  550.00000  1.954319842046e-04
550.00000  600.00000  2.386955532270e-05
600.00000  650.00000  7.011681876043e-05
650.00000  700.00000  3.505840938021e-05
700.00000  750.00000  5.221465226840e-05
750.00000  800.00000  4.326356902239e-05
800.00000  850.00000  1.387417903132e-04
850.00000  900.00000  5.072280506073e-05
900.00000  950.00000  5.296057587224e-05
950.00000  1000.00000  3.878802739938e-05
1000.00000  1050.00000  5.072280506073e-05
1050.00000  1100.00000  5.296057587224e-05
1100.00000  1150.00000  5.296057587224e-05
1150.00000  1200.00000  6.265758272208e-05
1200.00000  1250.00000  7.086274236426e-05
1250.00000  1300.00000  2.058749146583e-04
1300.00000  1350.00000  1.215855474250e-04
1350.00000  1400.00000  2.096045326774e-04
1400.00000  1450.00000  2.662947265688e-04
1450.00000  1500.00000  3.931017392207e-04
1500.00000  1550.00000  5.706315569332e-04
1550.00000  1600.00000  7.101192708503e-04
1600.00000  1650.00000  9.122645674894e-04
1650.00000  1700.00000  1.233011717138e-03
1700.00000  1750.00000  1.530635235068e-03
1750.00000  1800.00000  1.702197663950e-03
1800.00000  1850.00000  1.810356586506e-03
1850.00000  1900.00000  1.838701683452e-03
1900.00000  1950.00000  2.160940680308e-03
1950.00000  2000.00000  2.385463685062e-03
2000.00000  2050.00000  2.516000315733e-03
2050.00000  2100.00000  2.920290909011e-03
2100.00000  2150.00000  3.199266336845e-03
2150.00000  2200.00000  3.258940225152e-03
2200.00000  2250.00000  3.509570556040e-03
2250.00000  2300.00000  3.675911519695e-03
2300.00000  2350.00000  4.021274148271e-03
2350.00000  2400.00000  4.073488800539e-03
2400.00000  2450.00000  4.259223777894e-03
2450.00000  2500.00000  4.160761862188e-03
2500.00000  2550.00000  3.989199433306e-03
2550.00000  2600.00000  4.130178994431e-03
2600.00000  2650.00000  4.204025431210e-03
2650.00000  2700.00000  4.327102825843e-03
2700.00000  2750.00000  4.321135437012e-03
2750.00000  2800.00000  4.301741423312e-03
2800.00000  2850.00000  4.341275374316e-03
2850.00000  2900.00000  4.325610978635e-03
2900.00000  2950.00000  4.419597352718e-03
2950.00000  3000.00000  4.453909838495e-03
3000.00000  3050.00000  4.363653082431e-03
3050.00000  3100.00000  4.350972381166e-03
3100.00000  3150.00000  4.409900345868e-03
3150.00000  3200.00000  4.365144929638e-03
3200.00000  3250.00000  4.130178994431e-03
3250.00000  3300.00000  4.118990140373e-03
3300.00000  3350.00000  4.146589313715e-03
3350.00000  3400.00000  4.182393646699e-03
3400.00000  3450.00000  4.051857016028e-03
3450.00000  3500.00000  4.086169501804e-03
3500.00000  3550.00000  3.990691280514e-03
3550.00000  3600.00000  3.921320385357e-03
3600.00000  3650.00000  3.846728024974e-03
3650.00000  3700.00000  3.828825858482e-03
3700.00000  3750.00000  3.728872095568e-03
3750.00000  3800.00000  3.654279735184e-03
3800.00000  3850.00000  3.575957756782e-03
3850.00000  3900.00000  3.666214512846e-03
3900.00000  3950.00000  3.517775715683e-03
3950.00000  4000.00000  3.520759410098e-03
4000.00000  4050.00000  3.379033925369e-03
4050.00000  4100.00000  3.349942904820e-03
4100.00000  4150.00000  3.361877682481e-03
4150.00000  4200.00000  3.266399461190e-03
4200.00000  4250.00000  3.162716080257e-03
4250.00000  4300.00000  3.093345185101e-03
4300.00000  4350.00000  3.061270470136e-03
4350.00000  4400.00000  2.980710720922e-03
4400.00000  4450.00000  2.919544985407e-03
4450.00000  4500.00000  2.794229819963e-03
4500.00000  4550.00000  2.874043645574e-03
4550.00000  4600.00000  2.860617020705e-03
4600.00000  4650.00000  2.745744785714e-03
4650.00000  4700.00000  2.683833126596e-03
4700.00000  4750.00000  2.697259751465e-03
4750.00000  4800.00000  2.610732613420e-03
4800.00000  4850.00000  2.574928280436e-03
4850.00000  4900.00000  2.518984010148e-03
4900.00000  4950.00000  2.478704135541e-03
4950.00000  5000.00000  2.466769357880e-03
5000.00000  5050.00000  2.389193303081e-03
5050.00000  5100.00000  2.295952852602e-03
5100.00000  5150.00000  2.240754505918e-03
5150.00000  5200.00000  2.359356358928e-03
5200.00000  5250.00000  2.208679790953e-03
5250.00000  5300.00000  2.116185264078e-03
5300.00000  5350.00000  2.077397236679e-03
5350.00000  5400.00000  2.090823861548e-03
5400.00000  5450.00000  2.093061632359e-03
5450.00000  5500.00000  2.069938000640e-03
5500.00000  5550.00000  1.970730161330e-03
5550.00000  5600.00000  1.952827994838e-03
5600.00000  5650.00000  1.915531814647e-03
5650.00000  5700.00000  1.944622835196e-03
5700.00000  5750.00000  1.808118815694e-03
5750.00000  5800.00000  1.803643274071e-03
5800.00000  5850.00000  1.799167732448e-03
5850.00000  5900.00000  1.748444927388e-03
5900.00000  5950.00000  1.769330788295e-03
5950.00000  6000.00000  1.718607983234e-03
6000.00000  6050.00000  1.610449060678e-03
6050.00000  6100.00000  1.590309123375e-03
6100.00000  6150.00000  1.657442247720e-03
6150.00000  6200.00000  1.563455873637e-03
6200.00000  6250.00000  1.678328108627e-03
6250.00000  6300.00000  1.540332241918e-03
6300.00000  6350.00000  1.480658353611e-03
6350.00000  6400.00000  2.108726028040e-03
6400.00000  6450.00000  1.433665166570e-03
6450.00000  6500.00000  1.417254847285e-03
6500.00000  6550.00000  1.435157013777e-03
6550.00000  6600.00000  1.325506244014e-03
6600.00000  6650.00000  1.333711403656e-03
6650.00000  6700.00000  1.319538855183e-03
6700.00000  6750.00000  1.327744014825e-03
6750.00000  6800.00000  1.274037515349e-03
6800.00000  6850.00000  1.277021209764e-03
6850.00000  6900.00000  1.300144841483e-03
6900.00000  6950.00000  1.238979105969e-03
6950.00000  7000.00000  1.224060633892e-03
7000.00000  7050.00000  1.227044328307e-03
7050.00000  7100.00000  1.287464140218e-03
7100.00000  7150.00000  1.124852794582e-03
7150.00000  7200.00000  1.077113683937e-03
7200.00000  7250.00000  1.010726483195e-03
7250.00000  7300.00000  1.066670753483e-03
7300.00000  7350.00000  1.018185719234e-03
7350.00000  7400.00000  9.905865458920e-04
7400.00000  7450.00000  9.838732334575e-04
7450.00000  7500.00000  9.540362893041e-04
7500.00000  7550.00000  9.719384557961e-04
7550.00000  7600.00000  9.316585811891e-04
7600.00000  7650.00000  9.279289631699e-04
7650.00000  7700.00000  9.421015116427e-04
7700.00000  7750.00000  9.227074979430e-04
7750.00000  7800.00000  8.354344362944e-04
7800.00000  7850.00000  8.786980053168e-04
7850.00000  7900.00000  8.943624009973e-04
7900.00000  7950.00000  8.958542482050e-04
7950.00000  8000.00000  8.428936723328e-04
8000.00000  8050.00000  8.175322698024e-04
8050.00000  8100.00000  7.615879995148e-04
8100.00000  8150.00000  8.227537350292e-04
8150.00000  8200.00000  8.540825263903e-04
8200.00000  8250.00000  8.108189573679e-04
8250.00000  8300.00000  7.944086380835e-04
8300.00000  8350.00000  7.727768535723e-04
8350.00000  8400.00000  7.750146243838e-04
8400.00000  8450.00000  7.645716939302e-04
8450.00000  8500.00000  7.511450690611e-04
8500.00000  8550.00000  7.615879995148e-04
8550.00000  8600.00000  7.056437292273e-04
8600.00000  8650.00000  6.966926459812e-04
8650.00000  8700.00000  7.138488888694e-04
8700.00000  8750.00000  6.877415627352e-04
8750.00000  8800.00000  6.914711807544e-04
8800.00000  8850.00000  7.153407360771e-04
8850.00000  8900.00000  6.787904794892e-04
8900.00000  8950.00000  6.795364030931e-04
8950.00000  9000.00000  6.653638546202e-04
9000.00000  9050.00000  6.310513688438e-04
9050.00000  9100.00000  6.579046185819e-04
9100.00000  9150.00000  6.034521955020e-04
9150.00000  9200.00000  6.564127713742e-04
9200.00000  9250.00000  6.131492023518e-04
9250.00000  9300.00000  6.161328967671e-04
9300.00000  9350.00000  5.930092650483e-04
9350.00000  9400.00000  5.915174178406e-04
9400.00000  9450.00000  6.019603482943e-04
9450.00000  9500.00000  5.892796470291e-04
9500.00000  9550.00000  5.489997724221e-04
9550.00000  9600.00000  5.310976059300e-04
9600.00000  9650.00000  5.862959526138e-04
9650.00000  9700.00000  5.900255706329e-04
9700.00000  9750.00000  5.415405363837e-04
9750.00000  9800.00000  5.557130848566e-04
9800.00000  9850.00000  5.885337234253e-04
9850.00000  9900.00000  5.378109183645e-04
9900.00000  9950.00000  5.176709810610e-04
9950.00000  10000.00000  5.191628282687e-04
