300.00000  350.00000  1.143237587794e-05
350.00000  400.00000  2.965272493340e-05
400.00000  450.00000  1.964939604021e-05
450.00000  500.00000  2.786641620247e-05
500.00000  550.00000  1.968512221482e-04
550.00000  600.00000  2.000665778639e-05
600.00000  650.00000  5.930544986680e-05
650.00000  700.00000  2.322201350206e-05
700.00000  750.00000  4.215688604990e-05
750.00000  800.00000  2.465106048680e-05
800.00000  850.00000  9.181626876969e-05
850.00000  900.00000  2.322201350206e-05
900.00000  950.00000  2.215022826350e-05
950.00000  1000.00000  2.500832223299e-05
1000.00000  1050.00000  2.715189271010e-05
1050.00000  1100.00000  2.715189271010e-05
1100.00000  1150.00000  2.929546318722e-05
1150.00000  1200.00000  2.822367794866e-05
1200.00000  1250.00000  2.643736921773e-05
1250.00000  1300.00000  8.288472511505e-05
1300.00000  1350.00000  2.715189271010e-05
1350.00000  1400.00000  3.000998667959e-05
1400.00000  1450.00000  2.715189271010e-05
1450.00000  1500.00000  3.215355715670e-05
1500.00000  1550.00000  3.286808064907e-05
1550.00000  1600.00000  2.858093969484e-05
1600.00000  1650.00000  3.429712763381e-05
1650.00000  1700.00000  3.143903366433e-05
1700.00000  1750.00000  1.046776916324e-04
1750.00000  1800.00000  3.036724842577e-05
1800.00000  1850.00000  3.644069811093e-05
1850.00000  1900.00000  3.322534239526e-05
1900.00000  1950.00000  3.786974509567e-05
1950.00000  2000.00000  3.786974509567e-05
2000.00000  2050.00000  4.144236255752e-05
2050.00000  2100.00000  4.251414779608e-05
2100.00000  2150.00000  4.179962430371e-05
2150.00000  2200.00000  3.894153033423e-05
2200.00000  2250.00000  3.786974509567e-05
2250.00000  2300.00000  4.787307398886e-05
2300.00000  2350.00000  1.400466045047e-04
2350.00000  2400.00000  3.715522160330e-05
2400.00000  2450.00000  3.965605382660e-05
2450.00000  2500.00000  3.501165112618e-05
2500.00000  2550.00000  3.572617461856e-05
2550.00000  2600.00000  4.537224176557e-05
2600.00000  2650.00000  4.144236255752e-05
2650.00000  2700.00000  4.358593303464e-05
2700.00000  2750.00000  3.786974509567e-05
2750.00000  2800.00000  4.823033573505e-05
2800.00000  2850.00000  4.751581224268e-05
2850.00000  2900.00000  4.823033573505e-05
2900.00000  2950.00000  5.108842970453e-05
2950.00000  3000.00000  7.395318146041e-05
3000.00000  3050.00000  4.465771827319e-05
3050.00000  3100.00000  4.823033573505e-05
3100.00000  3150.00000  4.930212097361e-05
3150.00000  3200.00000  4.965938271979e-05
3200.00000  3250.00000  4.322867128845e-05
3250.00000  3300.00000  4.358593303464e-05
3300.00000  3350.00000  4.358593303464e-05
3350.00000  3400.00000  4.179962430371e-05
3400.00000  3450.00000  5.430378542020e-05
3450.00000  3500.00000  5.108842970453e-05
3500.00000  3550.00000  5.108842970453e-05
3550.00000  3600.00000  5.823366462825e-05
3600.00000  3650.00000  3.715522160330e-05
3650.00000  3700.00000  7.752579892227e-05
3700.00000  3750.00000  4.680128875031e-05
3750.00000  3800.00000  5.251747668928e-05
3800.00000  3850.00000  4.930212097361e-05
3850.00000  3900.00000  4.823033573505e-05
3900.00000  3950.00000  5.716187938969e-05
3950.00000  4000.00000  5.430378542020e-05
4000.00000  4050.00000  5.966271161299e-05
4050.00000  4100.00000  5.394652367402e-05
4100.00000  4150.00000  5.323200018165e-05
4150.00000  4200.00000  6.109175859773e-05
4200.00000  4250.00000  5.287473843546e-05
4250.00000  4300.00000  5.073116795835e-05
4300.00000  4350.00000  5.180295319691e-05
4350.00000  4400.00000  5.358926192783e-05
4400.00000  4450.00000  5.358926192783e-05
4450.00000  4500.00000  5.216021494309e-05
4500.00000  4550.00000  4.858759748124e-05
4550.00000  4600.00000  5.787640288206e-05
4600.00000  4650.00000  6.037723510536e-05
4650.00000  4700.00000  5.144569145072e-05
4700.00000  4750.00000  6.144902034392e-05
4750.00000  4800.00000  5.787640288206e-05
4800.00000  4850.00000  5.180295319691e-05
4850.00000  4900.00000  5.680461764350e-05
4900.00000  4950.00000  6.109175859773e-05
4950.00000  5000.00000  6.180628209010e-05
5000.00000  5050.00000  5.287473843546e-05
5050.00000  5100.00000  5.716187938969e-05
5100.00000  5150.00000  5.430378542020e-05
5150.00000  5200.00000  6.144902034392e-05
5200.00000  5250.00000  6.466437605959e-05
5250.00000  5300.00000  6.144902034392e-05
5300.00000  5350.00000  5.216021494309e-05
5350.00000  5400.00000  6.716520828288e-05
5400.00000  5450.00000  7.681127542989e-05
5450.00000  5500.00000  5.823366462825e-05
5500.00000  5550.00000  5.430378542020e-05
5550.00000  5600.00000  5.787640288206e-05
5600.00000  5650.00000  5.751914113587e-05
5650.00000  5700.00000  5.430378542020e-05
5700.00000  5750.00000  5.573283240495e-05
5750.00000  5800.00000  6.895151701381e-05
5800.00000  5850.00000  5.680461764350e-05
5850.00000  5900.00000  7.752579892227e-05
5900.00000  5950.00000  6.466437605959e-05
5950.00000  6000.00000  5.894818812062e-05
6000.00000  6050.00000  6.466437605959e-05
6050.00000  6100.00000  4.858759748124e-05
6100.00000  6150.00000  6.144902034392e-05
6150.00000  6200.00000  6.430711431340e-05
6200.00000  6250.00000  8.931543654639e-05
6250.00000  6300.00000  1.218262554493e-04
6300.00000  6350.00000  1.096793560790e-04
6350.00000  6400.00000  8.945834124486e-04
6400.00000  6450.00000  5.180295319691e-05
6450.00000  6500.00000  6.144902034392e-05
6500.00000  6550.00000  5.930544986680e-05
6550.00000  6600.00000  6.609342304433e-05
6600.00000  6650.00000  6.359259082103e-05
6650.00000  6700.00000  7.109508749093e-05
6700.00000  6750.00000  5.930544986680e-05
6750.00000  6800.00000  6.645068479051e-05
6800.00000  6850.00000  6.359259082103e-05
6850.00000  6900.00000  7.216687272948e-05
6900.00000  6950.00000  7.573949019134e-05
6950.00000  7000.00000  6.323532907484e-05
7000.00000  7050.00000  5.323200018165e-05
7050.00000  7100.00000  1.500499333979e-04
7100.00000  7150.00000  3.644069811093e-05
7150.00000  7200.00000  3.251081890289e-05
7200.00000  7250.00000  2.965272493340e-05
7250.00000  7300.00000  3.786974509567e-05
7300.00000  7350.00000  3.465438938000e-05
7350.00000  7400.00000  3.358260414144e-05
7400.00000  7450.00000  3.786974509567e-05
7450.00000  7500.00000  6.287806732866e-05
7500.00000  7550.00000  3.322534239526e-05
7550.00000  7600.00000  3.108177191814e-05
7600.00000  7650.00000  3.179629541051e-05
7650.00000  7700.00000  3.465438938000e-05
7700.00000  7750.00000  3.751248334948e-05
7750.00000  7800.00000  3.036724842577e-05
7800.00000  7850.00000  3.322534239526e-05
7850.00000  7900.00000  3.929879208041e-05
7900.00000  7950.00000  3.000998667959e-05
7950.00000  8000.00000  3.501165112618e-05
8000.00000  8050.00000  3.536891287237e-05
8050.00000  8100.00000  2.786641620247e-05
8100.00000  8150.00000  3.608343636474e-05
8150.00000  8200.00000  4.465771827319e-05
8200.00000  8250.00000  3.000998667959e-05
8250.00000  8300.00000  4.072783906515e-05
8300.00000  8350.00000  3.679795985711e-05
8350.00000  8400.00000  2.965272493340e-05
8400.00000  8450.00000  2.500832223299e-05
8450.00000  8500.00000  3.572617461856e-05
8500.00000  8550.00000  3.965605382660e-05
8550.00000  8600.00000  3.465438938000e-05
8600.00000  8650.00000  3.036724842577e-05
8650.00000  8700.00000  3.429712763381e-05
8700.00000  8750.00000  3.286808064907e-05
8750.00000  8800.00000  2.893820144103e-05
8800.00000  8850.00000  3.358260414144e-05
8850.00000  8900.00000  3.536891287237e-05
8900.00000  8950.00000  3.143903366433e-05
8950.00000  9000.00000  3.036724842577e-05
9000.00000  9050.00000  2.608010747155e-05
9050.00000  9100.00000  3.858426858804e-05
9100.00000  9150.00000  4.144236255752e-05
9150.00000  9200.00000  3.501165112618e-05
9200.00000  9250.00000  2.929546318722e-05
9250.00000  9300.00000  2.858093969484e-05
9300.00000  9350.00000  3.322534239526e-05
9350.00000  9400.00000  3.143903366433e-05
9400.00000  9450.00000  3.536891287237e-05
9450.00000  9500.00000  4.108510081134e-05
9500.00000  9550.00000  3.179629541051e-05
9550.00000  9600.00000  2.893820144103e-05
9600.00000  9650.00000  3.786974509567e-05
9650.00000  9700.00000  3.036724842577e-05
9700.00000  9750.00000  3.108177191814e-05
9750.00000  9800.00000  2.715189271010e-05
9800.00000  9850.00000  2.965272493340e-05
9850.00000  9900.00000  2.965272493340e-05
9900.00000  9950.00000  3.215355715670e-05
9950.00000  10000.00000  3.393986588763e-05
