10001.00000  11001.00000  8.105294139825e-04
11001.00000  12001.00000  6.889645792099e-04
12001.00000  13001.00000  5.993994855124e-04
13001.00000  14001.00000  5.154240418425e-04
14001.00000  15001.00000  4.490620277560e-04
15001.00000  16001.00000  3.955783260532e-04
16001.00000  17001.00000  3.517860319521e-04
17001.00000  18001.00000  3.094816303045e-04
18001.00000  19001.00000  2.780549288904e-04
19001.00000  20001.00000  2.478547334176e-04
20001.00000  21001.00000  2.263607194626e-04
21001.00000  22001.00000  2.029465199765e-04
22001.00000  23001.00000  1.865193830249e-04
23001.00000  24001.00000  1.664127282494e-04
24001.00000  25001.00000  1.545498019319e-04
25001.00000  26001.00000  1.406158901725e-04
26001.00000  27001.00000  1.300598964153e-04
27001.00000  28001.00000  1.198356624620e-04
28001.00000  29001.00000  1.089479089010e-04
29001.00000  30001.00000  1.026645792837e-04
30001.00000  31001.00000  9.341551808697e-05
31001.00000  32001.00000  8.767506814857e-05
32001.00000  33001.00000  8.015517926253e-05
33001.00000  34001.00000  7.332896996625e-05
34001.00000  35001.00000  6.959918550539e-05
35001.00000  36001.00000  6.500481488919e-05
36001.00000  37001.00000  6.131524373789e-05
37001.00000  38001.00000  5.656001988348e-05
38001.00000  39001.00000  5.241804899973e-05
39001.00000  40001.00000  4.932162416430e-05
40001.00000  41001.00000  4.539077315569e-05
41001.00000  42001.00000  4.422458717871e-05
42001.00000  43001.00000  4.053501602741e-05
43001.00000  44001.00000  3.854445720463e-05
44001.00000  45001.00000  3.555861897047e-05
45001.00000  46001.00000  3.444269963043e-05
46001.00000  47001.00000  3.180872785484e-05
47001.00000  48001.00000  3.052190194921e-05
48001.00000  49001.00000  2.879272963852e-05
49001.00000  50001.00000  2.723446389341e-05
50001.00000  51001.00000  2.559577152921e-05
51001.00000  52001.00000  2.371579930770e-05
52001.00000  53001.00000  2.263003994982e-05
53001.00000  54001.00000  2.118236080599e-05
54001.00000  55001.00000  2.075006772832e-05
55001.00000  56001.00000  1.941297518574e-05
56001.00000  57001.00000  1.758326960117e-05
57001.00000  58001.00000  1.638692364203e-05
58001.00000  59001.00000  1.638692364203e-05
59001.00000  60001.00000  1.645729693375e-05
60001.00000  61001.00000  1.481860456954e-05
61001.00000  62001.00000  1.413497830718e-05
62001.00000  63001.00000  1.305927227669e-05
63001.00000  64001.00000  1.295873900281e-05
64001.00000  65001.00000  1.190313962710e-05
65001.00000  66001.00000  1.172217973412e-05
66001.00000  67001.00000  1.105866012652e-05
67001.00000  68001.00000  9.751727566117e-06
68001.00000  69001.00000  1.036498053677e-05
69001.00000  70001.00000  9.872367494770e-06
70001.00000  71001.00000  9.379754452770e-06
71001.00000  72001.00000  8.203515148404e-06
72001.00000  73001.00000  8.123088529302e-06
73001.00000  74001.00000  7.439462266935e-06
74001.00000  75001.00000  7.791328725506e-06
75001.00000  76001.00000  7.550048868200e-06
76001.00000  77001.00000  6.886529260609e-06
77001.00000  78001.00000  6.353702909058e-06
78001.00000  79001.00000  6.424076200772e-06
79001.00000  80001.00000  5.619810009752e-06
80001.00000  81001.00000  5.629863337140e-06
81001.00000  82001.00000  5.338316842895e-06
82001.00000  83001.00000  5.177463604691e-06
83001.00000  84001.00000  4.875863783059e-06
84001.00000  85001.00000  4.865810455671e-06
85001.00000  86001.00000  4.926130419997e-06
86001.00000  87001.00000  4.564210634038e-06
87001.00000  88001.00000  3.971064318161e-06
88001.00000  89001.00000  3.940904335998e-06
89001.00000  90001.00000  3.759944443018e-06
90001.00000  91001.00000  3.307544710570e-06
91001.00000  92001.00000  3.880584371671e-06
92001.00000  93001.00000  3.277384728406e-06
93001.00000  94001.00000  3.227118091468e-06
94001.00000  95001.00000  2.925518269835e-06
95001.00000  96001.00000  3.036104871100e-06
96001.00000  97001.00000  2.985838234162e-06
97001.00000  98001.00000  2.895358287672e-06
98001.00000  99001.00000  2.654078430366e-06
99001.00000  100001.00000  2.382638590897e-06
100001.00000  101001.00000  2.563598483876e-06
101001.00000  102001.00000  2.282105317019e-06
102001.00000  103001.00000  2.191625370529e-06
103001.00000  104001.00000  1.950345513223e-06
104001.00000  105001.00000  2.000612150162e-06
105001.00000  106001.00000  2.181572043142e-06
106001.00000  107001.00000  1.960398840611e-06
107001.00000  108001.00000  1.879972221509e-06
108001.00000  109001.00000  1.578372399877e-06
109001.00000  110001.00000  1.598479054652e-06
110001.00000  111001.00000  1.618585709428e-06
111001.00000  112001.00000  1.477839125999e-06
112001.00000  113001.00000  1.447679143836e-06
113001.00000  114001.00000  1.518052435550e-06
114001.00000  115001.00000  1.337092542571e-06
115001.00000  116001.00000  1.719118983305e-06
116001.00000  117001.00000  1.507999108162e-06
117001.00000  118001.00000  1.246612596081e-06
118001.00000  119001.00000  1.105866012652e-06
119001.00000  120001.00000  1.186292631754e-06
120001.00000  121001.00000  8.545328279587e-07
121001.00000  122001.00000  1.015386066163e-06
122001.00000  123001.00000  9.550661018362e-07
123001.00000  124001.00000  1.136025994816e-06
124001.00000  125001.00000  1.045546048326e-06
125001.00000  126001.00000  8.645861553465e-07
126001.00000  127001.00000  8.344261731832e-07
127001.00000  128001.00000  8.947461375097e-07
128001.00000  129001.00000  6.836262623670e-07
129001.00000  130001.00000  7.942128636322e-07
130001.00000  131001.00000  6.434129528160e-07
131001.00000  132001.00000  7.037329171425e-07
132001.00000  133001.00000  7.238395719180e-07
133001.00000  134001.00000  6.031996432650e-07
134001.00000  135001.00000  7.741062088567e-07
135001.00000  136001.00000  6.333596254282e-07
136001.00000  137001.00000  5.026663693875e-07
137001.00000  138001.00000  5.931463158772e-07
138001.00000  139001.00000  5.931463158772e-07
139001.00000  140001.00000  5.629863337140e-07
140001.00000  141001.00000  5.428796789385e-07
141001.00000  142001.00000  4.825597146120e-07
142001.00000  143001.00000  4.423464050610e-07
143001.00000  144001.00000  5.026663693875e-07
144001.00000  145001.00000  3.719731133467e-07
145001.00000  146001.00000  4.222397502855e-07
146001.00000  147001.00000  4.021330955100e-07
147001.00000  148001.00000  3.719731133467e-07
148001.00000  149001.00000  3.719731133467e-07
149001.00000  150001.00000  4.725063872242e-07
150001.00000  151001.00000  3.418131311835e-07
151001.00000  152001.00000  3.920797681222e-07
152001.00000  153001.00000  3.217064764080e-07
153001.00000  154001.00000  2.814931668570e-07
154001.00000  155001.00000  2.412798573060e-07
155001.00000  156001.00000  2.412798573060e-07
156001.00000  157001.00000  3.116531490202e-07
157001.00000  158001.00000  2.613865120815e-07
158001.00000  159001.00000  3.116531490202e-07
159001.00000  160001.00000  2.714398394692e-07
160001.00000  161001.00000  2.010665477550e-07
161001.00000  162001.00000  2.714398394692e-07
162001.00000  163001.00000  1.608532382040e-07
163001.00000  164001.00000  1.206399286530e-07
164001.00000  165001.00000  1.709065655917e-07
165001.00000  166001.00000  1.809598929795e-07
166001.00000  167001.00000  3.015998216325e-07
167001.00000  168001.00000  2.211732025305e-07
168001.00000  169001.00000  1.407465834285e-07
169001.00000  170001.00000  2.513331846937e-07
170001.00000  171001.00000  2.412798573060e-07
171001.00000  172001.00000  1.809598929795e-07
172001.00000  173001.00000  1.306932560407e-07
173001.00000  174001.00000  1.105866012652e-07
174001.00000  175001.00000  1.709065655917e-07
175001.00000  176001.00000  1.206399286530e-07
176001.00000  177001.00000  1.306932560407e-07
177001.00000  178001.00000  1.608532382040e-07
178001.00000  179001.00000  1.507999108162e-07
179001.00000  180001.00000  1.809598929795e-07
180001.00000  181001.00000  1.507999108162e-07
181001.00000  182001.00000  1.005332738775e-07
182001.00000  183001.00000  1.105866012652e-07
183001.00000  184001.00000  1.005332738775e-07
184001.00000  185001.00000  1.306932560407e-07
185001.00000  186001.00000  1.105866012652e-07
186001.00000  187001.00000  9.047994648975e-08
187001.00000  188001.00000  8.042661910200e-08
188001.00000  189001.00000  5.026663693875e-08
189001.00000  190001.00000  3.015998216325e-08
190001.00000  191001.00000  1.206399286530e-07
191001.00000  192001.00000  1.608532382040e-07
192001.00000  193001.00000  1.005332738775e-07
193001.00000  194001.00000  9.047994648975e-08
194001.00000  195001.00000  9.047994648975e-08
195001.00000  196001.00000  9.047994648975e-08
196001.00000  197001.00000  3.015998216325e-08
197001.00000  198001.00000  7.037329171425e-08
198001.00000  199001.00000  6.031996432650e-08
