300.00000  350.00000  5.790788733424e-01
350.00000  400.00000  4.107269843669e-01
400.00000  450.00000  3.031431594865e-01
450.00000  500.00000  2.310585299356e-01
500.00000  550.00000  1.825562602650e-01
550.00000  600.00000  1.461986712747e-01
600.00000  650.00000  1.199245584340e-01
650.00000  700.00000  9.912402986149e-02
700.00000  750.00000  8.350565561077e-02
750.00000  800.00000  7.088560348514e-02
800.00000  850.00000  6.111323826550e-02
850.00000  900.00000  5.320072597728e-02
900.00000  950.00000  4.667950782336e-02
950.00000  1000.00000  4.091222272588e-02
1000.00000  1050.00000  3.625539926877e-02
1050.00000  1100.00000  3.254931870213e-02
1100.00000  1150.00000  2.916797436161e-02
1150.00000  1200.00000  2.613029026971e-02
1200.00000  1250.00000  2.347941319774e-02
1250.00000  1300.00000  2.170282596532e-02
1300.00000  1350.00000  1.957273799258e-02
1350.00000  1400.00000  1.805351746618e-02
1400.00000  1450.00000  1.640107182137e-02
1450.00000  1500.00000  1.517101035879e-02
1500.00000  1550.00000  1.394700458341e-02
1550.00000  1600.00000  1.301594267635e-02
1600.00000  1650.00000  1.209699214369e-02
1650.00000  1700.00000  1.095852295002e-02
1700.00000  1750.00000  1.042940728088e-02
1750.00000  1800.00000  9.748899431739e-03
1800.00000  1850.00000  8.997994218889e-03
1850.00000  1900.00000  8.250873810540e-03
1900.00000  1950.00000  7.847413650814e-03
1950.00000  2000.00000  7.452280060988e-03
2000.00000  2050.00000  6.983721263857e-03
2050.00000  2100.00000  6.750577306642e-03
2100.00000  2150.00000  6.379666465618e-03
2150.00000  2200.00000  5.893697567786e-03
2200.00000  2250.00000  5.631789096369e-03
2250.00000  2300.00000  5.210918835941e-03
2300.00000  2350.00000  5.167015103738e-03
2350.00000  2400.00000  4.780208083813e-03
2400.00000  2450.00000  4.549335009298e-03
2450.00000  2500.00000  4.388102337587e-03
2500.00000  2550.00000  4.186750738174e-03
2550.00000  2600.00000  3.997510513162e-03
2600.00000  2650.00000  3.695483114042e-03
2650.00000  2700.00000  3.612974375937e-03
2700.00000  2750.00000  3.429789838125e-03
2750.00000  2800.00000  3.340468451919e-03
2800.00000  2850.00000  3.115651064604e-03
2850.00000  2900.00000  3.044496739999e-03
2900.00000  2950.00000  2.898403286290e-03
2950.00000  3000.00000  2.831790727085e-03
3000.00000  3050.00000  2.741712379980e-03
3050.00000  3100.00000  2.573667060169e-03
3100.00000  3150.00000  2.476019104062e-03
3150.00000  3200.00000  2.377614187056e-03
3200.00000  3250.00000  2.339766142053e-03
3250.00000  3300.00000  2.205784062744e-03
3300.00000  3350.00000  2.115705715639e-03
3350.00000  3400.00000  2.139928464440e-03
3400.00000  3450.00000  2.003675502431e-03
3450.00000  3500.00000  1.947660395828e-03
3500.00000  3550.00000  1.909055389925e-03
3550.00000  3600.00000  1.791726450417e-03
3600.00000  3650.00000  1.725113891213e-03
3650.00000  3700.00000  1.645632996708e-03
3700.00000  3750.00000  1.656230449308e-03
3750.00000  3800.00000  1.588103968304e-03
3800.00000  3850.00000  1.552526806002e-03
3850.00000  3900.00000  1.526033174500e-03
3900.00000  3950.00000  1.458663654396e-03
3950.00000  4000.00000  1.422329531193e-03
4000.00000  4050.00000  1.345876480288e-03
4050.00000  4100.00000  1.323167653287e-03
4100.00000  4150.00000  1.254284211382e-03
4150.00000  4200.00000  1.238388032481e-03
4200.00000  4250.00000  1.196755182978e-03
4250.00000  4300.00000  1.255798133182e-03
4300.00000  4350.00000  1.101378109572e-03
4350.00000  4400.00000  1.072613595370e-03
4400.00000  4450.00000  1.149823607175e-03
4450.00000  4500.00000  1.038550354868e-03
4500.00000  4550.00000  1.062016142770e-03
4550.00000  4600.00000  1.001459270766e-03
4600.00000  4650.00000  1.016598488767e-03
4650.00000  4700.00000  9.333327897611e-04
4700.00000  4750.00000  9.151657281599e-04
4750.00000  4800.00000  9.227353371604e-04
4800.00000  4850.00000  9.287910243608e-04
4850.00000  4900.00000  8.493101298556e-04
4900.00000  4950.00000  8.084342412530e-04
4950.00000  5000.00000  8.213025765538e-04
5000.00000  5050.00000  8.167608111535e-04
5050.00000  5100.00000  7.698292353504e-04
5100.00000  5150.00000  7.334951121480e-04
5150.00000  5200.00000  7.546900173494e-04
5200.00000  5250.00000  7.418216820486e-04
5250.00000  5300.00000  6.850496145449e-04
5300.00000  5350.00000  7.100293242465e-04
5350.00000  5400.00000  6.789939273445e-04
5400.00000  5450.00000  6.759660837443e-04
5450.00000  5500.00000  6.608268657433e-04
5500.00000  5550.00000  6.025408764395e-04
5550.00000  5600.00000  6.229788207408e-04
5600.00000  5650.00000  6.017839155394e-04
5650.00000  5700.00000  6.040547982396e-04
5700.00000  5750.00000  5.934573456389e-04
5750.00000  5800.00000  5.752902840377e-04
5800.00000  5850.00000  5.662067532371e-04
5850.00000  5900.00000  5.344143954350e-04
5900.00000  5950.00000  5.662067532371e-04
5950.00000  6000.00000  5.662067532371e-04
6000.00000  6050.00000  5.117055684335e-04
6050.00000  6100.00000  5.397131217354e-04
6100.00000  6150.00000  4.874828196319e-04
6150.00000  6200.00000  5.200321383341e-04
6200.00000  6250.00000  4.768853670312e-04
6250.00000  6300.00000  4.867258587319e-04
6300.00000  6350.00000  4.678018362306e-04
6350.00000  6400.00000  7.266824640476e-04
6400.00000  6450.00000  4.201132995275e-04
6450.00000  6500.00000  4.572043836299e-04
6500.00000  6550.00000  4.307107521282e-04
6550.00000  6600.00000  4.466069310293e-04
6600.00000  6650.00000  4.170854559273e-04
6650.00000  6700.00000  4.011892770263e-04
6700.00000  6750.00000  4.390373220288e-04
6750.00000  6800.00000  3.936196680258e-04
6800.00000  6850.00000  4.246550649278e-04
6850.00000  6900.00000  3.807513327249e-04
6900.00000  6950.00000  3.686399583241e-04
6950.00000  7000.00000  4.019462379263e-04
7000.00000  7050.00000  3.610703493237e-04
7050.00000  7100.00000  3.709108410243e-04
7100.00000  7150.00000  3.315488742217e-04
7150.00000  7200.00000  3.444172095226e-04
7200.00000  7250.00000  3.360906396220e-04
7250.00000  7300.00000  3.474450531228e-04
7300.00000  7350.00000  3.519868185231e-04
7350.00000  7400.00000  2.982425946195e-04
7400.00000  7450.00000  3.088400472202e-04
7450.00000  7500.00000  3.073261254201e-04
7500.00000  7550.00000  3.080830863202e-04
7550.00000  7600.00000  2.785616112182e-04
7600.00000  7650.00000  2.974856337195e-04
7650.00000  7700.00000  2.664502368175e-04
7700.00000  7750.00000  2.550958233167e-04
7750.00000  7800.00000  2.762907285181e-04
7800.00000  7850.00000  2.884021029189e-04
7850.00000  7900.00000  2.884021029189e-04
7900.00000  7950.00000  2.755337676180e-04
7950.00000  8000.00000  2.369287617155e-04
8000.00000  8050.00000  2.581236669169e-04
8050.00000  8100.00000  2.717489631178e-04
8100.00000  8150.00000  2.619084714172e-04
8150.00000  8200.00000  2.407135662158e-04
8200.00000  8250.00000  2.566097451168e-04
8250.00000  8300.00000  2.301161136151e-04
8300.00000  8350.00000  2.308730745151e-04
8350.00000  8400.00000  2.331439572153e-04
8400.00000  8450.00000  2.104351302138e-04
8450.00000  8500.00000  2.210325828145e-04
8500.00000  8550.00000  2.096781693137e-04
8550.00000  8600.00000  2.278452309149e-04
8600.00000  8650.00000  2.089212084137e-04
8650.00000  8700.00000  2.074072866136e-04
8700.00000  8750.00000  2.089212084137e-04
8750.00000  8800.00000  1.937819904127e-04
8800.00000  8850.00000  2.301161136151e-04
8850.00000  8900.00000  1.915111077125e-04
8900.00000  8950.00000  2.134629738140e-04
8950.00000  9000.00000  1.862123814122e-04
9000.00000  9050.00000  2.278452309149e-04
9050.00000  9100.00000  1.862123814122e-04
9100.00000  9150.00000  1.960528731128e-04
9150.00000  9200.00000  1.907541468125e-04
9200.00000  9250.00000  1.968098340129e-04
9250.00000  9300.00000  1.831845378120e-04
9300.00000  9350.00000  1.922680686126e-04
9350.00000  9400.00000  1.892402250124e-04
9400.00000  9450.00000  1.778858115117e-04
9450.00000  9500.00000  1.589617890104e-04
9500.00000  9550.00000  1.771288506116e-04
9550.00000  9600.00000  1.589617890104e-04
9600.00000  9650.00000  1.778858115117e-04
9650.00000  9700.00000  1.680453198110e-04
9700.00000  9750.00000  1.559339454102e-04
9750.00000  9800.00000  1.566909063103e-04
9800.00000  9850.00000  1.521491409100e-04
9850.00000  9900.00000  1.589617890104e-04
9900.00000  9950.00000  1.491212973098e-04
9950.00000  10000.00000  1.513921800099e-04
