300.00000  350.00000  1.159411043633e-06
350.00000  400.00000  4.444409000594e-06
400.00000  450.00000  3.864703478777e-06
450.00000  500.00000  2.512057261205e-06
500.00000  550.00000  4.270497344049e-05
550.00000  600.00000  1.932351739389e-06
600.00000  650.00000  1.004822904482e-05
650.00000  700.00000  2.898527609083e-06
700.00000  750.00000  8.695582827249e-06
750.00000  800.00000  5.410584870288e-06
800.00000  850.00000  2.589351330781e-05
850.00000  900.00000  5.410584870288e-06
900.00000  950.00000  2.898527609083e-06
950.00000  1000.00000  5.217349696349e-06
1000.00000  1050.00000  5.990290392105e-06
1050.00000  1100.00000  7.342936609677e-06
1100.00000  1150.00000  6.569995913921e-06
1150.00000  1200.00000  5.217349696349e-06
1200.00000  1250.00000  8.695582827249e-06
1250.00000  1300.00000  2.550704295993e-05
1300.00000  1350.00000  4.830879348471e-06
1350.00000  1400.00000  6.183525566043e-06
1400.00000  1450.00000  7.149701435738e-06
1450.00000  1500.00000  9.854993870882e-06
1500.00000  1550.00000  1.082116974058e-05
1550.00000  1600.00000  8.695582827249e-06
1600.00000  1650.00000  1.024146421876e-05
1650.00000  1700.00000  1.236705113209e-05
1700.00000  1750.00000  4.289820861443e-05
1750.00000  1800.00000  1.101440491451e-05
1800.00000  1850.00000  1.236705113209e-05
1850.00000  1900.00000  1.294675665390e-05
1900.00000  1950.00000  9.275288349065e-06
1950.00000  2000.00000  1.004822904482e-05
2000.00000  2050.00000  1.082116974058e-05
2050.00000  2100.00000  1.449263804541e-05
2100.00000  2150.00000  9.468523523004e-06
2150.00000  2200.00000  1.178734561027e-05
2200.00000  2250.00000  1.487910839329e-05
2250.00000  2300.00000  1.275352147996e-05
2300.00000  2350.00000  4.850202865865e-05
2350.00000  2400.00000  1.507234356723e-05
2400.00000  2450.00000  1.236705113209e-05
2450.00000  2500.00000  1.719793048056e-05
2500.00000  2550.00000  1.236705113209e-05
2550.00000  2600.00000  1.410616769754e-05
2600.00000  2650.00000  1.642498978480e-05
2650.00000  2700.00000  1.507234356723e-05
2700.00000  2750.00000  1.333322700178e-05
2750.00000  2800.00000  1.410616769754e-05
2800.00000  2850.00000  1.217381595815e-05
2850.00000  2900.00000  1.545881391511e-05
2900.00000  2950.00000  1.526557874117e-05
2950.00000  3000.00000  2.492733743811e-05
3000.00000  3050.00000  1.700469530662e-05
3050.00000  3100.00000  1.603851943693e-05
3100.00000  3150.00000  1.719793048056e-05
3150.00000  3200.00000  1.661822495874e-05
3200.00000  3250.00000  1.429940287148e-05
3250.00000  3300.00000  1.256028630603e-05
3300.00000  3350.00000  1.893704704601e-05
3350.00000  3400.00000  1.584528426299e-05
3400.00000  3450.00000  1.951675256782e-05
3450.00000  3500.00000  1.855057669813e-05
3500.00000  3550.00000  1.797087117631e-05
3550.00000  3600.00000  1.874381187207e-05
3600.00000  3650.00000  1.913028221995e-05
3650.00000  3700.00000  3.091762783022e-05
3700.00000  3750.00000  1.661822495874e-05
3750.00000  3800.00000  1.797087117631e-05
3800.00000  3850.00000  1.932351739389e-05
3850.00000  3900.00000  1.874381187207e-05
3900.00000  3950.00000  1.758440082844e-05
3950.00000  4000.00000  1.797087117631e-05
4000.00000  4050.00000  2.260851535085e-05
4050.00000  4100.00000  2.028969326358e-05
4100.00000  4150.00000  2.009645808964e-05
4150.00000  4200.00000  1.758440082844e-05
4200.00000  4250.00000  1.855057669813e-05
4250.00000  4300.00000  2.125586913327e-05
4300.00000  4350.00000  1.855057669813e-05
4350.00000  4400.00000  1.874381187207e-05
4400.00000  4450.00000  2.048292843752e-05
4450.00000  4500.00000  1.913028221995e-05
4500.00000  4550.00000  1.874381187207e-05
4550.00000  4600.00000  1.893704704601e-05
4600.00000  4650.00000  1.970998774176e-05
4650.00000  4700.00000  2.048292843752e-05
4700.00000  4750.00000  2.106263395934e-05
4750.00000  4800.00000  2.183557465509e-05
4800.00000  4850.00000  2.125586913327e-05
4850.00000  4900.00000  1.874381187207e-05
4900.00000  4950.00000  1.913028221995e-05
4950.00000  5000.00000  1.913028221995e-05
5000.00000  5050.00000  1.874381187207e-05
5050.00000  5100.00000  2.086939878540e-05
5100.00000  5150.00000  2.318822087266e-05
5150.00000  5200.00000  2.164233948115e-05
5200.00000  5250.00000  1.855057669813e-05
5250.00000  5300.00000  1.893704704601e-05
5300.00000  5350.00000  2.338145604660e-05
5350.00000  5400.00000  1.874381187207e-05
5400.00000  5450.00000  2.241528017691e-05
5450.00000  5500.00000  2.009645808964e-05
5500.00000  5550.00000  2.376792639448e-05
5550.00000  5600.00000  2.222204500297e-05
5600.00000  5650.00000  2.048292843752e-05
5650.00000  5700.00000  1.932351739389e-05
5700.00000  5750.00000  2.164233948115e-05
5750.00000  5800.00000  1.855057669813e-05
5800.00000  5850.00000  1.816410635025e-05
5850.00000  5900.00000  2.357469122054e-05
5900.00000  5950.00000  1.758440082844e-05
5950.00000  6000.00000  1.623175461086e-05
6000.00000  6050.00000  1.681146013268e-05
6050.00000  6100.00000  1.623175461086e-05
6100.00000  6150.00000  1.951675256782e-05
6150.00000  6200.00000  1.681146013268e-05
6200.00000  6250.00000  2.183557465509e-05
6250.00000  6300.00000  2.048292843752e-05
6300.00000  6350.00000  2.763262987326e-05
6350.00000  6400.00000  2.626066013829e-04
6400.00000  6450.00000  2.048292843752e-05
6450.00000  6500.00000  1.797087117631e-05
6500.00000  6550.00000  1.681146013268e-05
6550.00000  6600.00000  2.009645808964e-05
6600.00000  6650.00000  1.932351739389e-05
6650.00000  6700.00000  1.526557874117e-05
6700.00000  6750.00000  1.623175461086e-05
6750.00000  6800.00000  1.681146013268e-05
6800.00000  6850.00000  1.623175461086e-05
6850.00000  6900.00000  1.835734152419e-05
6900.00000  6950.00000  1.970998774176e-05
6950.00000  7000.00000  1.584528426299e-05
7000.00000  7050.00000  1.391293252360e-05
7050.00000  7100.00000  4.231850309261e-05
7100.00000  7150.00000  1.256028630603e-05
7150.00000  7200.00000  1.140087526239e-05
7200.00000  7250.00000  1.140087526239e-05
7250.00000  7300.00000  1.429940287148e-05
7300.00000  7350.00000  1.140087526239e-05
7350.00000  7400.00000  1.159411043633e-05
7400.00000  7450.00000  1.352646217572e-05
7450.00000  7500.00000  2.608674848175e-05
7500.00000  7550.00000  1.256028630603e-05
7550.00000  7600.00000  1.198058078421e-05
7600.00000  7650.00000  1.371969734966e-05
7650.00000  7700.00000  1.178734561027e-05
7700.00000  7750.00000  8.695582827249e-06
7750.00000  7800.00000  1.410616769754e-05
7800.00000  7850.00000  1.120764008845e-05
7850.00000  7900.00000  9.854993870882e-06
7900.00000  7950.00000  1.101440491451e-05
7950.00000  8000.00000  1.507234356723e-05
8000.00000  8050.00000  9.854993870882e-06
8050.00000  8100.00000  1.256028630603e-05
8100.00000  8150.00000  1.082116974058e-05
8150.00000  8200.00000  1.043469939270e-05
8200.00000  8250.00000  1.275352147996e-05
8250.00000  8300.00000  1.275352147996e-05
8300.00000  8350.00000  1.313999182784e-05
8350.00000  8400.00000  1.371969734966e-05
8400.00000  8450.00000  1.043469939270e-05
8450.00000  8500.00000  1.024146421876e-05
8500.00000  8550.00000  1.140087526239e-05
8550.00000  8600.00000  8.502347653310e-06
8600.00000  8650.00000  1.468587321935e-05
8650.00000  8700.00000  1.024146421876e-05
8700.00000  8750.00000  1.313999182784e-05
8750.00000  8800.00000  1.120764008845e-05
8800.00000  8850.00000  1.178734561027e-05
8850.00000  8900.00000  1.236705113209e-05
8900.00000  8950.00000  9.661758696943e-06
8950.00000  9000.00000  1.256028630603e-05
9000.00000  9050.00000  1.004822904482e-05
9050.00000  9100.00000  1.236705113209e-05
9100.00000  9150.00000  1.159411043633e-05
9150.00000  9200.00000  1.082116974058e-05
9200.00000  9250.00000  8.309112479371e-06
9250.00000  9300.00000  1.082116974058e-05
9300.00000  9350.00000  8.502347653310e-06
9350.00000  9400.00000  1.043469939270e-05
9400.00000  9450.00000  1.120764008845e-05
9450.00000  9500.00000  1.178734561027e-05
9500.00000  9550.00000  1.236705113209e-05
9550.00000  9600.00000  8.695582827249e-06
9600.00000  9650.00000  1.159411043633e-05
9650.00000  9700.00000  1.140087526239e-05
9700.00000  9750.00000  1.101440491451e-05
9750.00000  9800.00000  1.043469939270e-05
9800.00000  9850.00000  9.275288349065e-06
9850.00000  9900.00000  8.888818001187e-06
9900.00000  9950.00000  1.043469939270e-05
9950.00000  10000.00000  6.763231087860e-06
