300.00000  350.00000  5.749150719556e-07
350.00000  400.00000  1.724745215867e-06
400.00000  450.00000  5.749150719556e-07
450.00000  500.00000  1.724745215867e-06
500.00000  550.00000  1.954711244649e-05
550.00000  600.00000  1.149830143911e-06
600.00000  650.00000  7.282257578104e-06
650.00000  700.00000  1.341468501230e-06
700.00000  750.00000  4.599320575644e-06
750.00000  800.00000  2.299660287822e-06
800.00000  850.00000  1.628926037207e-05
850.00000  900.00000  3.257852074415e-06
900.00000  950.00000  3.449490431733e-06
950.00000  1000.00000  3.449490431733e-06
1000.00000  1050.00000  4.982597290282e-06
1050.00000  1100.00000  4.982597290282e-06
1100.00000  1150.00000  4.216043861007e-06
1150.00000  1200.00000  4.599320575644e-06
1200.00000  1250.00000  4.982597290282e-06
1250.00000  1300.00000  1.954711244649e-05
1300.00000  1350.00000  4.407682218326e-06
1350.00000  1400.00000  6.324065791511e-06
1400.00000  1450.00000  5.365874004919e-06
1450.00000  1500.00000  9.390279508608e-06
1500.00000  1550.00000  5.174235647600e-06
1550.00000  1600.00000  6.324065791511e-06
1600.00000  1650.00000  7.857172650059e-06
1650.00000  1700.00000  5.557512362237e-06
1700.00000  1750.00000  3.066213717096e-05
1750.00000  1800.00000  9.581917865926e-06
1800.00000  1850.00000  9.965194580563e-06
1850.00000  1900.00000  9.773556223245e-06
1900.00000  1950.00000  8.623726079333e-06
1950.00000  2000.00000  8.432087722015e-06
2000.00000  2050.00000  1.054010965252e-05
2050.00000  2100.00000  9.965194580563e-06
2100.00000  2150.00000  9.007002793970e-06
2150.00000  2200.00000  1.015683293788e-05
2200.00000  2250.00000  9.965194580563e-06
2250.00000  2300.00000  1.207321651107e-05
2300.00000  2350.00000  3.372835088806e-05
2350.00000  2400.00000  1.283976994034e-05
2400.00000  2450.00000  1.073174800984e-05
2450.00000  2500.00000  1.245649322570e-05
2500.00000  2550.00000  1.264813158302e-05
2550.00000  2600.00000  1.034847129520e-05
2600.00000  2650.00000  1.207321651107e-05
2650.00000  2700.00000  1.111502472447e-05
2700.00000  2750.00000  9.198641151289e-06
2750.00000  2800.00000  1.207321651107e-05
2800.00000  2850.00000  1.015683293788e-05
2850.00000  2900.00000  1.111502472447e-05
2900.00000  2950.00000  1.130666308179e-05
2950.00000  3000.00000  1.839728230258e-05
3000.00000  3050.00000  1.379796172693e-05
3050.00000  3100.00000  1.149830143911e-05
3100.00000  3150.00000  1.168993979643e-05
3150.00000  3200.00000  1.456451515621e-05
3200.00000  3250.00000  9.198641151289e-06
3250.00000  3300.00000  1.245649322570e-05
3300.00000  3350.00000  9.773556223245e-06
3350.00000  3400.00000  8.623726079333e-06
3400.00000  3450.00000  1.322304665498e-05
3450.00000  3500.00000  1.226485486839e-05
3500.00000  3550.00000  8.623726079333e-06
3550.00000  3600.00000  1.130666308179e-05
3600.00000  3650.00000  1.054010965252e-05
3650.00000  3700.00000  2.031366587576e-05
3700.00000  3750.00000  9.390279508608e-06
3750.00000  3800.00000  1.418123844157e-05
3800.00000  3850.00000  1.073174800984e-05
3850.00000  3900.00000  1.168993979643e-05
3900.00000  3950.00000  1.034847129520e-05
3950.00000  4000.00000  8.623726079333e-06
4000.00000  4050.00000  1.322304665498e-05
4050.00000  4100.00000  1.149830143911e-05
4100.00000  4150.00000  1.130666308179e-05
4150.00000  4200.00000  1.034847129520e-05
4200.00000  4250.00000  9.390279508608e-06
4250.00000  4300.00000  7.857172650059e-06
4300.00000  4350.00000  9.581917865926e-06
4350.00000  4400.00000  8.623726079333e-06
4400.00000  4450.00000  1.092338636716e-05
4450.00000  4500.00000  9.965194580563e-06
4500.00000  4550.00000  1.283976994034e-05
4550.00000  4600.00000  9.390279508608e-06
4600.00000  4650.00000  7.090619220785e-06
4650.00000  4700.00000  9.390279508608e-06
4700.00000  4750.00000  9.773556223245e-06
4750.00000  4800.00000  1.092338636716e-05
4800.00000  4850.00000  9.390279508608e-06
4850.00000  4900.00000  8.240449364696e-06
4900.00000  4950.00000  9.007002793970e-06
4950.00000  5000.00000  9.390279508608e-06
5000.00000  5050.00000  1.111502472447e-05
5050.00000  5100.00000  1.283976994034e-05
5100.00000  5150.00000  1.054010965252e-05
5150.00000  5200.00000  1.092338636716e-05
5200.00000  5250.00000  1.283976994034e-05
5250.00000  5300.00000  9.581917865926e-06
5300.00000  5350.00000  1.092338636716e-05
5350.00000  5400.00000  1.149830143911e-05
5400.00000  5450.00000  1.264813158302e-05
5450.00000  5500.00000  9.965194580563e-06
5500.00000  5550.00000  1.149830143911e-05
5550.00000  5600.00000  9.965194580563e-06
5600.00000  5650.00000  1.188157815375e-05
5650.00000  5700.00000  1.130666308179e-05
5700.00000  5750.00000  1.149830143911e-05
5750.00000  5800.00000  1.188157815375e-05
5800.00000  5850.00000  1.456451515621e-05
5850.00000  5900.00000  1.341468501230e-05
5900.00000  5950.00000  1.322304665498e-05
5950.00000  6000.00000  1.130666308179e-05
6000.00000  6050.00000  1.188157815375e-05
6050.00000  6100.00000  1.226485486839e-05
6100.00000  6150.00000  1.878055901722e-05
6150.00000  6200.00000  2.280496452090e-05
6200.00000  6250.00000  3.602801117588e-05
6250.00000  6300.00000  5.653331540896e-05
6300.00000  6350.00000  6.419884970170e-05
6350.00000  6400.00000  4.691306987157e-04
6400.00000  6450.00000  1.149830143911e-05
6450.00000  6500.00000  1.398960008425e-05
6500.00000  6550.00000  1.360632336961e-05
6550.00000  6600.00000  1.322304665498e-05
6600.00000  6650.00000  1.533106858548e-05
6650.00000  6700.00000  1.418123844157e-05
6700.00000  6750.00000  1.609762201476e-05
6750.00000  6800.00000  1.437287679889e-05
6800.00000  6850.00000  1.801400558794e-05
6850.00000  6900.00000  2.165513437699e-05
6900.00000  6950.00000  1.897219737453e-05
6950.00000  7000.00000  2.203841109163e-05
7000.00000  7050.00000  1.743909051599e-05
7050.00000  7100.00000  6.343229627243e-05
7100.00000  7150.00000  5.557512362237e-06
7150.00000  7200.00000  6.324065791511e-06
7200.00000  7250.00000  8.815364436652e-06
7250.00000  7300.00000  6.707342506148e-06
7300.00000  7350.00000  6.324065791511e-06
7350.00000  7400.00000  7.473895935422e-06
7400.00000  7450.00000  7.473895935422e-06
7450.00000  7500.00000  2.682937002459e-05
7500.00000  7550.00000  7.473895935422e-06
7550.00000  7600.00000  7.090619220785e-06
7600.00000  7650.00000  7.090619220785e-06
7650.00000  7700.00000  8.623726079333e-06
7700.00000  7750.00000  6.707342506148e-06
7750.00000  7800.00000  7.090619220785e-06
7800.00000  7850.00000  7.665534292741e-06
7850.00000  7900.00000  7.665534292741e-06
7900.00000  7950.00000  8.623726079333e-06
7950.00000  8000.00000  6.898980863467e-06
8000.00000  8050.00000  6.898980863467e-06
8050.00000  8100.00000  1.130666308179e-05
8100.00000  8150.00000  7.857172650059e-06
8150.00000  8200.00000  1.073174800984e-05
8200.00000  8250.00000  1.015683293788e-05
8250.00000  8300.00000  1.418123844157e-05
8300.00000  8350.00000  7.857172650059e-06
8350.00000  8400.00000  6.132427434193e-06
8400.00000  8450.00000  1.015683293788e-05
8450.00000  8500.00000  9.581917865926e-06
8500.00000  8550.00000  7.665534292741e-06
8550.00000  8600.00000  7.282257578104e-06
8600.00000  8650.00000  8.623726079333e-06
8650.00000  8700.00000  9.007002793970e-06
8700.00000  8750.00000  6.707342506148e-06
8750.00000  8800.00000  8.432087722015e-06
8800.00000  8850.00000  9.198641151289e-06
8850.00000  8900.00000  9.581917865926e-06
8900.00000  8950.00000  7.857172650059e-06
8950.00000  9000.00000  9.581917865926e-06
9000.00000  9050.00000  9.581917865926e-06
9050.00000  9100.00000  9.198641151289e-06
9100.00000  9150.00000  7.857172650059e-06
9150.00000  9200.00000  1.073174800984e-05
9200.00000  9250.00000  8.815364436652e-06
9250.00000  9300.00000  9.581917865926e-06
9300.00000  9350.00000  1.092338636716e-05
9350.00000  9400.00000  1.111502472447e-05
9400.00000  9450.00000  9.581917865926e-06
9450.00000  9500.00000  1.226485486839e-05
9500.00000  9550.00000  1.111502472447e-05
9550.00000  9600.00000  1.418123844157e-05
9600.00000  9650.00000  1.149830143911e-05
9650.00000  9700.00000  1.226485486839e-05
9700.00000  9750.00000  1.130666308179e-05
9750.00000  9800.00000  1.092338636716e-05
9800.00000  9850.00000  1.188157815375e-05
9850.00000  9900.00000  1.533106858548e-05
9900.00000  9950.00000  1.283976994034e-05
9950.00000  10000.00000  1.513943022816e-05
