300.00000  350.00000  3.093055971813e-04
350.00000  400.00000  3.024993615465e-04
400.00000  450.00000  1.943558397936e-04
450.00000  500.00000  1.467121903501e-04
500.00000  550.00000  6.783548182680e-04
550.00000  600.00000  7.940608240596e-05
600.00000  650.00000  1.996495786207e-04
650.00000  700.00000  9.377480207941e-05
700.00000  750.00000  1.293184770611e-04
750.00000  800.00000  9.150605686782e-05
800.00000  850.00000  2.752744190073e-04
850.00000  900.00000  8.621231804075e-05
900.00000  950.00000  7.108734996343e-05
950.00000  1000.00000  7.486859198276e-05
1000.00000  1050.00000  7.259984677116e-05
1050.00000  1100.00000  8.696856644462e-05
1100.00000  1150.00000  8.394357282915e-05
1150.00000  1200.00000  8.243107602142e-05
1200.00000  1250.00000  8.621231804075e-05
1250.00000  1300.00000  1.686433940622e-04
1300.00000  1350.00000  9.301855367555e-05
1350.00000  1400.00000  6.503736273250e-05
1400.00000  1450.00000  6.579361113636e-05
1450.00000  1500.00000  8.696856644462e-05
1500.00000  1550.00000  5.898737550157e-05
1550.00000  1600.00000  7.184359836729e-05
1600.00000  1650.00000  6.957485315569e-05
1650.00000  1700.00000  7.335609517503e-05
1700.00000  1750.00000  2.087245594671e-04
1750.00000  1800.00000  8.016233080982e-05
1800.00000  1850.00000  8.999356006008e-05
1850.00000  1900.00000  8.091857921369e-05
1900.00000  1950.00000  8.318732442529e-05
1950.00000  2000.00000  8.469982123302e-05
2000.00000  2050.00000  8.469982123302e-05
2050.00000  2100.00000  8.545606963689e-05
2100.00000  2150.00000  7.411234357889e-05
2150.00000  2200.00000  8.999356006008e-05
2200.00000  2250.00000  8.545606963689e-05
2250.00000  2300.00000  1.013372861181e-04
2300.00000  2350.00000  2.336807567947e-04
2350.00000  2400.00000  9.453105048328e-05
2400.00000  2450.00000  9.982478931034e-05
2450.00000  2500.00000  9.453105048328e-05
2500.00000  2550.00000  8.848106325235e-05
2550.00000  2600.00000  7.033110155956e-05
2600.00000  2650.00000  8.016233080982e-05
2650.00000  2700.00000  7.411234357889e-05
2700.00000  2750.00000  8.318732442529e-05
2750.00000  2800.00000  7.638108879049e-05
2800.00000  2850.00000  8.091857921369e-05
2850.00000  2900.00000  8.545606963689e-05
2900.00000  2950.00000  8.923731165622e-05
2950.00000  3000.00000  9.831229250261e-05
3000.00000  3050.00000  6.881860475183e-05
3050.00000  3100.00000  6.049987230930e-05
3100.00000  3150.00000  6.201236911703e-05
3150.00000  3200.00000  8.091857921369e-05
3200.00000  3250.00000  7.411234357889e-05
3250.00000  3300.00000  5.369363667450e-05
3300.00000  3350.00000  7.259984677116e-05
3350.00000  3400.00000  5.369363667450e-05
3400.00000  3450.00000  7.335609517503e-05
3450.00000  3500.00000  7.789358559822e-05
3500.00000  3550.00000  5.596238188610e-05
3550.00000  3600.00000  6.352486592476e-05
3600.00000  3650.00000  4.688740103971e-05
3650.00000  3700.00000  6.654985954023e-05
3700.00000  3750.00000  4.159366221264e-05
3750.00000  3800.00000  6.881860475183e-05
3800.00000  3850.00000  5.596238188610e-05
3850.00000  3900.00000  5.218113986677e-05
3900.00000  3950.00000  4.991239465517e-05
3950.00000  4000.00000  3.781242019331e-05
4000.00000  4050.00000  5.142489146290e-05
4050.00000  4100.00000  4.839989784744e-05
4100.00000  4150.00000  5.671863028997e-05
4150.00000  4200.00000  5.066864305904e-05
4200.00000  4250.00000  4.386240742424e-05
4250.00000  4300.00000  5.142489146290e-05
4300.00000  4350.00000  4.764364944357e-05
4350.00000  4400.00000  4.839989784744e-05
4400.00000  4450.00000  3.100618455852e-05
4450.00000  4500.00000  3.629992338558e-05
4500.00000  4550.00000  3.478742657785e-05
4550.00000  4600.00000  3.403117817398e-05
4600.00000  4650.00000  4.159366221264e-05
4650.00000  4700.00000  4.386240742424e-05
4700.00000  4750.00000  4.386240742424e-05
4750.00000  4800.00000  2.646869413532e-05
4800.00000  4850.00000  3.327492977011e-05
4850.00000  4900.00000  3.251868136625e-05
4900.00000  4950.00000  4.008116540491e-05
4950.00000  5000.00000  3.856866859718e-05
5000.00000  5050.00000  3.932491700104e-05
5050.00000  5100.00000  3.856866859718e-05
5100.00000  5150.00000  2.722494253918e-05
5150.00000  5200.00000  2.798119094305e-05
5200.00000  5250.00000  2.571244573145e-05
5250.00000  5300.00000  2.344370051985e-05
5300.00000  5350.00000  3.251868136625e-05
5350.00000  5400.00000  2.798119094305e-05
5400.00000  5450.00000  2.419994892372e-05
5450.00000  5500.00000  2.344370051985e-05
5500.00000  5550.00000  2.722494253918e-05
5550.00000  5600.00000  2.117495530825e-05
5600.00000  5650.00000  2.117495530825e-05
5650.00000  5700.00000  2.117495530825e-05
5700.00000  5750.00000  2.117495530825e-05
5750.00000  5800.00000  1.966245850052e-05
5800.00000  5850.00000  2.344370051985e-05
5850.00000  5900.00000  2.041870690439e-05
5900.00000  5950.00000  1.966245850052e-05
5950.00000  6000.00000  2.117495530825e-05
6000.00000  6050.00000  1.739371328892e-05
6050.00000  6100.00000  2.344370051985e-05
6100.00000  6150.00000  2.722494253918e-05
6150.00000  6200.00000  2.798119094305e-05
6200.00000  6250.00000  1.663746488506e-05
6250.00000  6300.00000  2.268745211599e-05
6300.00000  6350.00000  2.495619732759e-05
6350.00000  6400.00000  1.822558653318e-04
6400.00000  6450.00000  9.831229250261e-06
6450.00000  6500.00000  1.966245850052e-05
6500.00000  6550.00000  1.588121648119e-05
6550.00000  6600.00000  1.285622286573e-05
6600.00000  6650.00000  1.134372605799e-05
6650.00000  6700.00000  1.512496807732e-05
6700.00000  6750.00000  1.361247126959e-05
6750.00000  6800.00000  1.512496807732e-05
6800.00000  6850.00000  1.814996169279e-05
6850.00000  6900.00000  1.663746488506e-05
6900.00000  6950.00000  1.361247126959e-05
6950.00000  7000.00000  1.436871967346e-05
7000.00000  7050.00000  1.512496807732e-05
7050.00000  7100.00000  3.100618455852e-05
7100.00000  7150.00000  1.814996169279e-05
7150.00000  7200.00000  1.663746488506e-05
7200.00000  7250.00000  1.209997446186e-05
7250.00000  7300.00000  1.512496807732e-05
7300.00000  7350.00000  1.436871967346e-05
7350.00000  7400.00000  1.209997446186e-05
7400.00000  7450.00000  9.074980846395e-06
7450.00000  7500.00000  1.966245850052e-05
7500.00000  7550.00000  1.361247126959e-05
7550.00000  7600.00000  9.831229250261e-06
7600.00000  7650.00000  1.058747765413e-05
7650.00000  7700.00000  9.074980846395e-06
7700.00000  7750.00000  9.831229250261e-06
7750.00000  7800.00000  7.562484038662e-06
7800.00000  7850.00000  1.361247126959e-05
7850.00000  7900.00000  1.058747765413e-05
7900.00000  7950.00000  1.361247126959e-05
7950.00000  8000.00000  6.806235634796e-06
8000.00000  8050.00000  1.361247126959e-05
8050.00000  8100.00000  6.806235634796e-06
8100.00000  8150.00000  1.285622286573e-05
8150.00000  8200.00000  1.209997446186e-05
8200.00000  8250.00000  1.285622286573e-05
8250.00000  8300.00000  1.134372605799e-05
8300.00000  8350.00000  9.831229250261e-06
8350.00000  8400.00000  9.831229250261e-06
8400.00000  8450.00000  6.806235634796e-06
8450.00000  8500.00000  6.806235634796e-06
8500.00000  8550.00000  5.293738827064e-06
8550.00000  8600.00000  1.058747765413e-05
8600.00000  8650.00000  7.562484038662e-06
8650.00000  8700.00000  8.318732442529e-06
8700.00000  8750.00000  6.806235634796e-06
8750.00000  8800.00000  1.134372605799e-05
8800.00000  8850.00000  5.293738827064e-06
8850.00000  8900.00000  4.537490423197e-06
8900.00000  8950.00000  7.562484038662e-06
8950.00000  9000.00000  9.074980846395e-06
9000.00000  9050.00000  1.134372605799e-05
9050.00000  9100.00000  1.058747765413e-05
9100.00000  9150.00000  8.318732442529e-06
9150.00000  9200.00000  6.049987230930e-06
9200.00000  9250.00000  9.074980846395e-06
9250.00000  9300.00000  7.562484038662e-06
9300.00000  9350.00000  7.562484038662e-06
9350.00000  9400.00000  1.134372605799e-05
9400.00000  9450.00000  6.049987230930e-06
9450.00000  9500.00000  6.806235634796e-06
9500.00000  9550.00000  1.209997446186e-05
9550.00000  9600.00000  7.562484038662e-06
9600.00000  9650.00000  8.318732442529e-06
9650.00000  9700.00000  6.806235634796e-06
9700.00000  9750.00000  8.318732442529e-06
9750.00000  9800.00000  8.318732442529e-06
9800.00000  9850.00000  5.293738827064e-06
9850.00000  9900.00000  3.781242019331e-06
9900.00000  9950.00000  7.562484038662e-06
9950.00000  10000.00000  3.781242019331e-06
