10001.00000  11001.00000  9.360671375787e-04
11001.00000  12001.00000  7.967044752982e-04
12001.00000  13001.00000  6.940765671861e-04
13001.00000  14001.00000  6.048607180459e-04
14001.00000  15001.00000  5.248813806358e-04
15001.00000  16001.00000  4.666450735619e-04
16001.00000  17001.00000  4.123931440972e-04
17001.00000  18001.00000  3.619243610491e-04
18001.00000  19001.00000  3.250990528442e-04
19001.00000  20001.00000  2.922581222483e-04
20001.00000  21001.00000  2.651019728371e-04
21001.00000  22001.00000  2.399480737900e-04
22001.00000  23001.00000  2.182553512518e-04
23001.00000  24001.00000  1.984642634815e-04
24001.00000  25001.00000  1.795485313981e-04
25001.00000  26001.00000  1.656837022434e-04
26001.00000  27001.00000  1.524326282253e-04
27001.00000  28001.00000  1.386985993456e-04
28001.00000  29001.00000  1.286672244057e-04
29001.00000  30001.00000  1.183138795579e-04
30001.00000  31001.00000  1.105061092937e-04
31001.00000  32001.00000  1.041673267338e-04
32001.00000  33001.00000  9.450822949972e-05
33001.00000  34001.00000  8.735446061072e-05
34001.00000  35001.00000  8.133764795866e-05
35001.00000  36001.00000  7.593459044335e-05
36001.00000  37001.00000  7.104467246859e-05
37001.00000  38001.00000  6.521902944929e-05
38001.00000  39001.00000  6.139563679413e-05
39001.00000  40001.00000  5.698867368108e-05
40001.00000  41001.00000  5.465439184951e-05
41001.00000  42001.00000  5.108253818482e-05
42001.00000  43001.00000  4.837597864736e-05
43001.00000  44001.00000  4.509591021162e-05
44001.00000  45001.00000  4.125239443722e-05
45001.00000  46001.00000  3.885774324794e-05
46001.00000  47001.00000  3.898854352299e-05
47001.00000  48001.00000  3.535632050059e-05
48001.00000  49001.00000  3.222717545913e-05
49001.00000  50001.00000  3.114052702029e-05
50001.00000  51001.00000  3.008406326032e-05
51001.00000  52001.00000  2.739762684209e-05
52001.00000  53001.00000  2.541549959718e-05
53001.00000  54001.00000  2.505328345090e-05
54001.00000  55001.00000  2.412761996597e-05
55001.00000  56001.00000  2.332269519646e-05
56001.00000  57001.00000  2.117958299765e-05
57001.00000  58001.00000  2.032435043005e-05
58001.00000  59001.00000  1.954961033940e-05
59001.00000  60001.00000  1.791963768114e-05
60001.00000  61001.00000  1.669212740765e-05
61001.00000  62001.00000  1.638021905946e-05
62001.00000  63001.00000  1.501184695130e-05
63001.00000  64001.00000  1.508227786863e-05
64001.00000  65001.00000  1.435784557608e-05
65001.00000  66001.00000  1.346236677000e-05
66001.00000  67001.00000  1.264738044088e-05
67001.00000  68001.00000  1.197325594641e-05
68001.00000  69001.00000  1.175190163480e-05
69001.00000  70001.00000  1.108783869996e-05
70001.00000  71001.00000  1.021248301312e-05
71001.00000  72001.00000  9.618850995606e-06
72001.00000  73001.00000  9.457866041705e-06
73001.00000  74001.00000  9.528296959037e-06
74001.00000  75001.00000  9.296881087803e-06
75001.00000  76001.00000  9.075526776189e-06
76001.00000  77001.00000  7.495861916032e-06
77001.00000  78001.00000  7.556231273745e-06
78001.00000  79001.00000  7.274507604418e-06
79001.00000  80001.00000  6.982722375471e-06
80001.00000  81001.00000  6.519890633005e-06
81001.00000  82001.00000  5.956443294350e-06
82001.00000  83001.00000  5.755212101974e-06
83001.00000  84001.00000  5.916197055875e-06
84001.00000  85001.00000  5.392995955695e-06
85001.00000  86001.00000  5.211887882556e-06
86001.00000  87001.00000  4.879856415135e-06
87001.00000  88001.00000  4.708809901615e-06
88001.00000  89001.00000  4.457270911144e-06
89001.00000  90001.00000  4.225855039911e-06
90001.00000  91001.00000  4.366716874574e-06
91001.00000  92001.00000  4.225855039911e-06
92001.00000  93001.00000  3.833454214776e-06
93001.00000  94001.00000  3.712715499350e-06
94001.00000  95001.00000  3.551730545449e-06
95001.00000  96001.00000  3.783146416682e-06
96001.00000  97001.00000  3.219699078027e-06
97001.00000  98001.00000  3.410868710785e-06
98001.00000  99001.00000  2.958098527937e-06
99001.00000  100001.00000  2.948036968319e-06
100001.00000  101001.00000  2.686436418229e-06
101001.00000  102001.00000  2.897729170224e-06
102001.00000  103001.00000  2.314158712332e-06
103001.00000  104001.00000  2.545574583565e-06
104001.00000  105001.00000  2.465082106615e-06
105001.00000  106001.00000  2.324220271951e-06
106001.00000  107001.00000  1.982127244910e-06
107001.00000  108001.00000  2.233666235381e-06
108001.00000  109001.00000  2.163235318050e-06
109001.00000  110001.00000  1.760772933296e-06
110001.00000  111001.00000  1.680280456345e-06
111001.00000  112001.00000  1.881511648722e-06
112001.00000  113001.00000  1.881511648722e-06
113001.00000  114001.00000  1.569603300538e-06
114001.00000  115001.00000  1.539418621682e-06
115001.00000  116001.00000  1.559541740919e-06
116001.00000  117001.00000  1.609849539014e-06
117001.00000  118001.00000  1.378433667780e-06
118001.00000  119001.00000  1.328125869686e-06
119001.00000  120001.00000  1.408618346637e-06
120001.00000  121001.00000  1.207387154260e-06
121001.00000  122001.00000  1.328125869686e-06
122001.00000  123001.00000  1.046402200359e-06
123001.00000  124001.00000  1.056463759978e-06
124001.00000  125001.00000  1.328125869686e-06
125001.00000  126001.00000  1.096709998453e-06
126001.00000  127001.00000  1.006155961883e-06
127001.00000  128001.00000  9.055403656951e-07
128001.00000  129001.00000  9.659097234081e-07
129001.00000  130001.00000  9.558481637893e-07
130001.00000  131001.00000  9.759712830270e-07
131001.00000  132001.00000  6.338782559866e-07
132001.00000  133001.00000  7.848016502691e-07
133001.00000  134001.00000  7.546169714126e-07
134001.00000  135001.00000  7.848016502691e-07
135001.00000  136001.00000  6.942476136996e-07
136001.00000  137001.00000  7.043091733184e-07
137001.00000  138001.00000  6.439398156054e-07
138001.00000  139001.00000  5.735088982736e-07
139001.00000  140001.00000  5.634473386548e-07
140001.00000  141001.00000  5.835704578924e-07
141001.00000  142001.00000  6.841860540808e-07
142001.00000  143001.00000  5.030779809417e-07
143001.00000  144001.00000  4.930164213229e-07
144001.00000  145001.00000  4.225855039911e-07
145001.00000  146001.00000  5.332626597982e-07
146001.00000  147001.00000  4.930164213229e-07
147001.00000  148001.00000  5.332626597982e-07
148001.00000  149001.00000  4.829548617041e-07
149001.00000  150001.00000  4.326470636099e-07
150001.00000  151001.00000  5.232011001794e-07
151001.00000  152001.00000  5.332626597982e-07
152001.00000  153001.00000  3.018467885650e-07
153001.00000  154001.00000  3.119083481839e-07
154001.00000  155001.00000  3.722777058969e-07
155001.00000  156001.00000  3.219699078027e-07
156001.00000  157001.00000  3.521545866592e-07
157001.00000  158001.00000  3.521545866592e-07
158001.00000  159001.00000  3.219699078027e-07
159001.00000  160001.00000  3.420930270404e-07
160001.00000  161001.00000  3.320314674216e-07
161001.00000  162001.00000  2.616005500897e-07
162001.00000  163001.00000  2.917852289462e-07
163001.00000  164001.00000  3.521545866592e-07
164001.00000  165001.00000  2.414774308520e-07
165001.00000  166001.00000  3.018467885650e-07
166001.00000  167001.00000  2.012311923767e-07
167001.00000  168001.00000  2.414774308520e-07
168001.00000  169001.00000  2.515389904709e-07
169001.00000  170001.00000  2.314158712332e-07
170001.00000  171001.00000  2.012311923767e-07
171001.00000  172001.00000  1.811080731390e-07
172001.00000  173001.00000  1.609849539014e-07
173001.00000  174001.00000  1.710465135202e-07
174001.00000  175001.00000  1.308002750449e-07
175001.00000  176001.00000  1.710465135202e-07
176001.00000  177001.00000  1.106771558072e-07
177001.00000  178001.00000  2.213543116144e-07
178001.00000  179001.00000  1.408618346637e-07
179001.00000  180001.00000  1.609849539014e-07
180001.00000  181001.00000  1.408618346637e-07
181001.00000  182001.00000  1.509233942825e-07
182001.00000  183001.00000  1.308002750449e-07
183001.00000  184001.00000  1.207387154260e-07
184001.00000  185001.00000  1.811080731390e-07
185001.00000  186001.00000  2.012311923767e-07
186001.00000  187001.00000  1.609849539014e-07
187001.00000  188001.00000  1.509233942825e-07
188001.00000  189001.00000  1.207387154260e-07
189001.00000  190001.00000  9.055403656951e-08
190001.00000  191001.00000  9.055403656951e-08
191001.00000  192001.00000  1.408618346637e-07
192001.00000  193001.00000  7.043091733184e-08
193001.00000  194001.00000  8.049247695068e-08
194001.00000  195001.00000  1.207387154260e-07
195001.00000  196001.00000  1.106771558072e-07
196001.00000  197001.00000  8.049247695068e-08
197001.00000  198001.00000  8.049247695068e-08
198001.00000  199001.00000  7.043091733184e-08
