300.00000  350.00000  7.830918165805e-06
350.00000  400.00000  1.204756640893e-05
400.00000  450.00000  6.826954298394e-06
450.00000  500.00000  7.830918165805e-06
500.00000  550.00000  6.826954298394e-05
550.00000  600.00000  6.826954298394e-06
600.00000  650.00000  2.409513281786e-05
650.00000  700.00000  8.433296486251e-06
700.00000  750.00000  1.967769180125e-05
750.00000  800.00000  1.084280976804e-05
800.00000  850.00000  7.128143458617e-05
850.00000  900.00000  2.730781719357e-05
900.00000  950.00000  3.393397871849e-05
950.00000  1000.00000  5.300929219929e-05
1000.00000  1050.00000  9.075833361394e-05
1050.00000  1100.00000  1.594294621448e-04
1100.00000  1150.00000  2.475774897035e-04
1150.00000  1200.00000  3.809038912957e-04
1200.00000  1250.00000  5.059977891751e-04
1250.00000  1300.00000  7.437364329780e-04
1300.00000  1350.00000  7.481538739946e-04
1350.00000  1400.00000  9.698290959189e-04
1400.00000  1450.00000  1.167208392252e-03
1450.00000  1500.00000  1.399124045624e-03
1500.00000  1550.00000  1.594093828675e-03
1550.00000  1600.00000  1.787858855085e-03
1600.00000  1650.00000  1.969977900634e-03
1650.00000  1700.00000  2.190849951464e-03
1700.00000  1750.00000  2.526575468726e-03
1750.00000  1800.00000  2.551473772638e-03
1800.00000  1850.00000  2.673555778915e-03
1850.00000  1900.00000  2.581592688660e-03
1900.00000  1950.00000  2.749455447291e-03
1950.00000  2000.00000  2.924948331315e-03
2000.00000  2050.00000  2.993217874299e-03
2050.00000  2100.00000  3.076346082520e-03
2100.00000  2150.00000  3.148832273747e-03
2150.00000  2200.00000  3.211881204621e-03
2200.00000  2250.00000  3.258264335295e-03
2250.00000  2300.00000  3.320710887848e-03
2300.00000  2350.00000  3.495601393551e-03
2350.00000  2400.00000  3.367897189616e-03
2400.00000  2450.00000  3.423315995097e-03
2450.00000  2500.00000  3.369905117351e-03
2500.00000  2550.00000  3.316293446831e-03
2550.00000  2600.00000  3.245413597792e-03
2600.00000  2650.00000  3.238787436267e-03
2650.00000  2700.00000  3.263886532953e-03
2700.00000  2750.00000  3.232964445836e-03
2750.00000  2800.00000  3.264890496820e-03
2800.00000  2850.00000  3.198829674344e-03
2850.00000  2900.00000  3.235976337439e-03
2900.00000  2950.00000  3.164494110079e-03
2950.00000  3000.00000  3.171923442698e-03
3000.00000  3050.00000  3.121122871007e-03
3050.00000  3100.00000  3.073133398145e-03
3100.00000  3150.00000  3.101445179206e-03
3150.00000  3200.00000  2.976351281326e-03
3200.00000  3250.00000  2.950850599094e-03
3250.00000  3300.00000  2.922338025259e-03
3300.00000  3350.00000  2.851658968994e-03
3350.00000  3400.00000  2.847442320751e-03
3400.00000  3450.00000  2.791621929723e-03
3450.00000  3500.00000  2.783188633236e-03
3500.00000  3550.00000  2.752266546120e-03
3550.00000  3600.00000  2.703273109390e-03
3600.00000  3650.00000  2.674358950009e-03
3650.00000  3700.00000  2.668736752352e-03
3700.00000  3750.00000  2.618337766207e-03
3750.00000  3800.00000  2.549265052130e-03
3800.00000  3850.00000  2.491838318914e-03
3850.00000  3900.00000  2.496858138251e-03
3900.00000  3950.00000  2.422163226515e-03
3950.00000  4000.00000  2.416942614405e-03
4000.00000  4050.00000  2.389434004438e-03
4050.00000  4100.00000  2.276588465741e-03
4100.00000  4150.00000  2.277592429608e-03
4150.00000  4200.00000  2.291848716525e-03
4200.00000  4250.00000  2.216953012017e-03
4250.00000  4300.00000  2.194062635840e-03
4300.00000  4350.00000  2.155711216105e-03
4350.00000  4400.00000  2.151896153408e-03
4400.00000  4450.00000  2.096477347927e-03
4450.00000  4500.00000  2.075795692259e-03
4500.00000  4550.00000  2.019573715684e-03
4550.00000  4600.00000  2.007927734822e-03
4600.00000  4650.00000  1.974997719971e-03
4650.00000  4700.00000  1.928413796523e-03
4700.00000  4750.00000  1.898696466047e-03
4750.00000  4800.00000  1.875002918776e-03
4800.00000  4850.00000  1.879420359793e-03
4850.00000  4900.00000  1.826009482047e-03
4900.00000  4950.00000  1.837253877362e-03
4950.00000  5000.00000  1.792075503328e-03
5000.00000  5050.00000  1.761755794533e-03
5050.00000  5100.00000  1.752720119726e-03
5100.00000  5150.00000  1.699710827527e-03
5150.00000  5200.00000  1.679430757405e-03
5200.00000  5250.00000  1.673808559747e-03
5250.00000  5300.00000  1.631240491769e-03
5300.00000  5350.00000  1.649311841383e-03
5350.00000  5400.00000  1.596904927504e-03
5400.00000  5450.00000  1.587869252697e-03
5450.00000  5500.00000  1.528434591746e-03
5500.00000  5550.00000  1.546907526907e-03
5550.00000  5600.00000  1.521206051901e-03
5600.00000  5650.00000  1.473818957359e-03
5650.00000  5700.00000  1.485264145448e-03
5700.00000  5750.00000  1.417797773558e-03
5750.00000  5800.00000  1.427837412232e-03
5800.00000  5850.00000  1.412577161447e-03
5850.00000  5900.00000  1.396714532342e-03
5900.00000  5950.00000  1.383663002066e-03
5950.00000  6000.00000  1.360170247568e-03
6000.00000  6050.00000  1.347520302839e-03
6050.00000  6100.00000  1.326637854397e-03
6100.00000  6150.00000  1.285475335833e-03
6150.00000  6200.00000  1.308767297557e-03
6200.00000  6250.00000  1.270616670595e-03
6250.00000  6300.00000  1.259773860827e-03
6300.00000  6350.00000  1.252143735435e-03
6350.00000  6400.00000  1.599314440785e-03
6400.00000  6450.00000  1.181866264716e-03
6450.00000  6500.00000  1.177448823699e-03
6500.00000  6550.00000  1.174236139324e-03
6550.00000  6600.00000  1.161586194594e-03
6600.00000  6650.00000  1.136687890683e-03
6650.00000  6700.00000  1.137491061776e-03
6700.00000  6750.00000  1.107974524075e-03
6750.00000  6800.00000  1.093517444384e-03
6800.00000  6850.00000  1.118817333843e-03
6850.00000  6900.00000  1.096127750439e-03
6900.00000  6950.00000  1.070225482660e-03
6950.00000  7000.00000  1.044323214881e-03
7000.00000  7050.00000  1.046933520936e-03
7050.00000  7100.00000  1.048740655897e-03
7100.00000  7150.00000  9.752505008029e-04
7150.00000  7200.00000  9.842861756096e-04
7200.00000  7250.00000  9.471395125154e-04
7250.00000  7300.00000  9.718370236537e-04
7300.00000  7350.00000  9.336863966921e-04
7350.00000  7400.00000  9.071817505924e-04
7400.00000  7450.00000  9.019611384819e-04
7450.00000  7500.00000  9.290681629020e-04
7500.00000  7550.00000  8.828858250011e-04
7550.00000  7600.00000  8.885080226586e-04
7600.00000  7650.00000  8.483494679622e-04
7650.00000  7700.00000  8.455383691334e-04
7700.00000  7750.00000  8.718422224596e-04
7750.00000  7800.00000  8.583891066363e-04
7800.00000  7850.00000  8.579875210893e-04
7850.00000  7900.00000  8.220456146360e-04
7900.00000  7950.00000  8.188329302603e-04
7950.00000  8000.00000  8.270654339731e-04
8000.00000  8050.00000  7.917259058402e-04
8050.00000  8100.00000  7.810838888456e-04
8100.00000  8150.00000  7.939346263485e-04
8150.00000  8200.00000  7.674299802488e-04
8200.00000  8250.00000  8.226479929564e-04
8250.00000  8300.00000  7.626109536853e-04
8300.00000  8350.00000  7.658236380610e-04
8350.00000  8400.00000  7.453427751658e-04
8400.00000  8450.00000  7.461459462597e-04
8450.00000  8500.00000  7.485554595415e-04
8500.00000  8550.00000  7.330944159834e-04
8550.00000  8600.00000  7.192397146131e-04
8600.00000  8650.00000  7.120111747678e-04
8650.00000  8700.00000  7.061881843368e-04
8700.00000  8750.00000  7.142198952761e-04
8750.00000  8800.00000  6.786795743697e-04
8800.00000  8850.00000  6.712502417509e-04
8850.00000  8900.00000  6.573955403806e-04
8900.00000  8950.00000  6.786795743697e-04
8950.00000  9000.00000  6.716518272979e-04
9000.00000  9050.00000  6.503677933087e-04
9050.00000  9100.00000  6.244655255295e-04
9100.00000  9150.00000  6.254694893970e-04
9150.00000  9200.00000  6.330996147893e-04
9200.00000  9250.00000  6.262726604909e-04
9250.00000  9300.00000  6.138235085350e-04
9300.00000  9350.00000  6.174377784577e-04
9350.00000  9400.00000  6.214536339273e-04
9400.00000  9450.00000  6.154298507228e-04
9450.00000  9500.00000  6.118155808002e-04
9500.00000  9550.00000  6.154298507228e-04
9550.00000  9600.00000  5.931418528663e-04
9600.00000  9650.00000  5.869172768884e-04
9650.00000  9700.00000  5.867164841149e-04
9700.00000  9750.00000  5.824998358718e-04
9750.00000  9800.00000  5.780823948552e-04
9800.00000  9850.00000  5.648300718053e-04
9850.00000  9900.00000  5.624205585236e-04
9900.00000  9950.00000  5.728617827446e-04
9950.00000  10000.00000  5.586054958274e-04
