300.00000  350.00000  2.627162162948e-02
350.00000  400.00000  2.080217802410e-02
400.00000  450.00000  1.705399935226e-02
450.00000  500.00000  1.428199383259e-02
500.00000  550.00000  1.217643475380e-02
550.00000  600.00000  1.051284306995e-02
600.00000  650.00000  9.129850193522e-03
650.00000  700.00000  8.049787517489e-03
700.00000  750.00000  7.249741090798e-03
750.00000  800.00000  6.446005129615e-03
800.00000  850.00000  5.880729608232e-03
850.00000  900.00000  5.332930829179e-03
900.00000  950.00000  4.866884367029e-03
950.00000  1000.00000  4.540457657498e-03
1000.00000  1050.00000  4.093635611912e-03
1050.00000  1100.00000  3.799637968705e-03
1100.00000  1150.00000  3.576518224951e-03
1150.00000  1200.00000  3.330678716167e-03
1200.00000  1250.00000  3.100179903428e-03
1250.00000  1300.00000  2.956288058239e-03
1300.00000  1350.00000  2.748703196557e-03
1350.00000  1400.00000  2.611802048300e-03
1400.00000  1450.00000  2.462472994386e-03
1450.00000  1500.00000  2.340912542175e-03
1500.00000  1550.00000  2.189447441976e-03
1550.00000  1600.00000  2.105753264815e-03
1600.00000  1650.00000  1.972153278999e-03
1650.00000  1700.00000  1.887682357734e-03
1700.00000  1750.00000  1.810396319428e-03
1750.00000  1800.00000  1.709031213910e-03
1800.00000  1850.00000  1.630774245474e-03
1850.00000  1900.00000  1.570188205394e-03
1900.00000  1950.00000  1.513485885833e-03
1950.00000  2000.00000  1.452899845753e-03
2000.00000  2050.00000  1.371730086929e-03
2050.00000  2100.00000  1.332310323672e-03
2100.00000  2150.00000  1.300658001451e-03
2150.00000  2200.00000  1.204147546581e-03
2200.00000  2250.00000  1.190942896820e-03
2250.00000  2300.00000  1.159873132676e-03
2300.00000  2350.00000  1.120647555445e-03
2350.00000  2400.00000  1.059090585236e-03
2400.00000  2450.00000  1.058119655107e-03
2450.00000  2500.00000  1.013456869151e-03
2500.00000  2550.00000  9.876301277066e-04
2550.00000  2600.00000  9.348115286629e-04
2600.00000  2650.00000  9.223836230056e-04
2650.00000  2700.00000  8.940324632248e-04
2700.00000  2750.00000  8.753906047387e-04
2750.00000  2800.00000  8.377185157149e-04
2800.00000  2850.00000  8.151929367110e-04
2850.00000  2900.00000  7.951917760437e-04
2900.00000  2950.00000  7.858708468007e-04
2950.00000  3000.00000  7.606266634343e-04
3000.00000  3050.00000  7.353824800678e-04
3050.00000  3100.00000  7.194592259443e-04
3100.00000  3150.00000  7.023708556655e-04
3150.00000  3200.00000  6.633394644604e-04
3200.00000  3250.00000  6.561545815023e-04
3250.00000  3300.00000  6.613976042015e-04
3300.00000  3350.00000  6.326580723689e-04
3350.00000  3400.00000  6.206185387633e-04
3400.00000  3450.00000  6.083848191319e-04
3450.00000  3500.00000  5.984813318112e-04
3500.00000  3550.00000  5.747906366519e-04
3550.00000  3600.00000  5.677999397196e-04
3600.00000  3650.00000  5.359534314727e-04
3650.00000  3700.00000  5.697417999786e-04
3700.00000  3750.00000  5.369243616022e-04
3750.00000  3800.00000  5.252732000484e-04
3800.00000  3850.00000  5.120685502875e-04
3850.00000  3900.00000  4.914848315425e-04
3900.00000  3950.00000  4.841057625585e-04
3950.00000  4000.00000  4.573080909849e-04
4000.00000  4050.00000  4.536185564928e-04
4050.00000  4100.00000  4.598325093215e-04
4100.00000  4150.00000  4.351708840327e-04
4150.00000  4200.00000  4.295394892817e-04
4200.00000  4250.00000  4.382778604471e-04
4250.00000  4300.00000  4.421615809650e-04
4300.00000  4350.00000  4.406080927578e-04
4350.00000  4400.00000  4.227429783754e-04
4400.00000  4450.00000  3.992464692420e-04
4450.00000  4500.00000  4.068197242519e-04
4500.00000  4550.00000  3.988580971902e-04
4550.00000  4600.00000  3.941976325687e-04
4600.00000  4650.00000  3.872069356364e-04
4650.00000  4700.00000  3.990522832161e-04
4700.00000  4750.00000  3.949743766723e-04
4750.00000  4800.00000  3.602150780369e-04
4800.00000  4850.00000  3.679825190727e-04
4850.00000  4900.00000  3.617685662441e-04
4900.00000  4950.00000  3.707011234353e-04
4950.00000  5000.00000  3.510883348198e-04
5000.00000  5050.00000  3.518650789234e-04
5050.00000  5100.00000  3.475929863537e-04
5100.00000  5150.00000  3.446801959652e-04
5150.00000  5200.00000  3.468162422501e-04
5200.00000  5250.00000  3.376894990330e-04
5250.00000  5300.00000  3.293394999195e-04
5300.00000  5350.00000  3.103092693817e-04
5350.00000  5400.00000  3.202127567023e-04
5400.00000  5450.00000  3.122511296406e-04
5450.00000  5500.00000  3.209895008059e-04
5500.00000  5550.00000  3.256499654274e-04
5550.00000  5600.00000  3.279801977382e-04
5600.00000  5650.00000  3.244848492721e-04
5650.00000  5700.00000  3.087557811745e-04
5700.00000  5750.00000  2.986581078279e-04
5750.00000  5800.00000  2.908906667921e-04
5800.00000  5850.00000  3.116685715629e-04
5850.00000  5900.00000  3.174941523398e-04
5900.00000  5950.00000  2.949685733359e-04
5950.00000  6000.00000  2.918615969215e-04
6000.00000  6050.00000  2.961336894913e-04
6050.00000  6100.00000  2.846767139634e-04
6100.00000  6150.00000  3.013767121904e-04
6150.00000  6200.00000  2.796278772901e-04
6200.00000  6250.00000  2.708895061248e-04
6250.00000  6300.00000  3.058429907861e-04
6300.00000  6350.00000  2.784627611347e-04
6350.00000  6400.00000  4.208011181164e-04
6400.00000  6450.00000  2.825406676785e-04
6450.00000  6500.00000  2.625395070113e-04
6500.00000  6550.00000  2.670057856069e-04
6550.00000  6600.00000  2.710836921507e-04
6600.00000  6650.00000  2.767150869017e-04
6650.00000  6700.00000  2.675883436846e-04
6700.00000  6750.00000  2.627336930372e-04
6750.00000  6800.00000  2.609860188041e-04
6800.00000  6850.00000  2.549662520013e-04
6850.00000  6900.00000  2.600150886746e-04
6900.00000  6950.00000  2.658406694515e-04
6950.00000  7000.00000  2.483639271209e-04
7000.00000  7050.00000  2.499174153280e-04
7050.00000  7100.00000  2.642871812443e-04
7100.00000  7150.00000  2.046720712943e-04
7150.00000  7200.00000  2.007883507764e-04
7200.00000  7250.00000  2.064197455273e-04
7250.00000  7300.00000  2.118569542524e-04
7300.00000  7350.00000  2.046720712943e-04
7350.00000  7400.00000  1.920499796111e-04
7400.00000  7450.00000  1.988464905174e-04
7450.00000  7500.00000  2.058371874497e-04
7500.00000  7550.00000  2.023418389835e-04
7550.00000  7600.00000  1.897197473003e-04
7600.00000  7650.00000  1.980697464138e-04
7650.00000  7700.00000  2.087499778381e-04
7700.00000  7750.00000  1.881662590931e-04
7750.00000  7800.00000  1.965162582067e-04
7800.00000  7850.00000  1.920499796111e-04
7850.00000  7900.00000  1.897197473003e-04
7900.00000  7950.00000  1.988464905174e-04
7950.00000  8000.00000  1.941860258959e-04
8000.00000  8050.00000  1.831174224198e-04
8050.00000  8100.00000  1.881662590931e-04
8100.00000  8150.00000  2.029243970612e-04
8150.00000  8200.00000  1.868069569119e-04
8200.00000  8250.00000  1.741848652286e-04
8250.00000  8300.00000  1.885546311449e-04
8300.00000  8350.00000  1.761267254876e-04
8350.00000  8400.00000  1.772918416430e-04
8400.00000  8450.00000  1.734081211250e-04
8450.00000  8500.00000  1.868069569119e-04
8500.00000  8550.00000  1.844767246011e-04
8550.00000  8600.00000  1.625337036749e-04
8600.00000  8650.00000  1.693302145812e-04
8650.00000  8700.00000  1.772918416430e-04
8700.00000  8750.00000  1.683592844518e-04
8750.00000  8800.00000  1.703011447107e-04
8800.00000  8850.00000  1.720488189438e-04
8850.00000  8900.00000  1.669999822705e-04
8900.00000  8950.00000  1.557371927685e-04
8950.00000  9000.00000  1.704953307366e-04
9000.00000  9050.00000  1.584557971311e-04
9050.00000  9100.00000  1.596209132864e-04
9100.00000  9150.00000  1.691360285553e-04
9150.00000  9200.00000  1.551546346908e-04
9200.00000  9250.00000  1.619511455972e-04
9250.00000  9300.00000  1.598150993123e-04
9300.00000  9350.00000  1.580674250793e-04
9350.00000  9400.00000  1.532127744319e-04
9400.00000  9450.00000  1.565139368721e-04
9450.00000  9500.00000  1.617569595713e-04
9500.00000  9550.00000  1.621453316231e-04
9550.00000  9600.00000  1.600092853382e-04
9600.00000  9650.00000  1.413674268522e-04
9650.00000  9700.00000  1.499116119916e-04
9700.00000  9750.00000  1.407848687745e-04
9750.00000  9800.00000  1.549604486649e-04
9800.00000  9850.00000  1.578732390534e-04
9850.00000  9900.00000  1.516592862247e-04
9900.00000  9950.00000  1.561255648203e-04
9950.00000  10000.00000  1.520476582765e-04
