10001.00000  11001.00000  3.204395735816e-04
11001.00000  12001.00000  2.654086463672e-04
12001.00000  13001.00000  2.251038024976e-04
13001.00000  14001.00000  1.935096600489e-04
14001.00000  15001.00000  1.687341404338e-04
15001.00000  16001.00000  1.451724070822e-04
16001.00000  17001.00000  1.265193681788e-04
17001.00000  18001.00000  1.130070710977e-04
18001.00000  19001.00000  1.008156590680e-04
19001.00000  20001.00000  8.737476117881e-05
20001.00000  21001.00000  8.053828854725e-05
21001.00000  22001.00000  7.229168187419e-05
22001.00000  23001.00000  6.631199954633e-05
23001.00000  24001.00000  6.283128893757e-05
24001.00000  25001.00000  5.660170943779e-05
25001.00000  26001.00000  5.210356034340e-05
26001.00000  27001.00000  4.778390922894e-05
27001.00000  28001.00000  4.441029740815e-05
28001.00000  29001.00000  4.248251922483e-05
29001.00000  30001.00000  3.839491548429e-05
30001.00000  31001.00000  3.505700325948e-05
31001.00000  32001.00000  3.323632386413e-05
32001.00000  33001.00000  3.055885416509e-05
33001.00000  34001.00000  2.868462537576e-05
34001.00000  35001.00000  2.673899739445e-05
35001.00000  36001.00000  2.593575648474e-05
36001.00000  37001.00000  2.495401759509e-05
37001.00000  38001.00000  2.375808112952e-05
38001.00000  39001.00000  2.177675355223e-05
39001.00000  40001.00000  1.970617698496e-05
40001.00000  41001.00000  1.888508627726e-05
41001.00000  42001.00000  1.786764779162e-05
42001.00000  43001.00000  1.808184536754e-05
43001.00000  44001.00000  1.627901577019e-05
44001.00000  45001.00000  1.449403597083e-05
45001.00000  46001.00000  1.485103193070e-05
46001.00000  47001.00000  1.501168011264e-05
47001.00000  48001.00000  1.336949869723e-05
48001.00000  49001.00000  1.311960152532e-05
49001.00000  50001.00000  1.245915899955e-05
50001.00000  51001.00000  1.261980718149e-05
51001.00000  52001.00000  1.185226586777e-05
52001.00000  53001.00000  1.062062980621e-05
53001.00000  54001.00000  1.012083546239e-05
54001.00000  55001.00000  9.656740714552e-06
55001.00000  56001.00000  9.924487684457e-06
56001.00000  57001.00000  9.192645966718e-06
57001.00000  58001.00000  9.210495764712e-06
58001.00000  59001.00000  8.799950410858e-06
59001.00000  60001.00000  8.621452430922e-06
60001.00000  61001.00000  7.764662127228e-06
61001.00000  62001.00000  7.996709501145e-06
62001.00000  63001.00000  7.175618793438e-06
63001.00000  64001.00000  6.479476671687e-06
64001.00000  65001.00000  7.425515965349e-06
65001.00000  66001.00000  6.586575459649e-06
66001.00000  67001.00000  6.247429297770e-06
67001.00000  68001.00000  6.354528085731e-06
68001.00000  69001.00000  6.318828489744e-06
69001.00000  70001.00000  6.229579499776e-06
70001.00000  71001.00000  5.551287176018e-06
71001.00000  72001.00000  5.462038186050e-06
72001.00000  73001.00000  5.229990812133e-06
73001.00000  74001.00000  5.140741822165e-06
74001.00000  75001.00000  4.016204548566e-06
75001.00000  76001.00000  4.801595660286e-06
76001.00000  77001.00000  4.944394044235e-06
77001.00000  78001.00000  3.998354750573e-06
78001.00000  79001.00000  4.016204548566e-06
79001.00000  80001.00000  4.962243842228e-06
80001.00000  81001.00000  3.784157174649e-06
81001.00000  82001.00000  3.730607780668e-06
82001.00000  83001.00000  4.426749902420e-06
83001.00000  84001.00000  3.855556366624e-06
84001.00000  85001.00000  3.516410204745e-06
85001.00000  86001.00000  3.873406164617e-06
86001.00000  87001.00000  3.605659194713e-06
87001.00000  88001.00000  3.088015052898e-06
88001.00000  89001.00000  3.302212628821e-06
89001.00000  90001.00000  3.159414244872e-06
90001.00000  91001.00000  3.516410204745e-06
91001.00000  92001.00000  3.195113840859e-06
92001.00000  93001.00000  2.748868891019e-06
93001.00000  94001.00000  3.123714648885e-06
94001.00000  95001.00000  2.427572527133e-06
95001.00000  96001.00000  2.909517072961e-06
96001.00000  97001.00000  2.909517072961e-06
97001.00000  98001.00000  2.623920305063e-06
98001.00000  99001.00000  2.855967678980e-06
99001.00000  100001.00000  2.659619901050e-06
100001.00000  101001.00000  2.052726769267e-06
101001.00000  102001.00000  2.177675355223e-06
102001.00000  103001.00000  2.159825557229e-06
103001.00000  104001.00000  1.999177375286e-06
104001.00000  105001.00000  1.731430405382e-06
105001.00000  106001.00000  2.106276163248e-06
106001.00000  107001.00000  2.106276163248e-06
107001.00000  108001.00000  1.767130001369e-06
108001.00000  109001.00000  2.124125961242e-06
109001.00000  110001.00000  1.963477779299e-06
110001.00000  111001.00000  1.892078587325e-06
111001.00000  112001.00000  1.767130001369e-06
112001.00000  113001.00000  1.642181415414e-06
113001.00000  114001.00000  2.088426365254e-06
114001.00000  115001.00000  1.874228789331e-06
115001.00000  116001.00000  1.731430405382e-06
116001.00000  117001.00000  1.517232829458e-06
117001.00000  118001.00000  2.017027173280e-06
118001.00000  119001.00000  1.838529193344e-06
119001.00000  120001.00000  1.695730809395e-06
120001.00000  121001.00000  1.374434445509e-06
121001.00000  122001.00000  1.356584647516e-06
122001.00000  123001.00000  1.410134041497e-06
123001.00000  124001.00000  1.160236869586e-06
124001.00000  125001.00000  1.445833637484e-06
125001.00000  126001.00000  1.427983839490e-06
126001.00000  127001.00000  1.338734849522e-06
127001.00000  128001.00000  1.463683435477e-06
128001.00000  129001.00000  1.320885051528e-06
129001.00000  130001.00000  1.178086667579e-06
130001.00000  131001.00000  1.178086667579e-06
131001.00000  132001.00000  1.106687475605e-06
132001.00000  133001.00000  9.817388896495e-07
133001.00000  134001.00000  1.142387071592e-06
134001.00000  135001.00000  1.213786263567e-06
135001.00000  136001.00000  8.567903036941e-07
136001.00000  137001.00000  8.389405057005e-07
137001.00000  138001.00000  1.160236869586e-06
138001.00000  139001.00000  1.303035253535e-06
139001.00000  140001.00000  9.638890916559e-07
140001.00000  141001.00000  1.106687475605e-06
141001.00000  142001.00000  1.106687475605e-06
142001.00000  143001.00000  1.267335657548e-06
143001.00000  144001.00000  7.139919197451e-07
144001.00000  145001.00000  8.746401016877e-07
145001.00000  146001.00000  9.281894956686e-07
146001.00000  147001.00000  9.995886876431e-07
147001.00000  148001.00000  8.032409097132e-07
148001.00000  149001.00000  6.604425257642e-07
149001.00000  150001.00000  7.853911117196e-07
150001.00000  151001.00000  7.318417177387e-07
151001.00000  152001.00000  8.032409097132e-07
152001.00000  153001.00000  7.139919197451e-07
153001.00000  154001.00000  7.496915157324e-07
154001.00000  155001.00000  9.103396976750e-07
155001.00000  156001.00000  8.389405057005e-07
156001.00000  157001.00000  8.032409097132e-07
157001.00000  158001.00000  8.389405057005e-07
158001.00000  159001.00000  8.032409097132e-07
159001.00000  160001.00000  7.675413137260e-07
160001.00000  161001.00000  8.746401016877e-07
161001.00000  162001.00000  6.782923237578e-07
162001.00000  163001.00000  7.853911117196e-07
163001.00000  164001.00000  8.746401016877e-07
164001.00000  165001.00000  6.782923237578e-07
165001.00000  166001.00000  4.283951518471e-07
166001.00000  167001.00000  7.496915157324e-07
167001.00000  168001.00000  4.640947478343e-07
168001.00000  169001.00000  4.640947478343e-07
169001.00000  170001.00000  4.819445458279e-07
170001.00000  171001.00000  6.247429297770e-07
171001.00000  172001.00000  4.997943438216e-07
172001.00000  173001.00000  6.247429297770e-07
173001.00000  174001.00000  6.961421217515e-07
174001.00000  175001.00000  5.354939398088e-07
175001.00000  176001.00000  4.640947478343e-07
176001.00000  177001.00000  6.961421217515e-07
177001.00000  178001.00000  5.711935357961e-07
178001.00000  179001.00000  7.853911117196e-07
179001.00000  180001.00000  5.711935357961e-07
180001.00000  181001.00000  3.748457578662e-07
181001.00000  182001.00000  5.354939398088e-07
182001.00000  183001.00000  3.748457578662e-07
183001.00000  184001.00000  4.283951518471e-07
184001.00000  185001.00000  4.105453538534e-07
185001.00000  186001.00000  3.748457578662e-07
186001.00000  187001.00000  4.462449498407e-07
187001.00000  188001.00000  3.569959598725e-07
188001.00000  189001.00000  5.176441418152e-07
189001.00000  190001.00000  3.391461618789e-07
190001.00000  191001.00000  3.391461618789e-07
191001.00000  192001.00000  3.212963638853e-07
192001.00000  193001.00000  4.283951518471e-07
193001.00000  194001.00000  3.748457578662e-07
194001.00000  195001.00000  5.890433337897e-07
195001.00000  196001.00000  2.677469699044e-07
196001.00000  197001.00000  4.462449498407e-07
197001.00000  198001.00000  3.926955558598e-07
198001.00000  199001.00000  3.926955558598e-07
