300.00000  350.00000  2.901169391462e-06
350.00000  400.00000  8.340862000453e-06
400.00000  450.00000  8.340862000453e-06
450.00000  500.00000  1.087938521798e-05
500.00000  550.00000  8.195803530880e-05
550.00000  600.00000  7.978215826521e-06
600.00000  650.00000  2.465993982743e-05
650.00000  700.00000  1.160467756585e-05
700.00000  750.00000  1.776966252270e-05
750.00000  800.00000  9.791446696184e-06
800.00000  850.00000  4.931987965485e-05
850.00000  900.00000  1.232996991371e-05
900.00000  950.00000  1.450584695731e-05
950.00000  1000.00000  1.776966252270e-05
1000.00000  1050.00000  1.559378547911e-05
1050.00000  1100.00000  1.486849313124e-05
1100.00000  1150.00000  1.885760104450e-05
1150.00000  1200.00000  1.994553956630e-05
1200.00000  1250.00000  1.885760104450e-05
1250.00000  1300.00000  4.605606408946e-05
1300.00000  1350.00000  1.994553956630e-05
1350.00000  1400.00000  1.885760104450e-05
1400.00000  1450.00000  2.465993982743e-05
1450.00000  1500.00000  2.574787834923e-05
1500.00000  1550.00000  1.414320078338e-05
1550.00000  1600.00000  2.393464747956e-05
1600.00000  1650.00000  2.538523217529e-05
1650.00000  1700.00000  2.139612426203e-05
1700.00000  1750.00000  7.035335774295e-05
1750.00000  1800.00000  2.611052452316e-05
1800.00000  1850.00000  3.009963243642e-05
1850.00000  1900.00000  2.212141660990e-05
1900.00000  1950.00000  3.336344800181e-05
1950.00000  2000.00000  3.046227861035e-05
2000.00000  2050.00000  3.263815565395e-05
2050.00000  2100.00000  2.792375539282e-05
2100.00000  2150.00000  2.864904774069e-05
2150.00000  2200.00000  3.300080182788e-05
2200.00000  2250.00000  3.191286330608e-05
2250.00000  2300.00000  2.973698626249e-05
2300.00000  2350.00000  9.356271287465e-05
2350.00000  2400.00000  3.046227861035e-05
2400.00000  2450.00000  3.009963243642e-05
2450.00000  2500.00000  3.916578678474e-05
2500.00000  2550.00000  2.901169391462e-05
2550.00000  2600.00000  3.517667887148e-05
2600.00000  2650.00000  3.155021713215e-05
2650.00000  2700.00000  3.009963243642e-05
2700.00000  2750.00000  3.336344800181e-05
2750.00000  2800.00000  3.445138652361e-05
2800.00000  2850.00000  3.844049443687e-05
2850.00000  2900.00000  3.481403269754e-05
2900.00000  2950.00000  2.792375539282e-05
2950.00000  3000.00000  5.258369522025e-05
3000.00000  3050.00000  3.698990974114e-05
3050.00000  3100.00000  3.300080182788e-05
3100.00000  3150.00000  3.590197121934e-05
3150.00000  3200.00000  4.134166382833e-05
3200.00000  3250.00000  3.771520208901e-05
3250.00000  3300.00000  3.046227861035e-05
3300.00000  3350.00000  3.698990974114e-05
3350.00000  3400.00000  4.242960235013e-05
3400.00000  3450.00000  3.844049443687e-05
3450.00000  3500.00000  3.735255591507e-05
3500.00000  3550.00000  3.916578678474e-05
3550.00000  3600.00000  3.553932504541e-05
3600.00000  3650.00000  3.336344800181e-05
3650.00000  3700.00000  4.496812556766e-05
3700.00000  3750.00000  3.372609417575e-05
3750.00000  3800.00000  3.445138652361e-05
3800.00000  3850.00000  3.771520208901e-05
3850.00000  3900.00000  3.989107913260e-05
3900.00000  3950.00000  4.496812556766e-05
3950.00000  4000.00000  3.336344800181e-05
4000.00000  4050.00000  3.807784826294e-05
4050.00000  4100.00000  3.445138652361e-05
4100.00000  4150.00000  3.590197121934e-05
4150.00000  4200.00000  3.735255591507e-05
4200.00000  4250.00000  3.880314061080e-05
4250.00000  4300.00000  3.118757095822e-05
4300.00000  4350.00000  3.590197121934e-05
4350.00000  4400.00000  4.061637148047e-05
4400.00000  4450.00000  3.807784826294e-05
4450.00000  4500.00000  4.315489469800e-05
4500.00000  4550.00000  4.279224852406e-05
4550.00000  4600.00000  4.605606408946e-05
4600.00000  4650.00000  4.351754087193e-05
4650.00000  4700.00000  4.170431000227e-05
4700.00000  4750.00000  4.279224852406e-05
4750.00000  4800.00000  4.134166382833e-05
4800.00000  4850.00000  3.880314061080e-05
4850.00000  4900.00000  4.206695617620e-05
4900.00000  4950.00000  3.952843295867e-05
4950.00000  5000.00000  3.989107913260e-05
5000.00000  5050.00000  4.097901765440e-05
5050.00000  5100.00000  3.553932504541e-05
5100.00000  5150.00000  4.170431000227e-05
5150.00000  5200.00000  3.989107913260e-05
5200.00000  5250.00000  4.315489469800e-05
5250.00000  5300.00000  4.460547939373e-05
5300.00000  5350.00000  4.134166382833e-05
5350.00000  5400.00000  4.242960235013e-05
5400.00000  5450.00000  4.605606408946e-05
5450.00000  5500.00000  3.771520208901e-05
5500.00000  5550.00000  3.626461739328e-05
5550.00000  5600.00000  4.424283321980e-05
5600.00000  5650.00000  4.315489469800e-05
5650.00000  5700.00000  4.750664878519e-05
5700.00000  5750.00000  4.134166382833e-05
5750.00000  5800.00000  4.315489469800e-05
5800.00000  5850.00000  4.170431000227e-05
5850.00000  5900.00000  5.040781817665e-05
5900.00000  5950.00000  5.403427991598e-05
5950.00000  6000.00000  4.097901765440e-05
6000.00000  6050.00000  3.771520208901e-05
6050.00000  6100.00000  4.496812556766e-05
6100.00000  6150.00000  5.149575669845e-05
6150.00000  6200.00000  5.367163374205e-05
6200.00000  6250.00000  8.776037409173e-05
6250.00000  6300.00000  1.127829600931e-04
6300.00000  6350.00000  1.073432674841e-04
6350.00000  6400.00000  7.789639816075e-04
6400.00000  6450.00000  4.460547939373e-05
6450.00000  6500.00000  4.678135643732e-05
6500.00000  6550.00000  3.735255591507e-05
6550.00000  6600.00000  4.786929495912e-05
6600.00000  6650.00000  4.968252582879e-05
6650.00000  6700.00000  5.077046435059e-05
6700.00000  6750.00000  4.931987965485e-05
6750.00000  6800.00000  5.077046435059e-05
6800.00000  6850.00000  4.641871026339e-05
6850.00000  6900.00000  6.056191104677e-05
6900.00000  6950.00000  5.548486461171e-05
6950.00000  7000.00000  5.222104904632e-05
7000.00000  7050.00000  5.222104904632e-05
7050.00000  7100.00000  1.131456062670e-04
7100.00000  7150.00000  2.429729365349e-05
7150.00000  7200.00000  2.756110921889e-05
7200.00000  7250.00000  2.429729365349e-05
7250.00000  7300.00000  3.009963243642e-05
7300.00000  7350.00000  2.937434008855e-05
7350.00000  7400.00000  2.429729365349e-05
7400.00000  7450.00000  2.103347808810e-05
7450.00000  7500.00000  5.403427991598e-05
7500.00000  7550.00000  2.429729365349e-05
7550.00000  7600.00000  2.429729365349e-05
7600.00000  7650.00000  3.118757095822e-05
7650.00000  7700.00000  3.155021713215e-05
7700.00000  7750.00000  2.647317069709e-05
7750.00000  7800.00000  2.103347808810e-05
7800.00000  7850.00000  2.212141660990e-05
7850.00000  7900.00000  2.973698626249e-05
7900.00000  7950.00000  2.248406278383e-05
7950.00000  8000.00000  2.393464747956e-05
8000.00000  8050.00000  2.248406278383e-05
8050.00000  8100.00000  2.502258600136e-05
8100.00000  8150.00000  3.445138652361e-05
8150.00000  8200.00000  3.009963243642e-05
8200.00000  8250.00000  2.756110921889e-05
8250.00000  8300.00000  3.155021713215e-05
8300.00000  8350.00000  3.082492478428e-05
8350.00000  8400.00000  2.756110921889e-05
8400.00000  8450.00000  1.958289339237e-05
8450.00000  8500.00000  2.574787834923e-05
8500.00000  8550.00000  2.973698626249e-05
8550.00000  8600.00000  3.009963243642e-05
8600.00000  8650.00000  2.212141660990e-05
8650.00000  8700.00000  3.372609417575e-05
8700.00000  8750.00000  2.465993982743e-05
8750.00000  8800.00000  3.118757095822e-05
8800.00000  8850.00000  3.118757095822e-05
8850.00000  8900.00000  2.864904774069e-05
8900.00000  8950.00000  3.155021713215e-05
8950.00000  9000.00000  2.792375539282e-05
9000.00000  9050.00000  3.263815565395e-05
9050.00000  9100.00000  2.719846304496e-05
9100.00000  9150.00000  3.082492478428e-05
9150.00000  9200.00000  2.901169391462e-05
9200.00000  9250.00000  3.263815565395e-05
9250.00000  9300.00000  3.263815565395e-05
9300.00000  9350.00000  2.901169391462e-05
9350.00000  9400.00000  2.284670895776e-05
9400.00000  9450.00000  3.009963243642e-05
9450.00000  9500.00000  2.465993982743e-05
9500.00000  9550.00000  2.864904774069e-05
9550.00000  9600.00000  3.336344800181e-05
9600.00000  9650.00000  2.683581687102e-05
9650.00000  9700.00000  2.864904774069e-05
9700.00000  9750.00000  3.300080182788e-05
9750.00000  9800.00000  2.937434008855e-05
9800.00000  9850.00000  2.828640156675e-05
9850.00000  9900.00000  2.864904774069e-05
9900.00000  9950.00000  3.698990974114e-05
9950.00000  10000.00000  2.647317069709e-05
