10001.00000  11001.00000  2.961954237076e-05
11001.00000  12001.00000  3.288279387017e-05
12001.00000  13001.00000  3.771510140027e-05
13001.00000  14001.00000  4.068956958115e-05
14001.00000  15001.00000  4.407796051859e-05
15001.00000  16001.00000  4.857335417707e-05
16001.00000  17001.00000  5.182697956587e-05
17001.00000  18001.00000  5.216389343749e-05
18001.00000  19001.00000  5.391584556991e-05
19001.00000  20001.00000  5.362706225138e-05
20001.00000  21001.00000  5.307837394617e-05
21001.00000  22001.00000  5.176922290216e-05
22001.00000  23001.00000  4.903540748672e-05
23001.00000  24001.00000  4.699467203576e-05
24001.00000  25001.00000  4.577215598731e-05
25001.00000  26001.00000  4.273030503211e-05
26001.00000  27001.00000  4.116124900142e-05
27001.00000  28001.00000  3.844668580722e-05
28001.00000  29001.00000  3.521231263966e-05
29001.00000  30001.00000  3.445184990086e-05
30001.00000  31001.00000  3.190093058716e-05
31001.00000  32001.00000  3.038963122018e-05
32001.00000  33001.00000  2.872431408331e-05
33001.00000  34001.00000  2.542255814143e-05
34001.00000  35001.00000  2.523003592907e-05
35001.00000  36001.00000  2.260210773043e-05
36001.00000  37001.00000  2.232295052252e-05
37001.00000  38001.00000  2.161061833681e-05
38001.00000  39001.00000  1.969502232388e-05
39001.00000  40001.00000  1.899231624878e-05
40001.00000  41001.00000  1.742326021809e-05
41001.00000  42001.00000  1.724999022697e-05
42001.00000  43001.00000  1.538252476713e-05
43001.00000  44001.00000  1.507448922737e-05
44001.00000  45001.00000  1.423701760362e-05
45001.00000  46001.00000  1.370758151965e-05
46001.00000  47001.00000  1.259095268799e-05
47001.00000  48001.00000  1.247543936058e-05
48001.00000  49001.00000  1.230216936946e-05
49001.00000  50001.00000  1.147432385634e-05
50001.00000  51001.00000  1.069460889630e-05
51001.00000  52001.00000  1.004003337429e-05
52001.00000  53001.00000  1.004003337429e-05
53001.00000  54001.00000  8.865647878931e-06
54001.00000  55001.00000  8.499855675457e-06
55001.00000  56001.00000  8.374716237426e-06
56001.00000  57001.00000  8.239950688778e-06
57001.00000  58001.00000  7.729766826038e-06
58001.00000  59001.00000  7.845280153451e-06
59001.00000  60001.00000  6.776781874883e-06
60001.00000  61001.00000  7.344722401329e-06
61001.00000  62001.00000  6.767155764265e-06
62001.00000  63001.00000  6.179963016584e-06
63001.00000  64001.00000  5.881553587434e-06
64001.00000  65001.00000  5.785292481257e-06
65001.00000  66001.00000  5.467630830871e-06
66001.00000  67001.00000  5.640900821991e-06
67001.00000  68001.00000  5.592770268902e-06
68001.00000  69001.00000  4.678289760217e-06
69001.00000  70001.00000  4.678289760217e-06
70001.00000  71001.00000  4.418384773539e-06
71001.00000  72001.00000  4.360628109832e-06
72001.00000  73001.00000  4.225862561184e-06
73001.00000  74001.00000  4.014088127594e-06
74001.00000  75001.00000  3.937079242652e-06
75001.00000  76001.00000  3.523156486090e-06
76001.00000  77001.00000  3.600165371032e-06
77001.00000  78001.00000  3.619417592267e-06
78001.00000  79001.00000  3.369138716206e-06
79001.00000  80001.00000  3.436521490530e-06
80001.00000  81001.00000  3.494278154237e-06
81001.00000  82001.00000  3.061103176439e-06
82001.00000  83001.00000  2.733815415436e-06
83001.00000  84001.00000  2.887833185319e-06
84001.00000  85001.00000  2.416153765051e-06
85001.00000  86001.00000  2.550919313699e-06
86001.00000  87001.00000  2.281388216402e-06
87001.00000  88001.00000  2.175500999607e-06
88001.00000  89001.00000  2.396901543815e-06
89001.00000  90001.00000  2.291014327020e-06
90001.00000  91001.00000  2.175500999607e-06
91001.00000  92001.00000  2.194753220843e-06
92001.00000  93001.00000  1.896343791693e-06
93001.00000  94001.00000  1.857839349222e-06
94001.00000  95001.00000  2.088866004048e-06
95001.00000  96001.00000  1.665317136868e-06
96001.00000  97001.00000  1.896343791693e-06
97001.00000  98001.00000  1.578682141308e-06
98001.00000  99001.00000  1.723073800574e-06
99001.00000  100001.00000  1.905969902311e-06
100001.00000  101001.00000  1.549803809455e-06
101001.00000  102001.00000  1.732699911192e-06
102001.00000  103001.00000  1.386159928953e-06
103001.00000  104001.00000  1.289898822776e-06
104001.00000  105001.00000  1.713447689956e-06
105001.00000  106001.00000  1.415038260807e-06
106001.00000  107001.00000  1.299524933394e-06
107001.00000  108001.00000  1.126254942275e-06
108001.00000  109001.00000  1.376533818336e-06
109001.00000  110001.00000  1.251394380305e-06
110001.00000  111001.00000  1.116628831657e-06
111001.00000  112001.00000  1.145507163510e-06
112001.00000  113001.00000  1.232142159070e-06
113001.00000  114001.00000  1.328403265247e-06
114001.00000  115001.00000  1.068498278568e-06
115001.00000  116001.00000  1.049246057333e-06
116001.00000  117001.00000  1.155133274128e-06
117001.00000  118001.00000  1.097376610421e-06
118001.00000  119001.00000  9.048543980668e-07
119001.00000  120001.00000  1.049246057333e-06
120001.00000  121001.00000  9.722371723909e-07
121001.00000  122001.00000  8.952282874490e-07
122001.00000  123001.00000  8.085932918894e-07
123001.00000  124001.00000  8.182194025072e-07
124001.00000  125001.00000  9.818632830086e-07
125001.00000  126001.00000  9.241066193022e-07
126001.00000  127001.00000  8.374716237426e-07
127001.00000  128001.00000  7.219582963299e-07
128001.00000  129001.00000  8.759760662136e-07
129001.00000  130001.00000  9.626110617731e-07
130001.00000  131001.00000  7.219582963299e-07
131001.00000  132001.00000  8.470977343604e-07
132001.00000  133001.00000  7.700888494185e-07
133001.00000  134001.00000  7.989671812717e-07
134001.00000  135001.00000  6.930799644767e-07
135001.00000  136001.00000  6.353233007703e-07
136001.00000  137001.00000  6.738277432412e-07
137001.00000  138001.00000  6.930799644767e-07
138001.00000  139001.00000  6.834538538589e-07
139001.00000  140001.00000  6.064449689171e-07
140001.00000  141001.00000  7.604627388008e-07
141001.00000  142001.00000  7.219582963299e-07
142001.00000  143001.00000  5.775666370639e-07
143001.00000  144001.00000  6.160710795348e-07
144001.00000  145001.00000  3.754183140915e-07
145001.00000  146001.00000  5.198099733575e-07
146001.00000  147001.00000  5.583144158284e-07
147001.00000  148001.00000  4.620533096511e-07
148001.00000  149001.00000  4.620533096511e-07
149001.00000  150001.00000  4.909316415043e-07
150001.00000  151001.00000  4.428010884156e-07
151001.00000  152001.00000  5.101838627398e-07
152001.00000  153001.00000  4.235488671802e-07
153001.00000  154001.00000  4.813055308866e-07
154001.00000  155001.00000  4.428010884156e-07
155001.00000  156001.00000  4.331749777979e-07
156001.00000  157001.00000  3.657922034738e-07
157001.00000  158001.00000  2.406527654433e-07
158001.00000  159001.00000  4.813055308866e-07
159001.00000  160001.00000  3.272877610029e-07
160001.00000  161001.00000  3.176616503851e-07
161001.00000  162001.00000  2.599049866787e-07
162001.00000  163001.00000  3.369138716206e-07
163001.00000  164001.00000  2.887833185319e-07
164001.00000  165001.00000  2.887833185319e-07
165001.00000  166001.00000  3.369138716206e-07
166001.00000  167001.00000  3.465399822383e-07
167001.00000  168001.00000  3.176616503851e-07
168001.00000  169001.00000  2.502788760610e-07
169001.00000  170001.00000  2.310266548256e-07
170001.00000  171001.00000  2.599049866787e-07
171001.00000  172001.00000  1.732699911192e-07
172001.00000  173001.00000  1.443916592660e-07
173001.00000  174001.00000  3.080355397674e-07
174001.00000  175001.00000  1.443916592660e-07
175001.00000  176001.00000  1.732699911192e-07
176001.00000  177001.00000  1.636438805014e-07
177001.00000  178001.00000  1.540177698837e-07
178001.00000  179001.00000  1.636438805014e-07
179001.00000  180001.00000  1.443916592660e-07
180001.00000  181001.00000  7.700888494185e-08
181001.00000  182001.00000  1.347655486482e-07
182001.00000  183001.00000  1.155133274128e-07
183001.00000  184001.00000  1.251394380305e-07
184001.00000  185001.00000  1.251394380305e-07
185001.00000  186001.00000  2.887833185319e-08
186001.00000  187001.00000  8.663499555958e-08
187001.00000  188001.00000  1.925222123546e-08
188001.00000  189001.00000  4.813055308866e-08
189001.00000  190001.00000  5.775666370639e-08
190001.00000  191001.00000  3.850444247093e-08
191001.00000  192001.00000  2.887833185319e-08
192001.00000  193001.00000  4.813055308866e-08
193001.00000  194001.00000  0.000000000000e+00
194001.00000  195001.00000  9.626110617731e-09
195001.00000  196001.00000  9.626110617731e-09
196001.00000  197001.00000  0.000000000000e+00
197001.00000  198001.00000  9.626110617731e-09
198001.00000  199001.00000  0.000000000000e+00
