300.00000  350.00000  7.170788532783e-07
350.00000  400.00000  1.434157706557e-06
400.00000  450.00000  7.170788532783e-07
450.00000  500.00000  3.585394266391e-07
500.00000  550.00000  2.545629929138e-05
550.00000  600.00000  1.792697133196e-06
600.00000  650.00000  1.003910394590e-05
650.00000  700.00000  1.434157706557e-06
700.00000  750.00000  5.736630826226e-06
750.00000  800.00000  2.868315413113e-06
800.00000  850.00000  2.868315413113e-05
850.00000  900.00000  1.792697133196e-06
900.00000  950.00000  1.434157706557e-06
950.00000  1000.00000  3.226854839752e-06
1000.00000  1050.00000  7.170788532783e-06
1050.00000  1100.00000  4.302473119670e-06
1100.00000  1150.00000  7.170788532783e-06
1150.00000  1200.00000  2.868315413113e-06
1200.00000  1250.00000  7.887867386061e-06
1250.00000  1300.00000  3.621248209055e-05
1300.00000  1350.00000  1.003910394590e-05
1350.00000  1400.00000  1.828551075860e-05
1400.00000  1450.00000  2.402214158482e-05
1450.00000  1500.00000  4.051495521022e-05
1500.00000  1550.00000  5.736630826226e-05
1550.00000  1600.00000  8.246406812700e-05
1600.00000  1650.00000  1.186765502176e-04
1650.00000  1700.00000  1.573988082946e-04
1700.00000  1750.00000  2.753582796589e-04
1750.00000  1800.00000  2.685460305527e-04
1800.00000  1850.00000  3.223269445486e-04
1850.00000  1900.00000  2.997389606703e-04
1900.00000  1950.00000  3.965446058629e-04
1950.00000  2000.00000  4.743476614436e-04
2000.00000  2050.00000  5.367335216788e-04
2050.00000  2100.00000  5.819094894353e-04
2100.00000  2150.00000  6.840932260275e-04
2150.00000  2200.00000  7.514986382357e-04
2200.00000  2250.00000  8.199796687237e-04
2250.00000  2300.00000  8.941973300380e-04
2300.00000  2350.00000  9.766613981650e-04
2350.00000  2400.00000  9.472611651806e-04
2400.00000  2450.00000  1.008571407136e-03
2450.00000  2500.00000  9.852663444044e-04
2500.00000  2550.00000  9.823980289913e-04
2550.00000  2600.00000  9.813224107113e-04
2600.00000  2650.00000  1.024347141908e-03
2650.00000  2700.00000  1.066654794251e-03
2700.00000  2750.00000  1.040122876680e-03
2750.00000  2800.00000  1.036896021840e-03
2800.00000  2850.00000  1.069881649091e-03
2850.00000  2900.00000  1.119718629394e-03
2900.00000  2950.00000  1.070957267371e-03
2950.00000  3000.00000  1.077769516477e-03
3000.00000  3050.00000  1.070957267371e-03
3050.00000  3100.00000  1.040481416107e-03
3100.00000  3150.00000  1.058408387439e-03
3150.00000  3200.00000  1.049803441199e-03
3200.00000  3250.00000  1.008571407136e-03
3250.00000  3300.00000  9.906444358040e-04
3300.00000  3350.00000  9.669808336458e-04
3350.00000  3400.00000  9.339952063950e-04
3400.00000  3450.00000  9.382976795147e-04
3450.00000  3500.00000  9.382976795147e-04
3500.00000  3550.00000  9.397318372212e-04
3550.00000  3600.00000  9.239561024491e-04
3600.00000  3650.00000  8.597775450807e-04
3650.00000  3700.00000  8.246406812700e-04
3700.00000  3750.00000  8.242821418434e-04
3750.00000  3800.00000  7.981087636987e-04
3800.00000  3850.00000  7.826915683533e-04
3850.00000  3900.00000  7.497059411025e-04
3900.00000  3950.00000  7.228154841045e-04
3950.00000  4000.00000  7.142105378652e-04
4000.00000  4050.00000  6.815834500410e-04
4050.00000  4100.00000  7.081153676123e-04
4100.00000  4150.00000  6.848103048808e-04
4150.00000  4200.00000  6.123853406997e-04
4200.00000  4250.00000  6.177634320993e-04
4250.00000  4300.00000  6.073657887267e-04
4300.00000  4350.00000  5.603971238370e-04
4350.00000  4400.00000  5.654166758099e-04
4400.00000  4450.00000  5.664922940899e-04
4450.00000  4500.00000  5.439043102116e-04
4500.00000  4550.00000  5.284871148661e-04
4550.00000  4600.00000  5.152211560805e-04
4600.00000  4650.00000  4.854623836694e-04
4650.00000  4700.00000  4.929917116288e-04
4700.00000  4750.00000  4.639500180711e-04
4750.00000  4800.00000  4.696866488973e-04
4800.00000  4850.00000  4.435132707526e-04
4850.00000  4900.00000  4.402864159129e-04
4900.00000  4950.00000  4.144715771949e-04
4950.00000  5000.00000  4.037153943957e-04
5000.00000  5050.00000  3.965446058629e-04
5050.00000  5100.00000  3.940348298764e-04
5100.00000  5150.00000  3.746737008379e-04
5150.00000  5200.00000  3.621248209055e-04
5200.00000  5250.00000  3.549540323728e-04
5250.00000  5300.00000  3.485003226933e-04
5300.00000  5350.00000  3.628418997588e-04
5350.00000  5400.00000  3.169488531490e-04
5400.00000  5450.00000  3.434807707203e-04
5450.00000  5500.00000  3.373856004674e-04
5500.00000  5550.00000  3.277050359482e-04
5550.00000  5600.00000  2.961535664039e-04
5600.00000  5650.00000  3.018901972302e-04
5650.00000  5700.00000  3.112122223228e-04
5700.00000  5750.00000  2.896998567244e-04
5750.00000  5800.00000  2.936437904175e-04
5800.00000  5850.00000  2.775095162187e-04
5850.00000  5900.00000  2.674704122728e-04
5900.00000  5950.00000  2.570727689003e-04
5950.00000  6000.00000  2.495434409408e-04
6000.00000  6050.00000  2.463165861011e-04
6050.00000  6100.00000  2.438068101146e-04
6100.00000  6150.00000  2.373531004351e-04
6150.00000  6200.00000  2.369945610085e-04
6200.00000  6250.00000  2.577898477535e-04
6250.00000  6300.00000  2.922096327109e-04
6300.00000  6350.00000  2.570727689003e-04
6350.00000  6400.00000  1.026498378468e-03
6400.00000  6450.00000  2.183505108232e-04
6450.00000  6500.00000  2.075943280241e-04
6500.00000  6550.00000  1.896673566921e-04
6550.00000  6600.00000  1.989893817847e-04
6600.00000  6650.00000  2.000650000646e-04
6650.00000  6700.00000  1.850063441458e-04
6700.00000  6750.00000  1.903844355454e-04
6750.00000  6800.00000  1.842892652925e-04
6800.00000  6850.00000  1.720989247868e-04
6850.00000  6900.00000  1.814209498794e-04
6900.00000  6950.00000  1.764013979065e-04
6950.00000  7000.00000  1.774770161864e-04
7000.00000  7050.00000  1.577573477212e-04
7050.00000  7100.00000  2.624508602999e-04
7100.00000  7150.00000  1.219034050573e-04
7150.00000  7200.00000  1.226204839106e-04
7200.00000  7250.00000  1.143740770979e-04
7250.00000  7300.00000  1.165253136577e-04
7300.00000  7350.00000  1.147326165245e-04
7350.00000  7400.00000  1.183180107909e-04
7400.00000  7450.00000  1.089959856983e-04
7450.00000  7500.00000  1.394718369626e-04
7500.00000  7550.00000  1.161667742311e-04
7550.00000  7600.00000  1.118643011114e-04
7600.00000  7650.00000  1.029008154454e-04
7650.00000  7700.00000  1.089959856983e-04
7700.00000  7750.00000  1.039764337254e-04
7750.00000  7800.00000  9.250317207290e-05
7800.00000  7850.00000  1.104301434049e-04
7850.00000  7900.00000  1.072032885651e-04
7900.00000  7950.00000  9.716418461921e-05
7950.00000  8000.00000  9.859834232577e-05
8000.00000  8050.00000  1.029008154454e-04
8050.00000  8100.00000  1.014666577389e-04
8100.00000  8150.00000  8.318114698028e-05
8150.00000  8200.00000  9.393732977946e-05
8200.00000  8250.00000  9.429586920610e-05
8250.00000  8300.00000  8.318114698028e-05
8300.00000  8350.00000  8.067137099381e-05
8350.00000  8400.00000  7.672743730078e-05
8400.00000  8450.00000  7.708597672742e-05
8450.00000  8500.00000  8.927631723315e-05
8500.00000  8550.00000  8.353968640692e-05
8550.00000  8600.00000  8.425676526020e-05
8600.00000  8650.00000  1.014666577389e-04
8650.00000  8700.00000  7.314204303439e-05
8700.00000  8750.00000  7.636889787414e-05
8750.00000  8800.00000  8.461530468684e-05
8800.00000  8850.00000  8.999339608643e-05
8850.00000  8900.00000  8.067137099381e-05
8900.00000  8950.00000  7.780305558070e-05
8950.00000  9000.00000  7.601035844750e-05
9000.00000  9050.00000  7.672743730078e-05
9050.00000  9100.00000  7.636889787414e-05
9100.00000  9150.00000  7.278350360775e-05
9150.00000  9200.00000  7.421766131430e-05
9200.00000  9250.00000  7.672743730078e-05
9250.00000  9300.00000  7.170788532783e-05
9300.00000  9350.00000  7.350058246103e-05
9350.00000  9400.00000  7.601035844750e-05
9400.00000  9450.00000  7.529327959422e-05
9450.00000  9500.00000  7.206642475447e-05
9500.00000  9550.00000  7.206642475447e-05
9550.00000  9600.00000  6.740541220816e-05
9600.00000  9650.00000  7.350058246103e-05
9650.00000  9700.00000  5.844192654218e-05
9700.00000  9750.00000  6.776395163480e-05
9750.00000  9800.00000  6.453709679505e-05
9800.00000  9850.00000  6.453709679505e-05
9850.00000  9900.00000  6.955664876799e-05
9900.00000  9950.00000  6.740541220816e-05
9950.00000  10000.00000  6.417855736841e-05
