300.00000  350.00000  0.000000000000e+00
350.00000  400.00000  0.000000000000e+00
400.00000  450.00000  0.000000000000e+00
450.00000  500.00000  0.000000000000e+00
500.00000  550.00000  3.743284018644e-06
550.00000  600.00000  0.000000000000e+00
600.00000  650.00000  2.245970411187e-06
650.00000  700.00000  0.000000000000e+00
700.00000  750.00000  7.486568037289e-07
750.00000  800.00000  0.000000000000e+00
800.00000  850.00000  1.122985205593e-05
850.00000  900.00000  0.000000000000e+00
900.00000  950.00000  7.486568037289e-07
950.00000  1000.00000  1.497313607458e-06
1000.00000  1050.00000  7.486568037289e-07
1050.00000  1100.00000  3.743284018644e-06
1100.00000  1150.00000  1.497313607458e-06
1150.00000  1200.00000  5.240597626102e-06
1200.00000  1250.00000  8.983881644746e-06
1250.00000  1300.00000  5.165731945729e-05
1300.00000  1350.00000  2.171104730814e-05
1350.00000  1400.00000  5.689791708339e-05
1400.00000  1450.00000  8.834150284000e-05
1450.00000  1500.00000  1.370041950824e-04
1500.00000  1550.00000  2.021373370068e-04
1550.00000  1600.00000  3.211737687997e-04
1600.00000  1650.00000  4.110125852471e-04
1650.00000  1700.00000  5.315463306475e-04
1700.00000  1750.00000  7.179618747760e-04
1750.00000  1800.00000  8.070520344197e-04
1800.00000  1850.00000  8.250197977092e-04
1850.00000  1900.00000  8.459821882136e-04
1900.00000  1950.00000  1.026408477912e-03
1950.00000  2000.00000  1.173145211443e-03
2000.00000  2050.00000  1.284695075199e-03
2050.00000  2100.00000  1.404480163795e-03
2100.00000  2150.00000  1.507794802710e-03
2150.00000  2200.00000  1.545976299700e-03
2200.00000  2250.00000  1.688969749212e-03
2250.00000  2300.00000  1.757846175155e-03
2300.00000  2350.00000  1.933031867228e-03
2350.00000  2400.00000  1.805011553790e-03
2400.00000  2450.00000  1.937523808050e-03
2450.00000  2500.00000  1.749610950314e-03
2500.00000  2550.00000  1.732391843829e-03
2550.00000  2600.00000  1.781054536071e-03
2600.00000  2650.00000  1.785546476893e-03
2650.00000  2700.00000  1.748862293511e-03
2700.00000  2750.00000  1.766830056800e-03
2750.00000  2800.00000  1.745867666296e-03
2800.00000  2850.00000  1.651536909026e-03
2850.00000  2900.00000  1.718167364558e-03
2900.00000  2950.00000  1.691964376427e-03
2950.00000  3000.00000  1.706937512502e-03
3000.00000  3050.00000  1.617847352858e-03
3050.00000  3100.00000  1.514532713943e-03
3100.00000  3150.00000  1.533249134037e-03
3150.00000  3200.00000  1.550468240522e-03
3200.00000  3250.00000  1.452394199234e-03
3250.00000  3300.00000  1.395496282151e-03
3300.00000  3350.00000  1.379774489272e-03
3350.00000  3400.00000  1.306406122507e-03
3400.00000  3450.00000  1.271967909535e-03
3450.00000  3500.00000  1.232289098938e-03
3500.00000  3550.00000  1.229294471723e-03
3550.00000  3600.00000  1.227797158115e-03
3600.00000  3650.00000  1.134215057649e-03
3650.00000  3700.00000  1.131969087238e-03
3700.00000  3750.00000  1.084803708603e-03
3750.00000  3800.00000  1.090044306229e-03
3800.00000  3850.00000  9.852323537072e-04
3850.00000  3900.00000  9.732538448475e-04
3900.00000  3950.00000  9.470508567170e-04
3950.00000  4000.00000  8.909015964373e-04
4000.00000  4050.00000  9.066233893156e-04
4050.00000  4100.00000  8.527200994472e-04
4100.00000  4150.00000  7.830950167004e-04
4150.00000  4200.00000  7.538974013550e-04
4200.00000  4250.00000  7.793517326817e-04
4250.00000  4300.00000  7.441648629065e-04
4300.00000  4350.00000  7.149672475611e-04
4350.00000  4400.00000  6.850209754119e-04
4400.00000  4450.00000  6.401015671882e-04
4450.00000  4500.00000  6.460908216180e-04
4500.00000  4550.00000  6.505827624404e-04
4550.00000  4600.00000  5.951821589644e-04
4600.00000  4650.00000  5.764657388712e-04
4650.00000  4700.00000  5.742197684600e-04
4700.00000  4750.00000  5.495140939370e-04
4750.00000  4800.00000  5.233111058065e-04
4800.00000  4850.00000  4.911188632461e-04
4850.00000  4900.00000  5.023487153021e-04
4900.00000  4950.00000  4.926161768536e-04
4950.00000  5000.00000  4.671618455268e-04
5000.00000  5050.00000  4.349696029665e-04
5050.00000  5100.00000  4.491940822373e-04
5100.00000  5150.00000  4.252370645180e-04
5150.00000  5200.00000  4.297290053404e-04
5200.00000  5250.00000  3.833122835092e-04
5250.00000  5300.00000  3.878042243315e-04
5300.00000  5350.00000  4.087666148360e-04
5350.00000  5400.00000  3.481254137339e-04
5400.00000  5450.00000  3.668418338271e-04
5450.00000  5500.00000  3.324036208556e-04
5500.00000  5550.00000  3.376442184817e-04
5550.00000  5600.00000  2.927248102580e-04
5600.00000  5650.00000  3.039546623139e-04
5650.00000  5700.00000  2.972167510804e-04
5700.00000  5750.00000  2.957194374729e-04
5750.00000  5800.00000  2.710137629498e-04
5800.00000  5850.00000  2.725110765573e-04
5850.00000  5900.00000  2.508000292492e-04
5900.00000  5950.00000  2.575379404827e-04
5950.00000  6000.00000  2.305862955485e-04
6000.00000  6050.00000  2.238483843149e-04
6050.00000  6100.00000  2.463080884268e-04
6100.00000  6150.00000  2.395701771932e-04
6150.00000  6200.00000  2.088752482404e-04
6200.00000  6250.00000  2.186077866888e-04
6250.00000  6300.00000  2.230997275112e-04
6300.00000  6350.00000  2.126185322590e-04
6350.00000  6400.00000  7.419188924953e-04
6400.00000  6450.00000  1.968967393807e-04
6450.00000  6500.00000  1.841695737173e-04
6500.00000  6550.00000  1.864155441285e-04
6550.00000  6600.00000  1.894101713434e-04
6600.00000  6650.00000  1.736883784651e-04
6650.00000  6700.00000  1.849182305210e-04
6700.00000  6750.00000  1.579665855868e-04
6750.00000  6800.00000  1.617098696054e-04
6800.00000  6850.00000  1.504800175495e-04
6850.00000  6900.00000  1.639558400166e-04
6900.00000  6950.00000  1.489827039420e-04
6950.00000  7000.00000  1.392501654936e-04
7000.00000  7050.00000  1.399988222973e-04
7050.00000  7100.00000  1.894101713434e-04
7100.00000  7150.00000  1.310149406525e-04
7150.00000  7200.00000  1.145444909705e-04
7200.00000  7250.00000  1.025659821109e-04
7250.00000  7300.00000  1.093038933444e-04
7300.00000  7350.00000  1.257743430264e-04
7350.00000  7400.00000  9.957135489594e-05
7400.00000  7450.00000  9.283344366238e-05
7450.00000  7500.00000  1.459880767271e-04
7500.00000  7550.00000  9.957135489594e-05
7550.00000  7600.00000  9.732538448475e-05
7600.00000  7650.00000  1.182877749892e-04
7650.00000  7700.00000  9.507941407356e-05
7700.00000  7750.00000  9.358210046611e-05
7750.00000  7800.00000  8.085493480272e-05
7800.00000  7850.00000  1.070579229332e-04
7850.00000  7900.00000  8.085493480272e-05
7900.00000  7950.00000  9.433075726984e-05
7950.00000  8000.00000  9.208478685865e-05
8000.00000  8050.00000  8.684418923255e-05
8050.00000  8100.00000  8.759284603628e-05
8100.00000  8150.00000  7.860896439153e-05
8150.00000  8200.00000  8.160359160645e-05
8200.00000  8250.00000  7.561433717661e-05
8250.00000  8300.00000  7.112239635424e-05
8300.00000  8350.00000  8.085493480272e-05
8350.00000  8400.00000  5.989254429831e-05
8400.00000  8450.00000  8.010627799899e-05
8450.00000  8500.00000  6.588179872814e-05
8500.00000  8550.00000  6.962508274678e-05
8550.00000  8600.00000  6.737911233560e-05
8600.00000  8650.00000  6.438448512068e-05
8650.00000  8700.00000  7.636299398034e-05
8700.00000  8750.00000  7.561433717661e-05
8750.00000  8800.00000  6.513314192441e-05
8800.00000  8850.00000  5.315463306475e-05
8850.00000  8900.00000  6.363582831695e-05
8900.00000  8950.00000  4.641672183119e-05
8950.00000  9000.00000  5.540060347594e-05
9000.00000  9050.00000  4.866269224238e-05
9050.00000  9100.00000  5.839523069085e-05
9100.00000  9150.00000  4.866269224238e-05
9150.00000  9200.00000  5.764657388712e-05
9200.00000  9250.00000  5.390328986848e-05
9250.00000  9300.00000  4.941134904610e-05
9300.00000  9350.00000  4.941134904610e-05
9350.00000  9400.00000  5.390328986848e-05
9400.00000  9450.00000  5.540060347594e-05
9450.00000  9500.00000  5.390328986848e-05
9500.00000  9550.00000  4.342209461627e-05
9550.00000  9600.00000  5.165731945729e-05
9600.00000  9650.00000  5.165731945729e-05
9650.00000  9700.00000  4.491940822373e-05
9700.00000  9750.00000  4.342209461627e-05
9750.00000  9800.00000  4.566806502746e-05
9800.00000  9850.00000  5.090866265356e-05
9850.00000  9900.00000  5.090866265356e-05
9900.00000  9950.00000  3.593552657899e-05
9950.00000  10000.00000  4.342209461627e-05
