300.00000  350.00000  1.310478093961e-04
350.00000  400.00000  1.882870824657e-04
400.00000  450.00000  1.250226227572e-04
450.00000  500.00000  1.212568811079e-04
500.00000  550.00000  5.490451324700e-04
550.00000  600.00000  6.778334968765e-05
600.00000  650.00000  1.634331875802e-04
650.00000  700.00000  6.401760803834e-05
700.00000  750.00000  1.174911394586e-04
750.00000  800.00000  6.401760803834e-05
800.00000  850.00000  2.681208054312e-04
850.00000  900.00000  6.175816304875e-05
900.00000  950.00000  7.154909133697e-05
950.00000  1000.00000  6.401760803834e-05
1000.00000  1050.00000  6.928964634738e-05
1050.00000  1100.00000  6.326445970848e-05
1100.00000  1150.00000  7.531483298628e-05
1150.00000  1200.00000  7.079594300710e-05
1200.00000  1250.00000  7.305538799669e-05
1250.00000  1300.00000  1.995843074136e-04
1300.00000  1350.00000  6.778334968765e-05
1350.00000  1400.00000  7.305538799669e-05
1400.00000  1450.00000  7.230223966683e-05
1450.00000  1500.00000  7.832742630573e-05
1500.00000  1550.00000  7.456168465642e-05
1550.00000  1600.00000  8.284631628491e-05
1600.00000  1650.00000  6.853649801752e-05
1650.00000  1700.00000  9.188409624326e-05
1700.00000  1750.00000  2.176598673304e-04
1750.00000  1800.00000  6.552390469806e-05
1800.00000  1850.00000  8.284631628491e-05
1850.00000  1900.00000  7.305538799669e-05
1900.00000  1950.00000  6.778334968765e-05
1950.00000  2000.00000  7.230223966683e-05
2000.00000  2050.00000  7.305538799669e-05
2050.00000  2100.00000  7.983372296546e-05
2100.00000  2150.00000  8.359946461477e-05
2150.00000  2200.00000  7.531483298628e-05
2200.00000  2250.00000  7.908057463560e-05
2250.00000  2300.00000  7.380853632656e-05
2300.00000  2350.00000  2.349822789172e-04
2350.00000  2400.00000  7.757427797587e-05
2400.00000  2450.00000  8.510576127450e-05
2450.00000  2500.00000  8.811835459395e-05
2500.00000  2550.00000  7.983372296546e-05
2550.00000  2600.00000  7.230223966683e-05
2600.00000  2650.00000  9.263724457313e-05
2650.00000  2700.00000  8.887150292381e-05
2700.00000  2750.00000  9.339039290299e-05
2750.00000  2800.00000  7.230223966683e-05
2800.00000  2850.00000  9.188409624326e-05
2850.00000  2900.00000  7.606798131614e-05
2900.00000  2950.00000  9.866243121203e-05
2950.00000  3000.00000  1.242694744274e-04
3000.00000  3050.00000  8.811835459395e-05
3050.00000  3100.00000  1.009218762016e-04
3100.00000  3150.00000  9.113094791340e-05
3150.00000  3200.00000  9.564983789258e-05
3200.00000  3250.00000  9.489668956271e-05
3250.00000  3300.00000  8.736520626409e-05
3300.00000  3350.00000  8.134001962518e-05
3350.00000  3400.00000  1.092065078301e-04
3400.00000  3450.00000  9.790928288217e-05
3450.00000  3500.00000  9.640298622244e-05
3500.00000  3550.00000  9.564983789258e-05
3550.00000  3600.00000  1.001687278718e-04
3600.00000  3650.00000  9.564983789258e-05
3650.00000  3700.00000  1.461107759934e-04
3700.00000  3750.00000  9.489668956271e-05
3750.00000  3800.00000  9.866243121203e-05
3800.00000  3850.00000  8.585890960436e-05
3850.00000  3900.00000  1.031813211912e-04
3900.00000  3950.00000  9.489668956271e-05
3950.00000  4000.00000  1.107128044898e-04
4000.00000  4050.00000  1.174911394586e-04
4050.00000  4100.00000  1.114659528197e-04
4100.00000  4150.00000  1.077002111704e-04
4150.00000  4200.00000  1.144785461391e-04
4200.00000  4250.00000  9.339039290299e-05
4250.00000  4300.00000  1.107128044898e-04
4300.00000  4350.00000  9.941557954189e-05
4350.00000  4400.00000  1.099596561600e-04
4400.00000  4450.00000  1.152316944690e-04
4450.00000  4500.00000  1.009218762016e-04
4500.00000  4550.00000  1.084533595002e-04
4550.00000  4600.00000  1.122191011496e-04
4600.00000  4650.00000  9.941557954189e-05
4650.00000  4700.00000  1.152316944690e-04
4700.00000  4750.00000  1.137253978093e-04
4750.00000  4800.00000  1.159848427989e-04
4800.00000  4850.00000  1.302946610663e-04
4850.00000  4900.00000  1.167379911287e-04
4900.00000  4950.00000  1.069470628405e-04
4950.00000  5000.00000  1.318009577260e-04
5000.00000  5050.00000  1.122191011496e-04
5050.00000  5100.00000  1.129722494794e-04
5100.00000  5150.00000  1.046876178509e-04
5150.00000  5200.00000  1.152316944690e-04
5200.00000  5250.00000  1.092065078301e-04
5250.00000  5300.00000  1.099596561600e-04
5300.00000  5350.00000  1.265289194170e-04
5350.00000  5400.00000  1.174911394586e-04
5400.00000  5450.00000  1.385792926948e-04
5450.00000  5500.00000  1.144785461391e-04
5500.00000  5550.00000  1.144785461391e-04
5550.00000  5600.00000  1.174911394586e-04
5600.00000  5650.00000  1.046876178509e-04
5650.00000  5700.00000  1.152316944690e-04
5700.00000  5750.00000  1.287883644065e-04
5750.00000  5800.00000  1.122191011496e-04
5800.00000  5850.00000  1.265289194170e-04
5850.00000  5900.00000  1.205037327781e-04
5900.00000  5950.00000  1.174911394586e-04
5950.00000  6000.00000  1.242694744274e-04
6000.00000  6050.00000  1.031813211912e-04
6050.00000  6100.00000  1.061939145107e-04
6100.00000  6150.00000  1.159848427989e-04
6150.00000  6200.00000  1.077002111704e-04
6200.00000  6250.00000  1.318009577260e-04
6250.00000  6300.00000  1.807555991671e-04
6300.00000  6350.00000  1.559017042816e-04
6350.00000  6400.00000  1.213321959409e-03
6400.00000  6450.00000  1.212568811079e-04
6450.00000  6500.00000  1.122191011496e-04
6500.00000  6550.00000  1.084533595002e-04
6550.00000  6600.00000  1.031813211912e-04
6600.00000  6650.00000  1.182442877885e-04
6650.00000  6700.00000  9.715613455230e-05
6700.00000  6750.00000  1.016750245315e-04
6750.00000  6800.00000  1.054407661808e-04
6800.00000  6850.00000  1.257757710871e-04
6850.00000  6900.00000  1.212568811079e-04
6900.00000  6950.00000  9.866243121203e-05
6950.00000  7000.00000  1.024281728613e-04
7000.00000  7050.00000  1.054407661808e-04
7050.00000  7100.00000  2.176598673304e-04
7100.00000  7150.00000  6.175816304875e-05
7150.00000  7200.00000  5.648612473971e-05
7200.00000  7250.00000  6.401760803834e-05
7250.00000  7300.00000  6.251131137861e-05
7300.00000  7350.00000  5.799242139944e-05
7350.00000  7400.00000  6.778334968765e-05
7400.00000  7450.00000  5.573297640985e-05
7450.00000  7500.00000  9.866243121203e-05
7500.00000  7550.00000  6.401760803834e-05
7550.00000  7600.00000  5.949871805916e-05
7600.00000  7650.00000  5.949871805916e-05
7650.00000  7700.00000  6.025186638903e-05
7700.00000  7750.00000  5.121408643067e-05
7750.00000  7800.00000  6.401760803834e-05
7800.00000  7850.00000  5.874556972930e-05
7850.00000  7900.00000  5.874556972930e-05
7900.00000  7950.00000  5.196723476053e-05
7950.00000  8000.00000  5.121408643067e-05
8000.00000  8050.00000  6.928964634738e-05
8050.00000  8100.00000  6.175816304875e-05
8100.00000  8150.00000  4.970778977095e-05
8150.00000  8200.00000  5.874556972930e-05
8200.00000  8250.00000  5.949871805916e-05
8250.00000  8300.00000  6.928964634738e-05
8300.00000  8350.00000  6.025186638903e-05
8350.00000  8400.00000  5.723927306957e-05
8400.00000  8450.00000  5.648612473971e-05
8450.00000  8500.00000  5.422667975012e-05
8500.00000  8550.00000  3.765741649314e-05
8550.00000  8600.00000  4.594204812163e-05
8600.00000  8650.00000  5.121408643067e-05
8650.00000  8700.00000  5.648612473971e-05
8700.00000  8750.00000  5.573297640985e-05
8750.00000  8800.00000  3.991686148273e-05
8800.00000  8850.00000  4.820149311122e-05
8850.00000  8900.00000  3.916371315287e-05
8900.00000  8950.00000  5.272038309040e-05
8950.00000  9000.00000  4.217630647232e-05
9000.00000  9050.00000  4.368260313204e-05
9050.00000  9100.00000  4.820149311122e-05
9100.00000  9150.00000  4.970778977095e-05
9150.00000  9200.00000  4.970778977095e-05
9200.00000  9250.00000  5.121408643067e-05
9250.00000  9300.00000  4.820149311122e-05
9300.00000  9350.00000  4.518889979177e-05
9350.00000  9400.00000  4.368260313204e-05
9400.00000  9450.00000  5.347353142026e-05
9450.00000  9500.00000  5.497982807999e-05
9500.00000  9550.00000  4.518889979177e-05
9550.00000  9600.00000  4.217630647232e-05
9600.00000  9650.00000  4.744834478136e-05
9650.00000  9700.00000  4.142315814245e-05
9700.00000  9750.00000  4.443575146191e-05
9750.00000  9800.00000  4.820149311122e-05
9800.00000  9850.00000  5.196723476053e-05
9850.00000  9900.00000  5.573297640985e-05
9900.00000  9950.00000  4.895464144108e-05
9950.00000  10000.00000  4.744834478136e-05
