10001.00000  11001.00000  8.655707550933e-04
11001.00000  12001.00000  7.293165250530e-04
12001.00000  13001.00000  6.252634533407e-04
13001.00000  14001.00000  5.445946758122e-04
14001.00000  15001.00000  4.746629688721e-04
15001.00000  16001.00000  4.182330276623e-04
16001.00000  17001.00000  3.710019811981e-04
17001.00000  18001.00000  3.297728365515e-04
18001.00000  19001.00000  2.935905172188e-04
19001.00000  20001.00000  2.664361842048e-04
20001.00000  21001.00000  2.397141489767e-04
21001.00000  22001.00000  2.161991601134e-04
22001.00000  23001.00000  1.939911180445e-04
23001.00000  24001.00000  1.765484050570e-04
24001.00000  25001.00000  1.628053568415e-04
25001.00000  26001.00000  1.497861560813e-04
26001.00000  27001.00000  1.363044972247e-04
27001.00000  28001.00000  1.250547013555e-04
28001.00000  29001.00000  1.163785853277e-04
29001.00000  30001.00000  1.072199043297e-04
30001.00000  31001.00000  9.761887210886e-05
31001.00000  32001.00000  9.047087848688e-05
32001.00000  33001.00000  8.391603764085e-05
33001.00000  34001.00000  7.919092230705e-05
34001.00000  35001.00000  7.257576083974e-05
35001.00000  36001.00000  6.713685148743e-05
36001.00000  37001.00000  6.337686609416e-05
37001.00000  38001.00000  6.004917848674e-05
38001.00000  39001.00000  5.472085694012e-05
39001.00000  40001.00000  5.141327620646e-05
40001.00000  41001.00000  4.907082541332e-05
41001.00000  42001.00000  4.520025221436e-05
42001.00000  43001.00000  4.209374021831e-05
43001.00000  44001.00000  3.967086193013e-05
44001.00000  45001.00000  3.702680803058e-05
45001.00000  46001.00000  3.497590690697e-05
46001.00000  47001.00000  3.181912772652e-05
47001.00000  48001.00000  3.040159312638e-05
48001.00000  49001.00000  2.903432571065e-05
49001.00000  50001.00000  2.837079887654e-05
50001.00000  51001.00000  2.630984431605e-05
51001.00000  52001.00000  2.498279064784e-05
52001.00000  53001.00000  2.419862257117e-05
53001.00000  54001.00000  2.327370637817e-05
54001.00000  55001.00000  2.138366024465e-05
55001.00000  56001.00000  1.923222475224e-05
56001.00000  57001.00000  1.923222475224e-05
57001.00000  58001.00000  1.831736199612e-05
58001.00000  59001.00000  1.650774335765e-05
59001.00000  60001.00000  1.614581962995e-05
60001.00000  61001.00000  1.564314778593e-05
61001.00000  62001.00000  1.416529256451e-05
62001.00000  63001.00000  1.355203291480e-05
63001.00000  64001.00000  1.251652891612e-05
64001.00000  65001.00000  1.208423113026e-05
65001.00000  66001.00000  1.156145241248e-05
66001.00000  67001.00000  1.082755152021e-05
67001.00000  68001.00000  1.054605528756e-05
68001.00000  69001.00000  9.832261269049e-06
69001.00000  70001.00000  1.047568122940e-05
70001.00000  71001.00000  9.178787871822e-06
71001.00000  72001.00000  8.525314474594e-06
72001.00000  73001.00000  8.394619795149e-06
73001.00000  74001.00000  8.113123562497e-06
74001.00000  75001.00000  7.560184534074e-06
75001.00000  76001.00000  7.168100495738e-06
76001.00000  77001.00000  6.745856146760e-06
77001.00000  78001.00000  5.991848380729e-06
78001.00000  79001.00000  5.961688070088e-06
79001.00000  80001.00000  6.474413350989e-06
80001.00000  81001.00000  5.881260575045e-06
81001.00000  82001.00000  5.428855915426e-06
82001.00000  83001.00000  5.398695604784e-06
83001.00000  84001.00000  4.885970323883e-06
84001.00000  85001.00000  5.076985624611e-06
85001.00000  86001.00000  4.594420654351e-06
86001.00000  87001.00000  4.222443489776e-06
87001.00000  88001.00000  4.865863450122e-06
88001.00000  89001.00000  4.061588499689e-06
89001.00000  90001.00000  3.709718208874e-06
90001.00000  91001.00000  3.629290713831e-06
91001.00000  92001.00000  3.468435723744e-06
92001.00000  93001.00000  3.056244811647e-06
93001.00000  94001.00000  2.945657005962e-06
94001.00000  95001.00000  3.076351685408e-06
95001.00000  96001.00000  2.814962326517e-06
96001.00000  97001.00000  2.463092035702e-06
97001.00000  98001.00000  2.905443258441e-06
98001.00000  99001.00000  2.885336384680e-06
99001.00000  100001.00000  2.352504230018e-06
100001.00000  101001.00000  2.412824851300e-06
101001.00000  102001.00000  2.211756113692e-06
102001.00000  103001.00000  2.211756113692e-06
103001.00000  104001.00000  2.161488929290e-06
104001.00000  105001.00000  2.131328618649e-06
105001.00000  106001.00000  1.719137706551e-06
106001.00000  107001.00000  1.819672075356e-06
107001.00000  108001.00000  1.699030832791e-06
108001.00000  109001.00000  1.719137706551e-06
109001.00000  110001.00000  1.608549900867e-06
110001.00000  111001.00000  1.628656774628e-06
111001.00000  112001.00000  1.518068968943e-06
112001.00000  113001.00000  1.477855221421e-06
113001.00000  114001.00000  1.699030832791e-06
114001.00000  115001.00000  1.467801784541e-06
115001.00000  116001.00000  1.226519299411e-06
116001.00000  117001.00000  1.477855221421e-06
117001.00000  118001.00000  1.256679610052e-06
118001.00000  119001.00000  1.055610872444e-06
119001.00000  120001.00000  1.206412425650e-06
120001.00000  121001.00000  1.136038367487e-06
121001.00000  122001.00000  1.085771183085e-06
122001.00000  123001.00000  9.048093192376e-07
123001.00000  124001.00000  1.095824619966e-06
124001.00000  125001.00000  8.444886979551e-07
125001.00000  126001.00000  1.005343688042e-06
126001.00000  127001.00000  9.751833774005e-07
127001.00000  128001.00000  7.540077660314e-07
128001.00000  129001.00000  9.450230667593e-07
129001.00000  130001.00000  7.439543291509e-07
130001.00000  131001.00000  6.836337078684e-07
131001.00000  132001.00000  6.132596497055e-07
132001.00000  133001.00000  5.328321546622e-07
133001.00000  134001.00000  7.037405816293e-07
134001.00000  135001.00000  5.026718440209e-07
135001.00000  136001.00000  5.127252809013e-07
136001.00000  137001.00000  5.629924653034e-07
137001.00000  138001.00000  6.132596497055e-07
138001.00000  139001.00000  5.127252809013e-07
139001.00000  140001.00000  4.021374752167e-07
140001.00000  141001.00000  4.524046596188e-07
141001.00000  142001.00000  5.227787177817e-07
142001.00000  143001.00000  4.322977858580e-07
143001.00000  144001.00000  4.624580964992e-07
144001.00000  145001.00000  5.127252809013e-07
145001.00000  146001.00000  4.926184071405e-07
146001.00000  147001.00000  3.719771645755e-07
147001.00000  148001.00000  3.418168539342e-07
148001.00000  149001.00000  4.222443489776e-07
149001.00000  150001.00000  3.317634170538e-07
150001.00000  151001.00000  3.317634170538e-07
151001.00000  152001.00000  3.217099801734e-07
152001.00000  153001.00000  2.613893588909e-07
153001.00000  154001.00000  2.915496695321e-07
154001.00000  155001.00000  3.820306014559e-07
155001.00000  156001.00000  3.619237276950e-07
156001.00000  157001.00000  3.518702908146e-07
157001.00000  158001.00000  2.513359220105e-07
158001.00000  159001.00000  1.910153007279e-07
159001.00000  160001.00000  2.915496695321e-07
160001.00000  161001.00000  2.312290482496e-07
161001.00000  162001.00000  2.312290482496e-07
162001.00000  163001.00000  2.513359220105e-07
163001.00000  164001.00000  2.010687376084e-07
164001.00000  165001.00000  2.312290482496e-07
165001.00000  166001.00000  2.312290482496e-07
166001.00000  167001.00000  1.508015532063e-07
167001.00000  168001.00000  2.010687376084e-07
168001.00000  169001.00000  2.111221744888e-07
169001.00000  170001.00000  1.407481163259e-07
170001.00000  171001.00000  1.910153007279e-07
171001.00000  172001.00000  1.608549900867e-07
172001.00000  173001.00000  1.306946794454e-07
173001.00000  174001.00000  1.206412425650e-07
174001.00000  175001.00000  1.306946794454e-07
175001.00000  176001.00000  2.211756113692e-07
176001.00000  177001.00000  1.809618638475e-07
177001.00000  178001.00000  2.312290482496e-07
178001.00000  179001.00000  7.037405816293e-08
179001.00000  180001.00000  1.306946794454e-07
180001.00000  181001.00000  6.032062128251e-08
181001.00000  182001.00000  9.048093192376e-08
182001.00000  183001.00000  1.508015532063e-07
183001.00000  184001.00000  1.105878056846e-07
184001.00000  185001.00000  1.206412425650e-07
185001.00000  186001.00000  1.105878056846e-07
186001.00000  187001.00000  1.105878056846e-07
187001.00000  188001.00000  1.105878056846e-07
188001.00000  189001.00000  9.048093192376e-08
189001.00000  190001.00000  6.032062128251e-08
190001.00000  191001.00000  1.005343688042e-07
191001.00000  192001.00000  1.105878056846e-07
192001.00000  193001.00000  1.206412425650e-07
193001.00000  194001.00000  1.206412425650e-07
194001.00000  195001.00000  6.032062128251e-08
195001.00000  196001.00000  9.048093192376e-08
196001.00000  197001.00000  5.026718440209e-08
197001.00000  198001.00000  1.005343688042e-07
198001.00000  199001.00000  9.048093192376e-08
