10001.00000  11001.00000  1.260373133178e-05
11001.00000  12001.00000  1.176283821379e-05
12001.00000  13001.00000  1.045800406518e-05
13001.00000  14001.00000  9.588114632768e-06
14001.00000  15001.00000  8.921199401255e-06
15001.00000  16001.00000  7.973986463743e-06
16001.00000  17001.00000  6.997777211818e-06
17001.00000  18001.00000  6.630490562579e-06
18001.00000  19001.00000  6.524170743063e-06
19001.00000  20001.00000  6.214876722651e-06
20001.00000  21001.00000  5.277329223277e-06
21001.00000  22001.00000  4.910042574038e-06
22001.00000  23001.00000  4.900377135900e-06
23001.00000  24001.00000  4.272123656939e-06
24001.00000  25001.00000  4.185134713698e-06
25001.00000  26001.00000  3.769520873770e-06
26001.00000  27001.00000  3.634204739839e-06
27001.00000  28001.00000  3.305579843152e-06
28001.00000  29001.00000  3.121936518532e-06
29001.00000  30001.00000  2.715988116742e-06
30001.00000  31001.00000  2.754649869293e-06
31001.00000  32001.00000  2.542010230260e-06
32001.00000  33001.00000  2.194054457297e-06
33001.00000  34001.00000  2.300374276813e-06
34001.00000  35001.00000  2.426024972606e-06
35001.00000  36001.00000  1.778440617368e-06
36001.00000  37001.00000  1.971749380126e-06
37001.00000  38001.00000  1.875094998747e-06
38001.00000  39001.00000  1.768775179230e-06
39001.00000  40001.00000  1.459481158818e-06
40001.00000  41001.00000  1.527139225784e-06
41001.00000  42001.00000  1.527139225784e-06
42001.00000  43001.00000  1.372492215578e-06
43001.00000  44001.00000  1.159852576544e-06
44001.00000  45001.00000  1.140521700269e-06
45001.00000  46001.00000  1.246841519785e-06
46001.00000  47001.00000  1.130856262131e-06
47001.00000  48001.00000  1.159852576544e-06
48001.00000  49001.00000  1.082529071442e-06
49001.00000  50001.00000  1.053532757028e-06
50001.00000  51001.00000  1.063198195166e-06
51001.00000  52001.00000  9.278820612356e-07
52001.00000  53001.00000  9.858746900628e-07
53001.00000  54001.00000  1.005205566339e-06
54001.00000  55001.00000  1.024536442614e-06
55001.00000  56001.00000  8.312276798569e-07
56001.00000  57001.00000  7.345732984782e-07
57001.00000  58001.00000  7.345732984782e-07
58001.00000  59001.00000  6.862461077888e-07
59001.00000  60001.00000  6.475843552373e-07
60001.00000  61001.00000  7.345732984782e-07
61001.00000  62001.00000  6.572497933752e-07
62001.00000  63001.00000  5.799262882722e-07
63001.00000  64001.00000  6.765806696509e-07
64001.00000  65001.00000  5.315990975829e-07
65001.00000  66001.00000  7.152424222024e-07
66001.00000  67001.00000  4.929373450314e-07
67001.00000  68001.00000  4.832719068935e-07
68001.00000  69001.00000  5.026027831693e-07
69001.00000  70001.00000  4.639410306178e-07
70001.00000  71001.00000  5.315990975829e-07
71001.00000  72001.00000  4.252792780663e-07
72001.00000  73001.00000  4.156138399284e-07
73001.00000  74001.00000  3.576212111012e-07
74001.00000  75001.00000  4.156138399284e-07
75001.00000  76001.00000  3.962829636527e-07
76001.00000  77001.00000  3.092940204119e-07
77001.00000  78001.00000  3.672866492391e-07
78001.00000  79001.00000  3.382903348255e-07
79001.00000  80001.00000  3.092940204119e-07
80001.00000  81001.00000  3.286248966876e-07
81001.00000  82001.00000  3.286248966876e-07
82001.00000  83001.00000  3.189594585497e-07
83001.00000  84001.00000  3.092940204119e-07
84001.00000  85001.00000  2.802977059982e-07
85001.00000  86001.00000  2.319705153089e-07
86001.00000  87001.00000  3.189594585497e-07
87001.00000  88001.00000  2.223050771710e-07
88001.00000  89001.00000  2.706322678604e-07
89001.00000  90001.00000  1.933087627574e-07
90001.00000  91001.00000  1.933087627574e-07
91001.00000  92001.00000  2.802977059982e-07
92001.00000  93001.00000  1.836433246195e-07
93001.00000  94001.00000  2.899631441361e-07
94001.00000  95001.00000  2.513013915846e-07
95001.00000  96001.00000  2.126396390332e-07
96001.00000  97001.00000  2.029742008953e-07
97001.00000  98001.00000  2.126396390332e-07
98001.00000  99001.00000  1.643124483438e-07
99001.00000  100001.00000  1.739778864817e-07
100001.00000  101001.00000  2.029742008953e-07
101001.00000  102001.00000  1.159852576544e-07
102001.00000  103001.00000  1.643124483438e-07
103001.00000  104001.00000  1.449815720681e-07
104001.00000  105001.00000  2.223050771710e-07
105001.00000  106001.00000  9.665438137871e-08
106001.00000  107001.00000  1.159852576544e-07
107001.00000  108001.00000  1.159852576544e-07
108001.00000  109001.00000  2.029742008953e-07
109001.00000  110001.00000  1.063198195166e-07
110001.00000  111001.00000  1.256506957923e-07
111001.00000  112001.00000  7.732350510296e-08
112001.00000  113001.00000  9.665438137871e-08
113001.00000  114001.00000  1.449815720681e-07
114001.00000  115001.00000  1.546470102059e-07
115001.00000  116001.00000  1.353161339302e-07
116001.00000  117001.00000  1.449815720681e-07
117001.00000  118001.00000  1.159852576544e-07
118001.00000  119001.00000  1.159852576544e-07
119001.00000  120001.00000  8.698894324084e-08
120001.00000  121001.00000  1.256506957923e-07
121001.00000  122001.00000  1.063198195166e-07
122001.00000  123001.00000  1.449815720681e-07
123001.00000  124001.00000  1.256506957923e-07
124001.00000  125001.00000  9.665438137871e-08
125001.00000  126001.00000  9.665438137871e-08
126001.00000  127001.00000  7.732350510296e-08
127001.00000  128001.00000  5.799262882722e-08
128001.00000  129001.00000  1.063198195166e-07
129001.00000  130001.00000  8.698894324084e-08
130001.00000  131001.00000  9.665438137871e-08
131001.00000  132001.00000  4.832719068935e-08
132001.00000  133001.00000  8.698894324084e-08
133001.00000  134001.00000  1.159852576544e-07
134001.00000  135001.00000  7.732350510296e-08
135001.00000  136001.00000  4.832719068935e-08
136001.00000  137001.00000  9.665438137871e-08
137001.00000  138001.00000  1.933087627574e-08
138001.00000  139001.00000  6.765806696509e-08
139001.00000  140001.00000  7.732350510296e-08
140001.00000  141001.00000  4.832719068935e-08
141001.00000  142001.00000  6.765806696509e-08
142001.00000  143001.00000  3.866175255148e-08
143001.00000  144001.00000  7.732350510296e-08
144001.00000  145001.00000  4.832719068935e-08
145001.00000  146001.00000  8.698894324084e-08
146001.00000  147001.00000  1.063198195166e-07
147001.00000  148001.00000  7.732350510296e-08
148001.00000  149001.00000  8.698894324084e-08
149001.00000  150001.00000  4.832719068935e-08
150001.00000  151001.00000  1.933087627574e-08
151001.00000  152001.00000  7.732350510296e-08
152001.00000  153001.00000  3.866175255148e-08
153001.00000  154001.00000  4.832719068935e-08
154001.00000  155001.00000  7.732350510296e-08
155001.00000  156001.00000  6.765806696509e-08
156001.00000  157001.00000  6.765806696509e-08
157001.00000  158001.00000  3.866175255148e-08
158001.00000  159001.00000  3.866175255148e-08
159001.00000  160001.00000  1.933087627574e-08
160001.00000  161001.00000  3.866175255148e-08
161001.00000  162001.00000  4.832719068935e-08
162001.00000  163001.00000  2.899631441361e-08
163001.00000  164001.00000  1.933087627574e-08
164001.00000  165001.00000  6.765806696509e-08
165001.00000  166001.00000  2.899631441361e-08
166001.00000  167001.00000  1.933087627574e-08
167001.00000  168001.00000  6.765806696509e-08
168001.00000  169001.00000  4.832719068935e-08
169001.00000  170001.00000  5.799262882722e-08
170001.00000  171001.00000  9.665438137871e-09
171001.00000  172001.00000  2.899631441361e-08
172001.00000  173001.00000  9.665438137871e-09
173001.00000  174001.00000  0.000000000000e+00
174001.00000  175001.00000  1.933087627574e-08
175001.00000  176001.00000  1.933087627574e-08
176001.00000  177001.00000  1.933087627574e-08
177001.00000  178001.00000  0.000000000000e+00
178001.00000  179001.00000  0.000000000000e+00
179001.00000  180001.00000  0.000000000000e+00
180001.00000  181001.00000  0.000000000000e+00
181001.00000  182001.00000  9.665438137871e-09
182001.00000  183001.00000  9.665438137871e-09
183001.00000  184001.00000  0.000000000000e+00
184001.00000  185001.00000  0.000000000000e+00
185001.00000  186001.00000  0.000000000000e+00
186001.00000  187001.00000  0.000000000000e+00
187001.00000  188001.00000  0.000000000000e+00
188001.00000  189001.00000  0.000000000000e+00
189001.00000  190001.00000  0.000000000000e+00
190001.00000  191001.00000  0.000000000000e+00
191001.00000  192001.00000  0.000000000000e+00
192001.00000  193001.00000  0.000000000000e+00
193001.00000  194001.00000  0.000000000000e+00
194001.00000  195001.00000  0.000000000000e+00
195001.00000  196001.00000  0.000000000000e+00
196001.00000  197001.00000  0.000000000000e+00
197001.00000  198001.00000  0.000000000000e+00
198001.00000  199001.00000  0.000000000000e+00
