300.00000  350.00000  9.648100398829e-07
350.00000  400.00000  2.315544095719e-06
400.00000  450.00000  2.315544095719e-06
450.00000  500.00000  3.087392127625e-06
500.00000  550.00000  3.492612344376e-05
550.00000  600.00000  1.929620079766e-06
600.00000  650.00000  1.292845453443e-05
650.00000  700.00000  4.631088191438e-06
700.00000  750.00000  7.718480319064e-06
750.00000  800.00000  5.981822247274e-06
800.00000  850.00000  3.261057934804e-05
850.00000  900.00000  5.981822247274e-06
900.00000  950.00000  5.402936223344e-06
950.00000  1000.00000  6.946632287157e-06
1000.00000  1050.00000  1.292845453443e-05
1050.00000  1100.00000  1.891027678171e-05
1100.00000  1150.00000  2.547098505291e-05
1150.00000  1200.00000  4.650384392236e-05
1200.00000  1250.00000  7.930738527838e-05
1250.00000  1300.00000  1.645965928040e-04
1300.00000  1350.00000  1.453003920064e-04
1350.00000  1400.00000  2.357995737474e-04
1400.00000  1450.00000  3.062307066588e-04
1450.00000  1500.00000  4.355152520032e-04
1500.00000  1550.00000  5.601687091560e-04
1550.00000  1600.00000  6.871377104046e-04
1600.00000  1650.00000  8.469102530092e-04
1650.00000  1700.00000  1.019418288140e-03
1700.00000  1750.00000  1.275864796741e-03
1750.00000  1800.00000  1.342243727485e-03
1800.00000  1850.00000  1.441040275569e-03
1850.00000  1900.00000  1.489473739571e-03
1900.00000  1950.00000  1.622424563067e-03
1950.00000  2000.00000  1.770233461177e-03
2000.00000  2050.00000  1.928076383702e-03
2050.00000  2100.00000  2.069517535549e-03
2100.00000  2150.00000  2.189346942502e-03
2150.00000  2200.00000  2.274250226012e-03
2200.00000  2250.00000  2.459493753670e-03
2250.00000  2300.00000  2.560605845849e-03
2300.00000  2350.00000  2.764180764265e-03
2350.00000  2400.00000  2.713045832151e-03
2400.00000  2450.00000  2.799878735740e-03
2450.00000  2500.00000  2.769583700488e-03
2500.00000  2550.00000  2.707256971912e-03
2550.00000  2600.00000  2.756655245954e-03
2600.00000  2650.00000  2.793318027469e-03
2650.00000  2700.00000  2.841944453479e-03
2700.00000  2750.00000  2.878800197003e-03
2750.00000  2800.00000  2.942863583651e-03
2800.00000  2850.00000  2.945372089755e-03
2850.00000  2900.00000  2.951546874010e-03
2900.00000  2950.00000  2.948652443890e-03
2950.00000  3000.00000  3.055167472293e-03
3000.00000  3050.00000  2.943828393691e-03
3050.00000  3100.00000  2.980877099222e-03
3100.00000  3150.00000  2.960809050393e-03
3150.00000  3200.00000  2.965247176576e-03
3200.00000  3250.00000  2.936881761404e-03
3250.00000  3300.00000  2.906200802135e-03
3300.00000  3350.00000  2.859311034197e-03
3350.00000  3400.00000  2.862977312349e-03
3400.00000  3450.00000  2.873011336763e-03
3450.00000  3500.00000  2.867222476524e-03
3500.00000  3550.00000  2.775565522735e-03
3550.00000  3600.00000  2.827665264889e-03
3600.00000  3650.00000  2.774021826671e-03
3650.00000  3700.00000  2.761672258161e-03
3700.00000  3750.00000  2.761286334145e-03
3750.00000  3800.00000  2.734078691020e-03
3800.00000  3850.00000  2.681207100835e-03
3850.00000  3900.00000  2.673295658508e-03
3900.00000  3950.00000  2.644158395303e-03
3950.00000  4000.00000  2.569482098216e-03
4000.00000  4050.00000  2.555588833642e-03
4050.00000  4100.00000  2.538415214932e-03
4100.00000  4150.00000  2.521434558230e-03
4150.00000  4200.00000  2.482070308603e-03
4200.00000  4250.00000  2.475895524348e-03
4250.00000  4300.00000  2.457757095598e-03
4300.00000  4350.00000  2.376327128232e-03
4350.00000  4400.00000  2.364556445745e-03
4400.00000  4450.00000  2.367257913857e-03
4450.00000  4500.00000  2.326928854190e-03
4500.00000  4550.00000  2.279460200227e-03
4550.00000  4600.00000  2.265759897661e-03
4600.00000  4650.00000  2.229290078154e-03
4650.00000  4700.00000  2.240481874616e-03
4700.00000  4750.00000  2.171787399776e-03
4750.00000  4800.00000  2.150368616891e-03
4800.00000  4850.00000  2.127406137942e-03
4850.00000  4900.00000  2.094795558594e-03
4900.00000  4950.00000  2.085726344219e-03
4950.00000  5000.00000  2.060062397158e-03
5000.00000  5050.00000  2.051186144791e-03
5050.00000  5100.00000  1.987122758143e-03
5100.00000  5150.00000  2.001208984725e-03
5150.00000  5200.00000  1.988473492199e-03
5200.00000  5250.00000  1.957985494938e-03
5250.00000  5300.00000  1.950459976627e-03
5300.00000  5350.00000  1.910130916960e-03
5350.00000  5400.00000  1.888326210059e-03
5400.00000  5450.00000  1.851470466535e-03
5450.00000  5500.00000  1.850505656495e-03
5500.00000  5550.00000  1.770040499169e-03
5550.00000  5600.00000  1.774285663345e-03
5600.00000  5650.00000  1.781811181656e-03
5650.00000  5700.00000  1.742446932029e-03
5700.00000  5750.00000  1.720835187135e-03
5750.00000  5800.00000  1.688803493811e-03
5800.00000  5850.00000  1.681856861524e-03
5850.00000  5900.00000  1.693627544011e-03
5900.00000  5950.00000  1.599269122110e-03
5950.00000  6000.00000  1.608338336485e-03
6000.00000  6050.00000  1.595988767974e-03
6050.00000  6100.00000  1.614320158732e-03
6100.00000  6150.00000  1.575148871113e-03
6150.00000  6200.00000  1.579201073280e-03
6200.00000  6250.00000  1.559518948467e-03
6250.00000  6300.00000  1.548520114012e-03
6300.00000  6350.00000  1.521119508879e-03
6350.00000  6400.00000  2.043467664472e-03
6400.00000  6450.00000  1.470563462790e-03
6450.00000  6500.00000  1.487351157484e-03
6500.00000  6550.00000  1.429848479107e-03
6550.00000  6600.00000  1.423866656859e-03
6600.00000  6650.00000  1.421165188748e-03
6650.00000  6700.00000  1.388747571408e-03
6700.00000  6750.00000  1.381993901128e-03
6750.00000  6800.00000  1.316965704440e-03
6800.00000  6850.00000  1.333174513110e-03
6850.00000  6900.00000  1.351505903868e-03
6900.00000  6950.00000  1.343594461541e-03
6950.00000  7000.00000  1.288407327260e-03
7000.00000  7050.00000  1.298827275690e-03
7050.00000  7100.00000  1.351698865876e-03
7100.00000  7150.00000  1.201574423670e-03
7150.00000  7200.00000  1.173209008498e-03
7200.00000  7250.00000  1.217397308324e-03
7250.00000  7300.00000  1.157579085852e-03
7300.00000  7350.00000  1.151983187620e-03
7350.00000  7400.00000  1.148509871477e-03
7400.00000  7450.00000  1.149474681517e-03
7450.00000  7500.00000  1.154684655732e-03
7500.00000  7550.00000  1.130178480719e-03
7550.00000  7600.00000  1.107408963778e-03
7600.00000  7650.00000  1.071325068286e-03
7650.00000  7700.00000  1.087533876956e-03
7700.00000  7750.00000  1.070553220254e-03
7750.00000  7800.00000  1.053379601544e-03
7800.00000  7850.00000  1.055888107648e-03
7850.00000  7900.00000  1.028680464523e-03
7900.00000  7950.00000  1.028294540507e-03
7950.00000  8000.00000  1.006875757622e-03
8000.00000  8050.00000  9.983854292709e-04
8050.00000  8100.00000  1.004367251518e-03
8100.00000  8150.00000  9.958769231672e-04
8150.00000  8200.00000  9.958769231672e-04
8200.00000  8250.00000  9.978065432469e-04
8250.00000  8300.00000  9.798610765051e-04
8300.00000  8350.00000  9.883514048561e-04
8350.00000  8400.00000  9.621085717713e-04
8400.00000  8450.00000  9.287261443913e-04
8450.00000  8500.00000  9.484082692049e-04
8500.00000  8550.00000  9.321994605349e-04
8550.00000  8600.00000  9.219724741121e-04
8600.00000  8650.00000  9.105877156415e-04
8650.00000  8700.00000  8.957296410273e-04
8700.00000  8750.00000  9.073073615059e-04
8750.00000  8800.00000  9.258317142717e-04
8800.00000  8850.00000  9.080792095378e-04
8850.00000  8900.00000  8.663994158149e-04
8900.00000  8950.00000  8.719953140462e-04
8950.00000  9000.00000  8.451735949375e-04
9000.00000  9050.00000  8.710305040063e-04
9050.00000  9100.00000  8.420862028098e-04
9100.00000  9150.00000  8.293507102834e-04
9150.00000  9200.00000  8.189307618526e-04
9200.00000  9250.00000  8.135278256293e-04
9250.00000  9300.00000  8.166152177569e-04
9300.00000  9350.00000  7.896005366402e-04
9350.00000  9400.00000  7.957753208954e-04
9400.00000  9450.00000  8.011782571188e-04
9450.00000  9500.00000  7.770580061217e-04
9500.00000  9550.00000  7.880568405764e-04
9550.00000  9600.00000  7.737776519861e-04
9600.00000  9650.00000  7.857412964807e-04
9650.00000  9700.00000  7.542884891805e-04
9700.00000  9750.00000  7.627788175315e-04
9750.00000  9800.00000  7.623928935155e-04
9800.00000  9850.00000  7.477277809093e-04
9850.00000  9900.00000  7.365359844466e-04
9900.00000  9950.00000  7.230286438883e-04
9950.00000  10000.00000  7.313260102313e-04
