300.00000  350.00000  2.149478875777e-06
350.00000  400.00000  4.657204230850e-06
400.00000  450.00000  2.865971834369e-06
450.00000  500.00000  2.865971834369e-06
500.00000  550.00000  2.901796482299e-05
550.00000  600.00000  2.149478875777e-06
600.00000  650.00000  1.182213381677e-05
650.00000  700.00000  1.432985917185e-06
700.00000  750.00000  7.164929585923e-06
750.00000  800.00000  2.507725355073e-06
800.00000  850.00000  2.507725355073e-05
850.00000  900.00000  2.507725355073e-06
900.00000  950.00000  3.224218313666e-06
950.00000  1000.00000  3.224218313666e-06
1000.00000  1050.00000  4.298957751554e-06
1050.00000  1100.00000  3.582464792962e-06
1100.00000  1150.00000  7.523176065220e-06
1150.00000  1200.00000  4.657204230850e-06
1200.00000  1250.00000  7.523176065220e-06
1250.00000  1300.00000  3.797412680539e-05
1300.00000  1350.00000  1.003090142029e-05
1350.00000  1400.00000  1.755407748551e-05
1400.00000  1450.00000  2.758497890580e-05
1450.00000  1500.00000  4.836327470498e-05
1500.00000  1550.00000  7.379877473501e-05
1550.00000  1600.00000  1.028167395580e-04
1600.00000  1650.00000  1.504635213044e-04
1650.00000  1700.00000  2.020510143230e-04
1700.00000  1750.00000  3.174063806564e-04
1750.00000  1800.00000  3.517980426688e-04
1800.00000  1850.00000  4.169989019007e-04
1850.00000  1900.00000  4.220143526109e-04
1900.00000  1950.00000  5.513413316368e-04
1950.00000  2000.00000  6.713539022010e-04
2000.00000  2050.00000  7.713046699247e-04
2050.00000  2100.00000  8.902425010510e-04
2100.00000  2150.00000  9.891185293367e-04
2150.00000  2200.00000  1.084053846350e-03
2200.00000  2250.00000  1.277148698691e-03
2250.00000  2300.00000  1.417939565054e-03
2300.00000  2350.00000  1.601003515975e-03
2350.00000  2400.00000  1.624289537129e-03
2400.00000  2450.00000  1.792665382398e-03
2450.00000  2500.00000  1.713492910474e-03
2500.00000  2550.00000  1.737495424586e-03
2550.00000  2600.00000  1.824191072576e-03
2600.00000  2650.00000  1.835654959914e-03
2650.00000  2700.00000  2.043079671426e-03
2700.00000  2750.00000  2.048453368615e-03
2750.00000  2800.00000  2.122252143351e-03
2800.00000  2850.00000  2.149837122256e-03
2850.00000  2900.00000  2.256594573087e-03
2900.00000  2950.00000  2.277014622406e-03
2950.00000  3000.00000  2.348305671786e-03
3000.00000  3050.00000  2.361919038000e-03
3050.00000  3100.00000  2.396310700012e-03
3100.00000  3150.00000  2.469392981788e-03
3150.00000  3200.00000  2.453988383179e-03
3200.00000  3250.00000  2.466885256433e-03
3250.00000  3300.00000  2.501993411404e-03
3300.00000  3350.00000  2.500202179008e-03
3350.00000  3400.00000  2.514173791701e-03
3400.00000  3450.00000  2.502709904363e-03
3450.00000  3500.00000  2.520622228328e-03
3500.00000  3550.00000  2.528503650872e-03
3550.00000  3600.00000  2.509516587470e-03
3600.00000  3650.00000  2.521696967766e-03
3650.00000  3700.00000  2.530294883269e-03
3700.00000  3750.00000  2.477990897292e-03
3750.00000  3800.00000  2.435001319776e-03
3800.00000  3850.00000  2.460078573327e-03
3850.00000  3900.00000  2.476557911374e-03
3900.00000  3950.00000  2.465094024037e-03
3950.00000  4000.00000  2.507725355073e-03
4000.00000  4050.00000  2.431777101462e-03
4050.00000  4100.00000  2.382339087320e-03
4100.00000  4150.00000  2.362635530958e-03
4150.00000  4200.00000  2.330393347822e-03
4200.00000  4250.00000  2.296359932288e-03
4250.00000  4300.00000  2.311764530898e-03
4300.00000  4350.00000  2.319287706963e-03
4350.00000  4400.00000  2.280238840720e-03
4400.00000  4450.00000  2.255161587169e-03
4450.00000  4500.00000  2.195334425127e-03
4500.00000  4550.00000  2.175989115245e-03
4550.00000  4600.00000  2.201782861754e-03
4600.00000  4650.00000  2.115803706723e-03
4650.00000  4700.00000  2.121535650392e-03
4700.00000  4750.00000  2.124401622226e-03
4750.00000  4800.00000  2.077471333438e-03
4800.00000  4850.00000  2.073888868646e-03
4850.00000  4900.00000  2.062783227787e-03
4900.00000  4950.00000  2.030899291130e-03
4950.00000  5000.00000  1.967131417815e-03
5000.00000  5050.00000  1.983969002342e-03
5050.00000  5100.00000  1.995432889680e-03
5100.00000  5150.00000  1.940979424827e-03
5150.00000  5200.00000  1.889391931808e-03
5200.00000  5250.00000  1.854283776837e-03
5250.00000  5300.00000  1.805562255653e-03
5300.00000  5350.00000  1.855358516275e-03
5350.00000  5400.00000  1.830281262724e-03
5400.00000  5450.00000  1.794814861274e-03
5450.00000  5500.00000  1.774036565475e-03
5500.00000  5550.00000  1.709193952722e-03
5550.00000  5600.00000  1.728181016125e-03
5600.00000  5650.00000  1.692714614674e-03
5650.00000  5700.00000  1.692356368195e-03
5700.00000  5750.00000  1.653665748431e-03
5750.00000  5800.00000  1.641843614614e-03
5800.00000  5850.00000  1.616766361064e-03
5850.00000  5900.00000  1.660114185058e-03
5900.00000  5950.00000  1.607451952602e-03
5950.00000  6000.00000  1.583449438489e-03
6000.00000  6050.00000  1.561596403252e-03
6050.00000  6100.00000  1.558730431418e-03
6100.00000  6150.00000  1.483498670765e-03
6150.00000  6200.00000  1.479916205972e-03
6200.00000  6250.00000  1.540459860974e-03
6250.00000  6300.00000  1.503560473606e-03
6300.00000  6350.00000  1.494604311624e-03
6350.00000  6400.00000  2.527428911434e-03
6400.00000  6450.00000  1.431194684788e-03
6450.00000  6500.00000  1.388563353752e-03
6500.00000  6550.00000  1.406117431237e-03
6550.00000  6600.00000  1.373158755142e-03
6600.00000  6650.00000  1.343782543840e-03
6650.00000  6700.00000  1.343424297361e-03
6700.00000  6750.00000  1.303300691679e-03
6750.00000  6800.00000  1.244906515554e-03
6800.00000  6850.00000  1.235592107092e-03
6850.00000  6900.00000  1.238458078927e-03
6900.00000  6950.00000  1.224128219755e-03
6950.00000  7000.00000  1.212664332418e-03
7000.00000  7050.00000  1.240249311323e-03
7050.00000  7100.00000  1.343782543840e-03
7100.00000  7150.00000  1.087636311143e-03
7150.00000  7200.00000  9.991494307570e-04
7200.00000  7250.00000  1.013479289929e-03
7250.00000  7300.00000  1.009180332177e-03
7300.00000  7350.00000  1.019211233598e-03
7350.00000  7400.00000  9.783711349578e-04
7400.00000  7450.00000  9.884020363781e-04
7450.00000  7500.00000  9.747886701649e-04
7500.00000  7550.00000  9.701314659340e-04
7550.00000  7600.00000  9.604588109930e-04
7600.00000  7650.00000  9.590258250758e-04
7650.00000  7700.00000  9.794458743957e-04
7700.00000  7750.00000  9.002734024713e-04
7750.00000  7800.00000  9.579510856380e-04
7800.00000  7850.00000  9.264253954599e-04
7850.00000  7900.00000  9.275001348978e-04
7900.00000  7950.00000  9.264253954599e-04
7950.00000  8000.00000  8.877347756959e-04
8000.00000  8050.00000  8.780621207549e-04
8050.00000  8100.00000  8.805698461100e-04
8100.00000  8150.00000  8.716136841276e-04
8150.00000  8200.00000  8.515518812870e-04
8200.00000  8250.00000  8.569255784764e-04
8250.00000  8300.00000  8.443869517011e-04
8300.00000  8350.00000  8.372220221151e-04
8350.00000  8400.00000  7.978149093926e-04
8400.00000  8450.00000  7.806190783864e-04
8450.00000  8500.00000  7.953071840375e-04
8500.00000  8550.00000  7.859927755758e-04
8550.00000  8600.00000  7.978149093926e-04
8600.00000  8650.00000  7.777531065520e-04
8650.00000  8700.00000  7.881422544516e-04
8700.00000  8750.00000  7.838432967000e-04
8750.00000  8800.00000  7.759618741555e-04
8800.00000  8850.00000  7.627067544215e-04
8850.00000  8900.00000  7.254491205747e-04
8900.00000  8950.00000  7.211501628232e-04
8950.00000  9000.00000  7.311810642435e-04
9000.00000  9050.00000  7.379877473501e-04
9050.00000  9100.00000  7.200754233853e-04
9100.00000  9150.00000  7.132687402787e-04
9150.00000  9200.00000  6.982223881482e-04
9200.00000  9250.00000  7.164929585923e-04
9250.00000  9300.00000  7.150599726752e-04
9300.00000  9350.00000  6.949981698346e-04
9350.00000  9400.00000  6.713539022010e-04
9400.00000  9450.00000  6.792353247455e-04
9450.00000  9500.00000  6.649054655737e-04
9500.00000  9550.00000  6.842507754557e-04
9550.00000  9600.00000  6.534415782362e-04
9600.00000  9650.00000  6.473513880882e-04
9650.00000  9700.00000  6.265730922890e-04
9700.00000  9750.00000  6.745781205147e-04
9750.00000  9800.00000  6.509338528811e-04
9800.00000  9850.00000  6.495008669640e-04
9850.00000  9900.00000  6.315885429991e-04
9900.00000  9950.00000  6.126014795964e-04
9950.00000  10000.00000  6.040035640933e-04
