10001.00000  11001.00000  9.106698116959e-04
11001.00000  12001.00000  7.653060968579e-04
12001.00000  13001.00000  6.519195774707e-04
13001.00000  14001.00000  5.620649683820e-04
14001.00000  15001.00000  4.893125656217e-04
15001.00000  16001.00000  4.346399260629e-04
16001.00000  17001.00000  3.814890502964e-04
17001.00000  18001.00000  3.383253792862e-04
18001.00000  19001.00000  2.997975449944e-04
19001.00000  20001.00000  2.714181619534e-04
20001.00000  21001.00000  2.478862516548e-04
21001.00000  22001.00000  2.209883207825e-04
22001.00000  23001.00000  2.010441449877e-04
23001.00000  24001.00000  1.826922783266e-04
24001.00000  25001.00000  1.672932380969e-04
25001.00000  26001.00000  1.520655222677e-04
26001.00000  27001.00000  1.396596200932e-04
27001.00000  28001.00000  1.283018201332e-04
28001.00000  29001.00000  1.159362295823e-04
29001.00000  30001.00000  1.079444501961e-04
30001.00000  31001.00000  1.009604614009e-04
31001.00000  32001.00000  9.379507029928e-05
32001.00000  33001.00000  8.578313510126e-05
33001.00000  34001.00000  8.166127158430e-05
34001.00000  35001.00000  7.402221890493e-05
35001.00000  36001.00000  6.871116249065e-05
36001.00000  37001.00000  6.447844200868e-05
37001.00000  38001.00000  6.096125284628e-05
38001.00000  39001.00000  5.591222198564e-05
39001.00000  40001.00000  5.321134320191e-05
40001.00000  41001.00000  4.921041455586e-05
41001.00000  42001.00000  4.630797765394e-05
42001.00000  43001.00000  4.414122788340e-05
43001.00000  44001.00000  3.998913064871e-05
44001.00000  45001.00000  3.894102843413e-05
45001.00000  46001.00000  3.641147405085e-05
46001.00000  47001.00000  3.568586482537e-05
47001.00000  48001.00000  3.259194771117e-05
48001.00000  49001.00000  2.967943290334e-05
49001.00000  50001.00000  2.842977257057e-05
50001.00000  51001.00000  2.731112501462e-05
51001.00000  52001.00000  2.609169839957e-05
52001.00000  53001.00000  2.440868811269e-05
53001.00000  54001.00000  2.373346841676e-05
54001.00000  55001.00000  2.213108137716e-05
55001.00000  56001.00000  2.063955130256e-05
56001.00000  57001.00000  1.942012468752e-05
57001.00000  58001.00000  1.853326896748e-05
58001.00000  59001.00000  1.760610162381e-05
59001.00000  60001.00000  1.656807731514e-05
60001.00000  61001.00000  1.578200065420e-05
61001.00000  62001.00000  1.529826117055e-05
62001.00000  63001.00000  1.421992523824e-05
63001.00000  64001.00000  1.304081024683e-05
64001.00000  65001.00000  1.289971956410e-05
65001.00000  66001.00000  1.230512311544e-05
66001.00000  67001.00000  1.202294174998e-05
67001.00000  68001.00000  1.131748833632e-05
68001.00000  69001.00000  1.072289188766e-05
69001.00000  70001.00000  9.997282662177e-06
70001.00000  71001.00000  9.644555955346e-06
71001.00000  72001.00000  9.019725788960e-06
72001.00000  73001.00000  8.546064211216e-06
73001.00000  74001.00000  8.425129340303e-06
74001.00000  75001.00000  8.011935198015e-06
75001.00000  76001.00000  8.243727033932e-06
76001.00000  77001.00000  6.762274865243e-06
77001.00000  78001.00000  7.044456230708e-06
78001.00000  79001.00000  6.732041147515e-06
79001.00000  80001.00000  6.651417900239e-06
80001.00000  81001.00000  6.238223757951e-06
81001.00000  82001.00000  5.966120298396e-06
82001.00000  83001.00000  5.300978508372e-06
83001.00000  84001.00000  5.119576202002e-06
84001.00000  85001.00000  5.079264578364e-06
85001.00000  86001.00000  5.220355261097e-06
86001.00000  87001.00000  4.716459965624e-06
87001.00000  88001.00000  4.655992530167e-06
88001.00000  89001.00000  4.091629799238e-06
89001.00000  90001.00000  4.232720481970e-06
90001.00000  91001.00000  3.829604245592e-06
91001.00000  92001.00000  3.829604245592e-06
92001.00000  93001.00000  3.325708950119e-06
93001.00000  94001.00000  3.164462455568e-06
94001.00000  95001.00000  3.093917114202e-06
95001.00000  96001.00000  3.456721726942e-06
96001.00000  97001.00000  3.416410103305e-06
97001.00000  98001.00000  3.224929891025e-06
98001.00000  99001.00000  2.741190407371e-06
99001.00000  100001.00000  2.630333442367e-06
100001.00000  101001.00000  2.630333442367e-06
101001.00000  102001.00000  2.217139300080e-06
102001.00000  103001.00000  2.459009041907e-06
103001.00000  104001.00000  2.166749770532e-06
104001.00000  105001.00000  2.086126523257e-06
105001.00000  106001.00000  2.035736993709e-06
106001.00000  107001.00000  2.106282335076e-06
107001.00000  108001.00000  1.904724216887e-06
108001.00000  109001.00000  1.874490499158e-06
109001.00000  110001.00000  1.945035840524e-06
110001.00000  111001.00000  1.662854475060e-06
111001.00000  112001.00000  1.803945157792e-06
112001.00000  113001.00000  1.491530074599e-06
113001.00000  114001.00000  1.632620757331e-06
114001.00000  115001.00000  1.410906827323e-06
115001.00000  116001.00000  1.350439391867e-06
116001.00000  117001.00000  1.431062639142e-06
117001.00000  118001.00000  1.158959179587e-06
118001.00000  119001.00000  1.209348709134e-06
119001.00000  120001.00000  1.118647555949e-06
120001.00000  121001.00000  8.666999082129e-07
121001.00000  122001.00000  1.148881273678e-06
122001.00000  123001.00000  1.038024308674e-06
123001.00000  124001.00000  1.058180120493e-06
124001.00000  125001.00000  9.876347791264e-07
125001.00000  126001.00000  1.027946402764e-06
126001.00000  127001.00000  9.271673436697e-07
127001.00000  128001.00000  8.868557200319e-07
128001.00000  129001.00000  8.263882845751e-07
129001.00000  130001.00000  7.356871313901e-07
130001.00000  131001.00000  7.457650372995e-07
131001.00000  132001.00000  8.566220023035e-07
132001.00000  133001.00000  6.046743545672e-07
133001.00000  134001.00000  7.054534136617e-07
134001.00000  135001.00000  5.945964486577e-07
135001.00000  136001.00000  6.550638841144e-07
136001.00000  137001.00000  6.248301663861e-07
137001.00000  138001.00000  6.046743545672e-07
138001.00000  139001.00000  5.442069191105e-07
139001.00000  140001.00000  5.845185427483e-07
140001.00000  141001.00000  4.837394836537e-07
141001.00000  142001.00000  5.341290132010e-07
142001.00000  143001.00000  4.837394836537e-07
143001.00000  144001.00000  4.635836718348e-07
144001.00000  145001.00000  4.837394836537e-07
145001.00000  146001.00000  5.945964486577e-07
146001.00000  147001.00000  4.333499541065e-07
147001.00000  148001.00000  3.930383304687e-07
148001.00000  149001.00000  3.628046127403e-07
149001.00000  150001.00000  3.628046127403e-07
150001.00000  151001.00000  4.333499541065e-07
151001.00000  152001.00000  3.426488009214e-07
152001.00000  153001.00000  4.333499541065e-07
153001.00000  154001.00000  3.124150831930e-07
154001.00000  155001.00000  4.131941422876e-07
155001.00000  156001.00000  2.821813654647e-07
156001.00000  157001.00000  3.224929891025e-07
157001.00000  158001.00000  2.821813654647e-07
158001.00000  159001.00000  3.224929891025e-07
159001.00000  160001.00000  3.325708950119e-07
160001.00000  161001.00000  3.628046127403e-07
161001.00000  162001.00000  2.821813654647e-07
162001.00000  163001.00000  2.418697418269e-07
163001.00000  164001.00000  2.519476477363e-07
164001.00000  165001.00000  1.814023063702e-07
165001.00000  166001.00000  2.620255536458e-07
166001.00000  167001.00000  1.914802122796e-07
167001.00000  168001.00000  1.612464945512e-07
168001.00000  169001.00000  1.914802122796e-07
169001.00000  170001.00000  2.217139300080e-07
170001.00000  171001.00000  3.023371772836e-07
171001.00000  172001.00000  1.713244004607e-07
172001.00000  173001.00000  2.418697418269e-07
173001.00000  174001.00000  1.814023063702e-07
174001.00000  175001.00000  1.108569650040e-07
175001.00000  176001.00000  1.007790590945e-07
176001.00000  177001.00000  1.410906827323e-07
177001.00000  178001.00000  1.007790590945e-07
178001.00000  179001.00000  1.814023063702e-07
179001.00000  180001.00000  1.511685886418e-07
180001.00000  181001.00000  1.511685886418e-07
181001.00000  182001.00000  1.007790590945e-07
182001.00000  183001.00000  8.062324727562e-08
183001.00000  184001.00000  1.310127768229e-07
184001.00000  185001.00000  1.209348709134e-07
185001.00000  186001.00000  1.209348709134e-07
186001.00000  187001.00000  1.511685886418e-07
187001.00000  188001.00000  8.062324727562e-08
188001.00000  189001.00000  1.209348709134e-07
189001.00000  190001.00000  7.054534136617e-08
190001.00000  191001.00000  8.062324727562e-08
191001.00000  192001.00000  1.007790590945e-07
192001.00000  193001.00000  9.070115318508e-08
193001.00000  194001.00000  7.054534136617e-08
194001.00000  195001.00000  1.612464945512e-07
195001.00000  196001.00000  9.070115318508e-08
196001.00000  197001.00000  5.038952954726e-08
197001.00000  198001.00000  9.070115318508e-08
198001.00000  199001.00000  6.046743545672e-08
