300.00000  350.00000  9.288784442599e-05
350.00000  400.00000  9.228856801034e-05
400.00000  450.00000  9.428615606251e-05
450.00000  500.00000  7.910448686600e-05
500.00000  550.00000  1.132632425581e-04
550.00000  600.00000  4.734283683647e-05
600.00000  650.00000  6.452209408515e-05
650.00000  700.00000  4.514548997908e-05
700.00000  750.00000  4.514548997908e-05
750.00000  800.00000  4.055103745909e-05
800.00000  850.00000  7.670738120340e-05
850.00000  900.00000  3.595658493909e-05
900.00000  950.00000  3.136213241910e-05
950.00000  1000.00000  2.956430317214e-05
1000.00000  1050.00000  3.895296701735e-05
1050.00000  1100.00000  3.076285600345e-05
1100.00000  1150.00000  3.136213241910e-05
1150.00000  1200.00000  3.575682613388e-05
1200.00000  1250.00000  3.375923808170e-05
1250.00000  1300.00000  7.211292868340e-05
1300.00000  1350.00000  3.176165002953e-05
1350.00000  1400.00000  3.855344940692e-05
1400.00000  1450.00000  4.055103745909e-05
1450.00000  1500.00000  4.314790192691e-05
1500.00000  1550.00000  3.855344940692e-05
1550.00000  1600.00000  3.815393179648e-05
1600.00000  1650.00000  3.495779091301e-05
1650.00000  1700.00000  3.835369060170e-05
1700.00000  1750.00000  1.178576950781e-04
1750.00000  1800.00000  3.915272582257e-05
1800.00000  1850.00000  4.254862551126e-05
1850.00000  1900.00000  4.634404281039e-05
1900.00000  1950.00000  4.115031387474e-05
1950.00000  2000.00000  4.294814312169e-05
2000.00000  2050.00000  4.474597236865e-05
2050.00000  2100.00000  4.534524878430e-05
2100.00000  2150.00000  4.894090727821e-05
2150.00000  2200.00000  4.294814312169e-05
2200.00000  2250.00000  4.614428400517e-05
2250.00000  2300.00000  4.774235444691e-05
2300.00000  2350.00000  1.518166919651e-04
2350.00000  2400.00000  5.273632457734e-05
2400.00000  2450.00000  5.613222426603e-05
2450.00000  2500.00000  5.912860634429e-05
2500.00000  2550.00000  5.073873652516e-05
2550.00000  2600.00000  5.033921891473e-05
2600.00000  2650.00000  5.832957112342e-05
2650.00000  2700.00000  4.834163086256e-05
2700.00000  2750.00000  5.513343023994e-05
2750.00000  2800.00000  5.952812395472e-05
2800.00000  2850.00000  5.253656577212e-05
2850.00000  2900.00000  6.012740037037e-05
2900.00000  2950.00000  5.793005351298e-05
2950.00000  3000.00000  1.026760258816e-04
3000.00000  3050.00000  5.673150068168e-05
3050.00000  3100.00000  6.212498842254e-05
3100.00000  3150.00000  6.032715917559e-05
3150.00000  3200.00000  5.753053590255e-05
3200.00000  3250.00000  5.832957112342e-05
3250.00000  3300.00000  6.032715917559e-05
3300.00000  3350.00000  6.052691798081e-05
3350.00000  3400.00000  5.633198307125e-05
3400.00000  3450.00000  6.232474722776e-05
3450.00000  3500.00000  6.312378244863e-05
3500.00000  3550.00000  5.952812395472e-05
3550.00000  3600.00000  6.592040572167e-05
3600.00000  3650.00000  6.552088811124e-05
3650.00000  3700.00000  8.949194473730e-05
3700.00000  3750.00000  6.432233527993e-05
3750.00000  3800.00000  5.992764156515e-05
3800.00000  3850.00000  6.911654660514e-05
3850.00000  3900.00000  5.852932992863e-05
3900.00000  3950.00000  7.191316987819e-05
3950.00000  4000.00000  5.972788275994e-05
4000.00000  4050.00000  6.991558182601e-05
4050.00000  4100.00000  6.751847616341e-05
4100.00000  4150.00000  6.452209408515e-05
4150.00000  4200.00000  6.312378244863e-05
4200.00000  4250.00000  6.871702899471e-05
4250.00000  4300.00000  6.572064691645e-05
4300.00000  4350.00000  6.412257647472e-05
4350.00000  4400.00000  6.831751138428e-05
4400.00000  4450.00000  6.871702899471e-05
4450.00000  4500.00000  7.051485824166e-05
4500.00000  4550.00000  6.971582302080e-05
4550.00000  4600.00000  7.071461704688e-05
4600.00000  4650.00000  6.492161169558e-05
4650.00000  4700.00000  7.011534063123e-05
4700.00000  4750.00000  6.691919974776e-05
4750.00000  4800.00000  7.530906956688e-05
4800.00000  4850.00000  7.470979315123e-05
4850.00000  4900.00000  7.730665761905e-05
4900.00000  4950.00000  6.552088811124e-05
4950.00000  5000.00000  7.091437585210e-05
5000.00000  5050.00000  7.251244629384e-05
5050.00000  5100.00000  8.110207491818e-05
5100.00000  5150.00000  7.291196390427e-05
5150.00000  5200.00000  7.151365226775e-05
5200.00000  5250.00000  7.371099912514e-05
5250.00000  5300.00000  7.630786359296e-05
5300.00000  5350.00000  7.730665761905e-05
5350.00000  5400.00000  7.291196390427e-05
5400.00000  5450.00000  8.409845699643e-05
5450.00000  5500.00000  7.650762239818e-05
5500.00000  5550.00000  7.690714000861e-05
5550.00000  5600.00000  7.331148151471e-05
5600.00000  5650.00000  8.050279850252e-05
5650.00000  5700.00000  7.750641642427e-05
5700.00000  5750.00000  7.930424567122e-05
5750.00000  5800.00000  7.950400447644e-05
5800.00000  5850.00000  8.190111013904e-05
5850.00000  5900.00000  8.489749221730e-05
5900.00000  5950.00000  7.970376328166e-05
5950.00000  6000.00000  7.351124031992e-05
6000.00000  6050.00000  8.589628624339e-05
6050.00000  6100.00000  8.389869819122e-05
6100.00000  6150.00000  9.368687964686e-05
6150.00000  6200.00000  9.848109097207e-05
6200.00000  6250.00000  1.314412938329e-04
6250.00000  6300.00000  1.781848542537e-04
6300.00000  6350.00000  1.610055970050e-04
6350.00000  6400.00000  1.247094220971e-03
6400.00000  6450.00000  8.270014535991e-05
6450.00000  6500.00000  8.130183372339e-05
6500.00000  6550.00000  8.309966297035e-05
6550.00000  6600.00000  8.609604504861e-05
6600.00000  6650.00000  9.128977398425e-05
6650.00000  6700.00000  8.289990416513e-05
6700.00000  6750.00000  8.829339190599e-05
6750.00000  6800.00000  9.049073876338e-05
6800.00000  6850.00000  9.248832681555e-05
6850.00000  6900.00000  9.488543247816e-05
6900.00000  6950.00000  9.208880920512e-05
6950.00000  7000.00000  7.930424567122e-05
7000.00000  7050.00000  8.329942177556e-05
7050.00000  7100.00000  2.113448159198e-04
7100.00000  7150.00000  4.934042488864e-05
7150.00000  7200.00000  5.133801294082e-05
7200.00000  7250.00000  4.794211325212e-05
7250.00000  7300.00000  5.033921891473e-05
7300.00000  7350.00000  5.393487740864e-05
7350.00000  7400.00000  5.193728935647e-05
7400.00000  7450.00000  5.253656577212e-05
7450.00000  7500.00000  9.648350291990e-05
7500.00000  7550.00000  4.834163086256e-05
7550.00000  7600.00000  5.053897771995e-05
7600.00000  7650.00000  4.854138966778e-05
7650.00000  7700.00000  4.754259564169e-05
7700.00000  7750.00000  5.433439501907e-05
7750.00000  7800.00000  4.874114847299e-05
7800.00000  7850.00000  5.313584218777e-05
7850.00000  7900.00000  5.313584218777e-05
7900.00000  7950.00000  4.594452519995e-05
7950.00000  8000.00000  4.954018369386e-05
8000.00000  8050.00000  5.013946010951e-05
8050.00000  8100.00000  5.053897771995e-05
8100.00000  8150.00000  5.093849533038e-05
8150.00000  8200.00000  5.193728935647e-05
8200.00000  8250.00000  5.113825413560e-05
8250.00000  8300.00000  5.932836514950e-05
8300.00000  8350.00000  4.714307803125e-05
8350.00000  8400.00000  5.373511860342e-05
8400.00000  8450.00000  5.593246546081e-05
8450.00000  8500.00000  5.952812395472e-05
8500.00000  8550.00000  4.934042488864e-05
8550.00000  8600.00000  4.993970130430e-05
8600.00000  8650.00000  4.914066608343e-05
8650.00000  8700.00000  5.113825413560e-05
8700.00000  8750.00000  5.113825413560e-05
8750.00000  8800.00000  5.573270665559e-05
8800.00000  8850.00000  5.173753055125e-05
8850.00000  8900.00000  5.173753055125e-05
8900.00000  8950.00000  5.313584218777e-05
8950.00000  9000.00000  5.033921891473e-05
9000.00000  9050.00000  4.794211325212e-05
9050.00000  9100.00000  5.153777174603e-05
9100.00000  9150.00000  5.053897771995e-05
9150.00000  9200.00000  5.233680696690e-05
9200.00000  9250.00000  5.812981231820e-05
9250.00000  9300.00000  5.213704816168e-05
9300.00000  9350.00000  5.433439501907e-05
9350.00000  9400.00000  5.952812395472e-05
9400.00000  9450.00000  5.533318904516e-05
9450.00000  9500.00000  5.153777174603e-05
9500.00000  9550.00000  5.153777174603e-05
9550.00000  9600.00000  5.313584218777e-05
9600.00000  9650.00000  5.413463621386e-05
9650.00000  9700.00000  5.413463621386e-05
9700.00000  9750.00000  5.533318904516e-05
9750.00000  9800.00000  5.633198307125e-05
9800.00000  9850.00000  5.473391262951e-05
9850.00000  9900.00000  5.353535979820e-05
9900.00000  9950.00000  5.852932992863e-05
9950.00000  10000.00000  6.092643559124e-05
