300.00000  350.00000  3.937911876231e-06
350.00000  400.00000  7.875823752461e-06
400.00000  450.00000  5.727871819972e-06
450.00000  500.00000  3.579919887482e-06
500.00000  550.00000  1.897357540366e-05
550.00000  600.00000  3.937911876231e-06
600.00000  650.00000  7.159839774965e-06
650.00000  700.00000  3.579919887482e-06
700.00000  750.00000  4.295903864979e-06
750.00000  800.00000  1.431967954993e-06
800.00000  850.00000  1.002377568495e-05
850.00000  900.00000  3.579919887482e-06
900.00000  950.00000  3.937911876231e-06
950.00000  1000.00000  4.295903864979e-06
1000.00000  1050.00000  2.863935909986e-06
1050.00000  1100.00000  3.221927898734e-06
1100.00000  1150.00000  3.937911876231e-06
1150.00000  1200.00000  4.653895853727e-06
1200.00000  1250.00000  5.011887842475e-06
1250.00000  1300.00000  8.591807729958e-06
1300.00000  1350.00000  1.789959943741e-06
1350.00000  1400.00000  5.011887842475e-06
1400.00000  1450.00000  5.727871819972e-06
1450.00000  1500.00000  5.369879831224e-06
1500.00000  1550.00000  4.295903864979e-06
1550.00000  1600.00000  6.085863808720e-06
1600.00000  1650.00000  3.937911876231e-06
1650.00000  1700.00000  6.443855797468e-06
1700.00000  1750.00000  7.159839774965e-06
1750.00000  1800.00000  5.727871819972e-06
1800.00000  1850.00000  7.159839774965e-06
1850.00000  1900.00000  5.727871819972e-06
1900.00000  1950.00000  5.727871819972e-06
1950.00000  2000.00000  7.875823752461e-06
2000.00000  2050.00000  6.443855797468e-06
2050.00000  2100.00000  5.727871819972e-06
2100.00000  2150.00000  8.233815741209e-06
2150.00000  2200.00000  6.443855797468e-06
2200.00000  2250.00000  6.085863808720e-06
2250.00000  2300.00000  9.307791707454e-06
2300.00000  2350.00000  2.219550330239e-05
2350.00000  2400.00000  8.233815741209e-06
2400.00000  2450.00000  9.307791707454e-06
2450.00000  2500.00000  6.085863808720e-06
2500.00000  2550.00000  8.233815741209e-06
2550.00000  2600.00000  5.369879831224e-06
2600.00000  2650.00000  8.233815741209e-06
2650.00000  2700.00000  9.307791707454e-06
2700.00000  2750.00000  9.307791707454e-06
2750.00000  2800.00000  1.073975966245e-05
2800.00000  2850.00000  1.109775165120e-05
2850.00000  2900.00000  8.949799718706e-06
2900.00000  2950.00000  1.002377568495e-05
2950.00000  3000.00000  1.288771159494e-05
3000.00000  3050.00000  8.949799718706e-06
3050.00000  3100.00000  1.038176767370e-05
3100.00000  3150.00000  1.360369557243e-05
3150.00000  3200.00000  1.145574363994e-05
3200.00000  3250.00000  1.467767153868e-05
3250.00000  3300.00000  1.718361545992e-05
3300.00000  3350.00000  9.307791707454e-06
3350.00000  3400.00000  1.252971960619e-05
3400.00000  3450.00000  1.431967954993e-05
3450.00000  3500.00000  1.324570358368e-05
3500.00000  3550.00000  1.575164750492e-05
3550.00000  3600.00000  1.718361545992e-05
3600.00000  3650.00000  1.288771159494e-05
3650.00000  3700.00000  2.147951932489e-05
3700.00000  3750.00000  1.073975966245e-05
3750.00000  3800.00000  1.825759142616e-05
3800.00000  3850.00000  1.718361545992e-05
3850.00000  3900.00000  1.539365551617e-05
3900.00000  3950.00000  1.503566352743e-05
3950.00000  4000.00000  1.682562347117e-05
4000.00000  4050.00000  2.649140716737e-05
4050.00000  4100.00000  1.968955938115e-05
4100.00000  4150.00000  1.718361545992e-05
4150.00000  4200.00000  1.503566352743e-05
4200.00000  4250.00000  2.147951932489e-05
4250.00000  4300.00000  1.539365551617e-05
4300.00000  4350.00000  2.291148727989e-05
4350.00000  4400.00000  1.861558341491e-05
4400.00000  4450.00000  1.682562347117e-05
4450.00000  4500.00000  1.825759142616e-05
4500.00000  4550.00000  1.646763148242e-05
4550.00000  4600.00000  2.076353534740e-05
4600.00000  4650.00000  1.968955938115e-05
4650.00000  4700.00000  2.112152733615e-05
4700.00000  4750.00000  2.541743120112e-05
4750.00000  4800.00000  2.326947926864e-05
4800.00000  4850.00000  2.326947926864e-05
4850.00000  4900.00000  2.183751131364e-05
4900.00000  4950.00000  2.470144722363e-05
4950.00000  5000.00000  2.183751131364e-05
5000.00000  5050.00000  1.718361545992e-05
5050.00000  5100.00000  2.076353534740e-05
5100.00000  5150.00000  2.255349529114e-05
5150.00000  5200.00000  2.004755136990e-05
5200.00000  5250.00000  2.147951932489e-05
5250.00000  5300.00000  2.291148727989e-05
5300.00000  5350.00000  2.147951932489e-05
5350.00000  5400.00000  2.255349529114e-05
5400.00000  5450.00000  2.684939915612e-05
5450.00000  5500.00000  1.754160744866e-05
5500.00000  5550.00000  2.112152733615e-05
5550.00000  5600.00000  2.434345523488e-05
5600.00000  5650.00000  1.897357540366e-05
5650.00000  5700.00000  2.112152733615e-05
5700.00000  5750.00000  2.362747125738e-05
5750.00000  5800.00000  2.362747125738e-05
5800.00000  5850.00000  1.968955938115e-05
5850.00000  5900.00000  1.861558341491e-05
5900.00000  5950.00000  1.861558341491e-05
5950.00000  6000.00000  2.756538313361e-05
6000.00000  6050.00000  2.362747125738e-05
6050.00000  6100.00000  2.255349529114e-05
6100.00000  6150.00000  2.613341517862e-05
6150.00000  6200.00000  2.613341517862e-05
6200.00000  6250.00000  3.078731103235e-05
6250.00000  6300.00000  3.544120688608e-05
6300.00000  6350.00000  4.367502262728e-05
6350.00000  6400.00000  2.534583280338e-04
6400.00000  6450.00000  2.112152733615e-05
6450.00000  6500.00000  2.362747125738e-05
6500.00000  6550.00000  2.398546324613e-05
6550.00000  6600.00000  1.610963949367e-05
6600.00000  6650.00000  1.897357540366e-05
6650.00000  6700.00000  2.076353534740e-05
6700.00000  6750.00000  2.040554335865e-05
6750.00000  6800.00000  2.684939915612e-05
6800.00000  6850.00000  2.326947926864e-05
6850.00000  6900.00000  2.291148727989e-05
6900.00000  6950.00000  2.183751131364e-05
6950.00000  7000.00000  2.183751131364e-05
7000.00000  7050.00000  1.897357540366e-05
7050.00000  7100.00000  4.582297455977e-05
7100.00000  7150.00000  1.288771159494e-05
7150.00000  7200.00000  9.665783696202e-06
7200.00000  7250.00000  1.145574363994e-05
7250.00000  7300.00000  1.324570358368e-05
7300.00000  7350.00000  1.575164750492e-05
7350.00000  7400.00000  1.217172761744e-05
7400.00000  7450.00000  1.181373562869e-05
7450.00000  7500.00000  2.541743120112e-05
7500.00000  7550.00000  1.431967954993e-05
7550.00000  7600.00000  1.288771159494e-05
7600.00000  7650.00000  1.396168756118e-05
7650.00000  7700.00000  7.875823752461e-06
7700.00000  7750.00000  1.109775165120e-05
7750.00000  7800.00000  7.159839774965e-06
7800.00000  7850.00000  1.467767153868e-05
7850.00000  7900.00000  1.145574363994e-05
7900.00000  7950.00000  1.181373562869e-05
7950.00000  8000.00000  1.252971960619e-05
8000.00000  8050.00000  1.217172761744e-05
8050.00000  8100.00000  1.109775165120e-05
8100.00000  8150.00000  1.073975966245e-05
8150.00000  8200.00000  1.002377568495e-05
8200.00000  8250.00000  1.324570358368e-05
8250.00000  8300.00000  1.431967954993e-05
8300.00000  8350.00000  1.217172761744e-05
8350.00000  8400.00000  1.073975966245e-05
8400.00000  8450.00000  1.217172761744e-05
8450.00000  8500.00000  1.288771159494e-05
8500.00000  8550.00000  1.252971960619e-05
8550.00000  8600.00000  1.324570358368e-05
8600.00000  8650.00000  7.159839774965e-06
8650.00000  8700.00000  1.002377568495e-05
8700.00000  8750.00000  1.181373562869e-05
8750.00000  8800.00000  1.217172761744e-05
8800.00000  8850.00000  1.073975966245e-05
8850.00000  8900.00000  9.665783696202e-06
8900.00000  8950.00000  1.181373562869e-05
8950.00000  9000.00000  1.145574363994e-05
9000.00000  9050.00000  1.181373562869e-05
9050.00000  9100.00000  1.217172761744e-05
9100.00000  9150.00000  1.610963949367e-05
9150.00000  9200.00000  1.073975966245e-05
9200.00000  9250.00000  1.002377568495e-05
9250.00000  9300.00000  1.038176767370e-05
9300.00000  9350.00000  9.665783696202e-06
9350.00000  9400.00000  8.949799718706e-06
9400.00000  9450.00000  1.109775165120e-05
9450.00000  9500.00000  9.665783696202e-06
9500.00000  9550.00000  9.665783696202e-06
9550.00000  9600.00000  8.591807729958e-06
9600.00000  9650.00000  1.324570358368e-05
9650.00000  9700.00000  1.109775165120e-05
9700.00000  9750.00000  1.324570358368e-05
9750.00000  9800.00000  1.109775165120e-05
9800.00000  9850.00000  1.002377568495e-05
9850.00000  9900.00000  9.307791707454e-06
9900.00000  9950.00000  9.665783696202e-06
9950.00000  10000.00000  9.307791707454e-06
