10001.00000  11001.00000  3.849508733642e-04
11001.00000  12001.00000  3.209860540878e-04
12001.00000  13001.00000  2.638977386109e-04
13001.00000  14001.00000  2.197623942799e-04
14001.00000  15001.00000  1.873037724672e-04
15001.00000  16001.00000  1.579500540322e-04
16001.00000  17001.00000  1.389777610008e-04
17001.00000  18001.00000  1.191482860554e-04
18001.00000  19001.00000  1.025380054095e-04
19001.00000  20001.00000  9.383284685993e-05
20001.00000  21001.00000  8.107036058381e-05
21001.00000  22001.00000  7.358430520095e-05
22001.00000  23001.00000  6.209806755245e-05
23001.00000  24001.00000  5.691687909408e-05
24001.00000  25001.00000  4.964035706800e-05
25001.00000  26001.00000  4.379247156536e-05
26001.00000  27001.00000  4.219239865910e-05
27001.00000  28001.00000  3.640165861740e-05
28001.00000  29001.00000  3.451585840645e-05
29001.00000  30001.00000  3.074425798456e-05
30001.00000  31001.00000  2.756316065902e-05
31001.00000  32001.00000  2.708694848453e-05
32001.00000  33001.00000  2.352488141941e-05
33001.00000  34001.00000  2.184861456523e-05
34001.00000  35001.00000  2.030568711991e-05
35001.00000  36001.00000  1.826749901313e-05
36001.00000  37001.00000  1.607692301051e-05
37001.00000  38001.00000  1.617216544541e-05
38001.00000  39001.00000  1.455304405217e-05
39001.00000  40001.00000  1.339108634643e-05
40001.00000  41001.00000  1.211483771882e-05
41001.00000  42001.00000  1.175291646621e-05
42001.00000  43001.00000  1.041952237767e-05
43001.00000  44001.00000  1.062905573444e-05
44001.00000  45001.00000  1.022903750787e-05
45001.00000  46001.00000  8.667061575572e-06
46001.00000  47001.00000  8.495625192758e-06
47001.00000  48001.00000  8.267043349007e-06
48001.00000  49001.00000  7.066988669312e-06
49001.00000  50001.00000  7.371764460981e-06
50001.00000  51001.00000  6.228855242224e-06
51001.00000  52001.00000  6.095515833369e-06
52001.00000  53001.00000  5.714546093784e-06
53001.00000  54001.00000  4.914509640654e-06
54001.00000  55001.00000  4.400200492213e-06
55001.00000  56001.00000  4.704976283882e-06
56001.00000  57001.00000  4.171618648462e-06
57001.00000  58001.00000  3.981133778669e-06
58001.00000  59001.00000  4.076376213566e-06
59001.00000  60001.00000  3.409679169291e-06
60001.00000  61001.00000  3.466824630229e-06
61001.00000  62001.00000  2.628691203140e-06
62001.00000  63001.00000  2.762030611995e-06
63001.00000  64001.00000  3.009660942726e-06
64001.00000  65001.00000  3.409679169291e-06
65001.00000  66001.00000  2.590594229182e-06
66001.00000  67001.00000  2.400109359389e-06
67001.00000  68001.00000  2.438206333348e-06
68001.00000  69001.00000  1.981042645845e-06
69001.00000  70001.00000  2.438206333348e-06
70001.00000  71001.00000  2.057236593762e-06
71001.00000  72001.00000  1.847703236990e-06
72001.00000  73001.00000  1.961994158866e-06
73001.00000  74001.00000  1.485781984384e-06
74001.00000  75001.00000  1.771509289073e-06
75001.00000  76001.00000  1.771509289073e-06
76001.00000  77001.00000  1.714363828135e-06
77001.00000  78001.00000  1.257200140632e-06
78001.00000  79001.00000  1.200054679695e-06
79001.00000  80001.00000  1.390539549487e-06
80001.00000  81001.00000  1.047666783860e-06
81001.00000  82001.00000  1.009569809902e-06
82001.00000  83001.00000  1.200054679695e-06
83001.00000  84001.00000  8.000364531297e-07
84001.00000  85001.00000  1.047666783860e-06
85001.00000  86001.00000  9.905213229225e-07
86001.00000  87001.00000  9.714728359432e-07
87001.00000  88001.00000  7.809879661504e-07
88001.00000  89001.00000  7.238425052126e-07
89001.00000  90001.00000  7.619394791711e-07
90001.00000  91001.00000  7.619394791711e-07
91001.00000  92001.00000  5.143091484405e-07
92001.00000  93001.00000  5.143091484405e-07
93001.00000  94001.00000  6.666970442748e-07
94001.00000  95001.00000  6.286000703162e-07
95001.00000  96001.00000  5.524061223991e-07
96001.00000  97001.00000  3.428727656270e-07
97001.00000  98001.00000  6.476485572955e-07
98001.00000  99001.00000  4.190667135441e-07
99001.00000  100001.00000  5.714546093784e-07
100001.00000  101001.00000  4.762121744820e-07
101001.00000  102001.00000  5.143091484405e-07
102001.00000  103001.00000  3.809697395856e-07
103001.00000  104001.00000  5.333576354198e-07
104001.00000  105001.00000  3.619212526063e-07
105001.00000  106001.00000  2.476303307306e-07
106001.00000  107001.00000  3.047757916685e-07
107001.00000  108001.00000  4.381152005234e-07
108001.00000  109001.00000  3.428727656270e-07
109001.00000  110001.00000  2.285818437513e-07
110001.00000  111001.00000  3.238242786477e-07
111001.00000  112001.00000  2.285818437513e-07
112001.00000  113001.00000  2.285818437513e-07
113001.00000  114001.00000  2.476303307306e-07
114001.00000  115001.00000  4.000182265649e-07
115001.00000  116001.00000  2.285818437513e-07
116001.00000  117001.00000  1.714363828135e-07
117001.00000  118001.00000  1.333394088550e-07
118001.00000  119001.00000  1.904848697928e-07
119001.00000  120001.00000  1.714363828135e-07
120001.00000  121001.00000  9.524243489639e-08
121001.00000  122001.00000  1.714363828135e-07
122001.00000  123001.00000  2.095333567721e-07
123001.00000  124001.00000  2.285818437513e-07
124001.00000  125001.00000  1.142909218757e-07
125001.00000  126001.00000  9.524243489639e-08
126001.00000  127001.00000  1.523878958342e-07
127001.00000  128001.00000  9.524243489639e-08
128001.00000  129001.00000  1.714363828135e-07
129001.00000  130001.00000  1.714363828135e-07
130001.00000  131001.00000  5.714546093784e-08
131001.00000  132001.00000  7.619394791711e-08
132001.00000  133001.00000  0.000000000000e+00
133001.00000  134001.00000  5.714546093784e-08
134001.00000  135001.00000  7.619394791711e-08
135001.00000  136001.00000  3.809697395856e-08
136001.00000  137001.00000  9.524243489639e-08
137001.00000  138001.00000  9.524243489639e-08
138001.00000  139001.00000  1.142909218757e-07
139001.00000  140001.00000  1.523878958342e-07
140001.00000  141001.00000  7.619394791711e-08
141001.00000  142001.00000  1.142909218757e-07
142001.00000  143001.00000  1.142909218757e-07
143001.00000  144001.00000  5.714546093784e-08
144001.00000  145001.00000  1.142909218757e-07
145001.00000  146001.00000  9.524243489639e-08
146001.00000  147001.00000  5.714546093784e-08
147001.00000  148001.00000  9.524243489639e-08
148001.00000  149001.00000  7.619394791711e-08
149001.00000  150001.00000  9.524243489639e-08
150001.00000  151001.00000  3.809697395856e-08
151001.00000  152001.00000  9.524243489639e-08
152001.00000  153001.00000  1.333394088550e-07
153001.00000  154001.00000  5.714546093784e-08
154001.00000  155001.00000  3.809697395856e-08
155001.00000  156001.00000  9.524243489639e-08
156001.00000  157001.00000  0.000000000000e+00
157001.00000  158001.00000  9.524243489639e-08
158001.00000  159001.00000  5.714546093784e-08
159001.00000  160001.00000  5.714546093784e-08
160001.00000  161001.00000  5.714546093784e-08
161001.00000  162001.00000  1.904848697928e-08
162001.00000  163001.00000  0.000000000000e+00
163001.00000  164001.00000  3.809697395856e-08
164001.00000  165001.00000  1.904848697928e-08
165001.00000  166001.00000  3.809697395856e-08
166001.00000  167001.00000  5.714546093784e-08
167001.00000  168001.00000  3.809697395856e-08
168001.00000  169001.00000  3.809697395856e-08
169001.00000  170001.00000  0.000000000000e+00
170001.00000  171001.00000  1.904848697928e-08
171001.00000  172001.00000  1.904848697928e-08
172001.00000  173001.00000  0.000000000000e+00
173001.00000  174001.00000  3.809697395856e-08
174001.00000  175001.00000  1.904848697928e-08
175001.00000  176001.00000  3.809697395856e-08
176001.00000  177001.00000  3.809697395856e-08
177001.00000  178001.00000  1.904848697928e-08
178001.00000  179001.00000  1.904848697928e-08
179001.00000  180001.00000  3.809697395856e-08
180001.00000  181001.00000  3.809697395856e-08
181001.00000  182001.00000  0.000000000000e+00
182001.00000  183001.00000  1.904848697928e-08
183001.00000  184001.00000  5.714546093784e-08
184001.00000  185001.00000  3.809697395856e-08
185001.00000  186001.00000  7.619394791711e-08
186001.00000  187001.00000  0.000000000000e+00
187001.00000  188001.00000  0.000000000000e+00
188001.00000  189001.00000  0.000000000000e+00
189001.00000  190001.00000  1.904848697928e-08
190001.00000  191001.00000  1.904848697928e-08
191001.00000  192001.00000  1.904848697928e-08
192001.00000  193001.00000  0.000000000000e+00
193001.00000  194001.00000  0.000000000000e+00
194001.00000  195001.00000  0.000000000000e+00
195001.00000  196001.00000  1.904848697928e-08
196001.00000  197001.00000  0.000000000000e+00
197001.00000  198001.00000  1.904848697928e-08
198001.00000  199001.00000  0.000000000000e+00
