300.00000  350.00000  0.000000000000e+00
350.00000  400.00000  0.000000000000e+00
400.00000  450.00000  0.000000000000e+00
450.00000  500.00000  0.000000000000e+00
500.00000  550.00000  5.563283429727e-06
550.00000  600.00000  0.000000000000e+00
600.00000  650.00000  0.000000000000e+00
650.00000  700.00000  0.000000000000e+00
700.00000  750.00000  1.589509551351e-06
750.00000  800.00000  1.589509551351e-06
800.00000  850.00000  4.768528654052e-06
850.00000  900.00000  0.000000000000e+00
900.00000  950.00000  0.000000000000e+00
950.00000  1000.00000  0.000000000000e+00
1000.00000  1050.00000  1.589509551351e-06
1050.00000  1100.00000  0.000000000000e+00
1100.00000  1150.00000  7.947547756754e-07
1150.00000  1200.00000  7.152792981078e-06
1200.00000  1250.00000  1.748460506486e-05
1250.00000  1300.00000  6.119611772700e-05
1300.00000  1350.00000  3.020068147566e-05
1350.00000  1400.00000  7.152792981078e-05
1400.00000  1450.00000  1.136499329216e-04
1450.00000  1500.00000  2.018677130215e-04
1500.00000  1550.00000  2.932645122242e-04
1550.00000  1600.00000  3.647924420350e-04
1600.00000  1650.00000  5.428175117863e-04
1650.00000  1700.00000  6.946156739403e-04
1700.00000  1750.00000  9.266840684375e-04
1750.00000  1800.00000  1.113451440721e-03
1800.00000  1850.00000  1.238227940502e-03
1850.00000  1900.00000  1.275581414959e-03
1900.00000  1950.00000  1.502086526026e-03
1950.00000  2000.00000  1.751639525588e-03
2000.00000  2050.00000  1.986092184413e-03
2050.00000  2100.00000  2.165706763715e-03
2100.00000  2150.00000  2.415259763277e-03
2150.00000  2200.00000  2.664812762839e-03
2200.00000  2250.00000  2.871449004515e-03
2250.00000  2300.00000  3.058216376799e-03
2300.00000  2350.00000  3.473078369701e-03
2350.00000  2400.00000  3.363402210658e-03
2400.00000  2450.00000  3.596265359931e-03
2450.00000  2500.00000  3.540632525634e-03
2500.00000  2550.00000  3.442082933450e-03
2550.00000  2600.00000  3.476257388804e-03
2600.00000  2650.00000  3.736142200450e-03
2650.00000  2700.00000  3.622492267528e-03
2700.00000  2750.00000  3.755216315066e-03
2750.00000  2800.00000  3.791775034747e-03
2800.00000  2850.00000  3.992847992993e-03
2850.00000  2900.00000  3.909398741547e-03
2900.00000  2950.00000  3.940394177798e-03
2950.00000  3000.00000  4.158951741109e-03
3000.00000  3050.00000  3.864892474109e-03
3050.00000  3100.00000  3.996027012096e-03
3100.00000  3150.00000  4.127956304858e-03
3150.00000  3200.00000  4.034969996104e-03
3200.00000  3250.00000  3.917346289304e-03
3250.00000  3300.00000  3.846613114269e-03
3300.00000  3350.00000  3.920525308407e-03
3350.00000  3400.00000  3.805285865934e-03
3400.00000  3450.00000  3.729784162244e-03
3450.00000  3500.00000  3.746474012534e-03
3500.00000  3550.00000  3.814822923242e-03
3550.00000  3600.00000  3.614544719772e-03
3600.00000  3650.00000  3.700378235544e-03
3650.00000  3700.00000  3.645540156023e-03
3700.00000  3750.00000  3.582754528744e-03
3750.00000  3800.00000  3.544606299512e-03
3800.00000  3850.00000  3.421419309282e-03
3850.00000  3900.00000  3.404729458993e-03
3900.00000  3950.00000  3.382476325274e-03
3950.00000  4000.00000  3.312537905015e-03
4000.00000  4050.00000  3.244983749082e-03
4050.00000  4100.00000  3.136897099591e-03
4100.00000  4150.00000  3.024836676220e-03
4150.00000  4200.00000  3.148818421226e-03
4200.00000  4250.00000  3.078880000966e-03
4250.00000  4300.00000  2.932645122242e-03
4300.00000  4350.00000  2.924697574485e-03
4350.00000  4400.00000  2.816610924993e-03
4400.00000  4450.00000  2.885754590477e-03
4450.00000  4500.00000  2.735545937875e-03
4500.00000  4550.00000  2.663223253288e-03
4550.00000  4600.00000  2.748262014285e-03
4600.00000  4650.00000  2.554341849021e-03
4650.00000  4700.00000  2.559110377675e-03
4700.00000  4750.00000  2.554341849021e-03
4750.00000  4800.00000  2.478840145331e-03
4800.00000  4850.00000  2.435923387445e-03
4850.00000  4900.00000  2.319094435421e-03
4900.00000  4950.00000  2.399364667764e-03
4950.00000  5000.00000  2.234055674423e-03
5000.00000  5050.00000  2.268230129777e-03
5050.00000  5100.00000  2.253924543815e-03
5100.00000  5150.00000  2.151401177753e-03
5150.00000  5200.00000  2.176833330575e-03
5200.00000  5250.00000  2.020266639767e-03
5250.00000  5300.00000  2.031393206626e-03
5300.00000  5350.00000  2.084641776596e-03
5350.00000  5400.00000  1.878005534921e-03
5400.00000  5450.00000  1.931254104891e-03
5450.00000  5500.00000  1.874031761042e-03
5500.00000  5550.00000  1.853368136875e-03
5550.00000  5600.00000  1.804888095559e-03
5600.00000  5650.00000  1.706338503375e-03
5650.00000  5700.00000  1.816809417194e-03
5700.00000  5750.00000  1.772303149756e-03
5750.00000  5800.00000  1.758792318570e-03
5800.00000  5850.00000  1.700775219945e-03
5850.00000  5900.00000  1.629247290134e-03
5900.00000  5950.00000  1.612557439845e-03
5950.00000  6000.00000  1.520365885867e-03
6000.00000  6050.00000  1.533876717053e-03
6050.00000  6100.00000  1.522750150194e-03
6100.00000  6150.00000  1.504470790353e-03
6150.00000  6200.00000  1.413073991151e-03
6200.00000  6250.00000  1.440890408299e-03
6250.00000  6300.00000  1.430558596216e-03
6300.00000  6350.00000  1.396384140862e-03
6350.00000  6400.00000  1.885158327902e-03
6400.00000  6450.00000  1.390820857432e-03
6450.00000  6500.00000  1.297834548678e-03
6500.00000  6550.00000  1.359030666405e-03
6550.00000  6600.00000  1.277170924510e-03
6600.00000  6650.00000  1.299424058229e-03
6650.00000  6700.00000  1.216769561559e-03
6700.00000  6750.00000  1.213590542456e-03
6750.00000  6800.00000  1.226306618867e-03
6800.00000  6850.00000  1.174647558448e-03
6850.00000  6900.00000  1.162726236813e-03
6900.00000  6950.00000  1.157957708159e-03
6950.00000  7000.00000  1.167494765467e-03
7000.00000  7050.00000  1.120604233702e-03
7050.00000  7100.00000  1.165905255916e-03
7100.00000  7150.00000  1.024438905846e-03
7150.00000  7200.00000  1.000596262575e-03
7200.00000  7250.00000  9.052256894942e-04
7250.00000  7300.00000  9.537057308104e-04
7300.00000  7350.00000  9.298630875402e-04
7350.00000  7400.00000  9.401948996239e-04
7400.00000  7450.00000  9.155575015780e-04
7450.00000  7500.00000  9.473476926050e-04
7500.00000  7550.00000  8.734354984672e-04
7550.00000  7600.00000  8.901253487564e-04
7600.00000  7650.00000  8.281344762537e-04
7650.00000  7700.00000  7.891914922456e-04
7700.00000  7750.00000  8.336977596834e-04
7750.00000  7800.00000  7.899862470213e-04
7800.00000  7850.00000  7.319691483970e-04
7850.00000  7900.00000  7.518380177889e-04
7900.00000  7950.00000  7.923705113483e-04
7950.00000  8000.00000  7.725016419564e-04
8000.00000  8050.00000  7.415062057051e-04
8050.00000  8100.00000  7.717068871808e-04
8100.00000  8150.00000  7.415062057051e-04
8150.00000  8200.00000  6.938209191646e-04
8200.00000  8250.00000  7.073317503511e-04
8250.00000  8300.00000  6.707730306700e-04
8300.00000  8350.00000  7.176635624348e-04
8350.00000  8400.00000  6.874628809592e-04
8400.00000  8450.00000  6.477251421754e-04
8450.00000  8500.00000  6.858733714078e-04
8500.00000  8550.00000  6.588517090349e-04
8550.00000  8600.00000  6.675940115673e-04
8600.00000  8650.00000  6.214982345781e-04
8650.00000  8700.00000  6.350090657646e-04
8700.00000  8750.00000  5.936818174295e-04
8750.00000  8800.00000  6.040136295133e-04
8800.00000  8850.00000  5.873237792241e-04
8850.00000  8900.00000  5.825552505700e-04
8900.00000  8950.00000  5.849395148971e-04
8950.00000  9000.00000  5.769919671403e-04
9000.00000  9050.00000  5.801709862430e-04
9050.00000  9100.00000  5.905027983268e-04
9100.00000  9150.00000  5.213591328430e-04
9150.00000  9200.00000  5.396384926836e-04
9200.00000  9250.00000  5.587126072998e-04
9250.00000  9300.00000  5.420227570106e-04
9300.00000  9350.00000  5.388437379079e-04
9350.00000  9400.00000  5.340752092538e-04
9400.00000  9450.00000  5.746077028133e-04
9450.00000  9500.00000  4.887741870403e-04
9500.00000  9550.00000  4.871846774890e-04
9550.00000  9600.00000  5.157958494133e-04
9600.00000  9650.00000  5.118220755349e-04
9650.00000  9700.00000  4.911584513674e-04
9700.00000  9750.00000  4.673158080971e-04
9750.00000  9800.00000  4.673158080971e-04
9800.00000  9850.00000  4.879794322647e-04
9850.00000  9900.00000  4.967217347971e-04
9900.00000  9950.00000  4.712895819755e-04
9950.00000  10000.00000  4.482416934809e-04
