10001.00000  11001.00000  6.306379144984e-05
11001.00000  12001.00000  5.038745277782e-05
12001.00000  13001.00000  4.108882190242e-05
13001.00000  14001.00000  3.516789882363e-05
14001.00000  15001.00000  3.107491172891e-05
15001.00000  16001.00000  2.388238100904e-05
16001.00000  17001.00000  2.197496954742e-05
17001.00000  18001.00000  1.871647496715e-05
18001.00000  19001.00000  1.565666908080e-05
19001.00000  20001.00000  1.311345379864e-05
20001.00000  21001.00000  1.140473103094e-05
21001.00000  22001.00000  1.029207434500e-05
22001.00000  23001.00000  1.049076303891e-05
23001.00000  24001.00000  7.947547756754e-06
24001.00000  25001.00000  6.636202376889e-06
25001.00000  26001.00000  7.311743936213e-06
26001.00000  27001.00000  5.364594735809e-06
27001.00000  28001.00000  5.285119258241e-06
28001.00000  29001.00000  4.649315437701e-06
29001.00000  30001.00000  4.569839960133e-06
30001.00000  31001.00000  3.616134229323e-06
31001.00000  32001.00000  3.655871968107e-06
32001.00000  33001.00000  2.582953020945e-06
33001.00000  34001.00000  2.622690759729e-06
34001.00000  35001.00000  2.622690759729e-06
35001.00000  36001.00000  2.582953020945e-06
36001.00000  37001.00000  1.788198245270e-06
37001.00000  38001.00000  2.225313371891e-06
38001.00000  39001.00000  1.629247290134e-06
39001.00000  40001.00000  1.470296334999e-06
40001.00000  41001.00000  1.470296334999e-06
41001.00000  42001.00000  1.192132163513e-06
42001.00000  43001.00000  8.742302532429e-07
43001.00000  44001.00000  1.152394424729e-06
44001.00000  45001.00000  1.271607641081e-06
45001.00000  46001.00000  7.947547756754e-07
46001.00000  47001.00000  7.550170368916e-07
47001.00000  48001.00000  8.344925144591e-07
48001.00000  49001.00000  7.550170368916e-07
49001.00000  50001.00000  5.563283429727e-07
50001.00000  51001.00000  9.139679920267e-07
51001.00000  52001.00000  7.550170368916e-07
52001.00000  53001.00000  8.344925144591e-07
53001.00000  54001.00000  4.371151266214e-07
54001.00000  55001.00000  5.960660817565e-07
55001.00000  56001.00000  5.960660817565e-07
56001.00000  57001.00000  5.563283429727e-07
57001.00000  58001.00000  2.781641714864e-07
58001.00000  59001.00000  4.768528654052e-07
59001.00000  60001.00000  5.165906041890e-07
60001.00000  61001.00000  3.179019102701e-07
61001.00000  62001.00000  7.947547756754e-08
62001.00000  63001.00000  3.576396490539e-07
63001.00000  64001.00000  1.192132163513e-07
64001.00000  65001.00000  3.179019102701e-07
65001.00000  66001.00000  1.192132163513e-07
66001.00000  67001.00000  2.384264327026e-07
67001.00000  68001.00000  3.973773878377e-07
68001.00000  69001.00000  1.192132163513e-07
69001.00000  70001.00000  1.192132163513e-07
70001.00000  71001.00000  1.986886939188e-07
71001.00000  72001.00000  3.179019102701e-07
72001.00000  73001.00000  1.589509551351e-07
73001.00000  74001.00000  1.192132163513e-07
74001.00000  75001.00000  1.192132163513e-07
75001.00000  76001.00000  1.986886939188e-07
76001.00000  77001.00000  1.192132163513e-07
77001.00000  78001.00000  2.781641714864e-07
78001.00000  79001.00000  1.192132163513e-07
79001.00000  80001.00000  7.947547756754e-08
80001.00000  81001.00000  1.986886939188e-07
81001.00000  82001.00000  7.947547756754e-08
82001.00000  83001.00000  7.947547756754e-08
83001.00000  84001.00000  7.947547756754e-08
84001.00000  85001.00000  1.192132163513e-07
85001.00000  86001.00000  1.192132163513e-07
86001.00000  87001.00000  3.973773878377e-08
87001.00000  88001.00000  0.000000000000e+00
88001.00000  89001.00000  7.947547756754e-08
89001.00000  90001.00000  3.973773878377e-08
90001.00000  91001.00000  0.000000000000e+00
91001.00000  92001.00000  3.973773878377e-08
92001.00000  93001.00000  0.000000000000e+00
93001.00000  94001.00000  7.947547756754e-08
94001.00000  95001.00000  1.589509551351e-07
95001.00000  96001.00000  3.973773878377e-08
96001.00000  97001.00000  3.973773878377e-08
97001.00000  98001.00000  3.973773878377e-08
98001.00000  99001.00000  0.000000000000e+00
99001.00000  100001.00000  7.947547756754e-08
100001.00000  101001.00000  3.973773878377e-08
101001.00000  102001.00000  3.973773878377e-08
102001.00000  103001.00000  3.973773878377e-08
103001.00000  104001.00000  0.000000000000e+00
104001.00000  105001.00000  3.973773878377e-08
105001.00000  106001.00000  0.000000000000e+00
106001.00000  107001.00000  3.973773878377e-08
107001.00000  108001.00000  3.973773878377e-08
108001.00000  109001.00000  3.973773878377e-08
109001.00000  110001.00000  0.000000000000e+00
110001.00000  111001.00000  0.000000000000e+00
111001.00000  112001.00000  0.000000000000e+00
112001.00000  113001.00000  0.000000000000e+00
113001.00000  114001.00000  0.000000000000e+00
114001.00000  115001.00000  7.947547756754e-08
115001.00000  116001.00000  0.000000000000e+00
116001.00000  117001.00000  0.000000000000e+00
117001.00000  118001.00000  0.000000000000e+00
118001.00000  119001.00000  7.947547756754e-08
119001.00000  120001.00000  7.947547756754e-08
120001.00000  121001.00000  3.973773878377e-08
121001.00000  122001.00000  0.000000000000e+00
122001.00000  123001.00000  0.000000000000e+00
123001.00000  124001.00000  0.000000000000e+00
124001.00000  125001.00000  0.000000000000e+00
125001.00000  126001.00000  0.000000000000e+00
126001.00000  127001.00000  0.000000000000e+00
127001.00000  128001.00000  0.000000000000e+00
128001.00000  129001.00000  3.973773878377e-08
129001.00000  130001.00000  3.973773878377e-08
130001.00000  131001.00000  3.973773878377e-08
131001.00000  132001.00000  0.000000000000e+00
132001.00000  133001.00000  0.000000000000e+00
133001.00000  134001.00000  0.000000000000e+00
134001.00000  135001.00000  0.000000000000e+00
135001.00000  136001.00000  0.000000000000e+00
136001.00000  137001.00000  0.000000000000e+00
137001.00000  138001.00000  0.000000000000e+00
138001.00000  139001.00000  0.000000000000e+00
139001.00000  140001.00000  0.000000000000e+00
140001.00000  141001.00000  0.000000000000e+00
141001.00000  142001.00000  0.000000000000e+00
142001.00000  143001.00000  0.000000000000e+00
143001.00000  144001.00000  0.000000000000e+00
144001.00000  145001.00000  3.973773878377e-08
145001.00000  146001.00000  3.973773878377e-08
146001.00000  147001.00000  0.000000000000e+00
147001.00000  148001.00000  0.000000000000e+00
148001.00000  149001.00000  0.000000000000e+00
149001.00000  150001.00000  3.973773878377e-08
150001.00000  151001.00000  0.000000000000e+00
151001.00000  152001.00000  3.973773878377e-08
152001.00000  153001.00000  3.973773878377e-08
153001.00000  154001.00000  0.000000000000e+00
154001.00000  155001.00000  0.000000000000e+00
155001.00000  156001.00000  0.000000000000e+00
156001.00000  157001.00000  0.000000000000e+00
157001.00000  158001.00000  3.973773878377e-08
158001.00000  159001.00000  0.000000000000e+00
159001.00000  160001.00000  0.000000000000e+00
160001.00000  161001.00000  0.000000000000e+00
161001.00000  162001.00000  0.000000000000e+00
162001.00000  163001.00000  0.000000000000e+00
163001.00000  164001.00000  0.000000000000e+00
164001.00000  165001.00000  0.000000000000e+00
165001.00000  166001.00000  3.973773878377e-08
166001.00000  167001.00000  0.000000000000e+00
167001.00000  168001.00000  0.000000000000e+00
168001.00000  169001.00000  0.000000000000e+00
169001.00000  170001.00000  0.000000000000e+00
170001.00000  171001.00000  0.000000000000e+00
171001.00000  172001.00000  0.000000000000e+00
172001.00000  173001.00000  0.000000000000e+00
173001.00000  174001.00000  0.000000000000e+00
174001.00000  175001.00000  0.000000000000e+00
175001.00000  176001.00000  0.000000000000e+00
176001.00000  177001.00000  3.973773878377e-08
177001.00000  178001.00000  0.000000000000e+00
178001.00000  179001.00000  0.000000000000e+00
179001.00000  180001.00000  0.000000000000e+00
180001.00000  181001.00000  0.000000000000e+00
181001.00000  182001.00000  0.000000000000e+00
182001.00000  183001.00000  0.000000000000e+00
183001.00000  184001.00000  0.000000000000e+00
184001.00000  185001.00000  0.000000000000e+00
185001.00000  186001.00000  0.000000000000e+00
186001.00000  187001.00000  0.000000000000e+00
187001.00000  188001.00000  0.000000000000e+00
188001.00000  189001.00000  0.000000000000e+00
189001.00000  190001.00000  0.000000000000e+00
190001.00000  191001.00000  0.000000000000e+00
191001.00000  192001.00000  0.000000000000e+00
192001.00000  193001.00000  0.000000000000e+00
193001.00000  194001.00000  0.000000000000e+00
194001.00000  195001.00000  0.000000000000e+00
195001.00000  196001.00000  0.000000000000e+00
196001.00000  197001.00000  0.000000000000e+00
197001.00000  198001.00000  0.000000000000e+00
198001.00000  199001.00000  0.000000000000e+00
