300.00000  350.00000  5.016333427254e-06
350.00000  400.00000  1.083528020287e-05
400.00000  450.00000  5.016333427254e-06
450.00000  500.00000  5.618293438525e-06
500.00000  550.00000  8.567897493751e-05
550.00000  600.00000  6.019600112705e-06
600.00000  650.00000  2.688754717008e-05
650.00000  700.00000  8.427440157788e-06
700.00000  750.00000  1.886141368648e-05
750.00000  800.00000  1.424638693340e-05
800.00000  850.00000  5.337378766599e-05
850.00000  900.00000  9.832013517419e-06
900.00000  950.00000  8.828746831968e-06
950.00000  1000.00000  1.203920022541e-05
1000.00000  1050.00000  1.304246691086e-05
1050.00000  1100.00000  1.203920022541e-05
1100.00000  1150.00000  1.163789355123e-05
1150.00000  1200.00000  1.043397352869e-05
1200.00000  1250.00000  1.464769360758e-05
1250.00000  1300.00000  5.638358772234e-05
1300.00000  1350.00000  1.665422697848e-05
1350.00000  1400.00000  1.966402703484e-05
1400.00000  1450.00000  1.685488031558e-05
1450.00000  1500.00000  2.227252041701e-05
1500.00000  1550.00000  2.267382709119e-05
1550.00000  1600.00000  2.086794705738e-05
1600.00000  1650.00000  1.565096029303e-05
1650.00000  1700.00000  2.106860039447e-05
1700.00000  1750.00000  8.387309490369e-05
1750.00000  1800.00000  2.146990706865e-05
1800.00000  1850.00000  2.728885384426e-05
1850.00000  1900.00000  2.106860039447e-05
1900.00000  1950.00000  2.086794705738e-05
1950.00000  2000.00000  2.046664038320e-05
2000.00000  2050.00000  2.588428048463e-05
2050.00000  2100.00000  2.708820050717e-05
2100.00000  2150.00000  2.728885384426e-05
2150.00000  2200.00000  2.588428048463e-05
2200.00000  2250.00000  2.769016051844e-05
2250.00000  2300.00000  2.508166713627e-05
2300.00000  2350.00000  1.109612954109e-04
2350.00000  2400.00000  2.869342720390e-05
2400.00000  2450.00000  2.769016051844e-05
2450.00000  2500.00000  3.411106730533e-05
2500.00000  2550.00000  3.210453393443e-05
2550.00000  2600.00000  2.869342720390e-05
2600.00000  2650.00000  3.150257392316e-05
2650.00000  2700.00000  2.969669388935e-05
2700.00000  2750.00000  3.611760067623e-05
2750.00000  2800.00000  3.310780061988e-05
2800.00000  2850.00000  3.290714728279e-05
2850.00000  2900.00000  3.611760067623e-05
2900.00000  2950.00000  3.732152069877e-05
2950.00000  3000.00000  6.561364122849e-05
3000.00000  3050.00000  3.350910729406e-05
3050.00000  3100.00000  4.113393410349e-05
3100.00000  3150.00000  3.431172064242e-05
3150.00000  3200.00000  4.193654745185e-05
3200.00000  3250.00000  3.310780061988e-05
3250.00000  3300.00000  4.093328076640e-05
3300.00000  3350.00000  4.173589411476e-05
3350.00000  3400.00000  3.812413404713e-05
3400.00000  3450.00000  4.053197409222e-05
3450.00000  3500.00000  3.792348071004e-05
3500.00000  3550.00000  4.193654745185e-05
3550.00000  3600.00000  4.314046747439e-05
3600.00000  3650.00000  4.113393410349e-05
3650.00000  3700.00000  6.561364122849e-05
3700.00000  3750.00000  4.835745423873e-05
3750.00000  3800.00000  3.912740073258e-05
3800.00000  3850.00000  3.952870740677e-05
3850.00000  3900.00000  4.534765418238e-05
3900.00000  3950.00000  5.116660095800e-05
3950.00000  4000.00000  4.514700084529e-05
4000.00000  4050.00000  5.016333427254e-05
4050.00000  4100.00000  4.113393410349e-05
4100.00000  4150.00000  4.574896085656e-05
4150.00000  4200.00000  4.474569417111e-05
4200.00000  4250.00000  5.578162771107e-05
4250.00000  4300.00000  5.337378766599e-05
4300.00000  4350.00000  4.895941425000e-05
4350.00000  4400.00000  5.016333427254e-05
4400.00000  4450.00000  4.815680090164e-05
4450.00000  4500.00000  4.635092086783e-05
4500.00000  4550.00000  5.257117431763e-05
4550.00000  4600.00000  5.879142776742e-05
4600.00000  4650.00000  5.237052098054e-05
4650.00000  4700.00000  5.216986764345e-05
4700.00000  4750.00000  5.076529428382e-05
4750.00000  4800.00000  5.678489439652e-05
4800.00000  4850.00000  4.916006758709e-05
4850.00000  4900.00000  5.397574767726e-05
4900.00000  4950.00000  5.517966769980e-05
4950.00000  5000.00000  4.675222754201e-05
5000.00000  5050.00000  5.417640101435e-05
5050.00000  5100.00000  5.758750774488e-05
5100.00000  5150.00000  4.976202759836e-05
5150.00000  5200.00000  5.618293438525e-05
5200.00000  5250.00000  5.257117431763e-05
5250.00000  5300.00000  5.698554773361e-05
5300.00000  5350.00000  6.220253449796e-05
5350.00000  5400.00000  5.818946775615e-05
5400.00000  5450.00000  6.019600112705e-05
5450.00000  5500.00000  5.899208110451e-05
5500.00000  5550.00000  5.698554773361e-05
5550.00000  5600.00000  5.477836102562e-05
5600.00000  5650.00000  5.397574767726e-05
5650.00000  5700.00000  5.578162771107e-05
5700.00000  5750.00000  5.297248099181e-05
5750.00000  5800.00000  5.497901436271e-05
5800.00000  5850.00000  5.798881441906e-05
5850.00000  5900.00000  6.059730780123e-05
5900.00000  5950.00000  5.879142776742e-05
5950.00000  6000.00000  5.437705435144e-05
6000.00000  6050.00000  5.738685440779e-05
6050.00000  6100.00000  5.678489439652e-05
6100.00000  6150.00000  5.457770768853e-05
6150.00000  6200.00000  5.658424105943e-05
6200.00000  6250.00000  6.922540129611e-05
6250.00000  6300.00000  8.286982821824e-05
6300.00000  6350.00000  7.263650802664e-05
6350.00000  6400.00000  7.139245733669e-04
6400.00000  6450.00000  5.036398760963e-05
6450.00000  6500.00000  5.176856096927e-05
6500.00000  6550.00000  5.738685440779e-05
6550.00000  6600.00000  5.377509434017e-05
6600.00000  6650.00000  5.277182765472e-05
6650.00000  6700.00000  5.096594762091e-05
6700.00000  6750.00000  5.016333427254e-05
6750.00000  6800.00000  5.196921430636e-05
6800.00000  6850.00000  4.895941425000e-05
6850.00000  6900.00000  5.497901436271e-05
6900.00000  6950.00000  5.798881441906e-05
6950.00000  7000.00000  5.558097437398e-05
7000.00000  7050.00000  4.956137426127e-05
7050.00000  7100.00000  1.264116023668e-04
7100.00000  7150.00000  3.812413404713e-05
7150.00000  7200.00000  3.531498732787e-05
7200.00000  7250.00000  3.391041396824e-05
7250.00000  7300.00000  2.789081385553e-05
7300.00000  7350.00000  3.310780061988e-05
7350.00000  7400.00000  3.330845395697e-05
7400.00000  7450.00000  3.832478738422e-05
7450.00000  7500.00000  6.119926781250e-05
7500.00000  7550.00000  3.551564066496e-05
7550.00000  7600.00000  3.130192058607e-05
7600.00000  7650.00000  2.969669388935e-05
7650.00000  7700.00000  3.611760067623e-05
7700.00000  7750.00000  3.230518727152e-05
7750.00000  7800.00000  3.651890735041e-05
7800.00000  7850.00000  3.491368065369e-05
7850.00000  7900.00000  3.270649394570e-05
7900.00000  7950.00000  3.571629400205e-05
7950.00000  8000.00000  3.451237397951e-05
8000.00000  8050.00000  3.370976063115e-05
8050.00000  8100.00000  3.190388059734e-05
8100.00000  8150.00000  3.752217403586e-05
8150.00000  8200.00000  2.989734722644e-05
8200.00000  8250.00000  2.789081385553e-05
8250.00000  8300.00000  3.471302731660e-05
8300.00000  8350.00000  3.571629400205e-05
8350.00000  8400.00000  3.631825401332e-05
8400.00000  8450.00000  2.969669388935e-05
8450.00000  8500.00000  3.110126724898e-05
8500.00000  8550.00000  2.889408054099e-05
8550.00000  8600.00000  3.170322726025e-05
8600.00000  8650.00000  3.049930723771e-05
8650.00000  8700.00000  3.370976063115e-05
8700.00000  8750.00000  2.849277386681e-05
8750.00000  8800.00000  3.150257392316e-05
8800.00000  8850.00000  2.829212052972e-05
8850.00000  8900.00000  3.350910729406e-05
8900.00000  8950.00000  3.150257392316e-05
8950.00000  9000.00000  3.130192058607e-05
9000.00000  9050.00000  2.789081385553e-05
9050.00000  9100.00000  3.150257392316e-05
9100.00000  9150.00000  2.989734722644e-05
9150.00000  9200.00000  3.250584060861e-05
9200.00000  9250.00000  3.130192058607e-05
9250.00000  9300.00000  2.648624049590e-05
9300.00000  9350.00000  3.009800056353e-05
9350.00000  9400.00000  3.712086736168e-05
9400.00000  9450.00000  3.330845395697e-05
9450.00000  9500.00000  2.688754717008e-05
9500.00000  9550.00000  3.049930723771e-05
9550.00000  9600.00000  2.889408054099e-05
9600.00000  9650.00000  3.069996057480e-05
9650.00000  9700.00000  2.949604055226e-05
9700.00000  9750.00000  3.391041396824e-05
9750.00000  9800.00000  2.969669388935e-05
9800.00000  9850.00000  2.508166713627e-05
9850.00000  9900.00000  3.110126724898e-05
9900.00000  9950.00000  2.708820050717e-05
9950.00000  10000.00000  3.090061391189e-05
