300.00000  350.00000  2.166663267843e-02
350.00000  400.00000  1.718536133090e-02
400.00000  450.00000  1.407526242997e-02
450.00000  500.00000  1.173401661861e-02
500.00000  550.00000  1.007308697573e-02
550.00000  600.00000  8.646339405497e-03
600.00000  650.00000  7.660934972165e-03
650.00000  700.00000  6.656175064744e-03
700.00000  750.00000  5.967235170184e-03
750.00000  800.00000  5.312215264869e-03
800.00000  850.00000  4.908433245999e-03
850.00000  900.00000  4.444285144574e-03
900.00000  950.00000  4.080172265669e-03
950.00000  1000.00000  3.703411255180e-03
1000.00000  1050.00000  3.418445017848e-03
1050.00000  1100.00000  3.179855262986e-03
1100.00000  1150.00000  2.952955447921e-03
1150.00000  1200.00000  2.736595742508e-03
1200.00000  1250.00000  2.588650930659e-03
1250.00000  1300.00000  2.387239017117e-03
1300.00000  1350.00000  2.250792506706e-03
1350.00000  1400.00000  2.197517043371e-03
1400.00000  1450.00000  2.051680253452e-03
1450.00000  1500.00000  1.904693633389e-03
1500.00000  1550.00000  1.824972076744e-03
1550.00000  1600.00000  1.744867243385e-03
1600.00000  1650.00000  1.639466146860e-03
1650.00000  1700.00000  1.549971033992e-03
1700.00000  1750.00000  1.483472524003e-03
1750.00000  1800.00000  1.421190057874e-03
1800.00000  1850.00000  1.384587131626e-03
1850.00000  1900.00000  1.313489301061e-03
1900.00000  1950.00000  1.269604117235e-03
1950.00000  2000.00000  1.223419273121e-03
2000.00000  2050.00000  1.151554889127e-03
2050.00000  2100.00000  1.113802132735e-03
2100.00000  2150.00000  1.080073781847e-03
2150.00000  2200.00000  1.029289617158e-03
2200.00000  2250.00000  9.846378799026e-04
2250.00000  2300.00000  9.511011673718e-04
2300.00000  2350.00000  9.447771015803e-04
2350.00000  2400.00000  8.897768930299e-04
2400.00000  2450.00000  8.767454847322e-04
2450.00000  2500.00000  7.975988431597e-04
2500.00000  2550.00000  7.880169252938e-04
2550.00000  2600.00000  7.895500321523e-04
2600.00000  2650.00000  7.466230401130e-04
2650.00000  2700.00000  7.703861964205e-04
2700.00000  2750.00000  7.272675660238e-04
2750.00000  2800.00000  6.908562781333e-04
2800.00000  2850.00000  6.715008040441e-04
2850.00000  2900.00000  6.670931218258e-04
2900.00000  2950.00000  6.287654503621e-04
2950.00000  3000.00000  6.419884970170e-04
3000.00000  3050.00000  6.071103159851e-04
3050.00000  3100.00000  5.952287378313e-04
3100.00000  3150.00000  5.793227541739e-04
3150.00000  3200.00000  5.605421951567e-04
3200.00000  3250.00000  5.501937238615e-04
3250.00000  3300.00000  5.335211867748e-04
3300.00000  3350.00000  5.155071811868e-04
3350.00000  3400.00000  5.074583701794e-04
3400.00000  3450.00000  4.925105783086e-04
3450.00000  3500.00000  4.980680906708e-04
3500.00000  3550.00000  4.741132960060e-04
3550.00000  3600.00000  4.601236959218e-04
3600.00000  3650.00000  4.534163534156e-04
3650.00000  3700.00000  4.444093506216e-04
3700.00000  3750.00000  4.355939861850e-04
3750.00000  3800.00000  4.217960244581e-04
3800.00000  3850.00000  4.315695806813e-04
3850.00000  3900.00000  4.189214490983e-04
3900.00000  3950.00000  4.028238270835e-04
3950.00000  4000.00000  3.773359255602e-04
4000.00000  4050.00000  3.871094817834e-04
4050.00000  4100.00000  3.821268844931e-04
4100.00000  4150.00000  3.859596516395e-04
4150.00000  4200.00000  3.510814706075e-04
4200.00000  4250.00000  3.625797720466e-04
4250.00000  4300.00000  3.378584239526e-04
4300.00000  4350.00000  3.493567253917e-04
4350.00000  4400.00000  3.363253170940e-04
4400.00000  4450.00000  3.133287142158e-04
4450.00000  4500.00000  3.223357170098e-04
4500.00000  4550.00000  3.217608019378e-04
4550.00000  4600.00000  3.068130100670e-04
4600.00000  4650.00000  3.211858868658e-04
4650.00000  4700.00000  3.052799032084e-04
4700.00000  4750.00000  3.119872457146e-04
4750.00000  4800.00000  2.928234099827e-04
4800.00000  4850.00000  2.914819414815e-04
4850.00000  4900.00000  2.887990044790e-04
4900.00000  4950.00000  2.905237496949e-04
4950.00000  5000.00000  2.773007030399e-04
5000.00000  5050.00000  2.759592345387e-04
5050.00000  5100.00000  2.669522317447e-04
5100.00000  5150.00000  2.725097441069e-04
5150.00000  5200.00000  2.633111029556e-04
5200.00000  5250.00000  2.659940399581e-04
5250.00000  5300.00000  2.546873768763e-04
5300.00000  5350.00000  2.489382261568e-04
5350.00000  5400.00000  2.420392452933e-04
5400.00000  5450.00000  2.385897548616e-04
5450.00000  5500.00000  2.428057987226e-04
5500.00000  5550.00000  2.410810535067e-04
5550.00000  5600.00000  2.343737110006e-04
5600.00000  5650.00000  2.288161986383e-04
5650.00000  5700.00000  2.320740507127e-04
5700.00000  5750.00000  2.219172177748e-04
5750.00000  5800.00000  2.201924725590e-04
5800.00000  5850.00000  2.207673876309e-04
5850.00000  5900.00000  2.232586862761e-04
5900.00000  5950.00000  2.042864889015e-04
5950.00000  6000.00000  2.090774478345e-04
6000.00000  6050.00000  2.094607245491e-04
6050.00000  6100.00000  2.161680670553e-04
6100.00000  6150.00000  2.178928122712e-04
6150.00000  6200.00000  2.008369984698e-04
6200.00000  6250.00000  2.098440012638e-04
6250.00000  6300.00000  2.119520231943e-04
6300.00000  6350.00000  2.098440012638e-04
6350.00000  6400.00000  3.882593119273e-04
6400.00000  6450.00000  2.008369984698e-04
6450.00000  6500.00000  1.920216340332e-04
6500.00000  6550.00000  1.862724833136e-04
6550.00000  6600.00000  1.927881874624e-04
6600.00000  6650.00000  1.856975682416e-04
6650.00000  6700.00000  1.866557600282e-04
6700.00000  6750.00000  1.818648010953e-04
6750.00000  6800.00000  1.807149709514e-04
6800.00000  6850.00000  1.730494366586e-04
6850.00000  6900.00000  1.797567791648e-04
6900.00000  6950.00000  1.753490969464e-04
6950.00000  7000.00000  1.709414147281e-04
7000.00000  7050.00000  1.671086475818e-04
7050.00000  7100.00000  1.801400558794e-04
7100.00000  7150.00000  1.494779187084e-04
7150.00000  7200.00000  1.548437927134e-04
7200.00000  7250.00000  1.561852612146e-04
7250.00000  7300.00000  1.515859406389e-04
7300.00000  7350.00000  1.471782584206e-04
7350.00000  7400.00000  1.513943022816e-04
7400.00000  7450.00000  1.464117049913e-04
7450.00000  7500.00000  1.525441324255e-04
7500.00000  7550.00000  1.444953214182e-04
7550.00000  7600.00000  1.408541926291e-04
7600.00000  7650.00000  1.421956611303e-04
7650.00000  7700.00000  1.389378090559e-04
7700.00000  7750.00000  1.310806364059e-04
7750.00000  7800.00000  1.322304665498e-04
7800.00000  7850.00000  1.379796172693e-04
7850.00000  7900.00000  1.364465104108e-04
7900.00000  7950.00000  1.262896774729e-04
7950.00000  8000.00000  1.316555514778e-04
8000.00000  8050.00000  1.301224446193e-04
8050.00000  8100.00000  1.360632336961e-04
8100.00000  8150.00000  1.224569103265e-04
8150.00000  8200.00000  1.322304665498e-04
8200.00000  8250.00000  1.272478692595e-04
8250.00000  8300.00000  1.347217651949e-04
8300.00000  8350.00000  1.278227843315e-04
8350.00000  8400.00000  1.291642528327e-04
8400.00000  8450.00000  1.188157815375e-04
8450.00000  8500.00000  1.218819952546e-04
8500.00000  8550.00000  1.270562309022e-04
8550.00000  8600.00000  1.226485486839e-04
8600.00000  8650.00000  1.230318253985e-04
8650.00000  8700.00000  1.243732938997e-04
8700.00000  8750.00000  1.088505869569e-04
8750.00000  8800.00000  1.105753321728e-04
8800.00000  8850.00000  1.184325048228e-04
8850.00000  8900.00000  1.063592883118e-04
8900.00000  8950.00000  1.111502472447e-04
8950.00000  9000.00000  1.144080993192e-04
9000.00000  9050.00000  1.159412061777e-04
9050.00000  9100.00000  1.157495678204e-04
9100.00000  9150.00000  1.067425650264e-04
9150.00000  9200.00000  1.161328445350e-04
9200.00000  9250.00000  1.055927348825e-04
9250.00000  9300.00000  1.006101375922e-04
9300.00000  9350.00000  1.078923951703e-04
9350.00000  9400.00000  1.052094581679e-04
9400.00000  9450.00000  1.132582691752e-04
9450.00000  9500.00000  1.092338636716e-04
9500.00000  9550.00000  1.000352225203e-04
9550.00000  9600.00000  9.543590194462e-05
9600.00000  9650.00000  9.850211566172e-05
9650.00000  9700.00000  1.021432444508e-04
9700.00000  9750.00000  9.677737044585e-05
9750.00000  9800.00000  1.015683293788e-04
9800.00000  9850.00000  1.046345430959e-04
9850.00000  9900.00000  9.026166629702e-05
9900.00000  9950.00000  1.004184992349e-04
9950.00000  10000.00000  9.811883894708e-05
