300.00000  350.00000  1.324863303668e-01
350.00000  400.00000  1.049380926259e-01
400.00000  450.00000  8.613332683003e-02
450.00000  500.00000  7.197843512970e-02
500.00000  550.00000  6.133612446347e-02
550.00000  600.00000  5.292549049451e-02
600.00000  650.00000  4.630158954043e-02
650.00000  700.00000  4.101193977649e-02
700.00000  750.00000  3.651746738415e-02
750.00000  800.00000  3.283730764777e-02
800.00000  850.00000  2.972057572818e-02
850.00000  900.00000  2.687135121799e-02
900.00000  950.00000  2.457395738256e-02
950.00000  1000.00000  2.274334851369e-02
1000.00000  1050.00000  2.087021679072e-02
1050.00000  1100.00000  1.930962804537e-02
1100.00000  1150.00000  1.794870342857e-02
1150.00000  1200.00000  1.678531679762e-02
1200.00000  1250.00000  1.569131973313e-02
1250.00000  1300.00000  1.482037436695e-02
1300.00000  1350.00000  1.381393572476e-02
1350.00000  1400.00000  1.304465863700e-02
1400.00000  1450.00000  1.227286883515e-02
1450.00000  1500.00000  1.168122130610e-02
1500.00000  1550.00000  1.100278849755e-02
1550.00000  1600.00000  1.054064238780e-02
1600.00000  1650.00000  9.933532002719e-03
1650.00000  1700.00000  9.465587321954e-03
1700.00000  1750.00000  9.164834772069e-03
1750.00000  1800.00000  8.653594094405e-03
1800.00000  1850.00000  8.283258692362e-03
1850.00000  1900.00000  7.889149149164e-03
1900.00000  1950.00000  7.618162597147e-03
1950.00000  2000.00000  7.269861764954e-03
2000.00000  2050.00000  7.022456068391e-03
2050.00000  2100.00000  6.793219227669e-03
2100.00000  2150.00000  6.476810536048e-03
2150.00000  2200.00000  6.267482122471e-03
2200.00000  2250.00000  6.043463995661e-03
2250.00000  2300.00000  5.843220010005e-03
2300.00000  2350.00000  5.675641307724e-03
2350.00000  2400.00000  5.389191899672e-03
2400.00000  2450.00000  5.214654912174e-03
2450.00000  2500.00000  5.062345780227e-03
2500.00000  2550.00000  4.892640935241e-03
2550.00000  2600.00000  4.756181230730e-03
2600.00000  2650.00000  4.672488522440e-03
2650.00000  2700.00000  4.479589393400e-03
2700.00000  2750.00000  4.395316828008e-03
2750.00000  2800.00000  4.267361694317e-03
2800.00000  2850.00000  4.144625274538e-03
2850.00000  2900.00000  3.985164571674e-03
2900.00000  2950.00000  3.931044575551e-03
2950.00000  3000.00000  3.799803584952e-03
3000.00000  3050.00000  3.700454734926e-03
3050.00000  3100.00000  3.574239172539e-03
3100.00000  3150.00000  3.494798749658e-03
3150.00000  3200.00000  3.412652326971e-03
3200.00000  3250.00000  3.281797907773e-03
3250.00000  3300.00000  3.246813195993e-03
3300.00000  3350.00000  3.160414487896e-03
3350.00000  3400.00000  3.038064639518e-03
3400.00000  3450.00000  3.044056496232e-03
3450.00000  3500.00000  2.966742216055e-03
3500.00000  3550.00000  2.904310934813e-03
3550.00000  3600.00000  2.887881650276e-03
3600.00000  3650.00000  2.763985516294e-03
3650.00000  3700.00000  2.723202233501e-03
3700.00000  3750.00000  2.651106667237e-03
3750.00000  3800.00000  2.567800530347e-03
3800.00000  3850.00000  2.554270531316e-03
3850.00000  3900.00000  2.501310249396e-03
3900.00000  3950.00000  2.464972537713e-03
3950.00000  4000.00000  2.396549399757e-03
4000.00000  4050.00000  2.377027544013e-03
4050.00000  4100.00000  2.281351122295e-03
4100.00000  4150.00000  2.254677695634e-03
4150.00000  4200.00000  2.224718412066e-03
4200.00000  4250.00000  2.160160988119e-03
4250.00000  4300.00000  2.134647275661e-03
4300.00000  4350.00000  2.080140708137e-03
4350.00000  4400.00000  2.069123423212e-03
4400.00000  4450.00000  2.027953569018e-03
4450.00000  4500.00000  1.985237429221e-03
4500.00000  4550.00000  1.913335148657e-03
4550.00000  4600.00000  1.911402291652e-03
4600.00000  4650.00000  1.866173437749e-03
4650.00000  4700.00000  1.874678008569e-03
4700.00000  4750.00000  1.847811296208e-03
4750.00000  4800.00000  1.831768583071e-03
4800.00000  4850.00000  1.795624157089e-03
4850.00000  4900.00000  1.719276305415e-03
4900.00000  4950.00000  1.704393306481e-03
4950.00000  5000.00000  1.690283450349e-03
5000.00000  5050.00000  1.660130881080e-03
5050.00000  5100.00000  1.638096311230e-03
5100.00000  5150.00000  1.632877597318e-03
5150.00000  5200.00000  1.590354743221e-03
5200.00000  5250.00000  1.602145170948e-03
5250.00000  5300.00000  1.536621318499e-03
5300.00000  5350.00000  1.535075032895e-03
5350.00000  5400.00000  1.508208320534e-03
5400.00000  5450.00000  1.503762749424e-03
5450.00000  5500.00000  1.452735324508e-03
5500.00000  5550.00000  1.466845180640e-03
5550.00000  5600.00000  1.422776040940e-03
5600.00000  5650.00000  1.387404757759e-03
5650.00000  5700.00000  1.411952041715e-03
5700.00000  5750.00000  1.333284761636e-03
5750.00000  5800.00000  1.333284761636e-03
5800.00000  5850.00000  1.366143330711e-03
5850.00000  5900.00000  1.294434335848e-03
5900.00000  5950.00000  1.284963336526e-03
5950.00000  6000.00000  1.263315338077e-03
6000.00000  6050.00000  1.246112910737e-03
6050.00000  6100.00000  1.258289909865e-03
6100.00000  6150.00000  1.223111912385e-03
6150.00000  6200.00000  1.241280768226e-03
6200.00000  6250.00000  1.204169913742e-03
6250.00000  6300.00000  1.221372341081e-03
6300.00000  6350.00000  1.174983772976e-03
6350.00000  6400.00000  2.112419420110e-03
6400.00000  6450.00000  1.151402917522e-03
6450.00000  6500.00000  1.117384634244e-03
6500.00000  6550.00000  1.107720349222e-03
6550.00000  6600.00000  1.113712205936e-03
6600.00000  6650.00000  1.081820065363e-03
6650.00000  6700.00000  1.054760067302e-03
6700.00000  6750.00000  1.069836351936e-03
6750.00000  6800.00000  1.054953353002e-03
6800.00000  6850.00000  1.028666497742e-03
6850.00000  6900.00000  1.033112068852e-03
6900.00000  6950.00000  1.013976784509e-03
6950.00000  7000.00000  1.014363355910e-03
7000.00000  7050.00000  9.826645010376e-04
7050.00000  7100.00000  1.105207635117e-03
7100.00000  7150.00000  9.351162187293e-04
7150.00000  7200.00000  9.430409324474e-04
7200.00000  7250.00000  9.150145058836e-04
7250.00000  7300.00000  9.144346487822e-04
7300.00000  7350.00000  9.030307924563e-04
7350.00000  7400.00000  8.925933646325e-04
7400.00000  7450.00000  9.038039352580e-04
7450.00000  7500.00000  9.059300779629e-04
7500.00000  7550.00000  8.844753652140e-04
7550.00000  7600.00000  8.380867971084e-04
7600.00000  7650.00000  8.320949403947e-04
7650.00000  7700.00000  7.961438001129e-04
7700.00000  7750.00000  8.317083689939e-04
7750.00000  7800.00000  8.301620833903e-04
7800.00000  7850.00000  7.998162284212e-04
7850.00000  7900.00000  8.243635123771e-04
7900.00000  7950.00000  8.042617995314e-04
7950.00000  8000.00000  8.029087996283e-04
8000.00000  8050.00000  7.916982290028e-04
8050.00000  8100.00000  7.685039449499e-04
8100.00000  8150.00000  7.857063722891e-04
8150.00000  8200.00000  7.802943726768e-04
8200.00000  8250.00000  7.514948033112e-04
8250.00000  8300.00000  7.820339439807e-04
8300.00000  8350.00000  7.354520901747e-04
8350.00000  8400.00000  7.134175203245e-04
8400.00000  8450.00000  7.186362342364e-04
8450.00000  8500.00000  7.232750910469e-04
8500.00000  8550.00000  7.232750910469e-04
8550.00000  8600.00000  7.329393760690e-04
8600.00000  8650.00000  7.153503773289e-04
8650.00000  8700.00000  6.886769506682e-04
8700.00000  8750.00000  6.971815214875e-04
8750.00000  8800.00000  6.774663800426e-04
8800.00000  8850.00000  6.793992370470e-04
8850.00000  8900.00000  6.660625237167e-04
8900.00000  8950.00000  6.531123817872e-04
8950.00000  9000.00000  6.620035240074e-04
9000.00000  9050.00000  6.538855245889e-04
9050.00000  9100.00000  6.293382406330e-04
9100.00000  9150.00000  6.291449549326e-04
9150.00000  9200.00000  6.382293828533e-04
9200.00000  9250.00000  6.473138107740e-04
9250.00000  9300.00000  6.314643833379e-04
9300.00000  9350.00000  6.235396696198e-04
9350.00000  9400.00000  6.254725266242e-04
9400.00000  9450.00000  6.109760990912e-04
9450.00000  9500.00000  5.949333859547e-04
9500.00000  9550.00000  5.823698154261e-04
9550.00000  9600.00000  5.777309586155e-04
9600.00000  9650.00000  5.831429582279e-04
9650.00000  9700.00000  5.872019579371e-04
9700.00000  9750.00000  6.022782425714e-04
9750.00000  9800.00000  5.827563868270e-04
9800.00000  9850.00000  5.879751007389e-04
9850.00000  9900.00000  5.732853875054e-04
9900.00000  9950.00000  5.663271022896e-04
9950.00000  10000.00000  5.512508176552e-04
