10001.00000  11001.00000  1.777908825897e-04
11001.00000  12001.00000  1.467062779555e-04
12001.00000  13001.00000  1.200952452050e-04
13001.00000  14001.00000  1.008953658757e-04
14001.00000  15001.00000  8.620745818874e-05
15001.00000  16001.00000  7.390033553863e-05
16001.00000  17001.00000  6.393559816671e-05
17001.00000  18001.00000  5.527645258917e-05
18001.00000  19001.00000  4.913249120378e-05
19001.00000  20001.00000  4.385252438822e-05
20001.00000  21001.00000  3.588457446654e-05
21001.00000  22001.00000  3.296619280848e-05
22001.00000  23001.00000  3.058540777164e-05
23001.00000  24001.00000  2.672623202644e-05
24001.00000  25001.00000  2.426864747229e-05
25001.00000  26001.00000  2.087026883099e-05
26001.00000  27001.00000  1.852788355281e-05
27001.00000  28001.00000  1.799028693159e-05
28001.00000  29001.00000  1.608949887799e-05
29001.00000  30001.00000  1.378551335847e-05
30001.00000  31001.00000  1.328631649590e-05
31001.00000  32001.00000  1.180792578754e-05
32001.00000  33001.00000  1.075193242443e-05
33001.00000  34001.00000  9.215942078084e-06
34001.00000  35001.00000  1.025273556187e-05
35001.00000  36001.00000  8.236748232287e-06
36001.00000  37001.00000  7.065555593198e-06
37001.00000  38001.00000  7.967949921677e-06
38001.00000  39001.00000  7.123155231186e-06
39001.00000  40001.00000  6.470359333988e-06
40001.00000  41001.00000  5.011168504958e-06
41001.00000  42001.00000  5.452765729533e-06
42001.00000  43001.00000  4.895969228982e-06
43001.00000  44001.00000  4.819169711665e-06
44001.00000  45001.00000  3.935975262515e-06
45001.00000  46001.00000  3.955175141844e-06
46001.00000  47001.00000  3.609577313916e-06
47001.00000  48001.00000  3.628777193245e-06
48001.00000  49001.00000  3.071980692695e-06
49001.00000  50001.00000  3.225579727329e-06
50001.00000  51001.00000  3.052780813365e-06
51001.00000  52001.00000  2.591983709461e-06
52001.00000  53001.00000  2.553583950802e-06
53001.00000  54001.00000  2.457584554156e-06
54001.00000  55001.00000  2.284785640192e-06
55001.00000  56001.00000  1.689589380982e-06
56001.00000  57001.00000  1.939187812263e-06
57001.00000  58001.00000  1.919987932934e-06
58001.00000  59001.00000  1.555190225677e-06
59001.00000  60001.00000  1.516790467018e-06
60001.00000  61001.00000  1.420791070371e-06
61001.00000  62001.00000  1.651189622323e-06
62001.00000  63001.00000  1.228792277078e-06
63001.00000  64001.00000  1.516790467018e-06
64001.00000  65001.00000  1.017593604455e-06
65001.00000  66001.00000  1.535990346347e-06
66001.00000  67001.00000  1.113593001102e-06
67001.00000  68001.00000  1.209592397748e-06
68001.00000  69001.00000  9.599939664671e-07
69001.00000  70001.00000  8.255948111617e-07
70001.00000  71001.00000  1.055993363114e-06
71001.00000  72001.00000  6.911956558563e-07
72001.00000  73001.00000  7.871950525030e-07
73001.00000  74001.00000  7.679951731736e-07
74001.00000  75001.00000  5.567965005509e-07
75001.00000  76001.00000  7.295954145150e-07
76001.00000  77001.00000  7.103955351856e-07
77001.00000  78001.00000  5.567965005509e-07
78001.00000  79001.00000  6.143961385389e-07
79001.00000  80001.00000  5.183967418922e-07
80001.00000  81001.00000  5.567965005509e-07
81001.00000  82001.00000  4.991968625629e-07
82001.00000  83001.00000  4.415972245748e-07
83001.00000  84001.00000  3.455978279281e-07
84001.00000  85001.00000  2.879981899401e-07
85001.00000  86001.00000  4.799969832335e-07
86001.00000  87001.00000  2.111986726228e-07
87001.00000  88001.00000  2.303985519521e-07
88001.00000  89001.00000  4.223973452455e-07
89001.00000  90001.00000  3.839975865868e-07
90001.00000  91001.00000  3.839975865868e-07
91001.00000  92001.00000  2.495984312814e-07
92001.00000  93001.00000  1.727989139641e-07
93001.00000  94001.00000  1.343991553054e-07
94001.00000  95001.00000  2.303985519521e-07
95001.00000  96001.00000  2.495984312814e-07
96001.00000  97001.00000  1.919987932934e-07
97001.00000  98001.00000  1.535990346347e-07
98001.00000  99001.00000  1.535990346347e-07
99001.00000  100001.00000  2.303985519521e-07
100001.00000  101001.00000  1.343991553054e-07
101001.00000  102001.00000  1.727989139641e-07
102001.00000  103001.00000  1.727989139641e-07
103001.00000  104001.00000  1.919987932934e-07
104001.00000  105001.00000  9.599939664671e-08
105001.00000  106001.00000  1.535990346347e-07
106001.00000  107001.00000  2.111986726228e-07
107001.00000  108001.00000  2.303985519521e-07
108001.00000  109001.00000  1.727989139641e-07
109001.00000  110001.00000  2.303985519521e-07
110001.00000  111001.00000  9.599939664671e-08
111001.00000  112001.00000  1.151992759760e-07
112001.00000  113001.00000  9.599939664671e-08
113001.00000  114001.00000  1.535990346347e-07
114001.00000  115001.00000  1.151992759760e-07
115001.00000  116001.00000  1.535990346347e-07
116001.00000  117001.00000  9.599939664671e-08
117001.00000  118001.00000  1.727989139641e-07
118001.00000  119001.00000  3.839975865868e-08
119001.00000  120001.00000  3.839975865868e-08
120001.00000  121001.00000  0.000000000000e+00
121001.00000  122001.00000  5.759963798802e-08
122001.00000  123001.00000  3.839975865868e-08
123001.00000  124001.00000  9.599939664671e-08
124001.00000  125001.00000  5.759963798802e-08
125001.00000  126001.00000  1.151992759760e-07
126001.00000  127001.00000  1.151992759760e-07
127001.00000  128001.00000  1.919987932934e-08
128001.00000  129001.00000  3.839975865868e-08
129001.00000  130001.00000  1.919987932934e-08
130001.00000  131001.00000  5.759963798802e-08
131001.00000  132001.00000  7.679951731736e-08
132001.00000  133001.00000  3.839975865868e-08
133001.00000  134001.00000  3.839975865868e-08
134001.00000  135001.00000  5.759963798802e-08
135001.00000  136001.00000  3.839975865868e-08
136001.00000  137001.00000  5.759963798802e-08
137001.00000  138001.00000  9.599939664671e-08
138001.00000  139001.00000  5.759963798802e-08
139001.00000  140001.00000  1.919987932934e-08
140001.00000  141001.00000  1.919987932934e-08
141001.00000  142001.00000  7.679951731736e-08
142001.00000  143001.00000  3.839975865868e-08
143001.00000  144001.00000  1.919987932934e-08
144001.00000  145001.00000  0.000000000000e+00
145001.00000  146001.00000  1.919987932934e-08
146001.00000  147001.00000  3.839975865868e-08
147001.00000  148001.00000  5.759963798802e-08
148001.00000  149001.00000  0.000000000000e+00
149001.00000  150001.00000  5.759963798802e-08
150001.00000  151001.00000  3.839975865868e-08
151001.00000  152001.00000  1.919987932934e-08
152001.00000  153001.00000  7.679951731736e-08
153001.00000  154001.00000  1.919987932934e-08
154001.00000  155001.00000  0.000000000000e+00
155001.00000  156001.00000  3.839975865868e-08
156001.00000  157001.00000  1.919987932934e-08
157001.00000  158001.00000  1.919987932934e-08
158001.00000  159001.00000  5.759963798802e-08
159001.00000  160001.00000  0.000000000000e+00
160001.00000  161001.00000  0.000000000000e+00
161001.00000  162001.00000  0.000000000000e+00
162001.00000  163001.00000  0.000000000000e+00
163001.00000  164001.00000  5.759963798802e-08
164001.00000  165001.00000  1.919987932934e-08
165001.00000  166001.00000  0.000000000000e+00
166001.00000  167001.00000  0.000000000000e+00
167001.00000  168001.00000  0.000000000000e+00
168001.00000  169001.00000  0.000000000000e+00
169001.00000  170001.00000  0.000000000000e+00
170001.00000  171001.00000  0.000000000000e+00
171001.00000  172001.00000  5.759963798802e-08
172001.00000  173001.00000  0.000000000000e+00
173001.00000  174001.00000  1.919987932934e-08
174001.00000  175001.00000  0.000000000000e+00
175001.00000  176001.00000  0.000000000000e+00
176001.00000  177001.00000  0.000000000000e+00
177001.00000  178001.00000  1.919987932934e-08
178001.00000  179001.00000  1.919987932934e-08
179001.00000  180001.00000  0.000000000000e+00
180001.00000  181001.00000  0.000000000000e+00
181001.00000  182001.00000  1.919987932934e-08
182001.00000  183001.00000  0.000000000000e+00
183001.00000  184001.00000  0.000000000000e+00
184001.00000  185001.00000  3.839975865868e-08
185001.00000  186001.00000  0.000000000000e+00
186001.00000  187001.00000  1.919987932934e-08
187001.00000  188001.00000  0.000000000000e+00
188001.00000  189001.00000  0.000000000000e+00
189001.00000  190001.00000  0.000000000000e+00
190001.00000  191001.00000  0.000000000000e+00
191001.00000  192001.00000  0.000000000000e+00
192001.00000  193001.00000  1.919987932934e-08
193001.00000  194001.00000  0.000000000000e+00
194001.00000  195001.00000  0.000000000000e+00
195001.00000  196001.00000  0.000000000000e+00
196001.00000  197001.00000  0.000000000000e+00
197001.00000  198001.00000  0.000000000000e+00
198001.00000  199001.00000  0.000000000000e+00
