300.00000  350.00000  0.000000000000e+00
350.00000  400.00000  3.860184242521e-07
400.00000  450.00000  0.000000000000e+00
450.00000  500.00000  0.000000000000e+00
500.00000  550.00000  3.860184242521e-06
550.00000  600.00000  0.000000000000e+00
600.00000  650.00000  3.860184242521e-07
650.00000  700.00000  3.860184242521e-07
700.00000  750.00000  2.316110545513e-06
750.00000  800.00000  0.000000000000e+00
800.00000  850.00000  6.948331636538e-06
850.00000  900.00000  1.158055272756e-06
900.00000  950.00000  3.860184242521e-07
950.00000  1000.00000  1.158055272756e-06
1000.00000  1050.00000  1.158055272756e-06
1050.00000  1100.00000  1.544073697009e-06
1100.00000  1150.00000  3.088147394017e-06
1150.00000  1200.00000  2.702128969765e-06
1200.00000  1250.00000  3.088147394017e-06
1250.00000  1300.00000  1.196657115182e-05
1300.00000  1350.00000  4.632221091026e-06
1350.00000  1400.00000  5.404257939530e-06
1400.00000  1450.00000  3.860184242521e-06
1450.00000  1500.00000  1.003647903056e-05
1500.00000  1550.00000  8.106386909295e-06
1550.00000  1600.00000  7.720368485043e-06
1600.00000  1650.00000  8.492405333547e-06
1650.00000  1700.00000  8.106386909295e-06
1700.00000  1750.00000  3.744378715246e-05
1750.00000  1800.00000  1.080851587906e-05
1800.00000  1850.00000  1.235258957607e-05
1850.00000  1900.00000  8.492405333547e-06
1900.00000  1950.00000  9.650460606303e-06
1950.00000  2000.00000  1.544073697009e-05
2000.00000  2050.00000  1.273860800032e-05
2050.00000  2100.00000  1.158055272756e-05
2100.00000  2150.00000  1.158055272756e-05
2150.00000  2200.00000  1.621277381859e-05
2200.00000  2250.00000  1.582675539434e-05
2250.00000  2300.00000  1.814286593985e-05
2300.00000  2350.00000  6.523711369861e-05
2350.00000  2400.00000  1.968693963686e-05
2400.00000  2450.00000  1.775684751560e-05
2450.00000  2500.00000  1.930092121261e-05
2500.00000  2550.00000  1.428268169733e-05
2550.00000  2600.00000  1.698481066709e-05
2600.00000  2650.00000  2.084499490962e-05
2650.00000  2700.00000  1.737082909135e-05
2700.00000  2750.00000  2.200305018237e-05
2750.00000  2800.00000  2.045897648536e-05
2800.00000  2850.00000  1.968693963686e-05
2850.00000  2900.00000  2.393314230363e-05
2900.00000  2950.00000  2.084499490962e-05
2950.00000  3000.00000  5.018239515278e-05
3000.00000  3050.00000  2.933740024316e-05
3050.00000  3100.00000  3.203952921293e-05
3100.00000  3150.00000  3.088147394017e-05
3150.00000  3200.00000  3.551369503120e-05
3200.00000  3250.00000  3.744378715246e-05
3250.00000  3300.00000  3.782980557671e-05
3300.00000  3350.00000  4.477813721325e-05
3350.00000  3400.00000  4.207600824348e-05
3400.00000  3450.00000  5.365656097105e-05
3450.00000  3500.00000  5.867480048632e-05
3500.00000  3550.00000  7.102739006239e-05
3550.00000  3600.00000  7.141340848665e-05
3600.00000  3650.00000  7.681766642618e-05
3650.00000  3700.00000  1.011368271541e-04
3700.00000  3750.00000  8.183590594145e-05
3750.00000  3800.00000  8.299396121421e-05
3800.00000  3850.00000  1.030669192753e-04
3850.00000  3900.00000  1.270000615790e-04
3900.00000  3950.00000  1.246839510334e-04
3950.00000  4000.00000  1.212097852152e-04
4000.00000  4050.00000  1.428268169733e-04
4050.00000  4100.00000  1.212097852152e-04
4100.00000  4150.00000  1.354924669125e-04
4150.00000  4200.00000  1.513192223068e-04
4200.00000  4250.00000  1.679180145497e-04
4250.00000  4300.00000  1.771824567317e-04
4300.00000  4350.00000  1.837447699440e-04
4350.00000  4400.00000  2.003435621869e-04
4400.00000  4450.00000  2.084499490962e-04
4450.00000  4500.00000  2.157842991569e-04
4500.00000  4550.00000  2.165563360054e-04
4550.00000  4600.00000  2.377873493393e-04
4600.00000  4650.00000  2.536141047337e-04
4650.00000  4700.00000  2.505259573396e-04
4700.00000  4750.00000  2.567022521277e-04
4750.00000  4800.00000  2.733010443705e-04
4800.00000  4850.00000  2.613344732187e-04
4850.00000  4900.00000  2.914439103104e-04
4900.00000  4950.00000  2.895138181891e-04
4950.00000  5000.00000  2.980062235227e-04
5000.00000  5050.00000  3.045685367349e-04
5050.00000  5100.00000  3.003223340682e-04
5100.00000  5150.00000  3.219393658263e-04
5150.00000  5200.00000  3.230974210990e-04
5200.00000  5250.00000  3.296597343113e-04
5250.00000  5300.00000  3.393101949176e-04
5300.00000  5350.00000  3.505047292209e-04
5350.00000  5400.00000  3.566810240090e-04
5400.00000  5450.00000  3.829302768581e-04
5450.00000  5500.00000  3.574530608575e-04
5500.00000  5550.00000  3.373801027964e-04
5550.00000  5600.00000  3.694196320093e-04
5600.00000  5650.00000  3.466445449784e-04
5650.00000  5700.00000  3.644013924940e-04
5700.00000  5750.00000  3.601551898272e-04
5750.00000  5800.00000  3.647874109183e-04
5800.00000  5850.00000  3.709637057063e-04
5850.00000  5900.00000  3.898786084947e-04
5900.00000  5950.00000  3.968269401312e-04
5950.00000  6000.00000  3.647874109183e-04
6000.00000  6050.00000  3.894925900704e-04
6050.00000  6100.00000  3.698056504335e-04
6100.00000  6150.00000  3.918087006159e-04
6150.00000  6200.00000  4.053193454647e-04
6200.00000  6250.00000  4.435351694657e-04
6250.00000  6300.00000  4.933315461942e-04
6300.00000  6350.00000  4.871552514062e-04
6350.00000  6400.00000  2.181004097025e-03
6400.00000  6450.00000  3.810001847369e-04
6450.00000  6500.00000  3.628573187970e-04
6500.00000  6550.00000  3.825442584339e-04
6550.00000  6600.00000  3.690336135850e-04
6600.00000  6650.00000  3.640153740698e-04
6650.00000  6700.00000  3.547509318877e-04
6700.00000  6750.00000  3.543649134635e-04
6750.00000  6800.00000  3.547509318877e-04
6800.00000  6850.00000  3.582250977060e-04
6850.00000  6900.00000  3.636293556455e-04
6900.00000  6950.00000  3.601551898272e-04
6950.00000  7000.00000  3.420123238874e-04
7000.00000  7050.00000  3.478026002512e-04
7050.00000  7100.00000  5.203528358919e-04
7100.00000  7150.00000  1.798845857015e-04
7150.00000  7200.00000  1.640578303072e-04
7200.00000  7250.00000  1.686900513982e-04
7250.00000  7300.00000  1.771824567317e-04
7300.00000  7350.00000  1.926231937018e-04
7350.00000  7400.00000  1.879909726108e-04
7400.00000  7450.00000  1.856748620653e-04
7450.00000  7500.00000  2.428055888546e-04
7500.00000  7550.00000  1.872189357623e-04
7550.00000  7600.00000  1.833587515198e-04
7600.00000  7650.00000  1.694620882467e-04
7650.00000  7700.00000  1.879909726108e-04
7700.00000  7750.00000  1.713921803679e-04
7750.00000  7800.00000  1.760244014590e-04
7800.00000  7850.00000  1.787265304287e-04
7850.00000  7900.00000  1.648298671557e-04
7900.00000  7950.00000  1.787265304287e-04
7950.00000  8000.00000  1.671459777012e-04
8000.00000  8050.00000  1.640578303072e-04
8050.00000  8100.00000  1.860608804895e-04
8100.00000  8150.00000  1.663739408527e-04
8150.00000  8200.00000  1.686900513982e-04
8200.00000  8250.00000  1.717781987922e-04
8250.00000  8300.00000  1.806566225500e-04
8300.00000  8350.00000  1.814286593985e-04
8350.00000  8400.00000  1.690760698224e-04
8400.00000  8450.00000  1.698481066709e-04
8450.00000  8500.00000  1.733222724892e-04
8500.00000  8550.00000  1.648298671557e-04
8550.00000  8600.00000  1.648298671557e-04
8600.00000  8650.00000  1.748663461862e-04
8650.00000  8700.00000  1.667599592769e-04
8700.00000  8750.00000  1.648298671557e-04
8750.00000  8800.00000  1.806566225500e-04
8800.00000  8850.00000  1.648298671557e-04
8850.00000  8900.00000  1.671459777012e-04
8900.00000  8950.00000  1.571094986706e-04
8950.00000  9000.00000  1.706201435194e-04
9000.00000  9050.00000  1.725502356407e-04
9050.00000  9100.00000  1.536353328524e-04
9100.00000  9150.00000  1.605836644889e-04
9150.00000  9200.00000  1.748663461862e-04
9200.00000  9250.00000  1.663739408527e-04
9250.00000  9300.00000  1.632857934587e-04
9300.00000  9350.00000  1.609696829131e-04
9350.00000  9400.00000  1.490031117613e-04
9400.00000  9450.00000  1.528632960038e-04
9450.00000  9500.00000  1.667599592769e-04
9500.00000  9550.00000  1.509332038826e-04
9550.00000  9600.00000  1.567234802464e-04
9600.00000  9650.00000  1.412827432763e-04
9650.00000  9700.00000  1.463009827916e-04
9700.00000  9750.00000  1.439848722460e-04
9750.00000  9800.00000  1.532493144281e-04
9800.00000  9850.00000  1.544073697009e-04
9850.00000  9900.00000  1.401246880035e-04
9900.00000  9950.00000  1.474590380643e-04
9950.00000  10000.00000  1.416687617005e-04
