300.00000  350.00000  5.283522475928e-04
350.00000  400.00000  3.766396736411e-04
400.00000  450.00000  3.404098052348e-04
450.00000  500.00000  3.275783935075e-04
500.00000  550.00000  3.766396736411e-04
550.00000  600.00000  2.098313211868e-04
600.00000  650.00000  3.004059922027e-04
650.00000  700.00000  4.845744899351e-04
700.00000  750.00000  6.747812990685e-04
750.00000  800.00000  8.717812085280e-04
800.00000  850.00000  1.217474536239e-03
850.00000  900.00000  1.109539719945e-03
900.00000  950.00000  1.178980301057e-03
950.00000  1000.00000  1.283895961650e-03
1000.00000  1050.00000  1.381263732992e-03
1050.00000  1100.00000  1.386547255468e-03
1100.00000  1150.00000  1.388811622244e-03
1150.00000  1200.00000  1.388056833319e-03
1200.00000  1250.00000  1.299746529078e-03
1250.00000  1300.00000  1.262761871747e-03
1300.00000  1350.00000  1.093689152517e-03
1350.00000  1400.00000  1.072555062613e-03
1400.00000  1450.00000  1.052930550560e-03
1450.00000  1500.00000  9.502792567418e-04
1500.00000  1550.00000  8.680072639024e-04
1550.00000  1600.00000  8.091337277420e-04
1600.00000  1650.00000  7.419575134053e-04
1650.00000  1700.00000  7.185590567261e-04
1700.00000  1750.00000  6.762908769187e-04
1750.00000  1800.00000  5.517507042719e-04
1800.00000  1850.00000  5.109921023147e-04
1850.00000  1900.00000  5.049537909136e-04
1900.00000  1950.00000  4.543829329298e-04
1950.00000  2000.00000  4.558925107800e-04
2000.00000  2050.00000  4.189078534485e-04
2050.00000  2100.00000  3.909806632186e-04
2100.00000  2150.00000  3.109730371546e-04
2150.00000  2200.00000  3.049347257535e-04
2200.00000  2250.00000  2.913485251011e-04
2250.00000  2300.00000  2.913485251011e-04
2300.00000  2350.00000  3.056895146787e-04
2350.00000  2400.00000  2.588926013205e-04
2400.00000  2450.00000  2.460611895932e-04
2450.00000  2500.00000  2.430420338927e-04
2500.00000  2550.00000  2.090765322617e-04
2550.00000  2600.00000  1.886972312831e-04
2600.00000  2650.00000  1.728466638553e-04
2650.00000  2700.00000  1.690727192297e-04
2700.00000  2750.00000  1.547317296522e-04
2750.00000  2800.00000  1.524673628768e-04
2800.00000  2850.00000  1.381263732992e-04
2850.00000  2900.00000  1.222758058715e-04
2900.00000  2950.00000  1.343524286736e-04
2950.00000  3000.00000  1.207662280212e-04
3000.00000  3050.00000  1.260497504971e-04
3050.00000  3100.00000  1.064252384437e-04
3100.00000  3150.00000  1.177470723207e-04
3150.00000  3200.00000  1.094443941442e-04
3200.00000  3250.00000  9.057467101590e-05
3250.00000  3300.00000  1.018965048929e-04
3300.00000  3350.00000  8.604593746511e-05
3350.00000  3400.00000  8.831030424050e-05
3400.00000  3450.00000  7.623368143838e-05
3450.00000  3500.00000  7.472410358812e-05
3500.00000  3550.00000  7.472410358812e-05
3550.00000  3600.00000  7.774325928865e-05
3600.00000  3650.00000  6.566663648653e-05
3650.00000  3700.00000  7.472410358812e-05
3700.00000  3750.00000  6.717621433679e-05
3750.00000  3800.00000  6.717621433679e-05
3800.00000  3850.00000  6.038311401060e-05
3850.00000  3900.00000  5.660916938494e-05
3900.00000  3950.00000  5.736395831007e-05
3950.00000  4000.00000  6.642142541166e-05
4000.00000  4050.00000  5.509959153467e-05
4050.00000  4100.00000  6.340226971113e-05
4100.00000  4150.00000  5.962832508547e-05
4150.00000  4200.00000  5.208043583414e-05
4200.00000  4250.00000  6.189269186087e-05
4250.00000  4300.00000  6.491184756140e-05
4300.00000  4350.00000  5.057085798388e-05
4350.00000  4400.00000  5.283522475928e-05
4400.00000  4450.00000  6.566663648653e-05
4450.00000  4500.00000  5.962832508547e-05
4500.00000  4550.00000  4.830649120848e-05
4550.00000  4600.00000  6.340226971113e-05
4600.00000  4650.00000  6.264748078600e-05
4650.00000  4700.00000  5.887353616034e-05
4700.00000  4750.00000  4.528733550795e-05
4750.00000  4800.00000  4.679691335822e-05
4800.00000  4850.00000  4.075860195716e-05
4850.00000  4900.00000  5.887353616034e-05
4900.00000  4950.00000  5.585438045981e-05
4950.00000  5000.00000  5.208043583414e-05
5000.00000  5050.00000  5.283522475928e-05
5050.00000  5100.00000  5.736395831007e-05
5100.00000  5150.00000  5.887353616034e-05
5150.00000  5200.00000  5.660916938494e-05
5200.00000  5250.00000  5.359001368441e-05
5250.00000  5300.00000  4.604212443308e-05
5300.00000  5350.00000  4.528733550795e-05
5350.00000  5400.00000  5.208043583414e-05
5400.00000  5450.00000  4.528733550795e-05
5450.00000  5500.00000  5.962832508547e-05
5500.00000  5550.00000  5.283522475928e-05
5550.00000  5600.00000  4.679691335822e-05
5600.00000  5650.00000  5.208043583414e-05
5650.00000  5700.00000  4.755170228335e-05
5700.00000  5750.00000  4.679691335822e-05
5750.00000  5800.00000  5.132564690901e-05
5800.00000  5850.00000  5.132564690901e-05
5850.00000  5900.00000  5.585438045981e-05
5900.00000  5950.00000  5.962832508547e-05
5950.00000  6000.00000  5.057085798388e-05
6000.00000  6050.00000  5.585438045981e-05
6050.00000  6100.00000  5.660916938494e-05
6100.00000  6150.00000  4.679691335822e-05
6150.00000  6200.00000  6.642142541166e-05
6200.00000  6250.00000  8.000762606405e-05
6250.00000  6300.00000  8.076241498918e-05
6300.00000  6350.00000  8.981988209077e-05
6350.00000  6400.00000  4.800457563843e-04
6400.00000  6450.00000  5.811874723520e-05
6450.00000  6500.00000  5.811874723520e-05
6500.00000  6550.00000  4.830649120848e-05
6550.00000  6600.00000  5.283522475928e-05
6600.00000  6650.00000  5.434480260954e-05
6650.00000  6700.00000  4.981606905875e-05
6700.00000  6750.00000  5.585438045981e-05
6750.00000  6800.00000  5.509959153467e-05
6800.00000  6850.00000  5.132564690901e-05
6850.00000  6900.00000  4.755170228335e-05
6900.00000  6950.00000  5.811874723520e-05
6950.00000  7000.00000  4.906128013361e-05
7000.00000  7050.00000  4.755170228335e-05
7050.00000  7100.00000  9.434861564156e-05
7100.00000  7150.00000  2.339845667911e-05
7150.00000  7200.00000  2.717240130477e-05
7200.00000  7250.00000  2.943676808017e-05
7250.00000  7300.00000  2.415324560424e-05
7300.00000  7350.00000  2.943676808017e-05
7350.00000  7400.00000  2.188887882884e-05
7400.00000  7450.00000  2.868197915504e-05
7450.00000  7500.00000  4.528733550795e-05
7500.00000  7550.00000  2.264366775398e-05
7550.00000  7600.00000  1.358620065239e-05
7600.00000  7650.00000  2.868197915504e-05
7650.00000  7700.00000  2.415324560424e-05
7700.00000  7750.00000  1.736014527805e-05
7750.00000  7800.00000  2.792719022990e-05
7800.00000  7850.00000  2.641761237964e-05
7850.00000  7900.00000  2.717240130477e-05
7900.00000  7950.00000  1.962451205345e-05
7950.00000  8000.00000  1.962451205345e-05
8000.00000  8050.00000  2.188887882884e-05
8050.00000  8100.00000  2.868197915504e-05
8100.00000  8150.00000  2.415324560424e-05
8150.00000  8200.00000  2.339845667911e-05
8200.00000  8250.00000  3.396550163096e-05
8250.00000  8300.00000  2.415324560424e-05
8300.00000  8350.00000  2.566282345451e-05
8350.00000  8400.00000  2.113408990371e-05
8400.00000  8450.00000  2.641761237964e-05
8450.00000  8500.00000  2.037930097858e-05
8500.00000  8550.00000  2.264366775398e-05
8550.00000  8600.00000  2.113408990371e-05
8600.00000  8650.00000  1.962451205345e-05
8650.00000  8700.00000  2.792719022990e-05
8700.00000  8750.00000  2.339845667911e-05
8750.00000  8800.00000  1.736014527805e-05
8800.00000  8850.00000  1.962451205345e-05
8850.00000  8900.00000  1.434098957752e-05
8900.00000  8950.00000  3.170113485557e-05
8950.00000  9000.00000  2.868197915504e-05
9000.00000  9050.00000  2.415324560424e-05
9050.00000  9100.00000  2.188887882884e-05
9100.00000  9150.00000  1.962451205345e-05
9150.00000  9200.00000  2.415324560424e-05
9200.00000  9250.00000  2.717240130477e-05
9250.00000  9300.00000  1.962451205345e-05
9300.00000  9350.00000  2.037930097858e-05
9350.00000  9400.00000  2.566282345451e-05
9400.00000  9450.00000  2.641761237964e-05
9450.00000  9500.00000  2.566282345451e-05
9500.00000  9550.00000  1.886972312831e-05
9550.00000  9600.00000  1.811493420318e-05
9600.00000  9650.00000  2.943676808017e-05
9650.00000  9700.00000  2.113408990371e-05
9700.00000  9750.00000  1.811493420318e-05
9750.00000  9800.00000  2.415324560424e-05
9800.00000  9850.00000  2.566282345451e-05
9850.00000  9900.00000  2.566282345451e-05
9900.00000  9950.00000  2.415324560424e-05
9950.00000  10000.00000  2.943676808017e-05
