300.00000  350.00000  1.062876411655e-05
350.00000  400.00000  1.855202463979e-05
400.00000  450.00000  1.352751796651e-05
450.00000  500.00000  1.700602258647e-05
500.00000  550.00000  1.211679109286e-04
550.00000  600.00000  1.140176514320e-05
600.00000  650.00000  3.555804722627e-05
650.00000  700.00000  1.314101745319e-05
700.00000  750.00000  2.802128721635e-05
750.00000  800.00000  1.661952207315e-05
800.00000  850.00000  7.440134881583e-05
850.00000  900.00000  1.565327078982e-05
900.00000  950.00000  1.739252309980e-05
950.00000  1000.00000  1.932502566645e-05
1000.00000  1050.00000  2.434953233973e-05
1050.00000  1100.00000  2.164402874642e-05
1100.00000  1150.00000  2.203052925975e-05
1150.00000  1200.00000  2.222377951642e-05
1200.00000  1250.00000  1.990477643644e-05
1250.00000  1300.00000  5.836157751268e-05
1300.00000  1350.00000  2.029127694977e-05
1350.00000  1400.00000  2.048452720644e-05
1400.00000  1450.00000  2.087102771976e-05
1450.00000  1500.00000  2.608878464971e-05
1500.00000  1550.00000  2.125752823309e-05
1550.00000  1600.00000  2.299678054307e-05
1600.00000  1650.00000  2.280353028641e-05
1650.00000  1700.00000  2.492928310972e-05
1700.00000  1750.00000  7.034309342587e-05
1750.00000  1800.00000  2.183727900309e-05
1800.00000  1850.00000  2.048452720644e-05
1850.00000  1900.00000  2.048452720644e-05
1900.00000  1950.00000  2.125752823309e-05
1950.00000  2000.00000  2.357653131307e-05
2000.00000  2050.00000  2.280353028641e-05
2050.00000  2100.00000  2.106427797643e-05
2100.00000  2150.00000  2.145077848976e-05
2150.00000  2200.00000  2.280353028641e-05
2200.00000  2250.00000  1.971152617978e-05
2250.00000  2300.00000  2.106427797643e-05
2300.00000  2350.00000  8.348411087906e-05
2350.00000  2400.00000  2.415628208306e-05
2400.00000  2450.00000  2.106427797643e-05
2450.00000  2500.00000  3.169304209298e-05
2500.00000  2550.00000  2.106427797643e-05
2550.00000  2600.00000  2.647528516303e-05
2600.00000  2650.00000  2.492928310972e-05
2650.00000  2700.00000  2.415628208306e-05
2700.00000  2750.00000  2.415628208306e-05
2750.00000  2800.00000  2.473603285305e-05
2800.00000  2850.00000  2.550903387971e-05
2850.00000  2900.00000  2.647528516303e-05
2900.00000  2950.00000  2.802128721635e-05
2950.00000  3000.00000  4.502730980283e-05
3000.00000  3050.00000  2.550903387971e-05
3050.00000  3100.00000  3.072679080965e-05
3100.00000  3150.00000  3.014704003966e-05
3150.00000  3200.00000  3.362554465962e-05
3200.00000  3250.00000  2.937403901300e-05
3250.00000  3300.00000  3.072679080965e-05
3300.00000  3350.00000  3.497829645627e-05
3350.00000  3400.00000  4.096905441287e-05
3400.00000  3450.00000  4.174205543953e-05
3450.00000  3500.00000  4.753956313946e-05
3500.00000  3550.00000  4.232180620952e-05
3550.00000  3600.00000  4.483405954616e-05
3600.00000  3650.00000  4.947206570611e-05
3650.00000  3700.00000  8.425711190572e-05
3700.00000  3750.00000  6.744433957591e-05
3750.00000  3800.00000  6.647808829258e-05
3800.00000  3850.00000  7.961910574577e-05
3850.00000  3900.00000  8.464361241905e-05
3900.00000  3950.00000  8.966811909232e-05
3950.00000  4000.00000  9.894413141222e-05
4000.00000  4050.00000  1.115053980954e-04
4050.00000  4100.00000  1.014563847489e-04
4100.00000  4150.00000  1.126648996354e-04
4150.00000  4200.00000  1.358549304351e-04
4200.00000  4250.00000  1.348886791518e-04
4250.00000  4300.00000  1.457106935250e-04
4300.00000  4350.00000  1.600112125182e-04
4350.00000  4400.00000  1.650357191915e-04
4400.00000  4450.00000  1.804957397246e-04
4450.00000  4500.00000  1.886122505045e-04
4500.00000  4550.00000  1.940232576911e-04
4550.00000  4600.00000  2.094832782243e-04
4600.00000  4650.00000  2.203052925975e-04
4650.00000  4700.00000  2.342193110774e-04
4700.00000  4750.00000  2.415628208306e-04
4750.00000  4800.00000  2.471670782739e-04
4800.00000  4850.00000  2.616608475237e-04
4850.00000  4900.00000  2.769276178002e-04
4900.00000  4950.00000  2.873631316601e-04
4950.00000  5000.00000  2.964458937233e-04
5000.00000  5050.00000  2.950931419267e-04
5050.00000  5100.00000  3.130654157965e-04
5100.00000  5150.00000  3.213751768330e-04
5150.00000  5200.00000  3.484302127661e-04
5200.00000  5250.00000  3.638902332992e-04
5250.00000  5300.00000  3.667889871492e-04
5300.00000  5350.00000  3.810895061424e-04
5350.00000  5400.00000  3.930710220556e-04
5400.00000  5450.00000  3.980955287288e-04
5450.00000  5500.00000  3.984820292422e-04
5500.00000  5550.00000  4.071782907921e-04
5550.00000  5600.00000  4.081445420754e-04
5600.00000  5650.00000  4.301750713351e-04
5650.00000  5700.00000  4.236045626086e-04
5700.00000  5750.00000  4.493068467449e-04
5750.00000  5800.00000  4.593558600915e-04
5800.00000  5850.00000  4.581963585515e-04
5850.00000  5900.00000  4.929814047511e-04
5900.00000  5950.00000  4.703711247214e-04
5950.00000  6000.00000  4.891163996178e-04
6000.00000  6050.00000  4.873771473078e-04
6050.00000  6100.00000  4.989721627077e-04
6100.00000  6150.00000  5.047696704076e-04
6150.00000  6200.00000  5.196499401708e-04
6200.00000  6250.00000  5.457387248205e-04
6250.00000  6300.00000  5.994622961732e-04
6300.00000  6350.00000  5.710545084436e-04
6350.00000  6400.00000  1.886702255815e-03
6400.00000  6450.00000  5.322112068540e-04
6450.00000  6500.00000  5.449657237939e-04
6500.00000  6550.00000  5.455454745638e-04
6550.00000  6600.00000  5.505699812371e-04
6600.00000  6650.00000  5.492172294405e-04
6650.00000  6700.00000  5.519227330338e-04
6700.00000  6750.00000  5.505699812371e-04
6750.00000  6800.00000  5.501834807238e-04
6800.00000  6850.00000  5.727937607535e-04
6850.00000  6900.00000  5.648705002303e-04
6900.00000  6950.00000  5.608122448403e-04
6950.00000  7000.00000  5.467049761038e-04
7000.00000  7050.00000  5.760790151168e-04
7050.00000  7100.00000  7.142529486319e-04
7100.00000  7150.00000  3.146114178498e-04
7150.00000  7200.00000  2.759613665169e-04
7200.00000  7250.00000  2.908416362801e-04
7250.00000  7300.00000  2.995378978300e-04
7300.00000  7350.00000  2.960593932100e-04
7350.00000  7400.00000  2.867833808901e-04
7400.00000  7450.00000  2.929673891034e-04
7450.00000  7500.00000  3.430192055795e-04
7500.00000  7550.00000  3.126789152831e-04
7550.00000  7600.00000  3.190561737531e-04
7600.00000  7650.00000  3.188629234964e-04
7650.00000  7700.00000  3.097801614332e-04
7700.00000  7750.00000  3.207954260630e-04
7750.00000  7800.00000  3.246604311963e-04
7800.00000  7850.00000  3.327769419762e-04
7850.00000  7900.00000  3.316174404363e-04
7900.00000  7950.00000  3.177034219564e-04
7950.00000  8000.00000  3.188629234964e-04
8000.00000  8050.00000  3.464977101994e-04
8050.00000  8100.00000  3.536479696960e-04
8100.00000  8150.00000  3.416664537828e-04
8150.00000  8200.00000  3.360621963395e-04
8200.00000  8250.00000  3.318106906929e-04
8250.00000  8300.00000  3.474639614827e-04
8300.00000  8350.00000  3.455314589161e-04
8350.00000  8400.00000  3.596387276526e-04
8400.00000  8450.00000  3.420529542961e-04
8450.00000  8500.00000  3.466909604561e-04
8500.00000  8550.00000  3.495897143061e-04
8550.00000  8600.00000  3.604117286793e-04
8600.00000  8650.00000  3.553872220060e-04
8650.00000  8700.00000  3.492032137927e-04
8700.00000  8750.00000  3.507492158460e-04
8750.00000  8800.00000  3.461112096861e-04
8800.00000  8850.00000  3.536479696960e-04
8850.00000  8900.00000  3.563534732893e-04
8900.00000  8950.00000  3.648564845826e-04
8950.00000  9000.00000  3.519087173860e-04
9000.00000  9050.00000  3.629239820159e-04
9050.00000  9100.00000  3.563534732893e-04
9100.00000  9150.00000  3.677552384325e-04
9150.00000  9200.00000  3.648564845826e-04
9200.00000  9250.00000  3.652429850959e-04
9250.00000  9300.00000  3.758717492124e-04
9300.00000  9350.00000  3.820557574257e-04
9350.00000  9400.00000  3.623442312459e-04
9400.00000  9450.00000  3.787705030624e-04
9450.00000  9500.00000  3.764514999824e-04
9500.00000  9550.00000  3.733594958758e-04
9550.00000  9600.00000  3.650497348392e-04
9600.00000  9650.00000  3.656294856092e-04
9650.00000  9700.00000  3.754852486991e-04
9700.00000  9750.00000  3.648564845826e-04
9750.00000  9800.00000  3.737459963891e-04
9800.00000  9850.00000  3.766447502391e-04
9850.00000  9900.00000  3.720067440791e-04
9900.00000  9950.00000  3.679484886892e-04
9950.00000  10000.00000  3.799300046024e-04
