10001.00000  11001.00000  1.268527531732e-05
11001.00000  12001.00000  1.365066917709e-05
12001.00000  13001.00000  1.377617037886e-05
13001.00000  14001.00000  1.413336610697e-05
14001.00000  15001.00000  1.436506063332e-05
15001.00000  16001.00000  1.476087211582e-05
16001.00000  17001.00000  1.390167158063e-05
17001.00000  18001.00000  1.456779334387e-05
18001.00000  19001.00000  1.426852124734e-05
19001.00000  20001.00000  1.324520375599e-05
20001.00000  21001.00000  1.288800802787e-05
21001.00000  22001.00000  1.218327051025e-05
22001.00000  23001.00000  1.203846143128e-05
23001.00000  24001.00000  1.149784086981e-05
24001.00000  25001.00000  1.005940401876e-05
25001.00000  26001.00000  1.021386703632e-05
26001.00000  27001.00000  9.113318036190e-06
27001.00000  28001.00000  9.161587729179e-06
28001.00000  29001.00000  8.514773843135e-06
29001.00000  30001.00000  7.674881185139e-06
30001.00000  31001.00000  7.723150878127e-06
31001.00000  32001.00000  7.018413360498e-06
32001.00000  33001.00000  6.641909755189e-06
33001.00000  34001.00000  6.748103079764e-06
34001.00000  35001.00000  5.908210421767e-06
35001.00000  36001.00000  5.840632851584e-06
36001.00000  37001.00000  4.933162623404e-06
37001.00000  38001.00000  4.817315360232e-06
38001.00000  39001.00000  4.585620833888e-06
39001.00000  40001.00000  4.267040860165e-06
40001.00000  41001.00000  4.296002675958e-06
41001.00000  42001.00000  3.552649403939e-06
42001.00000  43001.00000  3.909845132052e-06
43001.00000  44001.00000  3.552649403939e-06
44001.00000  45001.00000  3.301647000399e-06
45001.00000  46001.00000  2.818950070516e-06
46001.00000  47001.00000  2.828604009114e-06
47001.00000  48001.00000  2.355561017829e-06
48001.00000  49001.00000  2.394176772219e-06
49001.00000  50001.00000  2.423138588012e-06
50001.00000  51001.00000  2.210751938864e-06
51001.00000  52001.00000  2.249367693255e-06
52001.00000  53001.00000  2.307291324841e-06
53001.00000  54001.00000  2.181790123071e-06
54001.00000  55001.00000  1.998365289715e-06
55001.00000  56001.00000  1.959749535325e-06
56001.00000  57001.00000  1.805286517762e-06
57001.00000  58001.00000  1.747362886176e-06
58001.00000  59001.00000  1.563938052821e-06
59001.00000  60001.00000  1.544630175625e-06
60001.00000  61001.00000  1.515668359832e-06
61001.00000  62001.00000  1.283973833489e-06
62001.00000  63001.00000  1.283973833489e-06
63001.00000  64001.00000  1.409475035258e-06
64001.00000  65001.00000  1.235704140500e-06
65001.00000  66001.00000  1.255012017696e-06
66001.00000  67001.00000  1.110202938731e-06
67001.00000  68001.00000  9.171241667776e-07
68001.00000  69001.00000  1.090895061535e-06
69001.00000  70001.00000  9.943556755589e-07
70001.00000  71001.00000  9.171241667776e-07
71001.00000  72001.00000  9.653938597659e-07
72001.00000  73001.00000  8.592005351917e-07
73001.00000  74001.00000  9.943556755589e-07
74001.00000  75001.00000  9.750477983636e-07
75001.00000  76001.00000  8.881623509846e-07
76001.00000  77001.00000  6.950835790315e-07
77001.00000  78001.00000  6.178520702502e-07
78001.00000  79001.00000  6.081981316525e-07
79001.00000  80001.00000  6.564678246408e-07
80001.00000  81001.00000  5.599284386642e-07
81001.00000  82001.00000  5.888902544572e-07
82001.00000  83001.00000  7.336993334221e-07
83001.00000  84001.00000  6.854296404338e-07
84001.00000  85001.00000  5.213126842736e-07
85001.00000  86001.00000  5.020048070783e-07
86001.00000  87001.00000  5.599284386642e-07
87001.00000  88001.00000  5.502745000666e-07
88001.00000  89001.00000  4.826969298830e-07
89001.00000  90001.00000  4.826969298830e-07
90001.00000  91001.00000  5.116587456759e-07
91001.00000  92001.00000  4.344272368947e-07
92001.00000  93001.00000  3.668496667110e-07
93001.00000  94001.00000  4.537351140900e-07
94001.00000  95001.00000  3.958114825040e-07
95001.00000  96001.00000  3.765036053087e-07
96001.00000  97001.00000  3.185799737228e-07
97001.00000  98001.00000  3.089260351251e-07
98001.00000  99001.00000  3.861575439064e-07
99001.00000  100001.00000  3.475417895157e-07
100001.00000  101001.00000  3.282339123204e-07
101001.00000  102001.00000  3.089260351251e-07
102001.00000  103001.00000  2.799642193321e-07
103001.00000  104001.00000  2.316945263438e-07
104001.00000  105001.00000  2.510024035391e-07
105001.00000  106001.00000  2.799642193321e-07
106001.00000  107001.00000  2.510024035391e-07
107001.00000  108001.00000  2.510024035391e-07
108001.00000  109001.00000  3.668496667110e-07
109001.00000  110001.00000  2.799642193321e-07
110001.00000  111001.00000  1.544630175625e-07
111001.00000  112001.00000  2.123866491485e-07
112001.00000  113001.00000  2.220405877462e-07
113001.00000  114001.00000  1.544630175625e-07
114001.00000  115001.00000  1.834248333555e-07
115001.00000  116001.00000  1.158472631719e-07
116001.00000  117001.00000  8.688544737893e-08
117001.00000  118001.00000  9.653938597659e-08
118001.00000  119001.00000  1.448090789649e-07
119001.00000  120001.00000  5.792363158595e-08
120001.00000  121001.00000  1.351551403672e-07
121001.00000  122001.00000  1.061933245743e-07
122001.00000  123001.00000  1.448090789649e-07
123001.00000  124001.00000  1.158472631719e-07
124001.00000  125001.00000  6.757757018361e-08
125001.00000  126001.00000  6.757757018361e-08
126001.00000  127001.00000  1.061933245743e-07
127001.00000  128001.00000  6.757757018361e-08
128001.00000  129001.00000  7.723150878127e-08
129001.00000  130001.00000  3.861575439064e-08
130001.00000  131001.00000  6.757757018361e-08
131001.00000  132001.00000  7.723150878127e-08
132001.00000  133001.00000  6.757757018361e-08
133001.00000  134001.00000  7.723150878127e-08
134001.00000  135001.00000  8.688544737893e-08
135001.00000  136001.00000  7.723150878127e-08
136001.00000  137001.00000  5.792363158595e-08
137001.00000  138001.00000  6.757757018361e-08
138001.00000  139001.00000  6.757757018361e-08
139001.00000  140001.00000  6.757757018361e-08
140001.00000  141001.00000  9.653938597659e-09
141001.00000  142001.00000  6.757757018361e-08
142001.00000  143001.00000  6.757757018361e-08
143001.00000  144001.00000  5.792363158595e-08
144001.00000  145001.00000  2.896181579298e-08
145001.00000  146001.00000  1.930787719532e-08
146001.00000  147001.00000  4.826969298830e-08
147001.00000  148001.00000  3.861575439064e-08
148001.00000  149001.00000  4.826969298830e-08
149001.00000  150001.00000  9.653938597659e-09
150001.00000  151001.00000  1.930787719532e-08
151001.00000  152001.00000  3.861575439064e-08
152001.00000  153001.00000  0.000000000000e+00
153001.00000  154001.00000  0.000000000000e+00
154001.00000  155001.00000  1.930787719532e-08
155001.00000  156001.00000  1.930787719532e-08
156001.00000  157001.00000  2.896181579298e-08
157001.00000  158001.00000  4.826969298830e-08
158001.00000  159001.00000  9.653938597659e-09
159001.00000  160001.00000  9.653938597659e-09
160001.00000  161001.00000  1.930787719532e-08
161001.00000  162001.00000  9.653938597659e-09
162001.00000  163001.00000  9.653938597659e-09
163001.00000  164001.00000  1.930787719532e-08
164001.00000  165001.00000  9.653938597659e-09
165001.00000  166001.00000  2.896181579298e-08
166001.00000  167001.00000  1.930787719532e-08
167001.00000  168001.00000  1.930787719532e-08
168001.00000  169001.00000  9.653938597659e-09
169001.00000  170001.00000  0.000000000000e+00
170001.00000  171001.00000  2.896181579298e-08
171001.00000  172001.00000  3.861575439064e-08
172001.00000  173001.00000  9.653938597659e-09
173001.00000  174001.00000  3.861575439064e-08
174001.00000  175001.00000  0.000000000000e+00
175001.00000  176001.00000  9.653938597659e-09
176001.00000  177001.00000  1.930787719532e-08
177001.00000  178001.00000  0.000000000000e+00
178001.00000  179001.00000  0.000000000000e+00
179001.00000  180001.00000  0.000000000000e+00
180001.00000  181001.00000  3.861575439064e-08
181001.00000  182001.00000  1.930787719532e-08
182001.00000  183001.00000  0.000000000000e+00
183001.00000  184001.00000  2.896181579298e-08
184001.00000  185001.00000  0.000000000000e+00
185001.00000  186001.00000  0.000000000000e+00
186001.00000  187001.00000  0.000000000000e+00
187001.00000  188001.00000  1.930787719532e-08
188001.00000  189001.00000  0.000000000000e+00
189001.00000  190001.00000  9.653938597659e-09
190001.00000  191001.00000  0.000000000000e+00
191001.00000  192001.00000  9.653938597659e-09
192001.00000  193001.00000  0.000000000000e+00
193001.00000  194001.00000  0.000000000000e+00
194001.00000  195001.00000  0.000000000000e+00
195001.00000  196001.00000  0.000000000000e+00
196001.00000  197001.00000  9.653938597659e-09
197001.00000  198001.00000  0.000000000000e+00
198001.00000  199001.00000  0.000000000000e+00
