10001.00000  11001.00000  5.537183063612e-05
11001.00000  12001.00000  5.140951656590e-05
12001.00000  13001.00000  4.737680605281e-05
13001.00000  14001.00000  4.418885285418e-05
14001.00000  15001.00000  3.845657107747e-05
15001.00000  16001.00000  3.427301104393e-05
16001.00000  17001.00000  3.062245264929e-05
17001.00000  18001.00000  2.683110136890e-05
18001.00000  19001.00000  2.537288933798e-05
19001.00000  20001.00000  2.235589892919e-05
20001.00000  21001.00000  2.072672410844e-05
21001.00000  22001.00000  1.918805899995e-05
22001.00000  23001.00000  1.731752494649e-05
23001.00000  24001.00000  1.577885983801e-05
24001.00000  25001.00000  1.371724972533e-05
25001.00000  26001.00000  1.339543741506e-05
26001.00000  27001.00000  1.187688557596e-05
27001.00000  28001.00000  1.050918325731e-05
28001.00000  29001.00000  9.956068349030e-06
29001.00000  30001.00000  9.342613632575e-06
30001.00000  31001.00000  8.206213911928e-06
31001.00000  32001.00000  7.934684775136e-06
32001.00000  33001.00000  6.888794766753e-06
33001.00000  34001.00000  6.647435534049e-06
34001.00000  35001.00000  5.893187931850e-06
35001.00000  36001.00000  5.732281776714e-06
36001.00000  37001.00000  5.511035813402e-06
37001.00000  38001.00000  4.957920905123e-06
38001.00000  39001.00000  4.495315709107e-06
39001.00000  40001.00000  4.133276860052e-06
40001.00000  41001.00000  3.620388490556e-06
41001.00000  42001.00000  3.650558394644e-06
42001.00000  43001.00000  3.429312431333e-06
43001.00000  44001.00000  3.006933774101e-06
44001.00000  45001.00000  2.946593965925e-06
45001.00000  46001.00000  2.534271943389e-06
46001.00000  47001.00000  2.634838290349e-06
47001.00000  48001.00000  2.423648961734e-06
48001.00000  49001.00000  2.313025980078e-06
49001.00000  50001.00000  2.001270304502e-06
50001.00000  51001.00000  1.759911071798e-06
51001.00000  52001.00000  1.810194245278e-06
52001.00000  53001.00000  1.649288090142e-06
53001.00000  54001.00000  1.478325300311e-06
54001.00000  55001.00000  1.438098761527e-06
55001.00000  56001.00000  1.488381935007e-06
56001.00000  57001.00000  1.438098761527e-06
57001.00000  58001.00000  1.347589049263e-06
58001.00000  59001.00000  1.106229816559e-06
59001.00000  60001.00000  1.116286451255e-06
60001.00000  61001.00000  1.025776738991e-06
61001.00000  62001.00000  8.045307756792e-07
62001.00000  63001.00000  8.548139491591e-07
63001.00000  64001.00000  9.050971226391e-07
64001.00000  65001.00000  9.151537573351e-07
65001.00000  66001.00000  8.347006797672e-07
66001.00000  67001.00000  5.631715429754e-07
67001.00000  68001.00000  7.944741409832e-07
68001.00000  69001.00000  5.128883694955e-07
69001.00000  70001.00000  6.536812552393e-07
70001.00000  71001.00000  5.128883694955e-07
71001.00000  72001.00000  5.128883694955e-07
72001.00000  73001.00000  4.525485613195e-07
73001.00000  74001.00000  5.430582735835e-07
74001.00000  75001.00000  4.726618307115e-07
75001.00000  76001.00000  4.123220225356e-07
76001.00000  77001.00000  4.123220225356e-07
77001.00000  78001.00000  3.922087531436e-07
78001.00000  79001.00000  2.916424061837e-07
79001.00000  80001.00000  3.318689449677e-07
80001.00000  81001.00000  3.419255796637e-07
81001.00000  82001.00000  3.519822143596e-07
82001.00000  83001.00000  2.313025980078e-07
83001.00000  84001.00000  2.212459633118e-07
84001.00000  85001.00000  3.218123102717e-07
85001.00000  86001.00000  2.313025980078e-07
86001.00000  87001.00000  2.011326939198e-07
87001.00000  88001.00000  2.413592327038e-07
88001.00000  89001.00000  3.117556755757e-07
89001.00000  90001.00000  2.111893286158e-07
90001.00000  91001.00000  1.609061551358e-07
91001.00000  92001.00000  1.910760592238e-07
92001.00000  93001.00000  1.508495204398e-07
93001.00000  94001.00000  1.709627898318e-07
94001.00000  95001.00000  1.709627898318e-07
95001.00000  96001.00000  1.609061551358e-07
96001.00000  97001.00000  1.709627898318e-07
97001.00000  98001.00000  1.206796163519e-07
98001.00000  99001.00000  8.045307756792e-08
99001.00000  100001.00000  1.609061551358e-07
100001.00000  101001.00000  1.307362510479e-07
101001.00000  102001.00000  1.106229816559e-07
102001.00000  103001.00000  1.106229816559e-07
103001.00000  104001.00000  1.005663469599e-07
104001.00000  105001.00000  1.005663469599e-07
105001.00000  106001.00000  6.033980817594e-08
106001.00000  107001.00000  5.028317347995e-08
107001.00000  108001.00000  4.022653878396e-08
108001.00000  109001.00000  8.045307756792e-08
109001.00000  110001.00000  3.016990408797e-08
110001.00000  111001.00000  5.028317347995e-08
111001.00000  112001.00000  7.039644287193e-08
112001.00000  113001.00000  6.033980817594e-08
113001.00000  114001.00000  3.016990408797e-08
114001.00000  115001.00000  5.028317347995e-08
115001.00000  116001.00000  5.028317347995e-08
116001.00000  117001.00000  6.033980817594e-08
117001.00000  118001.00000  4.022653878396e-08
118001.00000  119001.00000  7.039644287193e-08
119001.00000  120001.00000  2.011326939198e-08
120001.00000  121001.00000  2.011326939198e-08
121001.00000  122001.00000  0.000000000000e+00
122001.00000  123001.00000  3.016990408797e-08
123001.00000  124001.00000  3.016990408797e-08
124001.00000  125001.00000  5.028317347995e-08
125001.00000  126001.00000  2.011326939198e-08
126001.00000  127001.00000  0.000000000000e+00
127001.00000  128001.00000  3.016990408797e-08
128001.00000  129001.00000  2.011326939198e-08
129001.00000  130001.00000  1.005663469599e-08
130001.00000  131001.00000  2.011326939198e-08
131001.00000  132001.00000  3.016990408797e-08
132001.00000  133001.00000  1.005663469599e-08
133001.00000  134001.00000  1.005663469599e-08
134001.00000  135001.00000  0.000000000000e+00
135001.00000  136001.00000  5.028317347995e-08
136001.00000  137001.00000  4.022653878396e-08
137001.00000  138001.00000  4.022653878396e-08
138001.00000  139001.00000  1.005663469599e-08
139001.00000  140001.00000  1.005663469599e-08
140001.00000  141001.00000  1.005663469599e-08
141001.00000  142001.00000  2.011326939198e-08
142001.00000  143001.00000  0.000000000000e+00
143001.00000  144001.00000  1.005663469599e-08
144001.00000  145001.00000  1.005663469599e-08
145001.00000  146001.00000  3.016990408797e-08
146001.00000  147001.00000  0.000000000000e+00
147001.00000  148001.00000  1.005663469599e-08
148001.00000  149001.00000  0.000000000000e+00
149001.00000  150001.00000  1.005663469599e-08
150001.00000  151001.00000  0.000000000000e+00
151001.00000  152001.00000  0.000000000000e+00
152001.00000  153001.00000  1.005663469599e-08
153001.00000  154001.00000  0.000000000000e+00
154001.00000  155001.00000  0.000000000000e+00
155001.00000  156001.00000  1.005663469599e-08
156001.00000  157001.00000  0.000000000000e+00
157001.00000  158001.00000  2.011326939198e-08
158001.00000  159001.00000  0.000000000000e+00
159001.00000  160001.00000  1.005663469599e-08
160001.00000  161001.00000  0.000000000000e+00
161001.00000  162001.00000  2.011326939198e-08
162001.00000  163001.00000  1.005663469599e-08
163001.00000  164001.00000  0.000000000000e+00
164001.00000  165001.00000  0.000000000000e+00
165001.00000  166001.00000  0.000000000000e+00
166001.00000  167001.00000  0.000000000000e+00
167001.00000  168001.00000  0.000000000000e+00
168001.00000  169001.00000  0.000000000000e+00
169001.00000  170001.00000  3.016990408797e-08
170001.00000  171001.00000  0.000000000000e+00
171001.00000  172001.00000  1.005663469599e-08
172001.00000  173001.00000  0.000000000000e+00
173001.00000  174001.00000  0.000000000000e+00
174001.00000  175001.00000  0.000000000000e+00
175001.00000  176001.00000  0.000000000000e+00
176001.00000  177001.00000  0.000000000000e+00
177001.00000  178001.00000  0.000000000000e+00
178001.00000  179001.00000  0.000000000000e+00
179001.00000  180001.00000  0.000000000000e+00
180001.00000  181001.00000  0.000000000000e+00
181001.00000  182001.00000  0.000000000000e+00
182001.00000  183001.00000  0.000000000000e+00
183001.00000  184001.00000  0.000000000000e+00
184001.00000  185001.00000  0.000000000000e+00
185001.00000  186001.00000  0.000000000000e+00
186001.00000  187001.00000  0.000000000000e+00
187001.00000  188001.00000  0.000000000000e+00
188001.00000  189001.00000  0.000000000000e+00
189001.00000  190001.00000  0.000000000000e+00
190001.00000  191001.00000  0.000000000000e+00
191001.00000  192001.00000  0.000000000000e+00
192001.00000  193001.00000  0.000000000000e+00
193001.00000  194001.00000  0.000000000000e+00
194001.00000  195001.00000  0.000000000000e+00
195001.00000  196001.00000  0.000000000000e+00
196001.00000  197001.00000  0.000000000000e+00
197001.00000  198001.00000  0.000000000000e+00
198001.00000  199001.00000  0.000000000000e+00
