10001.00000  11001.00000  6.263828679217e-07
11001.00000  12001.00000  6.552928464412e-07
12001.00000  13001.00000  5.396529323633e-07
13001.00000  14001.00000  4.047396992725e-07
14001.00000  15001.00000  5.781995703893e-07
15001.00000  16001.00000  4.432863372984e-07
16001.00000  17001.00000  3.276464232206e-07
17001.00000  18001.00000  3.854663802595e-07
18001.00000  19001.00000  3.180097637141e-07
19001.00000  20001.00000  2.409164876622e-07
20001.00000  21001.00000  1.638232116103e-07
21001.00000  22001.00000  2.698264661817e-07
22001.00000  23001.00000  2.023698496362e-07
23001.00000  24001.00000  2.120065091427e-07
24001.00000  25001.00000  1.541865521038e-07
25001.00000  26001.00000  9.636659506488e-08
26001.00000  27001.00000  1.541865521038e-07
27001.00000  28001.00000  1.734598711168e-07
28001.00000  29001.00000  8.672993555839e-08
29001.00000  30001.00000  1.638232116103e-07
30001.00000  31001.00000  1.060032545714e-07
31001.00000  32001.00000  1.060032545714e-07
32001.00000  33001.00000  1.060032545714e-07
33001.00000  34001.00000  1.156399140779e-07
34001.00000  35001.00000  1.638232116103e-07
35001.00000  36001.00000  9.636659506488e-08
36001.00000  37001.00000  9.636659506488e-08
37001.00000  38001.00000  9.636659506488e-08
38001.00000  39001.00000  9.636659506488e-08
39001.00000  40001.00000  5.781995703893e-08
40001.00000  41001.00000  8.672993555839e-08
41001.00000  42001.00000  6.745661654542e-08
42001.00000  43001.00000  6.745661654542e-08
43001.00000  44001.00000  7.709327605190e-08
44001.00000  45001.00000  5.781995703893e-08
45001.00000  46001.00000  6.745661654542e-08
46001.00000  47001.00000  5.781995703893e-08
47001.00000  48001.00000  2.890997851946e-08
48001.00000  49001.00000  8.672993555839e-08
49001.00000  50001.00000  2.890997851946e-08
50001.00000  51001.00000  3.854663802595e-08
51001.00000  52001.00000  7.709327605190e-08
52001.00000  53001.00000  5.781995703893e-08
53001.00000  54001.00000  1.927331901298e-08
54001.00000  55001.00000  1.927331901298e-08
55001.00000  56001.00000  1.927331901298e-08
56001.00000  57001.00000  3.854663802595e-08
57001.00000  58001.00000  2.890997851946e-08
58001.00000  59001.00000  9.636659506488e-09
59001.00000  60001.00000  2.890997851946e-08
60001.00000  61001.00000  0.000000000000e+00
61001.00000  62001.00000  4.818329753244e-08
62001.00000  63001.00000  0.000000000000e+00
63001.00000  64001.00000  9.636659506488e-09
64001.00000  65001.00000  2.890997851946e-08
65001.00000  66001.00000  1.927331901298e-08
66001.00000  67001.00000  3.854663802595e-08
67001.00000  68001.00000  4.818329753244e-08
68001.00000  69001.00000  1.927331901298e-08
69001.00000  70001.00000  3.854663802595e-08
70001.00000  71001.00000  2.890997851946e-08
71001.00000  72001.00000  1.927331901298e-08
72001.00000  73001.00000  1.927331901298e-08
73001.00000  74001.00000  0.000000000000e+00
74001.00000  75001.00000  1.927331901298e-08
75001.00000  76001.00000  1.927331901298e-08
76001.00000  77001.00000  2.890997851946e-08
77001.00000  78001.00000  3.854663802595e-08
78001.00000  79001.00000  9.636659506488e-09
79001.00000  80001.00000  0.000000000000e+00
80001.00000  81001.00000  1.927331901298e-08
81001.00000  82001.00000  2.890997851946e-08
82001.00000  83001.00000  0.000000000000e+00
83001.00000  84001.00000  1.927331901298e-08
84001.00000  85001.00000  1.927331901298e-08
85001.00000  86001.00000  1.927331901298e-08
86001.00000  87001.00000  0.000000000000e+00
87001.00000  88001.00000  3.854663802595e-08
88001.00000  89001.00000  1.927331901298e-08
89001.00000  90001.00000  2.890997851946e-08
90001.00000  91001.00000  9.636659506488e-09
91001.00000  92001.00000  9.636659506488e-09
92001.00000  93001.00000  9.636659506488e-09
93001.00000  94001.00000  1.927331901298e-08
94001.00000  95001.00000  9.636659506488e-09
95001.00000  96001.00000  9.636659506488e-09
96001.00000  97001.00000  9.636659506488e-09
97001.00000  98001.00000  9.636659506488e-09
98001.00000  99001.00000  1.927331901298e-08
99001.00000  100001.00000  0.000000000000e+00
100001.00000  101001.00000  0.000000000000e+00
101001.00000  102001.00000  9.636659506488e-09
102001.00000  103001.00000  1.927331901298e-08
103001.00000  104001.00000  9.636659506488e-09
104001.00000  105001.00000  0.000000000000e+00
105001.00000  106001.00000  9.636659506488e-09
106001.00000  107001.00000  0.000000000000e+00
107001.00000  108001.00000  9.636659506488e-09
108001.00000  109001.00000  9.636659506488e-09
109001.00000  110001.00000  9.636659506488e-09
110001.00000  111001.00000  2.890997851946e-08
111001.00000  112001.00000  0.000000000000e+00
112001.00000  113001.00000  9.636659506488e-09
113001.00000  114001.00000  9.636659506488e-09
114001.00000  115001.00000  9.636659506488e-09
115001.00000  116001.00000  1.927331901298e-08
116001.00000  117001.00000  9.636659506488e-09
117001.00000  118001.00000  0.000000000000e+00
118001.00000  119001.00000  2.890997851946e-08
119001.00000  120001.00000  2.890997851946e-08
120001.00000  121001.00000  0.000000000000e+00
121001.00000  122001.00000  0.000000000000e+00
122001.00000  123001.00000  0.000000000000e+00
123001.00000  124001.00000  9.636659506488e-09
124001.00000  125001.00000  1.927331901298e-08
125001.00000  126001.00000  9.636659506488e-09
126001.00000  127001.00000  0.000000000000e+00
127001.00000  128001.00000  0.000000000000e+00
128001.00000  129001.00000  0.000000000000e+00
129001.00000  130001.00000  0.000000000000e+00
130001.00000  131001.00000  0.000000000000e+00
131001.00000  132001.00000  0.000000000000e+00
132001.00000  133001.00000  0.000000000000e+00
133001.00000  134001.00000  0.000000000000e+00
134001.00000  135001.00000  9.636659506488e-09
135001.00000  136001.00000  0.000000000000e+00
136001.00000  137001.00000  0.000000000000e+00
137001.00000  138001.00000  0.000000000000e+00
138001.00000  139001.00000  0.000000000000e+00
139001.00000  140001.00000  0.000000000000e+00
140001.00000  141001.00000  9.636659506488e-09
141001.00000  142001.00000  0.000000000000e+00
142001.00000  143001.00000  0.000000000000e+00
143001.00000  144001.00000  1.927331901298e-08
144001.00000  145001.00000  9.636659506488e-09
145001.00000  146001.00000  0.000000000000e+00
146001.00000  147001.00000  0.000000000000e+00
147001.00000  148001.00000  0.000000000000e+00
148001.00000  149001.00000  0.000000000000e+00
149001.00000  150001.00000  0.000000000000e+00
150001.00000  151001.00000  1.927331901298e-08
151001.00000  152001.00000  0.000000000000e+00
152001.00000  153001.00000  0.000000000000e+00
153001.00000  154001.00000  9.636659506488e-09
154001.00000  155001.00000  0.000000000000e+00
155001.00000  156001.00000  0.000000000000e+00
156001.00000  157001.00000  0.000000000000e+00
157001.00000  158001.00000  0.000000000000e+00
158001.00000  159001.00000  0.000000000000e+00
159001.00000  160001.00000  0.000000000000e+00
160001.00000  161001.00000  0.000000000000e+00
161001.00000  162001.00000  0.000000000000e+00
162001.00000  163001.00000  0.000000000000e+00
163001.00000  164001.00000  0.000000000000e+00
164001.00000  165001.00000  0.000000000000e+00
165001.00000  166001.00000  0.000000000000e+00
166001.00000  167001.00000  0.000000000000e+00
167001.00000  168001.00000  0.000000000000e+00
168001.00000  169001.00000  0.000000000000e+00
169001.00000  170001.00000  0.000000000000e+00
170001.00000  171001.00000  0.000000000000e+00
171001.00000  172001.00000  0.000000000000e+00
172001.00000  173001.00000  0.000000000000e+00
173001.00000  174001.00000  0.000000000000e+00
174001.00000  175001.00000  0.000000000000e+00
175001.00000  176001.00000  0.000000000000e+00
176001.00000  177001.00000  0.000000000000e+00
177001.00000  178001.00000  9.636659506488e-09
178001.00000  179001.00000  0.000000000000e+00
179001.00000  180001.00000  0.000000000000e+00
180001.00000  181001.00000  0.000000000000e+00
181001.00000  182001.00000  0.000000000000e+00
182001.00000  183001.00000  0.000000000000e+00
183001.00000  184001.00000  0.000000000000e+00
184001.00000  185001.00000  0.000000000000e+00
185001.00000  186001.00000  0.000000000000e+00
186001.00000  187001.00000  0.000000000000e+00
187001.00000  188001.00000  0.000000000000e+00
188001.00000  189001.00000  0.000000000000e+00
189001.00000  190001.00000  0.000000000000e+00
190001.00000  191001.00000  0.000000000000e+00
191001.00000  192001.00000  0.000000000000e+00
192001.00000  193001.00000  0.000000000000e+00
193001.00000  194001.00000  0.000000000000e+00
194001.00000  195001.00000  0.000000000000e+00
195001.00000  196001.00000  0.000000000000e+00
196001.00000  197001.00000  0.000000000000e+00
197001.00000  198001.00000  0.000000000000e+00
198001.00000  199001.00000  0.000000000000e+00
