10001.00000  11001.00000  5.184398583523e-04
11001.00000  12001.00000  4.349047351536e-04
12001.00000  13001.00000  3.684367017808e-04
13001.00000  14001.00000  3.201699635704e-04
14001.00000  15001.00000  2.764940564842e-04
15001.00000  16001.00000  2.400914661592e-04
16001.00000  17001.00000  2.101340426672e-04
17001.00000  18001.00000  1.877379880855e-04
18001.00000  19001.00000  1.665841583962e-04
19001.00000  20001.00000  1.520555281329e-04
20001.00000  21001.00000  1.340342655635e-04
21001.00000  22001.00000  1.232503132368e-04
22001.00000  23001.00000  1.099999143846e-04
23001.00000  24001.00000  1.017184151019e-04
24001.00000  25001.00000  9.307685063311e-05
25001.00000  26001.00000  8.259895371464e-05
26001.00000  27001.00000  7.894429207470e-05
27001.00000  28001.00000  6.990665590104e-05
28001.00000  29001.00000  6.572989974110e-05
29001.00000  30001.00000  6.349749558665e-05
30001.00000  31001.00000  5.748440697708e-05
31001.00000  32001.00000  5.298359214956e-05
32001.00000  33001.00000  4.968899569582e-05
33001.00000  34001.00000  4.637639598276e-05
34001.00000  35001.00000  4.212762678559e-05
35001.00000  36001.00000  4.135348663525e-05
36001.00000  37001.00000  3.789686084772e-05
37001.00000  38001.00000  3.719473373462e-05
38001.00000  39001.00000  3.415218291122e-05
39001.00000  40001.00000  3.195578527539e-05
40001.00000  41001.00000  3.094760275403e-05
41001.00000  42001.00000  2.948933874991e-05
42001.00000  43001.00000  2.808508452372e-05
43001.00000  44001.00000  2.540259888652e-05
44001.00000  45001.00000  2.416037399413e-05
45001.00000  46001.00000  2.378230554861e-05
46001.00000  47001.00000  2.171193072796e-05
47001.00000  48001.00000  2.025366672384e-05
48001.00000  49001.00000  2.030767650177e-05
49001.00000  50001.00000  1.942551679558e-05
50001.00000  51001.00000  1.868738316386e-05
51001.00000  52001.00000  1.746316153078e-05
52001.00000  53001.00000  1.658100182458e-05
53001.00000  54001.00000  1.595088774873e-05
54001.00000  55001.00000  1.456463678185e-05
55001.00000  56001.00000  1.386250966876e-05
56001.00000  57001.00000  1.379049663152e-05
57001.00000  58001.00000  1.386250966876e-05
58001.00000  59001.00000  1.267429455430e-05
59001.00000  60001.00000  1.208018699706e-05
60001.00000  61001.00000  1.200817395982e-05
61001.00000  62001.00000  1.202617721913e-05
62001.00000  63001.00000  1.125203706880e-05
63001.00000  64001.00000  1.098198817915e-05
64001.00000  65001.00000  9.217668766760e-06
65001.00000  66001.00000  9.613740471582e-06
66001.00000  67001.00000  9.325688322621e-06
67001.00000  68001.00000  8.929616617799e-06
68001.00000  69001.00000  8.731580765388e-06
69001.00000  70001.00000  8.101466689536e-06
70001.00000  71001.00000  7.705394984714e-06
71001.00000  72001.00000  8.029453652295e-06
72001.00000  73001.00000  8.785590543319e-06
73001.00000  74001.00000  7.435346095063e-06
74001.00000  75001.00000  7.273316761272e-06
75001.00000  76001.00000  6.265134239908e-06
76001.00000  77001.00000  6.679209204039e-06
77001.00000  78001.00000  6.625199426109e-06
78001.00000  79001.00000  6.463170092318e-06
79001.00000  80001.00000  6.193121202667e-06
80001.00000  81001.00000  5.563007126814e-06
81001.00000  82001.00000  5.436984311644e-06
82001.00000  83001.00000  5.815052757156e-06
83001.00000  84001.00000  5.617016904745e-06
84001.00000  85001.00000  4.932893050962e-06
85001.00000  86001.00000  5.094922384752e-06
86001.00000  87001.00000  4.914889791652e-06
87001.00000  88001.00000  4.500814827520e-06
88001.00000  89001.00000  3.942713788907e-06
89001.00000  90001.00000  4.770863717171e-06
90001.00000  91001.00000  4.536821346140e-06
91001.00000  92001.00000  4.158752900628e-06
92001.00000  93001.00000  4.212762678559e-06
93001.00000  94001.00000  3.618655121326e-06
94001.00000  95001.00000  3.582648602706e-06
95001.00000  96001.00000  3.222583416504e-06
96001.00000  97001.00000  3.708671417876e-06
97001.00000  98001.00000  3.528638824776e-06
98001.00000  99001.00000  3.348606231675e-06
99001.00000  100001.00000  3.240586675814e-06
100001.00000  101001.00000  3.258589935124e-06
101001.00000  102001.00000  3.258589935124e-06
102001.00000  103001.00000  3.384612750295e-06
103001.00000  104001.00000  3.384612750295e-06
104001.00000  105001.00000  3.060554082713e-06
105001.00000  106001.00000  3.078557342024e-06
106001.00000  107001.00000  2.988541045473e-06
107001.00000  108001.00000  2.556462822031e-06
108001.00000  109001.00000  2.754498674442e-06
109001.00000  110001.00000  2.952534526853e-06
110001.00000  111001.00000  2.448443266171e-06
111001.00000  112001.00000  2.340423710310e-06
112001.00000  113001.00000  2.502453044101e-06
113001.00000  114001.00000  1.944352005489e-06
114001.00000  115001.00000  2.538459562721e-06
115001.00000  116001.00000  2.142387857899e-06
116001.00000  117001.00000  2.034368302039e-06
117001.00000  118001.00000  2.016365042729e-06
118001.00000  119001.00000  2.016365042729e-06
119001.00000  120001.00000  2.160391117209e-06
120001.00000  121001.00000  1.926348746178e-06
121001.00000  122001.00000  1.890342227558e-06
122001.00000  123001.00000  1.944352005489e-06
123001.00000  124001.00000  1.620293337907e-06
124001.00000  125001.00000  1.764319412388e-06
125001.00000  126001.00000  1.818329190318e-06
126001.00000  127001.00000  1.728312893768e-06
127001.00000  128001.00000  1.638296597217e-06
128001.00000  129001.00000  1.602290078597e-06
129001.00000  130001.00000  1.512273782047e-06
130001.00000  131001.00000  1.440260744806e-06
131001.00000  132001.00000  1.638296597217e-06
132001.00000  133001.00000  1.404254226186e-06
133001.00000  134001.00000  1.476267263426e-06
134001.00000  135001.00000  1.566283559977e-06
135001.00000  136001.00000  1.404254226186e-06
136001.00000  137001.00000  1.548280300667e-06
137001.00000  138001.00000  1.386250966876e-06
138001.00000  139001.00000  1.026185780675e-06
139001.00000  140001.00000  1.422257485496e-06
140001.00000  141001.00000  1.152208595845e-06
141001.00000  142001.00000  1.458264004116e-06
142001.00000  143001.00000  1.476267263426e-06
143001.00000  144001.00000  1.350244448256e-06
144001.00000  145001.00000  9.721760027443e-07
145001.00000  146001.00000  1.512273782047e-06
146001.00000  147001.00000  1.260228151706e-06
147001.00000  148001.00000  1.044189039985e-06
148001.00000  149001.00000  1.080195558605e-06
149001.00000  150001.00000  9.721760027443e-07
150001.00000  151001.00000  1.170211855155e-06
151001.00000  152001.00000  1.008182521364e-06
152001.00000  153001.00000  9.721760027443e-07
153001.00000  154001.00000  1.116202077225e-06
154001.00000  155001.00000  9.901792620543e-07
155001.00000  156001.00000  9.361694841241e-07
156001.00000  157001.00000  7.741401503334e-07
157001.00000  158001.00000  8.101466689536e-07
158001.00000  159001.00000  9.001629655040e-07
159001.00000  160001.00000  9.721760027443e-07
160001.00000  161001.00000  8.821597061939e-07
161001.00000  162001.00000  7.921434096435e-07
162001.00000  163001.00000  8.281499282636e-07
163001.00000  164001.00000  8.821597061939e-07
164001.00000  165001.00000  7.201303724032e-07
165001.00000  166001.00000  6.841238537830e-07
166001.00000  167001.00000  8.641564468838e-07
167001.00000  168001.00000  7.921434096435e-07
168001.00000  169001.00000  6.661205944729e-07
169001.00000  170001.00000  7.921434096435e-07
170001.00000  171001.00000  8.281499282636e-07
171001.00000  172001.00000  5.581010386125e-07
172001.00000  173001.00000  7.921434096435e-07
173001.00000  174001.00000  6.661205944729e-07
174001.00000  175001.00000  5.581010386125e-07
175001.00000  176001.00000  6.121108165427e-07
176001.00000  177001.00000  6.301140758528e-07
177001.00000  178001.00000  7.201303724032e-07
178001.00000  179001.00000  5.220945199923e-07
179001.00000  180001.00000  6.121108165427e-07
180001.00000  181001.00000  4.320782234419e-07
181001.00000  182001.00000  4.680847420621e-07
182001.00000  183001.00000  4.500814827520e-07
183001.00000  184001.00000  4.680847420621e-07
184001.00000  185001.00000  5.400977793024e-07
185001.00000  186001.00000  5.400977793024e-07
186001.00000  187001.00000  7.741401503334e-07
187001.00000  188001.00000  5.220945199923e-07
188001.00000  189001.00000  4.140749641318e-07
189001.00000  190001.00000  4.140749641318e-07
190001.00000  191001.00000  4.320782234419e-07
191001.00000  192001.00000  4.140749641318e-07
192001.00000  193001.00000  4.320782234419e-07
193001.00000  194001.00000  4.140749641318e-07
194001.00000  195001.00000  6.121108165427e-07
195001.00000  196001.00000  5.040912606822e-07
196001.00000  197001.00000  4.500814827520e-07
197001.00000  198001.00000  3.600651862016e-07
198001.00000  199001.00000  5.040912606822e-07
