300.00000  350.00000  2.466234921274e-04
350.00000  400.00000  2.318836041140e-04
400.00000  450.00000  2.182222444918e-04
450.00000  500.00000  1.696884668865e-04
500.00000  550.00000  1.829903170450e-04
550.00000  600.00000  8.628227129823e-05
600.00000  650.00000  9.706755521050e-05
650.00000  700.00000  7.118287382104e-05
700.00000  750.00000  7.657551577718e-05
750.00000  800.00000  6.399268454618e-05
800.00000  850.00000  9.095589432688e-05
850.00000  900.00000  5.069083438771e-05
900.00000  950.00000  4.781475867777e-05
950.00000  1000.00000  4.386015457660e-05
1000.00000  1050.00000  4.493868296783e-05
1050.00000  1100.00000  4.781475867777e-05
1100.00000  1150.00000  4.386015457660e-05
1150.00000  1200.00000  4.134358833040e-05
1200.00000  1250.00000  3.487241798303e-05
1250.00000  1300.00000  7.298042113975e-05
1300.00000  1350.00000  2.660370031695e-05
1350.00000  1400.00000  3.990555047543e-05
1400.00000  1450.00000  3.487241798303e-05
1450.00000  1500.00000  3.918653154794e-05
1500.00000  1550.00000  3.918653154794e-05
1550.00000  1600.00000  3.702947476549e-05
1600.00000  1650.00000  3.343438012806e-05
1650.00000  1700.00000  4.242211672163e-05
1700.00000  1750.00000  9.491049842805e-05
1750.00000  1800.00000  4.925279653274e-05
1800.00000  1850.00000  4.026505993917e-05
1850.00000  1900.00000  4.278162618537e-05
1900.00000  1950.00000  3.595094637426e-05
1950.00000  2000.00000  4.170309779414e-05
2000.00000  2050.00000  4.278162618537e-05
2050.00000  2100.00000  4.350064511286e-05
2100.00000  2150.00000  3.990555047543e-05
2150.00000  2200.00000  4.601721135905e-05
2200.00000  2250.00000  4.350064511286e-05
2250.00000  2300.00000  4.889328706899e-05
2300.00000  2350.00000  1.100098959052e-04
2350.00000  2400.00000  4.457917350408e-05
2400.00000  2450.00000  4.889328706899e-05
2450.00000  2500.00000  5.033132492396e-05
2500.00000  2550.00000  4.565770189531e-05
2550.00000  2600.00000  5.464543848888e-05
2600.00000  2650.00000  4.781475867777e-05
2650.00000  2700.00000  4.206260725788e-05
2700.00000  2750.00000  4.601721135905e-05
2750.00000  2800.00000  4.961230599648e-05
2800.00000  2850.00000  5.428592902513e-05
2850.00000  2900.00000  5.033132492396e-05
2900.00000  2950.00000  4.745524921402e-05
2950.00000  3000.00000  6.758777918361e-05
3000.00000  3050.00000  4.637672082280e-05
3050.00000  3100.00000  5.320740063391e-05
3100.00000  3150.00000  4.997181546022e-05
3150.00000  3200.00000  4.242211672163e-05
3200.00000  3250.00000  4.170309779414e-05
3250.00000  3300.00000  4.997181546022e-05
3300.00000  3350.00000  4.457917350408e-05
3350.00000  3400.00000  3.990555047543e-05
3400.00000  3450.00000  5.033132492396e-05
3450.00000  3500.00000  4.026505993917e-05
3500.00000  3550.00000  4.062456940291e-05
3550.00000  3600.00000  4.242211672163e-05
3600.00000  3650.00000  4.386015457660e-05
3650.00000  3700.00000  5.536445741636e-05
3700.00000  3750.00000  3.487241798303e-05
3750.00000  3800.00000  3.702947476549e-05
3800.00000  3850.00000  4.170309779414e-05
3850.00000  3900.00000  4.421966404034e-05
3900.00000  3950.00000  4.421966404034e-05
3950.00000  4000.00000  3.882702208420e-05
4000.00000  4050.00000  4.134358833040e-05
4050.00000  4100.00000  3.163683280935e-05
4100.00000  4150.00000  3.990555047543e-05
4150.00000  4200.00000  3.379388959181e-05
4200.00000  4250.00000  3.235585173683e-05
4250.00000  4300.00000  3.810800315672e-05
4300.00000  4350.00000  3.523192744678e-05
4350.00000  4400.00000  3.451290851929e-05
4400.00000  4450.00000  3.559143691052e-05
4450.00000  4500.00000  3.055830441812e-05
4500.00000  4550.00000  3.595094637426e-05
4550.00000  4600.00000  3.559143691052e-05
4600.00000  4650.00000  2.876075709941e-05
4650.00000  4700.00000  3.595094637426e-05
4700.00000  4750.00000  3.415339905555e-05
4750.00000  4800.00000  3.451290851929e-05
4800.00000  4850.00000  3.127732334561e-05
4850.00000  4900.00000  3.019879495438e-05
4900.00000  4950.00000  3.091781388186e-05
4950.00000  5000.00000  2.588468138947e-05
5000.00000  5050.00000  2.912026656315e-05
5050.00000  5100.00000  2.947977602689e-05
5100.00000  5150.00000  2.696320978070e-05
5150.00000  5200.00000  2.552517192573e-05
5200.00000  5250.00000  2.696320978070e-05
5250.00000  5300.00000  2.696320978070e-05
5300.00000  5350.00000  2.049203943333e-05
5350.00000  5400.00000  2.516566246198e-05
5400.00000  5450.00000  3.019879495438e-05
5450.00000  5500.00000  2.660370031695e-05
5500.00000  5550.00000  2.336811514327e-05
5550.00000  5600.00000  2.228958675204e-05
5600.00000  5650.00000  2.264909621578e-05
5650.00000  5700.00000  2.228958675204e-05
5700.00000  5750.00000  2.804173817192e-05
5750.00000  5800.00000  2.336811514327e-05
5800.00000  5850.00000  2.264909621578e-05
5850.00000  5900.00000  2.193007728830e-05
5900.00000  5950.00000  1.689694479590e-05
5950.00000  6000.00000  2.013252996959e-05
6000.00000  6050.00000  1.689694479590e-05
6050.00000  6100.00000  1.438037854970e-05
6100.00000  6150.00000  1.653743533216e-05
6150.00000  6200.00000  1.797547318713e-05
6200.00000  6250.00000  1.761596372339e-05
6250.00000  6300.00000  2.157056782456e-05
6300.00000  6350.00000  1.941351104210e-05
6350.00000  6400.00000  1.786762034801e-04
6400.00000  6450.00000  1.402086908596e-05
6450.00000  6500.00000  1.366135962222e-05
6500.00000  6550.00000  1.402086908596e-05
6550.00000  6600.00000  1.689694479590e-05
6600.00000  6650.00000  1.617792586842e-05
6650.00000  6700.00000  1.653743533216e-05
6700.00000  6750.00000  1.797547318713e-05
6750.00000  6800.00000  1.833498265087e-05
6800.00000  6850.00000  1.222332176725e-05
6850.00000  6900.00000  1.150430283976e-05
6900.00000  6950.00000  1.330185015848e-05
6950.00000  7000.00000  1.905400157836e-05
7000.00000  7050.00000  1.581841640467e-05
7050.00000  7100.00000  3.091781388186e-05
7100.00000  7150.00000  9.347246057308e-06
7150.00000  7200.00000  1.258283123099e-05
7200.00000  7250.00000  1.186381230351e-05
7250.00000  7300.00000  1.689694479590e-05
7300.00000  7350.00000  1.222332176725e-05
7350.00000  7400.00000  1.042577444854e-05
7400.00000  7450.00000  1.222332176725e-05
7450.00000  7500.00000  2.408713407075e-05
7500.00000  7550.00000  1.402086908596e-05
7550.00000  7600.00000  1.150430283976e-05
7600.00000  7650.00000  1.438037854970e-05
7650.00000  7700.00000  1.114479337602e-05
7700.00000  7750.00000  1.042577444854e-05
7750.00000  7800.00000  1.114479337602e-05
7800.00000  7850.00000  1.330185015848e-05
7850.00000  7900.00000  1.186381230351e-05
7900.00000  7950.00000  1.150430283976e-05
7950.00000  8000.00000  1.078528391228e-05
8000.00000  8050.00000  6.830679811110e-06
8050.00000  8100.00000  1.006626498479e-05
8100.00000  8150.00000  8.987736593565e-06
8150.00000  8200.00000  1.150430283976e-05
8200.00000  8250.00000  8.987736593565e-06
8250.00000  8300.00000  1.402086908596e-05
8300.00000  8350.00000  1.222332176725e-05
8350.00000  8400.00000  9.347246057308e-06
8400.00000  8450.00000  1.366135962222e-05
8450.00000  8500.00000  8.628227129823e-06
8500.00000  8550.00000  1.150430283976e-05
8550.00000  8600.00000  1.114479337602e-05
8600.00000  8650.00000  1.078528391228e-05
8650.00000  8700.00000  9.706755521050e-06
8700.00000  8750.00000  6.471170347367e-06
8750.00000  8800.00000  7.549698738595e-06
8800.00000  8850.00000  9.347246057308e-06
8850.00000  8900.00000  8.987736593565e-06
8900.00000  8950.00000  1.006626498479e-05
8950.00000  9000.00000  1.186381230351e-05
9000.00000  9050.00000  7.909208202337e-06
9050.00000  9100.00000  9.706755521050e-06
9100.00000  9150.00000  8.268717666080e-06
9150.00000  9200.00000  7.190189274852e-06
9200.00000  9250.00000  8.628227129823e-06
9250.00000  9300.00000  8.628227129823e-06
9300.00000  9350.00000  6.830679811110e-06
9350.00000  9400.00000  5.033132492396e-06
9400.00000  9450.00000  8.987736593565e-06
9450.00000  9500.00000  7.190189274852e-06
9500.00000  9550.00000  8.268717666080e-06
9550.00000  9600.00000  4.673623028654e-06
9600.00000  9650.00000  9.706755521050e-06
9650.00000  9700.00000  6.830679811110e-06
9700.00000  9750.00000  5.752151419882e-06
9750.00000  9800.00000  7.549698738595e-06
9800.00000  9850.00000  7.549698738595e-06
9850.00000  9900.00000  6.471170347367e-06
9900.00000  9950.00000  6.471170347367e-06
9950.00000  10000.00000  7.909208202337e-06
