10001.00000  11001.00000  3.728350398023e-04
11001.00000  12001.00000  3.028689586789e-04
12001.00000  13001.00000  2.542697646052e-04
13001.00000  14001.00000  2.114979033632e-04
14001.00000  15001.00000  1.815804527794e-04
15001.00000  16001.00000  1.492254250634e-04
16001.00000  17001.00000  1.285441065822e-04
17001.00000  18001.00000  1.117857637981e-04
18001.00000  19001.00000  9.893135313990e-05
19001.00000  20001.00000  8.721955676241e-05
20001.00000  21001.00000  7.516497610071e-05
21001.00000  22001.00000  6.968042755320e-05
22001.00000  23001.00000  5.932072474125e-05
23001.00000  24001.00000  5.231269048610e-05
24001.00000  25001.00000  4.627587836958e-05
25001.00000  26001.00000  4.237194624375e-05
26001.00000  27001.00000  3.915358268636e-05
27001.00000  28001.00000  3.528773770322e-05
28001.00000  29001.00000  3.224076628794e-05
29001.00000  30001.00000  2.913666415862e-05
30001.00000  31001.00000  2.662291274102e-05
31001.00000  32001.00000  2.393776918130e-05
32001.00000  33001.00000  2.239523990231e-05
33001.00000  34001.00000  2.199532490406e-05
34001.00000  35001.00000  1.894835348878e-05
35001.00000  36001.00000  1.774860849401e-05
36001.00000  37001.00000  1.578712064542e-05
37001.00000  38001.00000  1.405415565298e-05
38001.00000  39001.00000  1.319719494243e-05
39001.00000  40001.00000  1.234023423189e-05
40001.00000  41001.00000  1.152136066403e-05
41001.00000  42001.00000  1.087387923828e-05
42001.00000  43001.00000  1.024544138388e-05
43001.00000  44001.00000  9.350393530643e-06
44001.00000  45001.00000  7.960212822421e-06
45001.00000  46001.00000  8.322040677986e-06
46001.00000  47001.00000  7.845951394348e-06
47001.00000  48001.00000  6.417683543435e-06
48001.00000  49001.00000  7.103252111873e-06
49001.00000  50001.00000  5.998724973834e-06
50001.00000  51001.00000  5.617853546924e-06
51001.00000  52001.00000  5.256025691359e-06
52001.00000  53001.00000  5.427417833469e-06
53001.00000  54001.00000  5.141764263286e-06
54001.00000  55001.00000  4.798979979067e-06
55001.00000  56001.00000  4.437152123503e-06
56001.00000  57001.00000  4.018193553902e-06
57001.00000  58001.00000  3.580191412955e-06
58001.00000  59001.00000  3.675409269682e-06
59001.00000  60001.00000  3.104102129317e-06
60001.00000  61001.00000  2.970797129899e-06
61001.00000  62001.00000  3.504017127573e-06
62001.00000  63001.00000  3.066014986626e-06
63001.00000  64001.00000  2.475664274916e-06
64001.00000  65001.00000  2.875579273171e-06
65001.00000  66001.00000  2.704187131062e-06
66001.00000  67001.00000  2.037662133969e-06
67001.00000  68001.00000  1.752008563786e-06
68001.00000  69001.00000  1.828182849168e-06
69001.00000  70001.00000  1.790095706477e-06
70001.00000  71001.00000  1.980531419933e-06
71001.00000  72001.00000  1.904357134550e-06
72001.00000  73001.00000  1.732964992441e-06
73001.00000  74001.00000  1.599659993022e-06
74001.00000  75001.00000  1.637747135713e-06
75001.00000  76001.00000  1.523485707640e-06
76001.00000  77001.00000  1.218788566112e-06
77001.00000  78001.00000  1.142614280730e-06
78001.00000  79001.00000  1.199744994767e-06
79001.00000  80001.00000  1.256875708803e-06
80001.00000  81001.00000  1.028352852657e-06
81001.00000  82001.00000  1.180701423421e-06
82001.00000  83001.00000  8.950478532387e-07
83001.00000  84001.00000  1.123570709385e-06
84001.00000  85001.00000  7.046121397837e-07
85001.00000  86001.00000  8.760042818932e-07
86001.00000  87001.00000  6.474814257472e-07
87001.00000  88001.00000  8.379171392022e-07
88001.00000  89001.00000  9.712221386207e-07
89001.00000  90001.00000  7.617428538202e-07
90001.00000  91001.00000  5.713071403651e-07
91001.00000  92001.00000  5.522635690196e-07
92001.00000  93001.00000  5.141764263286e-07
93001.00000  94001.00000  7.426992824747e-07
94001.00000  95001.00000  6.474814257472e-07
95001.00000  96001.00000  5.713071403651e-07
96001.00000  97001.00000  4.760892836376e-07
97001.00000  98001.00000  3.046971415281e-07
98001.00000  99001.00000  3.999149982556e-07
99001.00000  100001.00000  4.570457122921e-07
100001.00000  101001.00000  6.855685684382e-07
101001.00000  102001.00000  3.808714269101e-07
102001.00000  103001.00000  3.237407128736e-07
103001.00000  104001.00000  2.666099988371e-07
104001.00000  105001.00000  3.618278555646e-07
105001.00000  106001.00000  3.808714269101e-07
106001.00000  107001.00000  3.046971415281e-07
107001.00000  108001.00000  3.618278555646e-07
108001.00000  109001.00000  2.666099988371e-07
109001.00000  110001.00000  2.094792848006e-07
110001.00000  111001.00000  3.046971415281e-07
111001.00000  112001.00000  3.237407128736e-07
112001.00000  113001.00000  2.285228561461e-07
113001.00000  114001.00000  3.046971415281e-07
114001.00000  115001.00000  2.666099988371e-07
115001.00000  116001.00000  1.904357134550e-07
116001.00000  117001.00000  1.904357134550e-07
117001.00000  118001.00000  2.856535701826e-07
118001.00000  119001.00000  2.666099988371e-07
119001.00000  120001.00000  2.285228561461e-07
120001.00000  121001.00000  1.523485707640e-07
121001.00000  122001.00000  2.856535701826e-07
122001.00000  123001.00000  1.523485707640e-07
123001.00000  124001.00000  1.523485707640e-07
124001.00000  125001.00000  1.523485707640e-07
125001.00000  126001.00000  2.094792848006e-07
126001.00000  127001.00000  9.521785672752e-08
127001.00000  128001.00000  5.713071403651e-08
128001.00000  129001.00000  2.094792848006e-07
129001.00000  130001.00000  1.713921421095e-07
130001.00000  131001.00000  1.142614280730e-07
131001.00000  132001.00000  9.521785672752e-08
132001.00000  133001.00000  5.713071403651e-08
133001.00000  134001.00000  7.617428538202e-08
134001.00000  135001.00000  1.523485707640e-07
135001.00000  136001.00000  5.713071403651e-08
136001.00000  137001.00000  1.904357134550e-07
137001.00000  138001.00000  9.521785672752e-08
138001.00000  139001.00000  9.521785672752e-08
139001.00000  140001.00000  7.617428538202e-08
140001.00000  141001.00000  3.808714269101e-08
141001.00000  142001.00000  1.904357134550e-08
142001.00000  143001.00000  1.142614280730e-07
143001.00000  144001.00000  3.808714269101e-08
144001.00000  145001.00000  7.617428538202e-08
145001.00000  146001.00000  5.713071403651e-08
146001.00000  147001.00000  3.808714269101e-08
147001.00000  148001.00000  3.808714269101e-08
148001.00000  149001.00000  0.000000000000e+00
149001.00000  150001.00000  3.808714269101e-08
150001.00000  151001.00000  0.000000000000e+00
151001.00000  152001.00000  0.000000000000e+00
152001.00000  153001.00000  1.333049994185e-07
153001.00000  154001.00000  0.000000000000e+00
154001.00000  155001.00000  1.904357134550e-08
155001.00000  156001.00000  0.000000000000e+00
156001.00000  157001.00000  1.904357134550e-08
157001.00000  158001.00000  5.713071403651e-08
158001.00000  159001.00000  1.904357134550e-08
159001.00000  160001.00000  1.904357134550e-08
160001.00000  161001.00000  1.904357134550e-08
161001.00000  162001.00000  7.617428538202e-08
162001.00000  163001.00000  3.808714269101e-08
163001.00000  164001.00000  0.000000000000e+00
164001.00000  165001.00000  3.808714269101e-08
165001.00000  166001.00000  1.904357134550e-08
166001.00000  167001.00000  3.808714269101e-08
167001.00000  168001.00000  1.904357134550e-08
168001.00000  169001.00000  1.904357134550e-08
169001.00000  170001.00000  1.904357134550e-08
170001.00000  171001.00000  1.904357134550e-08
171001.00000  172001.00000  3.808714269101e-08
172001.00000  173001.00000  1.904357134550e-08
173001.00000  174001.00000  1.904357134550e-08
174001.00000  175001.00000  7.617428538202e-08
175001.00000  176001.00000  5.713071403651e-08
176001.00000  177001.00000  3.808714269101e-08
177001.00000  178001.00000  1.904357134550e-08
178001.00000  179001.00000  0.000000000000e+00
179001.00000  180001.00000  1.904357134550e-08
180001.00000  181001.00000  0.000000000000e+00
181001.00000  182001.00000  0.000000000000e+00
182001.00000  183001.00000  0.000000000000e+00
183001.00000  184001.00000  0.000000000000e+00
184001.00000  185001.00000  1.904357134550e-08
185001.00000  186001.00000  1.904357134550e-08
186001.00000  187001.00000  0.000000000000e+00
187001.00000  188001.00000  3.808714269101e-08
188001.00000  189001.00000  0.000000000000e+00
189001.00000  190001.00000  0.000000000000e+00
190001.00000  191001.00000  3.808714269101e-08
191001.00000  192001.00000  0.000000000000e+00
192001.00000  193001.00000  0.000000000000e+00
193001.00000  194001.00000  1.904357134550e-08
194001.00000  195001.00000  1.904357134550e-08
195001.00000  196001.00000  0.000000000000e+00
196001.00000  197001.00000  0.000000000000e+00
197001.00000  198001.00000  1.904357134550e-08
198001.00000  199001.00000  0.000000000000e+00
