300.00000  350.00000  1.577320941997e-01
350.00000  400.00000  1.252851463966e-01
400.00000  450.00000  1.025083095606e-01
450.00000  500.00000  8.554118137314e-02
500.00000  550.00000  7.290069885579e-02
550.00000  600.00000  6.307157111643e-02
600.00000  650.00000  5.532239819565e-02
650.00000  700.00000  4.873169333721e-02
700.00000  750.00000  4.339112276294e-02
750.00000  800.00000  3.907065250144e-02
800.00000  850.00000  3.532681102060e-02
850.00000  900.00000  3.214647557709e-02
900.00000  950.00000  2.931929631449e-02
950.00000  1000.00000  2.711023685928e-02
1000.00000  1050.00000  2.501387861153e-02
1050.00000  1100.00000  2.302423914413e-02
1100.00000  1150.00000  2.150489564008e-02
1150.00000  1200.00000  2.005734126132e-02
1200.00000  1250.00000  1.878501410240e-02
1250.00000  1300.00000  1.760377422074e-02
1300.00000  1350.00000  1.667244540700e-02
1350.00000  1400.00000  1.567839759938e-02
1400.00000  1450.00000  1.475170034211e-02
1450.00000  1500.00000  1.386919585284e-02
1500.00000  1550.00000  1.313856781951e-02
1550.00000  1600.00000  1.251002701008e-02
1600.00000  1650.00000  1.191583691113e-02
1650.00000  1700.00000  1.133438359248e-02
1700.00000  1750.00000  1.081140367429e-02
1750.00000  1800.00000  1.031235346452e-02
1800.00000  1850.00000  9.849390798925e-03
1850.00000  1900.00000  9.472304909566e-03
1900.00000  1950.00000  9.033271952405e-03
1950.00000  2000.00000  8.622993241670e-03
2000.00000  2050.00000  8.356678744579e-03
2050.00000  2100.00000  8.093644933322e-03
2100.00000  2150.00000  7.709032764698e-03
2150.00000  2200.00000  7.440402489372e-03
2200.00000  2250.00000  7.182772160664e-03
2250.00000  2300.00000  6.953896078382e-03
2300.00000  2350.00000  6.763037355467e-03
2350.00000  2400.00000  6.511582435388e-03
2400.00000  2450.00000  6.255881921877e-03
2450.00000  2500.00000  6.084707313964e-03
2500.00000  2550.00000  5.847147063298e-03
2550.00000  2600.00000  5.691025013917e-03
2600.00000  2650.00000  5.574271194540e-03
2650.00000  2700.00000  5.362763449025e-03
2700.00000  2750.00000  5.169202984835e-03
2750.00000  2800.00000  4.998607321481e-03
2800.00000  2850.00000  4.889958725929e-03
2850.00000  2900.00000  4.785941686848e-03
2900.00000  2950.00000  4.657223013254e-03
2950.00000  3000.00000  4.527153469023e-03
3000.00000  3050.00000  4.329926355960e-03
3050.00000  3100.00000  4.282452902131e-03
3100.00000  3150.00000  4.195611218297e-03
3150.00000  3200.00000  4.100471329119e-03
3200.00000  3250.00000  4.007068273617e-03
3250.00000  3300.00000  3.859244429580e-03
3300.00000  3350.00000  3.771630819667e-03
3350.00000  3400.00000  3.694438211815e-03
3400.00000  3450.00000  3.576333521801e-03
3450.00000  3500.00000  3.490649727085e-03
3500.00000  3550.00000  3.414807989870e-03
3550.00000  3600.00000  3.325843509320e-03
3600.00000  3650.00000  3.250387735144e-03
3650.00000  3700.00000  3.180142461999e-03
3700.00000  3750.00000  3.185159981509e-03
3750.00000  3800.00000  3.028844950608e-03
3800.00000  3850.00000  3.041967693943e-03
3850.00000  3900.00000  2.955897936187e-03
3900.00000  3950.00000  2.865968548039e-03
3950.00000  4000.00000  2.797074145531e-03
4000.00000  4050.00000  2.776811085970e-03
4050.00000  4100.00000  2.709074572579e-03
4100.00000  4150.00000  2.660057266593e-03
4150.00000  4200.00000  2.614127664921e-03
4200.00000  4250.00000  2.564338432856e-03
4250.00000  4300.00000  2.488689677161e-03
4300.00000  4350.00000  2.437742555978e-03
4350.00000  4400.00000  2.440444297253e-03
4400.00000  4450.00000  2.422882978967e-03
4450.00000  4500.00000  2.359585040528e-03
4500.00000  4550.00000  2.315199291013e-03
4550.00000  4600.00000  2.237427738601e-03
4600.00000  4650.00000  2.273129319733e-03
4650.00000  4700.00000  2.160235130749e-03
4700.00000  4750.00000  2.168147373054e-03
4750.00000  4800.00000  2.114691492116e-03
4800.00000  4850.00000  2.060656666619e-03
4850.00000  4900.00000  2.066446112208e-03
4900.00000  4950.00000  1.980762317492e-03
4950.00000  5000.00000  1.996200839063e-03
5000.00000  5050.00000  1.967832555677e-03
5050.00000  5100.00000  1.884078576157e-03
5100.00000  5150.00000  1.875394407774e-03
5150.00000  5200.00000  1.870762851302e-03
5200.00000  5250.00000  1.838341956004e-03
5250.00000  5300.00000  1.803412300951e-03
5300.00000  5350.00000  1.782956259870e-03
5350.00000  5400.00000  1.754973939524e-03
5400.00000  5450.00000  1.719272358392e-03
5450.00000  5500.00000  1.667360329611e-03
5500.00000  5550.00000  1.670062070886e-03
5550.00000  5600.00000  1.649991992845e-03
5600.00000  5650.00000  1.633395582156e-03
5650.00000  5700.00000  1.621623709459e-03
5700.00000  5750.00000  1.566430994844e-03
5750.00000  5800.00000  1.575115163228e-03
5800.00000  5850.00000  1.545203027685e-03
5850.00000  5900.00000  1.511045298710e-03
5900.00000  5950.00000  1.501010259690e-03
5950.00000  6000.00000  1.497922555375e-03
6000.00000  6050.00000  1.430957968064e-03
6050.00000  6100.00000  1.427291319191e-03
6100.00000  6150.00000  1.455466621057e-03
6150.00000  6200.00000  1.424589577916e-03
6200.00000  6250.00000  1.386572218548e-03
6250.00000  6300.00000  1.368431955703e-03
6300.00000  6350.00000  1.364572325310e-03
6350.00000  6400.00000  1.595378222789e-03
6400.00000  6450.00000  1.295484941283e-03
6450.00000  6500.00000  1.306677869421e-03
6500.00000  6550.00000  1.296835811920e-03
6550.00000  6600.00000  1.281204308830e-03
6600.00000  6650.00000  1.259204415592e-03
6650.00000  6700.00000  1.224853705098e-03
6700.00000  6750.00000  1.195520514114e-03
6750.00000  6800.00000  1.195327532594e-03
6800.00000  6850.00000  1.204783627056e-03
6850.00000  6900.00000  1.162134711218e-03
6900.00000  6950.00000  1.179696029504e-03
6950.00000  7000.00000  1.160590859061e-03
7000.00000  7050.00000  1.127398037684e-03
7050.00000  7100.00000  1.176029380631e-03
7100.00000  7150.00000  1.110994608515e-03
7150.00000  7200.00000  1.070661470913e-03
7200.00000  7250.00000  1.085521047924e-03
7250.00000  7300.00000  1.060433450372e-03
7300.00000  7350.00000  1.064100099245e-03
7350.00000  7400.00000  1.044223002723e-03
7400.00000  7450.00000  1.016626645416e-03
7450.00000  7500.00000  1.013152978063e-03
7500.00000  7550.00000  9.969425304135e-04
7550.00000  7600.00000  9.934688630602e-04
7600.00000  7650.00000  9.749426371756e-04
7650.00000  7700.00000  9.830478610001e-04
7700.00000  7750.00000  9.789952490878e-04
7750.00000  7800.00000  9.463813722702e-04
7800.00000  7850.00000  9.378901854064e-04
7850.00000  7900.00000  9.342235365335e-04
7900.00000  7950.00000  9.398200006028e-04
7950.00000  8000.00000  9.272762018267e-04
8000.00000  8050.00000  8.890658609398e-04
8050.00000  8100.00000  8.925395282932e-04
8100.00000  8150.00000  8.693817459375e-04
8150.00000  8200.00000  8.466099266210e-04
8200.00000  8250.00000  8.738203208890e-04
8250.00000  8300.00000  8.589607438774e-04
8300.00000  8350.00000  8.610835405933e-04
8350.00000  8400.00000  8.552940950044e-04
8400.00000  8450.00000  8.454520375032e-04
8450.00000  8500.00000  8.570309286811e-04
8500.00000  8550.00000  8.300135159327e-04
8550.00000  8600.00000  8.139960498034e-04
8600.00000  8650.00000  8.190135693138e-04
8650.00000  8700.00000  8.126451791660e-04
8700.00000  8750.00000  7.933470272029e-04
8750.00000  8800.00000  7.881365261728e-04
8800.00000  8850.00000  7.809962099465e-04
8850.00000  8900.00000  7.599612243067e-04
8900.00000  8950.00000  7.686453926901e-04
8950.00000  9000.00000  7.595752612674e-04
9000.00000  9050.00000  7.559086123945e-04
9050.00000  9100.00000  7.730839676416e-04
9100.00000  9150.00000  7.389262386669e-04
9150.00000  9200.00000  7.319789039602e-04
9200.00000  9250.00000  7.086281400849e-04
9250.00000  9300.00000  7.296631257246e-04
9300.00000  9350.00000  7.200140497431e-04
9350.00000  9400.00000  7.204000127824e-04
9400.00000  9450.00000  7.134526780756e-04
9450.00000  9500.00000  6.854703577292e-04
9500.00000  9550.00000  6.891370066021e-04
9550.00000  9600.00000  6.773651339047e-04
9600.00000  9650.00000  6.789089860617e-04
9650.00000  9700.00000  6.895229696414e-04
9700.00000  9750.00000  6.756283002280e-04
9750.00000  9800.00000  6.613476677753e-04
9800.00000  9850.00000  6.499617581171e-04
9850.00000  9900.00000  6.638564275305e-04
9900.00000  9950.00000  6.474529983619e-04
9950.00000  10000.00000  6.623125753734e-04
