300.00000  350.00000  1.029300555039e+00
350.00000  400.00000  7.266111513017e-01
400.00000  450.00000  5.382485533021e-01
450.00000  500.00000  4.102722373437e-01
500.00000  550.00000  3.229317696692e-01
550.00000  600.00000  2.595641535834e-01
600.00000  650.00000  2.117719782578e-01
650.00000  700.00000  1.757218702608e-01
700.00000  750.00000  1.474647074138e-01
750.00000  800.00000  1.255150474643e-01
800.00000  850.00000  1.074220714581e-01
850.00000  900.00000  9.339316256667e-02
900.00000  950.00000  8.120417646517e-02
950.00000  1000.00000  7.194427670988e-02
1000.00000  1050.00000  6.417142682848e-02
1050.00000  1100.00000  5.642831794456e-02
1100.00000  1150.00000  5.087559333436e-02
1150.00000  1200.00000  4.556642337918e-02
1200.00000  1250.00000  4.135043603399e-02
1250.00000  1300.00000  3.730646418773e-02
1300.00000  1350.00000  3.479535942770e-02
1350.00000  1400.00000  3.108175379668e-02
1400.00000  1450.00000  2.852643944580e-02
1450.00000  1500.00000  2.629988368867e-02
1500.00000  1550.00000  2.429759112873e-02
1550.00000  1600.00000  2.228324140766e-02
1600.00000  1650.00000  2.085486971798e-02
1650.00000  1700.00000  1.923921012526e-02
1700.00000  1750.00000  1.785585183716e-02
1750.00000  1800.00000  1.676990352385e-02
1800.00000  1850.00000  1.554409214131e-02
1850.00000  1900.00000  1.444447904537e-02
1900.00000  1950.00000  1.373310653812e-02
1950.00000  2000.00000  1.297993587226e-02
2000.00000  2050.00000  1.211021264872e-02
2050.00000  2100.00000  1.143661924638e-02
2100.00000  2150.00000  1.076945632999e-02
2150.00000  2200.00000  1.023009932167e-02
2200.00000  2250.00000  9.554094487103e-03
2250.00000  2300.00000  9.134505279441e-03
2300.00000  2350.00000  8.743853258514e-03
2350.00000  2400.00000  8.200477196485e-03
2400.00000  2450.00000  7.795356582191e-03
2450.00000  2500.00000  7.383805481956e-03
2500.00000  2550.00000  7.056654509698e-03
2550.00000  2600.00000  6.673236785456e-03
2600.00000  2650.00000  6.473087910537e-03
2650.00000  2700.00000  6.169247449816e-03
2700.00000  2750.00000  5.866210799838e-03
2750.00000  2800.00000  5.572819878772e-03
2800.00000  2850.00000  5.285055632904e-03
2850.00000  2900.00000  5.215124098294e-03
2900.00000  2950.00000  4.908068394603e-03
2950.00000  3000.00000  4.768205325382e-03
3000.00000  3050.00000  4.483656322485e-03
3050.00000  3100.00000  4.340578010294e-03
3100.00000  3150.00000  4.232063560037e-03
3150.00000  3200.00000  4.004585119868e-03
3200.00000  3250.00000  3.826139135000e-03
3250.00000  3300.00000  3.688687498007e-03
3300.00000  3350.00000  3.598660694831e-03
3350.00000  3400.00000  3.461209057838e-03
3400.00000  3450.00000  3.245787778809e-03
3450.00000  3500.00000  3.236945860640e-03
3500.00000  3550.00000  3.065734172456e-03
3550.00000  3600.00000  2.986960719676e-03
3600.00000  3650.00000  2.953200668485e-03
3650.00000  3700.00000  2.857547190110e-03
3700.00000  3750.00000  2.670259287073e-03
3750.00000  3800.00000  2.618011588801e-03
3800.00000  3850.00000  2.478148519581e-03
3850.00000  3900.00000  2.466895169184e-03
3900.00000  3950.00000  2.407413174228e-03
3950.00000  4000.00000  2.323816856993e-03
4000.00000  4050.00000  2.220125271191e-03
4050.00000  4100.00000  2.224948135647e-03
4100.00000  4150.00000  2.014349721073e-03
4150.00000  4200.00000  2.040071664838e-03
4200.00000  4250.00000  2.033641178897e-03
4250.00000  4300.00000  1.912265756757e-03
4300.00000  4350.00000  1.838315168434e-03
4350.00000  4400.00000  1.794909388331e-03
4400.00000  4450.00000  1.685591127331e-03
4450.00000  4500.00000  1.728996907434e-03
4500.00000  4550.00000  1.613248160493e-03
4550.00000  4600.00000  1.644596779456e-03
4600.00000  4650.00000  1.609229106779e-03
4650.00000  4700.00000  1.537689950684e-03
4700.00000  4750.00000  1.457308876419e-03
4750.00000  4800.00000  1.441232661566e-03
4800.00000  4850.00000  1.384965909581e-03
4850.00000  4900.00000  1.405061178147e-03
4900.00000  4950.00000  1.386573531066e-03
4950.00000  5000.00000  1.305388646059e-03
5000.00000  5050.00000  1.284489566750e-03
5050.00000  5100.00000  1.250729515559e-03
5100.00000  5150.00000  1.290920052691e-03
5150.00000  5200.00000  1.177582737978e-03
5200.00000  5250.00000  1.138999822331e-03
5250.00000  5300.00000  1.146234119015e-03
5300.00000  5350.00000  1.077910205890e-03
5350.00000  5400.00000  1.086752124059e-03
5400.00000  5450.00000  1.045757776184e-03
5450.00000  5500.00000  1.011193914250e-03
5500.00000  5550.00000  9.581424052353e-04
5550.00000  5600.00000  9.814529167720e-04
5600.00000  5650.00000  9.316166507279e-04
5650.00000  5700.00000  9.597500267206e-04
5700.00000  5750.00000  9.066985177059e-04
5750.00000  5800.00000  8.689194128014e-04
5800.00000  5850.00000  8.464127120073e-04
5850.00000  5900.00000  8.038107426470e-04
5900.00000  5950.00000  8.745460880000e-04
5950.00000  6000.00000  7.933612029926e-04
6000.00000  6050.00000  8.440012797794e-04
6050.00000  6100.00000  7.933612029926e-04
6100.00000  6150.00000  7.515630443750e-04
6150.00000  6200.00000  7.387020724926e-04
6200.00000  6250.00000  7.137839394706e-04
6250.00000  6300.00000  7.467401799191e-04
6300.00000  6350.00000  7.378982617500e-04
6350.00000  6400.00000  6.985115353603e-04
6400.00000  6450.00000  7.242334791250e-04
6450.00000  6500.00000  6.591248089706e-04
6500.00000  6550.00000  6.334028652059e-04
6550.00000  6600.00000  6.462638370882e-04
6600.00000  6650.00000  6.430485941176e-04
6650.00000  6700.00000  5.835665991617e-04
6700.00000  6750.00000  6.269723792647e-04
6750.00000  6800.00000  5.682941950515e-04
6800.00000  6850.00000  5.859780313897e-04
6850.00000  6900.00000  6.173266503529e-04
6900.00000  6950.00000  5.707056272794e-04
6950.00000  7000.00000  5.610598983676e-04
7000.00000  7050.00000  5.289074686618e-04
7050.00000  7100.00000  5.433760620294e-04
7100.00000  7150.00000  5.289074686618e-04
7150.00000  7200.00000  5.015779034118e-04
7200.00000  7250.00000  5.409646298015e-04
7250.00000  7300.00000  5.289074686618e-04
7300.00000  7350.00000  4.734445274191e-04
7350.00000  7400.00000  4.694254737059e-04
7400.00000  7450.00000  4.855016885588e-04
7450.00000  7500.00000  4.509378266250e-04
7500.00000  7550.00000  4.718369059338e-04
7550.00000  7600.00000  4.268235043456e-04
7600.00000  7650.00000  4.292349365735e-04
7650.00000  7700.00000  4.083358572647e-04
7700.00000  7750.00000  4.332539902868e-04
7750.00000  7800.00000  4.228044506323e-04
7800.00000  7850.00000  3.657338879044e-04
7850.00000  7900.00000  4.059244250368e-04
7900.00000  7950.00000  3.914558316691e-04
7950.00000  8000.00000  3.689491308750e-04
8000.00000  8050.00000  3.705567523603e-04
8050.00000  8100.00000  3.753796168162e-04
8100.00000  8150.00000  3.641262664191e-04
8150.00000  8200.00000  4.011015605809e-04
8200.00000  8250.00000  3.673415093897e-04
8250.00000  8300.00000  3.785948597868e-04
8300.00000  8350.00000  3.279547830000e-04
8350.00000  8400.00000  3.327776474559e-04
8400.00000  8450.00000  3.432271871103e-04
8450.00000  8500.00000  3.512652945368e-04
8500.00000  8550.00000  3.263471615147e-04
8550.00000  8600.00000  3.223281078015e-04
8600.00000  8650.00000  3.054480822059e-04
8650.00000  8700.00000  3.070557036912e-04
8700.00000  8750.00000  3.183090540882e-04
8750.00000  8800.00000  3.070557036912e-04
8800.00000  8850.00000  3.054480822059e-04
8850.00000  8900.00000  2.853528136397e-04
8900.00000  8950.00000  2.773147062132e-04
8950.00000  9000.00000  2.885680566103e-04
9000.00000  9050.00000  2.958023532941e-04
9050.00000  9100.00000  2.596308698750e-04
9100.00000  9150.00000  2.588270591323e-04
9150.00000  9200.00000  2.909794888382e-04
9200.00000  9250.00000  2.556118161618e-04
9250.00000  9300.00000  2.660613558162e-04
9300.00000  9350.00000  2.700804095294e-04
9350.00000  9400.00000  2.628461128456e-04
9400.00000  9450.00000  2.475737087353e-04
9450.00000  9500.00000  2.443584657647e-04
9500.00000  9550.00000  2.427508442794e-04
9550.00000  9600.00000  2.395356013088e-04
9600.00000  9650.00000  2.411432227941e-04
9650.00000  9700.00000  2.282822509118e-04
9700.00000  9750.00000  2.290860616544e-04
9750.00000  9800.00000  2.363203583382e-04
9800.00000  9850.00000  2.371241690809e-04
9850.00000  9900.00000  2.323013046250e-04
9900.00000  9950.00000  2.097946038309e-04
9950.00000  10000.00000  1.864840922941e-04
