300.00000  350.00000  7.932950232520e-04
350.00000  400.00000  7.433356038487e-04
400.00000  450.00000  5.987560719392e-04
450.00000  500.00000  5.094346857334e-04
500.00000  550.00000  5.230599819343e-04
550.00000  600.00000  2.611515105171e-04
600.00000  650.00000  2.596375887170e-04
650.00000  700.00000  2.217895437145e-04
700.00000  750.00000  2.058933648135e-04
750.00000  800.00000  1.756149288115e-04
800.00000  850.00000  2.611515105171e-04
850.00000  900.00000  1.423086492093e-04
900.00000  950.00000  1.248985485082e-04
950.00000  1000.00000  1.248985485082e-04
1000.00000  1050.00000  1.180859004077e-04
1050.00000  1100.00000  9.234922980605e-05
1100.00000  1150.00000  1.158150177076e-04
1150.00000  1200.00000  1.029466824067e-04
1200.00000  1250.00000  1.037036433068e-04
1250.00000  1300.00000  1.816706160119e-04
1300.00000  1350.00000  8.932138620585e-05
1350.00000  1400.00000  7.721001180506e-05
1400.00000  1450.00000  9.537707340625e-05
1450.00000  1500.00000  9.310619070610e-05
1500.00000  1550.00000  6.888344190451e-05
1550.00000  1600.00000  7.645305090501e-05
1600.00000  1650.00000  9.613403430630e-05
1650.00000  1700.00000  7.493912910491e-05
1700.00000  1750.00000  1.922680686126e-04
1750.00000  1800.00000  7.948089450521e-05
1800.00000  1850.00000  9.537707340625e-05
1850.00000  1900.00000  9.083530800595e-05
1900.00000  1950.00000  7.342520730481e-05
1950.00000  2000.00000  7.948089450521e-05
2000.00000  2050.00000  9.386315160615e-05
2050.00000  2100.00000  7.796697270511e-05
2100.00000  2150.00000  8.629354260565e-05
2150.00000  2200.00000  8.477962080555e-05
2200.00000  2250.00000  9.007834710590e-05
2250.00000  2300.00000  8.780746440575e-05
2300.00000  2350.00000  1.998376776131e-04
2350.00000  2400.00000  9.007834710590e-05
2400.00000  2450.00000  9.613403430630e-05
2450.00000  2500.00000  8.326569900545e-05
2500.00000  2550.00000  7.342520730481e-05
2550.00000  2600.00000  7.266824640476e-05
2600.00000  2650.00000  8.175177720536e-05
2650.00000  2700.00000  8.250873810540e-05
2700.00000  2750.00000  7.645305090501e-05
2750.00000  2800.00000  8.629354260565e-05
2800.00000  2850.00000  8.175177720536e-05
2850.00000  2900.00000  8.705050350570e-05
2900.00000  2950.00000  8.250873810540e-05
2950.00000  3000.00000  1.127871741074e-04
3000.00000  3050.00000  7.645305090501e-05
3050.00000  3100.00000  7.418216820486e-05
3100.00000  3150.00000  7.191128550471e-05
3150.00000  3200.00000  9.007834710590e-05
3200.00000  3250.00000  7.721001180506e-05
3250.00000  3300.00000  7.418216820486e-05
3300.00000  3350.00000  8.175177720536e-05
3350.00000  3400.00000  8.175177720536e-05
3400.00000  3450.00000  7.039736370461e-05
3450.00000  3500.00000  7.115432460466e-05
3500.00000  3550.00000  7.569609000496e-05
3550.00000  3600.00000  8.856442530580e-05
3600.00000  3650.00000  9.234922980605e-05
3650.00000  3700.00000  9.613403430630e-05
3700.00000  3750.00000  7.039736370461e-05
3750.00000  3800.00000  7.569609000496e-05
3800.00000  3850.00000  7.115432460466e-05
3850.00000  3900.00000  8.023785540526e-05
3900.00000  3950.00000  7.039736370461e-05
3950.00000  4000.00000  7.569609000496e-05
4000.00000  4050.00000  8.402265990550e-05
4050.00000  4100.00000  7.796697270511e-05
4100.00000  4150.00000  5.525814570362e-05
4150.00000  4200.00000  6.812648100446e-05
4200.00000  4250.00000  5.752902840377e-05
4250.00000  4300.00000  6.812648100446e-05
4300.00000  4350.00000  6.661255920436e-05
4350.00000  4400.00000  5.752902840377e-05
4400.00000  4450.00000  7.115432460466e-05
4450.00000  4500.00000  5.979991110392e-05
4500.00000  4550.00000  8.023785540526e-05
4550.00000  4600.00000  7.493912910491e-05
4600.00000  4650.00000  7.569609000496e-05
4650.00000  4700.00000  6.736952010441e-05
4700.00000  4750.00000  8.705050350570e-05
4750.00000  4800.00000  6.888344190451e-05
4800.00000  4850.00000  5.677206750372e-05
4850.00000  4900.00000  6.964040280456e-05
4900.00000  4950.00000  6.282775470412e-05
4950.00000  5000.00000  6.434167650421e-05
5000.00000  5050.00000  8.099481630531e-05
5050.00000  5100.00000  6.585559830431e-05
5100.00000  5150.00000  8.629354260565e-05
5150.00000  5200.00000  7.115432460466e-05
5200.00000  5250.00000  7.796697270511e-05
5250.00000  5300.00000  7.266824640476e-05
5300.00000  5350.00000  6.585559830431e-05
5350.00000  5400.00000  7.418216820486e-05
5400.00000  5450.00000  8.023785540526e-05
5450.00000  5500.00000  5.601510660367e-05
5500.00000  5550.00000  7.266824640476e-05
5550.00000  5600.00000  6.812648100446e-05
5600.00000  5650.00000  7.948089450521e-05
5650.00000  5700.00000  6.661255920436e-05
5700.00000  5750.00000  6.661255920436e-05
5750.00000  5800.00000  6.358471560417e-05
5800.00000  5850.00000  7.342520730481e-05
5850.00000  5900.00000  7.948089450521e-05
5900.00000  5950.00000  7.039736370461e-05
5950.00000  6000.00000  6.585559830431e-05
6000.00000  6050.00000  5.904295020387e-05
6050.00000  6100.00000  7.645305090501e-05
6100.00000  6150.00000  6.434167650421e-05
6150.00000  6200.00000  8.099481630531e-05
6200.00000  6250.00000  1.014327606066e-04
6250.00000  6300.00000  1.037036433068e-04
6300.00000  6350.00000  1.059745260069e-04
6350.00000  6400.00000  7.592317827497e-04
6400.00000  6450.00000  7.266824640476e-05
6450.00000  6500.00000  7.039736370461e-05
6500.00000  6550.00000  5.979991110392e-05
6550.00000  6600.00000  6.055687200397e-05
6600.00000  6650.00000  6.207079380407e-05
6650.00000  6700.00000  6.585559830431e-05
6700.00000  6750.00000  5.979991110392e-05
6750.00000  6800.00000  6.812648100446e-05
6800.00000  6850.00000  9.159226890600e-05
6850.00000  6900.00000  8.553658170560e-05
6900.00000  6950.00000  7.645305090501e-05
6950.00000  7000.00000  4.844549760317e-05
7000.00000  7050.00000  7.569609000496e-05
7050.00000  7100.00000  1.347390402088e-04
7100.00000  7150.00000  4.011892770263e-05
7150.00000  7200.00000  3.784804500248e-05
7200.00000  7250.00000  3.860500590253e-05
7250.00000  7300.00000  3.936196680258e-05
7300.00000  7350.00000  3.784804500248e-05
7350.00000  7400.00000  4.541765400298e-05
7400.00000  7450.00000  3.860500590253e-05
7450.00000  7500.00000  5.979991110392e-05
7500.00000  7550.00000  4.163284950273e-05
7550.00000  7600.00000  3.784804500248e-05
7600.00000  7650.00000  3.482020140228e-05
7650.00000  7700.00000  4.768853670312e-05
7700.00000  7750.00000  3.860500590253e-05
7750.00000  7800.00000  4.011892770263e-05
7800.00000  7850.00000  4.541765400298e-05
7850.00000  7900.00000  3.557716230233e-05
7900.00000  7950.00000  3.179235780208e-05
7950.00000  8000.00000  4.844549760317e-05
8000.00000  8050.00000  4.238981040278e-05
8050.00000  8100.00000  4.541765400298e-05
8100.00000  8150.00000  3.709108410243e-05
8150.00000  8200.00000  4.087588860268e-05
8200.00000  8250.00000  3.860500590253e-05
8250.00000  8300.00000  3.784804500248e-05
8300.00000  8350.00000  4.390373220288e-05
8350.00000  8400.00000  3.709108410243e-05
8400.00000  8450.00000  3.482020140228e-05
8450.00000  8500.00000  3.709108410243e-05
8500.00000  8550.00000  2.876451420188e-05
8550.00000  8600.00000  4.238981040278e-05
8600.00000  8650.00000  4.163284950273e-05
8650.00000  8700.00000  3.254931870213e-05
8700.00000  8750.00000  2.649363150174e-05
8750.00000  8800.00000  4.163284950273e-05
8800.00000  8850.00000  3.784804500248e-05
8850.00000  8900.00000  2.649363150174e-05
8900.00000  8950.00000  3.633412320238e-05
8950.00000  9000.00000  4.995941940327e-05
9000.00000  9050.00000  4.163284950273e-05
9050.00000  9100.00000  4.541765400298e-05
9100.00000  9150.00000  4.314677130283e-05
9150.00000  9200.00000  4.087588860268e-05
9200.00000  9250.00000  4.011892770263e-05
9250.00000  9300.00000  2.497970970164e-05
9300.00000  9350.00000  3.633412320238e-05
9350.00000  9400.00000  3.557716230233e-05
9400.00000  9450.00000  3.709108410243e-05
9450.00000  9500.00000  3.330627960218e-05
9500.00000  9550.00000  3.936196680258e-05
9550.00000  9600.00000  4.011892770263e-05
9600.00000  9650.00000  3.179235780208e-05
9650.00000  9700.00000  3.860500590253e-05
9700.00000  9750.00000  2.952147510193e-05
9750.00000  9800.00000  2.270882700149e-05
9800.00000  9850.00000  3.709108410243e-05
9850.00000  9900.00000  3.330627960218e-05
9900.00000  9950.00000  3.482020140228e-05
9950.00000  10000.00000  5.298726300347e-05
