10001.00000  11001.00000  7.655319042379e-04
11001.00000  12001.00000  6.659983595428e-04
12001.00000  13001.00000  5.854903026164e-04
13001.00000  14001.00000  5.094366641061e-04
14001.00000  15001.00000  4.497803098738e-04
15001.00000  16001.00000  4.084054299219e-04
16001.00000  17001.00000  3.669629123802e-04
17001.00000  18001.00000  3.301197509471e-04
18001.00000  19001.00000  3.021950888591e-04
19001.00000  20001.00000  2.735650633342e-04
20001.00000  21001.00000  2.506455828938e-04
21001.00000  22001.00000  2.318809829717e-04
22001.00000  23001.00000  2.138603965378e-04
23001.00000  24001.00000  1.975887249266e-04
24001.00000  25001.00000  1.862642598861e-04
25001.00000  26001.00000  1.713743276101e-04
26001.00000  27001.00000  1.603687254930e-04
27001.00000  28001.00000  1.507255376855e-04
28001.00000  29001.00000  1.407344994159e-04
29001.00000  30001.00000  1.340866905867e-04
30001.00000  31001.00000  1.248686533438e-04
31001.00000  32001.00000  1.171289805643e-04
32001.00000  33001.00000  1.102202838886e-04
33001.00000  34001.00000  1.056209277800e-04
34001.00000  35001.00000  9.991038269554e-05
35001.00000  36001.00000  9.384232463628e-05
36001.00000  37001.00000  9.068268293981e-05
37001.00000  38001.00000  8.750371621768e-05
38001.00000  39001.00000  8.074961974726e-05
39001.00000  40001.00000  7.674933943430e-05
40001.00000  41001.00000  7.336745994267e-05
41001.00000  42001.00000  7.274905912135e-05
42001.00000  43001.00000  6.639112567708e-05
43001.00000  44001.00000  6.418807275111e-05
44001.00000  45001.00000  6.074821818248e-05
45001.00000  46001.00000  5.895099079550e-05
46001.00000  47001.00000  5.645806248453e-05
47001.00000  48001.00000  5.367525878856e-05
48001.00000  49001.00000  5.204229411975e-05
49001.00000  50001.00000  4.953970329594e-05
50001.00000  51001.00000  4.725935026730e-05
51001.00000  52001.00000  4.592592349632e-05
52001.00000  53001.00000  4.396443339117e-05
53001.00000  54001.00000  4.221551856836e-05
54001.00000  55001.00000  4.094972938720e-05
55001.00000  56001.00000  3.966461518039e-05
56001.00000  57001.00000  3.891093917939e-05
57001.00000  58001.00000  3.740358717741e-05
58001.00000  59001.00000  3.674653630475e-05
59001.00000  60001.00000  3.381879491629e-05
60001.00000  61001.00000  3.274625599180e-05
61001.00000  62001.00000  3.213751768330e-05
62001.00000  63001.00000  3.054320306582e-05
63001.00000  64001.00000  2.933538896167e-05
64001.00000  65001.00000  2.880395075584e-05
65001.00000  66001.00000  2.813723737035e-05
66001.00000  67001.00000  2.775073685702e-05
67001.00000  68001.00000  2.668786044537e-05
68001.00000  69001.00000  2.562498403371e-05
69001.00000  70001.00000  2.473603285305e-05
70001.00000  71001.00000  2.410796951889e-05
71001.00000  72001.00000  2.404033192906e-05
72001.00000  73001.00000  2.282285531208e-05
73001.00000  74001.00000  2.175997890042e-05
74001.00000  75001.00000  2.131550331009e-05
75001.00000  76001.00000  2.063912741177e-05
76001.00000  77001.00000  2.068743997593e-05
77001.00000  78001.00000  1.924772556378e-05
78001.00000  79001.00000  1.921873802528e-05
79001.00000  80001.00000  1.824282422913e-05
80001.00000  81001.00000  1.820417417779e-05
81001.00000  82001.00000  1.763408592063e-05
82001.00000  83001.00000  1.758577335647e-05
83001.00000  84001.00000  1.706399766347e-05
84001.00000  85001.00000  1.578854596949e-05
85001.00000  86001.00000  1.635863422665e-05
86001.00000  87001.00000  1.455174432684e-05
87001.00000  88001.00000  1.462904442950e-05
88001.00000  89001.00000  1.438748160867e-05
89001.00000  90001.00000  1.451309427550e-05
90001.00000  91001.00000  1.341156781252e-05
91001.00000  92001.00000  1.367245565901e-05
92001.00000  93001.00000  1.305405483769e-05
93001.00000  94001.00000  1.252261663186e-05
94001.00000  95001.00000  1.213611611853e-05
95001.00000  96001.00000  1.151771529720e-05
96001.00000  97001.00000  1.181725319503e-05
97001.00000  98001.00000  1.175927811803e-05
98001.00000  99001.00000  1.093796452721e-05
99001.00000  100001.00000  1.117952734804e-05
100001.00000  101001.00000  1.007800088505e-05
101001.00000  102001.00000  1.071572673205e-05
102001.00000  103001.00000  1.013597596205e-05
103001.00000  104001.00000  1.013597596205e-05
104001.00000  105001.00000  1.009732591072e-05
105001.00000  106001.00000  9.652850320391e-06
106001.00000  107001.00000  9.681837858891e-06
107001.00000  108001.00000  9.343649909728e-06
108001.00000  109001.00000  8.966811909232e-06
109001.00000  110001.00000  8.821874216734e-06
110001.00000  111001.00000  8.908836832233e-06
111001.00000  112001.00000  8.647948985736e-06
112001.00000  113001.00000  8.058535702909e-06
113001.00000  114001.00000  8.358073600739e-06
114001.00000  115001.00000  7.536760009915e-06
115001.00000  116001.00000  7.536760009915e-06
116001.00000  117001.00000  7.401484830250e-06
117001.00000  118001.00000  7.884610471911e-06
118001.00000  119001.00000  7.411147343083e-06
119001.00000  120001.00000  7.449797394416e-06
120001.00000  121001.00000  7.130934470920e-06
121001.00000  122001.00000  6.899034162922e-06
122001.00000  123001.00000  6.618821290759e-06
123001.00000  124001.00000  6.551183700926e-06
124001.00000  125001.00000  6.222658264596e-06
125001.00000  126001.00000  6.502871136760e-06
126001.00000  127001.00000  6.609158777925e-06
127001.00000  128001.00000  5.981095443766e-06
128001.00000  129001.00000  6.232320777430e-06
129001.00000  130001.00000  5.681557545936e-06
130001.00000  131001.00000  5.594594930437e-06
131001.00000  132001.00000  5.642907494603e-06
132001.00000  133001.00000  5.092144263109e-06
133001.00000  134001.00000  5.411007186606e-06
134001.00000  135001.00000  5.179106878608e-06
135001.00000  136001.00000  5.198431904275e-06
136001.00000  137001.00000  5.266069494107e-06
137001.00000  138001.00000  5.246744468441e-06
138001.00000  139001.00000  4.580031082948e-06
139001.00000  140001.00000  4.850581442279e-06
140001.00000  141001.00000  4.744293801113e-06
141001.00000  142001.00000  4.695981236947e-06
142001.00000  143001.00000  4.715306262613e-06
143001.00000  144001.00000  4.415768364784e-06
144001.00000  145001.00000  4.531718518782e-06
145001.00000  146001.00000  3.874667646123e-06
146001.00000  147001.00000  3.787705030624e-06
147001.00000  148001.00000  3.980955287288e-06
148001.00000  149001.00000  4.193530569619e-06
149001.00000  150001.00000  4.212855595286e-06
150001.00000  151001.00000  3.865005133290e-06
151001.00000  152001.00000  3.797367543457e-06
152001.00000  153001.00000  3.468842107128e-06
153001.00000  154001.00000  3.836017594790e-06
154001.00000  155001.00000  3.497829645627e-06
155001.00000  156001.00000  3.488167132794e-06
156001.00000  157001.00000  3.594454773959e-06
157001.00000  158001.00000  3.536479696960e-06
158001.00000  159001.00000  3.256266824797e-06
159001.00000  160001.00000  3.130654157965e-06
160001.00000  161001.00000  3.198291747797e-06
161001.00000  162001.00000  3.217616773464e-06
162001.00000  163001.00000  3.024366516799e-06
163001.00000  164001.00000  2.947066414133e-06
164001.00000  165001.00000  3.207954260630e-06
165001.00000  166001.00000  3.043691542466e-06
166001.00000  167001.00000  2.927741388467e-06
167001.00000  168001.00000  2.840778772968e-06
168001.00000  169001.00000  2.647528516303e-06
169001.00000  170001.00000  2.589553439304e-06
170001.00000  171001.00000  2.773141183135e-06
171001.00000  172001.00000  2.531578362305e-06
172001.00000  173001.00000  2.753816157469e-06
173001.00000  174001.00000  2.405965695473e-06
174001.00000  175001.00000  2.270690515808e-06
175001.00000  176001.00000  2.280353028641e-06
176001.00000  177001.00000  2.116090310476e-06
177001.00000  178001.00000  2.550903387971e-06
178001.00000  179001.00000  2.579890926471e-06
179001.00000  180001.00000  2.357653131307e-06
180001.00000  181001.00000  2.290015541474e-06
181001.00000  182001.00000  2.183727900309e-06
182001.00000  183001.00000  2.038790207810e-06
183001.00000  184001.00000  2.164402874642e-06
184001.00000  185001.00000  2.396303182640e-06
185001.00000  186001.00000  1.913177540978e-06
186001.00000  187001.00000  1.797227386980e-06
187001.00000  188001.00000  1.922840053812e-06
188001.00000  189001.00000  1.903515028145e-06
189001.00000  190001.00000  1.787564874147e-06
190001.00000  191001.00000  1.835877438313e-06
191001.00000  192001.00000  1.623302155982e-06
192001.00000  193001.00000  2.067777746310e-06
193001.00000  194001.00000  1.835877438313e-06
194001.00000  195001.00000  1.980815130811e-06
195001.00000  196001.00000  1.826214925479e-06
196001.00000  197001.00000  1.739252309980e-06
197001.00000  198001.00000  1.565327078982e-06
198001.00000  199001.00000  1.565327078982e-06
