300.00000  350.00000  4.648864871702e-06
350.00000  400.00000  1.037054471380e-05
400.00000  450.00000  9.297729743404e-06
450.00000  500.00000  1.215856966445e-05
500.00000  550.00000  7.974591279920e-05
550.00000  600.00000  1.215856966445e-05
600.00000  650.00000  2.002587944733e-05
650.00000  700.00000  1.287377964471e-05
700.00000  750.00000  2.538995429930e-05
750.00000  800.00000  1.037054471380e-05
800.00000  850.00000  4.684625370715e-05
850.00000  900.00000  1.609222455589e-05
900.00000  950.00000  1.323138463484e-05
950.00000  1000.00000  1.573461956576e-05
1000.00000  1050.00000  1.573461956576e-05
1050.00000  1100.00000  1.358898962498e-05
1100.00000  1150.00000  1.895306447694e-05
1150.00000  1200.00000  2.109869441772e-05
1200.00000  1250.00000  1.430419960524e-05
1250.00000  1300.00000  5.542877347029e-05
1300.00000  1350.00000  1.859545948681e-05
1350.00000  1400.00000  1.430419960524e-05
1400.00000  1450.00000  2.181390439799e-05
1450.00000  1500.00000  2.467474431903e-05
1500.00000  1550.00000  1.966827445720e-05
1550.00000  1600.00000  2.038348443746e-05
1600.00000  1650.00000  1.823785449668e-05
1650.00000  1700.00000  1.895306447694e-05
1700.00000  1750.00000  6.758734313474e-05
1750.00000  1800.00000  2.646276926969e-05
1800.00000  1850.00000  3.611810400322e-05
1850.00000  1900.00000  3.003881917100e-05
1900.00000  1950.00000  2.467474431903e-05
1950.00000  2000.00000  2.646276926969e-05
2000.00000  2050.00000  2.574755928943e-05
2050.00000  2100.00000  3.003881917100e-05
2100.00000  2150.00000  2.610516427956e-05
2150.00000  2200.00000  3.111163414139e-05
2200.00000  2250.00000  3.433007905257e-05
2250.00000  2300.00000  2.610516427956e-05
2300.00000  2350.00000  8.832843256234e-05
2350.00000  2400.00000  2.896600420060e-05
2400.00000  2450.00000  3.647570899335e-05
2450.00000  2500.00000  3.504528903283e-05
2500.00000  2550.00000  2.860839921047e-05
2550.00000  2600.00000  3.468768404270e-05
2600.00000  2650.00000  3.325726408218e-05
2650.00000  2700.00000  3.468768404270e-05
2700.00000  2750.00000  3.325726408218e-05
2750.00000  2800.00000  3.611810400322e-05
2800.00000  2850.00000  3.397247406244e-05
2850.00000  2900.00000  3.182684412165e-05
2900.00000  2950.00000  3.611810400322e-05
2950.00000  3000.00000  5.149511857885e-05
3000.00000  3050.00000  3.075402915126e-05
3050.00000  3100.00000  2.574755928943e-05
3100.00000  3150.00000  3.254205410191e-05
3150.00000  3200.00000  3.289965909204e-05
3200.00000  3250.00000  3.647570899335e-05
3250.00000  3300.00000  4.219738883545e-05
3300.00000  3350.00000  2.753558424008e-05
3350.00000  3400.00000  2.932360919074e-05
3400.00000  3450.00000  3.325726408218e-05
3450.00000  3500.00000  3.683331398349e-05
3500.00000  3550.00000  3.683331398349e-05
3550.00000  3600.00000  3.254205410191e-05
3600.00000  3650.00000  3.969415390453e-05
3650.00000  3700.00000  5.435595849990e-05
3700.00000  3750.00000  3.647570899335e-05
3750.00000  3800.00000  3.039642416113e-05
3800.00000  3850.00000  4.005175889466e-05
3850.00000  3900.00000  4.040936388479e-05
3900.00000  3950.00000  3.111163414139e-05
3950.00000  4000.00000  4.219738883545e-05
4000.00000  4050.00000  3.647570899335e-05
4050.00000  4100.00000  3.754852396375e-05
4100.00000  4150.00000  3.325726408218e-05
4150.00000  4200.00000  3.897894392427e-05
4200.00000  4250.00000  4.076696887493e-05
4250.00000  4300.00000  4.005175889466e-05
4300.00000  4350.00000  4.183978384532e-05
4350.00000  4400.00000  3.611810400322e-05
4400.00000  4450.00000  3.576049901309e-05
4450.00000  4500.00000  4.183978384532e-05
4500.00000  4550.00000  4.005175889466e-05
4550.00000  4600.00000  4.005175889466e-05
4600.00000  4650.00000  3.719091897362e-05
4650.00000  4700.00000  4.112457386506e-05
4700.00000  4750.00000  4.756146368741e-05
4750.00000  4800.00000  4.470062376637e-05
4800.00000  4850.00000  4.362780879597e-05
4850.00000  4900.00000  3.826373394401e-05
4900.00000  4950.00000  3.647570899335e-05
4950.00000  5000.00000  4.684625370715e-05
5000.00000  5050.00000  3.862133893414e-05
5050.00000  5100.00000  3.504528903283e-05
5100.00000  5150.00000  4.541583374663e-05
5150.00000  5200.00000  3.683331398349e-05
5200.00000  5250.00000  4.112457386506e-05
5250.00000  5300.00000  3.826373394401e-05
5300.00000  5350.00000  4.541583374663e-05
5350.00000  5400.00000  4.183978384532e-05
5400.00000  5450.00000  4.863427865781e-05
5450.00000  5500.00000  4.112457386506e-05
5500.00000  5550.00000  4.005175889466e-05
5550.00000  5600.00000  4.827667366767e-05
5600.00000  5650.00000  4.219738883545e-05
5650.00000  5700.00000  4.899188364794e-05
5700.00000  5750.00000  3.576049901309e-05
5750.00000  5800.00000  4.183978384532e-05
5800.00000  5850.00000  4.684625370715e-05
5850.00000  5900.00000  5.077990859859e-05
5900.00000  5950.00000  4.291259881571e-05
5950.00000  6000.00000  4.684625370715e-05
6000.00000  6050.00000  4.112457386506e-05
6050.00000  6100.00000  4.327020380584e-05
6100.00000  6150.00000  5.578637846042e-05
6150.00000  6200.00000  5.077990859859e-05
6200.00000  6250.00000  7.652746788802e-05
6250.00000  6300.00000  1.140759918518e-04
6300.00000  6350.00000  1.104999419505e-04
6350.00000  6400.00000  8.182002174196e-04
6400.00000  6450.00000  4.827667366767e-05
6450.00000  6500.00000  5.042230360846e-05
6500.00000  6550.00000  5.364074851964e-05
6550.00000  6600.00000  4.291259881571e-05
6600.00000  6650.00000  4.899188364794e-05
6650.00000  6700.00000  4.398541378610e-05
6700.00000  6750.00000  4.970709362820e-05
6750.00000  6800.00000  5.006469861833e-05
6800.00000  6850.00000  5.113751358872e-05
6850.00000  6900.00000  5.936242836173e-05
6900.00000  6950.00000  6.079284832226e-05
6950.00000  7000.00000  5.614398345055e-05
7000.00000  7050.00000  4.720385869728e-05
7050.00000  7100.00000  1.201552766840e-04
7100.00000  7150.00000  2.252911437825e-05
7150.00000  7200.00000  2.467474431903e-05
7200.00000  7250.00000  2.074108942759e-05
7250.00000  7300.00000  2.217150938812e-05
7300.00000  7350.00000  2.682037425982e-05
7350.00000  7400.00000  3.182684412165e-05
7400.00000  7450.00000  3.146923913152e-05
7450.00000  7500.00000  5.042230360846e-05
7500.00000  7550.00000  2.395953433877e-05
7550.00000  7600.00000  2.467474431903e-05
7600.00000  7650.00000  2.324432435851e-05
7650.00000  7700.00000  2.252911437825e-05
7700.00000  7750.00000  2.717797924995e-05
7750.00000  7800.00000  2.574755928943e-05
7800.00000  7850.00000  3.003881917100e-05
7850.00000  7900.00000  2.753558424008e-05
7900.00000  7950.00000  2.324432435851e-05
7950.00000  8000.00000  2.646276926969e-05
8000.00000  8050.00000  2.860839921047e-05
8050.00000  8100.00000  3.218444911178e-05
8100.00000  8150.00000  2.360192934864e-05
8150.00000  8200.00000  1.966827445720e-05
8200.00000  8250.00000  2.753558424008e-05
8250.00000  8300.00000  2.717797924995e-05
8300.00000  8350.00000  2.860839921047e-05
8350.00000  8400.00000  2.682037425982e-05
8400.00000  8450.00000  2.538995429930e-05
8450.00000  8500.00000  2.789318923021e-05
8500.00000  8550.00000  2.503234930916e-05
8550.00000  8600.00000  2.431713932890e-05
8600.00000  8650.00000  3.111163414139e-05
8650.00000  8700.00000  2.717797924995e-05
8700.00000  8750.00000  2.825079422034e-05
8750.00000  8800.00000  2.932360919074e-05
8800.00000  8850.00000  3.111163414139e-05
8850.00000  8900.00000  2.825079422034e-05
8900.00000  8950.00000  2.682037425982e-05
8950.00000  9000.00000  2.789318923021e-05
9000.00000  9050.00000  3.182684412165e-05
9050.00000  9100.00000  2.753558424008e-05
9100.00000  9150.00000  2.395953433877e-05
9150.00000  9200.00000  2.360192934864e-05
9200.00000  9250.00000  2.932360919074e-05
9250.00000  9300.00000  2.968121418087e-05
9300.00000  9350.00000  2.825079422034e-05
9350.00000  9400.00000  2.753558424008e-05
9400.00000  9450.00000  2.825079422034e-05
9450.00000  9500.00000  3.146923913152e-05
9500.00000  9550.00000  3.254205410191e-05
9550.00000  9600.00000  2.574755928943e-05
9600.00000  9650.00000  3.146923913152e-05
9650.00000  9700.00000  3.218444911178e-05
9700.00000  9750.00000  2.932360919074e-05
9750.00000  9800.00000  3.504528903283e-05
9800.00000  9850.00000  3.182684412165e-05
9850.00000  9900.00000  3.146923913152e-05
9900.00000  9950.00000  2.538995429930e-05
9950.00000  10000.00000  2.932360919074e-05
