300.00000  350.00000  3.833088342316e-01
350.00000  400.00000  2.874393180144e-01
400.00000  450.00000  2.230927887186e-01
450.00000  500.00000  1.786884697607e-01
500.00000  550.00000  1.458757293422e-01
550.00000  600.00000  1.217175157391e-01
600.00000  650.00000  1.027089544292e-01
650.00000  700.00000  8.822965309646e-02
700.00000  750.00000  7.630357399909e-02
750.00000  800.00000  6.665166661777e-02
800.00000  850.00000  5.896463495756e-02
850.00000  900.00000  5.272722573699e-02
900.00000  950.00000  4.691397330576e-02
950.00000  1000.00000  4.202464814233e-02
1000.00000  1050.00000  3.814566589138e-02
1050.00000  1100.00000  3.474449014252e-02
1100.00000  1150.00000  3.156547461355e-02
1150.00000  1200.00000  2.913395441113e-02
1200.00000  1250.00000  2.671215596874e-02
1250.00000  1300.00000  2.478940787442e-02
1300.00000  1350.00000  2.279464674286e-02
1350.00000  1400.00000  2.113474623447e-02
1400.00000  1450.00000  1.961707147463e-02
1450.00000  1500.00000  1.844757974985e-02
1500.00000  1550.00000  1.715170514471e-02
1550.00000  1600.00000  1.607619043353e-02
1600.00000  1650.00000  1.518070831544e-02
1650.00000  1700.00000  1.427514437215e-02
1700.00000  1750.00000  1.346247724689e-02
1750.00000  1800.00000  1.270273970401e-02
1800.00000  1850.00000  1.180977804223e-02
1850.00000  1900.00000  1.140722516405e-02
1900.00000  1950.00000  1.080627636828e-02
1950.00000  2000.00000  1.029786432537e-02
2000.00000  2050.00000  9.682872987333e-03
2050.00000  2100.00000  9.288961673628e-03
2100.00000  2150.00000  8.926015965937e-03
2150.00000  2200.00000  8.360353558415e-03
2200.00000  2250.00000  7.972203287689e-03
2250.00000  2300.00000  7.623300122260e-03
2300.00000  2350.00000  7.572530931005e-03
2350.00000  2400.00000  7.115968274902e-03
2400.00000  2450.00000  6.846639515623e-03
2450.00000  2500.00000  6.509258436152e-03
2500.00000  2550.00000  6.327065451934e-03
2550.00000  2600.00000  6.064937996379e-03
2600.00000  2650.00000  5.893186902561e-03
2650.00000  2700.00000  5.589651950593e-03
2700.00000  2750.00000  5.373252773686e-03
2750.00000  2800.00000  5.286116998625e-03
2800.00000  2850.00000  4.957377483623e-03
2850.00000  2900.00000  4.912369335348e-03
2900.00000  2950.00000  4.770143586799e-03
2950.00000  3000.00000  4.582549624788e-03
3000.00000  3050.00000  4.334824776681e-03
3050.00000  3100.00000  4.240847763082e-03
3100.00000  3150.00000  4.097181753788e-03
3150.00000  3200.00000  3.979800503086e-03
3200.00000  3250.00000  3.936592680742e-03
3250.00000  3300.00000  3.780684455117e-03
3300.00000  3350.00000  3.711912004552e-03
3350.00000  3400.00000  3.559604430789e-03
3400.00000  3450.00000  3.489391719480e-03
3450.00000  3500.00000  3.415218291122e-03
3500.00000  3550.00000  3.336724080530e-03
3550.00000  3600.00000  3.213581786849e-03
3600.00000  3650.00000  3.123565490299e-03
3650.00000  3700.00000  2.978459220259e-03
3700.00000  3750.00000  2.984220263239e-03
3750.00000  3800.00000  2.906446183019e-03
3800.00000  3850.00000  2.857117252510e-03
3850.00000  3900.00000  2.795186040483e-03
3900.00000  3950.00000  2.673484007547e-03
3950.00000  4000.00000  2.628835924458e-03
4000.00000  4050.00000  2.637837554113e-03
4050.00000  4100.00000  2.534498845673e-03
4100.00000  4150.00000  2.446282875054e-03
4150.00000  4200.00000  2.456724765453e-03
4200.00000  4250.00000  2.455284504709e-03
4250.00000  4300.00000  2.419998116461e-03
4300.00000  4350.00000  2.297215887966e-03
4350.00000  4400.00000  2.227003176657e-03
4400.00000  4450.00000  2.224482720353e-03
4450.00000  4500.00000  2.153909943858e-03
4500.00000  4550.00000  2.104941078534e-03
4550.00000  4600.00000  2.079016385128e-03
4600.00000  4650.00000  2.070374820659e-03
4650.00000  4700.00000  2.041209540577e-03
4700.00000  4750.00000  1.911586073544e-03
4750.00000  4800.00000  1.940391288440e-03
4800.00000  4850.00000  1.962355264799e-03
4850.00000  4900.00000  1.913386399475e-03
4900.00000  4950.00000  1.882420793462e-03
4950.00000  5000.00000  1.871618837876e-03
5000.00000  5050.00000  1.770080455367e-03
5050.00000  5100.00000  1.801046061380e-03
5100.00000  5150.00000  1.755317782733e-03
5150.00000  5200.00000  1.803566517684e-03
5200.00000  5250.00000  1.708869373713e-03
5250.00000  5300.00000  1.697707352940e-03
5300.00000  5350.00000  1.655219660969e-03
5350.00000  5400.00000  1.648018357245e-03
5400.00000  5450.00000  1.559442321439e-03
5450.00000  5500.00000  1.579966037053e-03
5500.00000  5550.00000  1.562682908115e-03
5550.00000  5600.00000  1.533877693219e-03
5600.00000  5650.00000  1.550080626598e-03
5650.00000  5700.00000  1.540718931757e-03
5700.00000  5750.00000  1.517314694653e-03
5750.00000  5800.00000  1.452502961137e-03
5800.00000  5850.00000  1.478787719730e-03
5850.00000  5900.00000  1.432699375896e-03
5900.00000  5950.00000  1.413255855841e-03
5950.00000  6000.00000  1.383370445386e-03
6000.00000  6050.00000  1.421537355124e-03
6050.00000  6100.00000  1.369687968311e-03
6100.00000  6150.00000  1.352764904559e-03
6150.00000  6200.00000  1.340882753415e-03
6200.00000  6250.00000  1.312797668891e-03
6250.00000  6300.00000  1.308476886657e-03
6300.00000  6350.00000  1.329000602270e-03
6350.00000  6400.00000  1.596889100804e-03
6400.00000  6450.00000  1.274990824340e-03
6450.00000  6500.00000  1.276071019898e-03
6500.00000  6550.00000  1.219180720479e-03
6550.00000  6600.00000  1.265269064312e-03
6600.00000  6650.00000  1.226742089389e-03
6650.00000  6700.00000  1.186414788534e-03
6700.00000  6750.00000  1.201177461168e-03
6750.00000  6800.00000  1.129884554301e-03
6800.00000  6850.00000  1.161210225500e-03
6850.00000  6900.00000  1.163370616617e-03
6900.00000  6950.00000  1.137085858025e-03
6950.00000  7000.00000  1.129164423928e-03
7000.00000  7050.00000  1.063632560039e-03
7050.00000  7100.00000  1.117282272784e-03
7100.00000  7150.00000  9.466113745240e-04
7150.00000  7200.00000  9.671350901374e-04
7200.00000  7250.00000  9.332889626345e-04
7250.00000  7300.00000  9.145655729520e-04
7300.00000  7350.00000  8.857603580559e-04
7350.00000  7400.00000  9.080843996004e-04
7400.00000  7450.00000  8.753184676560e-04
7450.00000  7500.00000  8.562350127874e-04
7500.00000  7550.00000  8.598356646494e-04
7550.00000  7600.00000  8.731580765388e-04
7600.00000  7650.00000  8.691973594906e-04
7650.00000  7700.00000  8.501139046219e-04
7700.00000  7750.00000  8.234690808430e-04
7750.00000  7800.00000  8.277898630774e-04
7800.00000  7850.00000  8.209486245396e-04
7850.00000  7900.00000  8.061859519053e-04
7900.00000  7950.00000  8.040255607881e-04
7950.00000  8000.00000  7.910632140849e-04
8000.00000  8050.00000  7.658586510508e-04
8050.00000  8100.00000  7.802612584988e-04
8100.00000  8150.00000  8.000648437399e-04
8150.00000  8200.00000  7.788209977540e-04
8200.00000  8250.00000  7.708995636576e-04
8250.00000  8300.00000  7.737800851472e-04
8300.00000  8350.00000  7.521761739751e-04
8350.00000  8400.00000  7.532563695337e-04
8400.00000  8450.00000  7.028472434655e-04
8450.00000  8500.00000  7.183300464722e-04
8500.00000  8550.00000  7.298521324306e-04
8550.00000  8600.00000  7.111287427481e-04
8600.00000  8650.00000  7.258914153824e-04
8650.00000  8700.00000  7.208505027756e-04
8700.00000  8750.00000  6.834037234106e-04
8750.00000  8800.00000  6.862842449002e-04
8800.00000  8850.00000  6.672007900315e-04
8850.00000  8900.00000  6.693611811487e-04
8900.00000  8950.00000  6.668407248453e-04
8950.00000  9000.00000  6.268734891770e-04
9000.00000  9050.00000  6.610796818661e-04
9050.00000  9100.00000  6.625199426109e-04
9100.00000  9150.00000  6.207523810115e-04
9150.00000  9200.00000  6.362351840182e-04
9200.00000  9250.00000  6.769225500590e-04
9250.00000  9300.00000  6.203923158253e-04
9300.00000  9350.00000  6.175117943357e-04
9350.00000  9400.00000  6.369553143906e-04
9400.00000  9450.00000  6.146312728461e-04
9450.00000  9500.00000  6.059897083773e-04
9500.00000  9550.00000  5.948276876050e-04
9550.00000  9600.00000  6.333546625286e-04
9600.00000  9650.00000  5.879864490672e-04
9650.00000  9700.00000  5.764643631087e-04
9700.00000  9750.00000  5.771844934811e-04
9750.00000  9800.00000  5.782646890397e-04
9800.00000  9850.00000  5.418981052334e-04
9850.00000  9900.00000  5.595412993573e-04
9900.00000  9950.00000  5.692630593847e-04
9950.00000  10000.00000  5.573809082400e-04
