10001.00000  11001.00000  1.583137955257e-05
11001.00000  12001.00000  1.899187407067e-05
12001.00000  13001.00000  2.299067048839e-05
13001.00000  14001.00000  2.956218652908e-05
14001.00000  15001.00000  3.477507535314e-05
15001.00000  16001.00000  4.078772346075e-05
16001.00000  17001.00000  4.736887515546e-05
17001.00000  18001.00000  4.908402157077e-05
18001.00000  19001.00000  5.412346862250e-05
19001.00000  20001.00000  5.376694942381e-05
20001.00000  21001.00000  5.529901841277e-05
21001.00000  22001.00000  5.405601904437e-05
22001.00000  23001.00000  5.301536841036e-05
23001.00000  24001.00000  5.301536841036e-05
24001.00000  25001.00000  4.940199815339e-05
25001.00000  26001.00000  4.898766503059e-05
26001.00000  27001.00000  4.375550489848e-05
27001.00000  28001.00000  4.162602536037e-05
28001.00000  29001.00000  3.891840658114e-05
29001.00000  30001.00000  3.644204349836e-05
30001.00000  31001.00000  3.441855615446e-05
31001.00000  32001.00000  3.281903758737e-05
32001.00000  33001.00000  3.160494518102e-05
33001.00000  34001.00000  2.877206289955e-05
34001.00000  35001.00000  2.829991585264e-05
35001.00000  36001.00000  2.601626585023e-05
36001.00000  37001.00000  2.351099580540e-05
37001.00000  38001.00000  2.337609664913e-05
38001.00000  39001.00000  2.167058588784e-05
39001.00000  40001.00000  2.021560213103e-05
40001.00000  41001.00000  1.867389748806e-05
41001.00000  42001.00000  1.851009136974e-05
42001.00000  43001.00000  1.639024748565e-05
43001.00000  44001.00000  1.542668208379e-05
44001.00000  45001.00000  1.511834115519e-05
45001.00000  46001.00000  1.440530275781e-05
46001.00000  47001.00000  1.340319473988e-05
47001.00000  48001.00000  1.249744326213e-05
48001.00000  49001.00000  1.187112575092e-05
49001.00000  50001.00000  1.123517258569e-05
50001.00000  51001.00000  1.049322722626e-05
51001.00000  52001.00000  9.838002752995e-06
52001.00000  53001.00000  9.356220052065e-06
53001.00000  54001.00000  1.035832807000e-05
54001.00000  55001.00000  8.787716464967e-06
55001.00000  56001.00000  8.161398953758e-06
56001.00000  57001.00000  7.968685873386e-06
57001.00000  58001.00000  7.602531020679e-06
58001.00000  59001.00000  7.207469205916e-06
59001.00000  60001.00000  6.860585661246e-06
60001.00000  61001.00000  6.475159500502e-06
61001.00000  62001.00000  6.552244732651e-06
62001.00000  63001.00000  5.983741145553e-06
63001.00000  64001.00000  5.405601904437e-06
64001.00000  65001.00000  5.569408022753e-06
65001.00000  66001.00000  5.434508866493e-06
66001.00000  67001.00000  5.280338402195e-06
67001.00000  68001.00000  4.779284393228e-06
68001.00000  69001.00000  4.355315616409e-06
69001.00000  70001.00000  4.519121734726e-06
70001.00000  71001.00000  4.297501692298e-06
71001.00000  72001.00000  4.181873844074e-06
72001.00000  73001.00000  3.883168569498e-06
73001.00000  74001.00000  3.613370256977e-06
74001.00000  75001.00000  3.584463294921e-06
75001.00000  76001.00000  3.555556332865e-06
76001.00000  77001.00000  3.545920678846e-06
77001.00000  78001.00000  3.121951902028e-06
78001.00000  79001.00000  3.256851058288e-06
79001.00000  80001.00000  2.938874475674e-06
80001.00000  81001.00000  3.102680593991e-06
81001.00000  82001.00000  3.160494518102e-06
82001.00000  83001.00000  2.823246627451e-06
83001.00000  84001.00000  2.360735234558e-06
84001.00000  85001.00000  2.370370888577e-06
85001.00000  86001.00000  2.447456120726e-06
86001.00000  87001.00000  2.476363082781e-06
87001.00000  88001.00000  2.119843884093e-06
88001.00000  89001.00000  2.090936922037e-06
89001.00000  90001.00000  1.888588187647e-06
90001.00000  91001.00000  2.100572576056e-06
91001.00000  92001.00000  1.927130803721e-06
92001.00000  93001.00000  1.840409917553e-06
93001.00000  94001.00000  1.753689031386e-06
94001.00000  95001.00000  1.570611605033e-06
95001.00000  96001.00000  1.821138609516e-06
96001.00000  97001.00000  1.580247259051e-06
97001.00000  98001.00000  1.618789875126e-06
98001.00000  99001.00000  1.609154221107e-06
99001.00000  100001.00000  1.493526372884e-06
100001.00000  101001.00000  1.589882913070e-06
101001.00000  102001.00000  1.348991562605e-06
102001.00000  103001.00000  1.445348102791e-06
103001.00000  104001.00000  1.300813292512e-06
104001.00000  105001.00000  1.281541984474e-06
105001.00000  106001.00000  1.348991562605e-06
106001.00000  107001.00000  1.271906330456e-06
107001.00000  108001.00000  1.108100212140e-06
108001.00000  109001.00000  9.539297478419e-07
109001.00000  110001.00000  1.127371520177e-06
110001.00000  111001.00000  1.291177638493e-06
111001.00000  112001.00000  1.069557596065e-06
112001.00000  113001.00000  8.286662456000e-07
113001.00000  114001.00000  1.021379325972e-06
114001.00000  115001.00000  9.828367098977e-07
115001.00000  116001.00000  9.635654018605e-07
116001.00000  117001.00000  9.442940938233e-07
117001.00000  118001.00000  7.612166674698e-07
118001.00000  119001.00000  9.153871317674e-07
119001.00000  120001.00000  7.612166674698e-07
120001.00000  121001.00000  9.057514777488e-07
121001.00000  122001.00000  7.612166674698e-07
122001.00000  123001.00000  8.383018996186e-07
123001.00000  124001.00000  6.552244732651e-07
124001.00000  125001.00000  6.937670893395e-07
125001.00000  126001.00000  6.744957813023e-07
126001.00000  127001.00000  7.804879755070e-07
127001.00000  128001.00000  7.612166674698e-07
128001.00000  129001.00000  5.588679330791e-07
129001.00000  130001.00000  5.106896629860e-07
130001.00000  131001.00000  5.974105491535e-07
131001.00000  132001.00000  5.492322790605e-07
132001.00000  133001.00000  4.817827009302e-07
133001.00000  134001.00000  4.914183549488e-07
134001.00000  135001.00000  5.877748951349e-07
135001.00000  136001.00000  4.239687768186e-07
136001.00000  137001.00000  5.588679330791e-07
137001.00000  138001.00000  5.203253170046e-07
138001.00000  139001.00000  4.046974687814e-07
139001.00000  140001.00000  3.950618147628e-07
140001.00000  141001.00000  3.950618147628e-07
141001.00000  142001.00000  4.817827009302e-07
142001.00000  143001.00000  5.203253170046e-07
143001.00000  144001.00000  4.721470469116e-07
144001.00000  145001.00000  4.143331228000e-07
145001.00000  146001.00000  2.697983125209e-07
146001.00000  147001.00000  3.565191986884e-07
147001.00000  148001.00000  3.661548527070e-07
148001.00000  149001.00000  3.468835446698e-07
149001.00000  150001.00000  2.697983125209e-07
150001.00000  151001.00000  2.023487343907e-07
151001.00000  152001.00000  2.987052745767e-07
152001.00000  153001.00000  2.794339665395e-07
153001.00000  154001.00000  2.216200424279e-07
154001.00000  155001.00000  3.565191986884e-07
155001.00000  156001.00000  2.216200424279e-07
156001.00000  157001.00000  1.927130803721e-07
157001.00000  158001.00000  2.312556964465e-07
158001.00000  159001.00000  1.734417723349e-07
159001.00000  160001.00000  2.023487343907e-07
160001.00000  161001.00000  2.697983125209e-07
161001.00000  162001.00000  2.023487343907e-07
162001.00000  163001.00000  1.734417723349e-07
163001.00000  164001.00000  1.734417723349e-07
164001.00000  165001.00000  9.635654018605e-08
165001.00000  166001.00000  9.635654018605e-08
166001.00000  167001.00000  2.312556964465e-07
167001.00000  168001.00000  1.830774263535e-07
168001.00000  169001.00000  1.156278482233e-07
169001.00000  170001.00000  1.252635022419e-07
170001.00000  171001.00000  1.348991562605e-07
171001.00000  172001.00000  1.830774263535e-07
172001.00000  173001.00000  9.635654018605e-08
173001.00000  174001.00000  8.672088616744e-08
174001.00000  175001.00000  1.252635022419e-07
175001.00000  176001.00000  1.252635022419e-07
176001.00000  177001.00000  4.817827009302e-08
177001.00000  178001.00000  4.817827009302e-08
178001.00000  179001.00000  8.672088616744e-08
179001.00000  180001.00000  6.744957813023e-08
180001.00000  181001.00000  7.708523214884e-08
181001.00000  182001.00000  8.672088616744e-08
182001.00000  183001.00000  7.708523214884e-08
183001.00000  184001.00000  6.744957813023e-08
184001.00000  185001.00000  5.781392411163e-08
185001.00000  186001.00000  0.000000000000e+00
186001.00000  187001.00000  2.890696205581e-08
187001.00000  188001.00000  2.890696205581e-08
188001.00000  189001.00000  1.927130803721e-08
189001.00000  190001.00000  1.927130803721e-08
190001.00000  191001.00000  7.708523214884e-08
191001.00000  192001.00000  1.927130803721e-08
192001.00000  193001.00000  1.927130803721e-08
193001.00000  194001.00000  3.854261607442e-08
194001.00000  195001.00000  1.927130803721e-08
195001.00000  196001.00000  3.854261607442e-08
196001.00000  197001.00000  0.000000000000e+00
197001.00000  198001.00000  0.000000000000e+00
198001.00000  199001.00000  1.927130803721e-08
