10001.00000  11001.00000  1.987301033151e-05
11001.00000  12001.00000  2.395277978826e-05
12001.00000  13001.00000  2.897542929723e-05
13001.00000  14001.00000  3.122383557561e-05
14001.00000  15001.00000  3.506788501930e-05
15001.00000  16001.00000  3.782399594119e-05
16001.00000  17001.00000  4.099714996310e-05
17001.00000  18001.00000  4.063450378916e-05
18001.00000  19001.00000  4.096088534570e-05
19001.00000  20001.00000  3.963722681085e-05
20001.00000  21001.00000  3.755201131074e-05
21001.00000  22001.00000  3.617395584979e-05
22001.00000  23001.00000  3.316399260615e-05
23001.00000  24001.00000  3.158648174954e-05
24001.00000  25001.00000  2.930181085377e-05
25001.00000  26001.00000  2.739791844062e-05
26001.00000  27001.00000  2.533083524920e-05
27001.00000  28001.00000  2.449674904916e-05
28001.00000  29001.00000  2.177690274466e-05
29001.00000  30001.00000  2.041697959241e-05
30001.00000  31001.00000  1.894826258799e-05
31001.00000  32001.00000  1.747954558356e-05
32001.00000  33001.00000  1.575697625738e-05
33001.00000  34001.00000  1.472343466167e-05
34001.00000  35001.00000  1.372615768335e-05
35001.00000  36001.00000  1.338164381812e-05
36001.00000  37001.00000  1.136895755279e-05
37001.00000  38001.00000  1.057113597014e-05
38001.00000  39001.00000  1.024475441360e-05
39001.00000  40001.00000  9.356271287465e-06
40001.00000  41001.00000  9.229345126588e-06
41001.00000  42001.00000  8.630978939599e-06
42001.00000  43001.00000  7.724363504768e-06
43001.00000  44001.00000  7.416114256925e-06
44001.00000  45001.00000  7.035335774295e-06
45001.00000  46001.00000  6.636424982969e-06
46001.00000  47001.00000  5.874868017711e-06
47001.00000  48001.00000  6.201249574250e-06
48001.00000  49001.00000  4.913855656789e-06
49001.00000  50001.00000  5.058914126362e-06
50001.00000  51001.00000  4.732532569822e-06
51001.00000  52001.00000  4.950120274182e-06
52001.00000  53001.00000  4.134166382833e-06
53001.00000  54001.00000  3.916578678474e-06
54001.00000  55001.00000  3.100624787125e-06
55001.00000  56001.00000  3.970975604564e-06
56001.00000  57001.00000  3.281947874091e-06
57001.00000  58001.00000  3.245683256698e-06
58001.00000  59001.00000  3.100624787125e-06
59001.00000  60001.00000  2.919301700159e-06
60001.00000  61001.00000  2.737978613192e-06
61001.00000  62001.00000  2.629184761012e-06
62001.00000  63001.00000  2.665449378406e-06
63001.00000  64001.00000  2.665449378406e-06
64001.00000  65001.00000  2.357200130563e-06
65001.00000  66001.00000  1.940157030540e-06
66001.00000  67001.00000  1.903892413147e-06
67001.00000  68001.00000  1.849495487057e-06
68001.00000  69001.00000  1.958289339237e-06
69001.00000  70001.00000  1.795098560967e-06
70001.00000  71001.00000  1.650040091394e-06
71001.00000  72001.00000  1.523113930518e-06
72001.00000  73001.00000  1.523113930518e-06
73001.00000  74001.00000  1.287393917461e-06
74001.00000  75001.00000  1.341790843551e-06
75001.00000  76001.00000  1.341790843551e-06
76001.00000  77001.00000  1.414320078338e-06
77001.00000  78001.00000  1.577510856607e-06
78001.00000  79001.00000  1.069806213102e-06
79001.00000  80001.00000  9.791446696184e-07
80001.00000  81001.00000  1.160467756585e-06
81001.00000  82001.00000  9.610123609218e-07
82001.00000  83001.00000  9.791446696184e-07
83001.00000  84001.00000  9.247477435285e-07
84001.00000  85001.00000  9.066154348319e-07
85001.00000  86001.00000  9.066154348319e-07
86001.00000  87001.00000  6.346308043823e-07
87001.00000  88001.00000  9.066154348319e-07
88001.00000  89001.00000  7.434246565621e-07
89001.00000  90001.00000  6.346308043823e-07
90001.00000  91001.00000  7.071600391689e-07
91001.00000  92001.00000  5.439692608991e-07
92001.00000  93001.00000  7.615569652588e-07
93001.00000  94001.00000  7.071600391689e-07
94001.00000  95001.00000  5.983661869890e-07
95001.00000  96001.00000  6.527631130790e-07
96001.00000  97001.00000  4.895723348092e-07
97001.00000  98001.00000  6.708954217756e-07
98001.00000  99001.00000  4.895723348092e-07
99001.00000  100001.00000  5.439692608991e-07
100001.00000  101001.00000  5.258369522025e-07
101001.00000  102001.00000  5.258369522025e-07
102001.00000  103001.00000  4.714400261126e-07
103001.00000  104001.00000  4.351754087193e-07
104001.00000  105001.00000  4.895723348092e-07
105001.00000  106001.00000  4.714400261126e-07
106001.00000  107001.00000  2.901169391462e-07
107001.00000  108001.00000  4.533077174159e-07
108001.00000  109001.00000  3.263815565395e-07
109001.00000  110001.00000  3.626461739328e-07
110001.00000  111001.00000  5.077046435059e-07
111001.00000  112001.00000  2.901169391462e-07
112001.00000  113001.00000  3.082492478428e-07
113001.00000  114001.00000  4.895723348092e-07
114001.00000  115001.00000  1.994553956630e-07
115001.00000  116001.00000  3.263815565395e-07
116001.00000  117001.00000  2.719846304496e-07
117001.00000  118001.00000  3.445138652361e-07
118001.00000  119001.00000  3.626461739328e-07
119001.00000  120001.00000  3.263815565395e-07
120001.00000  121001.00000  3.626461739328e-07
121001.00000  122001.00000  2.357200130563e-07
122001.00000  123001.00000  1.631907782697e-07
123001.00000  124001.00000  2.538523217529e-07
124001.00000  125001.00000  2.357200130563e-07
125001.00000  126001.00000  2.175877043597e-07
126001.00000  127001.00000  1.994553956630e-07
127001.00000  128001.00000  1.994553956630e-07
128001.00000  129001.00000  2.357200130563e-07
129001.00000  130001.00000  1.994553956630e-07
130001.00000  131001.00000  1.813230869664e-07
131001.00000  132001.00000  1.087938521798e-07
132001.00000  133001.00000  3.263815565395e-07
133001.00000  134001.00000  1.269261608765e-07
134001.00000  135001.00000  2.357200130563e-07
135001.00000  136001.00000  1.631907782697e-07
136001.00000  137001.00000  2.357200130563e-07
137001.00000  138001.00000  1.994553956630e-07
138001.00000  139001.00000  1.813230869664e-07
139001.00000  140001.00000  1.994553956630e-07
140001.00000  141001.00000  1.087938521798e-07
141001.00000  142001.00000  1.269261608765e-07
142001.00000  143001.00000  1.087938521798e-07
143001.00000  144001.00000  1.269261608765e-07
144001.00000  145001.00000  5.439692608991e-08
145001.00000  146001.00000  9.066154348319e-08
146001.00000  147001.00000  7.252923478655e-08
147001.00000  148001.00000  1.813230869664e-07
148001.00000  149001.00000  7.252923478655e-08
149001.00000  150001.00000  1.087938521798e-07
150001.00000  151001.00000  1.269261608765e-07
151001.00000  152001.00000  7.252923478655e-08
152001.00000  153001.00000  1.269261608765e-07
153001.00000  154001.00000  1.087938521798e-07
154001.00000  155001.00000  1.269261608765e-07
155001.00000  156001.00000  1.087938521798e-07
156001.00000  157001.00000  9.066154348319e-08
157001.00000  158001.00000  7.252923478655e-08
158001.00000  159001.00000  9.066154348319e-08
159001.00000  160001.00000  9.066154348319e-08
160001.00000  161001.00000  5.439692608991e-08
161001.00000  162001.00000  1.269261608765e-07
162001.00000  163001.00000  5.439692608991e-08
163001.00000  164001.00000  1.087938521798e-07
164001.00000  165001.00000  1.813230869664e-08
165001.00000  166001.00000  5.439692608991e-08
166001.00000  167001.00000  9.066154348319e-08
167001.00000  168001.00000  1.269261608765e-07
168001.00000  169001.00000  9.066154348319e-08
169001.00000  170001.00000  1.813230869664e-08
170001.00000  171001.00000  3.626461739328e-08
171001.00000  172001.00000  1.813230869664e-08
172001.00000  173001.00000  5.439692608991e-08
173001.00000  174001.00000  5.439692608991e-08
174001.00000  175001.00000  5.439692608991e-08
175001.00000  176001.00000  3.626461739328e-08
176001.00000  177001.00000  3.626461739328e-08
177001.00000  178001.00000  0.000000000000e+00
178001.00000  179001.00000  3.626461739328e-08
179001.00000  180001.00000  1.813230869664e-08
180001.00000  181001.00000  3.626461739328e-08
181001.00000  182001.00000  1.813230869664e-08
182001.00000  183001.00000  3.626461739328e-08
183001.00000  184001.00000  1.813230869664e-08
184001.00000  185001.00000  1.813230869664e-08
185001.00000  186001.00000  0.000000000000e+00
186001.00000  187001.00000  7.252923478655e-08
187001.00000  188001.00000  5.439692608991e-08
188001.00000  189001.00000  0.000000000000e+00
189001.00000  190001.00000  0.000000000000e+00
190001.00000  191001.00000  0.000000000000e+00
191001.00000  192001.00000  1.813230869664e-08
192001.00000  193001.00000  1.813230869664e-08
193001.00000  194001.00000  1.813230869664e-08
194001.00000  195001.00000  1.813230869664e-08
195001.00000  196001.00000  0.000000000000e+00
196001.00000  197001.00000  3.626461739328e-08
197001.00000  198001.00000  1.813230869664e-08
198001.00000  199001.00000  0.000000000000e+00
