300.00000  350.00000  5.038952954726e-06
350.00000  400.00000  1.310127768229e-05
400.00000  450.00000  7.659208491184e-06
450.00000  500.00000  7.457650372995e-06
500.00000  550.00000  8.364661904846e-05
550.00000  600.00000  6.449859782050e-06
600.00000  650.00000  2.459009041907e-05
650.00000  700.00000  9.674789673075e-06
700.00000  750.00000  1.551997510056e-05
750.00000  800.00000  8.263882845751e-06
800.00000  850.00000  5.240511072915e-05
850.00000  900.00000  1.027946402764e-05
900.00000  950.00000  1.108569650040e-05
950.00000  1000.00000  1.007790590945e-05
1000.00000  1050.00000  8.062324727562e-06
1050.00000  1100.00000  1.108569650040e-05
1100.00000  1150.00000  1.108569650040e-05
1150.00000  1200.00000  1.088413838221e-05
1200.00000  1250.00000  7.659208491184e-06
1250.00000  1300.00000  3.970694928324e-05
1300.00000  1350.00000  1.310127768229e-05
1350.00000  1400.00000  1.491530074599e-05
1400.00000  1450.00000  1.410906827323e-05
1450.00000  1500.00000  1.693088192788e-05
1500.00000  1550.00000  1.269816144591e-05
1550.00000  1600.00000  1.390751015504e-05
1600.00000  1650.00000  1.874490499158e-05
1650.00000  1700.00000  1.672932380969e-05
1700.00000  1750.00000  5.260666884734e-05
1750.00000  1800.00000  1.632620757331e-05
1800.00000  1850.00000  1.773711440064e-05
1850.00000  1900.00000  1.793867251883e-05
1900.00000  1950.00000  1.814023063702e-05
1950.00000  2000.00000  1.834178875520e-05
2000.00000  2050.00000  1.814023063702e-05
2050.00000  2100.00000  1.955113746434e-05
2100.00000  2150.00000  1.773711440064e-05
2150.00000  2200.00000  1.773711440064e-05
2200.00000  2250.00000  1.793867251883e-05
2250.00000  2300.00000  1.995425370072e-05
2300.00000  2350.00000  5.704094744750e-05
2350.00000  2400.00000  2.257450923717e-05
2400.00000  2450.00000  2.620255536458e-05
2450.00000  2500.00000  2.358229982812e-05
2500.00000  2550.00000  2.418697418269e-05
2550.00000  2600.00000  2.378385794631e-05
2600.00000  2650.00000  2.196983488261e-05
2650.00000  2700.00000  2.559788101001e-05
2700.00000  2750.00000  1.995425370072e-05
2750.00000  2800.00000  2.035736993709e-05
2800.00000  2850.00000  2.217139300080e-05
2850.00000  2900.00000  1.955113746434e-05
2900.00000  2950.00000  2.539632289182e-05
2950.00000  3000.00000  3.345864761938e-05
3000.00000  3050.00000  1.995425370072e-05
3050.00000  3100.00000  2.620255536458e-05
3100.00000  3150.00000  2.217139300080e-05
3150.00000  3200.00000  2.801657842828e-05
3200.00000  3250.00000  2.378385794631e-05
3250.00000  3300.00000  1.975269558253e-05
3300.00000  3350.00000  1.773711440064e-05
3350.00000  3400.00000  2.277606735536e-05
3400.00000  3450.00000  1.773711440064e-05
3450.00000  3500.00000  1.874490499158e-05
3500.00000  3550.00000  2.076048617347e-05
3550.00000  3600.00000  1.934957934615e-05
3600.00000  3650.00000  1.975269558253e-05
3650.00000  3700.00000  3.648201939222e-05
3700.00000  3750.00000  2.620255536458e-05
3750.00000  3800.00000  2.076048617347e-05
3800.00000  3850.00000  2.015581181891e-05
3850.00000  3900.00000  1.995425370072e-05
3900.00000  3950.00000  2.055892805528e-05
3950.00000  4000.00000  2.035736993709e-05
4000.00000  4050.00000  2.418697418269e-05
4050.00000  4100.00000  1.914802122796e-05
4100.00000  4150.00000  1.733399816426e-05
4150.00000  4200.00000  1.914802122796e-05
4200.00000  4250.00000  2.156671864623e-05
4250.00000  4300.00000  2.176827676442e-05
4300.00000  4350.00000  2.237295111899e-05
4350.00000  4400.00000  2.479164853725e-05
4400.00000  4450.00000  1.733399816426e-05
4450.00000  4500.00000  1.975269558253e-05
4500.00000  4550.00000  1.894646310977e-05
4550.00000  4600.00000  2.076048617347e-05
4600.00000  4650.00000  1.874490499158e-05
4650.00000  4700.00000  1.874490499158e-05
4700.00000  4750.00000  1.854334687339e-05
4750.00000  4800.00000  1.995425370072e-05
4800.00000  4850.00000  1.854334687339e-05
4850.00000  4900.00000  2.035736993709e-05
4900.00000  4950.00000  2.096204429166e-05
4950.00000  5000.00000  1.632620757331e-05
5000.00000  5050.00000  2.136516052804e-05
5050.00000  5100.00000  1.592309133694e-05
5100.00000  5150.00000  1.874490499158e-05
5150.00000  5200.00000  1.652776569150e-05
5200.00000  5250.00000  1.955113746434e-05
5250.00000  5300.00000  2.015581181891e-05
5300.00000  5350.00000  2.096204429166e-05
5350.00000  5400.00000  1.733399816426e-05
5400.00000  5450.00000  2.317918359174e-05
5450.00000  5500.00000  1.632620757331e-05
5500.00000  5550.00000  1.753555628245e-05
5550.00000  5600.00000  1.834178875520e-05
5600.00000  5650.00000  1.713244004607e-05
5650.00000  5700.00000  1.733399816426e-05
5700.00000  5750.00000  1.834178875520e-05
5750.00000  5800.00000  1.814023063702e-05
5800.00000  5850.00000  1.995425370072e-05
5850.00000  5900.00000  1.854334687339e-05
5900.00000  5950.00000  1.572153321875e-05
5950.00000  6000.00000  1.733399816426e-05
6000.00000  6050.00000  1.471374262780e-05
6050.00000  6100.00000  1.975269558253e-05
6100.00000  6150.00000  1.713244004607e-05
6150.00000  6200.00000  1.693088192788e-05
6200.00000  6250.00000  2.176827676442e-05
6250.00000  6300.00000  2.721034595552e-05
6300.00000  6350.00000  2.317918359174e-05
6350.00000  6400.00000  2.590021818729e-04
6400.00000  6450.00000  1.854334687339e-05
6450.00000  6500.00000  1.834178875520e-05
6500.00000  6550.00000  1.431062639142e-05
6550.00000  6600.00000  1.894646310977e-05
6600.00000  6650.00000  1.612464945512e-05
6650.00000  6700.00000  1.814023063702e-05
6700.00000  6750.00000  1.592309133694e-05
6750.00000  6800.00000  1.793867251883e-05
6800.00000  6850.00000  1.592309133694e-05
6850.00000  6900.00000  1.531841698237e-05
6900.00000  6950.00000  1.431062639142e-05
6950.00000  7000.00000  1.592309133694e-05
7000.00000  7050.00000  1.390751015504e-05
7050.00000  7100.00000  4.212564670151e-05
7100.00000  7150.00000  1.370595203686e-05
7150.00000  7200.00000  1.370595203686e-05
7200.00000  7250.00000  1.370595203686e-05
7250.00000  7300.00000  1.007790590945e-05
7300.00000  7350.00000  1.289971956410e-05
7350.00000  7400.00000  1.330283580048e-05
7400.00000  7450.00000  1.108569650040e-05
7450.00000  7500.00000  1.955113746434e-05
7500.00000  7550.00000  1.390751015504e-05
7550.00000  7600.00000  1.269816144591e-05
7600.00000  7650.00000  1.088413838221e-05
7650.00000  7700.00000  1.128725461859e-05
7700.00000  7750.00000  1.330283580048e-05
7750.00000  7800.00000  1.027946402764e-05
7800.00000  7850.00000  1.209348709134e-05
7850.00000  7900.00000  1.108569650040e-05
7900.00000  7950.00000  1.269816144591e-05
7950.00000  8000.00000  1.108569650040e-05
8000.00000  8050.00000  1.088413838221e-05
8050.00000  8100.00000  1.068258026402e-05
8100.00000  8150.00000  1.068258026402e-05
8150.00000  8200.00000  1.027946402764e-05
8200.00000  8250.00000  1.128725461859e-05
8250.00000  8300.00000  1.390751015504e-05
8300.00000  8350.00000  9.271673436697e-06
8350.00000  8400.00000  1.148881273678e-05
8400.00000  8450.00000  1.108569650040e-05
8450.00000  8500.00000  1.169037085497e-05
8500.00000  8550.00000  9.674789673075e-06
8550.00000  8600.00000  8.465440963940e-06
8600.00000  8650.00000  8.263882845751e-06
8650.00000  8700.00000  8.666999082129e-06
8700.00000  8750.00000  1.048102214583e-05
8750.00000  8800.00000  9.876347791264e-06
8800.00000  8850.00000  9.070115318508e-06
8850.00000  8900.00000  1.128725461859e-05
8900.00000  8950.00000  1.148881273678e-05
8950.00000  9000.00000  9.271673436697e-06
9000.00000  9050.00000  7.860766609373e-06
9050.00000  9100.00000  6.852976018428e-06
9100.00000  9150.00000  1.169037085497e-05
9150.00000  9200.00000  8.868557200319e-06
9200.00000  9250.00000  9.473231554886e-06
9250.00000  9300.00000  1.431062639142e-05
9300.00000  9350.00000  1.027946402764e-05
9350.00000  9400.00000  8.666999082129e-06
9400.00000  9450.00000  7.659208491184e-06
9450.00000  9500.00000  9.271673436697e-06
9500.00000  9550.00000  1.269816144591e-05
9550.00000  9600.00000  8.868557200319e-06
9600.00000  9650.00000  1.088413838221e-05
9650.00000  9700.00000  1.068258026402e-05
9700.00000  9750.00000  8.868557200319e-06
9750.00000  9800.00000  9.070115318508e-06
9800.00000  9850.00000  8.263882845751e-06
9850.00000  9900.00000  9.271673436697e-06
9900.00000  9950.00000  8.868557200319e-06
9950.00000  10000.00000  7.054534136617e-06
