10001.00000  11001.00000  4.496812556766e-06
11001.00000  12001.00000  6.146852648160e-06
12001.00000  13001.00000  9.156815891802e-06
13001.00000  14001.00000  1.142335447888e-05
14001.00000  15001.00000  1.385308384423e-05
15001.00000  16001.00000  1.640973937046e-05
16001.00000  17001.00000  1.825923485751e-05
17001.00000  18001.00000  1.951036415758e-05
18001.00000  19001.00000  2.016312727066e-05
19001.00000  20001.00000  2.047137651850e-05
20001.00000  21001.00000  1.931090876192e-05
21001.00000  22001.00000  1.972795186194e-05
22001.00000  23001.00000  1.784219175749e-05
23001.00000  24001.00000  1.731635480529e-05
24001.00000  25001.00000  1.671798861830e-05
25001.00000  26001.00000  1.504981621821e-05
26001.00000  27001.00000  1.336351150942e-05
27001.00000  28001.00000  1.312779149637e-05
28001.00000  29001.00000  1.254755761807e-05
29001.00000  30001.00000  1.093378214407e-05
30001.00000  31001.00000  1.051673904405e-05
31001.00000  32001.00000  9.882108239667e-06
32001.00000  33001.00000  8.921095878746e-06
33001.00000  34001.00000  8.232068148273e-06
34001.00000  35001.00000  7.923818900431e-06
35001.00000  36001.00000  7.107865009082e-06
36001.00000  37001.00000  6.835880378632e-06
37001.00000  38001.00000  5.403427991598e-06
38001.00000  39001.00000  5.131443361148e-06
39001.00000  40001.00000  5.077046435059e-06
40001.00000  41001.00000  4.315489469800e-06
41001.00000  42001.00000  4.315489469800e-06
42001.00000  43001.00000  4.206695617620e-06
43001.00000  44001.00000  3.608329430631e-06
44001.00000  45001.00000  3.281947874091e-06
45001.00000  46001.00000  3.009963243642e-06
46001.00000  47001.00000  3.354477108878e-06
47001.00000  48001.00000  2.665449378406e-06
48001.00000  49001.00000  2.774243230586e-06
49001.00000  50001.00000  2.592920143619e-06
50001.00000  51001.00000  2.538523217529e-06
51001.00000  52001.00000  2.375332439260e-06
52001.00000  53001.00000  2.230273969686e-06
53001.00000  54001.00000  1.613775474001e-06
54001.00000  55001.00000  1.704437017484e-06
55001.00000  56001.00000  1.595643165304e-06
56001.00000  57001.00000  1.686304708787e-06
57001.00000  58001.00000  1.577510856607e-06
58001.00000  59001.00000  1.922024721844e-06
59001.00000  60001.00000  1.341790843551e-06
60001.00000  61001.00000  1.160467756585e-06
61001.00000  62001.00000  1.178600065281e-06
62001.00000  63001.00000  1.124203139192e-06
63001.00000  64001.00000  9.791446696184e-07
64001.00000  65001.00000  1.196732373978e-06
65001.00000  66001.00000  9.066154348319e-07
66001.00000  67001.00000  9.610123609218e-07
67001.00000  68001.00000  1.087938521798e-06
68001.00000  69001.00000  9.247477435285e-07
69001.00000  70001.00000  8.884831261352e-07
70001.00000  71001.00000  6.708954217756e-07
71001.00000  72001.00000  8.522185087420e-07
72001.00000  73001.00000  7.434246565621e-07
73001.00000  74001.00000  4.714400261126e-07
74001.00000  75001.00000  7.978215826521e-07
75001.00000  76001.00000  7.071600391689e-07
76001.00000  77001.00000  7.615569652588e-07
77001.00000  78001.00000  5.439692608991e-07
78001.00000  79001.00000  5.077046435059e-07
79001.00000  80001.00000  5.983661869890e-07
80001.00000  81001.00000  6.527631130790e-07
81001.00000  82001.00000  4.170431000227e-07
82001.00000  83001.00000  4.533077174159e-07
83001.00000  84001.00000  4.714400261126e-07
84001.00000  85001.00000  4.714400261126e-07
85001.00000  86001.00000  3.082492478428e-07
86001.00000  87001.00000  4.533077174159e-07
87001.00000  88001.00000  3.626461739328e-07
88001.00000  89001.00000  3.263815565395e-07
89001.00000  90001.00000  3.082492478428e-07
90001.00000  91001.00000  2.719846304496e-07
91001.00000  92001.00000  2.719846304496e-07
92001.00000  93001.00000  4.533077174159e-07
93001.00000  94001.00000  1.994553956630e-07
94001.00000  95001.00000  2.719846304496e-07
95001.00000  96001.00000  2.538523217529e-07
96001.00000  97001.00000  2.357200130563e-07
97001.00000  98001.00000  1.994553956630e-07
98001.00000  99001.00000  3.263815565395e-07
99001.00000  100001.00000  1.631907782697e-07
100001.00000  101001.00000  1.994553956630e-07
101001.00000  102001.00000  1.269261608765e-07
102001.00000  103001.00000  1.631907782697e-07
103001.00000  104001.00000  1.813230869664e-07
104001.00000  105001.00000  9.066154348319e-08
105001.00000  106001.00000  2.719846304496e-07
106001.00000  107001.00000  1.269261608765e-07
107001.00000  108001.00000  1.269261608765e-07
108001.00000  109001.00000  1.994553956630e-07
109001.00000  110001.00000  1.269261608765e-07
110001.00000  111001.00000  1.631907782697e-07
111001.00000  112001.00000  9.066154348319e-08
112001.00000  113001.00000  1.450584695731e-07
113001.00000  114001.00000  1.631907782697e-07
114001.00000  115001.00000  9.066154348319e-08
115001.00000  116001.00000  1.450584695731e-07
116001.00000  117001.00000  1.087938521798e-07
117001.00000  118001.00000  1.994553956630e-07
118001.00000  119001.00000  7.252923478655e-08
119001.00000  120001.00000  1.269261608765e-07
120001.00000  121001.00000  1.450584695731e-07
121001.00000  122001.00000  5.439692608991e-08
122001.00000  123001.00000  1.450584695731e-07
123001.00000  124001.00000  5.439692608991e-08
124001.00000  125001.00000  9.066154348319e-08
125001.00000  126001.00000  1.813230869664e-07
126001.00000  127001.00000  7.252923478655e-08
127001.00000  128001.00000  5.439692608991e-08
128001.00000  129001.00000  9.066154348319e-08
129001.00000  130001.00000  1.813230869664e-08
130001.00000  131001.00000  0.000000000000e+00
131001.00000  132001.00000  5.439692608991e-08
132001.00000  133001.00000  7.252923478655e-08
133001.00000  134001.00000  5.439692608991e-08
134001.00000  135001.00000  5.439692608991e-08
135001.00000  136001.00000  9.066154348319e-08
136001.00000  137001.00000  5.439692608991e-08
137001.00000  138001.00000  9.066154348319e-08
138001.00000  139001.00000  7.252923478655e-08
139001.00000  140001.00000  5.439692608991e-08
140001.00000  141001.00000  5.439692608991e-08
141001.00000  142001.00000  5.439692608991e-08
142001.00000  143001.00000  5.439692608991e-08
143001.00000  144001.00000  5.439692608991e-08
144001.00000  145001.00000  9.066154348319e-08
145001.00000  146001.00000  5.439692608991e-08
146001.00000  147001.00000  1.813230869664e-08
147001.00000  148001.00000  0.000000000000e+00
148001.00000  149001.00000  5.439692608991e-08
149001.00000  150001.00000  5.439692608991e-08
150001.00000  151001.00000  3.626461739328e-08
151001.00000  152001.00000  3.626461739328e-08
152001.00000  153001.00000  0.000000000000e+00
153001.00000  154001.00000  1.813230869664e-08
154001.00000  155001.00000  3.626461739328e-08
155001.00000  156001.00000  3.626461739328e-08
156001.00000  157001.00000  3.626461739328e-08
157001.00000  158001.00000  1.813230869664e-08
158001.00000  159001.00000  3.626461739328e-08
159001.00000  160001.00000  0.000000000000e+00
160001.00000  161001.00000  1.813230869664e-08
161001.00000  162001.00000  3.626461739328e-08
162001.00000  163001.00000  3.626461739328e-08
163001.00000  164001.00000  1.813230869664e-08
164001.00000  165001.00000  5.439692608991e-08
165001.00000  166001.00000  1.813230869664e-08
166001.00000  167001.00000  1.813230869664e-08
167001.00000  168001.00000  1.813230869664e-08
168001.00000  169001.00000  0.000000000000e+00
169001.00000  170001.00000  0.000000000000e+00
170001.00000  171001.00000  0.000000000000e+00
171001.00000  172001.00000  0.000000000000e+00
172001.00000  173001.00000  0.000000000000e+00
173001.00000  174001.00000  0.000000000000e+00
174001.00000  175001.00000  0.000000000000e+00
175001.00000  176001.00000  0.000000000000e+00
176001.00000  177001.00000  0.000000000000e+00
177001.00000  178001.00000  1.813230869664e-08
178001.00000  179001.00000  0.000000000000e+00
179001.00000  180001.00000  0.000000000000e+00
180001.00000  181001.00000  0.000000000000e+00
181001.00000  182001.00000  1.813230869664e-08
182001.00000  183001.00000  1.813230869664e-08
183001.00000  184001.00000  0.000000000000e+00
184001.00000  185001.00000  0.000000000000e+00
185001.00000  186001.00000  1.813230869664e-08
186001.00000  187001.00000  1.813230869664e-08
187001.00000  188001.00000  0.000000000000e+00
188001.00000  189001.00000  0.000000000000e+00
189001.00000  190001.00000  0.000000000000e+00
190001.00000  191001.00000  1.813230869664e-08
191001.00000  192001.00000  0.000000000000e+00
192001.00000  193001.00000  0.000000000000e+00
193001.00000  194001.00000  0.000000000000e+00
194001.00000  195001.00000  0.000000000000e+00
195001.00000  196001.00000  0.000000000000e+00
196001.00000  197001.00000  0.000000000000e+00
197001.00000  198001.00000  0.000000000000e+00
198001.00000  199001.00000  0.000000000000e+00
