10001.00000  11001.00000  4.496509314783e-05
11001.00000  12001.00000  4.768933643938e-05
12001.00000  13001.00000  5.007179274969e-05
13001.00000  14001.00000  5.449491838909e-05
14001.00000  15001.00000  5.571127793993e-05
15001.00000  16001.00000  5.815404959987e-05
16001.00000  17001.00000  5.729958214680e-05
17001.00000  18001.00000  5.629432631967e-05
18001.00000  19001.00000  5.334892674616e-05
19001.00000  20001.00000  5.091620764449e-05
20001.00000  21001.00000  4.714649829272e-05
21001.00000  22001.00000  4.560845687720e-05
22001.00000  23001.00000  4.159748612693e-05
23001.00000  24001.00000  3.836056236355e-05
24001.00000  25001.00000  3.520405906634e-05
25001.00000  26001.00000  3.238934275035e-05
26001.00000  27001.00000  3.109256273335e-05
27001.00000  28001.00000  2.724243291541e-05
28001.00000  29001.00000  2.541286731002e-05
29001.00000  30001.00000  2.353303891328e-05
30001.00000  31001.00000  2.058763933976e-05
31001.00000  32001.00000  1.946175281337e-05
32001.00000  33001.00000  1.726024255194e-05
33001.00000  34001.00000  1.579256904432e-05
34001.00000  35001.00000  1.482752345027e-05
35001.00000  36001.00000  1.344027040882e-05
36001.00000  37001.00000  1.226412109107e-05
37001.00000  38001.00000  1.165091503652e-05
38001.00000  39001.00000  1.050492339358e-05
39001.00000  40001.00000  9.570035474344e-06
40001.00000  41001.00000  8.886461511890e-06
41001.00000  42001.00000  7.690207077597e-06
42001.00000  43001.00000  7.197631722300e-06
43001.00000  44001.00000  6.594478226018e-06
44001.00000  45001.00000  6.212481011706e-06
45001.00000  46001.00000  6.061692637636e-06
46001.00000  47001.00000  5.609327515424e-06
47001.00000  48001.00000  4.976016344328e-06
48001.00000  49001.00000  4.724702387544e-06
49001.00000  50001.00000  4.433178197674e-06
50001.00000  51001.00000  3.840077259663e-06
51001.00000  52001.00000  3.588763302879e-06
52001.00000  53001.00000  3.538500511522e-06
53001.00000  54001.00000  3.066030272768e-06
54001.00000  55001.00000  2.794611199441e-06
55001.00000  56001.00000  2.714190733270e-06
56001.00000  57001.00000  2.623717708827e-06
57001.00000  58001.00000  2.513139567842e-06
58001.00000  59001.00000  2.231667936244e-06
59001.00000  60001.00000  1.899933513289e-06
60001.00000  61001.00000  1.920038629832e-06
61001.00000  62001.00000  1.749145139218e-06
62001.00000  63001.00000  1.538041415519e-06
63001.00000  64001.00000  1.538041415519e-06
64001.00000  65001.00000  1.588304206876e-06
65001.00000  66001.00000  1.397305599720e-06
66001.00000  67001.00000  1.186201876022e-06
67001.00000  68001.00000  1.286727458735e-06
68001.00000  69001.00000  1.286727458735e-06
69001.00000  70001.00000  1.166096759479e-06
70001.00000  71001.00000  1.045466060222e-06
71001.00000  72001.00000  1.105781409851e-06
72001.00000  73001.00000  1.075623735037e-06
73001.00000  74001.00000  6.534162876390e-07
74001.00000  75001.00000  8.142572199809e-07
75001.00000  76001.00000  7.539418703527e-07
76001.00000  77001.00000  5.629432631967e-07
77001.00000  78001.00000  7.237841955386e-07
78001.00000  79001.00000  7.338367538100e-07
79001.00000  80001.00000  7.237841955386e-07
80001.00000  81001.00000  6.433637293676e-07
81001.00000  82001.00000  5.428381466539e-07
82001.00000  83001.00000  4.322600056689e-07
83001.00000  84001.00000  5.126804718398e-07
84001.00000  85001.00000  4.925753552971e-07
85001.00000  86001.00000  4.724702387544e-07
86001.00000  87001.00000  3.819972143120e-07
87001.00000  88001.00000  4.222074473975e-07
88001.00000  89001.00000  4.724702387544e-07
89001.00000  90001.00000  4.724702387544e-07
90001.00000  91001.00000  3.216818646838e-07
91001.00000  92001.00000  2.915241898697e-07
92001.00000  93001.00000  3.719446560407e-07
93001.00000  94001.00000  4.021023308548e-07
94001.00000  95001.00000  2.312088402415e-07
95001.00000  96001.00000  2.714190733270e-07
96001.00000  97001.00000  2.814716315983e-07
97001.00000  98001.00000  2.211562819701e-07
98001.00000  99001.00000  1.608409323419e-07
99001.00000  100001.00000  2.915241898697e-07
100001.00000  101001.00000  2.513139567842e-07
101001.00000  102001.00000  2.412613985129e-07
102001.00000  103001.00000  1.909986071560e-07
103001.00000  104001.00000  1.708934906133e-07
104001.00000  105001.00000  1.708934906133e-07
105001.00000  106001.00000  2.111037236988e-07
106001.00000  107001.00000  2.211562819701e-07
107001.00000  108001.00000  1.507883740705e-07
108001.00000  109001.00000  1.507883740705e-07
109001.00000  110001.00000  1.105781409851e-07
110001.00000  111001.00000  1.407358157992e-07
111001.00000  112001.00000  1.005255827137e-07
112001.00000  113001.00000  1.306832575278e-07
113001.00000  114001.00000  2.010511654274e-08
114001.00000  115001.00000  1.105781409851e-07
115001.00000  116001.00000  1.206306992564e-07
116001.00000  117001.00000  1.206306992564e-07
117001.00000  118001.00000  5.026279135685e-08
118001.00000  119001.00000  1.105781409851e-07
119001.00000  120001.00000  6.031534962822e-08
120001.00000  121001.00000  4.021023308548e-08
121001.00000  122001.00000  1.407358157992e-07
122001.00000  123001.00000  7.036790789958e-08
123001.00000  124001.00000  5.026279135685e-08
124001.00000  125001.00000  8.042046617095e-08
125001.00000  126001.00000  7.036790789958e-08
126001.00000  127001.00000  6.031534962822e-08
127001.00000  128001.00000  2.010511654274e-08
128001.00000  129001.00000  6.031534962822e-08
129001.00000  130001.00000  6.031534962822e-08
130001.00000  131001.00000  6.031534962822e-08
131001.00000  132001.00000  5.026279135685e-08
132001.00000  133001.00000  8.042046617095e-08
133001.00000  134001.00000  5.026279135685e-08
134001.00000  135001.00000  7.036790789958e-08
135001.00000  136001.00000  6.031534962822e-08
136001.00000  137001.00000  6.031534962822e-08
137001.00000  138001.00000  5.026279135685e-08
138001.00000  139001.00000  0.000000000000e+00
139001.00000  140001.00000  4.021023308548e-08
140001.00000  141001.00000  8.042046617095e-08
141001.00000  142001.00000  3.015767481411e-08
142001.00000  143001.00000  2.010511654274e-08
143001.00000  144001.00000  2.010511654274e-08
144001.00000  145001.00000  2.010511654274e-08
145001.00000  146001.00000  2.010511654274e-08
146001.00000  147001.00000  1.005255827137e-08
147001.00000  148001.00000  2.010511654274e-08
148001.00000  149001.00000  2.010511654274e-08
149001.00000  150001.00000  0.000000000000e+00
150001.00000  151001.00000  0.000000000000e+00
151001.00000  152001.00000  2.010511654274e-08
152001.00000  153001.00000  2.010511654274e-08
153001.00000  154001.00000  3.015767481411e-08
154001.00000  155001.00000  1.005255827137e-08
155001.00000  156001.00000  2.010511654274e-08
156001.00000  157001.00000  0.000000000000e+00
157001.00000  158001.00000  1.005255827137e-08
158001.00000  159001.00000  0.000000000000e+00
159001.00000  160001.00000  3.015767481411e-08
160001.00000  161001.00000  3.015767481411e-08
161001.00000  162001.00000  2.010511654274e-08
162001.00000  163001.00000  0.000000000000e+00
163001.00000  164001.00000  1.005255827137e-08
164001.00000  165001.00000  1.005255827137e-08
165001.00000  166001.00000  0.000000000000e+00
166001.00000  167001.00000  1.005255827137e-08
167001.00000  168001.00000  0.000000000000e+00
168001.00000  169001.00000  0.000000000000e+00
169001.00000  170001.00000  1.005255827137e-08
170001.00000  171001.00000  0.000000000000e+00
171001.00000  172001.00000  0.000000000000e+00
172001.00000  173001.00000  0.000000000000e+00
173001.00000  174001.00000  0.000000000000e+00
174001.00000  175001.00000  0.000000000000e+00
175001.00000  176001.00000  1.005255827137e-08
176001.00000  177001.00000  0.000000000000e+00
177001.00000  178001.00000  0.000000000000e+00
178001.00000  179001.00000  0.000000000000e+00
179001.00000  180001.00000  0.000000000000e+00
180001.00000  181001.00000  0.000000000000e+00
181001.00000  182001.00000  0.000000000000e+00
182001.00000  183001.00000  0.000000000000e+00
183001.00000  184001.00000  0.000000000000e+00
184001.00000  185001.00000  1.005255827137e-08
185001.00000  186001.00000  0.000000000000e+00
186001.00000  187001.00000  0.000000000000e+00
187001.00000  188001.00000  0.000000000000e+00
188001.00000  189001.00000  0.000000000000e+00
189001.00000  190001.00000  0.000000000000e+00
190001.00000  191001.00000  0.000000000000e+00
191001.00000  192001.00000  0.000000000000e+00
192001.00000  193001.00000  0.000000000000e+00
193001.00000  194001.00000  0.000000000000e+00
194001.00000  195001.00000  0.000000000000e+00
195001.00000  196001.00000  0.000000000000e+00
196001.00000  197001.00000  0.000000000000e+00
197001.00000  198001.00000  0.000000000000e+00
198001.00000  199001.00000  0.000000000000e+00
