300.00000  350.00000  1.285058783149e+00
350.00000  400.00000  9.117440250756e-01
400.00000  450.00000  6.732891889439e-01
450.00000  500.00000  5.150363149862e-01
500.00000  550.00000  4.043974734191e-01
550.00000  600.00000  3.239045874461e-01
600.00000  650.00000  2.659675965228e-01
650.00000  700.00000  2.202293157872e-01
700.00000  750.00000  1.856964376395e-01
750.00000  800.00000  1.582655228185e-01
800.00000  850.00000  1.363956424557e-01
850.00000  900.00000  1.174796431204e-01
900.00000  950.00000  1.024736298806e-01
950.00000  1000.00000  9.078013007521e-02
1000.00000  1050.00000  8.023023609828e-02
1050.00000  1100.00000  7.192439884147e-02
1100.00000  1150.00000  6.463567880494e-02
1150.00000  1200.00000  5.826883750721e-02
1200.00000  1250.00000  5.221449747687e-02
1250.00000  1300.00000  4.807087948142e-02
1300.00000  1350.00000  4.325687186236e-02
1350.00000  1400.00000  4.012069842892e-02
1400.00000  1450.00000  3.681636955160e-02
1450.00000  1500.00000  3.394507814480e-02
1500.00000  1550.00000  3.126649585290e-02
1550.00000  1600.00000  2.883493837236e-02
1600.00000  1650.00000  2.683195405852e-02
1650.00000  1700.00000  2.495843455546e-02
1700.00000  1750.00000  2.296735505181e-02
1750.00000  1800.00000  2.146288466453e-02
1800.00000  1850.00000  2.026719529144e-02
1850.00000  1900.00000  1.916823250113e-02
1900.00000  1950.00000  1.775974464597e-02
1950.00000  2000.00000  1.668235932411e-02
2000.00000  2050.00000  1.562059906563e-02
2050.00000  2100.00000  1.472401804847e-02
2100.00000  2150.00000  1.414291450126e-02
2150.00000  2200.00000  1.321210715482e-02
2200.00000  2250.00000  1.237802639115e-02
2250.00000  2300.00000  1.180957170475e-02
2300.00000  2350.00000  1.137504613296e-02
2350.00000  2400.00000  1.071730537017e-02
2400.00000  2450.00000  1.023516055762e-02
2450.00000  2500.00000  9.735902580438e-03
2500.00000  2550.00000  9.150334729402e-03
2550.00000  2600.00000  8.697207891688e-03
2600.00000  2650.00000  8.428605611861e-03
2650.00000  2700.00000  8.035746875715e-03
2700.00000  2750.00000  7.741846874242e-03
2750.00000  2800.00000  7.516399531340e-03
2800.00000  2850.00000  7.084850162089e-03
2850.00000  2900.00000  6.676366362573e-03
2900.00000  2950.00000  6.435293956302e-03
2950.00000  3000.00000  6.279787373244e-03
3000.00000  3050.00000  6.003000536414e-03
3050.00000  3100.00000  5.723237497037e-03
3100.00000  3150.00000  5.561778508886e-03
3150.00000  3200.00000  5.353444330627e-03
3200.00000  3250.00000  5.032758506235e-03
3250.00000  3300.00000  5.013413189682e-03
3300.00000  3350.00000  4.910734201826e-03
3350.00000  3400.00000  4.553589896238e-03
3400.00000  3450.00000  4.406267870184e-03
3450.00000  3500.00000  4.323678249517e-03
3500.00000  3550.00000  4.122784577624e-03
3550.00000  3600.00000  4.116088121894e-03
3600.00000  3650.00000  3.889152677719e-03
3650.00000  3700.00000  3.757455715033e-03
3700.00000  3750.00000  3.736622297207e-03
3750.00000  3800.00000  3.502246346666e-03
3800.00000  3850.00000  3.492573688389e-03
3850.00000  3900.00000  3.367573181434e-03
3900.00000  3950.00000  3.178584319727e-03
3950.00000  4000.00000  3.159983053811e-03
4000.00000  4050.00000  2.990339508657e-03
4050.00000  4100.00000  2.979922799744e-03
4100.00000  4150.00000  2.820695963503e-03
4150.00000  4200.00000  2.813999507774e-03
4200.00000  4250.00000  2.735130140290e-03
4250.00000  4300.00000  2.625754696704e-03
4300.00000  4350.00000  2.517867354391e-03
4350.00000  4400.00000  2.571439000229e-03
4400.00000  4450.00000  2.401795455075e-03
4450.00000  4500.00000  2.301348619128e-03
4500.00000  4550.00000  2.252241277110e-03
4550.00000  4600.00000  2.334086847141e-03
4600.00000  4650.00000  2.222479251645e-03
4650.00000  4700.00000  2.218014947825e-03
4700.00000  4750.00000  2.116824061242e-03
4750.00000  4800.00000  1.997031908743e-03
4800.00000  4850.00000  1.933787604628e-03
4850.00000  4900.00000  1.923370895715e-03
4900.00000  4950.00000  1.857894439691e-03
4950.00000  5000.00000  1.860870642237e-03
5000.00000  5050.00000  1.816971654676e-03
5050.00000  5100.00000  1.762655958201e-03
5100.00000  5150.00000  1.770096464567e-03
5150.00000  5200.00000  1.696435451540e-03
5200.00000  5250.00000  1.645095957612e-03
5250.00000  5300.00000  1.630958995515e-03
5300.00000  5350.00000  1.480660766914e-03
5350.00000  5400.00000  1.531256210206e-03
5400.00000  5450.00000  1.534232412752e-03
5450.00000  5500.00000  1.462803551635e-03
5500.00000  5550.00000  1.405511652613e-03
5550.00000  5600.00000  1.397327095610e-03
5600.00000  5650.00000  1.343755449772e-03
5650.00000  5700.00000  1.438993931262e-03
5700.00000  5750.00000  1.377237728421e-03
5750.00000  5800.00000  1.295392158391e-03
5800.00000  5850.00000  1.286463550751e-03
5850.00000  5900.00000  1.238844310006e-03
5900.00000  5950.00000  1.244796715099e-03
5950.00000  6000.00000  1.225451398547e-03
6000.00000  6050.00000  1.222475196000e-03
6050.00000  6100.00000  1.195689373081e-03
6100.00000  6150.00000  1.214290638997e-03
6150.00000  6200.00000  1.145837980426e-03
6200.00000  6250.00000  1.109379499231e-03
6250.00000  6300.00000  1.138397474060e-03
6300.00000  6350.00000  1.062504309122e-03
6350.00000  6400.00000  1.766376211384e-03
6400.00000  6450.00000  1.061016207849e-03
6450.00000  6500.00000  1.047623296390e-03
6500.00000  6550.00000  1.002980258191e-03
6550.00000  6600.00000  9.575931693560e-04
6600.00000  6650.00000  9.590812706293e-04
6650.00000  6700.00000  9.650336757224e-04
6700.00000  6750.00000  9.300632958003e-04
6750.00000  6800.00000  9.360157008935e-04
6800.00000  6850.00000  8.400331687669e-04
6850.00000  6900.00000  8.630987385027e-04
6900.00000  6950.00000  8.638427891394e-04
6950.00000  7000.00000  9.166703843408e-04
7000.00000  7050.00000  8.965810171515e-04
7050.00000  7100.00000  8.802119031454e-04
7100.00000  7150.00000  8.392891181302e-04
7150.00000  7200.00000  8.005984850249e-04
7200.00000  7250.00000  7.388422821838e-04
7250.00000  7300.00000  7.470268391868e-04
7300.00000  7350.00000  7.604197506464e-04
7350.00000  7400.00000  7.276815226342e-04
7400.00000  7450.00000  7.261934213609e-04
7450.00000  7500.00000  7.708364595593e-04
7500.00000  7550.00000  6.711336742495e-04
7550.00000  7600.00000  6.599729146999e-04
7600.00000  7650.00000  6.837825350724e-04
7650.00000  7700.00000  6.703896236129e-04
7700.00000  7750.00000  6.383954462374e-04
7750.00000  7800.00000  6.503002564236e-04
7800.00000  7850.00000  6.011929144053e-04
7850.00000  7900.00000  6.064012688618e-04
7900.00000  7950.00000  6.145858258649e-04
7950.00000  8000.00000  6.116096233183e-04
8000.00000  8050.00000  6.049131675885e-04
8050.00000  8100.00000  5.662225344833e-04
8100.00000  8150.00000  5.989607624954e-04
8150.00000  8200.00000  5.639903825733e-04
8200.00000  8250.00000  5.989607624954e-04
8250.00000  8300.00000  5.565498762069e-04
8300.00000  8350.00000  5.610141800268e-04
8350.00000  8400.00000  5.401807622008e-04
8400.00000  8450.00000  5.275319013780e-04
8450.00000  8500.00000  5.014901290955e-04
8500.00000  8550.00000  5.245556988314e-04
8550.00000  8600.00000  5.081865848253e-04
8600.00000  8650.00000  5.193473443749e-04
8650.00000  8700.00000  4.828888631795e-04
8700.00000  8750.00000  4.955377240024e-04
8750.00000  8800.00000  4.620554453536e-04
8800.00000  8850.00000  4.754483568131e-04
8850.00000  8900.00000  4.687519010834e-04
8900.00000  8950.00000  4.843769644528e-04
8950.00000  9000.00000  4.241088628850e-04
9000.00000  9050.00000  4.315493692514e-04
9050.00000  9100.00000  4.367577237078e-04
9100.00000  9150.00000  4.077397488789e-04
9150.00000  9200.00000  4.382458249811e-04
9200.00000  9250.00000  4.531268377139e-04
9250.00000  9300.00000  4.114600020621e-04
9300.00000  9350.00000  3.913706348728e-04
9350.00000  9400.00000  4.077397488789e-04
9400.00000  9450.00000  4.211326603384e-04
9450.00000  9500.00000  4.322934198880e-04
9500.00000  9550.00000  4.129481033354e-04
9550.00000  9600.00000  3.958349386926e-04
9600.00000  9650.00000  3.921146855094e-04
9650.00000  9700.00000  3.586324068606e-04
9700.00000  9750.00000  3.668169638637e-04
9750.00000  9800.00000  3.638407613171e-04
9800.00000  9850.00000  3.675610145003e-04
9850.00000  9900.00000  3.489597485843e-04
9900.00000  9950.00000  3.616086094072e-04
9950.00000  10000.00000  3.519359511309e-04
