300.00000  350.00000  1.353003985015e-04
350.00000  400.00000  1.256790368303e-04
400.00000  450.00000  1.052336432789e-04
450.00000  500.00000  8.819581531948e-05
500.00000  550.00000  1.262803719347e-04
550.00000  600.00000  5.211570905242e-05
600.00000  650.00000  5.812906009693e-05
650.00000  700.00000  4.710458318200e-05
700.00000  750.00000  5.091303884352e-05
750.00000  800.00000  4.309568248566e-05
800.00000  850.00000  7.957667882235e-05
850.00000  900.00000  4.389746262493e-05
900.00000  950.00000  3.167031550109e-05
950.00000  1000.00000  3.387521088407e-05
1000.00000  1050.00000  3.567921619743e-05
1050.00000  1100.00000  3.126942543145e-05
1100.00000  1150.00000  3.167031550109e-05
1150.00000  1200.00000  3.608010626706e-05
1200.00000  1250.00000  3.106898039664e-05
1250.00000  1300.00000  5.191526401761e-05
1300.00000  1350.00000  3.106898039664e-05
1350.00000  1400.00000  2.946542011810e-05
1400.00000  1450.00000  2.305117900396e-05
1450.00000  1500.00000  2.525607438694e-05
1500.00000  1550.00000  2.826274990920e-05
1550.00000  1600.00000  2.345206907359e-05
1600.00000  1650.00000  2.405340417804e-05
1650.00000  1700.00000  2.585740949139e-05
1700.00000  1750.00000  4.269479241602e-05
1750.00000  1800.00000  2.084628362097e-05
1800.00000  1850.00000  2.044539355134e-05
1850.00000  1900.00000  1.984405844688e-05
1900.00000  1950.00000  2.044539355134e-05
1950.00000  2000.00000  1.884183327280e-05
2000.00000  2050.00000  1.743871802908e-05
2050.00000  2100.00000  2.044539355134e-05
2100.00000  2150.00000  1.944316837725e-05
2150.00000  2200.00000  2.104672865579e-05
2200.00000  2250.00000  1.643649285499e-05
2250.00000  2300.00000  1.904227830762e-05
2300.00000  2350.00000  4.570146793828e-05
2350.00000  2400.00000  1.783960809871e-05
2400.00000  2450.00000  1.463248754164e-05
2450.00000  2500.00000  1.804005313353e-05
2500.00000  2550.00000  1.743871802908e-05
2550.00000  2600.00000  1.322937229792e-05
2600.00000  2650.00000  1.383070740237e-05
2650.00000  2700.00000  1.844094320316e-05
2700.00000  2750.00000  1.563471271573e-05
2750.00000  2800.00000  1.423159747201e-05
2800.00000  2850.00000  1.363026236756e-05
2850.00000  2900.00000  1.342981733274e-05
2900.00000  2950.00000  1.703782795945e-05
2950.00000  3000.00000  2.164806376024e-05
3000.00000  3050.00000  1.583515775054e-05
3050.00000  3100.00000  1.643649285499e-05
3100.00000  3150.00000  1.363026236756e-05
3150.00000  3200.00000  1.663693788981e-05
3200.00000  3250.00000  1.563471271573e-05
3250.00000  3300.00000  1.583515775054e-05
3300.00000  3350.00000  1.663693788981e-05
3350.00000  3400.00000  1.623604782018e-05
3400.00000  3450.00000  1.202670208902e-05
3450.00000  3500.00000  1.503337761128e-05
3500.00000  3550.00000  1.302892726311e-05
3550.00000  3600.00000  1.623604782018e-05
3600.00000  3650.00000  1.443204250682e-05
3650.00000  3700.00000  2.445429424768e-05
3700.00000  3750.00000  2.004450348170e-05
3750.00000  3800.00000  1.703782795945e-05
3800.00000  3850.00000  1.443204250682e-05
3850.00000  3900.00000  1.643649285499e-05
3900.00000  3950.00000  1.984405844688e-05
3950.00000  4000.00000  1.623604782018e-05
4000.00000  4050.00000  1.824049816835e-05
4050.00000  4100.00000  1.864138823798e-05
4100.00000  4150.00000  1.904227830762e-05
4150.00000  4200.00000  1.583515775054e-05
4200.00000  4250.00000  1.663693788981e-05
4250.00000  4300.00000  1.743871802908e-05
4300.00000  4350.00000  1.583515775054e-05
4350.00000  4400.00000  1.703782795945e-05
4400.00000  4450.00000  1.703782795945e-05
4450.00000  4500.00000  2.124717369060e-05
4500.00000  4550.00000  2.164806376024e-05
4550.00000  4600.00000  2.184850879505e-05
4600.00000  4650.00000  1.804005313353e-05
4650.00000  4700.00000  2.124717369060e-05
4700.00000  4750.00000  2.224939886469e-05
4750.00000  4800.00000  2.244984389951e-05
4800.00000  4850.00000  1.924272334243e-05
4850.00000  4900.00000  2.084628362097e-05
4900.00000  4950.00000  2.224939886469e-05
4950.00000  5000.00000  2.204895382987e-05
5000.00000  5050.00000  2.204895382987e-05
5050.00000  5100.00000  2.445429424768e-05
5100.00000  5150.00000  2.124717369060e-05
5150.00000  5200.00000  2.405340417804e-05
5200.00000  5250.00000  2.285073396914e-05
5250.00000  5300.00000  2.184850879505e-05
5300.00000  5350.00000  2.465473928249e-05
5350.00000  5400.00000  2.224939886469e-05
5400.00000  5450.00000  2.766141480475e-05
5450.00000  5500.00000  2.625829956103e-05
5500.00000  5550.00000  1.984405844688e-05
5550.00000  5600.00000  2.425384921286e-05
5600.00000  5650.00000  2.786185983956e-05
5650.00000  5700.00000  2.866363997883e-05
5700.00000  5750.00000  2.204895382987e-05
5750.00000  5800.00000  2.084628362097e-05
5800.00000  5850.00000  2.505562935213e-05
5850.00000  5900.00000  3.146987046627e-05
5900.00000  5950.00000  2.645874459585e-05
5950.00000  6000.00000  2.946542011810e-05
6000.00000  6050.00000  2.285073396914e-05
6050.00000  6100.00000  3.006675522255e-05
6100.00000  6150.00000  3.187076053590e-05
6150.00000  6200.00000  2.625829956103e-05
6200.00000  6250.00000  3.608010626706e-05
6250.00000  6300.00000  3.888633675450e-05
6300.00000  6350.00000  4.449879772938e-05
6350.00000  6400.00000  3.453667949897e-04
6400.00000  6450.00000  2.726052473511e-05
6450.00000  6500.00000  2.605785452621e-05
6500.00000  6550.00000  2.525607438694e-05
6550.00000  6600.00000  2.706007970030e-05
6600.00000  6650.00000  2.726052473511e-05
6650.00000  6700.00000  2.926497508328e-05
6700.00000  6750.00000  2.685963466548e-05
6750.00000  6800.00000  2.425384921286e-05
6800.00000  6850.00000  2.425384921286e-05
6850.00000  6900.00000  2.766141480475e-05
6900.00000  6950.00000  3.167031550109e-05
6950.00000  7000.00000  2.445429424768e-05
7000.00000  7050.00000  2.405340417804e-05
7050.00000  7100.00000  6.173707072364e-05
7100.00000  7150.00000  1.643649285499e-05
7150.00000  7200.00000  1.623604782018e-05
7200.00000  7250.00000  1.603560278536e-05
7250.00000  7300.00000  1.503337761128e-05
7300.00000  7350.00000  1.503337761128e-05
7350.00000  7400.00000  1.623604782018e-05
7400.00000  7450.00000  1.363026236756e-05
7450.00000  7500.00000  2.585740949139e-05
7500.00000  7550.00000  1.443204250682e-05
7550.00000  7600.00000  1.783960809871e-05
7600.00000  7650.00000  1.463248754164e-05
7650.00000  7700.00000  1.864138823798e-05
7700.00000  7750.00000  1.322937229792e-05
7750.00000  7800.00000  1.683738292463e-05
7800.00000  7850.00000  1.763916306390e-05
7850.00000  7900.00000  1.763916306390e-05
7900.00000  7950.00000  1.342981733274e-05
7950.00000  8000.00000  1.844094320316e-05
8000.00000  8050.00000  1.503337761128e-05
8050.00000  8100.00000  1.543426768091e-05
8100.00000  8150.00000  1.523382264609e-05
8150.00000  8200.00000  1.523382264609e-05
8200.00000  8250.00000  1.683738292463e-05
8250.00000  8300.00000  1.563471271573e-05
8300.00000  8350.00000  1.222714712384e-05
8350.00000  8400.00000  1.543426768091e-05
8400.00000  8450.00000  1.603560278536e-05
8450.00000  8500.00000  1.423159747201e-05
8500.00000  8550.00000  1.743871802908e-05
8550.00000  8600.00000  1.703782795945e-05
8600.00000  8650.00000  1.563471271573e-05
8650.00000  8700.00000  1.743871802908e-05
8700.00000  8750.00000  1.443204250682e-05
8750.00000  8800.00000  1.563471271573e-05
8800.00000  8850.00000  1.363026236756e-05
8850.00000  8900.00000  1.403115243719e-05
8900.00000  8950.00000  1.202670208902e-05
8950.00000  9000.00000  1.944316837725e-05
9000.00000  9050.00000  1.603560278536e-05
9050.00000  9100.00000  1.643649285499e-05
9100.00000  9150.00000  1.383070740237e-05
9150.00000  9200.00000  1.443204250682e-05
9200.00000  9250.00000  1.623604782018e-05
9250.00000  9300.00000  1.342981733274e-05
9300.00000  9350.00000  1.543426768091e-05
9350.00000  9400.00000  1.363026236756e-05
9400.00000  9450.00000  1.282848222829e-05
9450.00000  9500.00000  1.202670208902e-05
9500.00000  9550.00000  1.423159747201e-05
9550.00000  9600.00000  1.363026236756e-05
9600.00000  9650.00000  1.563471271573e-05
9650.00000  9700.00000  1.663693788981e-05
9700.00000  9750.00000  1.363026236756e-05
9750.00000  9800.00000  1.603560278536e-05
9800.00000  9850.00000  1.503337761128e-05
9850.00000  9900.00000  1.743871802908e-05
9900.00000  9950.00000  1.342981733274e-05
9950.00000  10000.00000  1.583515775054e-05
