10001.00000  11001.00000  1.372162030336e-04
11001.00000  12001.00000  1.137071332831e-04
12001.00000  13001.00000  9.470058552560e-05
13001.00000  14001.00000  7.680121530740e-05
14001.00000  15001.00000  6.410557952376e-05
15001.00000  16001.00000  5.676130184660e-05
16001.00000  17001.00000  4.838365846612e-05
17001.00000  18001.00000  4.203584057430e-05
18001.00000  19001.00000  3.845596653066e-05
19001.00000  20001.00000  3.221886639277e-05
20001.00000  21001.00000  2.919258111876e-05
21001.00000  22001.00000  2.576033074703e-05
22001.00000  23001.00000  2.133162058994e-05
23001.00000  24001.00000  2.088874957424e-05
24001.00000  25001.00000  1.848986490582e-05
25001.00000  26001.00000  1.642313349918e-05
26001.00000  27001.00000  1.435640209254e-05
27001.00000  28001.00000  1.513142637003e-05
28001.00000  29001.00000  1.247420027578e-05
29001.00000  30001.00000  1.206823517805e-05
30001.00000  31001.00000  1.014912744331e-05
31001.00000  32001.00000  9.411009083799e-06
32001.00000  33001.00000  8.303831544529e-06
33001.00000  34001.00000  8.266925626553e-06
34001.00000  35001.00000  7.934772364772e-06
35001.00000  36001.00000  7.159748087282e-06
36001.00000  37001.00000  7.418089513112e-06
37001.00000  38001.00000  5.056110762669e-06
38001.00000  39001.00000  5.831135040158e-06
39001.00000  40001.00000  5.425169942425e-06
40001.00000  41001.00000  5.646605450279e-06
41001.00000  42001.00000  5.240640352547e-06
42001.00000  43001.00000  4.354898321131e-06
43001.00000  44001.00000  4.133462813276e-06
44001.00000  45001.00000  4.133462813276e-06
45001.00000  46001.00000  3.985839141374e-06
46001.00000  47001.00000  3.026285274006e-06
47001.00000  48001.00000  3.321532617811e-06
48001.00000  49001.00000  4.022745059349e-06
49001.00000  50001.00000  2.731037930201e-06
50001.00000  51001.00000  2.546508340322e-06
51001.00000  52001.00000  3.063191191982e-06
52001.00000  53001.00000  2.767943848176e-06
53001.00000  54001.00000  2.620320176273e-06
54001.00000  55001.00000  2.435790586395e-06
55001.00000  56001.00000  2.177449160565e-06
56001.00000  57001.00000  2.140543242590e-06
57001.00000  58001.00000  2.214355078541e-06
58001.00000  59001.00000  2.435790586395e-06
59001.00000  60001.00000  1.734578144857e-06
60001.00000  61001.00000  1.845295898784e-06
61001.00000  62001.00000  1.550048554979e-06
62001.00000  63001.00000  1.882201816760e-06
63001.00000  64001.00000  1.586954472954e-06
64001.00000  65001.00000  1.623860390930e-06
65001.00000  66001.00000  1.402424883076e-06
66001.00000  67001.00000  1.144083457246e-06
67001.00000  68001.00000  1.033365703319e-06
68001.00000  69001.00000  1.550048554979e-06
69001.00000  70001.00000  1.513142637003e-06
70001.00000  71001.00000  7.750242774893e-07
71001.00000  72001.00000  1.144083457246e-06
72001.00000  73001.00000  1.254801211173e-06
73001.00000  74001.00000  1.476236719027e-06
74001.00000  75001.00000  1.291707129149e-06
75001.00000  76001.00000  8.857420314164e-07
76001.00000  77001.00000  1.033365703319e-06
77001.00000  78001.00000  1.254801211173e-06
78001.00000  79001.00000  6.643065235623e-07
79001.00000  80001.00000  9.964597853434e-07
80001.00000  81001.00000  9.226479493921e-07
81001.00000  82001.00000  5.904946876109e-07
82001.00000  83001.00000  8.857420314164e-07
83001.00000  84001.00000  5.535887696352e-07
84001.00000  85001.00000  7.750242774893e-07
85001.00000  86001.00000  6.643065235623e-07
86001.00000  87001.00000  8.857420314164e-07
87001.00000  88001.00000  5.535887696352e-07
88001.00000  89001.00000  4.059650977325e-07
89001.00000  90001.00000  7.012124415380e-07
90001.00000  91001.00000  5.166828516596e-07
91001.00000  92001.00000  5.166828516596e-07
92001.00000  93001.00000  6.274006055866e-07
93001.00000  94001.00000  7.750242774893e-07
94001.00000  95001.00000  4.797769336839e-07
95001.00000  96001.00000  5.535887696352e-07
96001.00000  97001.00000  4.059650977325e-07
97001.00000  98001.00000  6.274006055866e-07
98001.00000  99001.00000  2.952473438055e-07
99001.00000  100001.00000  5.166828516596e-07
100001.00000  101001.00000  5.166828516596e-07
101001.00000  102001.00000  4.059650977325e-07
102001.00000  103001.00000  3.690591797568e-07
103001.00000  104001.00000  2.952473438055e-07
104001.00000  105001.00000  4.797769336839e-07
105001.00000  106001.00000  4.428710157082e-07
106001.00000  107001.00000  3.690591797568e-07
107001.00000  108001.00000  2.583414258298e-07
108001.00000  109001.00000  2.214355078541e-07
109001.00000  110001.00000  4.059650977325e-07
110001.00000  111001.00000  2.214355078541e-07
111001.00000  112001.00000  3.690591797568e-07
112001.00000  113001.00000  4.797769336839e-07
113001.00000  114001.00000  2.952473438055e-07
114001.00000  115001.00000  1.476236719027e-07
115001.00000  116001.00000  3.690591797568e-07
116001.00000  117001.00000  2.583414258298e-07
117001.00000  118001.00000  2.214355078541e-07
118001.00000  119001.00000  1.476236719027e-07
119001.00000  120001.00000  3.321532617811e-07
120001.00000  121001.00000  2.214355078541e-07
121001.00000  122001.00000  3.321532617811e-07
122001.00000  123001.00000  5.166828516596e-07
123001.00000  124001.00000  1.476236719027e-07
124001.00000  125001.00000  3.321532617811e-07
125001.00000  126001.00000  3.321532617811e-07
126001.00000  127001.00000  1.476236719027e-07
127001.00000  128001.00000  1.476236719027e-07
128001.00000  129001.00000  2.214355078541e-07
129001.00000  130001.00000  3.321532617811e-07
130001.00000  131001.00000  2.583414258298e-07
131001.00000  132001.00000  2.214355078541e-07
132001.00000  133001.00000  2.952473438055e-07
133001.00000  134001.00000  1.476236719027e-07
134001.00000  135001.00000  1.845295898784e-07
135001.00000  136001.00000  1.845295898784e-07
136001.00000  137001.00000  1.107177539270e-07
137001.00000  138001.00000  1.845295898784e-07
138001.00000  139001.00000  1.107177539270e-07
139001.00000  140001.00000  1.476236719027e-07
140001.00000  141001.00000  1.845295898784e-07
141001.00000  142001.00000  1.845295898784e-07
142001.00000  143001.00000  2.214355078541e-07
143001.00000  144001.00000  1.107177539270e-07
144001.00000  145001.00000  1.845295898784e-07
145001.00000  146001.00000  1.845295898784e-07
146001.00000  147001.00000  2.214355078541e-07
147001.00000  148001.00000  2.583414258298e-07
148001.00000  149001.00000  1.107177539270e-07
149001.00000  150001.00000  1.476236719027e-07
150001.00000  151001.00000  1.107177539270e-07
151001.00000  152001.00000  2.214355078541e-07
152001.00000  153001.00000  1.107177539270e-07
153001.00000  154001.00000  1.107177539270e-07
154001.00000  155001.00000  1.107177539270e-07
155001.00000  156001.00000  3.690591797568e-08
156001.00000  157001.00000  1.476236719027e-07
157001.00000  158001.00000  1.107177539270e-07
158001.00000  159001.00000  7.381183595137e-08
159001.00000  160001.00000  1.107177539270e-07
160001.00000  161001.00000  3.690591797568e-08
161001.00000  162001.00000  1.107177539270e-07
162001.00000  163001.00000  1.845295898784e-07
163001.00000  164001.00000  7.381183595137e-08
164001.00000  165001.00000  7.381183595137e-08
165001.00000  166001.00000  3.690591797568e-08
166001.00000  167001.00000  3.690591797568e-08
167001.00000  168001.00000  1.107177539270e-07
168001.00000  169001.00000  1.107177539270e-07
169001.00000  170001.00000  3.690591797568e-08
170001.00000  171001.00000  3.690591797568e-08
171001.00000  172001.00000  1.107177539270e-07
172001.00000  173001.00000  1.107177539270e-07
173001.00000  174001.00000  7.381183595137e-08
174001.00000  175001.00000  7.381183595137e-08
175001.00000  176001.00000  7.381183595137e-08
176001.00000  177001.00000  1.845295898784e-07
177001.00000  178001.00000  3.690591797568e-08
178001.00000  179001.00000  3.690591797568e-08
179001.00000  180001.00000  3.690591797568e-08
180001.00000  181001.00000  7.381183595137e-08
181001.00000  182001.00000  3.690591797568e-08
182001.00000  183001.00000  0.000000000000e+00
183001.00000  184001.00000  7.381183595137e-08
184001.00000  185001.00000  3.690591797568e-08
185001.00000  186001.00000  0.000000000000e+00
186001.00000  187001.00000  0.000000000000e+00
187001.00000  188001.00000  7.381183595137e-08
188001.00000  189001.00000  1.845295898784e-07
189001.00000  190001.00000  7.381183595137e-08
190001.00000  191001.00000  1.107177539270e-07
191001.00000  192001.00000  7.381183595137e-08
192001.00000  193001.00000  0.000000000000e+00
193001.00000  194001.00000  3.690591797568e-08
194001.00000  195001.00000  3.690591797568e-08
195001.00000  196001.00000  3.690591797568e-08
196001.00000  197001.00000  3.690591797568e-08
197001.00000  198001.00000  1.107177539270e-07
198001.00000  199001.00000  3.690591797568e-08
