10001.00000  11001.00000  2.167086240193e-05
11001.00000  12001.00000  2.338736635456e-05
12001.00000  13001.00000  2.751770399057e-05
13001.00000  14001.00000  3.272085659698e-05
14001.00000  15001.00000  3.817433269648e-05
15001.00000  16001.00000  3.955111190848e-05
16001.00000  17001.00000  4.053452563134e-05
17001.00000  18001.00000  4.346688655041e-05
18001.00000  19001.00000  4.266227532262e-05
19001.00000  20001.00000  4.387813228906e-05
20001.00000  21001.00000  3.987295639960e-05
21001.00000  22001.00000  3.946171066095e-05
22001.00000  23001.00000  3.747700296572e-05
23001.00000  24001.00000  3.468768404270e-05
24001.00000  25001.00000  3.220232936129e-05
25001.00000  26001.00000  2.966333393136e-05
26001.00000  27001.00000  2.801835097676e-05
27001.00000  28001.00000  2.614092477857e-05
28001.00000  29001.00000  2.517539130522e-05
29001.00000  30001.00000  2.238607238220e-05
30001.00000  31001.00000  2.129537716230e-05
31001.00000  32001.00000  1.995435844931e-05
32001.00000  33001.00000  1.877426198187e-05
33001.00000  34001.00000  1.639618879750e-05
34001.00000  35001.00000  1.603858380737e-05
35001.00000  36001.00000  1.464392434586e-05
36001.00000  37001.00000  1.360686987448e-05
37001.00000  38001.00000  1.301682164077e-05
38001.00000  39001.00000  1.278437839718e-05
39001.00000  40001.00000  1.178308442481e-05
40001.00000  41001.00000  1.124667693962e-05
41001.00000  42001.00000  9.959298975146e-06
42001.00000  43001.00000  1.006658047219e-05
43001.00000  44001.00000  8.582519763142e-06
44001.00000  45001.00000  7.956711030413e-06
45001.00000  46001.00000  7.777908535348e-06
46001.00000  47001.00000  7.473944293736e-06
47001.00000  48001.00000  6.830255311501e-06
48001.00000  49001.00000  6.186566329265e-06
49001.00000  50001.00000  5.453476099497e-06
50001.00000  51001.00000  5.435595849990e-06
51001.00000  52001.00000  5.596518095549e-06
52001.00000  53001.00000  5.060110610353e-06
53001.00000  54001.00000  4.666745121209e-06
54001.00000  55001.00000  4.434301877623e-06
55001.00000  56001.00000  4.666745121209e-06
56001.00000  57001.00000  4.183978384532e-06
57001.00000  58001.00000  4.362780879597e-06
58001.00000  59001.00000  3.665451148842e-06
59001.00000  60001.00000  3.647570899335e-06
60001.00000  61001.00000  3.343606657724e-06
61001.00000  62001.00000  3.218444911178e-06
62001.00000  63001.00000  3.111163414139e-06
63001.00000  64001.00000  2.914480669567e-06
64001.00000  65001.00000  2.735678174502e-06
65001.00000  66001.00000  2.735678174502e-06
66001.00000  67001.00000  2.825079422034e-06
67001.00000  68001.00000  2.324432435851e-06
68001.00000  69001.00000  2.413833683384e-06
69001.00000  70001.00000  2.235031188318e-06
70001.00000  71001.00000  2.360192934864e-06
71001.00000  72001.00000  2.056228693253e-06
72001.00000  73001.00000  2.163510190292e-06
73001.00000  74001.00000  2.252911437825e-06
74001.00000  75001.00000  1.734384202135e-06
75001.00000  76001.00000  1.519821208056e-06
76001.00000  77001.00000  1.698623703122e-06
77001.00000  78001.00000  1.698623703122e-06
78001.00000  79001.00000  1.573461956576e-06
79001.00000  80001.00000  1.519821208056e-06
80001.00000  81001.00000  1.448300210030e-06
81001.00000  82001.00000  1.430419960524e-06
82001.00000  83001.00000  1.448300210030e-06
83001.00000  84001.00000  1.269497714965e-06
84001.00000  85001.00000  1.484060709043e-06
85001.00000  86001.00000  1.162216217925e-06
86001.00000  87001.00000  1.215856966445e-06
87001.00000  88001.00000  1.072814970393e-06
88001.00000  89001.00000  9.297729743404e-07
89001.00000  90001.00000  1.019174221873e-06
90001.00000  91001.00000  9.834137228600e-07
91001.00000  92001.00000  1.001293972367e-06
92001.00000  93001.00000  1.001293972367e-06
93001.00000  94001.00000  7.509704792749e-07
94001.00000  95001.00000  6.258087327291e-07
95001.00000  96001.00000  7.867309782880e-07
96001.00000  97001.00000  8.046112277946e-07
97001.00000  98001.00000  7.867309782880e-07
98001.00000  99001.00000  7.688507287815e-07
99001.00000  100001.00000  7.867309782880e-07
100001.00000  101001.00000  6.615692317422e-07
101001.00000  102001.00000  5.900482337160e-07
102001.00000  103001.00000  5.900482337160e-07
103001.00000  104001.00000  3.754852396375e-07
104001.00000  105001.00000  5.721679842095e-07
105001.00000  106001.00000  6.079284832226e-07
106001.00000  107001.00000  6.436889822357e-07
107001.00000  108001.00000  4.827667366767e-07
108001.00000  109001.00000  7.152099802618e-07
109001.00000  110001.00000  5.542877347029e-07
110001.00000  111001.00000  3.576049901309e-07
111001.00000  112001.00000  6.079284832226e-07
112001.00000  113001.00000  4.827667366767e-07
113001.00000  114001.00000  5.185272356898e-07
114001.00000  115001.00000  4.291259881571e-07
115001.00000  116001.00000  4.470062376637e-07
116001.00000  117001.00000  4.291259881571e-07
117001.00000  118001.00000  5.185272356898e-07
118001.00000  119001.00000  3.397247406244e-07
119001.00000  120001.00000  4.470062376637e-07
120001.00000  121001.00000  3.218444911178e-07
121001.00000  122001.00000  4.291259881571e-07
122001.00000  123001.00000  3.576049901309e-07
123001.00000  124001.00000  4.470062376637e-07
124001.00000  125001.00000  4.291259881571e-07
125001.00000  126001.00000  3.754852396375e-07
126001.00000  127001.00000  1.966827445720e-07
127001.00000  128001.00000  3.397247406244e-07
128001.00000  129001.00000  3.933654891440e-07
129001.00000  130001.00000  2.324432435851e-07
130001.00000  131001.00000  1.966827445720e-07
131001.00000  132001.00000  2.860839921047e-07
132001.00000  133001.00000  3.039642416113e-07
133001.00000  134001.00000  3.397247406244e-07
134001.00000  135001.00000  2.860839921047e-07
135001.00000  136001.00000  3.039642416113e-07
136001.00000  137001.00000  3.039642416113e-07
137001.00000  138001.00000  3.576049901309e-07
138001.00000  139001.00000  1.609222455589e-07
139001.00000  140001.00000  2.145629940786e-07
140001.00000  141001.00000  2.324432435851e-07
141001.00000  142001.00000  1.430419960524e-07
142001.00000  143001.00000  1.966827445720e-07
143001.00000  144001.00000  8.940124753273e-08
144001.00000  145001.00000  1.251617465458e-07
145001.00000  146001.00000  1.430419960524e-07
146001.00000  147001.00000  1.609222455589e-07
147001.00000  148001.00000  2.145629940786e-07
148001.00000  149001.00000  1.430419960524e-07
149001.00000  150001.00000  5.364074851964e-08
150001.00000  151001.00000  2.145629940786e-07
151001.00000  152001.00000  1.966827445720e-07
152001.00000  153001.00000  1.430419960524e-07
153001.00000  154001.00000  1.430419960524e-07
154001.00000  155001.00000  1.966827445720e-07
155001.00000  156001.00000  1.251617465458e-07
156001.00000  157001.00000  1.609222455589e-07
157001.00000  158001.00000  7.152099802618e-08
158001.00000  159001.00000  1.430419960524e-07
159001.00000  160001.00000  1.072814970393e-07
160001.00000  161001.00000  5.364074851964e-08
161001.00000  162001.00000  1.251617465458e-07
162001.00000  163001.00000  1.072814970393e-07
163001.00000  164001.00000  1.072814970393e-07
164001.00000  165001.00000  1.072814970393e-07
165001.00000  166001.00000  1.430419960524e-07
166001.00000  167001.00000  1.072814970393e-07
167001.00000  168001.00000  3.576049901309e-08
168001.00000  169001.00000  8.940124753273e-08
169001.00000  170001.00000  5.364074851964e-08
170001.00000  171001.00000  7.152099802618e-08
171001.00000  172001.00000  7.152099802618e-08
172001.00000  173001.00000  3.576049901309e-08
173001.00000  174001.00000  7.152099802618e-08
174001.00000  175001.00000  1.788024950655e-08
175001.00000  176001.00000  1.788024950655e-08
176001.00000  177001.00000  7.152099802618e-08
177001.00000  178001.00000  1.788024950655e-08
178001.00000  179001.00000  0.000000000000e+00
179001.00000  180001.00000  5.364074851964e-08
180001.00000  181001.00000  8.940124753273e-08
181001.00000  182001.00000  3.576049901309e-08
182001.00000  183001.00000  5.364074851964e-08
183001.00000  184001.00000  1.072814970393e-07
184001.00000  185001.00000  3.576049901309e-08
185001.00000  186001.00000  7.152099802618e-08
186001.00000  187001.00000  3.576049901309e-08
187001.00000  188001.00000  3.576049901309e-08
188001.00000  189001.00000  3.576049901309e-08
189001.00000  190001.00000  3.576049901309e-08
190001.00000  191001.00000  1.072814970393e-07
191001.00000  192001.00000  3.576049901309e-08
192001.00000  193001.00000  3.576049901309e-08
193001.00000  194001.00000  1.788024950655e-08
194001.00000  195001.00000  5.364074851964e-08
195001.00000  196001.00000  1.788024950655e-08
196001.00000  197001.00000  7.152099802618e-08
197001.00000  198001.00000  1.788024950655e-08
198001.00000  199001.00000  3.576049901309e-08
