300.00000  350.00000  1.002534658053e-06
350.00000  400.00000  2.205576247716e-06
400.00000  450.00000  1.604055452884e-06
450.00000  500.00000  2.606590110937e-06
500.00000  550.00000  2.245677634038e-05
550.00000  600.00000  1.604055452884e-06
600.00000  650.00000  7.819770332811e-06
650.00000  700.00000  3.208110905769e-06
700.00000  750.00000  7.218249537979e-06
750.00000  800.00000  5.814701016706e-06
800.00000  850.00000  2.406083179326e-05
850.00000  900.00000  5.413687153484e-06
900.00000  950.00000  5.213180221874e-06
950.00000  1000.00000  5.012673290263e-06
1000.00000  1050.00000  6.616728743148e-06
1050.00000  1100.00000  6.015207948316e-06
1100.00000  1150.00000  6.817235674758e-06
1150.00000  1200.00000  7.218249537979e-06
1200.00000  1250.00000  6.416221811537e-06
1250.00000  1300.00000  2.105322781911e-05
1300.00000  1350.00000  1.002534658053e-05
1350.00000  1400.00000  7.619263401200e-06
1400.00000  1450.00000  7.819770332811e-06
1450.00000  1500.00000  9.022811922474e-06
1500.00000  1550.00000  1.002534658053e-05
1550.00000  1600.00000  8.220784196032e-06
1600.00000  1650.00000  1.182990896502e-05
1650.00000  1700.00000  1.243142975985e-05
1700.00000  1750.00000  3.428668530540e-05
1750.00000  1800.00000  1.042636044375e-05
1800.00000  1850.00000  1.343396441791e-05
1850.00000  1900.00000  1.203041589663e-05
1900.00000  1950.00000  1.263193669146e-05
1950.00000  2000.00000  1.403548521274e-05
2000.00000  2050.00000  1.423599214435e-05
2050.00000  2100.00000  1.403548521274e-05
2100.00000  2150.00000  1.423599214435e-05
2150.00000  2200.00000  1.363447134952e-05
2200.00000  2250.00000  1.483751293918e-05
2250.00000  2300.00000  1.483751293918e-05
2300.00000  2350.00000  4.351000415949e-05
2350.00000  2400.00000  1.443649907596e-05
2400.00000  2450.00000  1.624106146045e-05
2450.00000  2500.00000  2.045170702427e-05
2500.00000  2550.00000  1.624106146045e-05
2550.00000  2600.00000  1.704308918690e-05
2600.00000  2650.00000  1.784511691334e-05
2650.00000  2700.00000  1.824613077656e-05
2700.00000  2750.00000  2.225626940877e-05
2750.00000  2800.00000  1.704308918690e-05
2800.00000  2850.00000  2.005069316105e-05
2850.00000  2900.00000  1.904815850300e-05
2900.00000  2950.00000  1.824613077656e-05
2950.00000  3000.00000  2.726894269903e-05
3000.00000  3050.00000  1.383497828113e-05
3050.00000  3100.00000  1.563954066562e-05
3100.00000  3150.00000  1.844663770817e-05
3150.00000  3200.00000  1.884765157139e-05
3200.00000  3250.00000  2.165474861394e-05
3250.00000  3300.00000  2.085272088750e-05
3300.00000  3350.00000  1.684258225529e-05
3350.00000  3400.00000  2.165474861394e-05
3400.00000  3450.00000  1.664207532367e-05
3450.00000  3500.00000  2.085272088750e-05
3500.00000  3550.00000  1.924866543461e-05
3550.00000  3600.00000  1.624106146045e-05
3600.00000  3650.00000  1.844663770817e-05
3650.00000  3700.00000  2.666742190420e-05
3700.00000  3750.00000  1.764460998173e-05
3750.00000  3800.00000  1.744410305012e-05
3800.00000  3850.00000  1.744410305012e-05
3850.00000  3900.00000  1.804562384495e-05
3900.00000  3950.00000  2.025120009266e-05
3950.00000  4000.00000  2.045170702427e-05
4000.00000  4050.00000  2.145424168233e-05
4050.00000  4100.00000  1.964967929783e-05
4100.00000  4150.00000  2.085272088750e-05
4150.00000  4200.00000  1.584004759723e-05
4200.00000  4250.00000  1.924866543461e-05
4250.00000  4300.00000  1.904815850300e-05
4300.00000  4350.00000  1.904815850300e-05
4350.00000  4400.00000  2.426133872487e-05
4400.00000  4450.00000  1.684258225529e-05
4450.00000  4500.00000  1.684258225529e-05
4500.00000  4550.00000  1.864714463978e-05
4550.00000  4600.00000  1.964967929783e-05
4600.00000  4650.00000  1.824613077656e-05
4650.00000  4700.00000  1.924866543461e-05
4700.00000  4750.00000  1.724359611851e-05
4750.00000  4800.00000  1.864714463978e-05
4800.00000  4850.00000  2.165474861394e-05
4850.00000  4900.00000  2.526387338293e-05
4900.00000  4950.00000  2.005069316105e-05
4950.00000  5000.00000  2.606590110937e-05
5000.00000  5050.00000  2.085272088750e-05
5050.00000  5100.00000  1.964967929783e-05
5100.00000  5150.00000  2.466235258810e-05
5150.00000  5200.00000  1.964967929783e-05
5200.00000  5250.00000  1.864714463978e-05
5250.00000  5300.00000  2.446184565649e-05
5300.00000  5350.00000  2.085272088750e-05
5350.00000  5400.00000  2.285779020360e-05
5400.00000  5450.00000  3.288313678413e-05
5450.00000  5500.00000  2.005069316105e-05
5500.00000  5550.00000  2.486285951971e-05
5550.00000  5600.00000  2.365981793004e-05
5600.00000  5650.00000  2.546438031454e-05
5650.00000  5700.00000  2.285779020360e-05
5700.00000  5750.00000  2.386032486165e-05
5750.00000  5800.00000  2.145424168233e-05
5800.00000  5850.00000  2.546438031454e-05
5850.00000  5900.00000  3.007603974158e-05
5900.00000  5950.00000  2.466235258810e-05
5950.00000  6000.00000  3.168009519446e-05
6000.00000  6050.00000  2.987553280997e-05
6050.00000  6100.00000  2.867249122031e-05
6100.00000  6150.00000  3.368516451057e-05
6150.00000  6200.00000  4.290848336465e-05
6200.00000  6250.00000  5.413687153484e-05
6250.00000  6300.00000  9.022811922474e-05
6300.00000  6350.00000  8.962659842991e-05
6350.00000  6400.00000  6.678885891947e-04
6400.00000  6450.00000  2.766995656225e-05
6450.00000  6500.00000  3.288313678413e-05
6500.00000  6550.00000  2.787046349386e-05
6550.00000  6600.00000  3.228161598930e-05
6600.00000  6650.00000  3.107857439963e-05
6650.00000  6700.00000  2.987553280997e-05
6700.00000  6750.00000  2.887299815192e-05
6750.00000  6800.00000  3.228161598930e-05
6800.00000  6850.00000  3.348465757896e-05
6850.00000  6900.00000  3.970037245889e-05
6900.00000  6950.00000  3.929935859567e-05
6950.00000  7000.00000  3.729428927956e-05
7000.00000  7050.00000  2.967502587836e-05
7050.00000  7100.00000  9.243369547246e-05
7100.00000  7150.00000  1.704308918690e-05
7150.00000  7200.00000  1.724359611851e-05
7200.00000  7250.00000  1.844663770817e-05
7250.00000  7300.00000  1.764460998173e-05
7300.00000  7350.00000  1.644156839206e-05
7350.00000  7400.00000  1.604055452884e-05
7400.00000  7450.00000  1.624106146045e-05
7450.00000  7500.00000  4.571558040720e-05
7500.00000  7550.00000  1.483751293918e-05
7550.00000  7600.00000  1.624106146045e-05
7600.00000  7650.00000  1.543903373401e-05
7650.00000  7700.00000  1.744410305012e-05
7700.00000  7750.00000  1.664207532367e-05
7750.00000  7800.00000  1.664207532367e-05
7800.00000  7850.00000  1.563954066562e-05
7850.00000  7900.00000  1.664207532367e-05
7900.00000  7950.00000  1.584004759723e-05
7950.00000  8000.00000  1.684258225529e-05
8000.00000  8050.00000  1.584004759723e-05
8050.00000  8100.00000  1.664207532367e-05
8100.00000  8150.00000  1.764460998173e-05
8150.00000  8200.00000  1.584004759723e-05
8200.00000  8250.00000  1.884765157139e-05
8250.00000  8300.00000  2.105322781911e-05
8300.00000  8350.00000  1.503801987079e-05
8350.00000  8400.00000  1.604055452884e-05
8400.00000  8450.00000  1.724359611851e-05
8450.00000  8500.00000  1.704308918690e-05
8500.00000  8550.00000  1.664207532367e-05
8550.00000  8600.00000  1.704308918690e-05
8600.00000  8650.00000  1.884765157139e-05
8650.00000  8700.00000  2.406083179326e-05
8700.00000  8750.00000  1.824613077656e-05
8750.00000  8800.00000  1.884765157139e-05
8800.00000  8850.00000  1.924866543461e-05
8850.00000  8900.00000  1.784511691334e-05
8900.00000  8950.00000  1.864714463978e-05
8950.00000  9000.00000  1.985018622944e-05
9000.00000  9050.00000  1.684258225529e-05
9050.00000  9100.00000  1.584004759723e-05
9100.00000  9150.00000  2.005069316105e-05
9150.00000  9200.00000  1.884765157139e-05
9200.00000  9250.00000  1.804562384495e-05
9250.00000  9300.00000  1.904815850300e-05
9300.00000  9350.00000  1.944917236622e-05
9350.00000  9400.00000  1.924866543461e-05
9400.00000  9450.00000  1.924866543461e-05
9450.00000  9500.00000  2.065221395589e-05
9500.00000  9550.00000  1.964967929783e-05
9550.00000  9600.00000  1.704308918690e-05
9600.00000  9650.00000  2.145424168233e-05
9650.00000  9700.00000  2.466235258810e-05
9700.00000  9750.00000  2.065221395589e-05
9750.00000  9800.00000  2.225626940877e-05
9800.00000  9850.00000  2.265728327199e-05
9850.00000  9900.00000  2.566488724615e-05
9900.00000  9950.00000  2.365981793004e-05
9950.00000  10000.00000  2.125373475072e-05
