300.00000  350.00000  1.593656319645e-01
350.00000  400.00000  1.263618367707e-01
400.00000  450.00000  1.034296747521e-01
450.00000  500.00000  8.661670061003e-02
500.00000  550.00000  7.378199844378e-02
550.00000  600.00000  6.360185467698e-02
600.00000  650.00000  5.557515467674e-02
650.00000  700.00000  4.901421497766e-02
700.00000  750.00000  4.397473639854e-02
750.00000  800.00000  3.942924120559e-02
800.00000  850.00000  3.574315760802e-02
850.00000  900.00000  3.232574854822e-02
900.00000  950.00000  2.974134619738e-02
950.00000  1000.00000  2.729937604412e-02
1000.00000  1050.00000  2.526215232509e-02
1050.00000  1100.00000  2.336793901283e-02
1100.00000  1150.00000  2.159977530438e-02
1150.00000  1200.00000  2.031422353467e-02
1200.00000  1250.00000  1.892921978397e-02
1250.00000  1300.00000  1.786762770787e-02
1300.00000  1350.00000  1.672180982616e-02
1350.00000  1400.00000  1.582654926090e-02
1400.00000  1450.00000  1.480755192859e-02
1450.00000  1500.00000  1.402407847373e-02
1500.00000  1550.00000  1.325101278433e-02
1550.00000  1600.00000  1.272002400988e-02
1600.00000  1650.00000  1.205142144779e-02
1650.00000  1700.00000  1.140575451697e-02
1700.00000  1750.00000  1.104591566329e-02
1750.00000  1800.00000  1.039716495012e-02
1800.00000  1850.00000  9.902796091151e-03
1850.00000  1900.00000  9.511541204716e-03
1900.00000  1950.00000  9.186202166143e-03
1950.00000  2000.00000  8.811522609872e-03
2000.00000  2050.00000  8.462476994437e-03
2050.00000  2100.00000  8.070065689618e-03
2100.00000  2150.00000  7.820472055168e-03
2150.00000  2200.00000  7.464873402226e-03
2200.00000  2250.00000  7.228578579187e-03
2250.00000  2300.00000  7.062054331955e-03
2300.00000  2350.00000  6.904203222600e-03
2350.00000  2400.00000  6.569420100562e-03
2400.00000  2450.00000  6.405786899289e-03
2450.00000  2500.00000  6.160626201976e-03
2500.00000  2550.00000  5.934160935197e-03
2550.00000  2600.00000  5.706924722829e-03
2600.00000  2650.00000  5.561023270104e-03
2650.00000  2700.00000  5.388138721763e-03
2700.00000  2750.00000  5.252259561696e-03
2750.00000  2800.00000  5.135075832163e-03
2800.00000  2850.00000  4.961998547425e-03
2850.00000  2900.00000  4.832479688467e-03
2900.00000  2950.00000  4.712019440180e-03
2950.00000  3000.00000  4.615843977948e-03
3000.00000  3050.00000  4.425613153854e-03
3050.00000  3100.00000  4.346205758183e-03
3100.00000  3150.00000  4.222468991143e-03
3150.00000  3200.00000  4.133810248404e-03
3200.00000  3250.00000  4.024143238364e-03
3250.00000  3300.00000  3.893660697420e-03
3300.00000  3350.00000  3.798256180777e-03
3350.00000  3400.00000  3.736002324462e-03
3400.00000  3450.00000  3.690902007504e-03
3450.00000  3500.00000  3.527076069834e-03
3500.00000  3550.00000  3.466364104697e-03
3550.00000  3600.00000  3.394280692122e-03
3600.00000  3650.00000  3.292708610767e-03
3650.00000  3700.00000  3.274976862219e-03
3700.00000  3750.00000  3.267267406329e-03
3750.00000  3800.00000  3.110958188152e-03
3800.00000  3850.00000  3.088022556878e-03
3850.00000  3900.00000  2.978162810441e-03
3900.00000  3950.00000  2.897213523592e-03
3950.00000  4000.00000  2.872350528346e-03
4000.00000  4050.00000  2.805470998497e-03
4050.00000  4100.00000  2.783884522004e-03
4100.00000  4150.00000  2.724907184443e-03
4150.00000  4200.00000  2.657642181800e-03
4200.00000  4250.00000  2.595388325485e-03
4250.00000  4300.00000  2.545084125801e-03
4300.00000  4350.00000  2.524846804089e-03
4350.00000  4400.00000  2.453341600706e-03
4400.00000  4450.00000  2.428864078254e-03
4450.00000  4500.00000  2.382221870117e-03
4500.00000  4550.00000  2.363333703186e-03
4550.00000  4600.00000  2.287010089871e-03
4600.00000  4650.00000  2.279493370378e-03
4650.00000  4700.00000  2.214541204502e-03
4700.00000  4750.00000  2.187172636091e-03
4750.00000  4800.00000  2.126267934558e-03
4800.00000  4850.00000  2.121642261023e-03
4850.00000  4900.00000  2.065170496627e-03
4900.00000  4950.00000  2.058617459120e-03
4950.00000  5000.00000  1.969187770792e-03
5000.00000  5050.00000  1.992316138463e-03
5050.00000  5100.00000  1.974198917121e-03
5100.00000  5150.00000  1.934687955683e-03
5150.00000  5200.00000  1.912137797203e-03
5200.00000  5250.00000  1.882263655628e-03
5250.00000  5300.00000  1.850076677286e-03
5300.00000  5350.00000  1.818467908136e-03
5350.00000  5400.00000  1.753130269465e-03
5400.00000  5450.00000  1.742529767616e-03
5450.00000  5500.00000  1.724605282671e-03
5500.00000  5550.00000  1.686250739616e-03
5550.00000  5600.00000  1.683552430055e-03
5600.00000  5650.00000  1.677577601739e-03
5650.00000  5700.00000  1.609156180713e-03
5700.00000  5750.00000  1.600290306439e-03
5750.00000  5800.00000  1.609156180713e-03
5800.00000  5850.00000  1.555768198672e-03
5850.00000  5900.00000  1.569452482877e-03
5900.00000  5950.00000  1.516449973631e-03
5950.00000  6000.00000  1.494092551549e-03
6000.00000  6050.00000  1.487732250440e-03
6050.00000  6100.00000  1.483877522495e-03
6100.00000  6150.00000  1.445715715837e-03
6150.00000  6200.00000  1.447835816207e-03
6200.00000  6250.00000  1.423165557358e-03
6250.00000  6300.00000  1.384425541509e-03
6300.00000  6350.00000  1.410059482344e-03
6350.00000  6400.00000  2.071916270531e-03
6400.00000  6450.00000  1.346841944044e-03
6450.00000  6500.00000  1.309258346578e-03
6500.00000  6550.00000  1.295381325976e-03
6550.00000  6600.00000  1.316389593277e-03
6600.00000  6650.00000  1.284973560524e-03
6650.00000  6700.00000  1.240258716360e-03
6700.00000  6750.00000  1.267627284770e-03
6750.00000  6800.00000  1.222141495017e-03
6800.00000  6850.00000  1.195736608593e-03
6850.00000  6900.00000  1.206337110442e-03
6900.00000  6950.00000  1.202482382497e-03
6950.00000  7000.00000  1.187256207113e-03
7000.00000  7050.00000  1.181281378798e-03
7050.00000  7100.00000  1.234476624442e-03
7100.00000  7150.00000  1.139457580593e-03
7150.00000  7200.00000  1.119027522484e-03
7200.00000  7250.00000  1.085491389361e-03
7250.00000  7300.00000  1.076240042292e-03
7300.00000  7350.00000  1.076818251484e-03
7350.00000  7400.00000  1.050027892265e-03
7400.00000  7450.00000  1.054075356608e-03
7450.00000  7500.00000  1.072192577950e-03
7500.00000  7550.00000  1.007433148471e-03
7550.00000  7600.00000  9.941343370602e-04
7600.00000  7650.00000  9.979890650054e-04
7650.00000  7700.00000  1.002614738540e-03
7700.00000  7750.00000  1.001843792951e-03
7750.00000  7800.00000  9.925924458822e-04
7800.00000  7850.00000  9.542379028277e-04
7850.00000  7900.00000  9.432519281839e-04
7900.00000  7950.00000  9.124141046226e-04
7950.00000  8000.00000  9.515395932661e-04
8000.00000  8050.00000  9.392044638415e-04
8050.00000  8100.00000  9.220509244855e-04
8100.00000  8150.00000  9.181961965403e-04
8150.00000  8200.00000  8.958387744583e-04
8200.00000  8250.00000  8.892857369515e-04
8250.00000  8300.00000  8.921767829104e-04
8300.00000  8350.00000  8.449563655820e-04
8350.00000  8400.00000  8.650009508969e-04
8400.00000  8450.00000  8.486183571299e-04
8450.00000  8500.00000  8.522803486779e-04
8500.00000  8550.00000  8.364759641026e-04
8550.00000  8600.00000  8.437999471985e-04
8600.00000  8650.00000  8.243335710753e-04
8650.00000  8700.00000  8.096856048837e-04
8700.00000  8750.00000  8.033253037741e-04
8750.00000  8800.00000  8.100710776782e-04
8800.00000  8850.00000  7.836661912538e-04
8850.00000  8900.00000  7.956158478838e-04
8900.00000  8950.00000  7.705601162402e-04
8950.00000  9000.00000  7.613087691718e-04
9000.00000  9050.00000  7.549484680622e-04
9050.00000  9100.00000  7.512864765143e-04
9100.00000  9150.00000  7.595741415964e-04
9150.00000  9200.00000  7.574540412266e-04
9200.00000  9250.00000  7.428060750349e-04
9250.00000  9300.00000  7.374094559117e-04
9300.00000  9350.00000  7.196777073639e-04
9350.00000  9400.00000  7.075353143366e-04
9400.00000  9450.00000  7.131246698571e-04
9450.00000  9500.00000  6.967420760901e-04
9500.00000  9550.00000  6.992476492545e-04
9550.00000  9600.00000  7.042587955832e-04
9600.00000  9650.00000  6.795885367341e-04
9650.00000  9700.00000  6.926946117477e-04
9700.00000  9750.00000  6.709153988574e-04
9750.00000  9800.00000  6.682170892958e-04
9800.00000  9850.00000  6.497143951590e-04
9850.00000  9900.00000  6.331390649947e-04
9900.00000  9950.00000  6.556892234740e-04
9950.00000  10000.00000  6.341027469810e-04
