300.00000  350.00000  5.583144158284e-05
350.00000  400.00000  5.082586406162e-05
400.00000  450.00000  4.755298645159e-05
450.00000  500.00000  5.101838627398e-05
500.00000  550.00000  6.757529653647e-05
550.00000  600.00000  4.042966459447e-05
600.00000  650.00000  7.104069635886e-05
650.00000  700.00000  1.108927943163e-04
700.00000  750.00000  1.501673256366e-04
750.00000  800.00000  2.125445224395e-04
800.00000  850.00000  3.007196956979e-04
850.00000  900.00000  3.039925733080e-04
900.00000  950.00000  3.242074056052e-04
950.00000  1000.00000  3.794612805510e-04
1000.00000  1050.00000  4.131526677130e-04
1050.00000  1100.00000  4.379880331068e-04
1100.00000  1150.00000  4.503094546975e-04
1150.00000  1200.00000  4.514645879716e-04
1200.00000  1250.00000  4.506944991222e-04
1250.00000  1300.00000  4.399132552303e-04
1300.00000  1350.00000  3.998686350606e-04
1350.00000  1400.00000  4.050667347941e-04
1400.00000  1450.00000  3.811939804622e-04
1450.00000  1500.00000  3.981359351494e-04
1500.00000  1550.00000  3.586688816167e-04
1550.00000  1600.00000  3.509679931225e-04
1600.00000  1650.00000  3.357587383465e-04
1650.00000  1700.00000  3.165065171110e-04
1700.00000  1750.00000  3.232447945434e-04
1750.00000  1800.00000  2.706862305706e-04
1800.00000  1850.00000  2.583648089799e-04
1850.00000  1900.00000  2.512414871228e-04
1900.00000  1950.00000  2.364172767715e-04
1950.00000  2000.00000  2.237108107561e-04
2000.00000  2050.00000  2.150473112001e-04
2050.00000  2100.00000  1.992604897870e-04
2100.00000  2150.00000  1.803933129763e-04
2150.00000  2200.00000  1.859764571346e-04
2200.00000  2250.00000  1.719223356327e-04
2250.00000  2300.00000  1.665317136868e-04
2300.00000  2350.00000  1.850138460728e-04
2350.00000  2400.00000  1.532476810343e-04
2400.00000  2450.00000  1.440066148413e-04
2450.00000  2500.00000  1.359206819224e-04
2500.00000  2550.00000  1.297599711270e-04
2550.00000  2600.00000  1.191712494475e-04
2600.00000  2650.00000  1.164759384746e-04
2650.00000  2700.00000  1.108927943163e-04
2700.00000  2750.00000  1.010741614862e-04
2750.00000  2800.00000  1.070423500692e-04
2800.00000  2850.00000  8.952282874490e-05
2850.00000  2900.00000  8.913778432019e-05
2900.00000  2950.00000  8.509481786075e-05
2950.00000  3000.00000  1.026143391850e-04
3000.00000  3050.00000  7.777897379127e-05
3050.00000  3100.00000  8.490229564839e-05
3100.00000  3150.00000  7.720140715421e-05
3150.00000  3200.00000  7.489114060595e-05
3200.00000  3250.00000  7.412105175653e-05
3250.00000  3300.00000  7.431357396889e-05
3300.00000  3350.00000  6.738277432412e-05
3350.00000  3400.00000  7.566122945537e-05
3400.00000  3450.00000  6.796034096118e-05
3450.00000  3500.00000  6.661268547470e-05
3500.00000  3550.00000  5.948936361758e-05
3550.00000  3600.00000  6.391737450174e-05
3600.00000  3650.00000  6.256971901525e-05
3650.00000  3700.00000  8.028176255188e-05
3700.00000  3750.00000  6.449494113880e-05
3750.00000  3800.00000  6.160710795348e-05
3800.00000  3850.00000  5.987440804229e-05
3850.00000  3900.00000  6.102954131642e-05
3900.00000  3950.00000  5.679405264462e-05
3950.00000  4000.00000  5.910431919287e-05
4000.00000  4050.00000  6.353233007703e-05
4050.00000  4100.00000  5.621648600755e-05
4100.00000  4150.00000  5.660153043226e-05
4150.00000  4200.00000  5.313613060988e-05
4200.00000  4250.00000  5.429126388401e-05
4250.00000  4300.00000  5.602396379520e-05
4300.00000  4350.00000  6.584259662528e-05
4350.00000  4400.00000  4.832307530101e-05
4400.00000  4450.00000  5.621648600755e-05
4450.00000  4500.00000  5.814170813110e-05
4500.00000  4550.00000  5.583144158284e-05
4550.00000  4600.00000  5.602396379520e-05
4600.00000  4650.00000  5.679405264462e-05
4650.00000  4700.00000  5.717909706932e-05
4700.00000  4750.00000  5.583144158284e-05
4750.00000  4800.00000  5.948936361758e-05
4800.00000  4850.00000  6.199215237819e-05
4850.00000  4900.00000  5.525387494578e-05
4900.00000  4950.00000  5.486883052107e-05
4950.00000  5000.00000  5.679405264462e-05
5000.00000  5050.00000  5.583144158284e-05
5050.00000  5100.00000  6.353233007703e-05
5100.00000  5150.00000  6.218467459055e-05
5150.00000  5200.00000  5.525387494578e-05
5200.00000  5250.00000  6.102954131642e-05
5250.00000  5300.00000  5.544639715813e-05
5300.00000  5350.00000  6.391737450174e-05
5350.00000  5400.00000  5.563891937049e-05
5400.00000  5450.00000  6.776781874883e-05
5450.00000  5500.00000  5.814170813110e-05
5500.00000  5550.00000  6.141458574113e-05
5550.00000  5600.00000  5.910431919287e-05
5600.00000  5650.00000  6.622764104999e-05
5650.00000  5700.00000  6.661268547470e-05
5700.00000  5750.00000  6.218467459055e-05
5750.00000  5800.00000  5.679405264462e-05
5800.00000  5850.00000  6.314728565232e-05
5850.00000  5900.00000  7.700888494185e-05
5900.00000  5950.00000  6.545755220057e-05
5950.00000  6000.00000  6.545755220057e-05
6000.00000  6050.00000  6.622764104999e-05
6050.00000  6100.00000  6.333980786467e-05
6100.00000  6150.00000  7.893410706540e-05
6150.00000  6200.00000  8.702003998429e-05
6200.00000  6250.00000  9.837885051322e-05
6250.00000  6300.00000  1.453542703277e-04
6300.00000  6350.00000  1.480495813007e-04
6350.00000  6400.00000  1.024025647514e-03
6400.00000  6450.00000  7.046312972179e-05
6450.00000  6500.00000  6.853790759825e-05
6500.00000  6550.00000  7.315844069476e-05
6550.00000  6600.00000  6.950051866002e-05
6600.00000  6650.00000  7.181078520828e-05
6650.00000  6700.00000  6.796034096118e-05
6700.00000  6750.00000  7.373600733182e-05
6750.00000  6800.00000  6.719025211177e-05
6800.00000  6850.00000  7.315844069476e-05
6850.00000  6900.00000  8.316959573720e-05
6900.00000  6950.00000  8.836769547077e-05
6950.00000  7000.00000  7.758645157892e-05
7000.00000  7050.00000  8.586490671016e-05
7050.00000  7100.00000  1.769279131539e-04
7100.00000  7150.00000  3.965957574505e-05
7150.00000  7200.00000  3.580913149796e-05
7200.00000  7250.00000  3.715678698444e-05
7250.00000  7300.00000  3.946705353270e-05
7300.00000  7350.00000  4.216236450566e-05
7350.00000  7400.00000  3.792687583386e-05
7400.00000  7450.00000  3.831192025857e-05
7450.00000  7500.00000  7.797149600362e-05
7500.00000  7550.00000  3.426895379912e-05
7550.00000  7600.00000  3.523156486090e-05
7600.00000  7650.00000  3.542408707325e-05
7650.00000  7700.00000  3.426895379912e-05
7700.00000  7750.00000  3.426895379912e-05
7750.00000  7800.00000  3.831192025857e-05
7800.00000  7850.00000  3.773435362151e-05
7850.00000  7900.00000  4.004462016976e-05
7900.00000  7950.00000  3.715678698444e-05
7950.00000  8000.00000  4.273993114273e-05
8000.00000  8050.00000  3.908200910799e-05
8050.00000  8100.00000  3.888948689564e-05
8100.00000  8150.00000  4.216236450566e-05
8150.00000  8200.00000  4.196984229331e-05
8200.00000  8250.00000  4.582028654040e-05
8250.00000  8300.00000  4.447263105392e-05
8300.00000  8350.00000  3.484652043619e-05
8350.00000  8400.00000  3.773435362151e-05
8400.00000  8450.00000  4.023714238212e-05
8450.00000  8500.00000  3.734930919680e-05
8500.00000  8550.00000  4.177732008095e-05
8550.00000  8600.00000  3.946705353270e-05
8600.00000  8650.00000  4.466515326627e-05
8650.00000  8700.00000  4.331749777979e-05
8700.00000  8750.00000  5.217351954810e-05
8750.00000  8800.00000  4.042966459447e-05
8800.00000  8850.00000  4.004462016976e-05
8850.00000  8900.00000  4.062218680683e-05
8900.00000  8950.00000  4.562776432805e-05
8950.00000  9000.00000  3.888948689564e-05
9000.00000  9050.00000  4.890064193808e-05
9050.00000  9100.00000  4.293245335508e-05
9100.00000  9150.00000  4.466515326627e-05
9150.00000  9200.00000  4.947820857514e-05
9200.00000  9250.00000  4.062218680683e-05
9250.00000  9300.00000  4.119975344389e-05
9300.00000  9350.00000  4.062218680683e-05
9350.00000  9400.00000  4.042966459447e-05
9400.00000  9450.00000  4.524271990334e-05
9450.00000  9500.00000  4.736046423924e-05
9500.00000  9550.00000  4.042966459447e-05
9550.00000  9600.00000  4.100723123154e-05
9600.00000  9650.00000  4.659037538982e-05
9650.00000  9700.00000  5.159595291104e-05
9700.00000  9750.00000  4.832307530101e-05
9750.00000  9800.00000  4.793803087630e-05
9800.00000  9850.00000  4.716794202688e-05
9850.00000  9900.00000  4.389506441686e-05
9900.00000  9950.00000  4.466515326627e-05
9950.00000  10000.00000  5.101838627398e-05
