300.00000  350.00000  2.227596076630e-01
350.00000  400.00000  1.672651521317e-01
400.00000  450.00000  1.295720033341e-01
450.00000  500.00000  1.035744585629e-01
500.00000  550.00000  8.465378583025e-02
550.00000  600.00000  7.069789392738e-02
600.00000  650.00000  5.935334278657e-02
650.00000  700.00000  5.105509925056e-02
700.00000  750.00000  4.415721799230e-02
750.00000  800.00000  3.830094759815e-02
800.00000  850.00000  3.404327658266e-02
850.00000  900.00000  3.008276875531e-02
900.00000  950.00000  2.694215418019e-02
950.00000  1000.00000  2.436776635345e-02
1000.00000  1050.00000  2.201740569704e-02
1050.00000  1100.00000  1.975480826199e-02
1100.00000  1150.00000  1.804496515099e-02
1150.00000  1200.00000  1.660341574741e-02
1200.00000  1250.00000  1.531622183404e-02
1250.00000  1300.00000  1.415605363580e-02
1300.00000  1350.00000  1.295315860611e-02
1350.00000  1400.00000  1.210632050521e-02
1400.00000  1450.00000  1.122175961618e-02
1450.00000  1500.00000  1.050079245118e-02
1500.00000  1550.00000  9.750185952657e-03
1550.00000  1600.00000  9.162018398939e-03
1600.00000  1650.00000  8.663923625045e-03
1650.00000  1700.00000  8.024560858864e-03
1700.00000  1750.00000  7.700452822065e-03
1750.00000  1800.00000  7.227763191197e-03
1800.00000  1850.00000  6.795490833328e-03
1850.00000  1900.00000  6.412104129465e-03
1900.00000  1950.00000  6.102238369817e-03
1950.00000  2000.00000  5.808924445777e-03
2000.00000  2050.00000  5.434006122924e-03
2050.00000  2100.00000  5.158398813721e-03
2100.00000  2150.00000  5.034452509862e-03
2150.00000  2200.00000  4.768853287306e-03
2200.00000  2250.00000  4.516341562673e-03
2250.00000  2300.00000  4.318489388190e-03
2300.00000  2350.00000  4.204936097387e-03
2350.00000  2400.00000  3.957043489669e-03
2400.00000  2450.00000  3.779977341298e-03
2450.00000  2500.00000  3.710690587588e-03
2500.00000  2550.00000  3.590978474233e-03
2550.00000  2600.00000  3.371185494408e-03
2600.00000  2650.00000  3.182186627344e-03
2650.00000  2700.00000  3.144848765622e-03
2700.00000  2750.00000  2.971631881347e-03
2750.00000  2800.00000  2.894646599446e-03
2800.00000  2850.00000  2.762231914578e-03
2850.00000  2900.00000  2.657531931194e-03
2900.00000  2950.00000  2.590554735941e-03
2950.00000  3000.00000  2.533585627335e-03
3000.00000  3050.00000  2.423111747808e-03
3050.00000  3100.00000  2.374226093801e-03
3100.00000  3150.00000  2.266061772732e-03
3150.00000  3200.00000  2.238731997657e-03
3200.00000  3250.00000  2.144809953739e-03
3250.00000  3300.00000  2.060511070058e-03
3300.00000  3350.00000  2.035490853441e-03
3350.00000  3400.00000  1.941568809522e-03
3400.00000  3450.00000  1.816852652844e-03
3450.00000  3500.00000  1.795681700321e-03
3500.00000  3550.00000  1.736403033258e-03
3550.00000  3600.00000  1.645175474207e-03
3600.00000  3650.00000  1.662112236225e-03
3650.00000  3700.00000  1.670195690824e-03
3700.00000  3750.00000  1.564340928211e-03
3750.00000  3800.00000  1.567035413078e-03
3800.00000  3850.00000  1.505062261148e-03
3850.00000  3900.00000  1.440394624352e-03
3900.00000  3950.00000  1.362254563224e-03
3950.00000  4000.00000  1.403826615450e-03
4000.00000  4050.00000  1.359945004767e-03
4050.00000  4100.00000  1.281804943638e-03
4100.00000  4150.00000  1.217522233251e-03
4150.00000  4200.00000  1.267562666486e-03
4200.00000  4250.00000  1.246776640373e-03
4250.00000  4300.00000  1.162092830283e-03
4300.00000  4350.00000  1.153624449274e-03
4350.00000  4400.00000  1.153624449274e-03
4400.00000  4450.00000  1.100889531172e-03
4450.00000  4500.00000  1.086262327611e-03
4500.00000  4550.00000  1.029678145415e-03
4550.00000  4600.00000  1.040841011290e-03
4600.00000  4650.00000  9.846417555032e-04
4650.00000  4700.00000  1.026213807729e-03
4700.00000  4750.00000  9.773281537227e-04
4750.00000  4800.00000  9.630858765711e-04
4800.00000  4850.00000  9.380656599536e-04
4850.00000  4900.00000  8.826362569855e-04
4900.00000  4950.00000  8.683939798339e-04
4950.00000  5000.00000  8.699336854719e-04
5000.00000  5050.00000  8.749377287954e-04
5050.00000  5100.00000  7.844800225627e-04
5100.00000  5150.00000  8.075756071328e-04
5150.00000  5200.00000  7.879443602482e-04
5200.00000  5250.00000  8.183535465988e-04
5250.00000  5300.00000  7.552256154407e-04
5300.00000  5350.00000  7.317451044611e-04
5350.00000  5400.00000  7.298204724136e-04
5400.00000  5450.00000  7.040304029771e-04
5450.00000  5500.00000  7.159631216716e-04
5500.00000  5550.00000  6.539899697419e-04
5550.00000  5600.00000  6.790101863595e-04
5600.00000  5650.00000  6.959469483775e-04
5650.00000  5700.00000  6.832443768640e-04
5700.00000  5750.00000  6.266601946674e-04
5750.00000  5800.00000  6.262752682579e-04
5800.00000  5850.00000  6.366682813144e-04
5850.00000  5900.00000  6.081837270113e-04
5900.00000  5950.00000  5.939414498598e-04
5950.00000  6000.00000  5.550638825002e-04
6000.00000  6050.00000  6.016399780498e-04
6050.00000  6100.00000  5.750800557943e-04
6100.00000  6150.00000  5.654568955568e-04
6150.00000  6200.00000  5.485201335387e-04
6200.00000  6250.00000  5.592980730047e-04
6250.00000  6300.00000  5.770046878418e-04
6300.00000  6350.00000  5.573734409572e-04
6350.00000  6400.00000  8.668542741959e-04
6400.00000  6450.00000  5.173410943691e-04
6450.00000  6500.00000  4.707649988195e-04
6500.00000  6550.00000  4.784635270096e-04
6550.00000  6600.00000  5.000194059416e-04
6600.00000  6650.00000  4.823127911046e-04
6650.00000  6700.00000  4.919359513421e-04
6700.00000  6750.00000  4.773087477811e-04
6750.00000  6800.00000  4.776936741906e-04
6800.00000  6850.00000  4.376613276025e-04
6850.00000  6900.00000  4.442050765640e-04
6900.00000  6950.00000  4.392010332405e-04
6950.00000  7000.00000  4.422804445165e-04
7000.00000  7050.00000  4.249587560889e-04
7050.00000  7100.00000  4.596021329440e-04
7100.00000  7150.00000  4.257286089079e-04
7150.00000  7200.00000  3.941646433289e-04
7200.00000  7250.00000  4.026330243379e-04
7250.00000  7300.00000  4.064822884329e-04
7300.00000  7350.00000  3.891606000054e-04
7350.00000  7400.00000  3.818469982248e-04
7400.00000  7450.00000  3.587514136548e-04
7450.00000  7500.00000  3.783826605393e-04
7500.00000  7550.00000  3.699142795303e-04
7550.00000  7600.00000  3.383503139512e-04
7600.00000  7650.00000  3.672197946638e-04
7650.00000  7700.00000  3.468186949603e-04
7700.00000  7750.00000  3.356558290847e-04
7750.00000  7800.00000  3.572117080168e-04
7800.00000  7850.00000  3.214135519332e-04
7850.00000  7900.00000  3.233381839807e-04
7900.00000  7950.00000  3.110205388767e-04
7950.00000  8000.00000  3.037069370962e-04
8000.00000  8050.00000  3.144848765622e-04
8050.00000  8100.00000  2.971631881347e-04
8100.00000  8150.00000  2.960084089062e-04
8150.00000  8200.00000  3.079411276007e-04
8200.00000  8250.00000  2.883098807161e-04
8250.00000  8300.00000  2.833058373926e-04
8300.00000  8350.00000  2.756073092026e-04
8350.00000  8400.00000  2.925440712206e-04
8400.00000  8450.00000  2.783017940691e-04
8450.00000  8500.00000  2.948536296777e-04
8500.00000  8550.00000  2.644444433271e-04
8550.00000  8600.00000  2.609801056416e-04
8600.00000  8650.00000  2.686786338316e-04
8650.00000  8700.00000  2.663690753746e-04
8700.00000  8750.00000  2.586705471846e-04
8750.00000  8800.00000  2.451981228520e-04
8800.00000  8850.00000  2.502021661756e-04
8850.00000  8900.00000  2.498172397661e-04
8900.00000  8950.00000  2.582856207751e-04
8950.00000  9000.00000  2.405790059380e-04
9000.00000  9050.00000  2.425036379855e-04
9050.00000  9100.00000  2.244120967390e-04
9100.00000  9150.00000  2.417337851665e-04
9150.00000  9200.00000  2.455830492615e-04
9200.00000  9250.00000  2.324955513385e-04
9250.00000  9300.00000  2.398091531190e-04
9300.00000  9350.00000  2.093999667685e-04
9350.00000  9400.00000  2.286462872435e-04
9400.00000  9450.00000  2.186382005965e-04
9450.00000  9500.00000  2.194080534155e-04
9500.00000  9550.00000  2.259518023770e-04
9550.00000  9600.00000  2.155587893205e-04
9600.00000  9650.00000  2.224874646915e-04
9650.00000  9700.00000  2.174834213680e-04
9700.00000  9750.00000  1.978521744834e-04
9750.00000  9800.00000  1.955426160264e-04
9800.00000  9850.00000  2.213326854630e-04
9850.00000  9900.00000  2.001617329404e-04
9900.00000  9950.00000  2.059356290830e-04
9950.00000  10000.00000  2.067054819020e-04
