10001.00000  11001.00000  9.146893276072e-05
11001.00000  12001.00000  8.078839977527e-05
12001.00000  13001.00000  7.012714573024e-05
13001.00000  14001.00000  6.321564559435e-05
14001.00000  15001.00000  5.299780717867e-05
15001.00000  16001.00000  4.698277777171e-05
16001.00000  17001.00000  4.165215074919e-05
17001.00000  18001.00000  3.531901882551e-05
18001.00000  19001.00000  3.195484372450e-05
19001.00000  20001.00000  2.730861908643e-05
20001.00000  21001.00000  2.404083868745e-05
21001.00000  22001.00000  2.122611338804e-05
22001.00000  23001.00000  1.911506941348e-05
23001.00000  24001.00000  1.761131206174e-05
24001.00000  25001.00000  1.624250729285e-05
25001.00000  26001.00000  1.497009722599e-05
26001.00000  27001.00000  1.383263974198e-05
27001.00000  28001.00000  1.281085590041e-05
28001.00000  29001.00000  1.067089351524e-05
29001.00000  30001.00000  9.745504375707e-06
30001.00000  31001.00000  9.938293779776e-06
31001.00000  32001.00000  9.215333514516e-06
32001.00000  33001.00000  8.154991792135e-06
33001.00000  34001.00000  7.663378811758e-06
34001.00000  35001.00000  7.325997354636e-06
35001.00000  36001.00000  7.017534308125e-06
36001.00000  37001.00000  6.429526625714e-06
37001.00000  38001.00000  6.092145168592e-06
38001.00000  39001.00000  5.600532188215e-06
39001.00000  40001.00000  5.022163976007e-06
40001.00000  41001.00000  4.732979869903e-06
41001.00000  42001.00000  4.482353644613e-06
42001.00000  43001.00000  4.501632585020e-06
43001.00000  44001.00000  4.193169538509e-06
44001.00000  45001.00000  4.048577485457e-06
45001.00000  46001.00000  3.643719736911e-06
46001.00000  47001.00000  3.749753909149e-06
47001.00000  48001.00000  3.287059339383e-06
48001.00000  49001.00000  3.730474968742e-06
49001.00000  50001.00000  3.181025167145e-06
50001.00000  51001.00000  2.930398941855e-06
51001.00000  52001.00000  2.949677882261e-06
52001.00000  53001.00000  2.882201590837e-06
53001.00000  54001.00000  2.660493776157e-06
54001.00000  55001.00000  2.332751789239e-06
55001.00000  56001.00000  2.226717617001e-06
56001.00000  57001.00000  2.390588610460e-06
57001.00000  58001.00000  2.207438676594e-06
58001.00000  59001.00000  2.188159736187e-06
59001.00000  60001.00000  2.168880795781e-06
60001.00000  61001.00000  2.149601855374e-06
61001.00000  62001.00000  1.898975630083e-06
62001.00000  63001.00000  2.062846623542e-06
63001.00000  64001.00000  1.648349404793e-06
64001.00000  65001.00000  1.706186226014e-06
65001.00000  66001.00000  1.773662517438e-06
66001.00000  67001.00000  1.889336159880e-06
67001.00000  68001.00000  1.600152053776e-06
68001.00000  69001.00000  1.783301987642e-06
69001.00000  70001.00000  1.378444239096e-06
70001.00000  71001.00000  1.609791523979e-06
71001.00000  72001.00000  1.590512583572e-06
72001.00000  73001.00000  1.445920530520e-06
73001.00000  74001.00000  1.224212715841e-06
74001.00000  75001.00000  1.262770596654e-06
75001.00000  76001.00000  1.272410066858e-06
76001.00000  77001.00000  1.417002119910e-06
77001.00000  78001.00000  1.166375894620e-06
78001.00000  79001.00000  1.243491656247e-06
79001.00000  80001.00000  1.224212715841e-06
80001.00000  81001.00000  1.050702252178e-06
81001.00000  82001.00000  1.050702252178e-06
82001.00000  83001.00000  9.543075501434e-07
83001.00000  84001.00000  1.041062781975e-06
84001.00000  85001.00000  9.253891395330e-07
85001.00000  86001.00000  1.002504901161e-06
86001.00000  87001.00000  7.325997354636e-07
87001.00000  88001.00000  9.253891395330e-07
88001.00000  89001.00000  7.904365566844e-07
89001.00000  90001.00000  7.807970864810e-07
90001.00000  91001.00000  7.133207950567e-07
91001.00000  92001.00000  8.675523183122e-07
92001.00000  93001.00000  7.036813248532e-07
93001.00000  94001.00000  8.000760268879e-07
94001.00000  95001.00000  7.036813248532e-07
95001.00000  96001.00000  7.229602652602e-07
96001.00000  97001.00000  7.807970864810e-07
97001.00000  98001.00000  7.422392056671e-07
98001.00000  99001.00000  7.229602652602e-07
99001.00000  100001.00000  5.012524505804e-07
100001.00000  101001.00000  9.061101991261e-07
101001.00000  102001.00000  6.554839738359e-07
102001.00000  103001.00000  6.072866228185e-07
103001.00000  104001.00000  6.844023844463e-07
104001.00000  105001.00000  6.265655632255e-07
105001.00000  106001.00000  5.880076824116e-07
106001.00000  107001.00000  4.819735101734e-07
107001.00000  108001.00000  4.530550995630e-07
108001.00000  109001.00000  3.759393379353e-07
109001.00000  110001.00000  4.144972187492e-07
110001.00000  111001.00000  4.916129803769e-07
111001.00000  112001.00000  7.422392056671e-07
112001.00000  113001.00000  5.687287420047e-07
113001.00000  114001.00000  4.819735101734e-07
114001.00000  115001.00000  3.662998677318e-07
115001.00000  116001.00000  4.530550995630e-07
116001.00000  117001.00000  3.855788081388e-07
117001.00000  118001.00000  3.566603975283e-07
118001.00000  119001.00000  5.108919207839e-07
119001.00000  120001.00000  4.723340399700e-07
120001.00000  121001.00000  4.337761591561e-07
121001.00000  122001.00000  4.626945697665e-07
122001.00000  123001.00000  4.723340399700e-07
123001.00000  124001.00000  2.891841061041e-07
124001.00000  125001.00000  4.723340399700e-07
125001.00000  126001.00000  3.470209273249e-07
126001.00000  127001.00000  3.373814571214e-07
127001.00000  128001.00000  2.506262252902e-07
128001.00000  129001.00000  1.638709934590e-07
129001.00000  130001.00000  3.662998677318e-07
130001.00000  131001.00000  2.891841061041e-07
131001.00000  132001.00000  2.988235763075e-07
132001.00000  133001.00000  2.506262252902e-07
133001.00000  134001.00000  3.566603975283e-07
134001.00000  135001.00000  1.349525828486e-07
135001.00000  136001.00000  2.217078146798e-07
136001.00000  137001.00000  2.217078146798e-07
137001.00000  138001.00000  2.217078146798e-07
138001.00000  139001.00000  2.313472848833e-07
139001.00000  140001.00000  2.313472848833e-07
140001.00000  141001.00000  2.602656954937e-07
141001.00000  142001.00000  2.217078146798e-07
142001.00000  143001.00000  1.927894040694e-07
143001.00000  144001.00000  3.084630465110e-07
144001.00000  145001.00000  1.445920530520e-07
145001.00000  146001.00000  2.120683444763e-07
146001.00000  147001.00000  1.349525828486e-07
147001.00000  148001.00000  1.445920530520e-07
148001.00000  149001.00000  2.024288742728e-07
149001.00000  150001.00000  1.927894040694e-07
150001.00000  151001.00000  1.927894040694e-07
151001.00000  152001.00000  1.927894040694e-07
152001.00000  153001.00000  2.217078146798e-07
153001.00000  154001.00000  2.409867550867e-07
154001.00000  155001.00000  1.349525828486e-07
155001.00000  156001.00000  1.349525828486e-07
156001.00000  157001.00000  1.735104636624e-07
157001.00000  158001.00000  1.445920530520e-07
158001.00000  159001.00000  1.831499338659e-07
159001.00000  160001.00000  2.024288742728e-07
160001.00000  161001.00000  1.831499338659e-07
161001.00000  162001.00000  9.639470203469e-08
162001.00000  163001.00000  2.602656954937e-07
163001.00000  164001.00000  1.542315232555e-07
164001.00000  165001.00000  1.831499338659e-07
165001.00000  166001.00000  1.349525828486e-07
166001.00000  167001.00000  9.639470203469e-08
167001.00000  168001.00000  1.542315232555e-07
168001.00000  169001.00000  8.675523183122e-08
169001.00000  170001.00000  1.349525828486e-07
170001.00000  171001.00000  1.060341722382e-07
171001.00000  172001.00000  1.349525828486e-07
172001.00000  173001.00000  1.156736424416e-07
173001.00000  174001.00000  1.156736424416e-07
174001.00000  175001.00000  7.711576162775e-08
175001.00000  176001.00000  6.747629142428e-08
176001.00000  177001.00000  9.639470203469e-08
177001.00000  178001.00000  4.819735101734e-08
178001.00000  179001.00000  6.747629142428e-08
179001.00000  180001.00000  4.819735101734e-08
180001.00000  181001.00000  3.855788081388e-08
181001.00000  182001.00000  1.060341722382e-07
182001.00000  183001.00000  5.783682122081e-08
183001.00000  184001.00000  7.711576162775e-08
184001.00000  185001.00000  1.156736424416e-07
185001.00000  186001.00000  2.891841061041e-08
186001.00000  187001.00000  4.819735101734e-08
187001.00000  188001.00000  1.927894040694e-08
188001.00000  189001.00000  3.855788081388e-08
189001.00000  190001.00000  0.000000000000e+00
190001.00000  191001.00000  2.891841061041e-08
191001.00000  192001.00000  2.891841061041e-08
192001.00000  193001.00000  1.927894040694e-08
193001.00000  194001.00000  9.639470203469e-09
194001.00000  195001.00000  1.927894040694e-08
195001.00000  196001.00000  3.855788081388e-08
196001.00000  197001.00000  9.639470203469e-09
197001.00000  198001.00000  4.819735101734e-08
198001.00000  199001.00000  1.927894040694e-08
