10001.00000  11001.00000  2.449974355933e-05
11001.00000  12001.00000  2.008493828428e-05
12001.00000  13001.00000  1.722259200706e-05
13001.00000  14001.00000  1.378777647438e-05
14001.00000  15001.00000  1.194423141447e-05
15001.00000  16001.00000  1.039177241665e-05
16001.00000  17001.00000  8.742284731469e-06
17001.00000  18001.00000  7.665266301732e-06
18001.00000  19001.00000  6.762899509249e-06
19001.00000  20001.00000  6.103104435176e-06
20001.00000  21001.00000  6.103104435176e-06
21001.00000  22001.00000  4.822325761976e-06
22001.00000  23001.00000  4.647674124721e-06
23001.00000  24001.00000  4.589456912303e-06
24001.00000  25001.00000  3.919958969493e-06
25001.00000  26001.00000  3.463924138884e-06
26001.00000  27001.00000  3.531844220038e-06
27001.00000  28001.00000  3.231055289211e-06
28001.00000  29001.00000  2.629477427556e-06
29001.00000  30001.00000  2.260768415574e-06
30001.00000  31001.00000  2.474231527774e-06
31001.00000  32001.00000  2.445122921565e-06
32001.00000  33001.00000  2.328688496729e-06
33001.00000  34001.00000  2.154036859474e-06
34001.00000  35001.00000  1.727110635074e-06
35001.00000  36001.00000  1.833842191174e-06
36001.00000  37001.00000  1.940573747274e-06
37001.00000  38001.00000  1.989088090956e-06
38001.00000  39001.00000  1.513647522874e-06
39001.00000  40001.00000  1.329293016883e-06
40001.00000  41001.00000  1.484538916665e-06
41001.00000  42001.00000  1.290481541937e-06
42001.00000  43001.00000  1.203155723310e-06
43001.00000  44001.00000  1.144938510892e-06
44001.00000  45001.00000  1.222561460783e-06
45001.00000  46001.00000  1.174047117101e-06
46001.00000  47001.00000  9.120696612187e-07
47001.00000  48001.00000  9.896926111097e-07
48001.00000  49001.00000  9.702868736369e-07
49001.00000  50001.00000  9.799897423733e-07
50001.00000  51001.00000  8.441495800641e-07
51001.00000  52001.00000  8.344467113278e-07
52001.00000  53001.00000  7.568237614368e-07
53001.00000  54001.00000  6.986065490186e-07
54001.00000  55001.00000  6.597950740731e-07
55001.00000  56001.00000  7.762294989095e-07
56001.00000  57001.00000  5.724692554458e-07
57001.00000  58001.00000  5.918749929185e-07
58001.00000  59001.00000  6.500922053367e-07
59001.00000  60001.00000  5.821721241822e-07
60001.00000  61001.00000  4.948463055548e-07
61001.00000  62001.00000  6.306864678640e-07
62001.00000  63001.00000  5.433606492367e-07
63001.00000  64001.00000  5.239549117639e-07
64001.00000  65001.00000  4.269262244003e-07
65001.00000  66001.00000  3.590061432457e-07
66001.00000  67001.00000  4.560348306094e-07
67001.00000  68001.00000  5.142520430276e-07
68001.00000  69001.00000  4.463319618730e-07
69001.00000  70001.00000  5.142520430276e-07
70001.00000  71001.00000  4.560348306094e-07
71001.00000  72001.00000  3.881147494548e-07
72001.00000  73001.00000  4.754405680821e-07
73001.00000  74001.00000  3.298975370366e-07
74001.00000  75001.00000  4.172233556639e-07
75001.00000  76001.00000  3.978176181911e-07
76001.00000  77001.00000  2.328688496729e-07
77001.00000  78001.00000  3.396004057729e-07
78001.00000  79001.00000  3.881147494548e-07
79001.00000  80001.00000  3.201946683002e-07
80001.00000  81001.00000  3.978176181911e-07
81001.00000  82001.00000  3.104917995638e-07
82001.00000  83001.00000  3.104917995638e-07
83001.00000  84001.00000  2.619774558820e-07
84001.00000  85001.00000  1.940573747274e-07
85001.00000  86001.00000  2.910860620911e-07
86001.00000  87001.00000  2.231659809365e-07
87001.00000  88001.00000  2.328688496729e-07
88001.00000  89001.00000  2.037602434638e-07
89001.00000  90001.00000  2.134631122001e-07
90001.00000  91001.00000  3.493032745093e-07
91001.00000  92001.00000  3.104917995638e-07
92001.00000  93001.00000  1.746516372546e-07
93001.00000  94001.00000  2.134631122001e-07
94001.00000  95001.00000  2.231659809365e-07
95001.00000  96001.00000  2.134631122001e-07
96001.00000  97001.00000  2.328688496729e-07
97001.00000  98001.00000  1.649487685183e-07
98001.00000  99001.00000  2.134631122001e-07
99001.00000  100001.00000  2.328688496729e-07
100001.00000  101001.00000  2.037602434638e-07
101001.00000  102001.00000  1.843545059910e-07
102001.00000  103001.00000  2.231659809365e-07
103001.00000  104001.00000  1.649487685183e-07
104001.00000  105001.00000  1.358401623092e-07
105001.00000  106001.00000  1.552458997819e-07
106001.00000  107001.00000  1.358401623092e-07
107001.00000  108001.00000  1.455430310455e-07
108001.00000  109001.00000  1.164344248364e-07
109001.00000  110001.00000  1.164344248364e-07
110001.00000  111001.00000  9.702868736369e-08
111001.00000  112001.00000  1.261372935728e-07
112001.00000  113001.00000  1.164344248364e-07
113001.00000  114001.00000  1.067315561001e-07
114001.00000  115001.00000  9.702868736369e-08
115001.00000  116001.00000  1.455430310455e-07
116001.00000  117001.00000  1.067315561001e-07
117001.00000  118001.00000  1.649487685183e-07
118001.00000  119001.00000  7.762294989095e-08
119001.00000  120001.00000  8.732581862732e-08
120001.00000  121001.00000  9.702868736369e-08
121001.00000  122001.00000  1.067315561001e-07
122001.00000  123001.00000  1.164344248364e-07
123001.00000  124001.00000  9.702868736369e-09
124001.00000  125001.00000  7.762294989095e-08
125001.00000  126001.00000  6.792008115459e-08
126001.00000  127001.00000  1.164344248364e-07
127001.00000  128001.00000  1.164344248364e-07
128001.00000  129001.00000  8.732581862732e-08
129001.00000  130001.00000  6.792008115459e-08
130001.00000  131001.00000  3.881147494548e-08
131001.00000  132001.00000  4.851434368185e-08
132001.00000  133001.00000  9.702868736369e-08
133001.00000  134001.00000  5.821721241822e-08
134001.00000  135001.00000  6.792008115459e-08
135001.00000  136001.00000  4.851434368185e-08
136001.00000  137001.00000  8.732581862732e-08
137001.00000  138001.00000  3.881147494548e-08
138001.00000  139001.00000  5.821721241822e-08
139001.00000  140001.00000  4.851434368185e-08
140001.00000  141001.00000  6.792008115459e-08
141001.00000  142001.00000  5.821721241822e-08
142001.00000  143001.00000  8.732581862732e-08
143001.00000  144001.00000  3.881147494548e-08
144001.00000  145001.00000  3.881147494548e-08
145001.00000  146001.00000  5.821721241822e-08
146001.00000  147001.00000  3.881147494548e-08
147001.00000  148001.00000  7.762294989095e-08
148001.00000  149001.00000  4.851434368185e-08
149001.00000  150001.00000  5.821721241822e-08
150001.00000  151001.00000  7.762294989095e-08
151001.00000  152001.00000  1.940573747274e-08
152001.00000  153001.00000  0.000000000000e+00
153001.00000  154001.00000  1.940573747274e-08
154001.00000  155001.00000  6.792008115459e-08
155001.00000  156001.00000  3.881147494548e-08
156001.00000  157001.00000  5.821721241822e-08
157001.00000  158001.00000  1.940573747274e-08
158001.00000  159001.00000  1.940573747274e-08
159001.00000  160001.00000  6.792008115459e-08
160001.00000  161001.00000  1.940573747274e-08
161001.00000  162001.00000  1.940573747274e-08
162001.00000  163001.00000  3.881147494548e-08
163001.00000  164001.00000  9.702868736369e-09
164001.00000  165001.00000  0.000000000000e+00
165001.00000  166001.00000  3.881147494548e-08
166001.00000  167001.00000  3.881147494548e-08
167001.00000  168001.00000  3.881147494548e-08
168001.00000  169001.00000  1.940573747274e-08
169001.00000  170001.00000  1.940573747274e-08
170001.00000  171001.00000  1.940573747274e-08
171001.00000  172001.00000  1.940573747274e-08
172001.00000  173001.00000  9.702868736369e-09
173001.00000  174001.00000  9.702868736369e-09
174001.00000  175001.00000  0.000000000000e+00
175001.00000  176001.00000  4.851434368185e-08
176001.00000  177001.00000  9.702868736369e-09
177001.00000  178001.00000  9.702868736369e-09
178001.00000  179001.00000  1.940573747274e-08
179001.00000  180001.00000  1.940573747274e-08
180001.00000  181001.00000  9.702868736369e-09
181001.00000  182001.00000  1.940573747274e-08
182001.00000  183001.00000  1.940573747274e-08
183001.00000  184001.00000  9.702868736369e-09
184001.00000  185001.00000  1.940573747274e-08
185001.00000  186001.00000  9.702868736369e-09
186001.00000  187001.00000  0.000000000000e+00
187001.00000  188001.00000  9.702868736369e-09
188001.00000  189001.00000  0.000000000000e+00
189001.00000  190001.00000  0.000000000000e+00
190001.00000  191001.00000  0.000000000000e+00
191001.00000  192001.00000  0.000000000000e+00
192001.00000  193001.00000  9.702868736369e-09
193001.00000  194001.00000  0.000000000000e+00
194001.00000  195001.00000  0.000000000000e+00
195001.00000  196001.00000  0.000000000000e+00
196001.00000  197001.00000  0.000000000000e+00
197001.00000  198001.00000  0.000000000000e+00
198001.00000  199001.00000  0.000000000000e+00
