300.00000  350.00000  1.822026017099e-06
350.00000  400.00000  5.830483254716e-06
400.00000  450.00000  5.101672847876e-06
450.00000  500.00000  6.559293661555e-06
500.00000  550.00000  5.101672847876e-05
550.00000  600.00000  5.830483254716e-06
600.00000  650.00000  1.457620813679e-05
650.00000  700.00000  7.288104068395e-06
700.00000  750.00000  1.603382895047e-05
750.00000  800.00000  1.129656130601e-05
800.00000  850.00000  3.644052034197e-05
850.00000  900.00000  8.381319678654e-06
900.00000  950.00000  1.056775089917e-05
950.00000  1000.00000  1.056775089917e-05
1000.00000  1050.00000  1.311858732311e-05
1050.00000  1100.00000  9.110130085493e-06
1100.00000  1150.00000  1.056775089917e-05
1150.00000  1200.00000  1.238977691627e-05
1200.00000  1250.00000  1.056775089917e-05
1250.00000  1300.00000  3.644052034197e-05
1300.00000  1350.00000  8.016914475234e-06
1350.00000  1400.00000  1.494061334021e-05
1400.00000  1450.00000  1.056775089917e-05
1450.00000  1500.00000  1.457620813679e-05
1500.00000  1550.00000  1.566942374705e-05
1550.00000  1600.00000  1.202537171285e-05
1600.00000  1650.00000  1.931347578125e-05
1650.00000  1700.00000  1.749144976415e-05
1700.00000  1750.00000  5.320315969928e-05
1750.00000  1800.00000  1.858466537441e-05
1800.00000  1850.00000  1.967788098467e-05
1850.00000  1900.00000  1.749144976415e-05
1900.00000  1950.00000  1.749144976415e-05
1950.00000  2000.00000  2.186431220518e-05
2000.00000  2050.00000  2.623717464622e-05
2050.00000  2100.00000  3.061003708726e-05
2100.00000  2150.00000  2.149990700176e-05
2150.00000  2200.00000  2.295752781544e-05
2200.00000  2250.00000  2.113550179834e-05
2250.00000  2300.00000  2.769479545990e-05
2300.00000  2350.00000  8.490641239680e-05
2350.00000  2400.00000  2.842360586674e-05
2400.00000  2450.00000  2.951682147700e-05
2450.00000  2500.00000  3.279646830778e-05
2500.00000  2550.00000  2.660157984964e-05
2550.00000  2600.00000  3.206765790094e-05
2600.00000  2650.00000  3.206765790094e-05
2650.00000  2700.00000  2.514395903596e-05
2700.00000  2750.00000  2.550836423938e-05
2750.00000  2800.00000  3.097444229068e-05
2800.00000  2850.00000  3.862695156249e-05
2850.00000  2900.00000  3.972016717275e-05
2900.00000  2950.00000  4.227100359669e-05
2950.00000  3000.00000  6.559293661555e-05
3000.00000  3050.00000  4.263540880011e-05
3050.00000  3100.00000  5.283875449586e-05
3100.00000  3150.00000  5.028791807192e-05
3150.00000  3200.00000  7.178782507369e-05
3200.00000  3250.00000  6.194888458135e-05
3250.00000  3300.00000  6.741496263265e-05
3300.00000  3350.00000  8.016914475234e-05
3350.00000  3400.00000  9.766059451649e-05
3400.00000  3450.00000  9.401654248229e-05
3450.00000  3500.00000  1.023978621609e-04
3500.00000  3550.00000  9.875381012675e-05
3550.00000  3600.00000  1.126012078567e-04
3600.00000  3650.00000  1.235333639593e-04
3650.00000  3700.00000  1.920415422022e-04
3700.00000  3750.00000  1.530501854363e-04
3750.00000  3800.00000  1.672619883697e-04
3800.00000  3850.00000  1.876686797612e-04
3850.00000  3900.00000  2.029736983048e-04
3900.00000  3950.00000  2.113550179834e-04
3950.00000  4000.00000  2.273888469339e-04
4000.00000  4050.00000  2.419650550707e-04
4050.00000  4100.00000  2.467023227152e-04
4100.00000  4150.00000  2.401430290536e-04
4150.00000  4200.00000  2.547192371904e-04
4200.00000  4250.00000  2.696598505306e-04
4250.00000  4300.00000  2.849648690742e-04
4300.00000  4350.00000  3.184901477888e-04
4350.00000  4400.00000  3.224986050265e-04
4400.00000  4450.00000  3.265070622641e-04
4450.00000  4500.00000  3.232274154333e-04
4500.00000  4550.00000  3.625831774026e-04
4550.00000  4600.00000  3.738797387086e-04
4600.00000  4650.00000  3.844474896078e-04
4650.00000  4700.00000  4.008457237617e-04
4700.00000  4750.00000  4.066762070164e-04
4750.00000  4800.00000  4.004813185583e-04
4800.00000  4850.00000  4.157863371019e-04
4850.00000  4900.00000  4.321845712558e-04
4900.00000  4950.00000  4.558709094781e-04
4950.00000  5000.00000  4.602437719191e-04
5000.00000  5050.00000  4.584217459020e-04
5050.00000  5100.00000  4.617013927328e-04
5100.00000  5150.00000  4.919470246166e-04
5150.00000  5200.00000  4.780996268867e-04
5200.00000  5250.00000  5.108960951945e-04
5250.00000  5300.00000  5.123537160081e-04
5300.00000  5350.00000  5.258367085347e-04
5350.00000  5400.00000  5.331248126031e-04
5400.00000  5450.00000  5.589975820459e-04
5450.00000  5500.00000  5.462433999262e-04
5500.00000  5550.00000  5.495230467570e-04
5550.00000  5600.00000  5.400485114680e-04
5600.00000  5650.00000  5.586331768424e-04
5650.00000  5700.00000  5.564467456219e-04
5700.00000  5750.00000  5.433281582988e-04
5750.00000  5800.00000  5.597263924527e-04
5800.00000  5850.00000  5.560823404185e-04
5850.00000  5900.00000  5.710229537587e-04
5900.00000  5950.00000  5.928872659639e-04
5950.00000  6000.00000  5.444213739091e-04
6000.00000  6050.00000  5.702941433519e-04
6050.00000  6100.00000  5.877855931160e-04
6100.00000  6150.00000  6.052770428802e-04
6150.00000  6200.00000  5.804974890476e-04
6200.00000  6250.00000  6.464548308666e-04
6250.00000  6300.00000  7.054884738206e-04
6300.00000  6350.00000  7.084037154480e-04
6350.00000  6400.00000  2.360616907753e-03
6400.00000  6450.00000  5.666500913177e-04
6450.00000  6500.00000  5.855991618955e-04
6500.00000  6550.00000  5.837771358784e-04
6550.00000  6600.00000  6.103787157281e-04
6600.00000  6650.00000  5.786754630305e-04
6650.00000  6700.00000  5.947092919810e-04
6700.00000  6750.00000  5.790398682340e-04
6750.00000  6800.00000  5.859635670989e-04
6800.00000  6850.00000  5.644636600972e-04
6850.00000  6900.00000  6.030906116597e-04
6900.00000  6950.00000  6.030906116597e-04
6950.00000  7000.00000  5.677433069279e-04
7000.00000  7050.00000  5.892432139297e-04
7050.00000  7100.00000  7.393781577386e-04
7100.00000  7150.00000  3.286934934846e-04
7150.00000  7200.00000  3.363460027564e-04
7200.00000  7250.00000  3.297867090949e-04
7250.00000  7300.00000  3.359815975530e-04
7300.00000  7350.00000  3.272358726709e-04
7350.00000  7400.00000  3.410832704009e-04
7400.00000  7450.00000  3.268714674675e-04
7450.00000  7500.00000  3.848118948112e-04
7500.00000  7550.00000  3.414476756043e-04
7550.00000  7600.00000  3.552950733342e-04
7600.00000  7650.00000  3.265070622641e-04
7650.00000  7700.00000  3.527442369103e-04
7700.00000  7750.00000  3.272358726709e-04
7750.00000  7800.00000  3.206765790094e-04
7800.00000  7850.00000  3.363460027564e-04
7850.00000  7900.00000  3.676848502505e-04
7900.00000  7950.00000  3.520154265035e-04
7950.00000  8000.00000  3.447273224351e-04
8000.00000  8050.00000  3.494645900795e-04
8050.00000  8100.00000  3.316087351120e-04
8100.00000  8150.00000  3.432697016214e-04
8150.00000  8200.00000  3.520154265035e-04
8200.00000  8250.00000  3.651340138266e-04
8250.00000  8300.00000  3.687780658608e-04
8300.00000  8350.00000  3.239562258401e-04
8350.00000  8400.00000  3.246850362470e-04
8400.00000  8450.00000  3.276002778743e-04
8450.00000  8500.00000  3.294223038914e-04
8500.00000  8550.00000  3.407188651974e-04
8550.00000  8600.00000  3.348883819427e-04
8600.00000  8650.00000  3.199477686025e-04
8650.00000  8700.00000  3.414476756043e-04
8700.00000  8750.00000  3.378036235701e-04
8750.00000  8800.00000  3.305155195017e-04
8800.00000  8850.00000  3.425408912145e-04
8850.00000  8900.00000  3.283290882812e-04
8900.00000  8950.00000  3.345239767393e-04
8950.00000  9000.00000  3.407188651974e-04
9000.00000  9050.00000  3.232274154333e-04
9050.00000  9100.00000  3.461849432487e-04
9100.00000  9150.00000  3.356171923496e-04
9150.00000  9200.00000  3.221341998230e-04
9200.00000  9250.00000  3.206765790094e-04
9250.00000  9300.00000  3.214053894162e-04
9300.00000  9350.00000  3.203121738059e-04
9350.00000  9400.00000  2.926173783460e-04
9400.00000  9450.00000  3.039139396521e-04
9450.00000  9500.00000  3.286934934846e-04
9500.00000  9550.00000  3.170325269752e-04
9550.00000  9600.00000  3.159393113649e-04
9600.00000  9650.00000  3.305155195017e-04
9650.00000  9700.00000  3.148460957546e-04
9700.00000  9750.00000  3.159393113649e-04
9750.00000  9800.00000  3.104732333136e-04
9800.00000  9850.00000  3.166681217717e-04
9850.00000  9900.00000  3.112020437205e-04
9900.00000  9950.00000  3.301511142983e-04
9950.00000  10000.00000  3.228630102299e-04
