10001.00000  11001.00000  5.019815807115e-05
11001.00000  12001.00000  3.814049191094e-05
12001.00000  13001.00000  3.027051818961e-05
13001.00000  14001.00000  2.407923152352e-05
14001.00000  15001.00000  2.101066378814e-05
15001.00000  16001.00000  1.644391298195e-05
16001.00000  17001.00000  1.454862114540e-05
17001.00000  18001.00000  1.216596855086e-05
18001.00000  19001.00000  1.064973508162e-05
19001.00000  20001.00000  9.332055995247e-06
20001.00000  21001.00000  8.537838463737e-06
21001.00000  22001.00000  7.147957783594e-06
22001.00000  23001.00000  6.985504197603e-06
23001.00000  24001.00000  5.884429892554e-06
24001.00000  25001.00000  5.288766743922e-06
25001.00000  26001.00000  4.819456384393e-06
26001.00000  27001.00000  4.187692438873e-06
27001.00000  28001.00000  3.916936462222e-06
28001.00000  29001.00000  3.483726899580e-06
29001.00000  30001.00000  3.880835665335e-06
30001.00000  31001.00000  3.086618133825e-06
31001.00000  32001.00000  2.545106180522e-06
32001.00000  33001.00000  2.454854188305e-06
33001.00000  34001.00000  2.472904586748e-06
34001.00000  35001.00000  2.436803789861e-06
35001.00000  36001.00000  2.274350203871e-06
36001.00000  37001.00000  1.913342235002e-06
37001.00000  38001.00000  1.805039844342e-06
38001.00000  39001.00000  1.823090242785e-06
39001.00000  40001.00000  1.642586258351e-06
40001.00000  41001.00000  1.263527891039e-06
41001.00000  42001.00000  1.480132672360e-06
42001.00000  43001.00000  1.534283867691e-06
43001.00000  44001.00000  1.516233469247e-06
44001.00000  45001.00000  9.386207190578e-07
45001.00000  46001.00000  9.025199221709e-07
46001.00000  47001.00000  1.209376695709e-06
47001.00000  48001.00000  8.483687268407e-07
48001.00000  49001.00000  9.927719143880e-07
49001.00000  50001.00000  7.581167346236e-07
50001.00000  51001.00000  6.678647424065e-07
51001.00000  52001.00000  1.010822312831e-06
52001.00000  53001.00000  7.761671330670e-07
53001.00000  54001.00000  7.581167346236e-07
54001.00000  55001.00000  8.844695237275e-07
55001.00000  56001.00000  6.317639455196e-07
56001.00000  57001.00000  6.317639455196e-07
57001.00000  58001.00000  6.317639455196e-07
58001.00000  59001.00000  5.956631486328e-07
59001.00000  60001.00000  6.317639455196e-07
60001.00000  61001.00000  5.234615548591e-07
61001.00000  62001.00000  3.249071719815e-07
62001.00000  63001.00000  5.234615548591e-07
63001.00000  64001.00000  4.512599610855e-07
64001.00000  65001.00000  5.054111564157e-07
65001.00000  66001.00000  2.888063750947e-07
66001.00000  67001.00000  3.610079688684e-07
67001.00000  68001.00000  5.054111564157e-07
68001.00000  69001.00000  3.429575704250e-07
69001.00000  70001.00000  3.429575704250e-07
70001.00000  71001.00000  3.790583673118e-07
71001.00000  72001.00000  3.971087657552e-07
72001.00000  73001.00000  2.166047813210e-07
73001.00000  74001.00000  3.971087657552e-07
74001.00000  75001.00000  3.610079688684e-07
75001.00000  76001.00000  3.249071719815e-07
76001.00000  77001.00000  3.249071719815e-07
77001.00000  78001.00000  3.068567735381e-07
78001.00000  79001.00000  1.444031875473e-07
79001.00000  80001.00000  1.444031875473e-07
80001.00000  81001.00000  2.166047813210e-07
81001.00000  82001.00000  1.444031875473e-07
82001.00000  83001.00000  2.166047813210e-07
83001.00000  84001.00000  2.527055782079e-07
84001.00000  85001.00000  1.985543828776e-07
85001.00000  86001.00000  1.805039844342e-07
86001.00000  87001.00000  1.624535859908e-07
87001.00000  88001.00000  1.444031875473e-07
88001.00000  89001.00000  1.083023906605e-07
89001.00000  90001.00000  1.624535859908e-07
90001.00000  91001.00000  1.263527891039e-07
91001.00000  92001.00000  2.527055782079e-07
92001.00000  93001.00000  2.527055782079e-07
93001.00000  94001.00000  5.415119533026e-08
94001.00000  95001.00000  1.985543828776e-07
95001.00000  96001.00000  1.985543828776e-07
96001.00000  97001.00000  1.444031875473e-07
97001.00000  98001.00000  9.025199221709e-08
98001.00000  99001.00000  1.624535859908e-07
99001.00000  100001.00000  1.263527891039e-07
100001.00000  101001.00000  1.444031875473e-07
101001.00000  102001.00000  1.083023906605e-07
102001.00000  103001.00000  9.025199221709e-08
103001.00000  104001.00000  1.624535859908e-07
104001.00000  105001.00000  9.025199221709e-08
105001.00000  106001.00000  1.263527891039e-07
106001.00000  107001.00000  3.610079688684e-08
107001.00000  108001.00000  5.415119533026e-08
108001.00000  109001.00000  1.624535859908e-07
109001.00000  110001.00000  7.220159377367e-08
110001.00000  111001.00000  5.415119533026e-08
111001.00000  112001.00000  1.624535859908e-07
112001.00000  113001.00000  1.083023906605e-07
113001.00000  114001.00000  9.025199221709e-08
114001.00000  115001.00000  1.805039844342e-08
115001.00000  116001.00000  7.220159377367e-08
116001.00000  117001.00000  3.610079688684e-08
117001.00000  118001.00000  0.000000000000e+00
118001.00000  119001.00000  1.805039844342e-08
119001.00000  120001.00000  3.610079688684e-08
120001.00000  121001.00000  3.610079688684e-08
121001.00000  122001.00000  9.025199221709e-08
122001.00000  123001.00000  5.415119533026e-08
123001.00000  124001.00000  1.083023906605e-07
124001.00000  125001.00000  7.220159377367e-08
125001.00000  126001.00000  1.805039844342e-08
126001.00000  127001.00000  5.415119533026e-08
127001.00000  128001.00000  5.415119533026e-08
128001.00000  129001.00000  9.025199221709e-08
129001.00000  130001.00000  1.805039844342e-08
130001.00000  131001.00000  1.263527891039e-07
131001.00000  132001.00000  3.610079688684e-08
132001.00000  133001.00000  1.805039844342e-08
133001.00000  134001.00000  0.000000000000e+00
134001.00000  135001.00000  1.805039844342e-08
135001.00000  136001.00000  7.220159377367e-08
136001.00000  137001.00000  1.263527891039e-07
137001.00000  138001.00000  5.415119533026e-08
138001.00000  139001.00000  3.610079688684e-08
139001.00000  140001.00000  3.610079688684e-08
140001.00000  141001.00000  1.805039844342e-08
141001.00000  142001.00000  3.610079688684e-08
142001.00000  143001.00000  1.805039844342e-08
143001.00000  144001.00000  7.220159377367e-08
144001.00000  145001.00000  9.025199221709e-08
145001.00000  146001.00000  3.610079688684e-08
146001.00000  147001.00000  3.610079688684e-08
147001.00000  148001.00000  0.000000000000e+00
148001.00000  149001.00000  1.805039844342e-08
149001.00000  150001.00000  5.415119533026e-08
150001.00000  151001.00000  3.610079688684e-08
151001.00000  152001.00000  3.610079688684e-08
152001.00000  153001.00000  1.805039844342e-08
153001.00000  154001.00000  5.415119533026e-08
154001.00000  155001.00000  0.000000000000e+00
155001.00000  156001.00000  0.000000000000e+00
156001.00000  157001.00000  3.610079688684e-08
157001.00000  158001.00000  0.000000000000e+00
158001.00000  159001.00000  1.805039844342e-08
159001.00000  160001.00000  3.610079688684e-08
160001.00000  161001.00000  0.000000000000e+00
161001.00000  162001.00000  0.000000000000e+00
162001.00000  163001.00000  1.805039844342e-08
163001.00000  164001.00000  5.415119533026e-08
164001.00000  165001.00000  0.000000000000e+00
165001.00000  166001.00000  3.610079688684e-08
166001.00000  167001.00000  1.805039844342e-08
167001.00000  168001.00000  1.805039844342e-08
168001.00000  169001.00000  0.000000000000e+00
169001.00000  170001.00000  0.000000000000e+00
170001.00000  171001.00000  0.000000000000e+00
171001.00000  172001.00000  1.805039844342e-08
172001.00000  173001.00000  1.805039844342e-08
173001.00000  174001.00000  0.000000000000e+00
174001.00000  175001.00000  0.000000000000e+00
175001.00000  176001.00000  0.000000000000e+00
176001.00000  177001.00000  0.000000000000e+00
177001.00000  178001.00000  1.805039844342e-08
178001.00000  179001.00000  0.000000000000e+00
179001.00000  180001.00000  0.000000000000e+00
180001.00000  181001.00000  1.805039844342e-08
181001.00000  182001.00000  0.000000000000e+00
182001.00000  183001.00000  0.000000000000e+00
183001.00000  184001.00000  0.000000000000e+00
184001.00000  185001.00000  0.000000000000e+00
185001.00000  186001.00000  1.805039844342e-08
186001.00000  187001.00000  0.000000000000e+00
187001.00000  188001.00000  0.000000000000e+00
188001.00000  189001.00000  0.000000000000e+00
189001.00000  190001.00000  0.000000000000e+00
190001.00000  191001.00000  0.000000000000e+00
191001.00000  192001.00000  1.805039844342e-08
192001.00000  193001.00000  0.000000000000e+00
193001.00000  194001.00000  0.000000000000e+00
194001.00000  195001.00000  0.000000000000e+00
195001.00000  196001.00000  0.000000000000e+00
196001.00000  197001.00000  0.000000000000e+00
197001.00000  198001.00000  0.000000000000e+00
198001.00000  199001.00000  0.000000000000e+00
