300.00000  350.00000  5.807339784412e-07
350.00000  400.00000  9.678899640687e-07
400.00000  450.00000  1.355045949696e-06
450.00000  500.00000  2.322935913765e-06
500.00000  550.00000  1.897064329575e-05
550.00000  600.00000  1.742201935324e-06
600.00000  650.00000  7.355963726922e-06
650.00000  700.00000  2.903669892206e-06
700.00000  750.00000  5.807339784412e-06
750.00000  800.00000  4.065137849089e-06
800.00000  850.00000  1.413119347540e-05
850.00000  900.00000  5.226605805971e-06
900.00000  950.00000  2.710091899392e-06
950.00000  1000.00000  4.839449820343e-06
1000.00000  1050.00000  6.000917777226e-06
1050.00000  1100.00000  5.613761791598e-06
1100.00000  1150.00000  2.516513906579e-06
1150.00000  1200.00000  6.388073762853e-06
1200.00000  1250.00000  4.645871827530e-06
1250.00000  1300.00000  1.606697340354e-05
1300.00000  1350.00000  5.420183798785e-06
1350.00000  1400.00000  6.388073762853e-06
1400.00000  1450.00000  1.025963361913e-05
1450.00000  1500.00000  7.355963726922e-06
1500.00000  1550.00000  7.936697705363e-06
1550.00000  1600.00000  9.098165662246e-06
1600.00000  1650.00000  5.807339784412e-06
1650.00000  1700.00000  6.581651755667e-06
1700.00000  1750.00000  2.787523096518e-05
1750.00000  1800.00000  1.200183555445e-05
1800.00000  1850.00000  8.323853690991e-06
1850.00000  1900.00000  9.291743655059e-06
1900.00000  1950.00000  9.291743655059e-06
1950.00000  2000.00000  9.098165662246e-06
2000.00000  2050.00000  1.084036759757e-05
2050.00000  2100.00000  1.064678960476e-05
2100.00000  2150.00000  1.142110157601e-05
2150.00000  2200.00000  1.335688150415e-05
2200.00000  2250.00000  1.064678960476e-05
2250.00000  2300.00000  1.142110157601e-05
2300.00000  2350.00000  3.561835067773e-05
2350.00000  2400.00000  1.200183555445e-05
2400.00000  2450.00000  1.238899154008e-05
2450.00000  2500.00000  1.161467956882e-05
2500.00000  2550.00000  1.161467956882e-05
2550.00000  2600.00000  1.200183555445e-05
2600.00000  2650.00000  1.703486336761e-05
2650.00000  2700.00000  1.200183555445e-05
2700.00000  2750.00000  1.355045949696e-05
2750.00000  2800.00000  1.103394559038e-05
2800.00000  2850.00000  1.025963361913e-05
2850.00000  2900.00000  1.006605562631e-05
2900.00000  2950.00000  1.238899154008e-05
2950.00000  3000.00000  1.897064329575e-05
3000.00000  3050.00000  1.200183555445e-05
3050.00000  3100.00000  1.180825756164e-05
3100.00000  3150.00000  1.200183555445e-05
3150.00000  3200.00000  1.277614752571e-05
3200.00000  3250.00000  1.238899154008e-05
3250.00000  3300.00000  1.258256953289e-05
3300.00000  3350.00000  9.872477633501e-06
3350.00000  3400.00000  8.904587669432e-06
3400.00000  3450.00000  1.316330351133e-05
3450.00000  3500.00000  1.606697340354e-05
3500.00000  3550.00000  1.296972551852e-05
3550.00000  3600.00000  1.045321161194e-05
3600.00000  3650.00000  1.432477146822e-05
3650.00000  3700.00000  1.858348731012e-05
3700.00000  3750.00000  1.103394559038e-05
3750.00000  3800.00000  8.323853690991e-06
3800.00000  3850.00000  9.098165662246e-06
3850.00000  3900.00000  1.142110157601e-05
3900.00000  3950.00000  1.296972551852e-05
3950.00000  4000.00000  1.045321161194e-05
4000.00000  4050.00000  1.180825756164e-05
4050.00000  4100.00000  8.904587669432e-06
4100.00000  4150.00000  9.485321647873e-06
4150.00000  4200.00000  1.122752358320e-05
4200.00000  4250.00000  1.064678960476e-05
4250.00000  4300.00000  8.711009676618e-06
4300.00000  4350.00000  1.142110157601e-05
4350.00000  4400.00000  8.323853690991e-06
4400.00000  4450.00000  8.711009676618e-06
4450.00000  4500.00000  1.103394559038e-05
4500.00000  4550.00000  1.025963361913e-05
4550.00000  4600.00000  1.064678960476e-05
4600.00000  4650.00000  1.200183555445e-05
4650.00000  4700.00000  9.678899640687e-06
4700.00000  4750.00000  1.045321161194e-05
4750.00000  4800.00000  1.161467956882e-05
4800.00000  4850.00000  1.296972551852e-05
4850.00000  4900.00000  8.904587669432e-06
4900.00000  4950.00000  1.025963361913e-05
4950.00000  5000.00000  9.678899640687e-06
5000.00000  5050.00000  1.006605562631e-05
5050.00000  5100.00000  8.711009676618e-06
5100.00000  5150.00000  1.219541354727e-05
5150.00000  5200.00000  1.006605562631e-05
5200.00000  5250.00000  8.904587669432e-06
5250.00000  5300.00000  1.355045949696e-05
5300.00000  5350.00000  1.180825756164e-05
5350.00000  5400.00000  1.045321161194e-05
5400.00000  5450.00000  1.432477146822e-05
5450.00000  5500.00000  9.678899640687e-06
5500.00000  5550.00000  7.355963726922e-06
5550.00000  5600.00000  1.064678960476e-05
5600.00000  5650.00000  1.161467956882e-05
5650.00000  5700.00000  1.316330351133e-05
5700.00000  5750.00000  1.122752358320e-05
5750.00000  5800.00000  1.045321161194e-05
5800.00000  5850.00000  1.045321161194e-05
5850.00000  5900.00000  1.935779928137e-05
5900.00000  5950.00000  1.258256953289e-05
5950.00000  6000.00000  9.872477633501e-06
6000.00000  6050.00000  1.238899154008e-05
6050.00000  6100.00000  1.006605562631e-05
6100.00000  6150.00000  1.993853325982e-05
6150.00000  6200.00000  2.090642322388e-05
6200.00000  6250.00000  3.135963483583e-05
6250.00000  6300.00000  6.058991175070e-05
6300.00000  6350.00000  6.233211368602e-05
6350.00000  6400.00000  4.475523193854e-04
6400.00000  6450.00000  1.567981741791e-05
6450.00000  6500.00000  1.296972551852e-05
6500.00000  6550.00000  1.296972551852e-05
6550.00000  6600.00000  1.122752358320e-05
6600.00000  6650.00000  1.219541354727e-05
6650.00000  6700.00000  1.664770738198e-05
6700.00000  6750.00000  1.722844136042e-05
6750.00000  6800.00000  1.567981741791e-05
6800.00000  6850.00000  1.490550544666e-05
6850.00000  6900.00000  1.935779928137e-05
6900.00000  6950.00000  2.245504716639e-05
6950.00000  7000.00000  1.780917533886e-05
7000.00000  7050.00000  1.606697340354e-05
7050.00000  7100.00000  6.504220558542e-05
7100.00000  7150.00000  8.517431683804e-06
7150.00000  7200.00000  8.130275698177e-06
7200.00000  7250.00000  7.549541719736e-06
7250.00000  7300.00000  6.968807741295e-06
7300.00000  7350.00000  7.936697705363e-06
7350.00000  7400.00000  6.581651755667e-06
7400.00000  7450.00000  1.122752358320e-05
7450.00000  7500.00000  2.110000121670e-05
7500.00000  7550.00000  5.807339784412e-06
7550.00000  7600.00000  5.613761791598e-06
7600.00000  7650.00000  7.549541719736e-06
7650.00000  7700.00000  5.226605805971e-06
7700.00000  7750.00000  6.581651755667e-06
7750.00000  7800.00000  5.807339784412e-06
7800.00000  7850.00000  7.355963726922e-06
7850.00000  7900.00000  7.743119712550e-06
7900.00000  7950.00000  7.549541719736e-06
7950.00000  8000.00000  6.968807741295e-06
8000.00000  8050.00000  6.581651755667e-06
8050.00000  8100.00000  9.872477633501e-06
8100.00000  8150.00000  8.711009676618e-06
8150.00000  8200.00000  9.872477633501e-06
8200.00000  8250.00000  6.194495770040e-06
8250.00000  8300.00000  1.064678960476e-05
8300.00000  8350.00000  8.711009676618e-06
8350.00000  8400.00000  1.006605562631e-05
8400.00000  8450.00000  8.130275698177e-06
8450.00000  8500.00000  7.355963726922e-06
8500.00000  8550.00000  8.711009676618e-06
8550.00000  8600.00000  1.006605562631e-05
8600.00000  8650.00000  7.743119712550e-06
8650.00000  8700.00000  9.098165662246e-06
8700.00000  8750.00000  8.711009676618e-06
8750.00000  8800.00000  8.130275698177e-06
8800.00000  8850.00000  8.904587669432e-06
8850.00000  8900.00000  7.549541719736e-06
8900.00000  8950.00000  1.258256953289e-05
8950.00000  9000.00000  1.277614752571e-05
9000.00000  9050.00000  1.142110157601e-05
9050.00000  9100.00000  1.161467956882e-05
9100.00000  9150.00000  1.064678960476e-05
9150.00000  9200.00000  9.872477633501e-06
9200.00000  9250.00000  9.485321647873e-06
9250.00000  9300.00000  9.291743655059e-06
9300.00000  9350.00000  9.098165662246e-06
9350.00000  9400.00000  1.238899154008e-05
9400.00000  9450.00000  1.296972551852e-05
9450.00000  9500.00000  1.006605562631e-05
9500.00000  9550.00000  1.025963361913e-05
9550.00000  9600.00000  1.103394559038e-05
9600.00000  9650.00000  1.200183555445e-05
9650.00000  9700.00000  1.142110157601e-05
9700.00000  9750.00000  1.122752358320e-05
9750.00000  9800.00000  1.084036759757e-05
9800.00000  9850.00000  1.006605562631e-05
9850.00000  9900.00000  1.161467956882e-05
9900.00000  9950.00000  1.316330351133e-05
9950.00000  10000.00000  1.025963361913e-05
