10001.00000  11001.00000  3.145732172305e-04
11001.00000  12001.00000  2.647005270160e-04
12001.00000  13001.00000  2.232034030971e-04
13001.00000  14001.00000  1.904988108955e-04
14001.00000  15001.00000  1.637586371164e-04
15001.00000  16001.00000  1.392483218965e-04
16001.00000  17001.00000  1.224971893053e-04
17001.00000  18001.00000  1.073776605380e-04
18001.00000  19001.00000  9.680849354603e-05
19001.00000  20001.00000  8.716390205418e-05
20001.00000  21001.00000  7.712047407207e-05
21001.00000  22001.00000  7.092037954159e-05
22001.00000  23001.00000  6.394074096196e-05
23001.00000  24001.00000  5.808509612762e-05
24001.00000  25001.00000  5.266454564630e-05
25001.00000  26001.00000  5.023526884196e-05
26001.00000  27001.00000  4.530419950778e-05
27001.00000  28001.00000  4.193221827191e-05
28001.00000  29001.00000  3.875965528117e-05
29001.00000  30001.00000  3.515199793741e-05
30001.00000  31001.00000  3.272272113307e-05
31001.00000  32001.00000  2.955015814233e-05
32001.00000  33001.00000  2.657701339672e-05
33001.00000  34001.00000  2.692146309286e-05
34001.00000  35001.00000  2.454657308265e-05
35001.00000  36001.00000  2.280619567058e-05
36001.00000  37001.00000  2.113833398402e-05
37001.00000  38001.00000  2.102956039577e-05
38001.00000  39001.00000  1.887221756206e-05
39001.00000  40001.00000  1.858215466005e-05
40001.00000  41001.00000  1.727687160101e-05
41001.00000  42001.00000  1.577217029683e-05
42001.00000  43001.00000  1.544584953206e-05
43001.00000  44001.00000  1.506514197317e-05
44001.00000  45001.00000  1.337915135524e-05
45001.00000  46001.00000  1.397740609064e-05
46001.00000  47001.00000  1.247270478646e-05
47001.00000  48001.00000  1.221889974720e-05
48001.00000  49001.00000  1.225515760995e-05
49001.00000  50001.00000  1.120367959016e-05
50001.00000  51001.00000  1.018845943312e-05
51001.00000  52001.00000  1.006155691349e-05
52001.00000  53001.00000  9.191368207461e-06
53001.00000  54001.00000  9.082594619207e-06
54001.00000  55001.00000  9.445173246720e-06
55001.00000  56001.00000  8.448082021058e-06
56001.00000  57001.00000  7.886085148413e-06
57001.00000  58001.00000  7.034025373757e-06
58001.00000  59001.00000  7.668537971905e-06
59001.00000  60001.00000  7.360346138519e-06
60001.00000  61001.00000  6.707704608995e-06
61001.00000  62001.00000  6.073192010847e-06
62001.00000  63001.00000  6.635188883492e-06
63001.00000  64001.00000  6.018805216720e-06
64001.00000  65001.00000  5.348034755820e-06
65001.00000  66001.00000  5.656226589206e-06
66001.00000  67001.00000  5.619968726455e-06
67001.00000  68001.00000  5.293647961693e-06
68001.00000  69001.00000  4.369072461535e-06
69001.00000  70001.00000  4.568490706667e-06
70001.00000  71001.00000  4.350943530159e-06
71001.00000  72001.00000  5.057971853810e-06
72001.00000  73001.00000  4.568490706667e-06
73001.00000  74001.00000  4.115267422275e-06
74001.00000  75001.00000  3.371981235873e-06
75001.00000  76001.00000  3.680173069259e-06
76001.00000  77001.00000  3.517012686878e-06
77001.00000  78001.00000  3.553270549630e-06
78001.00000  79001.00000  3.897720245767e-06
79001.00000  80001.00000  3.462625892751e-06
80001.00000  81001.00000  3.553270549630e-06
81001.00000  82001.00000  3.426368030000e-06
82001.00000  83001.00000  3.190691922116e-06
83001.00000  84001.00000  2.846242225979e-06
84001.00000  85001.00000  3.371981235873e-06
85001.00000  86001.00000  2.991273676984e-06
86001.00000  87001.00000  2.791855431852e-06
87001.00000  88001.00000  2.683081843598e-06
88001.00000  89001.00000  2.574308255344e-06
89001.00000  90001.00000  2.556179323968e-06
90001.00000  91001.00000  2.374890010212e-06
91001.00000  92001.00000  1.831022068942e-06
92001.00000  93001.00000  2.447405735714e-06
93001.00000  94001.00000  2.320503216085e-06
94001.00000  95001.00000  2.030440314074e-06
95001.00000  96001.00000  1.976053519947e-06
96001.00000  97001.00000  2.139213902328e-06
97001.00000  98001.00000  1.577217029683e-06
98001.00000  99001.00000  1.867279931693e-06
99001.00000  100001.00000  2.048569245450e-06
100001.00000  101001.00000  2.012311382698e-06
101001.00000  102001.00000  1.722248480688e-06
102001.00000  103001.00000  1.613474892434e-06
103001.00000  104001.00000  1.613474892434e-06
104001.00000  105001.00000  1.577217029683e-06
105001.00000  106001.00000  1.613474892434e-06
106001.00000  107001.00000  1.540959166931e-06
107001.00000  108001.00000  1.269025196296e-06
108001.00000  109001.00000  1.269025196296e-06
109001.00000  110001.00000  1.341540921799e-06
110001.00000  111001.00000  1.486572372804e-06
111001.00000  112001.00000  1.214638402169e-06
112001.00000  113001.00000  1.178380539418e-06
113001.00000  114001.00000  1.395927715926e-06
114001.00000  115001.00000  1.359669853175e-06
115001.00000  116001.00000  1.305283059048e-06
116001.00000  117001.00000  1.087735882540e-06
117001.00000  118001.00000  1.069606951164e-06
118001.00000  119001.00000  1.069606951164e-06
119001.00000  120001.00000  1.123993745291e-06
120001.00000  121001.00000  1.033349088413e-06
121001.00000  122001.00000  1.178380539418e-06
122001.00000  123001.00000  1.160251608042e-06
123001.00000  124001.00000  1.105864813915e-06
124001.00000  125001.00000  1.033349088413e-06
125001.00000  126001.00000  9.064465687831e-07
126001.00000  127001.00000  1.051478019788e-06
127001.00000  128001.00000  9.789622942857e-07
128001.00000  129001.00000  7.614151177778e-07
129001.00000  130001.00000  8.339308432804e-07
130001.00000  131001.00000  8.883176374074e-07
131001.00000  132001.00000  7.976729805291e-07
132001.00000  133001.00000  7.795440491535e-07
133001.00000  134001.00000  9.064465687831e-07
134001.00000  135001.00000  7.614151177778e-07
135001.00000  136001.00000  7.614151177778e-07
136001.00000  137001.00000  8.158019119048e-07
137001.00000  138001.00000  7.795440491535e-07
138001.00000  139001.00000  7.251572550265e-07
139001.00000  140001.00000  7.251572550265e-07
140001.00000  141001.00000  4.713522157672e-07
141001.00000  142001.00000  7.795440491535e-07
142001.00000  143001.00000  7.251572550265e-07
143001.00000  144001.00000  6.707704608995e-07
144001.00000  145001.00000  5.982547353968e-07
145001.00000  146001.00000  8.339308432804e-07
146001.00000  147001.00000  5.982547353968e-07
147001.00000  148001.00000  4.894811471429e-07
148001.00000  149001.00000  5.619968726455e-07
149001.00000  150001.00000  5.801258040212e-07
150001.00000  151001.00000  5.438679412699e-07
151001.00000  152001.00000  5.982547353968e-07
152001.00000  153001.00000  6.345125981482e-07
153001.00000  154001.00000  5.619968726455e-07
154001.00000  155001.00000  3.444496961376e-07
155001.00000  156001.00000  5.438679412699e-07
156001.00000  157001.00000  3.625786275132e-07
157001.00000  158001.00000  4.894811471429e-07
158001.00000  159001.00000  5.619968726455e-07
159001.00000  160001.00000  5.076100785185e-07
160001.00000  161001.00000  3.807075588889e-07
161001.00000  162001.00000  4.350943530159e-07
162001.00000  163001.00000  4.713522157672e-07
163001.00000  164001.00000  5.438679412699e-07
164001.00000  165001.00000  5.438679412699e-07
165001.00000  166001.00000  3.807075588889e-07
166001.00000  167001.00000  2.538050392593e-07
167001.00000  168001.00000  3.807075588889e-07
168001.00000  169001.00000  2.538050392593e-07
169001.00000  170001.00000  2.900629020106e-07
170001.00000  171001.00000  4.532232843915e-07
171001.00000  172001.00000  5.801258040212e-07
172001.00000  173001.00000  2.538050392593e-07
173001.00000  174001.00000  1.812893137566e-07
174001.00000  175001.00000  4.713522157672e-07
175001.00000  176001.00000  3.263207647619e-07
176001.00000  177001.00000  3.625786275132e-07
177001.00000  178001.00000  2.538050392593e-07
178001.00000  179001.00000  3.625786275132e-07
179001.00000  180001.00000  3.807075588889e-07
180001.00000  181001.00000  4.169654216402e-07
181001.00000  182001.00000  1.994182451323e-07
182001.00000  183001.00000  3.263207647619e-07
183001.00000  184001.00000  2.719339706349e-07
184001.00000  185001.00000  1.994182451323e-07
185001.00000  186001.00000  1.631603823810e-07
186001.00000  187001.00000  3.081918333863e-07
187001.00000  188001.00000  3.444496961376e-07
188001.00000  189001.00000  2.175471765079e-07
189001.00000  190001.00000  2.175471765079e-07
190001.00000  191001.00000  2.538050392593e-07
191001.00000  192001.00000  4.169654216402e-07
192001.00000  193001.00000  2.175471765079e-07
193001.00000  194001.00000  2.900629020106e-07
194001.00000  195001.00000  1.631603823810e-07
195001.00000  196001.00000  1.812893137566e-07
196001.00000  197001.00000  1.994182451323e-07
197001.00000  198001.00000  1.812893137566e-07
198001.00000  199001.00000  1.087735882540e-07
