300.00000  350.00000  7.733063434670e-02
350.00000  400.00000  6.156744852442e-02
400.00000  450.00000  5.010110162483e-02
450.00000  500.00000  4.192826064726e-02
500.00000  550.00000  3.574177772852e-02
550.00000  600.00000  3.088476130286e-02
600.00000  650.00000  2.688007525591e-02
650.00000  700.00000  2.368388660289e-02
700.00000  750.00000  2.118681395053e-02
750.00000  800.00000  1.890267309130e-02
800.00000  850.00000  1.711758483881e-02
850.00000  900.00000  1.555829677866e-02
900.00000  950.00000  1.425577349643e-02
950.00000  1000.00000  1.323675713423e-02
1000.00000  1050.00000  1.211137540984e-02
1050.00000  1100.00000  1.119590944751e-02
1100.00000  1150.00000  1.048613680375e-02
1150.00000  1200.00000  9.706794376781e-03
1200.00000  1250.00000  8.965655009957e-03
1250.00000  1300.00000  8.476655840093e-03
1300.00000  1350.00000  7.934373454764e-03
1350.00000  1400.00000  7.467089708562e-03
1400.00000  1450.00000  7.066560783246e-03
1450.00000  1500.00000  6.653565596198e-03
1500.00000  1550.00000  6.320997904194e-03
1550.00000  1600.00000  6.049152970948e-03
1600.00000  1650.00000  5.671344812981e-03
1650.00000  1700.00000  5.395277436245e-03
1700.00000  1750.00000  5.224771146753e-03
1750.00000  1800.00000  4.906077197644e-03
1800.00000  1850.00000  4.733158083301e-03
1850.00000  1900.00000  4.494489491760e-03
1900.00000  1950.00000  4.346703969618e-03
1950.00000  2000.00000  4.170165617997e-03
2000.00000  2050.00000  3.982769554546e-03
2050.00000  2100.00000  3.816284639807e-03
2100.00000  2150.00000  3.626274682767e-03
2150.00000  2200.00000  3.529560619977e-03
2200.00000  2250.00000  3.402083040333e-03
2250.00000  2300.00000  3.265356298760e-03
2300.00000  2350.00000  3.173668954410e-03
2350.00000  2400.00000  3.074542066769e-03
2400.00000  2450.00000  2.931984331805e-03
2450.00000  2500.00000  2.831449963001e-03
2500.00000  2550.00000  2.735339106424e-03
2550.00000  2600.00000  2.676023828830e-03
2600.00000  2650.00000  2.603438014553e-03
2650.00000  2700.00000  2.535878918717e-03
2700.00000  2750.00000  2.436148824863e-03
2750.00000  2800.00000  2.389500877738e-03
2800.00000  2850.00000  2.321941781901e-03
2850.00000  2900.00000  2.242117493071e-03
2900.00000  2950.00000  2.154250454736e-03
2950.00000  3000.00000  2.094935177142e-03
3000.00000  3050.00000  2.033810280909e-03
3050.00000  3100.00000  2.006666001331e-03
3100.00000  3150.00000  1.928852399877e-03
3150.00000  3200.00000  1.893263233320e-03
3200.00000  3250.00000  1.856065516863e-03
3250.00000  3300.00000  1.804591920035e-03
3300.00000  3350.00000  1.751911910782e-03
3350.00000  3400.00000  1.740048855263e-03
3400.00000  3450.00000  1.674500446802e-03
3450.00000  3500.00000  1.652583954403e-03
3500.00000  3550.00000  1.583617377403e-03
3550.00000  3600.00000  1.529529886987e-03
3600.00000  3650.00000  1.492734308004e-03
3650.00000  3700.00000  1.491326826841e-03
3700.00000  3750.00000  1.465992165903e-03
3750.00000  3800.00000  1.420349562465e-03
3800.00000  3850.00000  1.385162533384e-03
3850.00000  3900.00000  1.337509242571e-03
3900.00000  3950.00000  1.329265424329e-03
3950.00000  4000.00000  1.308756413093e-03
4000.00000  4050.00000  1.260902053542e-03
4050.00000  4100.00000  1.245017623271e-03
4100.00000  4150.00000  1.212042350303e-03
4150.00000  4200.00000  1.207618838076e-03
4200.00000  4250.00000  1.184898070726e-03
4250.00000  4300.00000  1.144483254467e-03
4300.00000  4350.00000  1.140260810977e-03
4350.00000  4400.00000  1.103666300732e-03
4400.00000  4450.00000  1.097433169866e-03
4450.00000  4500.00000  1.077728433581e-03
4500.00000  4550.00000  1.037313617322e-03
4550.00000  4600.00000  9.950891824238e-04
4600.00000  4650.00000  1.021630255788e-03
4650.00000  4700.00000  9.763897898262e-04
4700.00000  4750.00000  9.860410892314e-04
4750.00000  4800.00000  9.781994084647e-04
4800.00000  4850.00000  9.536690224765e-04
4850.00000  4900.00000  9.285354302754e-04
4900.00000  4950.00000  8.995815320598e-04
4950.00000  5000.00000  8.979729821589e-04
5000.00000  5050.00000  8.947558823572e-04
5050.00000  5100.00000  8.629870218151e-04
5100.00000  5150.00000  8.450919041679e-04
5150.00000  5200.00000  8.462983165936e-04
5200.00000  5250.00000  8.207625869173e-04
5250.00000  5300.00000  8.221700680806e-04
5300.00000  5350.00000  7.904012075385e-04
5350.00000  5400.00000  7.877873139496e-04
5400.00000  5450.00000  7.815541830837e-04
5450.00000  5500.00000  7.628547904861e-04
5500.00000  5550.00000  7.284720363551e-04
5550.00000  5600.00000  7.443564666261e-04
5600.00000  5650.00000  7.359115796466e-04
5650.00000  5700.00000  7.137940185097e-04
5700.00000  5750.00000  6.832315703932e-04
5750.00000  5800.00000  7.031373754164e-04
5800.00000  5850.00000  6.776016457402e-04
5850.00000  5900.00000  6.693578274982e-04
5900.00000  5950.00000  6.448274415100e-04
5950.00000  6000.00000  6.703631711863e-04
6000.00000  6050.00000  6.448274415100e-04
6050.00000  6100.00000  6.225088116355e-04
6100.00000  6150.00000  6.132596497055e-04
6150.00000  6200.00000  6.474413350989e-04
6200.00000  6250.00000  6.082329312653e-04
6250.00000  6300.00000  6.126564434927e-04
6300.00000  6350.00000  5.935549134199e-04
6350.00000  6400.00000  8.784693146109e-04
6400.00000  6450.00000  5.969730819592e-04
6450.00000  6500.00000  5.768662081984e-04
6500.00000  6550.00000  5.654052901547e-04
6550.00000  6600.00000  5.627913965658e-04
6600.00000  6650.00000  5.396684917408e-04
6650.00000  6700.00000  5.406738354289e-04
6700.00000  6750.00000  5.334353608750e-04
6750.00000  6800.00000  5.471080350323e-04
6800.00000  6850.00000  5.060900125602e-04
6850.00000  6900.00000  5.006611566448e-04
6900.00000  6950.00000  5.145348995398e-04
6950.00000  7000.00000  5.074974937235e-04
7000.00000  7050.00000  4.932216133533e-04
7050.00000  7100.00000  5.268000925339e-04
7100.00000  7150.00000  4.827660389977e-04
7150.00000  7200.00000  4.805542828840e-04
7200.00000  7250.00000  4.833692452105e-04
7250.00000  7300.00000  4.783425267703e-04
7300.00000  7350.00000  4.540132095197e-04
7350.00000  7400.00000  4.606484778608e-04
7400.00000  7450.00000  4.540132095197e-04
7450.00000  7500.00000  4.451661850649e-04
7500.00000  7550.00000  4.445629788521e-04
7550.00000  7600.00000  4.405416040999e-04
7600.00000  7650.00000  4.230486239280e-04
7650.00000  7700.00000  4.065609874441e-04
7700.00000  7750.00000  4.202336616015e-04
7750.00000  7800.00000  4.037460251176e-04
7800.00000  7850.00000  4.051535062808e-04
7850.00000  7900.00000  3.969096880389e-04
7900.00000  7950.00000  3.928883132867e-04
7950.00000  8000.00000  3.890680072722e-04
8000.00000  8050.00000  3.948990006628e-04
8050.00000  8100.00000  3.747921269020e-04
8100.00000  8150.00000  3.872583886337e-04
8150.00000  8200.00000  3.808241890302e-04
8200.00000  8250.00000  3.780092267037e-04
8250.00000  8300.00000  3.727814395259e-04
8300.00000  8350.00000  3.589076966309e-04
8350.00000  8400.00000  3.653418962344e-04
8400.00000  8450.00000  3.585055591557e-04
8450.00000  8500.00000  3.508649471266e-04
8500.00000  8550.00000  3.371922729692e-04
8550.00000  8600.00000  3.480499848001e-04
8600.00000  8650.00000  3.275409735640e-04
8650.00000  8700.00000  3.345783793803e-04
8700.00000  8750.00000  3.460392974240e-04
8750.00000  8800.00000  3.351815855931e-04
8800.00000  8850.00000  3.201014302725e-04
8850.00000  8900.00000  3.390018916077e-04
8900.00000  8950.00000  3.315623483162e-04
8950.00000  9000.00000  3.317634170538e-04
9000.00000  9050.00000  3.102490621297e-04
9050.00000  9100.00000  3.329698294794e-04
9100.00000  9150.00000  3.114554745554e-04
9150.00000  9200.00000  3.036137937886e-04
9200.00000  9250.00000  3.022063126254e-04
9250.00000  9300.00000  3.064287561151e-04
9300.00000  9350.00000  3.146725743571e-04
9350.00000  9400.00000  3.068308935904e-04
9400.00000  9450.00000  2.967774567099e-04
9450.00000  9500.00000  2.991902815612e-04
9500.00000  9550.00000  2.921528757449e-04
9550.00000  9600.00000  2.941635631210e-04
9600.00000  9650.00000  2.845122637158e-04
9650.00000  9700.00000  2.929571506954e-04
9700.00000  9750.00000  2.827026450774e-04
9750.00000  9800.00000  2.853165386663e-04
9800.00000  9850.00000  2.746598955730e-04
9850.00000  9900.00000  2.674214210191e-04
9900.00000  9950.00000  2.730513456722e-04
9950.00000  10000.00000  2.587754653020e-04
