10001.00000  11001.00000  2.187422168988e-05
11001.00000  12001.00000  2.038631085055e-05
12001.00000  13001.00000  1.826072393722e-05
13001.00000  14001.00000  1.705300410010e-05
14001.00000  15001.00000  1.506268180853e-05
15001.00000  16001.00000  1.361341800399e-05
16001.00000  17001.00000  1.241535992557e-05
17001.00000  18001.00000  1.201922781900e-05
18001.00000  19001.00000  1.034774356443e-05
19001.00000  20001.00000  9.207656038187e-06
20001.00000  21001.00000  8.869494483794e-06
21001.00000  22001.00000  8.202833133704e-06
22001.00000  23001.00000  7.574818818403e-06
23001.00000  24001.00000  6.637628224800e-06
24001.00000  25001.00000  7.053083848768e-06
25001.00000  26001.00000  6.231834359528e-06
26001.00000  27001.00000  5.999952150802e-06
27001.00000  28001.00000  5.304305524622e-06
28001.00000  29001.00000  5.371937835500e-06
29001.00000  30001.00000  5.053099798501e-06
30001.00000  31001.00000  4.531364828866e-06
31001.00000  32001.00000  4.048276894019e-06
32001.00000  33001.00000  4.009629859231e-06
33001.00000  34001.00000  3.739100615717e-06
34001.00000  35001.00000  3.681130063535e-06
35001.00000  36001.00000  3.458909613506e-06
36001.00000  37001.00000  3.516880165687e-06
37001.00000  38001.00000  3.149733335203e-06
38001.00000  39001.00000  3.169056852597e-06
39001.00000  40001.00000  2.724615952538e-06
40001.00000  41001.00000  2.444424950327e-06
41001.00000  42001.00000  2.782586504720e-06
42001.00000  43001.00000  2.241528017691e-06
43001.00000  44001.00000  2.541042537296e-06
44001.00000  45001.00000  2.299498569872e-06
45001.00000  46001.00000  2.202880982903e-06
46001.00000  47001.00000  1.961337015479e-06
47001.00000  48001.00000  2.096601637237e-06
48001.00000  49001.00000  1.845395911116e-06
49001.00000  50001.00000  1.768101841541e-06
50001.00000  51001.00000  1.768101841541e-06
51001.00000  52001.00000  1.806748876328e-06
52001.00000  53001.00000  1.758440082844e-06
53001.00000  54001.00000  1.497572598026e-06
54001.00000  55001.00000  1.632837219783e-06
55001.00000  56001.00000  1.497572598026e-06
56001.00000  57001.00000  1.362307976269e-06
57001.00000  58001.00000  1.603851943693e-06
58001.00000  59001.00000  1.188396319724e-06
59001.00000  60001.00000  1.449263804541e-06
60001.00000  61001.00000  1.342984458875e-06
61001.00000  62001.00000  1.420278528451e-06
62001.00000  63001.00000  1.246366871906e-06
63001.00000  64001.00000  1.265690389300e-06
64001.00000  65001.00000  1.140087526239e-06
65001.00000  66001.00000  1.111102250148e-06
66001.00000  67001.00000  1.265690389300e-06
67001.00000  68001.00000  9.468523523004e-07
68001.00000  69001.00000  8.792200414218e-07
69001.00000  70001.00000  9.661758696943e-07
70001.00000  71001.00000  9.275288349065e-07
71001.00000  72001.00000  8.598965240279e-07
72001.00000  73001.00000  8.115877305432e-07
73001.00000  74001.00000  9.758376283912e-07
74001.00000  75001.00000  9.178670762096e-07
75001.00000  76001.00000  9.178670762096e-07
76001.00000  77001.00000  1.062793456664e-06
77001.00000  78001.00000  7.053083848768e-07
78001.00000  79001.00000  8.792200414218e-07
79001.00000  80001.00000  6.376760739982e-07
80001.00000  81001.00000  6.086907979074e-07
81001.00000  82001.00000  7.246319022707e-07
82001.00000  83001.00000  8.212494892401e-07
83001.00000  84001.00000  6.280143153013e-07
84001.00000  85001.00000  6.859848674829e-07
85001.00000  86001.00000  5.603820044227e-07
86001.00000  87001.00000  7.246319022707e-07
87001.00000  88001.00000  6.183525566043e-07
88001.00000  89001.00000  5.507202457257e-07
89001.00000  90001.00000  4.637644174533e-07
90001.00000  91001.00000  6.183525566043e-07
91001.00000  92001.00000  5.410584870288e-07
92001.00000  93001.00000  5.217349696349e-07
93001.00000  94001.00000  5.797055218166e-07
94001.00000  95001.00000  5.603820044227e-07
95001.00000  96001.00000  5.313967283319e-07
96001.00000  97001.00000  5.603820044227e-07
97001.00000  98001.00000  5.700437631196e-07
98001.00000  99001.00000  4.734261761502e-07
99001.00000  100001.00000  4.830879348471e-07
100001.00000  101001.00000  4.927496935441e-07
101001.00000  102001.00000  4.057938652716e-07
102001.00000  103001.00000  4.347791413624e-07
103001.00000  104001.00000  4.541026587563e-07
104001.00000  105001.00000  4.154556239685e-07
105001.00000  106001.00000  3.284997956961e-07
106001.00000  107001.00000  3.478233130899e-07
107001.00000  108001.00000  4.637644174533e-07
108001.00000  109001.00000  3.768085891808e-07
109001.00000  110001.00000  3.961321065747e-07
110001.00000  111001.00000  3.478233130899e-07
111001.00000  112001.00000  4.251173826655e-07
112001.00000  113001.00000  3.671468304838e-07
113001.00000  114001.00000  3.768085891808e-07
114001.00000  115001.00000  3.961321065747e-07
115001.00000  116001.00000  2.898527609083e-07
116001.00000  117001.00000  2.898527609083e-07
117001.00000  118001.00000  2.705292435144e-07
118001.00000  119001.00000  2.222204500297e-07
119001.00000  120001.00000  3.768085891808e-07
120001.00000  121001.00000  2.705292435144e-07
121001.00000  122001.00000  2.995145196052e-07
122001.00000  123001.00000  3.478233130899e-07
123001.00000  124001.00000  2.705292435144e-07
124001.00000  125001.00000  3.091762783022e-07
125001.00000  126001.00000  3.961321065747e-07
126001.00000  127001.00000  2.415439674236e-07
127001.00000  128001.00000  2.705292435144e-07
128001.00000  129001.00000  1.932351739389e-07
129001.00000  130001.00000  2.801910022113e-07
130001.00000  131001.00000  2.608674848175e-07
131001.00000  132001.00000  2.028969326358e-07
132001.00000  133001.00000  2.222204500297e-07
133001.00000  134001.00000  1.739116565450e-07
134001.00000  135001.00000  2.705292435144e-07
135001.00000  136001.00000  1.835734152419e-07
136001.00000  137001.00000  1.545881391511e-07
137001.00000  138001.00000  2.028969326358e-07
138001.00000  139001.00000  1.352646217572e-07
139001.00000  140001.00000  1.835734152419e-07
140001.00000  141001.00000  1.642498978480e-07
141001.00000  142001.00000  1.739116565450e-07
142001.00000  143001.00000  1.352646217572e-07
143001.00000  144001.00000  1.642498978480e-07
144001.00000  145001.00000  2.512057261205e-07
145001.00000  146001.00000  1.449263804541e-07
146001.00000  147001.00000  1.545881391511e-07
147001.00000  148001.00000  1.449263804541e-07
148001.00000  149001.00000  1.256028630603e-07
149001.00000  150001.00000  1.159411043633e-07
150001.00000  151001.00000  7.729406957554e-08
151001.00000  152001.00000  1.256028630603e-07
152001.00000  153001.00000  8.695582827249e-08
153001.00000  154001.00000  9.661758696943e-08
154001.00000  155001.00000  1.449263804541e-07
155001.00000  156001.00000  1.352646217572e-07
156001.00000  157001.00000  9.661758696943e-08
157001.00000  158001.00000  1.835734152419e-07
158001.00000  159001.00000  1.256028630603e-07
159001.00000  160001.00000  9.661758696943e-08
160001.00000  161001.00000  1.159411043633e-07
161001.00000  162001.00000  9.661758696943e-08
162001.00000  163001.00000  1.159411043633e-07
163001.00000  164001.00000  8.695582827249e-08
164001.00000  165001.00000  9.661758696943e-08
165001.00000  166001.00000  7.729406957554e-08
166001.00000  167001.00000  1.256028630603e-07
167001.00000  168001.00000  2.898527609083e-08
168001.00000  169001.00000  1.159411043633e-07
169001.00000  170001.00000  5.797055218166e-08
170001.00000  171001.00000  1.062793456664e-07
171001.00000  172001.00000  1.062793456664e-07
172001.00000  173001.00000  4.830879348471e-08
173001.00000  174001.00000  7.729406957554e-08
174001.00000  175001.00000  2.898527609083e-08
175001.00000  176001.00000  3.864703478777e-08
176001.00000  177001.00000  9.661758696943e-09
177001.00000  178001.00000  8.695582827249e-08
178001.00000  179001.00000  8.695582827249e-08
179001.00000  180001.00000  4.830879348471e-08
180001.00000  181001.00000  7.729406957554e-08
181001.00000  182001.00000  7.729406957554e-08
182001.00000  183001.00000  7.729406957554e-08
183001.00000  184001.00000  1.932351739389e-08
184001.00000  185001.00000  2.898527609083e-08
185001.00000  186001.00000  6.763231087860e-08
186001.00000  187001.00000  1.932351739389e-08
187001.00000  188001.00000  9.661758696943e-09
188001.00000  189001.00000  9.661758696943e-09
189001.00000  190001.00000  9.661758696943e-09
190001.00000  191001.00000  9.661758696943e-09
191001.00000  192001.00000  9.661758696943e-09
192001.00000  193001.00000  2.898527609083e-08
193001.00000  194001.00000  1.932351739389e-08
194001.00000  195001.00000  0.000000000000e+00
195001.00000  196001.00000  9.661758696943e-09
196001.00000  197001.00000  0.000000000000e+00
197001.00000  198001.00000  0.000000000000e+00
198001.00000  199001.00000  0.000000000000e+00
