10001.00000  11001.00000  8.158519381829e-05
11001.00000  12001.00000  7.086689169379e-05
12001.00000  13001.00000  6.118647040849e-05
13001.00000  14001.00000  5.397950345961e-05
14001.00000  15001.00000  4.846030535206e-05
15001.00000  16001.00000  4.233001852610e-05
16001.00000  17001.00000  3.863438675286e-05
17001.00000  18001.00000  3.471565909829e-05
18001.00000  19001.00000  3.229070386650e-05
19001.00000  20001.00000  2.937105776742e-05
20001.00000  21001.00000  2.708190002861e-05
21001.00000  22001.00000  2.376456127153e-05
22001.00000  23001.00000  2.270728079047e-05
23001.00000  24001.00000  2.071881750040e-05
24001.00000  25001.00000  1.960333809378e-05
25001.00000  26001.00000  1.828416244769e-05
26001.00000  27001.00000  1.621810059020e-05
27001.00000  28001.00000  1.509292136265e-05
28001.00000  29001.00000  1.535481652769e-05
29001.00000  30001.00000  1.340515252133e-05
30001.00000  31001.00000  1.296866057961e-05
31001.00000  32001.00000  1.207627705431e-05
32001.00000  33001.00000  1.177558260557e-05
33001.00000  34001.00000  1.063100373616e-05
34001.00000  35001.00000  1.009751358517e-05
35001.00000  36001.00000  9.631922180664e-06
36001.00000  37001.00000  9.622222359737e-06
37001.00000  38001.00000  9.282728627287e-06
38001.00000  39001.00000  8.962634536691e-06
39001.00000  40001.00000  8.244847788081e-06
40001.00000  41001.00000  7.876254592849e-06
41001.00000  42001.00000  7.080869276823e-06
42001.00000  43001.00000  7.333064620929e-06
43001.00000  44001.00000  6.789874649008e-06
44001.00000  45001.00000  6.062388079471e-06
45001.00000  46001.00000  6.139986646889e-06
46001.00000  47001.00000  5.790793093511e-06
47001.00000  48001.00000  5.829592377220e-06
48001.00000  49001.00000  5.994489332981e-06
49001.00000  50001.00000  5.034207061193e-06
50001.00000  51001.00000  5.422199898279e-06
51001.00000  52001.00000  4.617114761325e-06
52001.00000  53001.00000  4.617114761325e-06
53001.00000  54001.00000  4.054525147551e-06
54001.00000  55001.00000  4.704413149670e-06
55001.00000  56001.00000  4.617114761325e-06
56001.00000  57001.00000  3.763530519736e-06
57001.00000  58001.00000  3.899328012716e-06
58001.00000  59001.00000  3.647132668610e-06
59001.00000  60001.00000  3.618033205829e-06
60001.00000  61001.00000  3.618033205829e-06
61001.00000  62001.00000  3.327038578014e-06
62001.00000  63001.00000  3.239740189670e-06
63001.00000  64001.00000  3.016644308345e-06
64001.00000  65001.00000  3.443436429140e-06
65001.00000  66001.00000  3.055443592054e-06
66001.00000  67001.00000  2.861447173511e-06
67001.00000  68001.00000  2.958445382782e-06
68001.00000  69001.00000  2.958445382782e-06
69001.00000  70001.00000  2.725649680530e-06
70001.00000  71001.00000  2.366756306226e-06
71001.00000  72001.00000  2.376456127153e-06
72001.00000  73001.00000  2.250358455100e-06
73001.00000  74001.00000  2.366756306226e-06
74001.00000  75001.00000  2.182459708610e-06
75001.00000  76001.00000  2.492853978279e-06
76001.00000  77001.00000  2.017562752848e-06
77001.00000  78001.00000  2.298857559736e-06
78001.00000  79001.00000  1.988463290067e-06
79001.00000  80001.00000  2.260058276027e-06
80001.00000  81001.00000  1.920564543577e-06
81001.00000  82001.00000  2.124260783047e-06
82001.00000  83001.00000  1.842965976159e-06
83001.00000  84001.00000  1.784767050596e-06
84001.00000  85001.00000  1.910864722649e-06
85001.00000  86001.00000  2.066061857484e-06
86001.00000  87001.00000  1.910864722649e-06
87001.00000  88001.00000  1.581070811126e-06
88001.00000  89001.00000  1.629569915762e-06
89001.00000  90001.00000  1.581070811126e-06
90001.00000  91001.00000  1.581070811126e-06
91001.00000  92001.00000  1.396774213510e-06
92001.00000  93001.00000  1.251276899603e-06
93001.00000  94001.00000  1.435573497219e-06
94001.00000  95001.00000  1.425873676292e-06
95001.00000  96001.00000  1.319175646093e-06
96001.00000  97001.00000  1.202777794967e-06
97001.00000  98001.00000  1.319175646093e-06
98001.00000  99001.00000  1.183378153113e-06
99001.00000  100001.00000  1.086379943841e-06
100001.00000  101001.00000  1.134879048477e-06
101001.00000  102001.00000  1.096079764768e-06
102001.00000  103001.00000  1.154278690331e-06
103001.00000  104001.00000  1.076680122914e-06
104001.00000  105001.00000  1.096079764768e-06
105001.00000  106001.00000  1.105779585696e-06
106001.00000  107001.00000  9.990815554969e-07
107001.00000  108001.00000  8.535842415896e-07
108001.00000  109001.00000  1.037880839206e-06
109001.00000  110001.00000  9.990815554969e-07
110001.00000  111001.00000  8.632840625167e-07
111001.00000  112001.00000  9.408826299340e-07
112001.00000  113001.00000  9.311828090068e-07
113001.00000  114001.00000  1.047580660133e-06
114001.00000  115001.00000  8.438844206624e-07
115001.00000  116001.00000  7.468862113909e-07
116001.00000  117001.00000  6.207885393379e-07
117001.00000  118001.00000  7.565860323180e-07
118001.00000  119001.00000  8.826837043710e-07
119001.00000  120001.00000  8.147849578810e-07
120001.00000  121001.00000  6.983871067551e-07
121001.00000  122001.00000  7.274865695366e-07
122001.00000  123001.00000  7.856854950995e-07
123001.00000  124001.00000  6.401881811922e-07
124001.00000  125001.00000  7.371863904637e-07
125001.00000  126001.00000  7.856854950995e-07
126001.00000  127001.00000  6.401881811922e-07
127001.00000  128001.00000  6.110887184107e-07
128001.00000  129001.00000  6.886872858280e-07
129001.00000  130001.00000  6.498880021193e-07
130001.00000  131001.00000  6.013888974836e-07
131001.00000  132001.00000  5.431899719206e-07
132001.00000  133001.00000  6.207885393379e-07
133001.00000  134001.00000  5.431899719206e-07
134001.00000  135001.00000  6.595878230465e-07
135001.00000  136001.00000  4.849910463577e-07
136001.00000  137001.00000  5.334901509935e-07
137001.00000  138001.00000  5.528897928478e-07
138001.00000  139001.00000  6.304883602650e-07
139001.00000  140001.00000  5.334901509935e-07
140001.00000  141001.00000  4.946908672849e-07
141001.00000  142001.00000  4.849910463577e-07
142001.00000  143001.00000  5.722894347021e-07
143001.00000  144001.00000  5.722894347021e-07
144001.00000  145001.00000  4.461917626491e-07
145001.00000  146001.00000  4.558915835763e-07
146001.00000  147001.00000  4.558915835763e-07
147001.00000  148001.00000  4.364919417219e-07
148001.00000  149001.00000  4.267921207948e-07
149001.00000  150001.00000  3.685931952319e-07
150001.00000  151001.00000  3.491935533776e-07
151001.00000  152001.00000  3.588933743047e-07
152001.00000  153001.00000  4.267921207948e-07
153001.00000  154001.00000  3.685931952319e-07
154001.00000  155001.00000  4.461917626491e-07
155001.00000  156001.00000  3.297939115232e-07
156001.00000  157001.00000  3.200940905961e-07
157001.00000  158001.00000  3.200940905961e-07
158001.00000  159001.00000  3.588933743047e-07
159001.00000  160001.00000  4.073924789405e-07
160001.00000  161001.00000  3.782930161590e-07
161001.00000  162001.00000  4.267921207948e-07
162001.00000  163001.00000  3.394937324504e-07
163001.00000  164001.00000  2.909946278146e-07
164001.00000  165001.00000  3.006944487418e-07
165001.00000  166001.00000  1.939964185431e-07
166001.00000  167001.00000  3.394937324504e-07
167001.00000  168001.00000  3.006944487418e-07
168001.00000  169001.00000  3.103942696689e-07
169001.00000  170001.00000  3.103942696689e-07
170001.00000  171001.00000  2.521953441060e-07
171001.00000  172001.00000  3.200940905961e-07
172001.00000  173001.00000  2.618951650332e-07
173001.00000  174001.00000  3.491935533776e-07
174001.00000  175001.00000  3.297939115232e-07
175001.00000  176001.00000  2.715949859603e-07
176001.00000  177001.00000  2.133960603974e-07
177001.00000  178001.00000  2.521953441060e-07
178001.00000  179001.00000  2.909946278146e-07
179001.00000  180001.00000  3.394937324504e-07
180001.00000  181001.00000  1.842965976159e-07
181001.00000  182001.00000  2.909946278146e-07
182001.00000  183001.00000  2.618951650332e-07
183001.00000  184001.00000  2.715949859603e-07
184001.00000  185001.00000  2.327957022517e-07
185001.00000  186001.00000  2.715949859603e-07
186001.00000  187001.00000  2.618951650332e-07
187001.00000  188001.00000  1.454973139073e-07
188001.00000  189001.00000  2.230958813245e-07
189001.00000  190001.00000  1.357974929802e-07
190001.00000  191001.00000  1.842965976159e-07
191001.00000  192001.00000  2.133960603974e-07
192001.00000  193001.00000  1.842965976159e-07
193001.00000  194001.00000  2.715949859603e-07
194001.00000  195001.00000  2.036962394702e-07
195001.00000  196001.00000  2.036962394702e-07
196001.00000  197001.00000  1.260976720530e-07
197001.00000  198001.00000  2.036962394702e-07
198001.00000  199001.00000  1.745967766888e-07
