300.00000  350.00000  2.091528595061e+00
350.00000  400.00000  1.479056830099e+00
400.00000  450.00000  1.092768360176e+00
450.00000  500.00000  8.366704978665e-01
500.00000  550.00000  6.574564353096e-01
550.00000  600.00000  5.280328484679e-01
600.00000  650.00000  4.315714681914e-01
650.00000  700.00000  3.590906553953e-01
700.00000  750.00000  3.009795565219e-01
750.00000  800.00000  2.571049083373e-01
800.00000  850.00000  2.209322693224e-01
850.00000  900.00000  1.913493457816e-01
900.00000  950.00000  1.683023781150e-01
950.00000  1000.00000  1.477419812420e-01
1000.00000  1050.00000  1.309947300806e-01
1050.00000  1100.00000  1.165909431721e-01
1100.00000  1150.00000  1.048698360206e-01
1150.00000  1200.00000  9.457903709957e-02
1200.00000  1250.00000  8.545883453881e-02
1250.00000  1300.00000  7.759781810163e-02
1300.00000  1350.00000  7.058256889238e-02
1350.00000  1400.00000  6.427528061250e-02
1400.00000  1450.00000  5.901441158867e-02
1450.00000  1500.00000  5.468032778146e-02
1500.00000  1550.00000  5.028869848695e-02
1550.00000  1600.00000  4.638393430216e-02
1600.00000  1650.00000  4.312807120450e-02
1650.00000  1700.00000  4.035907321656e-02
1700.00000  1750.00000  3.699493374148e-02
1750.00000  1800.00000  3.479306167450e-02
1800.00000  1850.00000  3.274868252016e-02
1850.00000  1900.00000  3.082848047001e-02
1900.00000  1950.00000  2.846760113548e-02
1950.00000  2000.00000  2.690781555846e-02
2000.00000  2050.00000  2.521325239275e-02
2050.00000  2100.00000  2.406840006632e-02
2100.00000  2150.00000  2.265474973996e-02
2150.00000  2200.00000  2.157955774027e-02
2200.00000  2250.00000  2.015984999420e-02
2250.00000  2300.00000  1.914901807900e-02
2300.00000  2350.00000  1.800037986525e-02
2350.00000  2400.00000  1.724244522321e-02
2400.00000  2450.00000  1.655568526285e-02
2450.00000  2500.00000  1.574777690815e-02
2500.00000  2550.00000  1.506631719003e-02
2550.00000  2600.00000  1.423115044661e-02
2600.00000  2650.00000  1.365796710593e-02
2650.00000  2700.00000  1.306585432864e-02
2700.00000  2750.00000  1.227611823309e-02
2750.00000  2800.00000  1.175896602479e-02
2800.00000  2850.00000  1.126225760803e-02
2850.00000  2900.00000  1.110249316300e-02
2900.00000  2950.00000  1.036500231251e-02
2950.00000  3000.00000  9.975055918259e-03
3000.00000  3050.00000  9.601767428225e-03
3050.00000  3100.00000  9.292839022680e-03
3100.00000  3150.00000  8.943023034048e-03
3150.00000  3200.00000  8.660595839763e-03
3200.00000  3250.00000  8.300936544092e-03
3250.00000  3300.00000  7.944305958279e-03
3300.00000  3350.00000  7.728510380876e-03
3350.00000  3400.00000  7.390052054213e-03
3400.00000  3450.00000  6.938774285329e-03
3450.00000  3500.00000  6.916816138856e-03
3500.00000  3550.00000  6.740393789611e-03
3550.00000  3600.00000  6.376948606617e-03
3600.00000  3650.00000  6.123294155986e-03
3650.00000  3700.00000  6.050605119387e-03
3700.00000  3750.00000  5.911284465906e-03
3750.00000  3800.00000  5.566011542062e-03
3800.00000  3850.00000  5.452434922376e-03
3850.00000  3900.00000  5.375959998454e-03
3900.00000  3950.00000  5.223767328075e-03
3950.00000  4000.00000  4.946640376042e-03
4000.00000  4050.00000  4.808834077491e-03
4050.00000  4100.00000  4.672542133868e-03
4100.00000  4150.00000  4.602881807127e-03
4150.00000  4200.00000  4.369671148039e-03
4200.00000  4250.00000  4.171290652322e-03
4250.00000  4300.00000  4.173562184715e-03
4300.00000  4350.00000  4.004711610116e-03
4350.00000  4400.00000  4.075129114321e-03
4400.00000  4450.00000  3.809359824257e-03
4450.00000  4500.00000  3.774529660887e-03
4500.00000  4550.00000  3.620065458114e-03
4550.00000  4600.00000  3.423956494790e-03
4600.00000  4650.00000  3.414870365215e-03
4650.00000  4700.00000  3.341424151152e-03
4700.00000  4750.00000  3.236176483577e-03
4750.00000  4800.00000  3.161973092049e-03
4800.00000  4850.00000  3.049153649828e-03
4850.00000  4900.00000  3.047639294898e-03
4900.00000  4950.00000  2.958292354079e-03
4950.00000  5000.00000  2.759911858361e-03
5000.00000  5050.00000  2.866673880866e-03
5050.00000  5100.00000  2.769755165401e-03
5100.00000  5150.00000  2.664507497825e-03
5150.00000  5200.00000  2.603933300660e-03
5200.00000  5250.00000  2.540330393636e-03
5250.00000  5300.00000  2.469912889431e-03
5300.00000  5350.00000  2.454769340139e-03
5350.00000  5400.00000  2.317720219052e-03
5400.00000  5450.00000  2.324534816233e-03
5450.00000  5500.00000  2.302576669760e-03
5500.00000  5550.00000  2.242759650059e-03
5550.00000  5600.00000  2.142055047271e-03
5600.00000  5650.00000  2.164013193744e-03
5650.00000  5700.00000  2.079209317712e-03
5700.00000  5750.00000  2.072394720531e-03
5750.00000  5800.00000  1.976990359995e-03
5800.00000  5850.00000  2.014092055759e-03
5850.00000  5900.00000  1.939888664231e-03
5900.00000  5950.00000  1.884614709317e-03
5950.00000  6000.00000  1.902029791002e-03
6000.00000  6050.00000  1.762709137521e-03
6050.00000  6100.00000  1.814197205112e-03
6100.00000  6150.00000  1.735450748797e-03
6150.00000  6200.00000  1.694563165710e-03
6200.00000  6250.00000  1.703649295285e-03
6250.00000  6300.00000  1.689262923458e-03
6300.00000  6350.00000  1.610516467143e-03
6350.00000  6400.00000  1.703649295285e-03
6400.00000  6450.00000  1.561299931945e-03
6450.00000  6500.00000  1.437880005220e-03
6500.00000  6550.00000  1.540856140402e-03
6550.00000  6600.00000  1.436365650291e-03
6600.00000  6650.00000  1.421979278464e-03
6650.00000  6700.00000  1.457566619299e-03
6700.00000  6750.00000  1.377305808055e-03
6750.00000  6800.00000  1.375034275661e-03
6800.00000  6850.00000  1.353076129188e-03
6850.00000  6900.00000  1.284172979912e-03
6900.00000  6950.00000  1.329603627787e-03
6950.00000  7000.00000  1.244799751755e-03
7000.00000  7050.00000  1.260700478511e-03
7050.00000  7100.00000  1.250099994007e-03
7100.00000  7150.00000  1.186497086983e-03
7150.00000  7200.00000  1.175896602479e-03
7200.00000  7250.00000  1.134251841927e-03
7250.00000  7300.00000  1.106993453203e-03
7300.00000  7350.00000  1.126680067282e-03
7350.00000  7400.00000  1.095635791234e-03
7400.00000  7450.00000  1.082763774337e-03
7450.00000  7500.00000  1.033547239139e-03
7500.00000  7550.00000  1.014617802525e-03
7550.00000  7600.00000  1.036575948998e-03
7600.00000  7650.00000  9.987170757692e-04
7650.00000  7700.00000  9.608582025406e-04
7700.00000  7750.00000  9.873594138006e-04
7750.00000  7800.00000  9.578294926823e-04
7800.00000  7850.00000  9.669156222572e-04
7850.00000  7900.00000  9.192134419892e-04
7900.00000  7950.00000  9.411715884618e-04
7950.00000  8000.00000  9.358713462098e-04
8000.00000  8050.00000  8.556105349653e-04
8050.00000  8100.00000  8.722684391858e-04
8100.00000  8150.00000  8.722684391858e-04
8150.00000  8200.00000  8.442528729967e-04
8200.00000  8250.00000  7.950363377996e-04
8250.00000  8300.00000  8.185088392013e-04
8300.00000  8350.00000  8.071511772327e-04
8350.00000  8400.00000  8.510674701778e-04
8400.00000  8450.00000  7.957935152641e-04
8450.00000  8500.00000  7.367336730276e-04
8500.00000  8550.00000  7.571774645710e-04
8550.00000  8600.00000  7.359764955630e-04
8600.00000  8650.00000  7.367336730276e-04
8650.00000  8700.00000  7.632348842876e-04
8700.00000  8750.00000  7.299190758465e-04
8750.00000  8800.00000  7.321906082402e-04
8800.00000  8850.00000  7.268903659882e-04
8850.00000  8900.00000  7.087181068385e-04
8900.00000  8950.00000  6.655589913579e-04
8950.00000  9000.00000  6.648018138934e-04
9000.00000  9050.00000  6.481439096728e-04
9050.00000  9100.00000  6.701020561454e-04
9100.00000  9150.00000  6.526869744602e-04
9150.00000  9200.00000  6.822168955785e-04
9200.00000  9250.00000  6.367862477042e-04
9250.00000  9300.00000  6.246714082711e-04
9300.00000  9350.00000  5.769692280031e-04
9350.00000  9400.00000  6.087706815151e-04
9400.00000  9450.00000  5.618256787117e-04
9450.00000  9500.00000  5.693974533574e-04
9500.00000  9550.00000  5.974130195465e-04
9550.00000  9600.00000  6.110422139088e-04
9600.00000  9650.00000  5.716689857511e-04
9650.00000  9700.00000  5.292670477351e-04
9700.00000  9750.00000  5.746976956094e-04
9750.00000  9800.00000  5.898412449008e-04
9800.00000  9850.00000  5.428962420974e-04
9850.00000  9900.00000  5.398675322391e-04
9900.00000  9950.00000  5.292670477351e-04
9950.00000  10000.00000  5.186665632311e-04
