10001.00000  11001.00000  7.259511832986e-05
11001.00000  12001.00000  6.429050960132e-05
12001.00000  13001.00000  5.744021037235e-05
13001.00000  14001.00000  5.188374511196e-05
14001.00000  15001.00000  4.521398085535e-05
15001.00000  16001.00000  3.978790196388e-05
16001.00000  17001.00000  3.597660810296e-05
17001.00000  18001.00000  3.221546284547e-05
18001.00000  19001.00000  2.859473367759e-05
19001.00000  20001.00000  2.631798708173e-05
20001.00000  21001.00000  2.385067579282e-05
21001.00000  22001.00000  2.154384003489e-05
22001.00000  23001.00000  1.893611265636e-05
23001.00000  24001.00000  1.747177343612e-05
24001.00000  25001.00000  1.616790974685e-05
25001.00000  26001.00000  1.463336248180e-05
26001.00000  27001.00000  1.290825052370e-05
27001.00000  28001.00000  1.225631867907e-05
28001.00000  29001.00000  1.098254415186e-05
29001.00000  30001.00000  1.044093923479e-05
30001.00000  31001.00000  9.718799345348e-06
31001.00000  32001.00000  8.635589511192e-06
32001.00000  33001.00000  7.823182135574e-06
33001.00000  34001.00000  7.592498559782e-06
34001.00000  35001.00000  6.569467049745e-06
35001.00000  36001.00000  6.248515987773e-06
36001.00000  37001.00000  6.007802691294e-06
37001.00000  38001.00000  5.516346377649e-06
38001.00000  39001.00000  4.914563136451e-06
39001.00000  40001.00000  4.834325370958e-06
40001.00000  41001.00000  4.403047381432e-06
41001.00000  42001.00000  3.971769391907e-06
42001.00000  43001.00000  4.041977436713e-06
43001.00000  44001.00000  3.500372519635e-06
44001.00000  45001.00000  3.289748385216e-06
45001.00000  46001.00000  2.878529837064e-06
46001.00000  47001.00000  2.988856764617e-06
47001.00000  48001.00000  2.607727378525e-06
48001.00000  49001.00000  2.447251847539e-06
49001.00000  50001.00000  2.296806037239e-06
50001.00000  51001.00000  2.377043802732e-06
51001.00000  52001.00000  1.925706371834e-06
52001.00000  53001.00000  1.875557768401e-06
53001.00000  54001.00000  1.715082237414e-06
54001.00000  55001.00000  1.865528047714e-06
55001.00000  56001.00000  1.464339220249e-06
56001.00000  57001.00000  1.504458102995e-06
57001.00000  58001.00000  1.394131175442e-06
58001.00000  59001.00000  1.313893409949e-06
59001.00000  60001.00000  1.043090951410e-06
60001.00000  61001.00000  1.273774527203e-06
61001.00000  62001.00000  1.103269275530e-06
62001.00000  63001.00000  1.123328716903e-06
63001.00000  64001.00000  7.823182135574e-07
64001.00000  65001.00000  8.926451411104e-07
65001.00000  66001.00000  8.725856997372e-07
66001.00000  67001.00000  6.318724032579e-07
67001.00000  68001.00000  7.622587721842e-07
68001.00000  69001.00000  7.421993308109e-07
69001.00000  70001.00000  7.020804480644e-07
70001.00000  71001.00000  6.519318446312e-07
71001.00000  72001.00000  5.917535205114e-07
72001.00000  73001.00000  4.312779895253e-07
73001.00000  74001.00000  6.419021239446e-07
74001.00000  75001.00000  5.516346377649e-07
75001.00000  76001.00000  4.713968722718e-07
76001.00000  77001.00000  4.112185481520e-07
77001.00000  78001.00000  4.112185481520e-07
78001.00000  79001.00000  5.014860343317e-07
79001.00000  80001.00000  3.710996654055e-07
80001.00000  81001.00000  3.109213412857e-07
81001.00000  82001.00000  4.312779895253e-07
82001.00000  83001.00000  3.008916205990e-07
83001.00000  84001.00000  3.410105033456e-07
84001.00000  85001.00000  3.710996654055e-07
85001.00000  86001.00000  2.808321792258e-07
86001.00000  87001.00000  2.206538551059e-07
87001.00000  88001.00000  3.610699447188e-07
88001.00000  89001.00000  1.805349723594e-07
89001.00000  90001.00000  3.008916205990e-07
90001.00000  91001.00000  2.206538551059e-07
91001.00000  92001.00000  2.407132964792e-07
92001.00000  93001.00000  1.604755309861e-07
93001.00000  94001.00000  1.905646930460e-07
94001.00000  95001.00000  2.407132964792e-07
95001.00000  96001.00000  2.005944137327e-07
96001.00000  97001.00000  1.905646930460e-07
97001.00000  98001.00000  2.106241344193e-07
98001.00000  99001.00000  1.805349723594e-07
99001.00000  100001.00000  1.705052516728e-07
100001.00000  101001.00000  1.504458102995e-07
101001.00000  102001.00000  1.303863689262e-07
102001.00000  103001.00000  1.002972068663e-07
103001.00000  104001.00000  1.303863689262e-07
104001.00000  105001.00000  1.002972068663e-07
105001.00000  106001.00000  1.103269275530e-07
106001.00000  107001.00000  1.203566482396e-07
107001.00000  108001.00000  1.002972068663e-07
108001.00000  109001.00000  1.504458102995e-07
109001.00000  110001.00000  8.023776549307e-08
110001.00000  111001.00000  7.020804480644e-08
111001.00000  112001.00000  5.014860343317e-08
112001.00000  113001.00000  6.017832411980e-08
113001.00000  114001.00000  8.023776549307e-08
114001.00000  115001.00000  1.303863689262e-07
115001.00000  116001.00000  2.005944137327e-08
116001.00000  117001.00000  3.008916205990e-08
117001.00000  118001.00000  5.014860343317e-08
118001.00000  119001.00000  6.017832411980e-08
119001.00000  120001.00000  6.017832411980e-08
120001.00000  121001.00000  7.020804480644e-08
121001.00000  122001.00000  5.014860343317e-08
122001.00000  123001.00000  6.017832411980e-08
123001.00000  124001.00000  6.017832411980e-08
124001.00000  125001.00000  7.020804480644e-08
125001.00000  126001.00000  5.014860343317e-08
126001.00000  127001.00000  4.011888274654e-08
127001.00000  128001.00000  7.020804480644e-08
128001.00000  129001.00000  4.011888274654e-08
129001.00000  130001.00000  6.017832411980e-08
130001.00000  131001.00000  6.017832411980e-08
131001.00000  132001.00000  4.011888274654e-08
132001.00000  133001.00000  1.002972068663e-08
133001.00000  134001.00000  4.011888274654e-08
134001.00000  135001.00000  5.014860343317e-08
135001.00000  136001.00000  4.011888274654e-08
136001.00000  137001.00000  3.008916205990e-08
137001.00000  138001.00000  4.011888274654e-08
138001.00000  139001.00000  1.002972068663e-08
139001.00000  140001.00000  1.002972068663e-08
140001.00000  141001.00000  0.000000000000e+00
141001.00000  142001.00000  5.014860343317e-08
142001.00000  143001.00000  1.002972068663e-08
143001.00000  144001.00000  3.008916205990e-08
144001.00000  145001.00000  3.008916205990e-08
145001.00000  146001.00000  1.002972068663e-08
146001.00000  147001.00000  2.005944137327e-08
147001.00000  148001.00000  1.002972068663e-08
148001.00000  149001.00000  0.000000000000e+00
149001.00000  150001.00000  3.008916205990e-08
150001.00000  151001.00000  0.000000000000e+00
151001.00000  152001.00000  2.005944137327e-08
152001.00000  153001.00000  1.002972068663e-08
153001.00000  154001.00000  0.000000000000e+00
154001.00000  155001.00000  1.002972068663e-08
155001.00000  156001.00000  1.002972068663e-08
156001.00000  157001.00000  0.000000000000e+00
157001.00000  158001.00000  1.002972068663e-08
158001.00000  159001.00000  0.000000000000e+00
159001.00000  160001.00000  2.005944137327e-08
160001.00000  161001.00000  0.000000000000e+00
161001.00000  162001.00000  0.000000000000e+00
162001.00000  163001.00000  0.000000000000e+00
163001.00000  164001.00000  0.000000000000e+00
164001.00000  165001.00000  0.000000000000e+00
165001.00000  166001.00000  0.000000000000e+00
166001.00000  167001.00000  0.000000000000e+00
167001.00000  168001.00000  0.000000000000e+00
168001.00000  169001.00000  1.002972068663e-08
169001.00000  170001.00000  0.000000000000e+00
170001.00000  171001.00000  1.002972068663e-08
171001.00000  172001.00000  1.002972068663e-08
172001.00000  173001.00000  0.000000000000e+00
173001.00000  174001.00000  1.002972068663e-08
174001.00000  175001.00000  0.000000000000e+00
175001.00000  176001.00000  0.000000000000e+00
176001.00000  177001.00000  0.000000000000e+00
177001.00000  178001.00000  0.000000000000e+00
178001.00000  179001.00000  1.002972068663e-08
179001.00000  180001.00000  0.000000000000e+00
180001.00000  181001.00000  0.000000000000e+00
181001.00000  182001.00000  0.000000000000e+00
182001.00000  183001.00000  0.000000000000e+00
183001.00000  184001.00000  0.000000000000e+00
184001.00000  185001.00000  0.000000000000e+00
185001.00000  186001.00000  0.000000000000e+00
186001.00000  187001.00000  0.000000000000e+00
187001.00000  188001.00000  0.000000000000e+00
188001.00000  189001.00000  0.000000000000e+00
189001.00000  190001.00000  1.002972068663e-08
190001.00000  191001.00000  0.000000000000e+00
191001.00000  192001.00000  0.000000000000e+00
192001.00000  193001.00000  1.002972068663e-08
193001.00000  194001.00000  0.000000000000e+00
194001.00000  195001.00000  0.000000000000e+00
195001.00000  196001.00000  0.000000000000e+00
196001.00000  197001.00000  0.000000000000e+00
197001.00000  198001.00000  0.000000000000e+00
198001.00000  199001.00000  0.000000000000e+00
