10001.00000  11001.00000  3.777709124178e-05
11001.00000  12001.00000  3.324527327868e-05
12001.00000  13001.00000  2.989566869727e-05
13001.00000  14001.00000  2.853433207594e-05
14001.00000  15001.00000  2.425328664835e-05
15001.00000  16001.00000  2.187094756103e-05
16001.00000  17001.00000  1.925574826217e-05
17001.00000  18001.00000  1.621065318815e-05
18001.00000  19001.00000  1.606735459643e-05
19001.00000  20001.00000  1.366710318515e-05
20001.00000  21001.00000  1.296852255052e-05
21001.00000  22001.00000  1.121311480197e-05
22001.00000  23001.00000  1.137432571765e-05
23001.00000  24001.00000  9.314408461700e-06
24001.00000  25001.00000  8.902425010510e-06
25001.00000  26001.00000  8.382967615530e-06
26001.00000  27001.00000  8.257581347777e-06
27001.00000  28001.00000  6.788770782662e-06
28001.00000  29001.00000  6.645472190944e-06
29001.00000  30001.00000  6.430524303366e-06
30001.00000  31001.00000  5.355784865478e-06
31001.00000  32001.00000  5.516995781161e-06
32001.00000  33001.00000  4.531817963097e-06
33001.00000  34001.00000  4.800502822569e-06
34001.00000  35001.00000  4.424344019308e-06
35001.00000  36001.00000  4.137746835871e-06
36001.00000  37001.00000  3.761588032610e-06
37001.00000  38001.00000  3.636201764856e-06
38001.00000  39001.00000  3.063007397982e-06
39001.00000  40001.00000  3.295867609525e-06
40001.00000  41001.00000  2.776410214545e-06
41001.00000  42001.00000  2.919708806264e-06
42001.00000  43001.00000  2.865971834369e-06
43001.00000  44001.00000  2.794322538510e-06
44001.00000  45001.00000  2.274865143531e-06
45001.00000  46001.00000  2.346514439390e-06
46001.00000  47001.00000  2.167391199742e-06
47001.00000  48001.00000  1.916618664234e-06
48001.00000  49001.00000  1.862881692340e-06
49001.00000  50001.00000  1.809144720446e-06
50001.00000  51001.00000  1.755407748551e-06
51001.00000  52001.00000  1.486722889079e-06
52001.00000  53001.00000  1.432985917185e-06
53001.00000  54001.00000  1.755407748551e-06
54001.00000  55001.00000  1.486722889079e-06
55001.00000  56001.00000  1.415073593220e-06
56001.00000  57001.00000  1.558372184938e-06
57001.00000  58001.00000  1.200125705642e-06
58001.00000  59001.00000  1.021002465994e-06
59001.00000  60001.00000  1.307599649431e-06
60001.00000  61001.00000  1.164301057713e-06
61001.00000  62001.00000  1.164301057713e-06
62001.00000  63001.00000  1.056827113924e-06
63001.00000  64001.00000  9.851778180645e-07
64001.00000  65001.00000  9.314408461700e-07
65001.00000  66001.00000  7.881422544516e-07
66001.00000  67001.00000  8.956161982404e-07
67001.00000  68001.00000  7.344052825571e-07
68001.00000  69001.00000  7.164929585923e-07
69001.00000  70001.00000  7.702299304868e-07
70001.00000  71001.00000  8.597915503108e-07
71001.00000  72001.00000  6.627559866979e-07
72001.00000  73001.00000  4.836327470498e-07
73001.00000  74001.00000  7.523176065220e-07
74001.00000  75001.00000  5.911066908387e-07
75001.00000  76001.00000  5.194573949794e-07
76001.00000  77001.00000  7.702299304868e-07
77001.00000  78001.00000  6.985806346275e-07
78001.00000  79001.00000  4.836327470498e-07
79001.00000  80001.00000  5.373697189443e-07
80001.00000  81001.00000  5.194573949794e-07
81001.00000  82001.00000  5.194573949794e-07
82001.00000  83001.00000  4.657204230850e-07
83001.00000  84001.00000  5.731943668739e-07
84001.00000  85001.00000  6.090190148035e-07
85001.00000  86001.00000  5.552820429091e-07
86001.00000  87001.00000  3.940711272258e-07
87001.00000  88001.00000  4.836327470498e-07
88001.00000  89001.00000  4.657204230850e-07
89001.00000  90001.00000  3.582464792962e-07
90001.00000  91001.00000  3.582464792962e-07
91001.00000  92001.00000  2.686848594721e-07
92001.00000  93001.00000  4.119834511906e-07
93001.00000  94001.00000  3.045095074017e-07
94001.00000  95001.00000  1.970355636129e-07
95001.00000  96001.00000  3.582464792962e-07
96001.00000  97001.00000  3.403341553314e-07
97001.00000  98001.00000  2.328602115425e-07
98001.00000  99001.00000  1.970355636129e-07
99001.00000  100001.00000  2.507725355073e-07
100001.00000  101001.00000  3.224218313666e-07
101001.00000  102001.00000  2.507725355073e-07
102001.00000  103001.00000  2.507725355073e-07
103001.00000  104001.00000  2.686848594721e-07
104001.00000  105001.00000  2.149478875777e-07
105001.00000  106001.00000  3.045095074017e-07
106001.00000  107001.00000  2.865971834369e-07
107001.00000  108001.00000  3.045095074017e-07
108001.00000  109001.00000  2.865971834369e-07
109001.00000  110001.00000  2.328602115425e-07
110001.00000  111001.00000  2.149478875777e-07
111001.00000  112001.00000  2.149478875777e-07
112001.00000  113001.00000  1.253862677537e-07
113001.00000  114001.00000  1.970355636129e-07
114001.00000  115001.00000  7.164929585923e-08
115001.00000  116001.00000  1.970355636129e-07
116001.00000  117001.00000  1.074739437889e-07
117001.00000  118001.00000  2.686848594721e-07
118001.00000  119001.00000  1.432985917185e-07
119001.00000  120001.00000  1.253862677537e-07
120001.00000  121001.00000  1.432985917185e-07
121001.00000  122001.00000  1.970355636129e-07
122001.00000  123001.00000  2.507725355073e-07
123001.00000  124001.00000  1.253862677537e-07
124001.00000  125001.00000  1.253862677537e-07
125001.00000  126001.00000  1.253862677537e-07
126001.00000  127001.00000  8.956161982404e-08
127001.00000  128001.00000  1.612109156833e-07
128001.00000  129001.00000  7.164929585923e-08
129001.00000  130001.00000  1.074739437889e-07
130001.00000  131001.00000  1.074739437889e-07
131001.00000  132001.00000  1.253862677537e-07
132001.00000  133001.00000  0.000000000000e+00
133001.00000  134001.00000  1.074739437889e-07
134001.00000  135001.00000  5.373697189443e-08
135001.00000  136001.00000  1.432985917185e-07
136001.00000  137001.00000  1.074739437889e-07
137001.00000  138001.00000  1.253862677537e-07
138001.00000  139001.00000  7.164929585923e-08
139001.00000  140001.00000  8.956161982404e-08
140001.00000  141001.00000  3.582464792962e-08
141001.00000  142001.00000  8.956161982404e-08
142001.00000  143001.00000  5.373697189443e-08
143001.00000  144001.00000  1.791232396481e-08
144001.00000  145001.00000  8.956161982404e-08
145001.00000  146001.00000  1.074739437889e-07
146001.00000  147001.00000  5.373697189443e-08
147001.00000  148001.00000  3.582464792962e-08
148001.00000  149001.00000  0.000000000000e+00
149001.00000  150001.00000  1.791232396481e-08
150001.00000  151001.00000  1.074739437889e-07
151001.00000  152001.00000  8.956161982404e-08
152001.00000  153001.00000  5.373697189443e-08
153001.00000  154001.00000  3.582464792962e-08
154001.00000  155001.00000  1.791232396481e-08
155001.00000  156001.00000  7.164929585923e-08
156001.00000  157001.00000  5.373697189443e-08
157001.00000  158001.00000  1.791232396481e-08
158001.00000  159001.00000  3.582464792962e-08
159001.00000  160001.00000  1.791232396481e-08
160001.00000  161001.00000  5.373697189443e-08
161001.00000  162001.00000  3.582464792962e-08
162001.00000  163001.00000  3.582464792962e-08
163001.00000  164001.00000  3.582464792962e-08
164001.00000  165001.00000  3.582464792962e-08
165001.00000  166001.00000  0.000000000000e+00
166001.00000  167001.00000  7.164929585923e-08
167001.00000  168001.00000  1.791232396481e-08
168001.00000  169001.00000  1.791232396481e-08
169001.00000  170001.00000  1.791232396481e-08
170001.00000  171001.00000  1.791232396481e-08
171001.00000  172001.00000  1.791232396481e-08
172001.00000  173001.00000  5.373697189443e-08
173001.00000  174001.00000  1.791232396481e-08
174001.00000  175001.00000  0.000000000000e+00
175001.00000  176001.00000  0.000000000000e+00
176001.00000  177001.00000  3.582464792962e-08
177001.00000  178001.00000  1.791232396481e-08
178001.00000  179001.00000  5.373697189443e-08
179001.00000  180001.00000  0.000000000000e+00
180001.00000  181001.00000  0.000000000000e+00
181001.00000  182001.00000  0.000000000000e+00
182001.00000  183001.00000  0.000000000000e+00
183001.00000  184001.00000  0.000000000000e+00
184001.00000  185001.00000  1.791232396481e-08
185001.00000  186001.00000  0.000000000000e+00
186001.00000  187001.00000  0.000000000000e+00
187001.00000  188001.00000  0.000000000000e+00
188001.00000  189001.00000  1.791232396481e-08
189001.00000  190001.00000  0.000000000000e+00
190001.00000  191001.00000  0.000000000000e+00
191001.00000  192001.00000  0.000000000000e+00
192001.00000  193001.00000  0.000000000000e+00
193001.00000  194001.00000  0.000000000000e+00
194001.00000  195001.00000  0.000000000000e+00
195001.00000  196001.00000  0.000000000000e+00
196001.00000  197001.00000  0.000000000000e+00
197001.00000  198001.00000  0.000000000000e+00
198001.00000  199001.00000  0.000000000000e+00
