10001.00000  11001.00000  4.451078643935e-04
11001.00000  12001.00000  3.512530495530e-04
12001.00000  13001.00000  2.744992403249e-04
13001.00000  14001.00000  2.216707816722e-04
14001.00000  15001.00000  1.823705833279e-04
15001.00000  16001.00000  1.516208877899e-04
16001.00000  17001.00000  1.309069936677e-04
17001.00000  18001.00000  1.067809270641e-04
18001.00000  19001.00000  9.116522006112e-05
19001.00000  20001.00000  8.028641132640e-05
20001.00000  21001.00000  6.988932105963e-05
21001.00000  22001.00000  5.780621615501e-05
22001.00000  23001.00000  5.379189558869e-05
23001.00000  24001.00000  4.568296804472e-05
24001.00000  25001.00000  3.889876628764e-05
25001.00000  26001.00000  3.833676140835e-05
26001.00000  27001.00000  3.187370529658e-05
27001.00000  28001.00000  2.773895511327e-05
28001.00000  29001.00000  2.504936033384e-05
29001.00000  30001.00000  2.272105440537e-05
30001.00000  31001.00000  2.003145962594e-05
31001.00000  32001.00000  1.677985996722e-05
32001.00000  33001.00000  1.649885752757e-05
33001.00000  34001.00000  1.682000317288e-05
34001.00000  35001.00000  1.320711466319e-05
35001.00000  36001.00000  1.336768748584e-05
36001.00000  37001.00000  1.140067040835e-05
37001.00000  38001.00000  9.995658210136e-06
38001.00000  39001.00000  9.634369359168e-06
39001.00000  40001.00000  9.192794096872e-06
40001.00000  41001.00000  8.028641132640e-06
41001.00000  42001.00000  7.868068309987e-06
42001.00000  43001.00000  7.868068309987e-06
43001.00000  44001.00000  5.901051232490e-06
44001.00000  45001.00000  6.262340083459e-06
45001.00000  46001.00000  5.379189558869e-06
46001.00000  47001.00000  5.218616736216e-06
47001.00000  48001.00000  5.017900707900e-06
48001.00000  49001.00000  4.977757502237e-06
49001.00000  50001.00000  4.054463771983e-06
50001.00000  51001.00000  3.331886070045e-06
51001.00000  52001.00000  3.693174921014e-06
52001.00000  53001.00000  2.850167602087e-06
53001.00000  54001.00000  3.050883630403e-06
54001.00000  55001.00000  2.970597219077e-06
55001.00000  56001.00000  2.649451573771e-06
56001.00000  57001.00000  2.729737985097e-06
57001.00000  58001.00000  2.087446694486e-06
58001.00000  59001.00000  2.328305928465e-06
59001.00000  60001.00000  2.127589900149e-06
60001.00000  61001.00000  1.766301049181e-06
61001.00000  62001.00000  1.926873871834e-06
62001.00000  63001.00000  1.645871432191e-06
63001.00000  64001.00000  1.726157843518e-06
64001.00000  65001.00000  1.886730666170e-06
65001.00000  66001.00000  1.324725786886e-06
66001.00000  67001.00000  1.525441815202e-06
67001.00000  68001.00000  1.124009758570e-06
68001.00000  69001.00000  1.204296169896e-06
69001.00000  70001.00000  7.225777019376e-07
70001.00000  71001.00000  1.244439375559e-06
71001.00000  72001.00000  9.232937302536e-07
72001.00000  73001.00000  9.634369359168e-07
73001.00000  74001.00000  7.627209076008e-07
74001.00000  75001.00000  8.430073189272e-07
75001.00000  76001.00000  6.021480849480e-07
76001.00000  77001.00000  5.620048792848e-07
77001.00000  78001.00000  4.817184679584e-07
78001.00000  79001.00000  4.817184679584e-07
79001.00000  80001.00000  8.430073189272e-07
80001.00000  81001.00000  4.014320566320e-07
81001.00000  82001.00000  6.824344962744e-07
82001.00000  83001.00000  5.218616736216e-07
83001.00000  84001.00000  4.014320566320e-07
84001.00000  85001.00000  4.415752622952e-07
85001.00000  86001.00000  3.612888509688e-07
86001.00000  87001.00000  4.817184679584e-07
87001.00000  88001.00000  4.817184679584e-07
88001.00000  89001.00000  3.211456453056e-07
89001.00000  90001.00000  5.218616736216e-07
90001.00000  91001.00000  4.817184679584e-07
91001.00000  92001.00000  1.204296169896e-07
92001.00000  93001.00000  2.810024396424e-07
93001.00000  94001.00000  4.817184679584e-07
94001.00000  95001.00000  2.408592339792e-07
95001.00000  96001.00000  2.810024396424e-07
96001.00000  97001.00000  4.415752622952e-07
97001.00000  98001.00000  2.408592339792e-07
98001.00000  99001.00000  2.810024396424e-07
99001.00000  100001.00000  1.605728226528e-07
100001.00000  101001.00000  2.007160283160e-07
101001.00000  102001.00000  1.204296169896e-07
102001.00000  103001.00000  2.007160283160e-07
103001.00000  104001.00000  1.204296169896e-07
104001.00000  105001.00000  4.014320566320e-08
105001.00000  106001.00000  8.028641132640e-08
106001.00000  107001.00000  1.204296169896e-07
107001.00000  108001.00000  1.204296169896e-07
108001.00000  109001.00000  4.014320566320e-08
109001.00000  110001.00000  8.028641132640e-08
110001.00000  111001.00000  1.204296169896e-07
111001.00000  112001.00000  8.028641132640e-08
112001.00000  113001.00000  2.007160283160e-07
113001.00000  114001.00000  8.028641132640e-08
114001.00000  115001.00000  2.810024396424e-07
115001.00000  116001.00000  8.028641132640e-08
116001.00000  117001.00000  1.605728226528e-07
117001.00000  118001.00000  1.204296169896e-07
118001.00000  119001.00000  1.204296169896e-07
119001.00000  120001.00000  1.204296169896e-07
120001.00000  121001.00000  1.204296169896e-07
121001.00000  122001.00000  0.000000000000e+00
122001.00000  123001.00000  1.605728226528e-07
123001.00000  124001.00000  8.028641132640e-08
124001.00000  125001.00000  4.014320566320e-08
125001.00000  126001.00000  4.014320566320e-08
126001.00000  127001.00000  0.000000000000e+00
127001.00000  128001.00000  1.605728226528e-07
128001.00000  129001.00000  4.014320566320e-08
129001.00000  130001.00000  4.014320566320e-08
130001.00000  131001.00000  0.000000000000e+00
131001.00000  132001.00000  8.028641132640e-08
132001.00000  133001.00000  0.000000000000e+00
133001.00000  134001.00000  0.000000000000e+00
134001.00000  135001.00000  8.028641132640e-08
135001.00000  136001.00000  0.000000000000e+00
136001.00000  137001.00000  0.000000000000e+00
137001.00000  138001.00000  4.014320566320e-08
138001.00000  139001.00000  0.000000000000e+00
139001.00000  140001.00000  0.000000000000e+00
140001.00000  141001.00000  0.000000000000e+00
141001.00000  142001.00000  0.000000000000e+00
142001.00000  143001.00000  0.000000000000e+00
143001.00000  144001.00000  4.014320566320e-08
144001.00000  145001.00000  0.000000000000e+00
145001.00000  146001.00000  4.014320566320e-08
146001.00000  147001.00000  4.014320566320e-08
147001.00000  148001.00000  4.014320566320e-08
148001.00000  149001.00000  0.000000000000e+00
149001.00000  150001.00000  4.014320566320e-08
150001.00000  151001.00000  4.014320566320e-08
151001.00000  152001.00000  0.000000000000e+00
152001.00000  153001.00000  4.014320566320e-08
153001.00000  154001.00000  0.000000000000e+00
154001.00000  155001.00000  0.000000000000e+00
155001.00000  156001.00000  0.000000000000e+00
156001.00000  157001.00000  4.014320566320e-08
157001.00000  158001.00000  0.000000000000e+00
158001.00000  159001.00000  0.000000000000e+00
159001.00000  160001.00000  8.028641132640e-08
160001.00000  161001.00000  0.000000000000e+00
161001.00000  162001.00000  4.014320566320e-08
162001.00000  163001.00000  4.014320566320e-08
163001.00000  164001.00000  0.000000000000e+00
164001.00000  165001.00000  8.028641132640e-08
165001.00000  166001.00000  8.028641132640e-08
166001.00000  167001.00000  0.000000000000e+00
167001.00000  168001.00000  0.000000000000e+00
168001.00000  169001.00000  0.000000000000e+00
169001.00000  170001.00000  4.014320566320e-08
170001.00000  171001.00000  4.014320566320e-08
171001.00000  172001.00000  0.000000000000e+00
172001.00000  173001.00000  0.000000000000e+00
173001.00000  174001.00000  4.014320566320e-08
174001.00000  175001.00000  0.000000000000e+00
175001.00000  176001.00000  0.000000000000e+00
176001.00000  177001.00000  0.000000000000e+00
177001.00000  178001.00000  0.000000000000e+00
178001.00000  179001.00000  0.000000000000e+00
179001.00000  180001.00000  0.000000000000e+00
180001.00000  181001.00000  0.000000000000e+00
181001.00000  182001.00000  0.000000000000e+00
182001.00000  183001.00000  0.000000000000e+00
183001.00000  184001.00000  0.000000000000e+00
184001.00000  185001.00000  0.000000000000e+00
185001.00000  186001.00000  0.000000000000e+00
186001.00000  187001.00000  0.000000000000e+00
187001.00000  188001.00000  4.014320566320e-08
188001.00000  189001.00000  0.000000000000e+00
189001.00000  190001.00000  0.000000000000e+00
190001.00000  191001.00000  0.000000000000e+00
191001.00000  192001.00000  0.000000000000e+00
192001.00000  193001.00000  0.000000000000e+00
193001.00000  194001.00000  0.000000000000e+00
194001.00000  195001.00000  4.014320566320e-08
195001.00000  196001.00000  0.000000000000e+00
196001.00000  197001.00000  0.000000000000e+00
197001.00000  198001.00000  4.014320566320e-08
198001.00000  199001.00000  0.000000000000e+00
