300.00000  350.00000  1.027414768510e+00
350.00000  400.00000  7.274422555998e-01
400.00000  450.00000  5.355103635471e-01
450.00000  500.00000  4.094791636392e-01
500.00000  550.00000  3.214820453690e-01
550.00000  600.00000  2.580911064422e-01
600.00000  650.00000  2.109549543524e-01
650.00000  700.00000  1.756771052156e-01
700.00000  750.00000  1.470188706927e-01
750.00000  800.00000  1.253744570632e-01
800.00000  850.00000  1.076873606480e-01
850.00000  900.00000  9.329521855361e-02
900.00000  950.00000  8.209686990181e-02
950.00000  1000.00000  7.231477354580e-02
1000.00000  1050.00000  6.391681492106e-02
1050.00000  1100.00000  5.644134716246e-02
1100.00000  1150.00000  5.063182243888e-02
1150.00000  1200.00000  4.577449455363e-02
1200.00000  1250.00000  4.143902834201e-02
1250.00000  1300.00000  3.743113068859e-02
1300.00000  1350.00000  3.401654961488e-02
1350.00000  1400.00000  3.125549992937e-02
1400.00000  1450.00000  2.869356054394e-02
1450.00000  1500.00000  2.637007180015e-02
1500.00000  1550.00000  2.454676739893e-02
1550.00000  1600.00000  2.254201570811e-02
1600.00000  1650.00000  2.062397334152e-02
1650.00000  1700.00000  1.941887430752e-02
1700.00000  1750.00000  1.794722438790e-02
1750.00000  1800.00000  1.674935113091e-02
1800.00000  1850.00000  1.552418049407e-02
1850.00000  1900.00000  1.475423380945e-02
1900.00000  1950.00000  1.373539924972e-02
1950.00000  2000.00000  1.291647785419e-02
2000.00000  2050.00000  1.207266767115e-02
2050.00000  2100.00000  1.144161647812e-02
2100.00000  2150.00000  1.089165456054e-02
2150.00000  2200.00000  1.016425967392e-02
2200.00000  2250.00000  9.667286787811e-03
2250.00000  2300.00000  9.083604577468e-03
2300.00000  2350.00000  8.700638395442e-03
2350.00000  2400.00000  8.172353808914e-03
2400.00000  2450.00000  7.802233452699e-03
2450.00000  2500.00000  7.442550329957e-03
2500.00000  2550.00000  7.031483903966e-03
2550.00000  2600.00000  6.593120098124e-03
2600.00000  2650.00000  6.468676160568e-03
2650.00000  2700.00000  6.161179205188e-03
2700.00000  2750.00000  5.848865065128e-03
2750.00000  2800.00000  5.599174325903e-03
2800.00000  2850.00000  5.362329412490e-03
2850.00000  2900.00000  5.091764206320e-03
2900.00000  2950.00000  4.789887299733e-03
2950.00000  3000.00000  4.666246226290e-03
3000.00000  3050.00000  4.472755974994e-03
3050.00000  3100.00000  4.447064323369e-03
3100.00000  3150.00000  4.145990280895e-03
3150.00000  3200.00000  4.064901005455e-03
3200.00000  3250.00000  3.940457067900e-03
3250.00000  3300.00000  3.714049387959e-03
3300.00000  3350.00000  3.684343415768e-03
3350.00000  3400.00000  3.415383937825e-03
3400.00000  3450.00000  3.354366265217e-03
3450.00000  3500.00000  3.237950968794e-03
3500.00000  3550.00000  3.153650236901e-03
3550.00000  3600.00000  2.901550905336e-03
3600.00000  3650.00000  2.911988138808e-03
3650.00000  3700.00000  2.745795267363e-03
3700.00000  3750.00000  2.641422932638e-03
3750.00000  3800.00000  2.576390939464e-03
3800.00000  3850.00000  2.488878751118e-03
3850.00000  3900.00000  2.436692583756e-03
3900.00000  3950.00000  2.353997580090e-03
3950.00000  4000.00000  2.329108792579e-03
4000.00000  4050.00000  2.325897336126e-03
4050.00000  4100.00000  2.170141698152e-03
4100.00000  4150.00000  2.129998492489e-03
4150.00000  4200.00000  1.972637126290e-03
4200.00000  4250.00000  1.929282464173e-03
4250.00000  4300.00000  1.949354067005e-03
4300.00000  4350.00000  1.841770275828e-03
4350.00000  4400.00000  1.855418965753e-03
4400.00000  4450.00000  1.710100561252e-03
4450.00000  4500.00000  1.690028958421e-03
4500.00000  4550.00000  1.637842791058e-03
4550.00000  4600.00000  1.651491480984e-03
4600.00000  4650.00000  1.576022254337e-03
4650.00000  4700.00000  1.546316282146e-03
4700.00000  4750.00000  1.486904337765e-03
4750.00000  4800.00000  1.446761132102e-03
4800.00000  4850.00000  1.413843703458e-03
4850.00000  4900.00000  1.386546323607e-03
4900.00000  4950.00000  1.329542971565e-03
4950.00000  5000.00000  1.316697145753e-03
5000.00000  5050.00000  1.291808358242e-03
5050.00000  5100.00000  1.282976852996e-03
5100.00000  5150.00000  1.245242239672e-03
5150.00000  5200.00000  1.198676121103e-03
5200.00000  5250.00000  1.166561556573e-03
5250.00000  5300.00000  1.083866552906e-03
5300.00000  5350.00000  1.148095681967e-03
5350.00000  5400.00000  1.069414998868e-03
5400.00000  5450.00000  9.859171310881e-04
5450.00000  5500.00000  1.062189221848e-03
5500.00000  5550.00000  1.038103298450e-03
5550.00000  5600.00000  1.005988733920e-03
5600.00000  5650.00000  9.746770335024e-04
5650.00000  5700.00000  9.409567407454e-04
5700.00000  5750.00000  9.232937302536e-04
5750.00000  5800.00000  8.976020786291e-04
5800.00000  5850.00000  8.799390681373e-04
5850.00000  5900.00000  8.598674653057e-04
5900.00000  5950.00000  8.831505245904e-04
5950.00000  6000.00000  8.181185314160e-04
6000.00000  6050.00000  8.245414443221e-04
6050.00000  6100.00000  8.076812979435e-04
6100.00000  6150.00000  7.490722176753e-04
6150.00000  6200.00000  7.860039668854e-04
6200.00000  6250.00000  7.771724616395e-04
6250.00000  6300.00000  7.338177995233e-04
6300.00000  6350.00000  6.864488168407e-04
6350.00000  6400.00000  7.715524128467e-04
6400.00000  6450.00000  6.503199317438e-04
6450.00000  6500.00000  6.487142035173e-04
6500.00000  6550.00000  6.744058551417e-04
6550.00000  6600.00000  6.671800781224e-04
6600.00000  6650.00000  6.214168236663e-04
6650.00000  6700.00000  5.965280361551e-04
6700.00000  6750.00000  6.559399805367e-04
6750.00000  6800.00000  6.133881825337e-04
6800.00000  6850.00000  5.467504611328e-04
6850.00000  6900.00000  5.732449768705e-04
6900.00000  6950.00000  5.636106075113e-04
6950.00000  7000.00000  5.547791022654e-04
7000.00000  7050.00000  5.419332764532e-04
7050.00000  7100.00000  5.339046353205e-04
7100.00000  7150.00000  4.929585655441e-04
7150.00000  7200.00000  5.162416248287e-04
7200.00000  7250.00000  5.218616736216e-04
7250.00000  7300.00000  5.154387607155e-04
7300.00000  7350.00000  5.258759941879e-04
7350.00000  7400.00000  4.921557014308e-04
7400.00000  7450.00000  5.001843425634e-04
7450.00000  7500.00000  4.600411369002e-04
7500.00000  7550.00000  4.793098756186e-04
7550.00000  7600.00000  4.439838546350e-04
7600.00000  7650.00000  4.479981752013e-04
7650.00000  7700.00000  4.311380288227e-04
7700.00000  7750.00000  4.343494852758e-04
7750.00000  7800.00000  4.239122518034e-04
7800.00000  7850.00000  3.749375408943e-04
7850.00000  7900.00000  4.174893388973e-04
7900.00000  7950.00000  3.926005513861e-04
7950.00000  8000.00000  4.006291925187e-04
8000.00000  8050.00000  3.717260844412e-04
8050.00000  8100.00000  3.877833667065e-04
8100.00000  8150.00000  4.086578336514e-04
8150.00000  8200.00000  3.315828787780e-04
8200.00000  8250.00000  3.508516174964e-04
8250.00000  8300.00000  3.572745304025e-04
8300.00000  8350.00000  3.476401610433e-04
8350.00000  8400.00000  3.388086557974e-04
8400.00000  8450.00000  3.355971993443e-04
8450.00000  8500.00000  3.612888509688e-04
8500.00000  8550.00000  3.323857428913e-04
8550.00000  8600.00000  3.283714223250e-04
8600.00000  8650.00000  3.420201122504e-04
8650.00000  8700.00000  3.195399170791e-04
8700.00000  8750.00000  3.195399170791e-04
8750.00000  8800.00000  2.978625860209e-04
8800.00000  8850.00000  2.793967114159e-04
8850.00000  8900.00000  3.099055477199e-04
8900.00000  8950.00000  2.914396731148e-04
8950.00000  9000.00000  2.962568577944e-04
9000.00000  9050.00000  2.978625860209e-04
9050.00000  9100.00000  2.729737985097e-04
9100.00000  9150.00000  2.890310807750e-04
9150.00000  9200.00000  2.737766626230e-04
9200.00000  9250.00000  2.689594779434e-04
9250.00000  9300.00000  2.962568577944e-04
9300.00000  9350.00000  2.793967114159e-04
9350.00000  9400.00000  2.376477775261e-04
9400.00000  9450.00000  2.818053037557e-04
9450.00000  9500.00000  2.368449134129e-04
9500.00000  9550.00000  2.512964674516e-04
9550.00000  9600.00000  2.352391851863e-04
9600.00000  9650.00000  2.400563698659e-04
9650.00000  9700.00000  2.649451573771e-04
9700.00000  9750.00000  2.328305928465e-04
9750.00000  9800.00000  2.368449134129e-04
9800.00000  9850.00000  2.400563698659e-04
9850.00000  9900.00000  2.416620980925e-04
9900.00000  9950.00000  2.095475335619e-04
9950.00000  10000.00000  2.352391851863e-04
