10001.00000  11001.00000  3.178212294409e-04
11001.00000  12001.00000  2.553953810268e-04
12001.00000  13001.00000  2.145470010752e-04
13001.00000  14001.00000  1.757447603744e-04
14001.00000  15001.00000  1.449782665494e-04
15001.00000  16001.00000  1.229171651730e-04
16001.00000  17001.00000  1.084453802903e-04
17001.00000  18001.00000  9.642896250858e-05
18001.00000  19001.00000  7.868335482471e-05
19001.00000  20001.00000  7.079641807632e-05
20001.00000  21001.00000  6.197941803214e-05
21001.00000  22001.00000  5.357164583810e-05
22001.00000  23001.00000  4.959097493207e-05
23001.00000  24001.00000  4.233648122483e-05
24001.00000  25001.00000  3.854182297797e-05
25001.00000  26001.00000  3.552841789957e-05
26001.00000  27001.00000  3.110131661156e-05
27001.00000  28001.00000  3.017125331576e-05
28001.00000  29001.00000  2.723225330103e-05
29001.00000  30001.00000  2.447926594547e-05
30001.00000  31001.00000  2.325158239501e-05
31001.00000  32001.00000  2.213550644005e-05
32001.00000  33001.00000  1.964293680730e-05
33001.00000  34001.00000  1.763400008837e-05
34001.00000  35001.00000  1.796882287486e-05
35001.00000  36001.00000  1.584827856044e-05
36001.00000  37001.00000  1.473220260548e-05
37001.00000  38001.00000  1.469500007365e-05
38001.00000  39001.00000  1.279767095021e-05
39001.00000  40001.00000  1.313249373670e-05
40001.00000  41001.00000  1.264886082288e-05
41001.00000  42001.00000  1.108635448594e-05
42001.00000  43001.00000  1.045391144480e-05
43001.00000  44001.00000  9.263430426171e-06
44001.00000  45001.00000  9.300632958003e-06
45001.00000  46001.00000  8.668189916859e-06
46001.00000  47001.00000  8.370569662203e-06
47001.00000  48001.00000  6.473240538770e-06
48001.00000  49001.00000  7.180088643579e-06
49001.00000  50001.00000  6.882468388923e-06
50001.00000  51001.00000  5.394367115642e-06
51001.00000  52001.00000  6.250025347778e-06
52001.00000  53001.00000  5.245556988314e-06
53001.00000  54001.00000  5.580379774802e-06
54001.00000  55001.00000  6.026810156786e-06
55001.00000  56001.00000  4.464303819842e-06
56001.00000  57001.00000  4.687519010834e-06
57001.00000  58001.00000  4.724721542666e-06
58001.00000  59001.00000  3.906265842361e-06
59001.00000  60001.00000  3.645848119537e-06
60001.00000  61001.00000  4.464303819842e-06
61001.00000  62001.00000  3.943468374193e-06
62001.00000  63001.00000  3.385430396713e-06
63001.00000  64001.00000  3.385430396713e-06
64001.00000  65001.00000  3.013405078393e-06
65001.00000  66001.00000  3.050607610225e-06
66001.00000  67001.00000  3.162215205721e-06
67001.00000  68001.00000  2.678582291905e-06
68001.00000  69001.00000  3.125012673889e-06
69001.00000  70001.00000  2.232151909921e-06
70001.00000  71001.00000  2.418164569081e-06
71001.00000  72001.00000  2.232151909921e-06
72001.00000  73001.00000  2.455367100913e-06
73001.00000  74001.00000  3.087810142057e-06
74001.00000  75001.00000  2.418164569081e-06
75001.00000  76001.00000  2.120544314425e-06
76001.00000  77001.00000  1.488101273281e-06
77001.00000  78001.00000  1.748518996105e-06
78001.00000  79001.00000  2.008936718929e-06
79001.00000  80001.00000  1.599708868777e-06
80001.00000  81001.00000  1.450898741449e-06
81001.00000  82001.00000  1.785721527937e-06
82001.00000  83001.00000  1.636911400609e-06
83001.00000  84001.00000  1.711316464273e-06
84001.00000  85001.00000  1.450898741449e-06
85001.00000  86001.00000  1.934531655265e-06
86001.00000  87001.00000  1.376493677785e-06
87001.00000  88001.00000  1.078873423128e-06
88001.00000  89001.00000  1.078873423128e-06
89001.00000  90001.00000  1.934531655265e-06
90001.00000  91001.00000  1.302088614120e-06
91001.00000  92001.00000  1.339291145952e-06
92001.00000  93001.00000  1.525303805113e-06
93001.00000  94001.00000  1.376493677785e-06
94001.00000  95001.00000  9.300632958003e-07
95001.00000  96001.00000  7.440506366403e-07
96001.00000  97001.00000  1.041670891296e-06
97001.00000  98001.00000  1.041670891296e-06
98001.00000  99001.00000  1.227683550456e-06
99001.00000  100001.00000  1.078873423128e-06
100001.00000  101001.00000  1.004468359464e-06
101001.00000  102001.00000  9.300632958003e-07
102001.00000  103001.00000  7.068481048083e-07
103001.00000  104001.00000  7.440506366403e-07
104001.00000  105001.00000  7.068481048083e-07
105001.00000  106001.00000  1.041670891296e-06
106001.00000  107001.00000  7.068481048083e-07
107001.00000  108001.00000  7.440506366403e-07
108001.00000  109001.00000  7.068481048083e-07
109001.00000  110001.00000  7.812531684723e-07
110001.00000  111001.00000  6.696455729762e-07
111001.00000  112001.00000  9.672658276324e-07
112001.00000  113001.00000  8.928607639683e-07
113001.00000  114001.00000  7.440506366403e-07
114001.00000  115001.00000  5.952405093122e-07
115001.00000  116001.00000  6.324430411442e-07
116001.00000  117001.00000  7.068481048083e-07
117001.00000  118001.00000  5.208354456482e-07
118001.00000  119001.00000  7.440506366403e-07
119001.00000  120001.00000  4.092278501522e-07
120001.00000  121001.00000  7.068481048083e-07
121001.00000  122001.00000  4.092278501522e-07
122001.00000  123001.00000  6.324430411442e-07
123001.00000  124001.00000  4.464303819842e-07
124001.00000  125001.00000  5.580379774802e-07
125001.00000  126001.00000  6.324430411442e-07
126001.00000  127001.00000  4.464303819842e-07
127001.00000  128001.00000  6.324430411442e-07
128001.00000  129001.00000  5.208354456482e-07
129001.00000  130001.00000  4.092278501522e-07
130001.00000  131001.00000  3.720253183201e-07
131001.00000  132001.00000  4.464303819842e-07
132001.00000  133001.00000  6.696455729762e-07
133001.00000  134001.00000  2.604177228241e-07
134001.00000  135001.00000  4.836329138162e-07
135001.00000  136001.00000  5.208354456482e-07
136001.00000  137001.00000  4.092278501522e-07
137001.00000  138001.00000  1.860126591601e-07
138001.00000  139001.00000  4.092278501522e-07
139001.00000  140001.00000  2.232151909921e-07
140001.00000  141001.00000  1.860126591601e-07
141001.00000  142001.00000  2.232151909921e-07
142001.00000  143001.00000  3.348227864881e-07
143001.00000  144001.00000  4.464303819842e-07
144001.00000  145001.00000  2.604177228241e-07
145001.00000  146001.00000  3.720253183201e-07
146001.00000  147001.00000  2.976202546561e-07
147001.00000  148001.00000  2.976202546561e-07
148001.00000  149001.00000  1.860126591601e-07
149001.00000  150001.00000  2.976202546561e-07
150001.00000  151001.00000  1.488101273281e-07
151001.00000  152001.00000  4.836329138162e-07
152001.00000  153001.00000  1.116075954960e-07
153001.00000  154001.00000  1.860126591601e-07
154001.00000  155001.00000  4.092278501522e-07
155001.00000  156001.00000  2.232151909921e-07
156001.00000  157001.00000  1.116075954960e-07
157001.00000  158001.00000  1.860126591601e-07
158001.00000  159001.00000  2.604177228241e-07
159001.00000  160001.00000  2.232151909921e-07
160001.00000  161001.00000  2.232151909921e-07
161001.00000  162001.00000  2.232151909921e-07
162001.00000  163001.00000  2.976202546561e-07
163001.00000  164001.00000  2.604177228241e-07
164001.00000  165001.00000  2.976202546561e-07
165001.00000  166001.00000  2.604177228241e-07
166001.00000  167001.00000  2.976202546561e-07
167001.00000  168001.00000  2.232151909921e-07
168001.00000  169001.00000  2.976202546561e-07
169001.00000  170001.00000  1.860126591601e-07
170001.00000  171001.00000  2.232151909921e-07
171001.00000  172001.00000  1.488101273281e-07
172001.00000  173001.00000  2.232151909921e-07
173001.00000  174001.00000  1.860126591601e-07
174001.00000  175001.00000  1.860126591601e-07
175001.00000  176001.00000  1.860126591601e-07
176001.00000  177001.00000  2.232151909921e-07
177001.00000  178001.00000  0.000000000000e+00
178001.00000  179001.00000  1.860126591601e-07
179001.00000  180001.00000  3.720253183201e-08
180001.00000  181001.00000  1.116075954960e-07
181001.00000  182001.00000  1.488101273281e-07
182001.00000  183001.00000  1.116075954960e-07
183001.00000  184001.00000  1.488101273281e-07
184001.00000  185001.00000  2.604177228241e-07
185001.00000  186001.00000  1.860126591601e-07
186001.00000  187001.00000  1.860126591601e-07
187001.00000  188001.00000  1.860126591601e-07
188001.00000  189001.00000  1.860126591601e-07
189001.00000  190001.00000  1.488101273281e-07
190001.00000  191001.00000  7.440506366403e-08
191001.00000  192001.00000  3.720253183201e-08
192001.00000  193001.00000  7.440506366403e-08
193001.00000  194001.00000  1.488101273281e-07
194001.00000  195001.00000  1.488101273281e-07
195001.00000  196001.00000  7.440506366403e-08
196001.00000  197001.00000  7.440506366403e-08
197001.00000  198001.00000  3.720253183201e-08
198001.00000  199001.00000  1.860126591601e-07
