10001.00000  11001.00000  2.882687054377e-04
11001.00000  12001.00000  2.202983189973e-04
12001.00000  13001.00000  1.749309114207e-04
13001.00000  14001.00000  1.416318800589e-04
14001.00000  15001.00000  1.200783252138e-04
15001.00000  16001.00000  9.816150820840e-05
16001.00000  17001.00000  8.306594732438e-05
17001.00000  18001.00000  7.091684618510e-05
18001.00000  19001.00000  6.131058016799e-05
19001.00000  20001.00000  5.380316218824e-05
20001.00000  21001.00000  4.375290908631e-05
21001.00000  22001.00000  3.927267577581e-05
22001.00000  23001.00000  3.487316738983e-05
23001.00000  24001.00000  3.164417040929e-05
24001.00000  25001.00000  2.498436413692e-05
25001.00000  26001.00000  2.571088845755e-05
26001.00000  27001.00000  1.933361942098e-05
27001.00000  28001.00000  1.937398188324e-05
28001.00000  29001.00000  1.614498490270e-05
29001.00000  30001.00000  1.473229872371e-05
30001.00000  31001.00000  1.287562545990e-05
31001.00000  32001.00000  1.134185189415e-05
32001.00000  33001.00000  1.118040204512e-05
33001.00000  34001.00000  9.404453705821e-06
34001.00000  35001.00000  9.404453705821e-06
35001.00000  36001.00000  9.162278932281e-06
36001.00000  37001.00000  7.588142904268e-06
37001.00000  38001.00000  6.780893659133e-06
38001.00000  39001.00000  5.408569942404e-06
39001.00000  40001.00000  5.206757631120e-06
40001.00000  41001.00000  5.327845017890e-06
41001.00000  42001.00000  4.682045621782e-06
42001.00000  43001.00000  4.601320697269e-06
43001.00000  44001.00000  3.592259140850e-06
44001.00000  45001.00000  3.390446829566e-06
45001.00000  46001.00000  3.027184669256e-06
46001.00000  47001.00000  3.148272056026e-06
47001.00000  48001.00000  3.027184669256e-06
48001.00000  49001.00000  2.381385273148e-06
49001.00000  50001.00000  2.865734820229e-06
50001.00000  51001.00000  3.188634518283e-06
51001.00000  52001.00000  1.856673263810e-06
52001.00000  53001.00000  2.058485575094e-06
53001.00000  54001.00000  2.098848037351e-06
54001.00000  55001.00000  1.775948339297e-06
55001.00000  56001.00000  1.695223414783e-06
56001.00000  57001.00000  1.574136028013e-06
57001.00000  58001.00000  1.089786480932e-06
58001.00000  59001.00000  1.210873867702e-06
59001.00000  60001.00000  1.493411103500e-06
60001.00000  61001.00000  9.686990941619e-07
61001.00000  62001.00000  1.291598792216e-06
62001.00000  63001.00000  1.170511405446e-06
63001.00000  64001.00000  9.686990941619e-07
64001.00000  65001.00000  1.210873867702e-06
65001.00000  66001.00000  8.879741696484e-07
66001.00000  67001.00000  1.009061556419e-06
67001.00000  68001.00000  8.072492451349e-07
68001.00000  69001.00000  8.879741696484e-07
69001.00000  70001.00000  5.650744715944e-07
70001.00000  71001.00000  4.036246225674e-07
71001.00000  72001.00000  8.476117073916e-07
72001.00000  73001.00000  6.457993961079e-07
73001.00000  74001.00000  6.457993961079e-07
74001.00000  75001.00000  5.650744715944e-07
75001.00000  76001.00000  4.843495470809e-07
76001.00000  77001.00000  4.439870848242e-07
77001.00000  78001.00000  7.265243206214e-07
78001.00000  79001.00000  2.825372357972e-07
79001.00000  80001.00000  2.825372357972e-07
80001.00000  81001.00000  1.210873867702e-07
81001.00000  82001.00000  2.825372357972e-07
82001.00000  83001.00000  2.421747735405e-07
83001.00000  84001.00000  2.421747735405e-07
84001.00000  85001.00000  2.825372357972e-07
85001.00000  86001.00000  1.614498490270e-07
86001.00000  87001.00000  3.228996980540e-07
87001.00000  88001.00000  4.036246225674e-08
88001.00000  89001.00000  2.421747735405e-07
89001.00000  90001.00000  2.825372357972e-07
90001.00000  91001.00000  4.036246225674e-08
91001.00000  92001.00000  2.421747735405e-07
92001.00000  93001.00000  1.210873867702e-07
93001.00000  94001.00000  8.072492451349e-08
94001.00000  95001.00000  8.072492451349e-08
95001.00000  96001.00000  1.614498490270e-07
96001.00000  97001.00000  2.421747735405e-07
97001.00000  98001.00000  1.614498490270e-07
98001.00000  99001.00000  0.000000000000e+00
99001.00000  100001.00000  2.825372357972e-07
100001.00000  101001.00000  1.614498490270e-07
101001.00000  102001.00000  2.018123112837e-07
102001.00000  103001.00000  4.036246225674e-08
103001.00000  104001.00000  1.210873867702e-07
104001.00000  105001.00000  1.614498490270e-07
105001.00000  106001.00000  4.036246225674e-08
106001.00000  107001.00000  0.000000000000e+00
107001.00000  108001.00000  2.018123112837e-07
108001.00000  109001.00000  2.018123112837e-07
109001.00000  110001.00000  4.036246225674e-08
110001.00000  111001.00000  8.072492451349e-08
111001.00000  112001.00000  1.210873867702e-07
112001.00000  113001.00000  8.072492451349e-08
113001.00000  114001.00000  1.210873867702e-07
114001.00000  115001.00000  4.036246225674e-08
115001.00000  116001.00000  0.000000000000e+00
116001.00000  117001.00000  4.036246225674e-08
117001.00000  118001.00000  4.036246225674e-08
118001.00000  119001.00000  0.000000000000e+00
119001.00000  120001.00000  4.036246225674e-08
120001.00000  121001.00000  8.072492451349e-08
121001.00000  122001.00000  0.000000000000e+00
122001.00000  123001.00000  4.036246225674e-08
123001.00000  124001.00000  1.614498490270e-07
124001.00000  125001.00000  4.036246225674e-08
125001.00000  126001.00000  4.036246225674e-08
126001.00000  127001.00000  1.614498490270e-07
127001.00000  128001.00000  4.036246225674e-08
128001.00000  129001.00000  8.072492451349e-08
129001.00000  130001.00000  4.036246225674e-08
130001.00000  131001.00000  4.036246225674e-08
131001.00000  132001.00000  4.036246225674e-08
132001.00000  133001.00000  8.072492451349e-08
133001.00000  134001.00000  8.072492451349e-08
134001.00000  135001.00000  0.000000000000e+00
135001.00000  136001.00000  4.036246225674e-08
136001.00000  137001.00000  0.000000000000e+00
137001.00000  138001.00000  0.000000000000e+00
138001.00000  139001.00000  0.000000000000e+00
139001.00000  140001.00000  0.000000000000e+00
140001.00000  141001.00000  0.000000000000e+00
141001.00000  142001.00000  0.000000000000e+00
142001.00000  143001.00000  0.000000000000e+00
143001.00000  144001.00000  4.036246225674e-08
144001.00000  145001.00000  0.000000000000e+00
145001.00000  146001.00000  4.036246225674e-08
146001.00000  147001.00000  0.000000000000e+00
147001.00000  148001.00000  0.000000000000e+00
148001.00000  149001.00000  0.000000000000e+00
149001.00000  150001.00000  4.036246225674e-08
150001.00000  151001.00000  0.000000000000e+00
151001.00000  152001.00000  0.000000000000e+00
152001.00000  153001.00000  8.072492451349e-08
153001.00000  154001.00000  0.000000000000e+00
154001.00000  155001.00000  0.000000000000e+00
155001.00000  156001.00000  0.000000000000e+00
156001.00000  157001.00000  0.000000000000e+00
157001.00000  158001.00000  0.000000000000e+00
158001.00000  159001.00000  0.000000000000e+00
159001.00000  160001.00000  0.000000000000e+00
160001.00000  161001.00000  0.000000000000e+00
161001.00000  162001.00000  0.000000000000e+00
162001.00000  163001.00000  0.000000000000e+00
163001.00000  164001.00000  0.000000000000e+00
164001.00000  165001.00000  0.000000000000e+00
165001.00000  166001.00000  0.000000000000e+00
166001.00000  167001.00000  0.000000000000e+00
167001.00000  168001.00000  0.000000000000e+00
168001.00000  169001.00000  0.000000000000e+00
169001.00000  170001.00000  0.000000000000e+00
170001.00000  171001.00000  0.000000000000e+00
171001.00000  172001.00000  0.000000000000e+00
172001.00000  173001.00000  0.000000000000e+00
173001.00000  174001.00000  0.000000000000e+00
174001.00000  175001.00000  0.000000000000e+00
175001.00000  176001.00000  0.000000000000e+00
176001.00000  177001.00000  0.000000000000e+00
177001.00000  178001.00000  0.000000000000e+00
178001.00000  179001.00000  0.000000000000e+00
179001.00000  180001.00000  0.000000000000e+00
180001.00000  181001.00000  0.000000000000e+00
181001.00000  182001.00000  0.000000000000e+00
182001.00000  183001.00000  0.000000000000e+00
183001.00000  184001.00000  0.000000000000e+00
184001.00000  185001.00000  0.000000000000e+00
185001.00000  186001.00000  0.000000000000e+00
186001.00000  187001.00000  0.000000000000e+00
187001.00000  188001.00000  0.000000000000e+00
188001.00000  189001.00000  0.000000000000e+00
189001.00000  190001.00000  0.000000000000e+00
190001.00000  191001.00000  0.000000000000e+00
191001.00000  192001.00000  0.000000000000e+00
192001.00000  193001.00000  0.000000000000e+00
193001.00000  194001.00000  0.000000000000e+00
194001.00000  195001.00000  0.000000000000e+00
195001.00000  196001.00000  4.036246225674e-08
196001.00000  197001.00000  4.036246225674e-08
197001.00000  198001.00000  0.000000000000e+00
198001.00000  199001.00000  0.000000000000e+00
