10001.00000  11001.00000  2.030193188545e-04
11001.00000  12001.00000  1.795564722783e-04
12001.00000  13001.00000  1.598101405997e-04
13001.00000  14001.00000  1.332689685528e-04
14001.00000  15001.00000  1.175770167626e-04
15001.00000  16001.00000  1.014345783182e-04
16001.00000  17001.00000  8.904619532595e-05
17001.00000  18001.00000  7.560667680711e-05
18001.00000  19001.00000  6.776070091204e-05
19001.00000  20001.00000  6.321829381488e-05
20001.00000  21001.00000  5.300726298493e-05
21001.00000  22001.00000  5.041696472292e-05
22001.00000  23001.00000  4.136969108314e-05
23001.00000  24001.00000  3.938004169348e-05
24001.00000  25001.00000  3.540074291415e-05
25001.00000  26001.00000  3.262274187953e-05
26001.00000  27001.00000  2.853082143665e-05
27001.00000  28001.00000  2.687903703768e-05
28001.00000  29001.00000  2.323760324906e-05
29001.00000  30001.00000  2.106025108679e-05
30001.00000  31001.00000  1.914568280617e-05
31001.00000  32001.00000  1.850749337930e-05
32001.00000  33001.00000  1.715603341651e-05
33001.00000  34001.00000  1.527900569041e-05
34001.00000  35001.00000  1.614243844442e-05
35001.00000  36001.00000  1.250100465579e-05
36001.00000  37001.00000  1.242592354675e-05
37001.00000  38001.00000  1.148740968370e-05
38001.00000  39001.00000  1.107446358396e-05
39001.00000  40001.00000  1.013594972091e-05
40001.00000  41001.00000  8.671868094560e-06
41001.00000  42001.00000  8.033678667687e-06
42001.00000  43001.00000  8.409084212906e-06
43001.00000  44001.00000  8.071219222209e-06
44001.00000  45001.00000  7.545651458903e-06
45001.00000  46001.00000  6.794840368464e-06
46001.00000  47001.00000  6.907462032030e-06
47001.00000  48001.00000  5.931407614461e-06
48001.00000  49001.00000  6.156650941592e-06
49001.00000  50001.00000  4.917812642369e-06
50001.00000  51001.00000  5.368299296632e-06
51001.00000  52001.00000  4.767650424282e-06
52001.00000  53001.00000  4.730109869760e-06
53001.00000  54001.00000  4.429785433585e-06
54001.00000  55001.00000  4.054379888366e-06
55001.00000  56001.00000  3.791596006712e-06
56001.00000  57001.00000  3.566352679581e-06
57001.00000  58001.00000  3.603893234103e-06
58001.00000  59001.00000  3.603893234103e-06
59001.00000  60001.00000  3.115866025318e-06
60001.00000  61001.00000  2.853082143665e-06
61001.00000  62001.00000  2.778001034621e-06
62001.00000  63001.00000  2.778001034621e-06
63001.00000  64001.00000  2.665379371055e-06
64001.00000  65001.00000  2.815541589143e-06
65001.00000  66001.00000  3.003244361752e-06
66001.00000  67001.00000  2.365054934880e-06
67001.00000  68001.00000  2.440136043924e-06
68001.00000  69001.00000  2.289973825836e-06
69001.00000  70001.00000  1.539162735398e-06
70001.00000  71001.00000  1.764406062529e-06
71001.00000  72001.00000  1.614243844442e-06
72001.00000  73001.00000  2.102271053227e-06
73001.00000  74001.00000  1.539162735398e-06
74001.00000  75001.00000  1.576703289920e-06
75001.00000  76001.00000  1.389000517310e-06
76001.00000  77001.00000  1.989649389661e-06
77001.00000  78001.00000  1.952108835139e-06
78001.00000  79001.00000  1.389000517310e-06
79001.00000  80001.00000  1.464081626354e-06
80001.00000  81001.00000  1.464081626354e-06
81001.00000  82001.00000  1.088676081135e-06
82001.00000  83001.00000  1.313919408267e-06
83001.00000  84001.00000  9.009733085257e-07
84001.00000  85001.00000  1.276378853745e-06
85001.00000  86001.00000  9.385138630476e-07
86001.00000  87001.00000  1.238838299223e-06
87001.00000  88001.00000  7.883516449600e-07
88001.00000  89001.00000  1.238838299223e-06
89001.00000  90001.00000  1.013594972091e-06
90001.00000  91001.00000  9.009733085257e-07
91001.00000  92001.00000  7.883516449600e-07
92001.00000  93001.00000  9.385138630476e-07
93001.00000  94001.00000  8.258921994819e-07
94001.00000  95001.00000  5.255677633066e-07
95001.00000  96001.00000  7.132705359162e-07
96001.00000  97001.00000  6.381894268724e-07
97001.00000  98001.00000  5.631083178285e-07
98001.00000  99001.00000  6.006488723505e-07
99001.00000  100001.00000  8.634327540038e-07
100001.00000  101001.00000  4.129460997409e-07
101001.00000  102001.00000  7.508110904381e-07
102001.00000  103001.00000  4.880272087847e-07
103001.00000  104001.00000  6.006488723505e-07
104001.00000  105001.00000  5.631083178285e-07
105001.00000  106001.00000  6.381894268724e-07
106001.00000  107001.00000  3.378649906971e-07
107001.00000  108001.00000  6.381894268724e-07
108001.00000  109001.00000  6.381894268724e-07
109001.00000  110001.00000  6.381894268724e-07
110001.00000  111001.00000  3.754055452190e-07
111001.00000  112001.00000  5.255677633066e-07
112001.00000  113001.00000  6.757299813943e-07
113001.00000  114001.00000  4.129460997409e-07
114001.00000  115001.00000  3.754055452190e-07
115001.00000  116001.00000  3.754055452190e-07
116001.00000  117001.00000  3.378649906971e-07
117001.00000  118001.00000  4.880272087847e-07
118001.00000  119001.00000  5.255677633066e-07
119001.00000  120001.00000  3.003244361752e-07
120001.00000  121001.00000  4.129460997409e-07
121001.00000  122001.00000  2.252433271314e-07
122001.00000  123001.00000  4.504866542628e-07
123001.00000  124001.00000  5.255677633066e-07
124001.00000  125001.00000  1.877027726095e-07
125001.00000  126001.00000  4.129460997409e-07
126001.00000  127001.00000  1.501622180876e-07
127001.00000  128001.00000  2.252433271314e-07
128001.00000  129001.00000  4.129460997409e-07
129001.00000  130001.00000  4.504866542628e-07
130001.00000  131001.00000  2.252433271314e-07
131001.00000  132001.00000  3.754055452190e-07
132001.00000  133001.00000  3.754055452190e-07
133001.00000  134001.00000  3.378649906971e-07
134001.00000  135001.00000  2.627838816533e-07
135001.00000  136001.00000  3.003244361752e-07
136001.00000  137001.00000  1.501622180876e-07
137001.00000  138001.00000  3.378649906971e-07
138001.00000  139001.00000  1.877027726095e-07
139001.00000  140001.00000  1.126216635657e-07
140001.00000  141001.00000  7.508110904381e-08
141001.00000  142001.00000  4.129460997409e-07
142001.00000  143001.00000  3.754055452190e-07
143001.00000  144001.00000  1.877027726095e-07
144001.00000  145001.00000  3.378649906971e-07
145001.00000  146001.00000  1.126216635657e-07
146001.00000  147001.00000  3.378649906971e-07
147001.00000  148001.00000  2.252433271314e-07
148001.00000  149001.00000  3.003244361752e-07
149001.00000  150001.00000  1.501622180876e-07
150001.00000  151001.00000  7.508110904381e-08
151001.00000  152001.00000  7.508110904381e-08
152001.00000  153001.00000  2.252433271314e-07
153001.00000  154001.00000  1.126216635657e-07
154001.00000  155001.00000  3.754055452190e-08
155001.00000  156001.00000  1.501622180876e-07
156001.00000  157001.00000  7.508110904381e-08
157001.00000  158001.00000  1.877027726095e-07
158001.00000  159001.00000  2.252433271314e-07
159001.00000  160001.00000  7.508110904381e-08
160001.00000  161001.00000  1.877027726095e-07
161001.00000  162001.00000  1.877027726095e-07
162001.00000  163001.00000  2.252433271314e-07
163001.00000  164001.00000  1.126216635657e-07
164001.00000  165001.00000  2.627838816533e-07
165001.00000  166001.00000  1.126216635657e-07
166001.00000  167001.00000  1.501622180876e-07
167001.00000  168001.00000  7.508110904381e-08
168001.00000  169001.00000  0.000000000000e+00
169001.00000  170001.00000  1.126216635657e-07
170001.00000  171001.00000  3.754055452190e-08
171001.00000  172001.00000  2.252433271314e-07
172001.00000  173001.00000  7.508110904381e-08
173001.00000  174001.00000  1.501622180876e-07
174001.00000  175001.00000  1.877027726095e-07
175001.00000  176001.00000  7.508110904381e-08
176001.00000  177001.00000  3.754055452190e-08
177001.00000  178001.00000  1.126216635657e-07
178001.00000  179001.00000  1.501622180876e-07
179001.00000  180001.00000  3.754055452190e-08
180001.00000  181001.00000  1.126216635657e-07
181001.00000  182001.00000  7.508110904381e-08
182001.00000  183001.00000  7.508110904381e-08
183001.00000  184001.00000  7.508110904381e-08
184001.00000  185001.00000  1.126216635657e-07
185001.00000  186001.00000  7.508110904381e-08
186001.00000  187001.00000  1.501622180876e-07
187001.00000  188001.00000  1.501622180876e-07
188001.00000  189001.00000  2.252433271314e-07
189001.00000  190001.00000  0.000000000000e+00
190001.00000  191001.00000  3.754055452190e-08
191001.00000  192001.00000  1.501622180876e-07
192001.00000  193001.00000  7.508110904381e-08
193001.00000  194001.00000  3.754055452190e-08
194001.00000  195001.00000  7.508110904381e-08
195001.00000  196001.00000  0.000000000000e+00
196001.00000  197001.00000  3.754055452190e-08
197001.00000  198001.00000  0.000000000000e+00
198001.00000  199001.00000  3.754055452190e-08
