300.00000  350.00000  6.448540842915e-05
350.00000  400.00000  9.753418024908e-05
400.00000  450.00000  7.174001687743e-05
450.00000  500.00000  9.995238306518e-05
500.00000  550.00000  3.885245857856e-04
550.00000  600.00000  4.836405632186e-05
600.00000  650.00000  1.088191267242e-04
650.00000  700.00000  5.884293519160e-05
700.00000  750.00000  1.039827210920e-04
750.00000  800.00000  5.239439434868e-05
800.00000  850.00000  2.023229689464e-04
850.00000  900.00000  5.803686758623e-05
900.00000  950.00000  5.964900279696e-05
950.00000  1000.00000  6.045507040232e-05
1000.00000  1050.00000  3.869124505749e-05
1050.00000  1100.00000  5.561866477014e-05
1100.00000  1150.00000  5.158832674332e-05
1150.00000  1200.00000  4.513978590040e-05
1200.00000  1250.00000  5.481259716477e-05
1250.00000  1300.00000  9.350384222226e-05
1300.00000  1350.00000  3.627304224139e-05
1350.00000  1400.00000  4.594585350577e-05
1400.00000  1450.00000  4.594585350577e-05
1450.00000  1500.00000  3.546697463603e-05
1500.00000  1550.00000  4.513978590040e-05
1550.00000  1600.00000  4.110944787358e-05
1600.00000  1650.00000  4.030338026822e-05
1650.00000  1700.00000  3.869124505749e-05
1700.00000  1750.00000  7.012788166670e-05
1750.00000  1800.00000  3.788517745212e-05
1800.00000  1850.00000  2.901843379312e-05
1850.00000  1900.00000  3.466090703067e-05
1900.00000  1950.00000  2.740629858239e-05
1950.00000  2000.00000  3.385483942530e-05
2000.00000  2050.00000  3.063056900384e-05
2050.00000  2100.00000  3.627304224139e-05
2100.00000  2150.00000  2.256989295020e-05
2150.00000  2200.00000  3.143663660921e-05
2200.00000  2250.00000  2.418202816093e-05
2250.00000  2300.00000  2.418202816093e-05
2300.00000  2350.00000  4.755798871650e-05
2350.00000  2400.00000  2.337596055557e-05
2400.00000  2450.00000  2.821236618775e-05
2450.00000  2500.00000  1.934562252874e-05
2500.00000  2550.00000  2.337596055557e-05
2550.00000  2600.00000  1.612135210729e-05
2600.00000  2650.00000  1.853955492338e-05
2650.00000  2700.00000  1.934562252874e-05
2700.00000  2750.00000  2.579416337166e-05
2750.00000  2800.00000  1.531528450192e-05
2800.00000  2850.00000  1.934562252874e-05
2850.00000  2900.00000  1.450921689656e-05
2900.00000  2950.00000  2.498809576629e-05
2950.00000  3000.00000  3.143663660921e-05
3000.00000  3050.00000  2.337596055557e-05
3050.00000  3100.00000  1.853955492338e-05
3100.00000  3150.00000  2.337596055557e-05
3150.00000  3200.00000  1.692741971265e-05
3200.00000  3250.00000  1.209101408046e-05
3250.00000  3300.00000  1.128494647510e-05
3300.00000  3350.00000  1.773348731802e-05
3350.00000  3400.00000  1.531528450192e-05
3400.00000  3450.00000  1.128494647510e-05
3450.00000  3500.00000  2.015169013411e-05
3500.00000  3550.00000  1.047887886974e-05
3550.00000  3600.00000  1.370314929119e-05
3600.00000  3650.00000  1.289708168583e-05
3650.00000  3700.00000  2.015169013411e-05
3700.00000  3750.00000  1.047887886974e-05
3750.00000  3800.00000  1.289708168583e-05
3800.00000  3850.00000  1.773348731802e-05
3850.00000  3900.00000  1.289708168583e-05
3900.00000  3950.00000  2.176382534484e-05
3950.00000  4000.00000  1.289708168583e-05
4000.00000  4050.00000  1.934562252874e-05
4050.00000  4100.00000  1.370314929119e-05
4100.00000  4150.00000  1.370314929119e-05
4150.00000  4200.00000  1.450921689656e-05
4200.00000  4250.00000  1.128494647510e-05
4250.00000  4300.00000  9.672811264372e-06
4300.00000  4350.00000  9.672811264372e-06
4350.00000  4400.00000  9.672811264372e-06
4400.00000  4450.00000  1.209101408046e-05
4450.00000  4500.00000  1.128494647510e-05
4500.00000  4550.00000  8.060676053643e-06
4550.00000  4600.00000  1.289708168583e-05
4600.00000  4650.00000  1.450921689656e-05
4650.00000  4700.00000  1.692741971265e-05
4700.00000  4750.00000  8.060676053643e-06
4750.00000  4800.00000  9.672811264372e-06
4800.00000  4850.00000  1.047887886974e-05
4850.00000  4900.00000  1.289708168583e-05
4900.00000  4950.00000  8.060676053643e-06
4950.00000  5000.00000  1.289708168583e-05
5000.00000  5050.00000  1.128494647510e-05
5050.00000  5100.00000  1.128494647510e-05
5100.00000  5150.00000  1.450921689656e-05
5150.00000  5200.00000  1.289708168583e-05
5200.00000  5250.00000  9.672811264372e-06
5250.00000  5300.00000  1.209101408046e-05
5300.00000  5350.00000  1.450921689656e-05
5350.00000  5400.00000  1.531528450192e-05
5400.00000  5450.00000  1.692741971265e-05
5450.00000  5500.00000  1.128494647510e-05
5500.00000  5550.00000  1.047887886974e-05
5550.00000  5600.00000  7.254608448279e-06
5600.00000  5650.00000  1.450921689656e-05
5650.00000  5700.00000  7.254608448279e-06
5700.00000  5750.00000  1.128494647510e-05
5750.00000  5800.00000  9.672811264372e-06
5800.00000  5850.00000  1.692741971265e-05
5850.00000  5900.00000  1.531528450192e-05
5900.00000  5950.00000  1.047887886974e-05
5950.00000  6000.00000  1.289708168583e-05
6000.00000  6050.00000  8.060676053643e-06
6050.00000  6100.00000  1.047887886974e-05
6100.00000  6150.00000  1.209101408046e-05
6150.00000  6200.00000  1.128494647510e-05
6200.00000  6250.00000  2.176382534484e-05
6250.00000  6300.00000  2.418202816093e-05
6300.00000  6350.00000  2.337596055557e-05
6350.00000  6400.00000  1.201040731993e-04
6400.00000  6450.00000  8.060676053643e-06
6450.00000  6500.00000  1.370314929119e-05
6500.00000  6550.00000  1.047887886974e-05
6550.00000  6600.00000  1.209101408046e-05
6600.00000  6650.00000  1.612135210729e-05
6650.00000  6700.00000  6.448540842915e-06
6700.00000  6750.00000  5.642473237550e-06
6750.00000  6800.00000  1.209101408046e-05
6800.00000  6850.00000  1.047887886974e-05
6850.00000  6900.00000  1.289708168583e-05
6900.00000  6950.00000  5.642473237550e-06
6950.00000  7000.00000  1.289708168583e-05
7000.00000  7050.00000  1.047887886974e-05
7050.00000  7100.00000  2.579416337166e-05
7100.00000  7150.00000  7.254608448279e-06
7150.00000  7200.00000  3.224270421457e-06
7200.00000  7250.00000  1.612135210729e-06
7250.00000  7300.00000  4.836405632186e-06
7300.00000  7350.00000  6.448540842915e-06
7350.00000  7400.00000  5.642473237550e-06
7400.00000  7450.00000  3.224270421457e-06
7450.00000  7500.00000  1.128494647510e-05
7500.00000  7550.00000  5.642473237550e-06
7550.00000  7600.00000  7.254608448279e-06
7600.00000  7650.00000  6.448540842915e-06
7650.00000  7700.00000  7.254608448279e-06
7700.00000  7750.00000  8.866743659008e-06
7750.00000  7800.00000  3.224270421457e-06
7800.00000  7850.00000  6.448540842915e-06
7850.00000  7900.00000  8.060676053643e-06
7900.00000  7950.00000  3.224270421457e-06
7950.00000  8000.00000  8.060676053643e-06
8000.00000  8050.00000  7.254608448279e-06
8050.00000  8100.00000  4.030338026822e-06
8100.00000  8150.00000  3.224270421457e-06
8150.00000  8200.00000  3.224270421457e-06
8200.00000  8250.00000  4.836405632186e-06
8250.00000  8300.00000  3.224270421457e-06
8300.00000  8350.00000  8.060676053643e-06
8350.00000  8400.00000  1.128494647510e-05
8400.00000  8450.00000  1.047887886974e-05
8450.00000  8500.00000  5.642473237550e-06
8500.00000  8550.00000  5.642473237550e-06
8550.00000  8600.00000  5.642473237550e-06
8600.00000  8650.00000  1.612135210729e-06
8650.00000  8700.00000  8.866743659008e-06
8700.00000  8750.00000  5.642473237550e-06
8750.00000  8800.00000  8.866743659008e-06
8800.00000  8850.00000  5.642473237550e-06
8850.00000  8900.00000  5.642473237550e-06
8900.00000  8950.00000  8.060676053643e-06
8950.00000  9000.00000  8.866743659008e-06
9000.00000  9050.00000  8.060676053643e-06
9050.00000  9100.00000  5.642473237550e-06
9100.00000  9150.00000  8.866743659008e-06
9150.00000  9200.00000  8.060676053643e-06
9200.00000  9250.00000  6.448540842915e-06
9250.00000  9300.00000  2.418202816093e-06
9300.00000  9350.00000  7.254608448279e-06
9350.00000  9400.00000  1.209101408046e-05
9400.00000  9450.00000  3.224270421457e-06
9450.00000  9500.00000  5.642473237550e-06
9500.00000  9550.00000  4.030338026822e-06
9550.00000  9600.00000  3.224270421457e-06
9600.00000  9650.00000  6.448540842915e-06
9650.00000  9700.00000  7.254608448279e-06
9700.00000  9750.00000  6.448540842915e-06
9750.00000  9800.00000  6.448540842915e-06
9800.00000  9850.00000  3.224270421457e-06
9850.00000  9900.00000  7.254608448279e-06
9900.00000  9950.00000  8.060676053643e-06
9950.00000  10000.00000  6.448540842915e-06
