300.00000  350.00000  2.505745946166e-06
350.00000  400.00000  5.204241580499e-06
400.00000  450.00000  4.047743451500e-06
450.00000  500.00000  3.854993763333e-06
500.00000  550.00000  3.951368607416e-05
550.00000  600.00000  3.469494387000e-06
600.00000  650.00000  1.002298378467e-05
650.00000  700.00000  4.047743451500e-06
700.00000  750.00000  8.288236591166e-06
750.00000  800.00000  4.047743451500e-06
800.00000  850.00000  2.447921039716e-05
850.00000  900.00000  4.818742204166e-06
900.00000  950.00000  4.818742204166e-06
950.00000  1000.00000  5.975240333166e-06
1000.00000  1050.00000  5.011491892333e-06
1050.00000  1100.00000  5.589740956833e-06
1100.00000  1150.00000  5.204241580499e-06
1150.00000  1200.00000  8.288236591166e-06
1200.00000  1250.00000  1.021573347283e-05
1250.00000  1300.00000  4.664542453633e-05
1300.00000  1350.00000  1.908221912850e-05
1350.00000  1400.00000  3.469494387000e-05
1400.00000  1450.00000  5.955965364349e-05
1450.00000  1500.00000  9.194160125549e-05
1500.00000  1550.00000  1.191193072870e-04
1550.00000  1600.00000  1.786789609305e-04
1600.00000  1650.00000  2.366966170686e-04
1650.00000  1700.00000  2.891245322500e-04
1700.00000  1750.00000  4.217363177086e-04
1750.00000  1800.00000  4.311810524288e-04
1800.00000  1850.00000  4.689599913095e-04
1850.00000  1900.00000  4.955594482764e-04
1900.00000  1950.00000  5.878865489083e-04
1950.00000  2000.00000  6.620951788524e-04
2000.00000  2050.00000  7.632887651399e-04
2050.00000  2100.00000  8.087776915473e-04
2100.00000  2150.00000  8.637113526747e-04
2150.00000  2200.00000  9.132480225336e-04
2200.00000  2250.00000  9.882276512304e-04
2250.00000  2300.00000  1.040270067035e-03
2300.00000  2350.00000  1.264052454997e-03
2350.00000  2400.00000  1.138957907377e-03
2400.00000  2450.00000  1.176158597193e-03
2450.00000  2500.00000  1.113514948539e-03
2500.00000  2550.00000  1.098094973485e-03
2550.00000  2600.00000  1.109274455399e-03
2600.00000  2650.00000  1.133175416732e-03
2650.00000  2700.00000  1.145896896151e-03
2700.00000  2750.00000  1.162473369333e-03
2750.00000  2800.00000  1.159389374322e-03
2800.00000  2850.00000  1.154185132742e-03
2850.00000  2900.00000  1.137223160183e-03
2900.00000  2950.00000  1.167677610914e-03
2950.00000  3000.00000  1.178857092827e-03
3000.00000  3050.00000  1.117369942302e-03
3050.00000  3100.00000  1.100986218808e-03
3100.00000  3150.00000  1.086529992195e-03
3150.00000  3200.00000  1.084795245002e-03
3200.00000  3250.00000  1.034294826702e-03
3250.00000  3300.00000  1.042968562670e-03
3300.00000  3350.00000  1.043739561422e-03
3350.00000  3400.00000  9.880349015422e-04
3400.00000  3450.00000  9.828306599617e-04
3450.00000  3500.00000  9.413894770059e-04
3500.00000  3550.00000  9.365707348017e-04
3550.00000  3600.00000  9.367634844899e-04
3600.00000  3650.00000  9.043815368779e-04
3650.00000  3700.00000  9.120915244046e-04
3700.00000  3750.00000  8.471348794924e-04
3750.00000  3800.00000  8.396176416539e-04
3800.00000  3850.00000  8.278599106757e-04
3850.00000  3900.00000  8.101269393644e-04
3900.00000  3950.00000  8.066574449774e-04
3950.00000  4000.00000  7.671437589033e-04
4000.00000  4050.00000  7.413153006889e-04
4050.00000  4100.00000  7.114390990231e-04
4100.00000  4150.00000  7.197273356143e-04
4150.00000  4200.00000  6.807918986046e-04
4200.00000  4250.00000  6.557344391429e-04
4250.00000  4300.00000  6.474462025518e-04
4300.00000  4350.00000  6.270147356061e-04
4350.00000  4400.00000  6.106310121119e-04
4400.00000  4450.00000  6.008007780154e-04
4450.00000  4500.00000  5.641783372638e-04
4500.00000  4550.00000  5.678405813389e-04
4550.00000  4600.00000  5.585885963069e-04
4600.00000  4650.00000  5.512641081566e-04
4650.00000  4700.00000  5.157981655339e-04
4700.00000  4750.00000  4.996071917279e-04
4750.00000  4800.00000  4.924754532658e-04
4800.00000  4850.00000  4.918972042013e-04
4850.00000  4900.00000  4.572022603313e-04
4900.00000  4950.00000  4.508415206218e-04
4950.00000  5000.00000  4.460227784176e-04
5000.00000  5050.00000  4.190378220743e-04
5050.00000  5100.00000  4.253985617838e-04
5100.00000  5150.00000  4.134480811175e-04
5150.00000  5200.00000  3.883906216558e-04
5200.00000  5250.00000  3.918601160428e-04
5250.00000  5300.00000  3.835718794516e-04
5300.00000  5350.00000  3.795241360001e-04
5350.00000  5400.00000  3.544666765385e-04
5400.00000  5450.00000  3.669954062693e-04
5450.00000  5500.00000  3.575506715491e-04
5500.00000  5550.00000  3.442509430656e-04
5550.00000  5600.00000  3.313367139585e-04
5600.00000  5650.00000  3.168804873460e-04
5650.00000  5700.00000  3.226629779910e-04
5700.00000  5750.00000  2.977982682175e-04
5750.00000  5800.00000  3.045445073033e-04
5800.00000  5850.00000  2.937505247660e-04
5850.00000  5900.00000  2.852695384866e-04
5900.00000  5950.00000  2.843057900458e-04
5950.00000  6000.00000  2.829565422286e-04
6000.00000  6050.00000  2.692713143688e-04
6050.00000  6100.00000  2.667655684226e-04
6100.00000  6150.00000  2.675365671753e-04
6150.00000  6200.00000  2.467196008533e-04
6200.00000  6250.00000  2.515383430575e-04
6250.00000  6300.00000  2.498035958640e-04
6300.00000  6350.00000  2.401661114556e-04
6350.00000  6400.00000  8.874195643192e-04
6400.00000  6450.00000  2.233968885851e-04
6450.00000  6500.00000  2.243606370260e-04
6500.00000  6550.00000  2.141449035531e-04
6550.00000  6600.00000  2.072059147791e-04
6600.00000  6650.00000  2.045074191448e-04
6650.00000  6700.00000  1.987249284998e-04
6700.00000  6750.00000  1.940989359838e-04
6750.00000  6800.00000  1.917859397258e-04
6800.00000  6850.00000  1.871599472098e-04
6850.00000  6900.00000  1.885091950270e-04
6900.00000  6950.00000  1.765587143606e-04
6950.00000  7000.00000  1.804137081240e-04
7000.00000  7050.00000  1.617169883718e-04
7050.00000  7100.00000  2.486470977350e-04
7100.00000  7150.00000  1.541997505333e-04
7150.00000  7200.00000  1.597894914902e-04
7200.00000  7250.00000  1.385870257918e-04
7250.00000  7300.00000  1.435985176842e-04
7300.00000  7350.00000  1.426347692433e-04
7350.00000  7400.00000  1.497665077055e-04
7400.00000  7450.00000  1.389725251682e-04
7450.00000  7500.00000  1.649937330706e-04
7500.00000  7550.00000  1.329972848350e-04
7550.00000  7600.00000  1.353102810930e-04
7600.00000  7650.00000  1.360812798457e-04
7650.00000  7700.00000  1.349247817167e-04
7700.00000  7750.00000  1.206613047923e-04
7750.00000  7800.00000  1.191193072870e-04
7800.00000  7850.00000  1.277930432545e-04
7850.00000  7900.00000  1.210468041687e-04
7900.00000  7950.00000  1.166135613408e-04
7950.00000  8000.00000  1.185410582225e-04
8000.00000  8050.00000  1.173845600935e-04
8050.00000  8100.00000  1.098673222550e-04
8100.00000  8150.00000  1.119875688248e-04
8150.00000  8200.00000  1.110238203840e-04
8200.00000  8250.00000  1.112165700722e-04
8250.00000  8300.00000  1.081325750615e-04
8300.00000  8350.00000  1.079398253733e-04
8350.00000  8400.00000  9.753134221232e-05
8400.00000  8450.00000  1.060123284917e-04
8450.00000  8500.00000  1.002298378467e-04
8500.00000  8550.00000  9.849509065316e-05
8550.00000  8600.00000  9.888059002949e-05
8600.00000  8650.00000  9.965158878216e-05
8650.00000  8700.00000  9.059235343832e-05
8700.00000  8750.00000  9.830234096499e-05
8750.00000  8800.00000  1.017718353520e-04
8800.00000  8850.00000  9.579659501882e-05
8850.00000  8900.00000  8.827935718032e-05
8900.00000  8950.00000  8.095486902999e-05
8950.00000  9000.00000  8.307511559982e-05
9000.00000  9050.00000  8.326786528799e-05
9050.00000  9100.00000  7.748537464299e-05
9100.00000  9150.00000  9.251985031999e-05
9150.00000  9200.00000  8.480986279332e-05
9200.00000  9250.00000  7.748537464299e-05
9250.00000  9300.00000  7.594337713766e-05
9300.00000  9350.00000  7.806362370749e-05
9350.00000  9400.00000  7.690712557849e-05
9400.00000  9450.00000  6.804063992283e-05
9450.00000  9500.00000  7.073913555716e-05
9500.00000  9550.00000  7.401588025599e-05
9550.00000  9600.00000  7.652162620216e-05
9600.00000  9650.00000  7.208838337433e-05
9650.00000  9700.00000  7.208838337433e-05
9700.00000  9750.00000  6.842613929916e-05
9750.00000  9800.00000  7.189563368616e-05
9800.00000  9850.00000  7.112463493349e-05
9850.00000  9900.00000  7.189563368616e-05
9900.00000  9950.00000  6.572764366483e-05
9950.00000  10000.00000  6.534214428849e-05
