10001.00000  11001.00000  2.528323010582e-04
11001.00000  12001.00000  2.366887469799e-04
12001.00000  13001.00000  2.136760048136e-04
13001.00000  14001.00000  1.926451292385e-04
14001.00000  15001.00000  1.752893654977e-04
15001.00000  16001.00000  1.547202840798e-04
16001.00000  17001.00000  1.380764529980e-04
17001.00000  18001.00000  1.226063487323e-04
18001.00000  19001.00000  1.122929458885e-04
19001.00000  20001.00000  1.011136790000e-04
20001.00000  21001.00000  8.945337653115e-05
21001.00000  22001.00000  7.808169541050e-05
22001.00000  23001.00000  6.950002065617e-05
23001.00000  24001.00000  6.445876777358e-05
24001.00000  25001.00000  5.833999519089e-05
25001.00000  26001.00000  5.364508792619e-05
26001.00000  27001.00000  4.918107774008e-05
27001.00000  28001.00000  4.375499639317e-05
28001.00000  29001.00000  3.827119077661e-05
29001.00000  30001.00000  3.482697602095e-05
30001.00000  31001.00000  3.280662658327e-05
31001.00000  32001.00000  3.069007002951e-05
32001.00000  33001.00000  2.811171931857e-05
33001.00000  34001.00000  2.603364561124e-05
34001.00000  35001.00000  2.310894928241e-05
35001.00000  36001.00000  2.183901535015e-05
36001.00000  37001.00000  1.929914748564e-05
37001.00000  38001.00000  1.981866591247e-05
38001.00000  39001.00000  1.691321100686e-05
39001.00000  40001.00000  1.662458965862e-05
40001.00000  41001.00000  1.598962269249e-05
41001.00000  42001.00000  1.406548037089e-05
42001.00000  43001.00000  1.273782216899e-05
43001.00000  44001.00000  1.139092254387e-05
44001.00000  45001.00000  1.181423385462e-05
45001.00000  46001.00000  1.029416142056e-05
46001.00000  47001.00000  9.582228761565e-06
47001.00000  48001.00000  9.466780222269e-06
48001.00000  49001.00000  8.620157600765e-06
49001.00000  50001.00000  7.792776402477e-06
50001.00000  51001.00000  7.003878050622e-06
51001.00000  52001.00000  7.407947938157e-06
52001.00000  53001.00000  6.792222395246e-06
53001.00000  54001.00000  6.272703968414e-06
54001.00000  55001.00000  6.214979698766e-06
55001.00000  56001.00000  5.291391384398e-06
56001.00000  57001.00000  5.252908537966e-06
57001.00000  58001.00000  4.675665841486e-06
58001.00000  59001.00000  4.175388837871e-06
59001.00000  60001.00000  3.482697602095e-06
60001.00000  61001.00000  3.886767489631e-06
61001.00000  62001.00000  3.848284643199e-06
62001.00000  63001.00000  3.482697602095e-06
63001.00000  64001.00000  3.405731909231e-06
64001.00000  65001.00000  3.001662021695e-06
65001.00000  66001.00000  3.155593407423e-06
66001.00000  67001.00000  2.770764943103e-06
67001.00000  68001.00000  3.059386291343e-06
68001.00000  69001.00000  2.328212209135e-06
69001.00000  70001.00000  2.174280823407e-06
70001.00000  71001.00000  2.174280823407e-06
71001.00000  72001.00000  2.193522246623e-06
72001.00000  73001.00000  2.116556553759e-06
73001.00000  74001.00000  2.020349437679e-06
74001.00000  75001.00000  1.731728089439e-06
75001.00000  76001.00000  1.750969512655e-06
76001.00000  77001.00000  1.481589587631e-06
77001.00000  78001.00000  1.308416778688e-06
78001.00000  79001.00000  1.750969512655e-06
79001.00000  80001.00000  1.385382471552e-06
80001.00000  81001.00000  1.212209662608e-06
81001.00000  82001.00000  1.366141048336e-06
82001.00000  83001.00000  1.173726816176e-06
83001.00000  84001.00000  1.058278276880e-06
84001.00000  85001.00000  9.428297375837e-07
85001.00000  86001.00000  1.212209662608e-06
86001.00000  87001.00000  1.000554007232e-06
87001.00000  88001.00000  8.081397750717e-07
88001.00000  89001.00000  8.466226215037e-07
89001.00000  90001.00000  1.154485392960e-06
90001.00000  91001.00000  9.428297375837e-07
91001.00000  92001.00000  8.466226215037e-07
92001.00000  93001.00000  9.235883143677e-07
93001.00000  94001.00000  6.926912357758e-07
94001.00000  95001.00000  6.926912357758e-07
95001.00000  96001.00000  6.157255429118e-07
96001.00000  97001.00000  5.580012732638e-07
97001.00000  98001.00000  7.119326589918e-07
98001.00000  99001.00000  4.810355803998e-07
99001.00000  100001.00000  5.387598500478e-07
100001.00000  101001.00000  4.810355803998e-07
101001.00000  102001.00000  6.157255429118e-07
102001.00000  103001.00000  5.964841196958e-07
103001.00000  104001.00000  5.964841196958e-07
104001.00000  105001.00000  3.078627714559e-07
105001.00000  106001.00000  4.425527339678e-07
106001.00000  107001.00000  5.002770036158e-07
107001.00000  108001.00000  5.772426964798e-07
108001.00000  109001.00000  4.233113107519e-07
109001.00000  110001.00000  3.271041946719e-07
110001.00000  111001.00000  3.078627714559e-07
111001.00000  112001.00000  2.886213482399e-07
112001.00000  113001.00000  1.924142321599e-07
113001.00000  114001.00000  2.886213482399e-07
114001.00000  115001.00000  4.040698875359e-07
115001.00000  116001.00000  4.617941571838e-07
116001.00000  117001.00000  1.924142321599e-07
117001.00000  118001.00000  1.924142321599e-07
118001.00000  119001.00000  3.271041946719e-07
119001.00000  120001.00000  2.501385018079e-07
120001.00000  121001.00000  4.233113107519e-07
121001.00000  122001.00000  2.886213482399e-07
122001.00000  123001.00000  2.501385018079e-07
123001.00000  124001.00000  1.539313857279e-07
124001.00000  125001.00000  2.116556553759e-07
125001.00000  126001.00000  2.308970785919e-07
126001.00000  127001.00000  2.501385018079e-07
127001.00000  128001.00000  1.539313857279e-07
128001.00000  129001.00000  1.731728089439e-07
129001.00000  130001.00000  2.501385018079e-07
130001.00000  131001.00000  1.924142321599e-07
131001.00000  132001.00000  2.308970785919e-07
132001.00000  133001.00000  1.924142321599e-07
133001.00000  134001.00000  9.620711607997e-08
134001.00000  135001.00000  1.731728089439e-07
135001.00000  136001.00000  9.620711607997e-08
136001.00000  137001.00000  1.154485392960e-07
137001.00000  138001.00000  1.924142321599e-07
138001.00000  139001.00000  1.924142321599e-08
139001.00000  140001.00000  9.620711607997e-08
140001.00000  141001.00000  7.696569286397e-08
141001.00000  142001.00000  3.848284643199e-08
142001.00000  143001.00000  7.696569286397e-08
143001.00000  144001.00000  5.772426964798e-08
144001.00000  145001.00000  9.620711607997e-08
145001.00000  146001.00000  5.772426964798e-08
146001.00000  147001.00000  3.848284643199e-08
147001.00000  148001.00000  7.696569286397e-08
148001.00000  149001.00000  3.848284643199e-08
149001.00000  150001.00000  5.772426964798e-08
150001.00000  151001.00000  9.620711607997e-08
151001.00000  152001.00000  9.620711607997e-08
152001.00000  153001.00000  7.696569286397e-08
153001.00000  154001.00000  7.696569286397e-08
154001.00000  155001.00000  1.154485392960e-07
155001.00000  156001.00000  5.772426964798e-08
156001.00000  157001.00000  3.848284643199e-08
157001.00000  158001.00000  1.924142321599e-08
158001.00000  159001.00000  3.848284643199e-08
159001.00000  160001.00000  3.848284643199e-08
160001.00000  161001.00000  7.696569286397e-08
161001.00000  162001.00000  5.772426964798e-08
162001.00000  163001.00000  1.924142321599e-08
163001.00000  164001.00000  3.848284643199e-08
164001.00000  165001.00000  1.924142321599e-08
165001.00000  166001.00000  1.924142321599e-08
166001.00000  167001.00000  3.848284643199e-08
167001.00000  168001.00000  1.924142321599e-08
168001.00000  169001.00000  5.772426964798e-08
169001.00000  170001.00000  1.924142321599e-08
170001.00000  171001.00000  1.924142321599e-08
171001.00000  172001.00000  3.848284643199e-08
172001.00000  173001.00000  3.848284643199e-08
173001.00000  174001.00000  1.924142321599e-08
174001.00000  175001.00000  1.924142321599e-08
175001.00000  176001.00000  9.620711607997e-08
176001.00000  177001.00000  1.924142321599e-08
177001.00000  178001.00000  1.924142321599e-08
178001.00000  179001.00000  0.000000000000e+00
179001.00000  180001.00000  3.848284643199e-08
180001.00000  181001.00000  1.924142321599e-08
181001.00000  182001.00000  1.924142321599e-08
182001.00000  183001.00000  0.000000000000e+00
183001.00000  184001.00000  1.924142321599e-08
184001.00000  185001.00000  1.924142321599e-08
185001.00000  186001.00000  3.848284643199e-08
186001.00000  187001.00000  1.924142321599e-08
187001.00000  188001.00000  1.924142321599e-08
188001.00000  189001.00000  3.848284643199e-08
189001.00000  190001.00000  0.000000000000e+00
190001.00000  191001.00000  1.924142321599e-08
191001.00000  192001.00000  1.924142321599e-08
192001.00000  193001.00000  0.000000000000e+00
193001.00000  194001.00000  1.924142321599e-08
194001.00000  195001.00000  3.848284643199e-08
195001.00000  196001.00000  0.000000000000e+00
196001.00000  197001.00000  1.924142321599e-08
197001.00000  198001.00000  1.924142321599e-08
198001.00000  199001.00000  3.848284643199e-08
