300.00000  350.00000  1.282069030434e-01
350.00000  400.00000  1.019446706263e-01
400.00000  450.00000  8.302998830002e-02
450.00000  500.00000  6.948195704218e-02
500.00000  550.00000  5.921921637292e-02
550.00000  600.00000  5.108324476243e-02
600.00000  650.00000  4.443249534207e-02
650.00000  700.00000  3.931177392195e-02
700.00000  750.00000  3.505964226481e-02
750.00000  800.00000  3.145990731374e-02
800.00000  850.00000  2.857666347874e-02
850.00000  900.00000  2.589353886742e-02
900.00000  950.00000  2.372678614849e-02
950.00000  1000.00000  2.175111112204e-02
1000.00000  1050.00000  1.999363838165e-02
1050.00000  1100.00000  1.857833736606e-02
1100.00000  1150.00000  1.717730187745e-02
1150.00000  1200.00000  1.607162307439e-02
1200.00000  1250.00000  1.484639513670e-02
1250.00000  1300.00000  1.415843507461e-02
1300.00000  1350.00000  1.320385030387e-02
1350.00000  1400.00000  1.240397617794e-02
1400.00000  1450.00000  1.172184288039e-02
1450.00000  1500.00000  1.100635637890e-02
1500.00000  1550.00000  1.041142362661e-02
1550.00000  1600.00000  9.880786207219e-03
1600.00000  1650.00000  9.409220124938e-03
1650.00000  1700.00000  8.929818048959e-03
1700.00000  1750.00000  8.627830907217e-03
1750.00000  1800.00000  8.169927583178e-03
1800.00000  1850.00000  7.811280179313e-03
1850.00000  1900.00000  7.500854275127e-03
1900.00000  1950.00000  7.083738302900e-03
1950.00000  2000.00000  6.938671958031e-03
2000.00000  2050.00000  6.664010332774e-03
2050.00000  2100.00000  6.301344470602e-03
2100.00000  2150.00000  6.095599405304e-03
2150.00000  2200.00000  5.797630721868e-03
2200.00000  2250.00000  5.628855472990e-03
2250.00000  2300.00000  5.378706443404e-03
2300.00000  2350.00000  5.285076364860e-03
2350.00000  2400.00000  5.082947912037e-03
2400.00000  2450.00000  4.882426842537e-03
2450.00000  2500.00000  4.692554687549e-03
2500.00000  2550.00000  4.576220319573e-03
2550.00000  2600.00000  4.405234918626e-03
2600.00000  2650.00000  4.256551961282e-03
2650.00000  2700.00000  4.202704619973e-03
2700.00000  2750.00000  4.006001085864e-03
2750.00000  2800.00000  3.936883602990e-03
2800.00000  2850.00000  3.789205260222e-03
2850.00000  2900.00000  3.688743802557e-03
2900.00000  2950.00000  3.587076807400e-03
2950.00000  3000.00000  3.521776859917e-03
3000.00000  3050.00000  3.342553619442e-03
3050.00000  3100.00000  3.310405952989e-03
3100.00000  3150.00000  3.216173105699e-03
3150.00000  3200.00000  3.141228858281e-03
3200.00000  3250.00000  2.973056378149e-03
3250.00000  3300.00000  2.932871795083e-03
3300.00000  3350.00000  2.943118863765e-03
3350.00000  3400.00000  2.814126352122e-03
3400.00000  3450.00000  2.700403982045e-03
3450.00000  3500.00000  2.691764296686e-03
3500.00000  3550.00000  2.612801590961e-03
3550.00000  3600.00000  2.546898874732e-03
3600.00000  3650.00000  2.525601045707e-03
3650.00000  3700.00000  2.419915592243e-03
3700.00000  3750.00000  2.377319934193e-03
3750.00000  3800.00000  2.296548922230e-03
3800.00000  3850.00000  2.273241864052e-03
3850.00000  3900.00000  2.229842514340e-03
3900.00000  3950.00000  2.164341643943e-03
3950.00000  4000.00000  2.147665041970e-03
4000.00000  4050.00000  2.093214931916e-03
4050.00000  4100.00000  2.060866342547e-03
4100.00000  4150.00000  2.053633117595e-03
4150.00000  4200.00000  1.971455645225e-03
4200.00000  4250.00000  1.900529856113e-03
4250.00000  4300.00000  1.887268943702e-03
4300.00000  4350.00000  1.861952656370e-03
4350.00000  4400.00000  1.817548692082e-03
4400.00000  4450.00000  1.793638865157e-03
4450.00000  4500.00000  1.746622902970e-03
4500.00000  4550.00000  1.719498309400e-03
4550.00000  4600.00000  1.692976484577e-03
4600.00000  4650.00000  1.644353139067e-03
4650.00000  4700.00000  1.640736526591e-03
4700.00000  4750.00000  1.615822085090e-03
4750.00000  4800.00000  1.593720564403e-03
4800.00000  4850.00000  1.560568283374e-03
4850.00000  4900.00000  1.505716327488e-03
4900.00000  4950.00000  1.498081256706e-03
4950.00000  5000.00000  1.471559431882e-03
5000.00000  5050.00000  1.449056065365e-03
5050.00000  5100.00000  1.404853023992e-03
5100.00000  5150.00000  1.410880711452e-03
5150.00000  5200.00000  1.367481361741e-03
5200.00000  5250.00000  1.341562305663e-03
5250.00000  5300.00000  1.298363878867e-03
5300.00000  5350.00000  1.306199872565e-03
5350.00000  5400.00000  1.270234670721e-03
5400.00000  5450.00000  1.256772835394e-03
5450.00000  5500.00000  1.225027014771e-03
5500.00000  5550.00000  1.238287927183e-03
5550.00000  5600.00000  1.197299652456e-03
5600.00000  5650.00000  1.171380596378e-03
5650.00000  5700.00000  1.168165829733e-03
5700.00000  5750.00000  1.157717838136e-03
5750.00000  5800.00000  1.123560942529e-03
5800.00000  5850.00000  1.122958173783e-03
5850.00000  5900.00000  1.118537869646e-03
5900.00000  5950.00000  1.089805892754e-03
5950.00000  6000.00000  1.050224078434e-03
6000.00000  6050.00000  1.051027770095e-03
6050.00000  6100.00000  1.026515174425e-03
6100.00000  6150.00000  9.987878121091e-04
6150.00000  6200.00000  9.945684308871e-04
6200.00000  6250.00000  9.885407434272e-04
6250.00000  6300.00000  1.000395195432e-03
6300.00000  6350.00000  9.706586039628e-04
6350.00000  6400.00000  1.163544602680e-03
6400.00000  6450.00000  9.286657146586e-04
6450.00000  6500.00000  9.174140314001e-04
6500.00000  6550.00000  9.284647917433e-04
6550.00000  6600.00000  8.947097419677e-04
6600.00000  6650.00000  8.746174504347e-04
6650.00000  6700.00000  8.933032815604e-04
6700.00000  6750.00000  9.003355835970e-04
6750.00000  6800.00000  8.497030089337e-04
6800.00000  6850.00000  8.396568631671e-04
6850.00000  6900.00000  8.683888400594e-04
6900.00000  6950.00000  8.032898154923e-04
6950.00000  7000.00000  8.223774924487e-04
7000.00000  7050.00000  7.771698364993e-04
7050.00000  7100.00000  8.175553424807e-04
7100.00000  7150.00000  7.759642990073e-04
7150.00000  7200.00000  7.733523011080e-04
7200.00000  7250.00000  7.677264594787e-04
7250.00000  7300.00000  7.418074034011e-04
7300.00000  7350.00000  7.454240158770e-04
7350.00000  7400.00000  7.168929619000e-04
7400.00000  7450.00000  7.257335701746e-04
7450.00000  7500.00000  7.402000200784e-04
7500.00000  7550.00000  6.875582162618e-04
7550.00000  7600.00000  7.201077285453e-04
7600.00000  7650.00000  6.982071307743e-04
7650.00000  7700.00000  6.837406808705e-04
7700.00000  7750.00000  7.032302036576e-04
7750.00000  7800.00000  6.875582162618e-04
7800.00000  7850.00000  6.620410060148e-04
7850.00000  7900.00000  6.608354685228e-04
7900.00000  7950.00000  6.552096268935e-04
7950.00000  8000.00000  6.556114727242e-04
8000.00000  8050.00000  6.170342729807e-04
8050.00000  8100.00000  6.184407333880e-04
8100.00000  8150.00000  6.176370417267e-04
8150.00000  8200.00000  6.073899730448e-04
8200.00000  8250.00000  6.027687459922e-04
8250.00000  8300.00000  6.174361188113e-04
8300.00000  8350.00000  5.766487669992e-04
8350.00000  8400.00000  5.744386149306e-04
8400.00000  8450.00000  5.796626107292e-04
8450.00000  8500.00000  5.834801461204e-04
8500.00000  8550.00000  5.631869316720e-04
8550.00000  8600.00000  5.641915462487e-04
8600.00000  8650.00000  5.543463233975e-04
8650.00000  8700.00000  5.545472463128e-04
8700.00000  8750.00000  5.382724901710e-04
8750.00000  8800.00000  5.348568006104e-04
8800.00000  8850.00000  5.280254214892e-04
8850.00000  8900.00000  5.143626632467e-04
8900.00000  8950.00000  5.107460507707e-04
8950.00000  9000.00000  5.223995798599e-04
9000.00000  9050.00000  5.213949652832e-04
9050.00000  9100.00000  5.221986569446e-04
9100.00000  9150.00000  5.242078860979e-04
9150.00000  9200.00000  4.802057676404e-04
9200.00000  9250.00000  4.816122280478e-04
9250.00000  9300.00000  4.998962133429e-04
9300.00000  9350.00000  4.926629883910e-04
9350.00000  9400.00000  4.623236281760e-04
9400.00000  9450.00000  4.695568531279e-04
9450.00000  9500.00000  4.615199365147e-04
9500.00000  9550.00000  4.492636386795e-04
9550.00000  9600.00000  4.713651593659e-04
9600.00000  9650.00000  4.546885573934e-04
9650.00000  9700.00000  4.444414887116e-04
9700.00000  9750.00000  4.484599470182e-04
9750.00000  9800.00000  4.554922490548e-04
9800.00000  9850.00000  4.382128783363e-04
9850.00000  9900.00000  4.488617928489e-04
9900.00000  9950.00000  4.177187409726e-04
9950.00000  10000.00000  4.392174929130e-04
