10001.00000  11001.00000  7.433734894487e-06
11001.00000  12001.00000  7.761551997487e-06
12001.00000  13001.00000  8.166502536486e-06
13001.00000  14001.00000  8.378619485486e-06
14001.00000  15001.00000  9.092103768485e-06
15001.00000  16001.00000  9.149953845484e-06
16001.00000  17001.00000  9.622396140984e-06
17001.00000  18001.00000  9.709171256483e-06
18001.00000  19001.00000  9.699529576983e-06
19001.00000  20001.00000  9.506695986984e-06
20001.00000  21001.00000  9.853796448983e-06
21001.00000  22001.00000  8.503961318986e-06
22001.00000  23001.00000  8.745003306485e-06
23001.00000  24001.00000  8.523244677985e-06
24001.00000  25001.00000  8.224352613486e-06
25001.00000  26001.00000  7.346959778987e-06
26001.00000  27001.00000  7.231259624988e-06
27001.00000  28001.00000  6.614192136989e-06
28001.00000  29001.00000  6.247808315989e-06
29001.00000  30001.00000  6.054974725990e-06
30001.00000  31001.00000  5.611457468990e-06
31001.00000  32001.00000  5.110090134991e-06
32001.00000  33001.00000  5.322207083991e-06
33001.00000  34001.00000  4.811198070492e-06
34001.00000  35001.00000  4.550872723992e-06
35001.00000  36001.00000  4.358039133993e-06
36001.00000  37001.00000  4.030222030993e-06
37001.00000  38001.00000  3.808463402494e-06
38001.00000  39001.00000  3.442079581494e-06
39001.00000  40001.00000  3.268529350494e-06
40001.00000  41001.00000  3.422796222494e-06
41001.00000  42001.00000  3.046770721995e-06
42001.00000  43001.00000  2.815370413995e-06
43001.00000  44001.00000  2.825012093495e-06
44001.00000  45001.00000  2.805728734495e-06
45001.00000  46001.00000  2.362211477496e-06
46001.00000  47001.00000  2.304361400496e-06
47001.00000  48001.00000  2.526120028996e-06
48001.00000  49001.00000  2.217586284996e-06
49001.00000  50001.00000  2.121169489996e-06
50001.00000  51001.00000  2.063319412996e-06
51001.00000  52001.00000  1.639085514997e-06
52001.00000  53001.00000  2.053677733497e-06
53001.00000  54001.00000  1.668010553497e-06
54001.00000  55001.00000  1.696935591997e-06
55001.00000  56001.00000  1.475176963497e-06
56001.00000  57001.00000  1.504102001997e-06
57001.00000  58001.00000  1.600518796997e-06
58001.00000  59001.00000  1.311268411998e-06
59001.00000  60001.00000  1.388401847998e-06
60001.00000  61001.00000  1.282343373498e-06
61001.00000  62001.00000  1.263060014498e-06
62001.00000  63001.00000  1.128076501498e-06
63001.00000  64001.00000  1.157001539998e-06
64001.00000  65001.00000  1.002734667998e-06
65001.00000  66001.00000  9.641679499984e-07
66001.00000  67001.00000  9.256012319984e-07
67001.00000  68001.00000  7.424093214987e-07
68001.00000  69001.00000  9.448845909984e-07
69001.00000  70001.00000  9.256012319984e-07
70001.00000  71001.00000  9.834513089983e-07
71001.00000  72001.00000  7.520510009987e-07
72001.00000  73001.00000  6.942009239988e-07
73001.00000  74001.00000  8.002593984986e-07
74001.00000  75001.00000  7.520510009987e-07
75001.00000  76001.00000  5.977841289990e-07
76001.00000  77001.00000  7.424093214987e-07
77001.00000  78001.00000  6.363508469989e-07
78001.00000  79001.00000  5.785007699990e-07
79001.00000  80001.00000  6.170674879989e-07
80001.00000  81001.00000  5.399340519991e-07
81001.00000  82001.00000  5.206506929991e-07
82001.00000  83001.00000  3.760255004994e-07
83001.00000  84001.00000  4.531589364992e-07
84001.00000  85001.00000  4.628006159992e-07
85001.00000  86001.00000  4.917256544992e-07
86001.00000  87001.00000  4.724422954992e-07
87001.00000  88001.00000  3.856671799993e-07
88001.00000  89001.00000  4.145922184993e-07
89001.00000  90001.00000  4.145922184993e-07
90001.00000  91001.00000  3.181754234995e-07
91001.00000  92001.00000  4.242338979993e-07
92001.00000  93001.00000  4.145922184993e-07
93001.00000  94001.00000  3.760255004994e-07
94001.00000  95001.00000  3.856671799993e-07
95001.00000  96001.00000  3.567421414994e-07
96001.00000  97001.00000  2.796087054995e-07
97001.00000  98001.00000  2.796087054995e-07
98001.00000  99001.00000  3.085337439995e-07
99001.00000  100001.00000  3.663838209994e-07
100001.00000  101001.00000  3.567421414994e-07
101001.00000  102001.00000  3.181754234995e-07
102001.00000  103001.00000  2.410419874996e-07
103001.00000  104001.00000  2.314003079996e-07
104001.00000  105001.00000  3.471004619994e-07
105001.00000  106001.00000  2.217586284996e-07
106001.00000  107001.00000  2.506836669996e-07
107001.00000  108001.00000  2.603253464996e-07
108001.00000  109001.00000  2.796087054995e-07
109001.00000  110001.00000  1.928335899997e-07
110001.00000  111001.00000  2.314003079996e-07
111001.00000  112001.00000  2.121169489996e-07
112001.00000  113001.00000  1.928335899997e-07
113001.00000  114001.00000  2.121169489996e-07
114001.00000  115001.00000  2.121169489996e-07
115001.00000  116001.00000  1.831919104997e-07
116001.00000  117001.00000  1.542668719997e-07
117001.00000  118001.00000  2.121169489996e-07
118001.00000  119001.00000  1.446251924998e-07
119001.00000  120001.00000  8.677511549985e-08
120001.00000  121001.00000  1.446251924998e-07
121001.00000  122001.00000  1.253418334998e-07
122001.00000  123001.00000  1.831919104997e-07
123001.00000  124001.00000  1.253418334998e-07
124001.00000  125001.00000  2.217586284996e-07
125001.00000  126001.00000  9.641679499984e-08
126001.00000  127001.00000  1.639085514997e-07
127001.00000  128001.00000  1.735502309997e-07
128001.00000  129001.00000  1.157001539998e-07
129001.00000  130001.00000  9.641679499984e-08
130001.00000  131001.00000  9.641679499984e-08
131001.00000  132001.00000  1.446251924998e-07
132001.00000  133001.00000  1.446251924998e-07
133001.00000  134001.00000  1.639085514997e-07
134001.00000  135001.00000  1.542668719997e-07
135001.00000  136001.00000  1.542668719997e-07
136001.00000  137001.00000  1.157001539998e-07
137001.00000  138001.00000  9.641679499984e-08
138001.00000  139001.00000  1.542668719997e-07
139001.00000  140001.00000  9.641679499984e-08
140001.00000  141001.00000  6.749175649989e-08
141001.00000  142001.00000  7.713343599987e-08
142001.00000  143001.00000  1.446251924998e-07
143001.00000  144001.00000  7.713343599987e-08
144001.00000  145001.00000  9.641679499984e-08
145001.00000  146001.00000  6.749175649989e-08
146001.00000  147001.00000  8.677511549985e-08
147001.00000  148001.00000  2.892503849995e-08
148001.00000  149001.00000  6.749175649989e-08
149001.00000  150001.00000  9.641679499984e-08
150001.00000  151001.00000  7.713343599987e-08
151001.00000  152001.00000  0.000000000000e+00
152001.00000  153001.00000  3.856671799993e-08
153001.00000  154001.00000  5.785007699990e-08
154001.00000  155001.00000  2.892503849995e-08
155001.00000  156001.00000  2.892503849995e-08
156001.00000  157001.00000  3.856671799993e-08
157001.00000  158001.00000  3.856671799993e-08
158001.00000  159001.00000  7.713343599987e-08
159001.00000  160001.00000  2.892503849995e-08
160001.00000  161001.00000  3.856671799993e-08
161001.00000  162001.00000  4.820839749992e-08
162001.00000  163001.00000  1.928335899997e-08
163001.00000  164001.00000  9.641679499984e-09
164001.00000  165001.00000  9.641679499984e-09
165001.00000  166001.00000  9.641679499984e-09
166001.00000  167001.00000  0.000000000000e+00
167001.00000  168001.00000  0.000000000000e+00
168001.00000  169001.00000  0.000000000000e+00
169001.00000  170001.00000  9.641679499984e-09
170001.00000  171001.00000  0.000000000000e+00
171001.00000  172001.00000  9.641679499984e-09
172001.00000  173001.00000  0.000000000000e+00
173001.00000  174001.00000  0.000000000000e+00
174001.00000  175001.00000  0.000000000000e+00
175001.00000  176001.00000  0.000000000000e+00
176001.00000  177001.00000  0.000000000000e+00
177001.00000  178001.00000  0.000000000000e+00
178001.00000  179001.00000  0.000000000000e+00
179001.00000  180001.00000  0.000000000000e+00
180001.00000  181001.00000  0.000000000000e+00
181001.00000  182001.00000  0.000000000000e+00
182001.00000  183001.00000  0.000000000000e+00
183001.00000  184001.00000  0.000000000000e+00
184001.00000  185001.00000  0.000000000000e+00
185001.00000  186001.00000  0.000000000000e+00
186001.00000  187001.00000  0.000000000000e+00
187001.00000  188001.00000  0.000000000000e+00
188001.00000  189001.00000  0.000000000000e+00
189001.00000  190001.00000  0.000000000000e+00
190001.00000  191001.00000  0.000000000000e+00
191001.00000  192001.00000  0.000000000000e+00
192001.00000  193001.00000  0.000000000000e+00
193001.00000  194001.00000  0.000000000000e+00
194001.00000  195001.00000  0.000000000000e+00
195001.00000  196001.00000  0.000000000000e+00
196001.00000  197001.00000  0.000000000000e+00
197001.00000  198001.00000  0.000000000000e+00
198001.00000  199001.00000  0.000000000000e+00
