300.00000  350.00000  5.040274283994e-01
350.00000  400.00000  3.781655025609e-01
400.00000  450.00000  2.930240644274e-01
450.00000  500.00000  2.345857781386e-01
500.00000  550.00000  1.921853966101e-01
550.00000  600.00000  1.595425651826e-01
600.00000  650.00000  1.341051078594e-01
650.00000  700.00000  1.153402627127e-01
700.00000  750.00000  1.002570180539e-01
750.00000  800.00000  8.706192170050e-02
800.00000  850.00000  7.671232835910e-02
850.00000  900.00000  6.823779524107e-02
900.00000  950.00000  6.093503040882e-02
950.00000  1000.00000  5.473474401628e-02
1000.00000  1050.00000  4.969082816593e-02
1050.00000  1100.00000  4.491136856141e-02
1100.00000  1150.00000  4.110697106855e-02
1150.00000  1200.00000  3.745424134986e-02
1200.00000  1250.00000  3.481160360945e-02
1250.00000  1300.00000  3.175515151056e-02
1300.00000  1350.00000  2.933077678527e-02
1350.00000  1400.00000  2.725824050058e-02
1400.00000  1450.00000  2.537663623617e-02
1450.00000  1500.00000  2.365285884337e-02
1500.00000  1550.00000  2.213040694776e-02
1550.00000  1600.00000  2.068917814950e-02
1600.00000  1650.00000  1.943657170998e-02
1650.00000  1700.00000  1.824170680885e-02
1700.00000  1750.00000  1.727010918950e-02
1750.00000  1800.00000  1.613183099600e-02
1800.00000  1850.00000  1.526763263806e-02
1850.00000  1900.00000  1.440612888525e-02
1900.00000  1950.00000  1.382024474237e-02
1950.00000  2000.00000  1.314505368677e-02
2000.00000  2050.00000  1.242905861070e-02
2050.00000  2100.00000  1.159296113479e-02
2100.00000  2150.00000  1.124574201725e-02
2150.00000  2200.00000  1.076764207937e-02
2200.00000  2250.00000  1.030340011070e-02
2250.00000  2300.00000  9.814136808719e-03
2300.00000  2350.00000  9.362213034903e-03
2350.00000  2400.00000  8.929151496962e-03
2400.00000  2450.00000  8.510717815414e-03
2450.00000  2500.00000  8.254730328542e-03
2500.00000  2550.00000  7.803961385494e-03
2550.00000  2600.00000  7.483303375623e-03
2600.00000  2650.00000  7.216152524662e-03
2650.00000  2700.00000  6.959395150611e-03
2700.00000  2750.00000  6.728813940632e-03
2750.00000  2800.00000  6.572911786973e-03
2800.00000  2850.00000  6.201441223317e-03
2850.00000  2900.00000  6.045924013247e-03
2900.00000  2950.00000  5.815342803268e-03
2950.00000  3000.00000  5.645197736806e-03
3000.00000  3050.00000  5.446951788326e-03
3050.00000  3100.00000  5.283350762882e-03
3100.00000  3150.00000  5.050844834956e-03
3150.00000  3200.00000  4.892248076172e-03
3200.00000  3250.00000  4.738655584049e-03
3250.00000  3300.00000  4.615088691890e-03
3300.00000  3350.00000  4.416457799821e-03
3350.00000  3400.00000  4.417227686999e-03
3400.00000  3450.00000  4.165089636020e-03
3450.00000  3500.00000  4.084251482271e-03
3500.00000  3550.00000  3.990325246487e-03
3550.00000  3600.00000  3.875227113292e-03
3600.00000  3650.00000  3.660813534062e-03
3650.00000  3700.00000  3.663893082777e-03
3700.00000  3750.00000  3.521079011153e-03
3750.00000  3800.00000  3.416759298458e-03
3800.00000  3850.00000  3.294347237067e-03
3850.00000  3900.00000  3.232371319193e-03
3900.00000  3950.00000  3.164236303890e-03
3950.00000  4000.00000  3.036050088659e-03
4000.00000  4050.00000  2.994091237428e-03
4050.00000  4100.00000  2.934809924678e-03
4100.00000  4150.00000  2.834724591465e-03
4150.00000  4200.00000  2.743877904395e-03
4200.00000  4250.00000  2.706538376235e-03
4250.00000  4300.00000  2.566033966147e-03
4300.00000  4350.00000  2.559104981540e-03
4350.00000  4400.00000  2.536393309772e-03
4400.00000  4450.00000  2.461329309863e-03
4450.00000  4500.00000  2.388959915078e-03
4500.00000  4550.00000  2.333528038221e-03
4550.00000  4600.00000  2.264238192151e-03
4600.00000  4650.00000  2.238446971669e-03
4650.00000  4700.00000  2.159918479456e-03
4700.00000  4750.00000  2.091013576974e-03
4750.00000  4800.00000  2.077925494939e-03
4800.00000  4850.00000  1.966676797637e-03
4850.00000  4900.00000  2.012100141172e-03
4900.00000  4950.00000  1.953973659190e-03
4950.00000  5000.00000  1.858122705459e-03
5000.00000  5050.00000  1.889688079780e-03
5050.00000  5100.00000  1.861587197763e-03
5100.00000  5150.00000  1.814239136281e-03
5150.00000  5200.00000  1.719158069729e-03
5200.00000  5250.00000  1.694136736426e-03
5250.00000  5300.00000  1.646403731355e-03
5300.00000  5350.00000  1.634085536498e-03
5350.00000  5400.00000  1.615223300623e-03
5400.00000  5450.00000  1.557866705820e-03
5450.00000  5500.00000  1.550167834035e-03
5500.00000  5550.00000  1.524376613553e-03
5550.00000  5600.00000  1.518217516124e-03
5600.00000  5650.00000  1.443153516214e-03
5650.00000  5700.00000  1.503204716142e-03
5700.00000  5750.00000  1.424676223929e-03
5750.00000  5800.00000  1.390031300894e-03
5800.00000  5850.00000  1.392340962429e-03
5850.00000  5900.00000  1.335369311216e-03
5900.00000  5950.00000  1.332289762502e-03
5950.00000  6000.00000  1.309193147145e-03
6000.00000  6050.00000  1.296105065109e-03
6050.00000  6100.00000  1.231434542110e-03
6100.00000  6150.00000  1.217191629307e-03
6150.00000  6200.00000  1.254146213877e-03
6200.00000  6250.00000  1.204488490860e-03
6250.00000  6300.00000  1.139048080682e-03
6300.00000  6350.00000  1.157910316557e-03
6350.00000  6400.00000  1.307653372788e-03
6400.00000  6450.00000  1.087080696130e-03
6450.00000  6500.00000  1.162529639629e-03
6500.00000  6550.00000  1.074377557683e-03
6550.00000  6600.00000  1.062829250005e-03
6600.00000  6650.00000  1.012016696220e-03
6650.00000  6700.00000  1.042812183362e-03
6700.00000  6750.00000  1.006627485970e-03
6750.00000  6800.00000  9.766018860059e-04
6800.00000  6850.00000  9.754470552380e-04
6850.00000  6900.00000  9.608191988454e-04
6900.00000  6950.00000  9.615890860239e-04
6950.00000  7000.00000  9.115464194174e-04
7000.00000  7050.00000  9.265592193994e-04
7050.00000  7100.00000  8.872949732927e-04
7100.00000  7150.00000  8.911444091855e-04
7150.00000  7200.00000  8.980733937926e-04
7200.00000  7250.00000  8.611188092216e-04
7250.00000  7300.00000  8.280136605434e-04
7300.00000  7350.00000  8.353275887398e-04
7350.00000  7400.00000  8.145406349186e-04
7400.00000  7450.00000  7.860548093118e-04
7450.00000  7500.00000  8.210846759364e-04
7500.00000  7550.00000  7.710420093298e-04
7550.00000  7600.00000  7.494851683301e-04
7600.00000  7650.00000  8.026073836509e-04
7650.00000  7700.00000  7.567990965264e-04
7700.00000  7750.00000  7.421712401338e-04
7750.00000  7800.00000  7.310078760446e-04
7800.00000  7850.00000  7.125305837591e-04
7850.00000  7900.00000  7.052166555628e-04
7900.00000  7950.00000  6.967478965986e-04
7950.00000  8000.00000  6.851995889202e-04
8000.00000  8050.00000  6.755759991881e-04
8050.00000  8100.00000  6.775007171346e-04
8100.00000  8150.00000  6.828899273845e-04
8150.00000  8200.00000  6.821200402059e-04
8200.00000  8250.00000  6.651825222776e-04
8250.00000  8300.00000  6.093657018318e-04
8300.00000  8350.00000  6.259182761709e-04
8350.00000  8400.00000  6.255333325816e-04
8400.00000  8450.00000  6.405461325636e-04
8450.00000  8500.00000  6.024367172248e-04
8500.00000  8550.00000  5.824196505821e-04
8550.00000  8600.00000  5.924281839035e-04
8600.00000  8650.00000  5.751057223858e-04
8650.00000  8700.00000  5.558585429218e-04
8700.00000  8750.00000  5.889636915999e-04
8750.00000  8800.00000  5.658670762431e-04
8800.00000  8850.00000  5.316070967971e-04
8850.00000  8900.00000  5.650971890645e-04
8900.00000  8950.00000  5.377661942255e-04
8950.00000  9000.00000  5.185190147615e-04
9000.00000  9050.00000  5.296823788506e-04
9050.00000  9100.00000  5.289124916721e-04
9100.00000  9150.00000  5.162093532258e-04
9150.00000  9200.00000  4.973471173510e-04
9200.00000  9250.00000  4.961922865832e-04
9250.00000  9300.00000  4.792547686548e-04
9300.00000  9350.00000  4.896482455654e-04
9350.00000  9400.00000  4.754053327620e-04
9400.00000  9450.00000  4.900331891547e-04
9450.00000  9500.00000  4.692462353335e-04
9500.00000  9550.00000  4.838740917262e-04
9550.00000  9600.00000  4.665516302086e-04
9600.00000  9650.00000  4.584678148337e-04
9650.00000  9700.00000  4.634720814943e-04
9700.00000  9750.00000  4.496141122802e-04
9750.00000  9800.00000  4.265174969233e-04
9800.00000  9850.00000  4.396055789589e-04
9850.00000  9900.00000  4.372959174232e-04
9900.00000  9950.00000  4.473044507445e-04
9950.00000  10000.00000  4.172788507806e-04
