300.00000  350.00000  1.928425346779e-01
350.00000  400.00000  1.359577153016e-01
400.00000  450.00000  1.000709201438e-01
450.00000  500.00000  7.681759969191e-02
500.00000  550.00000  6.067676968762e-02
550.00000  600.00000  4.798923782846e-02
600.00000  650.00000  3.975824128273e-02
650.00000  700.00000  3.281428196006e-02
700.00000  750.00000  2.784738352296e-02
750.00000  800.00000  2.344967511163e-02
800.00000  850.00000  2.049004596929e-02
850.00000  900.00000  1.741196806462e-02
900.00000  950.00000  1.540708364426e-02
950.00000  1000.00000  1.349282445148e-02
1000.00000  1050.00000  1.180035857879e-02
1050.00000  1100.00000  1.068344239695e-02
1100.00000  1150.00000  9.497364857232e-03
1150.00000  1200.00000  8.476638609916e-03
1200.00000  1250.00000  7.725403170887e-03
1250.00000  1300.00000  6.961448401673e-03
1300.00000  1350.00000  6.442340738513e-03
1350.00000  1400.00000  5.858046508157e-03
1400.00000  1450.00000  5.457387607341e-03
1450.00000  1500.00000  4.971668185915e-03
1500.00000  1550.00000  4.571804243236e-03
1550.00000  1600.00000  4.127422644911e-03
1600.00000  1650.00000  3.900064617861e-03
1650.00000  1700.00000  3.663167093172e-03
1700.00000  1750.00000  3.361877959424e-03
1750.00000  1800.00000  3.134519932374e-03
1800.00000  1850.00000  2.938960230785e-03
1850.00000  1900.00000  2.787918184843e-03
1900.00000  1950.00000  2.521607209102e-03
1950.00000  2000.00000  2.498553423142e-03
2000.00000  2050.00000  2.314918093602e-03
2050.00000  2100.00000  2.104254187419e-03
2100.00000  2150.00000  2.027938206311e-03
2150.00000  2200.00000  1.889615490553e-03
2200.00000  2250.00000  1.855432290682e-03
2250.00000  2300.00000  1.771961686346e-03
2300.00000  2350.00000  1.590711231215e-03
2350.00000  2400.00000  1.570837277801e-03
2400.00000  2450.00000  1.524729705882e-03
2450.00000  2500.00000  1.368122952984e-03
2500.00000  2550.00000  1.355403622799e-03
2550.00000  2600.00000  1.298166636968e-03
2600.00000  2650.00000  1.160638879347e-03
2650.00000  2700.00000  1.114531307428e-03
2700.00000  2750.00000  1.140764925934e-03
2750.00000  2800.00000  1.055704405324e-03
2800.00000  2850.00000  1.037420368184e-03
2850.00000  2900.00000  1.055704405324e-03
2900.00000  2950.00000  9.181766477026e-04
2950.00000  3000.00000  8.768388246026e-04
3000.00000  3050.00000  8.386808340487e-04
3050.00000  3100.00000  8.060875504506e-04
3100.00000  3150.00000  8.068825085872e-04
3150.00000  3200.00000  7.758791412621e-04
3200.00000  3250.00000  6.979732438813e-04
3250.00000  3300.00000  6.987682020179e-04
3300.00000  3350.00000  6.939984531986e-04
3350.00000  3400.00000  6.232471790466e-04
3400.00000  3450.00000  6.049631419062e-04
3450.00000  3500.00000  6.304018022755e-04
3500.00000  3550.00000  5.890639791755e-04
3550.00000  3600.00000  5.143379143408e-04
3600.00000  3650.00000  5.326219514812e-04
3650.00000  3700.00000  4.865143795619e-04
3700.00000  3750.00000  5.032085004292e-04
3750.00000  3800.00000  4.944639609273e-04
3800.00000  3850.00000  4.968488353369e-04
3850.00000  3900.00000  4.936690027908e-04
3900.00000  3950.00000  4.300723518676e-04
3950.00000  4000.00000  4.213278123657e-04
4000.00000  4050.00000  4.253026030484e-04
4050.00000  4100.00000  4.253026030484e-04
4100.00000  4150.00000  3.855546962215e-04
4150.00000  4200.00000  4.308673100042e-04
4200.00000  4250.00000  3.656807428080e-04
4250.00000  4300.00000  3.879395706311e-04
4300.00000  4350.00000  3.362672917560e-04
4350.00000  4400.00000  3.529614126234e-04
4400.00000  4450.00000  3.410370405753e-04
4450.00000  4500.00000  3.148034220695e-04
4500.00000  4550.00000  3.036740081579e-04
4550.00000  4600.00000  3.020840918849e-04
4600.00000  4650.00000  2.877748454271e-04
4650.00000  4700.00000  2.631311431944e-04
4700.00000  4750.00000  2.885698035637e-04
4750.00000  4800.00000  2.663109757406e-04
4800.00000  4850.00000  2.869798872906e-04
4850.00000  4900.00000  2.861849291541e-04
4900.00000  4950.00000  2.686958501502e-04
4950.00000  5000.00000  2.647210594675e-04
5000.00000  5050.00000  2.297429014598e-04
5050.00000  5100.00000  2.305378595963e-04
5100.00000  5150.00000  2.345126502790e-04
5150.00000  5200.00000  2.376924828252e-04
5200.00000  5250.00000  2.305378595963e-04
5250.00000  5300.00000  2.058941573636e-04
5300.00000  5350.00000  1.939697853155e-04
5350.00000  5400.00000  1.955597015886e-04
5400.00000  5450.00000  1.995344922713e-04
5450.00000  5500.00000  2.114588643194e-04
5500.00000  5550.00000  1.979445759982e-04
5550.00000  5600.00000  2.106639061829e-04
5600.00000  5650.00000  1.717109574924e-04
5650.00000  5700.00000  1.621714598540e-04
5700.00000  5750.00000  1.725059156290e-04
5750.00000  5800.00000  1.605815435809e-04
5800.00000  5850.00000  1.899949946328e-04
5850.00000  5900.00000  1.725059156290e-04
5900.00000  5950.00000  1.470672552597e-04
5950.00000  6000.00000  1.701210412194e-04
6000.00000  6050.00000  1.574017110347e-04
6050.00000  6100.00000  1.502470878059e-04
6100.00000  6150.00000  1.279882599828e-04
6150.00000  6200.00000  1.335529669386e-04
6200.00000  6250.00000  1.391176738943e-04
6250.00000  6300.00000  1.454773389867e-04
6300.00000  6350.00000  1.208336367539e-04
6350.00000  6400.00000  1.351428832116e-04
6400.00000  6450.00000  1.240134693001e-04
6450.00000  6500.00000  1.112941391155e-04
6500.00000  6550.00000  1.224235530270e-04
6550.00000  6600.00000  1.240134693001e-04
6600.00000  6650.00000  1.279882599828e-04
6650.00000  6700.00000  1.136790135251e-04
6700.00000  6750.00000  1.025495996135e-04
6750.00000  6800.00000  1.104991809789e-04
6800.00000  6850.00000  1.184487623443e-04
6850.00000  6900.00000  1.081143065693e-04
6900.00000  6950.00000  1.112941391155e-04
6950.00000  7000.00000  9.460001824815e-05
7000.00000  7050.00000  9.618993452123e-05
7050.00000  7100.00000  9.618993452123e-05
7100.00000  7150.00000  1.049344740232e-04
7150.00000  7200.00000  9.698489265777e-05
7200.00000  7250.00000  8.506052060968e-05
7250.00000  7300.00000  9.460001824815e-05
7300.00000  7350.00000  8.903531129238e-05
7350.00000  7400.00000  1.089092647059e-04
7400.00000  7450.00000  8.506052060968e-05
7450.00000  7500.00000  8.267564620007e-05
7500.00000  7550.00000  8.506052060968e-05
7550.00000  7600.00000  7.870085551737e-05
7600.00000  7650.00000  7.075127415198e-05
7650.00000  7700.00000  8.585547874622e-05
7700.00000  7750.00000  8.506052060968e-05
7750.00000  7800.00000  6.757144160582e-05
7800.00000  7850.00000  6.439160905967e-05
7850.00000  7900.00000  6.916135787890e-05
7900.00000  7950.00000  7.711093924429e-05
7950.00000  8000.00000  5.485211142120e-05
8000.00000  8050.00000  9.062522756546e-05
8050.00000  8100.00000  8.188068806353e-05
8100.00000  8150.00000  8.426556247314e-05
8150.00000  8200.00000  6.121177651351e-05
8200.00000  8250.00000  6.041681837697e-05
8250.00000  8300.00000  7.075127415198e-05
8300.00000  8350.00000  7.790589738083e-05
8350.00000  8400.00000  7.552102297121e-05
8400.00000  8450.00000  6.359665092313e-05
8450.00000  8500.00000  5.326219514812e-05
8500.00000  8550.00000  6.280169278659e-05
8550.00000  8600.00000  6.280169278659e-05
8600.00000  8650.00000  6.518656719621e-05
8650.00000  8700.00000  5.803194396735e-05
8700.00000  8750.00000  6.598152533274e-05
8750.00000  8800.00000  6.041681837697e-05
8800.00000  8850.00000  5.167227887504e-05
8850.00000  8900.00000  4.610757191927e-05
8900.00000  8950.00000  5.962186024043e-05
8950.00000  9000.00000  5.564706955774e-05
9000.00000  9050.00000  4.769748819235e-05
9050.00000  9100.00000  6.200673465005e-05
9100.00000  9150.00000  5.087732073850e-05
9150.00000  9200.00000  4.213278123657e-05
9200.00000  9250.00000  5.723698583081e-05
9250.00000  9300.00000  4.372269750965e-05
9300.00000  9350.00000  5.564706955774e-05
9350.00000  9400.00000  4.531261378273e-05
9400.00000  9450.00000  5.326219514812e-05
9450.00000  9500.00000  4.372269750965e-05
9500.00000  9550.00000  4.928740446542e-05
9550.00000  9600.00000  3.736303241734e-05
9600.00000  9650.00000  4.054286496349e-05
9650.00000  9700.00000  5.087732073850e-05
9700.00000  9750.00000  4.292773937311e-05
9750.00000  9800.00000  4.769748819235e-05
9800.00000  9850.00000  3.895294869042e-05
9850.00000  9900.00000  4.133782310003e-05
9900.00000  9950.00000  3.736303241734e-05
9950.00000  10000.00000  4.849244632888e-05
