10001.00000  11001.00000  3.783485674265e-05
11001.00000  12001.00000  3.750931782231e-05
12001.00000  13001.00000  3.653270106126e-05
13001.00000  14001.00000  3.693058196391e-05
14001.00000  15001.00000  3.656887205241e-05
15001.00000  16001.00000  3.615290565419e-05
16001.00000  17001.00000  3.485074997280e-05
17001.00000  18001.00000  3.311454239761e-05
18001.00000  19001.00000  3.372944924715e-05
19001.00000  20001.00000  3.125173635340e-05
20001.00000  21001.00000  2.982298220298e-05
21001.00000  22001.00000  2.752612426497e-05
22001.00000  23001.00000  2.522926632696e-05
23001.00000  24001.00000  2.501224038006e-05
24001.00000  25001.00000  2.369199920310e-05
25001.00000  26001.00000  2.146748324738e-05
26001.00000  27001.00000  1.989404513237e-05
27001.00000  28001.00000  1.734399025631e-05
28001.00000  29001.00000  1.651205745987e-05
29001.00000  30001.00000  1.546309871652e-05
30001.00000  31001.00000  1.437796898203e-05
31001.00000  32001.00000  1.338326672541e-05
32001.00000  33001.00000  1.209919653960e-05
33001.00000  34001.00000  1.121300725643e-05
34001.00000  35001.00000  1.005553553963e-05
35001.00000  36001.00000  9.820424097161e-06
36001.00000  37001.00000  8.970405805141e-06
37001.00000  38001.00000  8.084216521972e-06
38001.00000  39001.00000  7.396967690127e-06
39001.00000  40001.00000  7.650164628175e-06
40001.00000  41001.00000  6.583120389257e-06
41001.00000  42001.00000  6.492692911383e-06
42001.00000  43001.00000  5.769273088387e-06
43001.00000  44001.00000  5.425648672465e-06
44001.00000  45001.00000  4.611801371595e-06
45001.00000  46001.00000  4.449031911421e-06
46001.00000  47001.00000  4.828827318494e-06
47001.00000  48001.00000  4.358604433547e-06
48001.00000  49001.00000  3.526671637102e-06
49001.00000  50001.00000  3.544757132677e-06
50001.00000  51001.00000  3.888381548600e-06
51001.00000  52001.00000  3.418158663653e-06
52001.00000  53001.00000  3.074534247730e-06
53001.00000  54001.00000  3.400073168078e-06
54001.00000  55001.00000  2.947935778706e-06
55001.00000  56001.00000  2.369199920310e-06
56001.00000  57001.00000  2.694738840657e-06
57001.00000  58001.00000  2.441541902609e-06
58001.00000  59001.00000  2.387285415884e-06
59001.00000  60001.00000  1.862806044213e-06
60001.00000  61001.00000  2.134088477836e-06
61001.00000  62001.00000  2.043660999962e-06
62001.00000  63001.00000  2.097917486686e-06
63001.00000  64001.00000  1.663865592889e-06
64001.00000  65001.00000  1.862806044213e-06
65001.00000  66001.00000  1.374497663691e-06
66001.00000  67001.00000  1.736207575189e-06
67001.00000  68001.00000  1.139386221218e-06
68001.00000  69001.00000  1.338326672541e-06
69001.00000  70001.00000  1.338326672541e-06
70001.00000  71001.00000  1.410668654841e-06
71001.00000  72001.00000  1.338326672541e-06
72001.00000  73001.00000  1.048958743343e-06
73001.00000  74001.00000  1.030873247768e-06
74001.00000  75001.00000  1.067044238918e-06
75001.00000  76001.00000  1.392583159266e-06
76001.00000  77001.00000  8.138473008697e-07
77001.00000  78001.00000  9.585312654687e-07
78001.00000  79001.00000  1.067044238918e-06
79001.00000  80001.00000  7.595908141450e-07
80001.00000  81001.00000  7.957618052948e-07
81001.00000  82001.00000  8.138473008697e-07
82001.00000  83001.00000  8.861892831692e-07
83001.00000  84001.00000  7.415053185702e-07
84001.00000  85001.00000  7.776763097199e-07
85001.00000  86001.00000  6.510778406958e-07
86001.00000  87001.00000  7.957618052948e-07
87001.00000  88001.00000  7.234198229953e-07
88001.00000  89001.00000  8.138473008697e-07
89001.00000  90001.00000  5.606503628213e-07
90001.00000  91001.00000  5.787358583962e-07
91001.00000  92001.00000  5.425648672465e-07
92001.00000  93001.00000  5.606503628213e-07
93001.00000  94001.00000  4.340518937972e-07
94001.00000  95001.00000  5.244793716716e-07
95001.00000  96001.00000  4.702228849469e-07
96001.00000  97001.00000  5.425648672465e-07
97001.00000  98001.00000  3.978809026474e-07
98001.00000  99001.00000  3.978809026474e-07
99001.00000  100001.00000  5.063938760967e-07
100001.00000  101001.00000  3.797954070725e-07
101001.00000  102001.00000  4.521373893721e-07
102001.00000  103001.00000  3.074534247730e-07
103001.00000  104001.00000  3.978809026474e-07
104001.00000  105001.00000  4.159663982223e-07
105001.00000  106001.00000  2.712824336232e-07
106001.00000  107001.00000  2.170259468986e-07
107001.00000  108001.00000  1.627694601739e-07
108001.00000  109001.00000  3.074534247730e-07
109001.00000  110001.00000  2.170259468986e-07
110001.00000  111001.00000  2.893679291981e-07
111001.00000  112001.00000  2.170259468986e-07
112001.00000  113001.00000  4.159663982223e-07
113001.00000  114001.00000  2.170259468986e-07
114001.00000  115001.00000  3.797954070725e-07
115001.00000  116001.00000  2.531969380483e-07
116001.00000  117001.00000  1.265984690242e-07
117001.00000  118001.00000  1.627694601739e-07
118001.00000  119001.00000  2.712824336232e-07
119001.00000  120001.00000  2.712824336232e-07
120001.00000  121001.00000  1.627694601739e-07
121001.00000  122001.00000  1.085129734493e-07
122001.00000  123001.00000  1.446839645991e-07
123001.00000  124001.00000  2.531969380483e-07
124001.00000  125001.00000  1.085129734493e-07
125001.00000  126001.00000  1.627694601739e-07
126001.00000  127001.00000  1.265984690242e-07
127001.00000  128001.00000  2.531969380483e-07
128001.00000  129001.00000  1.446839645991e-07
129001.00000  130001.00000  1.265984690242e-07
130001.00000  131001.00000  1.627694601739e-07
131001.00000  132001.00000  1.446839645991e-07
132001.00000  133001.00000  1.446839645991e-07
133001.00000  134001.00000  9.042747787441e-08
134001.00000  135001.00000  1.085129734493e-07
135001.00000  136001.00000  1.265984690242e-07
136001.00000  137001.00000  1.627694601739e-07
137001.00000  138001.00000  1.446839645991e-07
138001.00000  139001.00000  1.085129734493e-07
139001.00000  140001.00000  1.446839645991e-07
140001.00000  141001.00000  5.425648672465e-08
141001.00000  142001.00000  2.712824336232e-07
142001.00000  143001.00000  1.265984690242e-07
143001.00000  144001.00000  5.425648672465e-08
144001.00000  145001.00000  1.989404513237e-07
145001.00000  146001.00000  1.085129734493e-07
146001.00000  147001.00000  9.042747787441e-08
147001.00000  148001.00000  1.085129734493e-07
148001.00000  149001.00000  7.234198229953e-08
149001.00000  150001.00000  1.085129734493e-07
150001.00000  151001.00000  5.425648672465e-08
151001.00000  152001.00000  3.617099114976e-08
152001.00000  153001.00000  5.425648672465e-08
153001.00000  154001.00000  9.042747787441e-08
154001.00000  155001.00000  5.425648672465e-08
155001.00000  156001.00000  1.265984690242e-07
156001.00000  157001.00000  1.446839645991e-07
157001.00000  158001.00000  5.425648672465e-08
158001.00000  159001.00000  5.425648672465e-08
159001.00000  160001.00000  1.085129734493e-07
160001.00000  161001.00000  9.042747787441e-08
161001.00000  162001.00000  0.000000000000e+00
162001.00000  163001.00000  3.617099114976e-08
163001.00000  164001.00000  1.808549557488e-08
164001.00000  165001.00000  5.425648672465e-08
165001.00000  166001.00000  1.808549557488e-08
166001.00000  167001.00000  3.617099114976e-08
167001.00000  168001.00000  1.808549557488e-08
168001.00000  169001.00000  5.425648672465e-08
169001.00000  170001.00000  1.808549557488e-08
170001.00000  171001.00000  0.000000000000e+00
171001.00000  172001.00000  1.808549557488e-08
172001.00000  173001.00000  1.808549557488e-08
173001.00000  174001.00000  1.808549557488e-08
174001.00000  175001.00000  0.000000000000e+00
175001.00000  176001.00000  0.000000000000e+00
176001.00000  177001.00000  5.425648672465e-08
177001.00000  178001.00000  1.808549557488e-08
178001.00000  179001.00000  3.617099114976e-08
179001.00000  180001.00000  3.617099114976e-08
180001.00000  181001.00000  0.000000000000e+00
181001.00000  182001.00000  1.808549557488e-08
182001.00000  183001.00000  0.000000000000e+00
183001.00000  184001.00000  1.808549557488e-08
184001.00000  185001.00000  0.000000000000e+00
185001.00000  186001.00000  1.808549557488e-08
186001.00000  187001.00000  1.808549557488e-08
187001.00000  188001.00000  0.000000000000e+00
188001.00000  189001.00000  0.000000000000e+00
189001.00000  190001.00000  0.000000000000e+00
190001.00000  191001.00000  1.808549557488e-08
191001.00000  192001.00000  1.808549557488e-08
192001.00000  193001.00000  0.000000000000e+00
193001.00000  194001.00000  0.000000000000e+00
194001.00000  195001.00000  0.000000000000e+00
195001.00000  196001.00000  0.000000000000e+00
196001.00000  197001.00000  0.000000000000e+00
197001.00000  198001.00000  0.000000000000e+00
198001.00000  199001.00000  0.000000000000e+00
