10001.00000  11001.00000  2.051425526102e-04
11001.00000  12001.00000  1.750597789892e-04
12001.00000  13001.00000  1.521781480662e-04
13001.00000  14001.00000  1.356875312877e-04
14001.00000  15001.00000  1.242197115411e-04
15001.00000  16001.00000  1.129499232187e-04
16001.00000  17001.00000  1.012120606209e-04
17001.00000  18001.00000  9.138250083804e-05
18001.00000  19001.00000  8.416335528326e-05
19001.00000  20001.00000  7.865448111927e-05
20001.00000  21001.00000  7.231747554500e-05
21001.00000  22001.00000  6.731268136987e-05
22001.00000  23001.00000  6.131773007375e-05
23001.00000  24001.00000  5.764514729776e-05
24001.00000  25001.00000  5.310842739799e-05
25001.00000  26001.00000  4.822965322008e-05
26001.00000  27001.00000  4.507915328969e-05
27001.00000  28001.00000  4.149658479742e-05
28001.00000  29001.00000  3.892217628287e-05
29001.00000  30001.00000  3.546562778781e-05
30001.00000  31001.00000  3.425943638589e-05
31001.00000  32001.00000  3.019079076150e-05
32001.00000  33001.00000  3.047883646943e-05
33001.00000  34001.00000  2.743635367951e-05
34001.00000  35001.00000  2.486194516496e-05
35001.00000  36001.00000  2.282762235277e-05
36001.00000  37001.00000  2.248556807461e-05
37001.00000  38001.00000  2.118936238896e-05
38001.00000  39001.00000  1.915503957677e-05
39001.00000  40001.00000  1.782282817763e-05
40001.00000  41001.00000  1.821889102602e-05
41001.00000  42001.00000  1.701269962410e-05
42001.00000  43001.00000  1.564448251148e-05
43001.00000  44001.00000  1.469033110399e-05
44001.00000  45001.00000  1.380819112348e-05
45001.00000  46001.00000  1.294405399971e-05
46001.00000  47001.00000  1.332211399136e-05
47001.00000  48001.00000  1.164784831407e-05
48001.00000  49001.00000  1.204391116246e-05
49001.00000  50001.00000  1.062168547960e-05
50001.00000  51001.00000  1.072970262007e-05
51001.00000  52001.00000  9.919574066541e-06
52001.00000  53001.00000  9.667534072110e-06
53001.00000  54001.00000  9.073439799522e-06
54001.00000  55001.00000  9.127448369757e-06
55001.00000  56001.00000  8.065279821797e-06
56001.00000  57001.00000  8.047276965052e-06
57001.00000  58001.00000  7.633211259915e-06
58001.00000  59001.00000  6.715065565916e-06
59001.00000  60001.00000  7.291156981759e-06
60001.00000  61001.00000  7.093125557563e-06
61001.00000  62001.00000  6.102968436583e-06
62001.00000  63001.00000  6.445022714740e-06
63001.00000  64001.00000  5.850928442152e-06
64001.00000  65001.00000  5.454865593760e-06
65001.00000  66001.00000  6.174979863563e-06
66001.00000  67001.00000  5.436862737015e-06
67001.00000  68001.00000  5.472868450505e-06
68001.00000  69001.00000  4.824765607682e-06
69001.00000  70001.00000  4.590728469996e-06
70001.00000  71001.00000  4.500714186271e-06
71001.00000  72001.00000  3.924622770428e-06
72001.00000  73001.00000  4.878774177917e-06
73001.00000  74001.00000  4.122654194624e-06
74001.00000  75001.00000  4.410699902545e-06
75001.00000  76001.00000  4.104651337879e-06
76001.00000  77001.00000  3.852611343448e-06
77001.00000  78001.00000  3.402539924821e-06
78001.00000  79001.00000  3.582568492272e-06
79001.00000  80001.00000  3.060485646664e-06
80001.00000  81001.00000  3.294522784350e-06
81001.00000  82001.00000  2.916462792703e-06
82001.00000  83001.00000  3.222511357370e-06
83001.00000  84001.00000  3.186505643880e-06
84001.00000  85001.00000  3.060485646664e-06
85001.00000  86001.00000  2.628417084782e-06
86001.00000  87001.00000  2.916462792703e-06
87001.00000  88001.00000  2.934465649449e-06
88001.00000  89001.00000  2.268359949880e-06
89001.00000  90001.00000  3.042482789919e-06
90001.00000  91001.00000  2.844451365723e-06
91001.00000  92001.00000  2.322368520116e-06
92001.00000  93001.00000  2.142339952665e-06
93001.00000  94001.00000  2.520399944312e-06
94001.00000  95001.00000  1.854294244744e-06
95001.00000  96001.00000  2.448388517331e-06
96001.00000  97001.00000  1.908302814979e-06
97001.00000  98001.00000  1.602254250312e-06
98001.00000  99001.00000  1.764279961018e-06
99001.00000  100001.00000  1.674265677293e-06
100001.00000  101001.00000  2.250357093135e-06
101001.00000  102001.00000  1.782282817763e-06
102001.00000  103001.00000  1.836291387998e-06
103001.00000  104001.00000  1.620257107057e-06
104001.00000  105001.00000  1.692268534038e-06
105001.00000  106001.00000  1.692268534038e-06
106001.00000  107001.00000  1.656262820548e-06
107001.00000  108001.00000  1.170185688430e-06
108001.00000  109001.00000  1.458231396352e-06
109001.00000  110001.00000  1.656262820548e-06
110001.00000  111001.00000  1.494237109842e-06
111001.00000  112001.00000  8.461342670189e-07
112001.00000  113001.00000  1.242197115411e-06
113001.00000  114001.00000  1.350214255881e-06
114001.00000  115001.00000  1.476234253097e-06
115001.00000  116001.00000  1.242197115411e-06
116001.00000  117001.00000  1.368217112626e-06
117001.00000  118001.00000  1.242197115411e-06
118001.00000  119001.00000  1.116177118195e-06
119001.00000  120001.00000  1.080171404705e-06
120001.00000  121001.00000  1.098174261450e-06
121001.00000  122001.00000  1.008159977725e-06
122001.00000  123001.00000  1.098174261450e-06
123001.00000  124001.00000  1.206191401921e-06
124001.00000  125001.00000  1.116177118195e-06
125001.00000  126001.00000  1.044165691215e-06
126001.00000  127001.00000  1.008159977725e-06
127001.00000  128001.00000  1.098174261450e-06
128001.00000  129001.00000  1.026162834470e-06
129001.00000  130001.00000  1.026162834470e-06
130001.00000  131001.00000  8.821399805091e-07
131001.00000  132001.00000  9.721542642345e-07
132001.00000  133001.00000  9.181456939992e-07
133001.00000  134001.00000  6.481028428230e-07
134001.00000  135001.00000  9.721542642345e-07
135001.00000  136001.00000  7.921256967836e-07
136001.00000  137001.00000  8.461342670189e-07
137001.00000  138001.00000  7.741228400386e-07
138001.00000  139001.00000  7.381171265484e-07
139001.00000  140001.00000  8.281314102738e-07
140001.00000  141001.00000  5.760914158427e-07
141001.00000  142001.00000  7.561199832935e-07
142001.00000  143001.00000  7.561199832935e-07
143001.00000  144001.00000  6.300999860779e-07
144001.00000  145001.00000  5.760914158427e-07
145001.00000  146001.00000  6.120971293328e-07
146001.00000  147001.00000  6.481028428230e-07
147001.00000  148001.00000  5.400857023525e-07
148001.00000  149001.00000  5.580885590976e-07
149001.00000  150001.00000  6.661056995681e-07
150001.00000  151001.00000  6.120971293328e-07
151001.00000  152001.00000  4.680742753722e-07
152001.00000  153001.00000  5.580885590976e-07
153001.00000  154001.00000  4.860771321172e-07
154001.00000  155001.00000  4.500714186271e-07
155001.00000  156001.00000  4.860771321172e-07
156001.00000  157001.00000  7.201142698033e-07
157001.00000  158001.00000  5.580885590976e-07
158001.00000  159001.00000  6.300999860779e-07
159001.00000  160001.00000  5.760914158427e-07
160001.00000  161001.00000  4.860771321172e-07
161001.00000  162001.00000  5.760914158427e-07
162001.00000  163001.00000  5.400857023525e-07
163001.00000  164001.00000  3.780599916467e-07
164001.00000  165001.00000  5.580885590976e-07
165001.00000  166001.00000  4.500714186271e-07
166001.00000  167001.00000  2.700428511762e-07
167001.00000  168001.00000  4.860771321172e-07
168001.00000  169001.00000  4.320685618820e-07
169001.00000  170001.00000  3.060485646664e-07
170001.00000  171001.00000  2.880457079213e-07
171001.00000  172001.00000  4.860771321172e-07
172001.00000  173001.00000  3.960628483918e-07
173001.00000  174001.00000  5.580885590976e-07
174001.00000  175001.00000  4.500714186271e-07
175001.00000  176001.00000  4.320685618820e-07
176001.00000  177001.00000  3.960628483918e-07
177001.00000  178001.00000  3.060485646664e-07
178001.00000  179001.00000  4.500714186271e-07
179001.00000  180001.00000  3.240514214115e-07
180001.00000  181001.00000  4.320685618820e-07
181001.00000  182001.00000  3.960628483918e-07
182001.00000  183001.00000  3.960628483918e-07
183001.00000  184001.00000  3.780599916467e-07
184001.00000  185001.00000  3.960628483918e-07
185001.00000  186001.00000  3.060485646664e-07
186001.00000  187001.00000  2.880457079213e-07
187001.00000  188001.00000  1.620257107057e-07
188001.00000  189001.00000  2.160342809410e-07
189001.00000  190001.00000  2.700428511762e-07
190001.00000  191001.00000  3.060485646664e-07
191001.00000  192001.00000  1.980314241959e-07
192001.00000  193001.00000  3.420542781566e-07
193001.00000  194001.00000  3.780599916467e-07
194001.00000  195001.00000  2.160342809410e-07
195001.00000  196001.00000  2.340371376861e-07
196001.00000  197001.00000  2.520399944312e-07
197001.00000  198001.00000  2.700428511762e-07
198001.00000  199001.00000  2.340371376861e-07
