10001.00000  11001.00000  3.646305621419e-05
11001.00000  12001.00000  3.637639988836e-05
12001.00000  13001.00000  3.583720497207e-05
13001.00000  14001.00000  3.458550248782e-05
14001.00000  15001.00000  3.375745315209e-05
15001.00000  16001.00000  3.153327412238e-05
16001.00000  17001.00000  3.134070450942e-05
17001.00000  18001.00000  2.935723749592e-05
18001.00000  19001.00000  2.804776412779e-05
19001.00000  20001.00000  2.684420404678e-05
20001.00000  21001.00000  2.540956043022e-05
21001.00000  22001.00000  2.406157313949e-05
22001.00000  23001.00000  2.273284281006e-05
23001.00000  24001.00000  2.118265742572e-05
24001.00000  25001.00000  2.000798278666e-05
25001.00000  26001.00000  1.886219358954e-05
26001.00000  27001.00000  1.751420629881e-05
27001.00000  28001.00000  1.712906707289e-05
28001.00000  29001.00000  1.576182282087e-05
29001.00000  30001.00000  1.480860323671e-05
30001.00000  31001.00000  1.429829376236e-05
31001.00000  32001.00000  1.361467163635e-05
32001.00000  33001.00000  1.289253558775e-05
33001.00000  34001.00000  1.165046158415e-05
34001.00000  35001.00000  1.146752045184e-05
35001.00000  36001.00000  1.130383628082e-05
36001.00000  37001.00000  1.017730404500e-05
37001.00000  38001.00000  9.994362912682e-06
38001.00000  39001.00000  9.243341422134e-06
39001.00000  40001.00000  9.301112306022e-06
40001.00000  41001.00000  8.790802831675e-06
41001.00000  42001.00000  8.049409821775e-06
42001.00000  43001.00000  8.010895899183e-06
43001.00000  44001.00000  7.510214905484e-06
44001.00000  45001.00000  6.711051011695e-06
45001.00000  46001.00000  6.576252282622e-06
46001.00000  47001.00000  6.556995321326e-06
47001.00000  48001.00000  6.162227614756e-06
48001.00000  49001.00000  5.892630156610e-06
49001.00000  50001.00000  5.613404217817e-06
50001.00000  51001.00000  5.334178279023e-06
51001.00000  52001.00000  4.843125765972e-06
52001.00000  53001.00000  4.862382727268e-06
53001.00000  54001.00000  4.698698556251e-06
54001.00000  55001.00000  4.525385904586e-06
55001.00000  56001.00000  4.352073252921e-06
56001.00000  57001.00000  4.043961872184e-06
57001.00000  58001.00000  4.130618198016e-06
58001.00000  59001.00000  4.015076430239e-06
59001.00000  60001.00000  3.167770133211e-06
60001.00000  61001.00000  3.533652397837e-06
61001.00000  62001.00000  3.408482149412e-06
62001.00000  63001.00000  3.235169497747e-06
63001.00000  64001.00000  3.081113807378e-06
64001.00000  65001.00000  3.071485326730e-06
65001.00000  66001.00000  3.004085962194e-06
66001.00000  67001.00000  3.215912536451e-06
67001.00000  68001.00000  2.869287233121e-06
68001.00000  69001.00000  2.436005603958e-06
69001.00000  70001.00000  2.676717620160e-06
70001.00000  71001.00000  2.445634084606e-06
71001.00000  72001.00000  2.561175852383e-06
72001.00000  73001.00000  2.416748642662e-06
73001.00000  74001.00000  2.012352455444e-06
74001.00000  75001.00000  2.012352455444e-06
75001.00000  76001.00000  2.253064471645e-06
76001.00000  77001.00000  2.301206874885e-06
77001.00000  78001.00000  2.262692952293e-06
78001.00000  79001.00000  2.089380300628e-06
79001.00000  80001.00000  1.829411323131e-06
80001.00000  81001.00000  1.607956268225e-06
81001.00000  82001.00000  1.713869555354e-06
82001.00000  83001.00000  1.810154361835e-06
83001.00000  84001.00000  1.550185384337e-06
84001.00000  85001.00000  1.521299942393e-06
85001.00000  86001.00000  1.502042981097e-06
86001.00000  87001.00000  1.453900577857e-06
87001.00000  88001.00000  1.492414500449e-06
88001.00000  89001.00000  1.887182207019e-06
89001.00000  90001.00000  1.453900577857e-06
90001.00000  91001.00000  1.328730329432e-06
91001.00000  92001.00000  1.290216406840e-06
92001.00000  93001.00000  1.453900577857e-06
93001.00000  94001.00000  1.232445522951e-06
94001.00000  95001.00000  1.367244252024e-06
95001.00000  96001.00000  1.001361987398e-06
96001.00000  97001.00000  1.165046158415e-06
97001.00000  98001.00000  1.155417677767e-06
98001.00000  99001.00000  9.532195841576e-07
99001.00000  100001.00000  1.020618948694e-06
100001.00000  101001.00000  9.821050261017e-07
101001.00000  102001.00000  8.954487002692e-07
102001.00000  103001.00000  1.010990468046e-06
103001.00000  104001.00000  9.917335067498e-07
104001.00000  105001.00000  8.473062970290e-07
105001.00000  106001.00000  9.147056615654e-07
106001.00000  107001.00000  9.339626228615e-07
107001.00000  108001.00000  6.643651647159e-07
108001.00000  109001.00000  8.184208550848e-07
109001.00000  110001.00000  7.510214905484e-07
110001.00000  111001.00000  7.895354131406e-07
111001.00000  112001.00000  7.606499711965e-07
112001.00000  113001.00000  8.280493357328e-07
113001.00000  114001.00000  7.799069324926e-07
114001.00000  115001.00000  6.836221260120e-07
115001.00000  116001.00000  7.221360486042e-07
116001.00000  117001.00000  8.473062970290e-07
117001.00000  118001.00000  5.295664356431e-07
118001.00000  119001.00000  4.717955517548e-07
119001.00000  120001.00000  7.702784518445e-07
120001.00000  121001.00000  5.680803582353e-07
121001.00000  122001.00000  4.910525130509e-07
122001.00000  123001.00000  5.199379549950e-07
123001.00000  124001.00000  4.043961872184e-07
124001.00000  125001.00000  3.851392259223e-07
125001.00000  126001.00000  4.910525130509e-07
126001.00000  127001.00000  5.006809936989e-07
127001.00000  128001.00000  4.043961872184e-07
128001.00000  129001.00000  4.140246678664e-07
129001.00000  130001.00000  4.043961872184e-07
130001.00000  131001.00000  3.081113807378e-07
131001.00000  132001.00000  2.310835355534e-07
132001.00000  133001.00000  4.236531485145e-07
133001.00000  134001.00000  3.273683420339e-07
134001.00000  135001.00000  3.562537839781e-07
135001.00000  136001.00000  2.599689774975e-07
136001.00000  137001.00000  3.658822646261e-07
137001.00000  138001.00000  2.503404968495e-07
138001.00000  139001.00000  3.851392259223e-07
139001.00000  140001.00000  2.792259387936e-07
140001.00000  141001.00000  2.792259387936e-07
141001.00000  142001.00000  3.562537839781e-07
142001.00000  143001.00000  1.540556903689e-07
143001.00000  144001.00000  2.407120162014e-07
144001.00000  145001.00000  1.829411323131e-07
145001.00000  146001.00000  2.310835355534e-07
146001.00000  147001.00000  2.214550549053e-07
147001.00000  148001.00000  2.214550549053e-07
148001.00000  149001.00000  1.829411323131e-07
149001.00000  150001.00000  2.695974581456e-07
150001.00000  151001.00000  1.733126516650e-07
151001.00000  152001.00000  2.888544194417e-07
152001.00000  153001.00000  2.214550549053e-07
153001.00000  154001.00000  1.059132871286e-07
154001.00000  155001.00000  2.503404968495e-07
155001.00000  156001.00000  9.628480648056e-08
156001.00000  157001.00000  1.829411323131e-07
157001.00000  158001.00000  1.251702484247e-07
158001.00000  159001.00000  1.155417677767e-07
159001.00000  160001.00000  2.503404968495e-07
160001.00000  161001.00000  1.540556903689e-07
161001.00000  162001.00000  1.444272097208e-07
162001.00000  163001.00000  1.636841710170e-07
163001.00000  164001.00000  2.021980936092e-07
164001.00000  165001.00000  2.503404968495e-07
165001.00000  166001.00000  2.407120162014e-07
166001.00000  167001.00000  1.636841710170e-07
167001.00000  168001.00000  1.444272097208e-07
168001.00000  169001.00000  1.347987290728e-07
169001.00000  170001.00000  8.665632583251e-08
170001.00000  171001.00000  2.118265742572e-07
171001.00000  172001.00000  7.702784518445e-08
172001.00000  173001.00000  1.251702484247e-07
173001.00000  174001.00000  8.665632583251e-08
174001.00000  175001.00000  9.628480648056e-08
175001.00000  176001.00000  1.444272097208e-07
176001.00000  177001.00000  9.628480648056e-08
177001.00000  178001.00000  1.155417677767e-07
178001.00000  179001.00000  7.702784518445e-08
179001.00000  180001.00000  8.665632583251e-08
180001.00000  181001.00000  9.628480648056e-08
181001.00000  182001.00000  5.777088388834e-08
182001.00000  183001.00000  1.155417677767e-07
183001.00000  184001.00000  1.155417677767e-07
184001.00000  185001.00000  4.814240324028e-08
185001.00000  186001.00000  5.777088388834e-08
186001.00000  187001.00000  7.702784518445e-08
187001.00000  188001.00000  3.851392259223e-08
188001.00000  189001.00000  6.739936453639e-08
189001.00000  190001.00000  4.814240324028e-08
190001.00000  191001.00000  4.814240324028e-08
191001.00000  192001.00000  1.925696129611e-08
192001.00000  193001.00000  3.851392259223e-08
193001.00000  194001.00000  1.925696129611e-08
194001.00000  195001.00000  3.851392259223e-08
195001.00000  196001.00000  1.925696129611e-08
196001.00000  197001.00000  0.000000000000e+00
197001.00000  198001.00000  9.628480648056e-09
198001.00000  199001.00000  9.628480648056e-09
