300.00000  350.00000  3.371642653136e-01
350.00000  400.00000  2.524609209764e-01
400.00000  450.00000  1.962903806812e-01
450.00000  500.00000  1.568185387572e-01
500.00000  550.00000  1.285382819771e-01
550.00000  600.00000  1.072779037183e-01
600.00000  650.00000  9.064396105527e-02
650.00000  700.00000  7.765648427094e-02
700.00000  750.00000  6.722901648352e-02
750.00000  800.00000  5.882120728359e-02
800.00000  850.00000  5.198084597567e-02
850.00000  900.00000  4.621650868542e-02
900.00000  950.00000  4.119362425389e-02
950.00000  1000.00000  3.706113080989e-02
1000.00000  1050.00000  3.373700445641e-02
1050.00000  1100.00000  3.062549267813e-02
1100.00000  1150.00000  2.803490459680e-02
1150.00000  1200.00000  2.567815657281e-02
1200.00000  1250.00000  2.333939624554e-02
1250.00000  1300.00000  2.172769861960e-02
1300.00000  1350.00000  2.018867128841e-02
1350.00000  1400.00000  1.863417453804e-02
1400.00000  1450.00000  1.737107847450e-02
1450.00000  1500.00000  1.615798820784e-02
1500.00000  1550.00000  1.507548861935e-02
1550.00000  1600.00000  1.418293910821e-02
1600.00000  1650.00000  1.331449311066e-02
1650.00000  1700.00000  1.233128560806e-02
1700.00000  1750.00000  1.198340355353e-02
1750.00000  1800.00000  1.109589059746e-02
1800.00000  1850.00000  1.060374721526e-02
1850.00000  1900.00000  1.016340839960e-02
1900.00000  1950.00000  9.546430402176e-03
1950.00000  2000.00000  9.056805297512e-03
2000.00000  2050.00000  8.493430636304e-03
2050.00000  2100.00000  8.197712902260e-03
2100.00000  2150.00000  7.847672324128e-03
2150.00000  2200.00000  7.477485525672e-03
2200.00000  2250.00000  7.090030538366e-03
2250.00000  2300.00000  6.743227745643e-03
2300.00000  2350.00000  6.597167648293e-03
2350.00000  2400.00000  6.185249393451e-03
2400.00000  2450.00000  5.979829896931e-03
2450.00000  2500.00000  5.671161021250e-03
2500.00000  2550.00000  5.448113581947e-03
2550.00000  2600.00000  5.306370531809e-03
2600.00000  2650.00000  5.088359647587e-03
2650.00000  2700.00000  4.940860534500e-03
2700.00000  2750.00000  4.762782336991e-03
2750.00000  2800.00000  4.583984631615e-03
2800.00000  2850.00000  4.292583944783e-03
2850.00000  2900.00000  4.268840185115e-03
2900.00000  2950.00000  4.106231406785e-03
2950.00000  3000.00000  4.005140551229e-03
3000.00000  3050.00000  3.843251280767e-03
3050.00000  3100.00000  3.756550582587e-03
3100.00000  3150.00000  3.634234244904e-03
3150.00000  3200.00000  3.468387681164e-03
3200.00000  3250.00000  3.402552711176e-03
3250.00000  3300.00000  3.265126708251e-03
3300.00000  3350.00000  3.190297889904e-03
3350.00000  3400.00000  3.072658353368e-03
3400.00000  3450.00000  2.961494387651e-03
3450.00000  3500.00000  2.931634811099e-03
3500.00000  3550.00000  2.840976819641e-03
3550.00000  3600.00000  2.795647823911e-03
3600.00000  3650.00000  2.733410393267e-03
3650.00000  3700.00000  2.643831663611e-03
3700.00000  3750.00000  2.510003200029e-03
3750.00000  3800.00000  2.474027806593e-03
3800.00000  3850.00000  2.451363308729e-03
3850.00000  3900.00000  2.337681065471e-03
3900.00000  3950.00000  2.338400573340e-03
3950.00000  4000.00000  2.259614461715e-03
4000.00000  4050.00000  2.173633271403e-03
4050.00000  4100.00000  2.121468950921e-03
4100.00000  4150.00000  2.118590919446e-03
4150.00000  4200.00000  2.054194965195e-03
4200.00000  4250.00000  1.946628538822e-03
4250.00000  4300.00000  1.925403056694e-03
4300.00000  4350.00000  1.927561580301e-03
4350.00000  4400.00000  1.843019405726e-03
4400.00000  4450.00000  1.826110970811e-03
4450.00000  4500.00000  1.794452624587e-03
4500.00000  4550.00000  1.726818884928e-03
4550.00000  4600.00000  1.766391817707e-03
4600.00000  4650.00000  1.611337871998e-03
4650.00000  4700.00000  1.603423285442e-03
4700.00000  4750.00000  1.583277065118e-03
4750.00000  4800.00000  1.576081986431e-03
4800.00000  4850.00000  1.524996927752e-03
4850.00000  4900.00000  1.525356681686e-03
4900.00000  4950.00000  1.449088847602e-03
4950.00000  5000.00000  1.396205019251e-03
5000.00000  5050.00000  1.407357391216e-03
5050.00000  5100.00000  1.385772155155e-03
5100.00000  5150.00000  1.374979537124e-03
5150.00000  5200.00000  1.290797116484e-03
5200.00000  5250.00000  1.310223828939e-03
5250.00000  5300.00000  1.284681299599e-03
5300.00000  5350.00000  1.211291496990e-03
5350.00000  5400.00000  1.226760916167e-03
5400.00000  5450.00000  1.203376910434e-03
5450.00000  5500.00000  1.190425768797e-03
5500.00000  5550.00000  1.165602747326e-03
5550.00000  5600.00000  1.135023662906e-03
5600.00000  5650.00000  1.133944401103e-03
5650.00000  5700.00000  1.157328406836e-03
5700.00000  5750.00000  1.073865494064e-03
5750.00000  5800.00000  1.057316813084e-03
5800.00000  5850.00000  1.057316813084e-03
5850.00000  5900.00000  1.041127886038e-03
5900.00000  5950.00000  1.008750031945e-03
5950.00000  6000.00000  9.752929160498e-04
6000.00000  6050.00000  9.724148845750e-04
6050.00000  6100.00000  1.000115937521e-03
6100.00000  6150.00000  9.155737629461e-04
6150.00000  6200.00000  9.364394911390e-04
6200.00000  6250.00000  9.285249045830e-04
6250.00000  6300.00000  9.350004754015e-04
6300.00000  6350.00000  8.795983695101e-04
6350.00000  6400.00000  1.138980956184e-03
6400.00000  6450.00000  8.763605841009e-04
6450.00000  6500.00000  8.245560175530e-04
6500.00000  6550.00000  8.831959088537e-04
6550.00000  6600.00000  8.277938029623e-04
6600.00000  6650.00000  8.288730647653e-04
6650.00000  6700.00000  7.990134882135e-04
6700.00000  6750.00000  7.795867757580e-04
6750.00000  6800.00000  7.839038229703e-04
6800.00000  6850.00000  7.687941577272e-04
6850.00000  6900.00000  7.576417857621e-04
6900.00000  6950.00000  7.587210475651e-04
6950.00000  7000.00000  7.371358115035e-04
7000.00000  7050.00000  7.252639316697e-04
7050.00000  7100.00000  7.313797485538e-04
7100.00000  7150.00000  6.954043551178e-04
7150.00000  7200.00000  6.756178887280e-04
7200.00000  7250.00000  6.486363436510e-04
7250.00000  7300.00000  6.446790503730e-04
7300.00000  7350.00000  6.716605954500e-04
7350.00000  7400.00000  6.464778200448e-04
7400.00000  7450.00000  6.446790503730e-04
7450.00000  7500.00000  6.428802807012e-04
7500.00000  7550.00000  6.461180661105e-04
7550.00000  7600.00000  6.223743064427e-04
7600.00000  7650.00000  6.133804580837e-04
7650.00000  7700.00000  5.889171905472e-04
7700.00000  7750.00000  6.061853793965e-04
7750.00000  7800.00000  5.640941690764e-04
7800.00000  7850.00000  5.907159602190e-04
7850.00000  7900.00000  5.777648185821e-04
7900.00000  7950.00000  5.604966297328e-04
7950.00000  8000.00000  5.702099859605e-04
8000.00000  8050.00000  5.389113936712e-04
8050.00000  8100.00000  5.615758915359e-04
8100.00000  8150.00000  5.345943464589e-04
8150.00000  8200.00000  5.241614823625e-04
8200.00000  8250.00000  5.198444351501e-04
8250.00000  8300.00000  5.065335395788e-04
8300.00000  8350.00000  4.644423292587e-04
8350.00000  8400.00000  5.112103407255e-04
8400.00000  8450.00000  5.050945238414e-04
8450.00000  8500.00000  5.119298485942e-04
8500.00000  8550.00000  4.777532248300e-04
8550.00000  8600.00000  5.040152620383e-04
8600.00000  8650.00000  4.881860889265e-04
8650.00000  8700.00000  4.536497112279e-04
8700.00000  8750.00000  4.489729100812e-04
8750.00000  8800.00000  4.640825753243e-04
8800.00000  8850.00000  4.572472505715e-04
8850.00000  8900.00000  4.475338943438e-04
8900.00000  8950.00000  4.385400459848e-04
8950.00000  9000.00000  4.414180774597e-04
9000.00000  9050.00000  4.234303807417e-04
9050.00000  9100.00000  4.273876740196e-04
9100.00000  9150.00000  4.165950559888e-04
9150.00000  9200.00000  4.086804694329e-04
9200.00000  9250.00000  4.083207154985e-04
9250.00000  9300.00000  3.917720345180e-04
9300.00000  9350.00000  4.065219458267e-04
9350.00000  9400.00000  4.076012076298e-04
9400.00000  9450.00000  3.788208928810e-04
9450.00000  9500.00000  3.878147412400e-04
9500.00000  9550.00000  3.694672905877e-04
9550.00000  9600.00000  3.727050759969e-04
9600.00000  9650.00000  3.723453220626e-04
9650.00000  9700.00000  3.755831074718e-04
9700.00000  9750.00000  3.586746725569e-04
9750.00000  9800.00000  3.745038456687e-04
9800.00000  9850.00000  3.417662376420e-04
9850.00000  9900.00000  3.748635996031e-04
9900.00000  9950.00000  3.575954107538e-04
9950.00000  10000.00000  3.493210702635e-04
