300.00000  350.00000  7.911500909233e-06
350.00000  400.00000  1.563003838166e-05
400.00000  450.00000  1.099891589820e-05
450.00000  500.00000  1.099891589820e-05
500.00000  550.00000  1.144273180287e-04
550.00000  600.00000  1.042002558777e-05
600.00000  650.00000  3.743490674125e-05
650.00000  700.00000  1.254262339269e-05
700.00000  750.00000  2.199783179640e-05
750.00000  800.00000  1.447225776079e-05
800.00000  850.00000  6.194126321619e-05
850.00000  900.00000  1.891041680743e-05
900.00000  950.00000  1.601596525528e-05
950.00000  1000.00000  1.698078243933e-05
1000.00000  1050.00000  1.254262339269e-05
1050.00000  1100.00000  1.099891589820e-05
1100.00000  1150.00000  1.794559962338e-05
1150.00000  1200.00000  1.794559962338e-05
1200.00000  1250.00000  1.813856306019e-05
1250.00000  1300.00000  5.017049357075e-05
1300.00000  1350.00000  2.643599084305e-05
1350.00000  1400.00000  3.492638206271e-05
1400.00000  1450.00000  5.557346980144e-05
1450.00000  1500.00000  8.181649720768e-05
1500.00000  1550.00000  1.213740017538e-04
1550.00000  1600.00000  1.736670931295e-04
1600.00000  1650.00000  2.321350144831e-04
1650.00000  1700.00000  3.131796579435e-04
1700.00000  1750.00000  4.615685408509e-04
1750.00000  1800.00000  5.356665005861e-04
1800.00000  1850.00000  6.024318497226e-04
1850.00000  1900.00000  6.389019392798e-04
1900.00000  1950.00000  7.826596997036e-04
1950.00000  2000.00000  9.239089354490e-04
2000.00000  2050.00000  1.045668864076e-03
2050.00000  2100.00000  1.260630132683e-03
2100.00000  2150.00000  1.348042569559e-03
2150.00000  2200.00000  1.555671227567e-03
2200.00000  2250.00000  1.702130476106e-03
2250.00000  2300.00000  1.851677139634e-03
2300.00000  2350.00000  2.081496592876e-03
2350.00000  2400.00000  2.162927163210e-03
2400.00000  2450.00000  2.299545276471e-03
2450.00000  2500.00000  2.323472742636e-03
2500.00000  2550.00000  2.306684923633e-03
2550.00000  2600.00000  2.454494916230e-03
2600.00000  2650.00000  2.534574742507e-03
2650.00000  2700.00000  2.654019109892e-03
2700.00000  2750.00000  2.744518961757e-03
2750.00000  2800.00000  2.783304612556e-03
2800.00000  2850.00000  2.899854528389e-03
2850.00000  2900.00000  2.924939775174e-03
2900.00000  2950.00000  3.057505656263e-03
2950.00000  3000.00000  3.123113224779e-03
3000.00000  3050.00000  3.222875321610e-03
3050.00000  3100.00000  3.210718625091e-03
3100.00000  3150.00000  3.223647175357e-03
3150.00000  3200.00000  3.283465840768e-03
3200.00000  3250.00000  3.262239862719e-03
3250.00000  3300.00000  3.270730253939e-03
3300.00000  3350.00000  3.286167328884e-03
3350.00000  3400.00000  3.335373005271e-03
3400.00000  3450.00000  3.332671517155e-03
3450.00000  3500.00000  3.388052023520e-03
3500.00000  3550.00000  3.405804659706e-03
3550.00000  3600.00000  3.371071241080e-03
3600.00000  3650.00000  3.399243902855e-03
3650.00000  3700.00000  3.430118052745e-03
3700.00000  3750.00000  3.382456083852e-03
3750.00000  3800.00000  3.384578681657e-03
3800.00000  3850.00000  3.377246071058e-03
3850.00000  3900.00000  3.340004127754e-03
3900.00000  3950.00000  3.379947559174e-03
3950.00000  4000.00000  3.347336738353e-03
4000.00000  4050.00000  3.326882614051e-03
4050.00000  4100.00000  3.311445539106e-03
4100.00000  4150.00000  3.245259080280e-03
4150.00000  4200.00000  3.245066116843e-03
4200.00000  4250.00000  3.212069369149e-03
4250.00000  4300.00000  3.145111056575e-03
4300.00000  4350.00000  3.175792243028e-03
4350.00000  4400.00000  3.127744347262e-03
4400.00000  4450.00000  3.142023641586e-03
4450.00000  4500.00000  3.155917009037e-03
4500.00000  4550.00000  3.058856400321e-03
4550.00000  4600.00000  3.060014180942e-03
4600.00000  4650.00000  3.035121897593e-03
4650.00000  4700.00000  2.983021769654e-03
4700.00000  4750.00000  2.981478062160e-03
4750.00000  4800.00000  2.972022853756e-03
4800.00000  4850.00000  2.940569813556e-03
4850.00000  4900.00000  2.914519749587e-03
4900.00000  4950.00000  2.859525170096e-03
4950.00000  5000.00000  2.815143579629e-03
5000.00000  5050.00000  2.795654272511e-03
5050.00000  5100.00000  2.795268345638e-03
5100.00000  5150.00000  2.804530590605e-03
5150.00000  5200.00000  2.725029654639e-03
5200.00000  5250.00000  2.703996640026e-03
5250.00000  5300.00000  2.719047788098e-03
5300.00000  5350.00000  2.639160925258e-03
5350.00000  5400.00000  2.658843195813e-03
5400.00000  5450.00000  2.615040495657e-03
5450.00000  5500.00000  2.580114113594e-03
5500.00000  5550.00000  2.555607757119e-03
5550.00000  5600.00000  2.493473530466e-03
5600.00000  5650.00000  2.459126038714e-03
5650.00000  5700.00000  2.445232671263e-03
5700.00000  5750.00000  2.465879759002e-03
5750.00000  5800.00000  2.411078142948e-03
5800.00000  5850.00000  2.385606969289e-03
5850.00000  5900.00000  2.365924698734e-03
5900.00000  5950.00000  2.325209413567e-03
5950.00000  6000.00000  2.292984519620e-03
6000.00000  6050.00000  2.270600760950e-03
6050.00000  6100.00000  2.206922826802e-03
6100.00000  6150.00000  2.248409965717e-03
6150.00000  6200.00000  2.236253269198e-03
6200.00000  6250.00000  2.196309837778e-03
6250.00000  6300.00000  2.228920658599e-03
6300.00000  6350.00000  2.141122294850e-03
6350.00000  6400.00000  2.550590707762e-03
6400.00000  6450.00000  2.131088196136e-03
6450.00000  6500.00000  2.094811070015e-03
6500.00000  6550.00000  2.070497676977e-03
6550.00000  6600.00000  2.053323931101e-03
6600.00000  6650.00000  1.994856009748e-03
6650.00000  6700.00000  2.025151269327e-03
6700.00000  6750.00000  1.968805945778e-03
6750.00000  6800.00000  1.941405137751e-03
6800.00000  6850.00000  1.945457369924e-03
6850.00000  6900.00000  1.959929627685e-03
6900.00000  6950.00000  1.897795401032e-03
6950.00000  7000.00000  1.886796485134e-03
7000.00000  7050.00000  1.871359410189e-03
7050.00000  7100.00000  1.874446825178e-03
7100.00000  7150.00000  1.711585684510e-03
7150.00000  7200.00000  1.658713702824e-03
7200.00000  7250.00000  1.645978115994e-03
7250.00000  7300.00000  1.613946185484e-03
7300.00000  7350.00000  1.617226563909e-03
7350.00000  7400.00000  1.611437660805e-03
7400.00000  7450.00000  1.602175415838e-03
7450.00000  7500.00000  1.598702073975e-03
7500.00000  7550.00000  1.579984620605e-03
7550.00000  7600.00000  1.568985704707e-03
7600.00000  7650.00000  1.538304518254e-03
7650.00000  7700.00000  1.535410066702e-03
7700.00000  7750.00000  1.523060406746e-03
7750.00000  7800.00000  1.495466635282e-03
7800.00000  7850.00000  1.477713999095e-03
7850.00000  7900.00000  1.483888829073e-03
7900.00000  7950.00000  1.486783280625e-03
7950.00000  8000.00000  1.466329156323e-03
8000.00000  8050.00000  1.442787617033e-03
8050.00000  8100.00000  1.403616039360e-03
8100.00000  8150.00000  1.440857982664e-03
8150.00000  8200.00000  1.413457174637e-03
8200.00000  8250.00000  1.397827136256e-03
8250.00000  8300.00000  1.385477476300e-03
8300.00000  8350.00000  1.382775988184e-03
8350.00000  8400.00000  1.372548926034e-03
8400.00000  8450.00000  1.366181132619e-03
8450.00000  8500.00000  1.349200350179e-03
8500.00000  8550.00000  1.347270715811e-03
8550.00000  8600.00000  1.316010639048e-03
8600.00000  8650.00000  1.311765443438e-03
8650.00000  8700.00000  1.292469099757e-03
8700.00000  8750.00000  1.302503198471e-03
8750.00000  8800.00000  1.280698330112e-03
8800.00000  8850.00000  1.261980876741e-03
8850.00000  8900.00000  1.263524584236e-03
8900.00000  8950.00000  1.275681280755e-03
8950.00000  9000.00000  1.250788997406e-03
9000.00000  9050.00000  1.188847734190e-03
9050.00000  9100.00000  1.272400902329e-03
9100.00000  9150.00000  1.199074796341e-03
9150.00000  9200.00000  1.211617419734e-03
9200.00000  9250.00000  1.200811467272e-03
9250.00000  9300.00000  1.174568439866e-03
9300.00000  9350.00000  1.163762487404e-03
9350.00000  9400.00000  1.163569523968e-03
9400.00000  9450.00000  1.161446926163e-03
9450.00000  9500.00000  1.151026900575e-03
9500.00000  9550.00000  1.151798754322e-03
9550.00000  9600.00000  1.123819055985e-03
9600.00000  9650.00000  1.126134617226e-03
9650.00000  9700.00000  1.123433129111e-03
9700.00000  9750.00000  1.108767907913e-03
9750.00000  9800.00000  1.077507831150e-03
9800.00000  9850.00000  1.101049370441e-03
9850.00000  9900.00000  1.039494034098e-03
9900.00000  9950.00000  1.071718928046e-03
9950.00000  10000.00000  1.061877792769e-03
