10001.00000  11001.00000  4.188507878592e-04
11001.00000  12001.00000  3.448453610251e-04
12001.00000  13001.00000  2.919998701866e-04
13001.00000  14001.00000  2.496256490446e-04
14001.00000  15001.00000  2.133747655452e-04
15001.00000  16001.00000  1.831385213870e-04
16001.00000  17001.00000  1.617611887887e-04
17001.00000  18001.00000  1.431556628747e-04
18001.00000  19001.00000  1.267603357548e-04
19001.00000  20001.00000  1.136803068260e-04
20001.00000  21001.00000  1.059446110467e-04
21001.00000  22001.00000  9.246602167964e-05
22001.00000  23001.00000  8.038239384650e-05
23001.00000  24001.00000  7.786421653195e-05
24001.00000  25001.00000  7.000170606781e-05
25001.00000  26001.00000  6.324429500071e-05
26001.00000  27001.00000  5.882389741258e-05
27001.00000  28001.00000  5.518250431743e-05
28001.00000  29001.00000  4.996498585275e-05
29001.00000  30001.00000  4.496486399076e-05
30001.00000  31001.00000  4.039953533417e-05
31001.00000  32001.00000  4.128723812851e-05
32001.00000  33001.00000  3.599725412959e-05
33001.00000  34001.00000  3.458417621207e-05
34001.00000  35001.00000  3.233774465089e-05
35001.00000  36001.00000  3.032682607596e-05
36001.00000  37001.00000  2.940289051451e-05
37001.00000  38001.00000  2.721080810400e-05
38001.00000  39001.00000  2.601512678918e-05
39001.00000  40001.00000  2.458393248810e-05
40001.00000  41001.00000  2.193894048864e-05
41001.00000  42001.00000  2.065267725603e-05
42001.00000  43001.00000  2.000048744795e-05
43001.00000  44001.00000  1.947511232477e-05
44001.00000  45001.00000  1.833378016062e-05
45001.00000  46001.00000  1.706563331156e-05
46001.00000  47001.00000  1.614169775011e-05
47001.00000  48001.00000  1.516341303798e-05
48001.00000  49001.00000  1.568878816116e-05
49001.00000  50001.00000  1.340612383286e-05
50001.00000  51001.00000  1.396773172316e-05
51001.00000  52001.00000  1.250030465497e-05
52001.00000  53001.00000  1.289886509324e-05
53001.00000  54001.00000  1.081548098408e-05
54001.00000  55001.00000  1.134085610726e-05
55001.00000  56001.00000  1.061620076494e-05
56001.00000  57001.00000  1.016329117599e-05
57001.00000  58001.00000  9.819079888394e-06
58001.00000  59001.00000  9.221239230983e-06
59001.00000  60001.00000  9.076308162519e-06
60001.00000  61001.00000  8.967609861172e-06
61001.00000  62001.00000  8.224838135297e-06
62001.00000  63001.00000  8.333536436645e-06
63001.00000  64001.00000  7.626997477886e-06
64001.00000  65001.00000  6.847992984895e-06
65001.00000  66001.00000  7.916859614812e-06
66001.00000  67001.00000  6.521898080852e-06
67001.00000  68001.00000  7.155971505380e-06
68001.00000  69001.00000  6.521898080852e-06
69001.00000  70001.00000  5.833475505651e-06
70001.00000  71001.00000  5.724777204304e-06
71001.00000  72001.00000  6.123337642578e-06
72001.00000  73001.00000  6.050872108346e-06
73001.00000  74001.00000  5.181285697566e-06
74001.00000  75001.00000  4.873307177081e-06
75001.00000  76001.00000  6.050872108346e-06
76001.00000  77001.00000  4.221117368996e-06
77001.00000  78001.00000  4.818958026407e-06
78001.00000  79001.00000  4.257350136112e-06
79001.00000  80001.00000  4.239233752554e-06
80001.00000  81001.00000  4.583445040154e-06
81001.00000  82001.00000  4.529095889481e-06
82001.00000  83001.00000  3.786324163606e-06
83001.00000  84001.00000  3.786324163606e-06
84001.00000  85001.00000  3.496462026679e-06
85001.00000  86001.00000  3.695742245816e-06
86001.00000  87001.00000  3.913138848511e-06
87001.00000  88001.00000  3.695742245816e-06
88001.00000  89001.00000  3.170367122637e-06
89001.00000  90001.00000  3.297181807542e-06
90001.00000  91001.00000  3.152250739079e-06
91001.00000  92001.00000  3.188483506194e-06
92001.00000  93001.00000  3.043552437731e-06
93001.00000  94001.00000  2.644991999457e-06
94001.00000  95001.00000  2.318897095414e-06
95001.00000  96001.00000  2.663108383015e-06
96001.00000  97001.00000  2.518177314551e-06
97001.00000  98001.00000  2.445711780320e-06
98001.00000  99001.00000  2.373246246088e-06
99001.00000  100001.00000  2.663108383015e-06
100001.00000  101001.00000  2.210198794067e-06
101001.00000  102001.00000  2.083384109161e-06
102001.00000  103001.00000  2.355129862530e-06
103001.00000  104001.00000  2.137733259835e-06
104001.00000  105001.00000  2.029034958487e-06
105001.00000  106001.00000  2.119616876277e-06
106001.00000  107001.00000  2.337013478972e-06
107001.00000  108001.00000  1.558008985981e-06
108001.00000  109001.00000  1.793521972234e-06
109001.00000  110001.00000  1.684823670887e-06
110001.00000  111001.00000  1.811638355792e-06
111001.00000  112001.00000  1.702940054445e-06
112001.00000  113001.00000  1.811638355792e-06
113001.00000  114001.00000  1.956569424256e-06
114001.00000  115001.00000  1.467427068192e-06
115001.00000  116001.00000  2.065267725603e-06
116001.00000  117001.00000  1.666707287329e-06
117001.00000  118001.00000  1.775405588676e-06
118001.00000  119001.00000  1.612358136655e-06
119001.00000  120001.00000  1.793521972234e-06
120001.00000  121001.00000  1.413077917518e-06
121001.00000  122001.00000  1.739172821561e-06
122001.00000  123001.00000  1.503659835308e-06
123001.00000  124001.00000  1.503659835308e-06
124001.00000  125001.00000  1.467427068192e-06
125001.00000  126001.00000  1.394961533960e-06
126001.00000  127001.00000  1.159448547707e-06
127001.00000  128001.00000  9.601683285699e-07
128001.00000  129001.00000  1.105099397033e-06
129001.00000  130001.00000  1.304379616170e-06
130001.00000  131001.00000  1.449310684634e-06
131001.00000  132001.00000  1.250030465497e-06
132001.00000  133001.00000  1.195681314823e-06
133001.00000  134001.00000  9.420519450120e-07
134001.00000  135001.00000  1.068866629917e-06
135001.00000  136001.00000  7.971208765486e-07
136001.00000  137001.00000  1.050750246360e-06
137001.00000  138001.00000  9.058191778961e-07
138001.00000  139001.00000  1.050750246360e-06
139001.00000  140001.00000  9.058191778961e-07
140001.00000  141001.00000  1.014517479244e-06
141001.00000  142001.00000  9.420519450120e-07
142001.00000  143001.00000  6.340734245273e-07
143001.00000  144001.00000  7.971208765486e-07
144001.00000  145001.00000  8.333536436645e-07
145001.00000  146001.00000  8.333536436645e-07
146001.00000  147001.00000  7.971208765486e-07
147001.00000  148001.00000  1.105099397033e-06
148001.00000  149001.00000  9.058191778961e-07
149001.00000  150001.00000  8.514700272224e-07
150001.00000  151001.00000  7.427717258748e-07
151001.00000  152001.00000  6.521898080852e-07
152001.00000  153001.00000  7.246553423169e-07
153001.00000  154001.00000  9.239355614541e-07
154001.00000  155001.00000  8.333536436645e-07
155001.00000  156001.00000  7.608881094328e-07
156001.00000  157001.00000  7.971208765486e-07
157001.00000  158001.00000  5.978406574115e-07
158001.00000  159001.00000  6.340734245273e-07
159001.00000  160001.00000  6.703061916431e-07
160001.00000  161001.00000  5.616078902956e-07
161001.00000  162001.00000  4.891423560639e-07
162001.00000  163001.00000  5.072587396218e-07
163001.00000  164001.00000  5.434915067377e-07
164001.00000  165001.00000  4.710259725060e-07
165001.00000  166001.00000  6.340734245273e-07
166001.00000  167001.00000  6.703061916431e-07
167001.00000  168001.00000  5.978406574115e-07
168001.00000  169001.00000  4.347932053901e-07
169001.00000  170001.00000  6.703061916431e-07
170001.00000  171001.00000  5.072587396218e-07
171001.00000  172001.00000  5.072587396218e-07
172001.00000  173001.00000  5.072587396218e-07
173001.00000  174001.00000  6.340734245273e-07
174001.00000  175001.00000  5.072587396218e-07
175001.00000  176001.00000  4.166768218322e-07
176001.00000  177001.00000  3.442112876005e-07
177001.00000  178001.00000  4.529095889481e-07
178001.00000  179001.00000  4.891423560639e-07
179001.00000  180001.00000  5.253751231798e-07
180001.00000  181001.00000  4.529095889481e-07
181001.00000  182001.00000  3.804440547164e-07
182001.00000  183001.00000  2.717457533688e-07
183001.00000  184001.00000  4.166768218322e-07
184001.00000  185001.00000  3.442112876005e-07
185001.00000  186001.00000  4.347932053901e-07
186001.00000  187001.00000  3.804440547164e-07
187001.00000  188001.00000  3.260949040426e-07
188001.00000  189001.00000  3.985604382743e-07
189001.00000  190001.00000  3.623276711585e-07
190001.00000  191001.00000  2.717457533688e-07
191001.00000  192001.00000  3.442112876005e-07
192001.00000  193001.00000  3.804440547164e-07
193001.00000  194001.00000  2.536293698109e-07
194001.00000  195001.00000  1.992802191372e-07
195001.00000  196001.00000  4.347932053901e-07
196001.00000  197001.00000  3.079785204847e-07
197001.00000  198001.00000  2.536293698109e-07
198001.00000  199001.00000  2.173966026951e-07
