300.00000  350.00000  4.840390715833e-06
350.00000  400.00000  1.471478777613e-05
400.00000  450.00000  8.131856402599e-06
450.00000  500.00000  1.297224711843e-05
500.00000  550.00000  1.250756960971e-04
550.00000  600.00000  1.026162831757e-05
600.00000  650.00000  3.504442878263e-05
650.00000  700.00000  1.452117214750e-05
700.00000  750.00000  2.497641609370e-05
750.00000  800.00000  1.800625346290e-05
800.00000  850.00000  7.609094205289e-05
850.00000  900.00000  1.819986909153e-05
900.00000  950.00000  1.607009717657e-05
950.00000  1000.00000  1.607009717657e-05
1000.00000  1050.00000  2.207218166420e-05
1050.00000  1100.00000  1.761902220563e-05
1100.00000  1150.00000  2.071687226377e-05
1150.00000  1200.00000  2.226579729283e-05
1200.00000  1250.00000  2.245941292147e-05
1250.00000  1300.00000  7.938240773966e-05
1300.00000  1350.00000  2.207218166420e-05
1350.00000  1400.00000  1.936156286333e-05
1400.00000  1450.00000  2.846149740910e-05
1450.00000  1500.00000  2.729980363730e-05
1500.00000  1550.00000  2.904234429500e-05
1550.00000  1600.00000  2.923595992363e-05
1600.00000  1650.00000  2.962319118090e-05
1650.00000  1700.00000  3.388273501083e-05
1700.00000  1750.00000  1.132651427505e-04
1750.00000  1800.00000  3.252742561040e-05
1800.00000  1850.00000  3.194657872450e-05
1850.00000  1900.00000  3.117211620996e-05
1900.00000  1950.00000  3.523804441126e-05
1950.00000  2000.00000  3.291465686766e-05
2000.00000  2050.00000  3.446358189673e-05
2050.00000  2100.00000  3.698058506896e-05
2100.00000  2150.00000  3.543166003990e-05
2150.00000  2200.00000  4.317628518523e-05
2200.00000  2250.00000  4.201459141343e-05
2250.00000  2300.00000  4.375713207113e-05
2300.00000  2350.00000  1.727051407409e-04
2350.00000  2400.00000  4.336990081386e-05
2400.00000  2450.00000  4.472521021430e-05
2450.00000  2500.00000  4.704859775790e-05
2500.00000  2550.00000  4.549967272883e-05
2550.00000  2600.00000  4.433797895703e-05
2600.00000  2650.00000  5.227621973100e-05
2650.00000  2700.00000  4.549967272883e-05
2700.00000  2750.00000  5.150175721646e-05
2750.00000  2800.00000  4.937198530150e-05
2800.00000  2850.00000  5.150175721646e-05
2850.00000  2900.00000  5.343791350280e-05
2900.00000  2950.00000  5.653576356093e-05
2950.00000  3000.00000  1.059077488624e-04
3000.00000  3050.00000  5.556768541776e-05
3050.00000  3100.00000  5.479322290323e-05
3100.00000  3150.00000  5.537406978913e-05
3150.00000  3200.00000  6.950801067936e-05
3200.00000  3250.00000  6.098892301950e-05
3250.00000  3300.00000  6.311869493446e-05
3300.00000  3350.00000  6.737823876440e-05
3350.00000  3400.00000  6.369954182036e-05
3400.00000  3450.00000  6.931439505073e-05
3450.00000  3500.00000  7.028247319389e-05
3500.00000  3550.00000  6.873354816483e-05
3550.00000  3600.00000  7.609094205289e-05
3600.00000  3650.00000  7.802709833923e-05
3650.00000  3700.00000  1.330139368711e-04
3700.00000  3750.00000  7.570371079563e-05
3750.00000  3800.00000  7.279947636613e-05
3800.00000  3850.00000  7.434840139519e-05
3850.00000  3900.00000  8.732064851363e-05
3900.00000  3950.00000  8.131856402599e-05
3950.00000  4000.00000  7.086332007979e-05
4000.00000  4050.00000  9.080572982903e-05
4050.00000  4100.00000  8.461002971276e-05
4100.00000  4150.00000  8.770787977089e-05
4150.00000  4200.00000  8.596533911319e-05
4200.00000  4250.00000  8.499726097003e-05
4250.00000  4300.00000  8.906318917133e-05
4300.00000  4350.00000  8.712703288499e-05
4350.00000  4400.00000  8.906318917133e-05
4400.00000  4450.00000  9.564612054486e-05
4450.00000  4500.00000  9.680781431666e-05
4500.00000  4550.00000  9.525888928759e-05
4550.00000  4600.00000  1.053269019765e-04
4600.00000  4650.00000  9.990566437479e-05
4650.00000  4700.00000  1.095864458065e-04
4700.00000  4750.00000  9.990566437479e-05
4750.00000  4800.00000  1.084247520347e-04
4800.00000  4850.00000  1.041652082047e-04
4850.00000  4900.00000  1.153949146655e-04
4900.00000  4950.00000  1.082311364060e-04
4950.00000  5000.00000  1.084247520347e-04
5000.00000  5050.00000  1.033907456902e-04
5050.00000  5100.00000  1.134587583791e-04
5100.00000  5150.00000  1.111353708355e-04
5150.00000  5200.00000  1.111353708355e-04
5200.00000  5250.00000  1.103609083210e-04
5250.00000  5300.00000  1.192672272381e-04
5300.00000  5350.00000  1.258501586117e-04
5350.00000  5400.00000  1.279799305266e-04
5400.00000  5450.00000  1.454053371036e-04
5450.00000  5500.00000  1.254629273544e-04
5500.00000  5550.00000  1.161693771800e-04
5550.00000  5600.00000  1.210097678958e-04
5600.00000  5650.00000  1.167502240659e-04
5650.00000  5700.00000  1.273990836407e-04
5700.00000  5750.00000  1.270118523835e-04
5750.00000  5800.00000  1.217842304104e-04
5800.00000  5850.00000  1.192672272381e-04
5850.00000  5900.00000  1.428883339314e-04
5900.00000  5950.00000  1.208161522672e-04
5950.00000  6000.00000  1.303033180702e-04
6000.00000  6050.00000  1.308841649561e-04
6050.00000  6100.00000  1.318522430993e-04
6100.00000  6150.00000  1.411457932737e-04
6150.00000  6200.00000  1.332075524997e-04
6200.00000  6250.00000  1.698009063114e-04
6250.00000  6300.00000  2.292409043019e-04
6300.00000  6350.00000  2.207218166420e-04
6350.00000  6400.00000  1.937705211362e-03
6400.00000  6450.00000  1.262373898689e-04
6450.00000  6500.00000  1.304969336989e-04
6500.00000  6550.00000  1.241076179540e-04
6550.00000  6600.00000  1.244948492112e-04
6600.00000  6650.00000  1.310777805848e-04
6650.00000  6700.00000  1.277863148980e-04
6700.00000  6750.00000  1.264310054976e-04
6750.00000  6800.00000  1.212033835245e-04
6800.00000  6850.00000  1.295288555557e-04
6850.00000  6900.00000  1.254629273544e-04
6900.00000  6950.00000  1.347564775288e-04
6950.00000  7000.00000  1.159757615514e-04
7000.00000  7050.00000  1.223650772963e-04
7050.00000  7100.00000  2.948766024085e-04
7100.00000  7150.00000  7.551009516699e-05
7150.00000  7200.00000  7.918879211103e-05
7200.00000  7250.00000  7.783348271059e-05
7250.00000  7300.00000  8.093133276873e-05
7300.00000  7350.00000  8.209302654053e-05
7350.00000  7400.00000  8.306110468369e-05
7400.00000  7450.00000  7.647817331016e-05
7450.00000  7500.00000  1.409521776451e-04
7500.00000  7550.00000  7.241224510886e-05
7550.00000  7600.00000  8.364195156959e-05
7600.00000  7650.00000  7.667178893879e-05
7650.00000  7700.00000  8.248025779779e-05
7700.00000  7750.00000  7.976963899693e-05
7750.00000  7800.00000  7.880156085376e-05
7800.00000  7850.00000  7.763986708196e-05
7850.00000  7900.00000  7.512286390973e-05
7900.00000  7950.00000  7.744625145333e-05
7950.00000  8000.00000  7.996325462556e-05
8000.00000  8050.00000  7.744625145333e-05
8050.00000  8100.00000  7.860794522513e-05
8100.00000  8150.00000  8.248025779779e-05
8150.00000  8200.00000  8.286748905506e-05
8200.00000  8250.00000  7.822071396786e-05
8250.00000  8300.00000  8.325472031233e-05
8300.00000  8350.00000  8.093133276873e-05
8350.00000  8400.00000  7.570371079563e-05
8400.00000  8450.00000  7.938240773966e-05
8450.00000  8500.00000  7.434840139519e-05
8500.00000  8550.00000  8.170579528326e-05
8550.00000  8600.00000  7.686540456743e-05
8600.00000  8650.00000  7.783348271059e-05
8650.00000  8700.00000  7.183139822296e-05
8700.00000  8750.00000  8.248025779779e-05
8750.00000  8800.00000  7.066970445116e-05
8800.00000  8850.00000  7.221862948023e-05
8850.00000  8900.00000  7.899517648239e-05
8900.00000  8950.00000  7.318670762339e-05
8950.00000  9000.00000  6.931439505073e-05
9000.00000  9050.00000  7.647817331016e-05
9050.00000  9100.00000  8.248025779779e-05
9100.00000  9150.00000  7.705902019606e-05
9150.00000  9200.00000  8.054410151146e-05
9200.00000  9250.00000  7.454201702383e-05
9250.00000  9300.00000  7.705902019606e-05
9300.00000  9350.00000  7.454201702383e-05
9350.00000  9400.00000  7.473563265246e-05
9400.00000  9450.00000  7.492924828109e-05
9450.00000  9500.00000  7.899517648239e-05
9500.00000  9550.00000  7.454201702383e-05
9550.00000  9600.00000  7.492924828109e-05
9600.00000  9650.00000  7.299309199476e-05
9650.00000  9700.00000  8.073771714009e-05
9700.00000  9750.00000  8.054410151146e-05
9750.00000  9800.00000  7.938240773966e-05
9800.00000  9850.00000  7.822071396786e-05
9850.00000  9900.00000  7.202501385159e-05
9900.00000  9950.00000  7.163778259433e-05
9950.00000  10000.00000  7.899517648239e-05
