300.00000  350.00000  1.281827166073e-01
350.00000  400.00000  1.020297661644e-01
400.00000  450.00000  8.328710691760e-02
450.00000  500.00000  6.965174430083e-02
500.00000  550.00000  5.925192899331e-02
550.00000  600.00000  5.126100694417e-02
600.00000  650.00000  4.470917967236e-02
650.00000  700.00000  3.935243726321e-02
700.00000  750.00000  3.523809187014e-02
750.00000  800.00000  3.151492738815e-02
800.00000  850.00000  2.844487195171e-02
850.00000  900.00000  2.584995133265e-02
900.00000  950.00000  2.367822282633e-02
950.00000  1000.00000  2.181553327962e-02
1000.00000  1050.00000  2.003760295244e-02
1050.00000  1100.00000  1.843523091371e-02
1100.00000  1150.00000  1.720914149094e-02
1150.00000  1200.00000  1.613465228743e-02
1200.00000  1250.00000  1.495064048196e-02
1250.00000  1300.00000  1.414049535269e-02
1300.00000  1350.00000  1.315841584460e-02
1350.00000  1400.00000  1.230518645647e-02
1400.00000  1450.00000  1.178012221762e-02
1450.00000  1500.00000  1.104869645852e-02
1500.00000  1550.00000  1.048256124393e-02
1550.00000  1600.00000  9.956289035206e-03
1600.00000  1650.00000  9.436861989105e-03
1650.00000  1700.00000  8.979041406611e-03
1700.00000  1750.00000  8.634166007398e-03
1750.00000  1800.00000  8.193659659774e-03
1800.00000  1850.00000  7.825832832942e-03
1850.00000  1900.00000  7.478541493979e-03
1900.00000  1950.00000  7.203124362558e-03
1950.00000  2000.00000  6.853618412159e-03
2000.00000  2050.00000  6.565920253679e-03
2050.00000  2100.00000  6.259095905517e-03
2100.00000  2150.00000  6.080316364068e-03
2150.00000  2200.00000  5.877981410064e-03
2200.00000  2250.00000  5.638602046570e-03
2250.00000  2300.00000  5.492437691737e-03
2300.00000  2350.00000  5.308423614164e-03
2350.00000  2400.00000  5.028375931557e-03
2400.00000  2450.00000  4.922477239213e-03
2450.00000  2500.00000  4.745308324264e-03
2500.00000  2550.00000  4.591493493558e-03
2550.00000  2600.00000  4.423183024356e-03
2600.00000  2650.00000  4.243598169657e-03
2650.00000  2700.00000  4.165281456117e-03
2700.00000  2750.00000  4.015090535036e-03
2750.00000  2800.00000  3.906373246317e-03
2800.00000  2850.00000  3.811547611156e-03
2850.00000  2900.00000  3.750545132486e-03
2900.00000  2950.00000  3.594314362031e-03
2950.00000  3000.00000  3.491435594373e-03
3000.00000  3050.00000  3.381107679155e-03
3050.00000  3100.00000  3.312454724612e-03
3100.00000  3150.00000  3.202529466019e-03
3150.00000  3200.00000  3.060995662372e-03
3200.00000  3250.00000  3.060593005747e-03
3250.00000  3300.00000  2.984289575331e-03
3300.00000  3350.00000  2.882618777548e-03
3350.00000  3400.00000  2.856244768618e-03
3400.00000  3450.00000  2.761217805145e-03
3450.00000  3500.00000  2.678069212107e-03
3500.00000  3550.00000  2.605389691315e-03
3550.00000  3600.00000  2.541971272896e-03
3600.00000  3650.00000  2.480163480976e-03
3650.00000  3700.00000  2.454796113608e-03
3700.00000  3750.00000  2.394196291563e-03
3750.00000  3800.00000  2.355742583887e-03
3800.00000  3850.00000  2.307021132276e-03
3850.00000  3900.00000  2.229912388610e-03
3900.00000  3950.00000  2.193874620683e-03
3950.00000  4000.00000  2.137301364887e-03
4000.00000  4050.00000  2.108108759583e-03
4050.00000  4100.00000  2.085157331964e-03
4100.00000  4150.00000  1.986305130555e-03
4150.00000  4200.00000  1.969192223998e-03
4200.00000  4250.00000  1.917853504325e-03
4250.00000  4300.00000  1.894298091769e-03
4300.00000  4350.00000  1.841751402222e-03
4350.00000  4400.00000  1.811552155355e-03
4400.00000  4450.00000  1.773098447679e-03
4450.00000  4500.00000  1.756388197746e-03
4500.00000  4550.00000  1.706458776260e-03
4550.00000  4600.00000  1.675252887832e-03
4600.00000  4650.00000  1.677870155894e-03
4650.00000  4700.00000  1.616666348911e-03
4700.00000  4750.00000  1.561301062990e-03
4750.00000  4800.00000  1.555059885304e-03
4800.00000  4850.00000  1.608613216413e-03
4850.00000  4900.00000  1.512176954754e-03
4900.00000  4950.00000  1.494862719884e-03
4950.00000  5000.00000  1.470703322391e-03
5000.00000  5050.00000  1.434665554463e-03
5050.00000  5100.00000  1.414331394907e-03
5100.00000  5150.00000  1.379098940229e-03
5150.00000  5200.00000  1.378293626980e-03
5200.00000  5250.00000  1.352926259612e-03
5250.00000  5300.00000  1.342255859052e-03
5300.00000  5350.00000  1.329773503681e-03
5350.00000  5400.00000  1.292527765879e-03
5400.00000  5450.00000  1.255886013015e-03
5450.00000  5500.00000  1.237766464895e-03
5500.00000  5550.00000  1.227901377585e-03
5550.00000  5600.00000  1.187837043409e-03
5600.00000  5650.00000  1.186025088597e-03
5650.00000  5700.00000  1.164482959166e-03
5700.00000  5750.00000  1.154617871856e-03
5750.00000  5800.00000  1.140524889985e-03
5800.00000  5850.00000  1.103077823871e-03
5850.00000  5900.00000  1.103883137121e-03
5900.00000  5950.00000  1.097037974498e-03
5950.00000  6000.00000  1.080126396253e-03
6000.00000  6050.00000  1.039458077139e-03
6050.00000  6100.00000  1.050128477699e-03
6100.00000  6150.00000  1.016909306146e-03
6150.00000  6200.00000  1.008050860398e-03
6200.00000  6250.00000  9.925485803402e-04
6250.00000  6300.00000  9.675838695974e-04
6300.00000  6350.00000  9.726170774084e-04
6350.00000  6400.00000  1.044893941575e-03
6400.00000  6450.00000  9.220836709854e-04
6450.00000  6500.00000  9.267142221716e-04
6500.00000  6550.00000  9.063800626149e-04
6550.00000  6600.00000  8.963136469928e-04
6600.00000  6650.00000  9.063800626149e-04
6650.00000  6700.00000  8.695369814380e-04
6700.00000  6750.00000  8.832273066841e-04
6750.00000  6800.00000  8.854419181210e-04
6800.00000  6850.00000  8.103464575800e-04
6850.00000  6900.00000  8.385324213219e-04
6900.00000  6950.00000  8.401430478215e-04
6950.00000  7000.00000  8.292713189496e-04
7000.00000  7050.00000  7.984680871459e-04
7050.00000  7100.00000  7.855830751496e-04
7100.00000  7150.00000  7.735033764031e-04
7150.00000  7200.00000  7.654502439054e-04
7200.00000  7250.00000  7.720940782160e-04
7250.00000  7300.00000  7.501492921598e-04
7300.00000  7350.00000  7.276005211662e-04
7350.00000  7400.00000  7.366602952261e-04
7400.00000  7450.00000  7.447134277238e-04
7450.00000  7500.00000  7.086756597967e-04
7500.00000  7550.00000  7.137088676077e-04
7550.00000  7600.00000  6.925693948013e-04
7600.00000  7650.00000  6.961933044253e-04
7650.00000  7700.00000  6.706246087451e-04
7700.00000  7750.00000  6.633767894972e-04
7750.00000  7800.00000  6.655914009340e-04
7800.00000  7850.00000  6.368014522548e-04
7850.00000  7900.00000  6.585449099986e-04
7900.00000  7950.00000  6.587462383110e-04
7950.00000  8000.00000  6.186819041350e-04
8000.00000  8050.00000  6.174739342603e-04
8050.00000  8100.00000  6.055955638262e-04
8100.00000  8150.00000  6.192858890723e-04
8150.00000  8200.00000  6.035822807018e-04
8200.00000  8250.00000  6.011663409525e-04
8250.00000  8300.00000  5.836507777700e-04
8300.00000  8350.00000  5.858653892069e-04
8350.00000  8400.00000  5.834494494576e-04
8400.00000  8450.00000  5.808321813959e-04
8450.00000  8500.00000  5.574780971526e-04
8500.00000  8550.00000  5.625113049636e-04
8550.00000  8600.00000  5.687524826493e-04
8600.00000  8650.00000  5.516395760917e-04
8650.00000  8700.00000  5.347279978466e-04
8700.00000  8750.00000  5.379492508457e-04
8750.00000  8800.00000  5.431837869692e-04
8800.00000  8850.00000  5.365399526586e-04
8850.00000  8900.00000  5.290908050982e-04
8900.00000  8950.00000  5.383519074705e-04
8950.00000  9000.00000  5.045287509802e-04
9000.00000  9050.00000  5.003008564190e-04
9050.00000  9100.00000  5.013074979812e-04
9100.00000  9150.00000  4.970796034199e-04
9150.00000  9200.00000  4.904357691093e-04
9200.00000  9250.00000  5.059380491673e-04
9250.00000  9300.00000  4.952676486079e-04
9300.00000  9350.00000  4.807720101121e-04
9350.00000  9400.00000  4.837919347987e-04
9400.00000  9450.00000  4.682896547406e-04
9450.00000  9500.00000  4.505727632457e-04
9500.00000  9550.00000  4.447342421849e-04
9550.00000  9600.00000  4.554046427443e-04
9600.00000  9650.00000  4.602365222430e-04
9650.00000  9700.00000  4.455395554347e-04
9700.00000  9750.00000  4.324532151259e-04
9750.00000  9800.00000  4.415129891858e-04
9800.00000  9850.00000  4.386943928116e-04
9850.00000  9900.00000  4.338625133130e-04
9900.00000  9950.00000  4.366811096872e-04
9950.00000  10000.00000  4.272186790024e-04
