10001.00000  11001.00000  6.902642718710e-04
11001.00000  12001.00000  5.650333655637e-04
12001.00000  13001.00000  4.684156486267e-04
13001.00000  14001.00000  3.946267835861e-04
14001.00000  15001.00000  3.291095211331e-04
15001.00000  16001.00000  2.843965924608e-04
16001.00000  17001.00000  2.463549330083e-04
17001.00000  18001.00000  2.081590245564e-04
18001.00000  19001.00000  1.851566425357e-04
19001.00000  20001.00000  1.648921802525e-04
20001.00000  21001.00000  1.435865372241e-04
21001.00000  22001.00000  1.295884405376e-04
22001.00000  23001.00000  1.137779181092e-04
23001.00000  24001.00000  1.010523756669e-04
24001.00000  25001.00000  9.172031120923e-05
25001.00000  26001.00000  8.287027487435e-05
26001.00000  27001.00000  7.450226666228e-05
27001.00000  28001.00000  6.746465606918e-05
28001.00000  29001.00000  5.984861172870e-05
29001.00000  30001.00000  5.747703336445e-05
30001.00000  31001.00000  5.005380027310e-05
31001.00000  32001.00000  4.646751103936e-05
32001.00000  33001.00000  4.253416155719e-05
33001.00000  34001.00000  3.889002894871e-05
34001.00000  35001.00000  3.540014533953e-05
35001.00000  36001.00000  3.351059509810e-05
36001.00000  37001.00000  2.973149461523e-05
37001.00000  38001.00000  2.722494837659e-05
38001.00000  39001.00000  2.612592425657e-05
39001.00000  40001.00000  2.321447439477e-05
40001.00000  41001.00000  2.145989202772e-05
41001.00000  42001.00000  2.111283177929e-05
42001.00000  43001.00000  1.978243416033e-05
43001.00000  44001.00000  1.847131766627e-05
44001.00000  45001.00000  1.725660679678e-05
45001.00000  46001.00000  1.588764692798e-05
46001.00000  47001.00000  1.473077943322e-05
47001.00000  48001.00000  1.336181956443e-05
48001.00000  49001.00000  1.260985569284e-05
49001.00000  50001.00000  1.237848219389e-05
50001.00000  51001.00000  1.025755845350e-05
51001.00000  52001.00000  1.010330945420e-05
52001.00000  53001.00000  9.814092580512e-06
53001.00000  54001.00000  9.370626707523e-06
54001.00000  55001.00000  8.329445962242e-06
55001.00000  56001.00000  8.020947963641e-06
56001.00000  57001.00000  7.191859592399e-06
57001.00000  58001.00000  7.095453967836e-06
58001.00000  59001.00000  6.671269219759e-06
59001.00000  60001.00000  6.767674844322e-06
60001.00000  61001.00000  6.304927846420e-06
61001.00000  62001.00000  5.649369599391e-06
62001.00000  63001.00000  5.456558350265e-06
63001.00000  64001.00000  5.283028226052e-06
64001.00000  65001.00000  4.415377604985e-06
65001.00000  66001.00000  4.550345479373e-06
66001.00000  67001.00000  4.106879606383e-06
67001.00000  68001.00000  4.184004106034e-06
68001.00000  69001.00000  4.068317356558e-06
69001.00000  70001.00000  3.933349482170e-06
70001.00000  71001.00000  3.586289233743e-06
71001.00000  72001.00000  3.470602484268e-06
72001.00000  73001.00000  3.451321359355e-06
73001.00000  74001.00000  2.795763112327e-06
74001.00000  75001.00000  2.853606487064e-06
75001.00000  76001.00000  2.853606487064e-06
76001.00000  77001.00000  3.027136611278e-06
77001.00000  78001.00000  2.063080365648e-06
78001.00000  79001.00000  2.333016114424e-06
79001.00000  80001.00000  2.005236990910e-06
80001.00000  81001.00000  2.236610489861e-06
81001.00000  82001.00000  2.294453864599e-06
82001.00000  83001.00000  1.889550241435e-06
83001.00000  84001.00000  2.024518115823e-06
84001.00000  85001.00000  1.850987991609e-06
85001.00000  86001.00000  1.407522118620e-06
86001.00000  87001.00000  1.638895617571e-06
87001.00000  88001.00000  1.696738992309e-06
88001.00000  89001.00000  1.446084368445e-06
89001.00000  90001.00000  1.600333367746e-06
90001.00000  91001.00000  1.600333367746e-06
91001.00000  92001.00000  1.465365493357e-06
92001.00000  93001.00000  1.195429744581e-06
93001.00000  94001.00000  1.118305244931e-06
94001.00000  95001.00000  1.137586369843e-06
95001.00000  96001.00000  9.062128708921e-07
96001.00000  97001.00000  9.254939958047e-07
97001.00000  98001.00000  9.062128708921e-07
98001.00000  99001.00000  1.099024120018e-06
99001.00000  100001.00000  6.555582470283e-07
100001.00000  101001.00000  8.869317459795e-07
101001.00000  102001.00000  7.905261214165e-07
102001.00000  103001.00000  6.941204968535e-07
103001.00000  104001.00000  7.134016217661e-07
104001.00000  105001.00000  4.627469979024e-07
105001.00000  106001.00000  7.326827466787e-07
106001.00000  107001.00000  7.134016217661e-07
107001.00000  108001.00000  7.134016217661e-07
108001.00000  109001.00000  5.784337473779e-07
109001.00000  110001.00000  6.362771221157e-07
110001.00000  111001.00000  4.049036231646e-07
111001.00000  112001.00000  5.013092477275e-07
112001.00000  113001.00000  6.362771221157e-07
113001.00000  114001.00000  5.977148722905e-07
114001.00000  115001.00000  3.663413733394e-07
115001.00000  116001.00000  2.892168736890e-07
116001.00000  117001.00000  5.977148722905e-07
117001.00000  118001.00000  5.013092477275e-07
118001.00000  119001.00000  3.470602484268e-07
119001.00000  120001.00000  2.892168736890e-07
120001.00000  121001.00000  2.892168736890e-07
121001.00000  122001.00000  3.856224982520e-07
122001.00000  123001.00000  2.699357487764e-07
123001.00000  124001.00000  1.542489993008e-07
124001.00000  125001.00000  1.542489993008e-07
125001.00000  126001.00000  2.699357487764e-07
126001.00000  127001.00000  1.735301242134e-07
127001.00000  128001.00000  1.735301242134e-07
128001.00000  129001.00000  2.313734989512e-07
129001.00000  130001.00000  2.313734989512e-07
130001.00000  131001.00000  1.542489993008e-07
131001.00000  132001.00000  2.699357487764e-07
132001.00000  133001.00000  1.542489993008e-07
133001.00000  134001.00000  2.699357487764e-07
134001.00000  135001.00000  1.349678743882e-07
135001.00000  136001.00000  2.892168736890e-07
136001.00000  137001.00000  9.640562456299e-08
137001.00000  138001.00000  2.506546238638e-07
138001.00000  139001.00000  2.313734989512e-07
139001.00000  140001.00000  1.349678743882e-07
140001.00000  141001.00000  5.784337473779e-08
141001.00000  142001.00000  1.928112491260e-07
142001.00000  143001.00000  1.542489993008e-07
143001.00000  144001.00000  1.928112491260e-07
144001.00000  145001.00000  1.349678743882e-07
145001.00000  146001.00000  1.928112491260e-07
146001.00000  147001.00000  5.784337473779e-08
147001.00000  148001.00000  7.712449965039e-08
148001.00000  149001.00000  9.640562456299e-08
149001.00000  150001.00000  9.640562456299e-08
150001.00000  151001.00000  3.856224982520e-08
151001.00000  152001.00000  5.784337473779e-08
152001.00000  153001.00000  5.784337473779e-08
153001.00000  154001.00000  9.640562456299e-08
154001.00000  155001.00000  1.349678743882e-07
155001.00000  156001.00000  9.640562456299e-08
156001.00000  157001.00000  7.712449965039e-08
157001.00000  158001.00000  3.856224982520e-08
158001.00000  159001.00000  7.712449965039e-08
159001.00000  160001.00000  7.712449965039e-08
160001.00000  161001.00000  9.640562456299e-08
161001.00000  162001.00000  0.000000000000e+00
162001.00000  163001.00000  5.784337473779e-08
163001.00000  164001.00000  7.712449965039e-08
164001.00000  165001.00000  5.784337473779e-08
165001.00000  166001.00000  3.856224982520e-08
166001.00000  167001.00000  5.784337473779e-08
167001.00000  168001.00000  3.856224982520e-08
168001.00000  169001.00000  1.349678743882e-07
169001.00000  170001.00000  5.784337473779e-08
170001.00000  171001.00000  0.000000000000e+00
171001.00000  172001.00000  5.784337473779e-08
172001.00000  173001.00000  1.928112491260e-08
173001.00000  174001.00000  3.856224982520e-08
174001.00000  175001.00000  5.784337473779e-08
175001.00000  176001.00000  7.712449965039e-08
176001.00000  177001.00000  1.928112491260e-08
177001.00000  178001.00000  5.784337473779e-08
178001.00000  179001.00000  1.928112491260e-08
179001.00000  180001.00000  1.928112491260e-08
180001.00000  181001.00000  3.856224982520e-08
181001.00000  182001.00000  7.712449965039e-08
182001.00000  183001.00000  3.856224982520e-08
183001.00000  184001.00000  1.928112491260e-08
184001.00000  185001.00000  0.000000000000e+00
185001.00000  186001.00000  0.000000000000e+00
186001.00000  187001.00000  1.928112491260e-08
187001.00000  188001.00000  1.928112491260e-08
188001.00000  189001.00000  1.928112491260e-08
189001.00000  190001.00000  3.856224982520e-08
190001.00000  191001.00000  0.000000000000e+00
191001.00000  192001.00000  0.000000000000e+00
192001.00000  193001.00000  1.928112491260e-08
193001.00000  194001.00000  1.928112491260e-08
194001.00000  195001.00000  0.000000000000e+00
195001.00000  196001.00000  0.000000000000e+00
196001.00000  197001.00000  5.784337473779e-08
197001.00000  198001.00000  7.712449965039e-08
198001.00000  199001.00000  3.856224982520e-08
