10001.00000  11001.00000  2.932397569970e-04
11001.00000  12001.00000  2.446064626558e-04
12001.00000  13001.00000  1.991027486453e-04
13001.00000  14001.00000  1.675957466658e-04
14001.00000  15001.00000  1.411575128293e-04
15001.00000  16001.00000  1.221688321726e-04
16001.00000  17001.00000  1.046009425863e-04
17001.00000  18001.00000  9.200582174620e-05
18001.00000  19001.00000  8.083149197653e-05
19001.00000  20001.00000  6.917716522362e-05
20001.00000  21001.00000  6.330200214884e-05
21001.00000  22001.00000  5.541085174448e-05
22001.00000  23001.00000  4.686690544292e-05
23001.00000  24001.00000  4.308452921504e-05
24001.00000  25001.00000  3.993574900503e-05
25001.00000  26001.00000  3.402218617159e-05
26001.00000  27001.00000  3.121900378951e-05
27001.00000  28001.00000  2.885741863200e-05
28001.00000  29001.00000  2.582383769796e-05
29001.00000  30001.00000  2.231025978069e-05
30001.00000  31001.00000  2.232945966002e-05
31001.00000  32001.00000  2.012147353715e-05
32001.00000  33001.00000  1.793268729360e-05
33001.00000  34001.00000  1.553270237744e-05
34001.00000  35001.00000  1.472630744560e-05
35001.00000  36001.00000  1.380471323780e-05
36001.00000  37001.00000  1.326711661657e-05
37001.00000  38001.00000  1.173112627023e-05
38001.00000  39001.00000  1.134712868364e-05
39001.00000  40001.00000  1.048313411382e-05
40001.00000  41001.00000  9.427140750707e-06
41001.00000  42001.00000  8.371147387593e-06
42001.00000  43001.00000  9.004743405461e-06
43001.00000  44001.00000  8.140748835641e-06
44001.00000  45001.00000  6.431959575329e-06
45001.00000  46001.00000  7.007955955210e-06
46001.00000  47001.00000  6.259160661365e-06
47001.00000  48001.00000  5.779163678132e-06
48001.00000  49001.00000  5.587164884838e-06
49001.00000  50001.00000  4.780769953006e-06
50001.00000  51001.00000  4.819169711665e-06
51001.00000  52001.00000  4.415972245748e-06
52001.00000  53001.00000  3.839975865868e-06
53001.00000  54001.00000  3.916775383186e-06
54001.00000  55001.00000  4.223973452455e-06
55001.00000  56001.00000  3.571177555257e-06
56001.00000  57001.00000  3.379178761964e-06
57001.00000  58001.00000  3.091180572024e-06
58001.00000  59001.00000  3.014381054707e-06
59001.00000  60001.00000  3.091180572024e-06
60001.00000  61001.00000  2.860782020072e-06
61001.00000  62001.00000  2.476784433485e-06
62001.00000  63001.00000  1.843188415617e-06
63001.00000  64001.00000  2.342385278180e-06
64001.00000  65001.00000  2.111986726228e-06
65001.00000  66001.00000  1.900788053605e-06
66001.00000  67001.00000  1.670389501653e-06
67001.00000  68001.00000  1.689589380982e-06
68001.00000  69001.00000  1.555190225677e-06
69001.00000  70001.00000  1.478390708359e-06
70001.00000  71001.00000  1.228792277078e-06
71001.00000  72001.00000  1.555190225677e-06
72001.00000  73001.00000  1.036793483784e-06
73001.00000  74001.00000  1.324791673725e-06
74001.00000  75001.00000  1.171192639090e-06
75001.00000  76001.00000  1.343991553054e-06
76001.00000  77001.00000  1.113593001102e-06
77001.00000  78001.00000  1.017593604455e-06
78001.00000  79001.00000  8.831944491497e-07
79001.00000  80001.00000  8.063949318323e-07
80001.00000  81001.00000  9.407940871377e-07
81001.00000  82001.00000  7.487952938443e-07
82001.00000  83001.00000  8.831944491497e-07
83001.00000  84001.00000  7.295954145150e-07
84001.00000  85001.00000  5.951962592096e-07
85001.00000  86001.00000  7.295954145150e-07
86001.00000  87001.00000  6.719957765269e-07
87001.00000  88001.00000  5.567965005509e-07
88001.00000  89001.00000  6.335960178683e-07
89001.00000  90001.00000  3.647977072575e-07
90001.00000  91001.00000  4.031974659162e-07
91001.00000  92001.00000  6.719957765269e-07
92001.00000  93001.00000  5.375966212216e-07
93001.00000  94001.00000  3.647977072575e-07
94001.00000  95001.00000  4.415972245748e-07
95001.00000  96001.00000  4.991968625629e-07
96001.00000  97001.00000  3.071980692695e-07
97001.00000  98001.00000  4.991968625629e-07
98001.00000  99001.00000  2.495984312814e-07
99001.00000  100001.00000  2.495984312814e-07
100001.00000  101001.00000  2.495984312814e-07
101001.00000  102001.00000  3.263979485988e-07
102001.00000  103001.00000  3.263979485988e-07
103001.00000  104001.00000  2.687983106108e-07
104001.00000  105001.00000  1.727989139641e-07
105001.00000  106001.00000  2.303985519521e-07
106001.00000  107001.00000  1.535990346347e-07
107001.00000  108001.00000  1.535990346347e-07
108001.00000  109001.00000  2.687983106108e-07
109001.00000  110001.00000  2.111986726228e-07
110001.00000  111001.00000  2.687983106108e-07
111001.00000  112001.00000  1.535990346347e-07
112001.00000  113001.00000  1.343991553054e-07
113001.00000  114001.00000  1.343991553054e-07
114001.00000  115001.00000  2.687983106108e-07
115001.00000  116001.00000  2.879981899401e-07
116001.00000  117001.00000  1.343991553054e-07
117001.00000  118001.00000  2.111986726228e-07
118001.00000  119001.00000  2.303985519521e-07
119001.00000  120001.00000  1.727989139641e-07
120001.00000  121001.00000  1.343991553054e-07
121001.00000  122001.00000  1.151992759760e-07
122001.00000  123001.00000  7.679951731736e-08
123001.00000  124001.00000  1.535990346347e-07
124001.00000  125001.00000  2.111986726228e-07
125001.00000  126001.00000  7.679951731736e-08
126001.00000  127001.00000  7.679951731736e-08
127001.00000  128001.00000  5.759963798802e-08
128001.00000  129001.00000  3.839975865868e-08
129001.00000  130001.00000  7.679951731736e-08
130001.00000  131001.00000  1.919987932934e-08
131001.00000  132001.00000  7.679951731736e-08
132001.00000  133001.00000  7.679951731736e-08
133001.00000  134001.00000  0.000000000000e+00
134001.00000  135001.00000  1.151992759760e-07
135001.00000  136001.00000  5.759963798802e-08
136001.00000  137001.00000  5.759963798802e-08
137001.00000  138001.00000  7.679951731736e-08
138001.00000  139001.00000  1.919987932934e-08
139001.00000  140001.00000  3.839975865868e-08
140001.00000  141001.00000  5.759963798802e-08
141001.00000  142001.00000  5.759963798802e-08
142001.00000  143001.00000  5.759963798802e-08
143001.00000  144001.00000  5.759963798802e-08
144001.00000  145001.00000  5.759963798802e-08
145001.00000  146001.00000  7.679951731736e-08
146001.00000  147001.00000  0.000000000000e+00
147001.00000  148001.00000  7.679951731736e-08
148001.00000  149001.00000  3.839975865868e-08
149001.00000  150001.00000  7.679951731736e-08
150001.00000  151001.00000  3.839975865868e-08
151001.00000  152001.00000  1.919987932934e-08
152001.00000  153001.00000  1.919987932934e-08
153001.00000  154001.00000  0.000000000000e+00
154001.00000  155001.00000  5.759963798802e-08
155001.00000  156001.00000  3.839975865868e-08
156001.00000  157001.00000  0.000000000000e+00
157001.00000  158001.00000  3.839975865868e-08
158001.00000  159001.00000  1.919987932934e-08
159001.00000  160001.00000  7.679951731736e-08
160001.00000  161001.00000  0.000000000000e+00
161001.00000  162001.00000  1.919987932934e-08
162001.00000  163001.00000  3.839975865868e-08
163001.00000  164001.00000  1.919987932934e-08
164001.00000  165001.00000  1.919987932934e-08
165001.00000  166001.00000  0.000000000000e+00
166001.00000  167001.00000  0.000000000000e+00
167001.00000  168001.00000  3.839975865868e-08
168001.00000  169001.00000  1.919987932934e-08
169001.00000  170001.00000  3.839975865868e-08
170001.00000  171001.00000  1.919987932934e-08
171001.00000  172001.00000  1.919987932934e-08
172001.00000  173001.00000  3.839975865868e-08
173001.00000  174001.00000  0.000000000000e+00
174001.00000  175001.00000  0.000000000000e+00
175001.00000  176001.00000  0.000000000000e+00
176001.00000  177001.00000  0.000000000000e+00
177001.00000  178001.00000  3.839975865868e-08
178001.00000  179001.00000  1.919987932934e-08
179001.00000  180001.00000  1.919987932934e-08
180001.00000  181001.00000  1.919987932934e-08
181001.00000  182001.00000  1.919987932934e-08
182001.00000  183001.00000  0.000000000000e+00
183001.00000  184001.00000  1.919987932934e-08
184001.00000  185001.00000  0.000000000000e+00
185001.00000  186001.00000  3.839975865868e-08
186001.00000  187001.00000  1.919987932934e-08
187001.00000  188001.00000  0.000000000000e+00
188001.00000  189001.00000  1.919987932934e-08
189001.00000  190001.00000  0.000000000000e+00
190001.00000  191001.00000  0.000000000000e+00
191001.00000  192001.00000  0.000000000000e+00
192001.00000  193001.00000  0.000000000000e+00
193001.00000  194001.00000  0.000000000000e+00
194001.00000  195001.00000  0.000000000000e+00
195001.00000  196001.00000  0.000000000000e+00
196001.00000  197001.00000  0.000000000000e+00
197001.00000  198001.00000  1.919987932934e-08
198001.00000  199001.00000  0.000000000000e+00
