300.00000  350.00000  1.335543769476e-05
350.00000  400.00000  2.300103158542e-05
400.00000  450.00000  9.645593890659e-06
450.00000  500.00000  8.161656369019e-06
500.00000  550.00000  9.868184518905e-05
550.00000  600.00000  9.645593890659e-06
600.00000  650.00000  1.929118778132e-05
650.00000  700.00000  1.261346893394e-05
700.00000  750.00000  1.483937521640e-05
750.00000  800.00000  8.903625129839e-06
800.00000  850.00000  4.748600069248e-05
850.00000  900.00000  7.419687608199e-06
900.00000  950.00000  8.903625129839e-06
950.00000  1000.00000  1.335543769476e-05
1000.00000  1050.00000  1.261346893394e-05
1050.00000  1100.00000  1.038756265148e-05
1100.00000  1150.00000  1.038756265148e-05
1150.00000  1200.00000  8.903625129839e-06
1200.00000  1250.00000  1.187150017312e-05
1250.00000  1300.00000  2.448496910706e-05
1300.00000  1350.00000  8.161656369019e-06
1350.00000  1400.00000  8.161656369019e-06
1400.00000  1450.00000  1.261346893394e-05
1450.00000  1500.00000  2.448496910706e-05
1500.00000  1550.00000  9.645593890659e-06
1550.00000  1600.00000  1.483937521640e-05
1600.00000  1650.00000  1.261346893394e-05
1650.00000  1700.00000  1.187150017312e-05
1700.00000  1750.00000  4.006631308428e-05
1750.00000  1800.00000  1.335543769476e-05
1800.00000  1850.00000  1.335543769476e-05
1850.00000  1900.00000  1.335543769476e-05
1900.00000  1950.00000  1.112953141230e-05
1950.00000  2000.00000  1.409740645558e-05
2000.00000  2050.00000  9.645593890659e-06
2050.00000  2100.00000  1.558134397722e-05
2100.00000  2150.00000  1.632331273804e-05
2150.00000  2200.00000  1.409740645558e-05
2200.00000  2250.00000  1.409740645558e-05
2250.00000  2300.00000  1.261346893394e-05
2300.00000  2350.00000  3.561450051936e-05
2350.00000  2400.00000  1.483937521640e-05
2400.00000  2450.00000  1.261346893394e-05
2450.00000  2500.00000  1.038756265148e-05
2500.00000  2550.00000  1.335543769476e-05
2550.00000  2600.00000  1.038756265148e-05
2600.00000  2650.00000  1.038756265148e-05
2650.00000  2700.00000  1.558134397722e-05
2700.00000  2750.00000  1.335543769476e-05
2750.00000  2800.00000  6.677718847379e-06
2800.00000  2850.00000  5.935750086559e-06
2850.00000  2900.00000  1.038756265148e-05
2900.00000  2950.00000  1.112953141230e-05
2950.00000  3000.00000  1.706528149886e-05
3000.00000  3050.00000  1.112953141230e-05
3050.00000  3100.00000  1.038756265148e-05
3100.00000  3150.00000  9.645593890659e-06
3150.00000  3200.00000  1.335543769476e-05
3200.00000  3250.00000  1.038756265148e-05
3250.00000  3300.00000  1.335543769476e-05
3300.00000  3350.00000  8.161656369019e-06
3350.00000  3400.00000  5.935750086559e-06
3400.00000  3450.00000  1.112953141230e-05
3450.00000  3500.00000  5.193781325740e-06
3500.00000  3550.00000  6.677718847379e-06
3550.00000  3600.00000  5.935750086559e-06
3600.00000  3650.00000  6.677718847379e-06
3650.00000  3700.00000  9.645593890659e-06
3700.00000  3750.00000  7.419687608199e-06
3750.00000  3800.00000  1.261346893394e-05
3800.00000  3850.00000  8.903625129839e-06
3850.00000  3900.00000  5.935750086559e-06
3900.00000  3950.00000  6.677718847379e-06
3950.00000  4000.00000  7.419687608199e-06
4000.00000  4050.00000  2.967875043280e-06
4050.00000  4100.00000  1.038756265148e-05
4100.00000  4150.00000  5.193781325740e-06
4150.00000  4200.00000  9.645593890659e-06
4200.00000  4250.00000  2.967875043280e-06
4250.00000  4300.00000  4.451812564920e-06
4300.00000  4350.00000  7.419687608199e-06
4350.00000  4400.00000  1.261346893394e-05
4400.00000  4450.00000  1.483937521640e-06
4450.00000  4500.00000  6.677718847379e-06
4500.00000  4550.00000  8.161656369019e-06
4550.00000  4600.00000  4.451812564920e-06
4600.00000  4650.00000  6.677718847379e-06
4650.00000  4700.00000  5.193781325740e-06
4700.00000  4750.00000  1.483937521640e-06
4750.00000  4800.00000  3.709843804100e-06
4800.00000  4850.00000  2.967875043280e-06
4850.00000  4900.00000  8.161656369019e-06
4900.00000  4950.00000  2.225906282460e-06
4950.00000  5000.00000  4.451812564920e-06
5000.00000  5050.00000  5.935750086559e-06
5050.00000  5100.00000  5.935750086559e-06
5100.00000  5150.00000  3.709843804100e-06
5150.00000  5200.00000  3.709843804100e-06
5200.00000  5250.00000  5.193781325740e-06
5250.00000  5300.00000  5.193781325740e-06
5300.00000  5350.00000  3.709843804100e-06
5350.00000  5400.00000  5.935750086559e-06
5400.00000  5450.00000  1.483937521640e-06
5450.00000  5500.00000  5.193781325740e-06
5500.00000  5550.00000  4.451812564920e-06
5550.00000  5600.00000  5.193781325740e-06
5600.00000  5650.00000  2.225906282460e-06
5650.00000  5700.00000  2.225906282460e-06
5700.00000  5750.00000  2.967875043280e-06
5750.00000  5800.00000  4.451812564920e-06
5800.00000  5850.00000  3.709843804100e-06
5850.00000  5900.00000  2.225906282460e-06
5900.00000  5950.00000  3.709843804100e-06
5950.00000  6000.00000  1.483937521640e-06
6000.00000  6050.00000  2.225906282460e-06
6050.00000  6100.00000  1.483937521640e-06
6100.00000  6150.00000  3.709843804100e-06
6150.00000  6200.00000  7.419687608199e-07
6200.00000  6250.00000  1.483937521640e-06
6250.00000  6300.00000  7.419687608199e-07
6300.00000  6350.00000  1.483937521640e-06
6350.00000  6400.00000  3.042071919362e-05
6400.00000  6450.00000  2.225906282460e-06
6450.00000  6500.00000  2.225906282460e-06
6500.00000  6550.00000  2.967875043280e-06
6550.00000  6600.00000  2.967875043280e-06
6600.00000  6650.00000  1.483937521640e-06
6650.00000  6700.00000  7.419687608199e-07
6700.00000  6750.00000  7.419687608199e-07
6750.00000  6800.00000  2.967875043280e-06
6800.00000  6850.00000  2.225906282460e-06
6850.00000  6900.00000  5.935750086559e-06
6900.00000  6950.00000  7.419687608199e-07
6950.00000  7000.00000  1.483937521640e-06
7000.00000  7050.00000  1.483937521640e-06
7050.00000  7100.00000  5.193781325740e-06
7100.00000  7150.00000  1.483937521640e-06
7150.00000  7200.00000  7.419687608199e-07
7200.00000  7250.00000  1.483937521640e-06
7250.00000  7300.00000  3.709843804100e-06
7300.00000  7350.00000  7.419687608199e-07
7350.00000  7400.00000  0.000000000000e+00
7400.00000  7450.00000  1.483937521640e-06
7450.00000  7500.00000  1.483937521640e-06
7500.00000  7550.00000  4.451812564920e-06
7550.00000  7600.00000  1.483937521640e-06
7600.00000  7650.00000  2.225906282460e-06
7650.00000  7700.00000  7.419687608199e-07
7700.00000  7750.00000  0.000000000000e+00
7750.00000  7800.00000  1.483937521640e-06
7800.00000  7850.00000  7.419687608199e-07
7850.00000  7900.00000  3.709843804100e-06
7900.00000  7950.00000  1.483937521640e-06
7950.00000  8000.00000  3.709843804100e-06
8000.00000  8050.00000  0.000000000000e+00
8050.00000  8100.00000  7.419687608199e-07
8100.00000  8150.00000  7.419687608199e-07
8150.00000  8200.00000  7.419687608199e-07
8200.00000  8250.00000  2.225906282460e-06
8250.00000  8300.00000  2.967875043280e-06
8300.00000  8350.00000  0.000000000000e+00
8350.00000  8400.00000  7.419687608199e-07
8400.00000  8450.00000  1.483937521640e-06
8450.00000  8500.00000  0.000000000000e+00
8500.00000  8550.00000  0.000000000000e+00
8550.00000  8600.00000  0.000000000000e+00
8600.00000  8650.00000  1.483937521640e-06
8650.00000  8700.00000  2.225906282460e-06
8700.00000  8750.00000  1.483937521640e-06
8750.00000  8800.00000  2.967875043280e-06
8800.00000  8850.00000  0.000000000000e+00
8850.00000  8900.00000  7.419687608199e-07
8900.00000  8950.00000  7.419687608199e-07
8950.00000  9000.00000  7.419687608199e-07
9000.00000  9050.00000  0.000000000000e+00
9050.00000  9100.00000  0.000000000000e+00
9100.00000  9150.00000  1.483937521640e-06
9150.00000  9200.00000  0.000000000000e+00
9200.00000  9250.00000  7.419687608199e-07
9250.00000  9300.00000  7.419687608199e-07
9300.00000  9350.00000  7.419687608199e-07
9350.00000  9400.00000  0.000000000000e+00
9400.00000  9450.00000  7.419687608199e-07
9450.00000  9500.00000  0.000000000000e+00
9500.00000  9550.00000  7.419687608199e-07
9550.00000  9600.00000  0.000000000000e+00
9600.00000  9650.00000  7.419687608199e-07
9650.00000  9700.00000  2.225906282460e-06
9700.00000  9750.00000  7.419687608199e-07
9750.00000  9800.00000  1.483937521640e-06
9800.00000  9850.00000  0.000000000000e+00
9850.00000  9900.00000  7.419687608199e-07
9900.00000  9950.00000  2.225906282460e-06
9950.00000  10000.00000  0.000000000000e+00
