300.00000  350.00000  1.342056451296e-05
350.00000  400.00000  2.003069330293e-05
400.00000  450.00000  1.642516850840e-05
450.00000  500.00000  2.063161410202e-05
500.00000  550.00000  1.235893776791e-04
550.00000  600.00000  1.402148531205e-05
600.00000  650.00000  4.246506980222e-05
650.00000  700.00000  2.103222796808e-05
700.00000  750.00000  3.665616874437e-05
750.00000  800.00000  3.184880235166e-05
800.00000  850.00000  8.272676334111e-05
850.00000  900.00000  4.026169353889e-05
900.00000  950.00000  4.126322820404e-05
950.00000  1000.00000  5.087796098945e-05
1000.00000  1050.00000  5.848962444456e-05
1050.00000  1100.00000  6.950650576117e-05
1100.00000  1150.00000  7.832001081446e-05
1150.00000  1200.00000  9.093934759531e-05
1200.00000  1250.00000  1.233890707461e-04
1250.00000  1300.00000  1.686584376107e-04
1300.00000  1350.00000  1.312010411342e-04
1350.00000  1400.00000  1.730651901373e-04
1400.00000  1450.00000  1.866860615833e-04
1450.00000  1500.00000  2.399677057691e-04
1500.00000  1550.00000  2.618011614693e-04
1550.00000  1600.00000  3.086729837982e-04
1600.00000  1650.00000  3.585494101225e-04
1650.00000  1700.00000  4.004135591256e-04
1700.00000  1750.00000  4.797351046052e-04
1750.00000  1800.00000  4.901510651227e-04
1800.00000  1850.00000  4.785332630070e-04
1850.00000  1900.00000  5.025700949706e-04
1900.00000  1950.00000  5.618609471472e-04
1950.00000  2000.00000  6.261594726497e-04
2000.00000  2050.00000  6.548033640728e-04
2050.00000  2100.00000  6.868524733575e-04
2100.00000  2150.00000  7.134932954504e-04
2150.00000  2200.00000  7.529537612572e-04
2200.00000  2250.00000  7.565592860517e-04
2250.00000  2300.00000  8.034311083806e-04
2300.00000  2350.00000  8.539084555040e-04
2350.00000  2400.00000  8.466974059149e-04
2400.00000  2450.00000  8.615201189591e-04
2450.00000  2500.00000  8.386851285938e-04
2500.00000  2550.00000  7.815976526804e-04
2550.00000  2600.00000  7.817979596134e-04
2600.00000  2650.00000  8.078378609072e-04
2650.00000  2700.00000  8.220596531523e-04
2700.00000  2750.00000  8.036314153136e-04
2750.00000  2800.00000  7.759890585556e-04
2800.00000  2850.00000  7.827994942786e-04
2850.00000  2900.00000  7.673758604353e-04
2900.00000  2950.00000  7.589629692481e-04
2950.00000  3000.00000  7.689783158996e-04
3000.00000  3050.00000  7.309199986240e-04
3050.00000  3100.00000  7.479460879315e-04
3100.00000  3150.00000  7.295178500928e-04
3150.00000  3200.00000  7.174994341110e-04
3200.00000  3250.00000  7.136936023835e-04
3250.00000  3300.00000  6.610128789968e-04
3300.00000  3350.00000  6.536015224747e-04
3350.00000  3400.00000  6.351732846360e-04
3400.00000  3450.00000  6.095339972082e-04
3450.00000  3500.00000  5.929085217668e-04
3500.00000  3550.00000  5.818916404502e-04
3550.00000  3600.00000  5.562523530224e-04
3600.00000  3650.00000  5.552508183573e-04
3650.00000  3700.00000  5.542492836921e-04
3700.00000  3750.00000  5.179937288138e-04
3750.00000  3800.00000  5.077780752293e-04
3800.00000  3850.00000  5.025700949706e-04
3850.00000  3900.00000  4.883483027255e-04
3900.00000  3950.00000  4.629093222308e-04
3950.00000  4000.00000  4.400743318654e-04
4000.00000  4050.00000  4.414764803966e-04
4050.00000  4100.00000  4.182408761652e-04
4100.00000  4150.00000  4.116307473753e-04
4150.00000  4200.00000  4.046200047192e-04
4200.00000  4250.00000  3.795816380906e-04
4250.00000  4300.00000  3.693659845061e-04
4300.00000  4350.00000  3.611534002519e-04
4350.00000  4400.00000  3.503368258683e-04
4400.00000  4450.00000  3.437266970783e-04
4450.00000  4500.00000  3.281027563020e-04
4500.00000  4550.00000  3.154834195212e-04
4550.00000  4600.00000  3.082723699321e-04
4600.00000  4650.00000  3.120782016597e-04
4650.00000  4700.00000  2.882416766292e-04
4700.00000  4750.00000  2.742201913171e-04
4750.00000  4800.00000  2.828333894374e-04
4800.00000  4850.00000  2.784266369108e-04
4850.00000  4900.00000  2.561925673445e-04
4900.00000  4950.00000  2.433729236306e-04
4950.00000  5000.00000  2.547904188133e-04
5000.00000  5050.00000  2.365624879076e-04
5050.00000  5100.00000  2.361618740416e-04
5100.00000  5150.00000  2.323560423140e-04
5150.00000  5200.00000  2.243437649928e-04
5200.00000  5250.00000  2.187351708680e-04
5250.00000  5300.00000  2.135271906093e-04
5300.00000  5350.00000  1.882885170476e-04
5350.00000  5400.00000  1.944980319715e-04
5400.00000  5450.00000  1.890897447797e-04
5450.00000  5500.00000  1.926952695742e-04
5500.00000  5550.00000  1.830805367888e-04
5550.00000  5600.00000  1.804765466594e-04
5600.00000  5650.00000  1.686584376107e-04
5650.00000  5700.00000  1.682578237446e-04
5700.00000  5750.00000  1.620483088207e-04
5750.00000  5800.00000  1.672562890795e-04
5800.00000  5850.00000  1.470252888435e-04
5850.00000  5900.00000  1.448219125802e-04
5900.00000  5950.00000  1.388127045893e-04
5950.00000  6000.00000  1.372102491251e-04
6000.00000  6050.00000  1.386123976563e-04
6050.00000  6100.00000  1.277958232727e-04
6100.00000  6150.00000  1.340053381966e-04
6150.00000  6200.00000  1.191826251524e-04
6200.00000  6250.00000  1.197835459515e-04
6250.00000  6300.00000  1.157774072909e-04
6300.00000  6350.00000  1.183813974203e-04
6350.00000  6400.00000  1.944980319715e-04
6400.00000  6450.00000  1.147758726258e-04
6450.00000  6500.00000  1.073645161037e-04
6500.00000  6550.00000  1.065632883716e-04
6550.00000  6600.00000  9.394395159075e-05
6600.00000  6650.00000  9.895162491648e-05
6650.00000  6700.00000  9.975285264860e-05
6700.00000  6750.00000  8.813505053290e-05
6750.00000  6800.00000  8.953719906411e-05
6800.00000  6850.00000  8.973750599714e-05
6850.00000  6900.00000  9.414425852378e-05
6900.00000  6950.00000  8.593167426958e-05
6950.00000  7000.00000  8.352799107323e-05
7000.00000  7050.00000  7.872062468052e-05
7050.00000  7100.00000  8.873597133199e-05
7100.00000  7150.00000  6.830466416300e-05
7150.00000  7200.00000  7.511509988599e-05
7200.00000  7250.00000  6.570067403362e-05
7250.00000  7300.00000  6.990711962723e-05
7300.00000  7350.00000  7.030773349329e-05
7350.00000  7400.00000  7.170988202450e-05
7400.00000  7450.00000  5.909054524365e-05
7450.00000  7500.00000  6.850497109603e-05
7500.00000  7550.00000  6.249576310515e-05
7550.00000  7600.00000  6.229545617212e-05
7600.00000  7650.00000  6.550036710059e-05
7650.00000  7700.00000  5.949115910971e-05
7700.00000  7750.00000  5.328164418580e-05
7750.00000  7800.00000  5.548502044912e-05
7800.00000  7850.00000  5.548502044912e-05
7850.00000  7900.00000  5.648655511427e-05
7900.00000  7950.00000  5.889023831062e-05
7950.00000  8000.00000  5.187949565459e-05
8000.00000  8050.00000  4.907519859218e-05
8050.00000  8100.00000  4.727243619492e-05
8100.00000  8150.00000  4.707212926189e-05
8150.00000  8200.00000  4.627090152977e-05
8200.00000  8250.00000  4.987642632430e-05
8250.00000  8300.00000  4.446813913251e-05
8300.00000  8350.00000  4.947581245824e-05
8350.00000  8400.00000  4.687182232886e-05
8400.00000  8450.00000  4.667151539583e-05
8450.00000  8500.00000  4.026169353889e-05
8500.00000  8550.00000  4.386721833342e-05
8550.00000  8600.00000  3.825862420860e-05
8600.00000  8650.00000  4.406752526645e-05
8650.00000  8700.00000  3.765770340951e-05
8700.00000  8750.00000  3.845893114163e-05
8750.00000  8800.00000  4.046200047192e-05
8800.00000  8850.00000  4.186414900313e-05
8850.00000  8900.00000  3.926015887375e-05
8900.00000  8950.00000  3.525402021316e-05
8950.00000  9000.00000  3.825862420860e-05
9000.00000  9050.00000  3.625555487831e-05
9050.00000  9100.00000  3.285033701681e-05
9100.00000  9150.00000  3.325095088287e-05
9150.00000  9200.00000  3.305064394984e-05
9200.00000  9250.00000  3.645586181134e-05
9250.00000  9300.00000  3.345125781590e-05
9300.00000  9350.00000  3.084726768652e-05
9350.00000  9400.00000  3.204910928469e-05
9400.00000  9450.00000  3.164849541863e-05
9450.00000  9500.00000  2.944511915531e-05
9500.00000  9550.00000  2.864389142319e-05
9550.00000  9600.00000  2.664082209290e-05
9600.00000  9650.00000  2.824327755713e-05
9650.00000  9700.00000  2.603990129381e-05
9700.00000  9750.00000  2.543898049472e-05
9750.00000  9800.00000  2.924481222228e-05
9800.00000  9850.00000  2.624020822684e-05
9850.00000  9900.00000  2.724174289199e-05
9900.00000  9950.00000  2.323560423140e-05
9950.00000  10000.00000  2.383652503049e-05
