300.00000  350.00000  0.000000000000e+00
350.00000  400.00000  0.000000000000e+00
400.00000  450.00000  0.000000000000e+00
450.00000  500.00000  0.000000000000e+00
500.00000  550.00000  2.718604362543e-06
550.00000  600.00000  0.000000000000e+00
600.00000  650.00000  5.825580776877e-07
650.00000  700.00000  0.000000000000e+00
700.00000  750.00000  5.825580776877e-07
750.00000  800.00000  0.000000000000e+00
800.00000  850.00000  5.631394750981e-06
850.00000  900.00000  0.000000000000e+00
900.00000  950.00000  1.941860258959e-07
950.00000  1000.00000  1.941860258959e-07
1000.00000  1050.00000  1.359302181271e-06
1050.00000  1100.00000  1.941860258959e-07
1100.00000  1150.00000  9.709301294795e-07
1150.00000  1200.00000  1.941860258959e-06
1200.00000  1250.00000  5.243022699189e-06
1250.00000  1300.00000  2.757441567722e-05
1300.00000  1350.00000  9.903487320691e-06
1350.00000  1400.00000  2.058371874497e-05
1400.00000  1450.00000  3.806046107560e-05
1450.00000  1500.00000  6.369301649386e-05
1500.00000  1550.00000  8.427673523882e-05
1550.00000  1600.00000  1.322406836351e-04
1600.00000  1650.00000  1.774860276689e-04
1650.00000  1700.00000  2.260325341428e-04
1700.00000  1750.00000  3.573022876485e-04
1750.00000  1800.00000  3.668174029174e-04
1800.00000  1850.00000  4.211894901682e-04
1850.00000  1900.00000  4.159464674690e-04
1900.00000  1950.00000  5.103208760544e-04
1950.00000  2000.00000  5.984813318112e-04
2000.00000  2050.00000  6.732429517811e-04
2050.00000  2100.00000  7.606266634343e-04
2100.00000  2150.00000  8.216010755656e-04
2150.00000  2200.00000  9.004406020793e-04
2200.00000  2250.00000  9.458801321390e-04
2250.00000  2300.00000  1.022001054290e-03
2300.00000  2350.00000  1.219876614678e-03
2350.00000  2400.00000  1.131327786870e-03
2400.00000  2450.00000  1.157931272417e-03
2450.00000  2500.00000  1.142978948423e-03
2500.00000  2550.00000  1.098316162467e-03
2550.00000  2600.00000  1.137930111750e-03
2600.00000  2650.00000  1.142590576372e-03
2650.00000  2700.00000  1.198321965804e-03
2700.00000  2750.00000  1.210361499409e-03
2750.00000  2800.00000  1.235605682776e-03
2800.00000  2850.00000  1.198127779778e-03
2850.00000  2900.00000  1.215021964031e-03
2900.00000  2950.00000  1.190554524768e-03
2950.00000  3000.00000  1.262209168323e-03
3000.00000  3050.00000  1.226673125584e-03
3050.00000  3100.00000  1.191913826949e-03
3100.00000  3150.00000  1.197739407726e-03
3150.00000  3200.00000  1.168028945764e-03
3200.00000  3250.00000  1.154435923951e-03
3250.00000  3300.00000  1.121424299549e-03
3300.00000  3350.00000  1.103753371192e-03
3350.00000  3400.00000  1.108413835814e-03
3400.00000  3450.00000  1.047439423683e-03
3450.00000  3500.00000  1.049381283941e-03
3500.00000  3550.00000  1.025496402756e-03
3550.00000  3600.00000  1.025108030704e-03
3600.00000  3650.00000  9.862708255253e-04
3650.00000  3700.00000  1.017728961720e-03
3700.00000  3750.00000  9.635510604955e-04
3750.00000  3800.00000  9.278208317306e-04
3800.00000  3850.00000  9.138394378661e-04
3850.00000  3900.00000  9.019940902865e-04
3900.00000  3950.00000  8.724778143503e-04
3950.00000  4000.00000  8.336406091711e-04
4000.00000  4050.00000  8.379127017408e-04
4050.00000  4100.00000  7.893661952669e-04
4100.00000  4150.00000  7.744138712729e-04
4150.00000  4200.00000  7.951917760437e-04
4200.00000  4250.00000  7.433441071295e-04
4250.00000  4300.00000  7.204301560738e-04
4300.00000  4350.00000  6.944092286038e-04
4350.00000  4400.00000  7.076138783647e-04
4400.00000  4450.00000  6.815929508946e-04
4450.00000  4500.00000  6.419790016119e-04
4500.00000  4550.00000  6.516883029067e-04
4550.00000  4600.00000  6.206185387633e-04
4600.00000  4650.00000  5.996464479666e-04
4650.00000  4700.00000  5.998406339925e-04
4700.00000  4750.00000  5.730429624188e-04
4750.00000  4800.00000  5.744022646001e-04
4800.00000  4850.00000  5.425557563532e-04
4850.00000  4900.00000  5.507115694408e-04
4900.00000  4950.00000  5.097383179768e-04
4950.00000  5000.00000  5.027476210445e-04
5000.00000  5050.00000  5.143987825983e-04
5050.00000  5100.00000  4.705127407458e-04
5100.00000  5150.00000  4.895429712836e-04
5150.00000  5200.00000  4.608034394510e-04
5200.00000  5250.00000  4.679883224091e-04
5250.00000  5300.00000  4.662406481761e-04
5300.00000  5350.00000  4.359476281363e-04
5350.00000  5400.00000  4.239080945308e-04
5400.00000  5450.00000  4.433266971204e-04
5450.00000  5500.00000  4.027418177081e-04
5500.00000  5550.00000  3.840999592221e-04
5550.00000  5600.00000  3.905080980767e-04
5600.00000  5650.00000  3.656522867620e-04
5650.00000  5700.00000  3.747790299791e-04
5700.00000  5750.00000  3.623511243218e-04
5750.00000  5800.00000  3.646813566325e-04
5800.00000  5850.00000  3.518650789234e-04
5850.00000  5900.00000  3.448743819911e-04
5900.00000  5950.00000  3.475929863537e-04
5950.00000  6000.00000  3.155522920808e-04
6000.00000  6050.00000  3.126395016924e-04
6050.00000  6100.00000  3.023476423199e-04
6100.00000  6150.00000  2.963278755172e-04
6150.00000  6200.00000  2.978813637243e-04
6200.00000  6250.00000  2.955511314136e-04
6250.00000  6300.00000  3.192418265729e-04
6300.00000  6350.00000  2.951627593618e-04
6350.00000  6400.00000  1.212691731720e-03
6400.00000  6450.00000  2.751615986945e-04
6450.00000  6500.00000  2.658406694515e-04
6500.00000  6550.00000  2.637046231666e-04
6550.00000  6600.00000  2.580732284157e-04
6600.00000  6650.00000  2.413732301886e-04
6650.00000  6700.00000  2.468104389137e-04
6700.00000  6750.00000  2.304988127384e-04
6750.00000  6800.00000  2.343825332564e-04
6800.00000  6850.00000  2.209836974695e-04
6850.00000  6900.00000  2.136046284855e-04
6900.00000  6950.00000  2.124395123301e-04
6950.00000  7000.00000  2.163232328480e-04
7000.00000  7050.00000  2.019534669317e-04
7050.00000  7100.00000  3.013767121904e-04
7100.00000  7150.00000  1.701069586848e-04
7150.00000  7200.00000  1.807871901091e-04
7200.00000  7250.00000  1.763209115135e-04
7250.00000  7300.00000  1.730197490733e-04
7300.00000  7350.00000  1.734081211250e-04
7350.00000  7400.00000  1.693302145812e-04
7400.00000  7450.00000  1.648639359856e-04
7450.00000  7500.00000  1.937976538441e-04
7500.00000  7550.00000  1.623395176490e-04
7550.00000  7600.00000  1.534069604578e-04
7600.00000  7650.00000  1.487464958363e-04
7650.00000  7700.00000  1.563197508462e-04
7700.00000  7750.00000  1.411732408263e-04
7750.00000  7800.00000  1.493290539140e-04
7800.00000  7850.00000  1.450569613442e-04
7850.00000  7900.00000  1.429209150594e-04
7900.00000  7950.00000  1.442802172407e-04
7950.00000  8000.00000  1.475813796809e-04
8000.00000  8050.00000  1.380662644120e-04
8050.00000  8100.00000  1.435034731371e-04
8100.00000  8150.00000  1.281627770913e-04
8150.00000  8200.00000  1.242790565734e-04
8200.00000  8250.00000  1.466104495514e-04
8250.00000  8300.00000  1.324348696610e-04
8300.00000  8350.00000  1.304930094020e-04
8350.00000  8400.00000  1.235023124698e-04
8400.00000  8450.00000  1.240848705475e-04
8450.00000  8500.00000  1.196185919519e-04
8500.00000  8550.00000  1.231139404180e-04
8550.00000  8600.00000  1.219488242626e-04
8600.00000  8650.00000  1.229197543921e-04
8650.00000  8700.00000  1.149581273304e-04
8700.00000  8750.00000  1.163174295116e-04
8750.00000  8800.00000  1.172883596411e-04
8800.00000  8850.00000  1.124337089937e-04
8850.00000  8900.00000  1.120453369419e-04
8900.00000  8950.00000  1.062197561651e-04
8950.00000  9000.00000  9.728719897385e-05
9000.00000  9050.00000  1.066081282169e-04
9050.00000  9100.00000  9.922905923281e-05
9100.00000  9150.00000  1.000058033364e-04
9150.00000  9200.00000  1.015592915436e-04
9200.00000  9250.00000  9.981161731050e-05
9250.00000  9300.00000  1.042778959061e-04
9300.00000  9350.00000  9.961743128460e-05
9350.00000  9400.00000  8.252906100576e-05
9400.00000  9450.00000  7.670348022888e-05
9450.00000  9500.00000  9.456859461131e-05
9500.00000  9550.00000  8.854882780853e-05
9550.00000  9600.00000  9.126743217108e-05
9600.00000  9650.00000  9.010231601570e-05
9650.00000  9700.00000  9.903487320691e-05
9700.00000  9750.00000  9.184999024876e-05
9750.00000  9800.00000  8.680115357547e-05
9800.00000  9850.00000  9.204417627466e-05
9850.00000  9900.00000  8.194650292807e-05
9900.00000  9950.00000  8.039301472091e-05
9950.00000  10000.00000  7.922789856553e-05
