10001.00000  11001.00000  2.744619310923e-05
11001.00000  12001.00000  2.638850180064e-05
12001.00000  13001.00000  2.735655825257e-05
13001.00000  14001.00000  2.864730018847e-05
14001.00000  15001.00000  2.769717070787e-05
15001.00000  16001.00000  2.687253002660e-05
16001.00000  17001.00000  2.610167025933e-05
17001.00000  18001.00000  2.481092832343e-05
18001.00000  19001.00000  2.472129346677e-05
19001.00000  20001.00000  2.520532169273e-05
20001.00000  21001.00000  2.248042205027e-05
21001.00000  22001.00000  2.142273074169e-05
22001.00000  23001.00000  1.930734812452e-05
23001.00000  24001.00000  1.871575807056e-05
24001.00000  25001.00000  1.787319041796e-05
25001.00000  26001.00000  1.629561694075e-05
26001.00000  27001.00000  1.536341443149e-05
27001.00000  28001.00000  1.475389740620e-05
28001.00000  29001.00000  1.272814964569e-05
29001.00000  30001.00000  1.287156541635e-05
30001.00000  31001.00000  1.118643011114e-05
31001.00000  32001.00000  1.046935125786e-05
32001.00000  33001.00000  1.045142428653e-05
33001.00000  34001.00000  9.537148748601e-06
34001.00000  35001.00000  8.855923837987e-06
35001.00000  36001.00000  8.049210128049e-06
36001.00000  37001.00000  7.869940414729e-06
37001.00000  38001.00000  6.812249106144e-06
38001.00000  39001.00000  6.597125450160e-06
39001.00000  40001.00000  6.148951166861e-06
40001.00000  41001.00000  5.557361112907e-06
41001.00000  42001.00000  5.162967743604e-06
42001.00000  43001.00000  4.858209230960e-06
43001.00000  44001.00000  4.481742832989e-06
44001.00000  45001.00000  4.643085574977e-06
45001.00000  46001.00000  4.445888890325e-06
46001.00000  47001.00000  3.979787635695e-06
47001.00000  48001.00000  4.087349463686e-06
48001.00000  49001.00000  3.692956094383e-06
49001.00000  50001.00000  3.352343639076e-06
50001.00000  51001.00000  3.280635753748e-06
51001.00000  52001.00000  2.904169355777e-06
52001.00000  53001.00000  2.778680556453e-06
53001.00000  54001.00000  2.527702957806e-06
54001.00000  55001.00000  2.563556900470e-06
55001.00000  56001.00000  2.491849015142e-06
56001.00000  57001.00000  2.133309588503e-06
57001.00000  58001.00000  2.366360215818e-06
58001.00000  59001.00000  2.527702957806e-06
59001.00000  60001.00000  2.097455645839e-06
60001.00000  61001.00000  2.025747760511e-06
61001.00000  62001.00000  1.828551075860e-06
62001.00000  63001.00000  1.470011649221e-06
63001.00000  64001.00000  2.043674731843e-06
64001.00000  65001.00000  1.398303763893e-06
65001.00000  66001.00000  1.613427419876e-06
66001.00000  67001.00000  1.165253136577e-06
67001.00000  68001.00000  1.649281362540e-06
68001.00000  69001.00000  1.380376792561e-06
69001.00000  70001.00000  1.290741935901e-06
70001.00000  71001.00000  9.859834232577e-07
71001.00000  72001.00000  1.039764337254e-06
72001.00000  73001.00000  8.246406812700e-07
73001.00000  74001.00000  9.322025092618e-07
74001.00000  75001.00000  8.425676526020e-07
75001.00000  76001.00000  8.067137099381e-07
76001.00000  77001.00000  9.142755379298e-07
77001.00000  78001.00000  8.246406812700e-07
78001.00000  79001.00000  1.021837365922e-06
79001.00000  80001.00000  8.784215952659e-07
80001.00000  81001.00000  7.529327959422e-07
81001.00000  82001.00000  7.170788532783e-07
82001.00000  83001.00000  6.632979392824e-07
83001.00000  84001.00000  7.350058246103e-07
84001.00000  85001.00000  6.095170252866e-07
85001.00000  86001.00000  7.529327959422e-07
86001.00000  87001.00000  7.708597672742e-07
87001.00000  88001.00000  5.198821686268e-07
88001.00000  89001.00000  5.198821686268e-07
89001.00000  90001.00000  6.991518819463e-07
90001.00000  91001.00000  6.991518819463e-07
91001.00000  92001.00000  6.632979392824e-07
92001.00000  93001.00000  4.840282259629e-07
93001.00000  94001.00000  5.378091399587e-07
94001.00000  95001.00000  4.123203406350e-07
95001.00000  96001.00000  5.198821686268e-07
96001.00000  97001.00000  3.406124553072e-07
97001.00000  98001.00000  5.736630826226e-07
98001.00000  99001.00000  3.943933693031e-07
99001.00000  100001.00000  3.226854839752e-07
100001.00000  101001.00000  3.943933693031e-07
101001.00000  102001.00000  4.481742832989e-07
102001.00000  103001.00000  5.198821686268e-07
103001.00000  104001.00000  2.509775986474e-07
104001.00000  105001.00000  3.226854839752e-07
105001.00000  106001.00000  1.792697133196e-07
106001.00000  107001.00000  3.406124553072e-07
107001.00000  108001.00000  3.047585126433e-07
108001.00000  109001.00000  3.226854839752e-07
109001.00000  110001.00000  2.689045699794e-07
110001.00000  111001.00000  2.151236559835e-07
111001.00000  112001.00000  2.151236559835e-07
112001.00000  113001.00000  2.151236559835e-07
113001.00000  114001.00000  2.151236559835e-07
114001.00000  115001.00000  1.971966846515e-07
115001.00000  116001.00000  1.792697133196e-07
116001.00000  117001.00000  1.434157706557e-07
117001.00000  118001.00000  2.330506273154e-07
118001.00000  119001.00000  1.075618279917e-07
119001.00000  120001.00000  1.971966846515e-07
120001.00000  121001.00000  1.613427419876e-07
121001.00000  122001.00000  1.075618279917e-07
122001.00000  123001.00000  1.254887993237e-07
123001.00000  124001.00000  1.613427419876e-07
124001.00000  125001.00000  1.075618279917e-07
125001.00000  126001.00000  1.254887993237e-07
126001.00000  127001.00000  1.434157706557e-07
127001.00000  128001.00000  7.170788532783e-08
128001.00000  129001.00000  1.254887993237e-07
129001.00000  130001.00000  8.963485665979e-08
130001.00000  131001.00000  7.170788532783e-08
131001.00000  132001.00000  1.254887993237e-07
132001.00000  133001.00000  8.963485665979e-08
133001.00000  134001.00000  1.075618279917e-07
134001.00000  135001.00000  7.170788532783e-08
135001.00000  136001.00000  1.075618279917e-07
136001.00000  137001.00000  1.792697133196e-08
137001.00000  138001.00000  5.378091399587e-08
138001.00000  139001.00000  7.170788532783e-08
139001.00000  140001.00000  5.378091399587e-08
140001.00000  141001.00000  1.254887993237e-07
141001.00000  142001.00000  8.963485665979e-08
142001.00000  143001.00000  7.170788532783e-08
143001.00000  144001.00000  7.170788532783e-08
144001.00000  145001.00000  5.378091399587e-08
145001.00000  146001.00000  0.000000000000e+00
146001.00000  147001.00000  3.585394266391e-08
147001.00000  148001.00000  1.075618279917e-07
148001.00000  149001.00000  7.170788532783e-08
149001.00000  150001.00000  3.585394266391e-08
150001.00000  151001.00000  1.075618279917e-07
151001.00000  152001.00000  5.378091399587e-08
152001.00000  153001.00000  7.170788532783e-08
153001.00000  154001.00000  5.378091399587e-08
154001.00000  155001.00000  5.378091399587e-08
155001.00000  156001.00000  1.075618279917e-07
156001.00000  157001.00000  7.170788532783e-08
157001.00000  158001.00000  5.378091399587e-08
158001.00000  159001.00000  7.170788532783e-08
159001.00000  160001.00000  1.792697133196e-08
160001.00000  161001.00000  0.000000000000e+00
161001.00000  162001.00000  5.378091399587e-08
162001.00000  163001.00000  5.378091399587e-08
163001.00000  164001.00000  1.792697133196e-08
164001.00000  165001.00000  3.585394266391e-08
165001.00000  166001.00000  0.000000000000e+00
166001.00000  167001.00000  5.378091399587e-08
167001.00000  168001.00000  3.585394266391e-08
168001.00000  169001.00000  7.170788532783e-08
169001.00000  170001.00000  3.585394266391e-08
170001.00000  171001.00000  1.792697133196e-08
171001.00000  172001.00000  1.792697133196e-08
172001.00000  173001.00000  3.585394266391e-08
173001.00000  174001.00000  3.585394266391e-08
174001.00000  175001.00000  8.963485665979e-08
175001.00000  176001.00000  3.585394266391e-08
176001.00000  177001.00000  3.585394266391e-08
177001.00000  178001.00000  1.792697133196e-08
178001.00000  179001.00000  5.378091399587e-08
179001.00000  180001.00000  0.000000000000e+00
180001.00000  181001.00000  1.792697133196e-08
181001.00000  182001.00000  0.000000000000e+00
182001.00000  183001.00000  1.792697133196e-08
183001.00000  184001.00000  3.585394266391e-08
184001.00000  185001.00000  3.585394266391e-08
185001.00000  186001.00000  1.792697133196e-08
186001.00000  187001.00000  1.792697133196e-08
187001.00000  188001.00000  0.000000000000e+00
188001.00000  189001.00000  1.792697133196e-08
189001.00000  190001.00000  0.000000000000e+00
190001.00000  191001.00000  0.000000000000e+00
191001.00000  192001.00000  0.000000000000e+00
192001.00000  193001.00000  3.585394266391e-08
193001.00000  194001.00000  1.792697133196e-08
194001.00000  195001.00000  1.792697133196e-08
195001.00000  196001.00000  1.792697133196e-08
196001.00000  197001.00000  3.585394266391e-08
197001.00000  198001.00000  0.000000000000e+00
198001.00000  199001.00000  1.792697133196e-08
