10001.00000  11001.00000  1.361577016925e-04
11001.00000  12001.00000  1.195553166913e-04
12001.00000  13001.00000  1.000860717665e-04
13001.00000  14001.00000  8.644127010434e-05
14001.00000  15001.00000  7.517342192324e-05
15001.00000  16001.00000  6.446805891703e-05
16001.00000  17001.00000  5.744606657228e-05
17001.00000  18001.00000  5.058737637509e-05
18001.00000  19001.00000  4.392827769156e-05
19001.00000  20001.00000  3.886591111744e-05
20001.00000  21001.00000  3.445675313353e-05
21001.00000  22001.00000  3.184391877270e-05
22001.00000  23001.00000  2.730774800735e-05
23001.00000  24001.00000  2.580173931326e-05
24001.00000  25001.00000  2.480378174489e-05
25001.00000  26001.00000  2.166475157527e-05
26001.00000  27001.00000  1.970512580464e-05
27001.00000  28001.00000  1.682012119789e-05
28001.00000  29001.00000  1.582216362951e-05
29001.00000  30001.00000  1.471533796277e-05
30001.00000  31001.00000  1.317303990255e-05
31001.00000  32001.00000  1.282829092439e-05
32001.00000  33001.00000  1.173960994070e-05
33001.00000  34001.00000  1.063278427396e-05
34001.00000  35001.00000  9.779984170076e-06
35001.00000  36001.00000  1.005215441600e-05
36001.00000  37001.00000  8.999762798437e-06
37001.00000  38001.00000  8.419132940473e-06
38001.00000  39001.00000  8.382843574351e-06
39001.00000  40001.00000  7.040137027810e-06
40001.00000  41001.00000  6.386928437601e-06
41001.00000  42001.00000  6.423217803723e-06
42001.00000  43001.00000  5.951456044128e-06
43001.00000  44001.00000  5.497838967594e-06
44001.00000  45001.00000  5.515983650655e-06
45001.00000  46001.00000  4.808341011262e-06
46001.00000  47001.00000  4.608749497587e-06
47001.00000  48001.00000  4.118843054930e-06
48001.00000  49001.00000  4.209566470237e-06
49001.00000  50001.00000  3.973685590439e-06
50001.00000  51001.00000  3.610791929212e-06
51001.00000  52001.00000  3.864817492071e-06
52001.00000  53001.00000  3.429345098598e-06
53001.00000  54001.00000  3.665225978396e-06
54001.00000  55001.00000  3.048306754309e-06
55001.00000  56001.00000  2.540255628591e-06
56001.00000  57001.00000  2.757991825327e-06
57001.00000  58001.00000  2.757991825327e-06
58001.00000  59001.00000  2.576544994714e-06
59001.00000  60001.00000  2.304374748793e-06
60001.00000  61001.00000  2.286230065732e-06
61001.00000  62001.00000  2.032204502873e-06
62001.00000  63001.00000  2.032204502873e-06
63001.00000  64001.00000  2.213651333487e-06
64001.00000  65001.00000  1.887047038382e-06
65001.00000  66001.00000  1.705600207768e-06
66001.00000  67001.00000  2.050349185934e-06
67001.00000  68001.00000  1.723744890830e-06
68001.00000  69001.00000  1.506008694093e-06
69001.00000  70001.00000  1.687455524707e-06
70001.00000  71001.00000  1.487864011032e-06
71001.00000  72001.00000  1.669310841646e-06
72001.00000  73001.00000  1.088680983682e-06
73001.00000  74001.00000  1.687455524707e-06
74001.00000  75001.00000  1.034246934498e-06
75001.00000  76001.00000  1.215693765111e-06
76001.00000  77001.00000  1.251983131234e-06
77001.00000  78001.00000  1.251983131234e-06
78001.00000  79001.00000  1.106825666743e-06
79001.00000  80001.00000  8.165107377614e-07
80001.00000  81001.00000  8.346554208228e-07
81001.00000  82001.00000  1.070536300621e-06
82001.00000  83001.00000  9.072341530683e-07
83001.00000  84001.00000  7.439320055160e-07
84001.00000  85001.00000  1.088680983682e-06
85001.00000  86001.00000  1.016102251436e-06
86001.00000  87001.00000  8.346554208228e-07
87001.00000  88001.00000  6.169192240864e-07
88001.00000  89001.00000  5.261958087796e-07
89001.00000  90001.00000  7.983660547001e-07
90001.00000  91001.00000  7.439320055160e-07
91001.00000  92001.00000  5.987745410250e-07
92001.00000  93001.00000  7.620766885773e-07
93001.00000  94001.00000  8.165107377614e-07
94001.00000  95001.00000  6.350639071478e-07
95001.00000  96001.00000  6.532085902091e-07
96001.00000  97001.00000  7.076426393932e-07
97001.00000  98001.00000  6.350639071478e-07
98001.00000  99001.00000  4.717617595955e-07
99001.00000  100001.00000  4.536170765341e-07
100001.00000  101001.00000  5.080511257182e-07
101001.00000  102001.00000  4.354723934728e-07
102001.00000  103001.00000  3.266042951046e-07
103001.00000  104001.00000  4.717617595955e-07
104001.00000  105001.00000  5.080511257182e-07
105001.00000  106001.00000  5.806298579637e-07
106001.00000  107001.00000  4.354723934728e-07
107001.00000  108001.00000  4.899064426569e-07
108001.00000  109001.00000  4.717617595955e-07
109001.00000  110001.00000  4.899064426569e-07
110001.00000  111001.00000  3.447489781659e-07
111001.00000  112001.00000  3.084596120432e-07
112001.00000  113001.00000  2.903149289818e-07
113001.00000  114001.00000  2.177361967364e-07
114001.00000  115001.00000  2.177361967364e-07
115001.00000  116001.00000  3.810383442887e-07
116001.00000  117001.00000  1.633021475523e-07
117001.00000  118001.00000  2.903149289818e-07
118001.00000  119001.00000  1.814468306137e-07
119001.00000  120001.00000  1.995915136750e-07
120001.00000  121001.00000  3.266042951046e-07
121001.00000  122001.00000  2.540255628591e-07
122001.00000  123001.00000  3.266042951046e-07
123001.00000  124001.00000  2.358808797977e-07
124001.00000  125001.00000  1.270127814296e-07
125001.00000  126001.00000  2.358808797977e-07
126001.00000  127001.00000  2.540255628591e-07
127001.00000  128001.00000  1.995915136750e-07
128001.00000  129001.00000  9.072341530683e-08
129001.00000  130001.00000  2.358808797977e-07
130001.00000  131001.00000  1.814468306137e-07
131001.00000  132001.00000  1.451574644909e-07
132001.00000  133001.00000  9.072341530683e-08
133001.00000  134001.00000  1.814468306137e-07
134001.00000  135001.00000  1.451574644909e-07
135001.00000  136001.00000  1.633021475523e-07
136001.00000  137001.00000  9.072341530683e-08
137001.00000  138001.00000  1.995915136750e-07
138001.00000  139001.00000  1.995915136750e-07
139001.00000  140001.00000  1.633021475523e-07
140001.00000  141001.00000  1.088680983682e-07
141001.00000  142001.00000  3.628936612273e-08
142001.00000  143001.00000  5.443404918410e-08
143001.00000  144001.00000  5.443404918410e-08
144001.00000  145001.00000  1.451574644909e-07
145001.00000  146001.00000  1.451574644909e-07
146001.00000  147001.00000  1.088680983682e-07
147001.00000  148001.00000  1.270127814296e-07
148001.00000  149001.00000  5.443404918410e-08
149001.00000  150001.00000  9.072341530683e-08
150001.00000  151001.00000  1.088680983682e-07
151001.00000  152001.00000  7.257873224546e-08
152001.00000  153001.00000  1.270127814296e-07
153001.00000  154001.00000  3.628936612273e-08
154001.00000  155001.00000  7.257873224546e-08
155001.00000  156001.00000  9.072341530683e-08
156001.00000  157001.00000  5.443404918410e-08
157001.00000  158001.00000  7.257873224546e-08
158001.00000  159001.00000  9.072341530683e-08
159001.00000  160001.00000  1.633021475523e-07
160001.00000  161001.00000  1.088680983682e-07
161001.00000  162001.00000  9.072341530683e-08
162001.00000  163001.00000  9.072341530683e-08
163001.00000  164001.00000  9.072341530683e-08
164001.00000  165001.00000  3.628936612273e-08
165001.00000  166001.00000  7.257873224546e-08
166001.00000  167001.00000  3.628936612273e-08
167001.00000  168001.00000  5.443404918410e-08
168001.00000  169001.00000  5.443404918410e-08
169001.00000  170001.00000  3.628936612273e-08
170001.00000  171001.00000  7.257873224546e-08
171001.00000  172001.00000  5.443404918410e-08
172001.00000  173001.00000  1.814468306137e-08
173001.00000  174001.00000  0.000000000000e+00
174001.00000  175001.00000  1.814468306137e-08
175001.00000  176001.00000  1.814468306137e-08
176001.00000  177001.00000  5.443404918410e-08
177001.00000  178001.00000  3.628936612273e-08
178001.00000  179001.00000  3.628936612273e-08
179001.00000  180001.00000  5.443404918410e-08
180001.00000  181001.00000  1.814468306137e-08
181001.00000  182001.00000  1.814468306137e-08
182001.00000  183001.00000  5.443404918410e-08
183001.00000  184001.00000  1.814468306137e-08
184001.00000  185001.00000  1.814468306137e-08
185001.00000  186001.00000  1.814468306137e-08
186001.00000  187001.00000  0.000000000000e+00
187001.00000  188001.00000  0.000000000000e+00
188001.00000  189001.00000  3.628936612273e-08
189001.00000  190001.00000  0.000000000000e+00
190001.00000  191001.00000  0.000000000000e+00
191001.00000  192001.00000  0.000000000000e+00
192001.00000  193001.00000  1.814468306137e-08
193001.00000  194001.00000  0.000000000000e+00
194001.00000  195001.00000  0.000000000000e+00
195001.00000  196001.00000  0.000000000000e+00
196001.00000  197001.00000  0.000000000000e+00
197001.00000  198001.00000  0.000000000000e+00
198001.00000  199001.00000  1.814468306137e-08
