10001.00000  11001.00000  6.523544330499e-04
11001.00000  12001.00000  5.563442136286e-04
12001.00000  13001.00000  4.716512088814e-04
13001.00000  14001.00000  4.068563824678e-04
14001.00000  15001.00000  3.535900254020e-04
15001.00000  16001.00000  3.085726603653e-04
16001.00000  17001.00000  2.717238093867e-04
17001.00000  18001.00000  2.445323149299e-04
18001.00000  19001.00000  2.187994836978e-04
19001.00000  20001.00000  1.948572873207e-04
20001.00000  21001.00000  1.732087131176e-04
21001.00000  22001.00000  1.581090338059e-04
22001.00000  23001.00000  1.445183164507e-04
23001.00000  24001.00000  1.301228193853e-04
24001.00000  25001.00000  1.183327966316e-04
25001.00000  26001.00000  1.093192638779e-04
26001.00000  27001.00000  1.010501523561e-04
27001.00000  28001.00000  9.082945003712e-05
28001.00000  29001.00000  8.529658952982e-05
29001.00000  30001.00000  7.803345264569e-05
30001.00000  31001.00000  7.235975568911e-05
31001.00000  32001.00000  6.706832909486e-05
32001.00000  33001.00000  6.128397492814e-05
33001.00000  34001.00000  5.564045721069e-05
34001.00000  35001.00000  5.343737275415e-05
35001.00000  36001.00000  4.906138308019e-05
36001.00000  37001.00000  4.588250322509e-05
37001.00000  38001.00000  4.382025521782e-05
38001.00000  39001.00000  4.112424318881e-05
39001.00000  40001.00000  3.774416840617e-05
40001.00000  41001.00000  3.513869409455e-05
41001.00000  42001.00000  3.316698380467e-05
42001.00000  43001.00000  3.130593072494e-05
43001.00000  44001.00000  2.970643105102e-05
44001.00000  45001.00000  2.833830554376e-05
45001.00000  46001.00000  2.630623677562e-05
46001.00000  47001.00000  2.393213663067e-05
47001.00000  48001.00000  2.282556452921e-05
48001.00000  49001.00000  2.171899242775e-05
49001.00000  50001.00000  2.108522840600e-05
50001.00000  51001.00000  2.033074742774e-05
51001.00000  52001.00000  1.821820068858e-05
52001.00000  53001.00000  1.789628880452e-05
53001.00000  54001.00000  1.591451876827e-05
54001.00000  55001.00000  1.579380181175e-05
55001.00000  56001.00000  1.586422003639e-05
56001.00000  57001.00000  1.362089659434e-05
57001.00000  58001.00000  1.306761054361e-05
58001.00000  59001.00000  1.247408550737e-05
59001.00000  60001.00000  1.213205413055e-05
60001.00000  61001.00000  1.161900706533e-05
61001.00000  62001.00000  1.072368963779e-05
62001.00000  63001.00000  9.657356521834e-06
63001.00000  64001.00000  9.838431956618e-06
64001.00000  65001.00000  9.536639565311e-06
65001.00000  66001.00000  9.214727681250e-06
66001.00000  67001.00000  8.269111521820e-06
67001.00000  68001.00000  8.067916594282e-06
68001.00000  69001.00000  7.212838152245e-06
69001.00000  70001.00000  7.202778405868e-06
70001.00000  71001.00000  6.820508043545e-06
71001.00000  72001.00000  6.599193623253e-06
72001.00000  73001.00000  6.206863514554e-06
73001.00000  74001.00000  6.086146558031e-06
74001.00000  75001.00000  5.291426594255e-06
75001.00000  76001.00000  5.633457971070e-06
76001.00000  77001.00000  5.552980000054e-06
77001.00000  78001.00000  5.422203297155e-06
78001.00000  79001.00000  5.170709637732e-06
79001.00000  80001.00000  4.718021050771e-06
80001.00000  81001.00000  4.818618514540e-06
81001.00000  82001.00000  4.225093478302e-06
82001.00000  83001.00000  3.873002355110e-06
83001.00000  84001.00000  3.923301086995e-06
84001.00000  85001.00000  3.903181594241e-06
85001.00000  86001.00000  3.742225652211e-06
86001.00000  87001.00000  3.802584130472e-06
87001.00000  88001.00000  3.027983659450e-06
88001.00000  89001.00000  2.897206956550e-06
89001.00000  90001.00000  2.766430253650e-06
90001.00000  91001.00000  2.726191268143e-06
91001.00000  92001.00000  2.746310760896e-06
92001.00000  93001.00000  2.353980652197e-06
93001.00000  94001.00000  2.585354818866e-06
94001.00000  95001.00000  2.243323442051e-06
95001.00000  96001.00000  2.193024710166e-06
96001.00000  97001.00000  2.253383188428e-06
97001.00000  98001.00000  2.132666231905e-06
98001.00000  99001.00000  2.112546739151e-06
99001.00000  100001.00000  2.162845471036e-06
100001.00000  101001.00000  1.760455615959e-06
101001.00000  102001.00000  1.750395869582e-06
102001.00000  103001.00000  1.710156884075e-06
103001.00000  104001.00000  1.519021702913e-06
104001.00000  105001.00000  1.589439927552e-06
105001.00000  106001.00000  1.569320434798e-06
106001.00000  107001.00000  1.468722971029e-06
107001.00000  108001.00000  1.619619166683e-06
108001.00000  109001.00000  1.559260688421e-06
109001.00000  110001.00000  1.166930579722e-06
110001.00000  111001.00000  1.317826775375e-06
111001.00000  112001.00000  1.056273369576e-06
112001.00000  113001.00000  1.337946268129e-06
113001.00000  114001.00000  1.197109818852e-06
114001.00000  115001.00000  1.076392862329e-06
115001.00000  116001.00000  1.036153876822e-06
116001.00000  117001.00000  1.026094130445e-06
117001.00000  118001.00000  1.146811086968e-06
118001.00000  119001.00000  9.959148913141e-07
119001.00000  120001.00000  8.450186956604e-07
120001.00000  121001.00000  7.846602173990e-07
121001.00000  122001.00000  8.148394565297e-07
122001.00000  123001.00000  7.041822463837e-07
123001.00000  124001.00000  7.846602173990e-07
124001.00000  125001.00000  7.041822463837e-07
125001.00000  126001.00000  6.035847826146e-07
126001.00000  127001.00000  5.935250362377e-07
127001.00000  128001.00000  6.740030072530e-07
128001.00000  129001.00000  5.633457971070e-07
129001.00000  130001.00000  5.331665579762e-07
130001.00000  131001.00000  5.935250362377e-07
131001.00000  132001.00000  6.237042753684e-07
132001.00000  133001.00000  5.231068115993e-07
133001.00000  134001.00000  4.929275724686e-07
134001.00000  135001.00000  5.029873188455e-07
135001.00000  136001.00000  3.923301086995e-07
136001.00000  137001.00000  4.728080797148e-07
137001.00000  138001.00000  4.526885869610e-07
138001.00000  139001.00000  3.722106159457e-07
139001.00000  140001.00000  3.722106159457e-07
140001.00000  141001.00000  3.621508695688e-07
141001.00000  142001.00000  4.023898550764e-07
142001.00000  143001.00000  3.420313768149e-07
143001.00000  144001.00000  3.520911231919e-07
144001.00000  145001.00000  3.722106159457e-07
145001.00000  146001.00000  2.414339130458e-07
146001.00000  147001.00000  3.118521376842e-07
147001.00000  148001.00000  3.420313768149e-07
148001.00000  149001.00000  3.118521376842e-07
149001.00000  150001.00000  3.420313768149e-07
150001.00000  151001.00000  2.414339130458e-07
151001.00000  152001.00000  2.615534057997e-07
152001.00000  153001.00000  1.810754347844e-07
153001.00000  154001.00000  1.911351811613e-07
154001.00000  155001.00000  2.112546739151e-07
155001.00000  156001.00000  2.917326449304e-07
156001.00000  157001.00000  1.810754347844e-07
157001.00000  158001.00000  2.112546739151e-07
158001.00000  159001.00000  1.207169565229e-07
159001.00000  160001.00000  2.011949275382e-07
160001.00000  161001.00000  1.710156884075e-07
161001.00000  162001.00000  1.508961956537e-07
162001.00000  163001.00000  1.810754347844e-07
163001.00000  164001.00000  2.213144202920e-07
164001.00000  165001.00000  1.207169565229e-07
165001.00000  166001.00000  1.710156884075e-07
166001.00000  167001.00000  1.307767028998e-07
167001.00000  168001.00000  1.207169565229e-07
168001.00000  169001.00000  1.005974637691e-07
169001.00000  170001.00000  1.710156884075e-07
170001.00000  171001.00000  1.106572101460e-07
171001.00000  172001.00000  2.112546739151e-07
172001.00000  173001.00000  1.609559420306e-07
173001.00000  174001.00000  2.011949275382e-07
174001.00000  175001.00000  1.005974637691e-07
175001.00000  176001.00000  1.810754347844e-07
176001.00000  177001.00000  1.005974637691e-07
177001.00000  178001.00000  1.307767028998e-07
178001.00000  179001.00000  1.307767028998e-07
179001.00000  180001.00000  1.005974637691e-07
180001.00000  181001.00000  1.408364492767e-07
181001.00000  182001.00000  6.035847826146e-08
182001.00000  183001.00000  9.053771739219e-08
183001.00000  184001.00000  7.041822463837e-08
184001.00000  185001.00000  5.029873188455e-08
185001.00000  186001.00000  7.041822463837e-08
186001.00000  187001.00000  1.408364492767e-07
187001.00000  188001.00000  7.041822463837e-08
188001.00000  189001.00000  5.029873188455e-08
189001.00000  190001.00000  9.053771739219e-08
190001.00000  191001.00000  5.029873188455e-08
191001.00000  192001.00000  4.023898550764e-08
192001.00000  193001.00000  5.029873188455e-08
193001.00000  194001.00000  8.047797101528e-08
194001.00000  195001.00000  4.023898550764e-08
195001.00000  196001.00000  4.023898550764e-08
196001.00000  197001.00000  6.035847826146e-08
197001.00000  198001.00000  5.029873188455e-08
198001.00000  199001.00000  6.035847826146e-08
