300.00000  350.00000  2.224695486703e-02
350.00000  400.00000  1.760159883255e-02
400.00000  450.00000  1.440060370688e-02
450.00000  500.00000  1.206029735773e-02
500.00000  550.00000  1.030172596153e-02
550.00000  600.00000  8.838961849087e-03
600.00000  650.00000  7.652826945037e-03
650.00000  700.00000  6.863232649936e-03
700.00000  750.00000  6.074025790701e-03
750.00000  800.00000  5.525222886378e-03
800.00000  850.00000  4.894283578442e-03
850.00000  900.00000  4.506653994415e-03
900.00000  950.00000  4.144595177549e-03
950.00000  1000.00000  3.790672513871e-03
1000.00000  1050.00000  3.499708178434e-03
1050.00000  1100.00000  3.246518839941e-03
1100.00000  1150.00000  3.026455267999e-03
1150.00000  1200.00000  2.787988492418e-03
1200.00000  1250.00000  2.656454015879e-03
1250.00000  1300.00000  2.453631339978e-03
1300.00000  1350.00000  2.339918913279e-03
1350.00000  1400.00000  2.185138284775e-03
1400.00000  1450.00000  2.073556755339e-03
1450.00000  1500.00000  1.955582534113e-03
1500.00000  1550.00000  1.842451261214e-03
1550.00000  1600.00000  1.742299089828e-03
1600.00000  1650.00000  1.656288327555e-03
1650.00000  1700.00000  1.571827308747e-03
1700.00000  1750.00000  1.535408337334e-03
1750.00000  1800.00000  1.456177702717e-03
1800.00000  1850.00000  1.378690529498e-03
1850.00000  1900.00000  1.338397199424e-03
1900.00000  1950.00000  1.227396823788e-03
1950.00000  2000.00000  1.232820925914e-03
2000.00000  2050.00000  1.145454138109e-03
2050.00000  2100.00000  1.134605933859e-03
2100.00000  2150.00000  1.087919911994e-03
2150.00000  2200.00000  1.028835942415e-03
2200.00000  2250.00000  1.021668378892e-03
2250.00000  2300.00000  9.935792786001e-04
2300.00000  2350.00000  9.164795412472e-04
2350.00000  2400.00000  9.306209503597e-04
2400.00000  2450.00000  8.769610829056e-04
2450.00000  2500.00000  8.174896774600e-04
2500.00000  2550.00000  8.031545504145e-04
2550.00000  2600.00000  8.081912166737e-04
2600.00000  2650.00000  7.921126282308e-04
2650.00000  2700.00000  7.431019911698e-04
2700.00000  2750.00000  7.212118647355e-04
2750.00000  2800.00000  6.964159693054e-04
2800.00000  2850.00000  6.906044313140e-04
2850.00000  2900.00000  6.766567401346e-04
2900.00000  2950.00000  6.495362295079e-04
2950.00000  3000.00000  6.396566149225e-04
3000.00000  3050.00000  6.129235401620e-04
3050.00000  3100.00000  6.173790526220e-04
3100.00000  3150.00000  5.732113638872e-04
3150.00000  3200.00000  5.737925176864e-04
3200.00000  3250.00000  5.650752106993e-04
3250.00000  3300.00000  5.282688034202e-04
3300.00000  3350.00000  5.135462405086e-04
3350.00000  3400.00000  5.075409845842e-04
3400.00000  3450.00000  5.013420107267e-04
3450.00000  3500.00000  5.133525225756e-04
3500.00000  3550.00000  4.492318867369e-04
3550.00000  3600.00000  4.705408593721e-04
3600.00000  3650.00000  4.629858599833e-04
3650.00000  3700.00000  4.529125274648e-04
3700.00000  3750.00000  4.546559888622e-04
3750.00000  3800.00000  4.221113761103e-04
3800.00000  3850.00000  4.317972727626e-04
3850.00000  3900.00000  4.155249663867e-04
3900.00000  3950.00000  4.132003511901e-04
3950.00000  4000.00000  4.023521469394e-04
4000.00000  4050.00000  3.694200983214e-04
4050.00000  4100.00000  3.820117639695e-04
4100.00000  4150.00000  3.767813797772e-04
4150.00000  4200.00000  3.599279196021e-04
4200.00000  4250.00000  3.546975354098e-04
4250.00000  4300.00000  3.550849712759e-04
4300.00000  4350.00000  3.593467658029e-04
4350.00000  4400.00000  3.393938186990e-04
4400.00000  4450.00000  3.295142041136e-04
4450.00000  4500.00000  3.095612570097e-04
4500.00000  4550.00000  3.200220253943e-04
4550.00000  4600.00000  3.190534357291e-04
4600.00000  4650.00000  3.200220253943e-04
4650.00000  4700.00000  2.967758734286e-04
4700.00000  4750.00000  2.923203609685e-04
4750.00000  4800.00000  3.004565141565e-04
4800.00000  4850.00000  2.781789518561e-04
4850.00000  4900.00000  2.892208740398e-04
4900.00000  4950.00000  2.853465153788e-04
4950.00000  5000.00000  2.694616448689e-04
5000.00000  5050.00000  2.725611317977e-04
5050.00000  5100.00000  2.679119014045e-04
5100.00000  5150.00000  2.580322868191e-04
5150.00000  5200.00000  2.529956205599e-04
5200.00000  5250.00000  2.562888254217e-04
5250.00000  5300.00000  2.516395950286e-04
5300.00000  5350.00000  2.411788266440e-04
5350.00000  5400.00000  2.440845956397e-04
5400.00000  5450.00000  2.429222880414e-04
5450.00000  5500.00000  2.367233141839e-04
5500.00000  5550.00000  2.328489555230e-04
5550.00000  5600.00000  2.396290831796e-04
5600.00000  5650.00000  2.189012643436e-04
5650.00000  5700.00000  2.132834442852e-04
5700.00000  5750.00000  2.183201105444e-04
5750.00000  5800.00000  2.061158807624e-04
5800.00000  5850.00000  2.144457518835e-04
5850.00000  5900.00000  2.053410090302e-04
5900.00000  5950.00000  1.910058819847e-04
5950.00000  6000.00000  2.018540862354e-04
6000.00000  6050.00000  1.948802406457e-04
6050.00000  6100.00000  2.039849834989e-04
6100.00000  6150.00000  1.973985737753e-04
6150.00000  6200.00000  1.960425482440e-04
6200.00000  6250.00000  1.921681895830e-04
6250.00000  6300.00000  1.910058819847e-04
6300.00000  6350.00000  1.956551123779e-04
6350.00000  6400.00000  2.097965214903e-04
6400.00000  6450.00000  1.722152424791e-04
6450.00000  6500.00000  1.757021652740e-04
6500.00000  6550.00000  1.931367792483e-04
6550.00000  6600.00000  1.881001129890e-04
6600.00000  6650.00000  1.820948570646e-04
6650.00000  6700.00000  1.621419099607e-04
6700.00000  6750.00000  1.669848582869e-04
6750.00000  6800.00000  1.646602430903e-04
6800.00000  6850.00000  1.660162686216e-04
6850.00000  6900.00000  1.605921664963e-04
6900.00000  6950.00000  1.646602430903e-04
6950.00000  7000.00000  1.658225506886e-04
7000.00000  7050.00000  1.600110126971e-04
7050.00000  7100.00000  1.656288327555e-04
7100.00000  7150.00000  1.524560133083e-04
7150.00000  7200.00000  1.476130649821e-04
7200.00000  7250.00000  1.499376801787e-04
7250.00000  7300.00000  1.458696035847e-04
7300.00000  7350.00000  1.476130649821e-04
7350.00000  7400.00000  1.400580655933e-04
7400.00000  7450.00000  1.398643476602e-04
7450.00000  7500.00000  1.394769117941e-04
7500.00000  7550.00000  1.363774248654e-04
7550.00000  7600.00000  1.338590917357e-04
7600.00000  7650.00000  1.284349896104e-04
7650.00000  7700.00000  1.385083221289e-04
7700.00000  7750.00000  1.348276814010e-04
7750.00000  7800.00000  1.268852461460e-04
7800.00000  7850.00000  1.268852461460e-04
7850.00000  7900.00000  1.301784510078e-04
7900.00000  7950.00000  1.305658868739e-04
7950.00000  8000.00000  1.371522965976e-04
8000.00000  8050.00000  1.251417847486e-04
8050.00000  8100.00000  1.166181956945e-04
8100.00000  8150.00000  1.173930674267e-04
8150.00000  8200.00000  1.146810163641e-04
8200.00000  8250.00000  1.158433239623e-04
8250.00000  8300.00000  1.224297336860e-04
8300.00000  8350.00000  1.193302467572e-04
8350.00000  8400.00000  1.185553750250e-04
8400.00000  8450.00000  1.038328121134e-04
8450.00000  8500.00000  1.102255039040e-04
8500.00000  8550.00000  1.080946066404e-04
8550.00000  8600.00000  1.084820425065e-04
8600.00000  8650.00000  1.024767865821e-04
8650.00000  8700.00000  1.201051184894e-04
8700.00000  8750.00000  1.090631963057e-04
8750.00000  8800.00000  1.067385811091e-04
8800.00000  8850.00000  1.063511452430e-04
8850.00000  8900.00000  1.079008887074e-04
8900.00000  8950.00000  1.100317859709e-04
8950.00000  9000.00000  1.044139659125e-04
9000.00000  9050.00000  1.098380680379e-04
9050.00000  9100.00000  9.065999266618e-05
9100.00000  9150.00000  1.053825555778e-04
9150.00000  9200.00000  1.036390941804e-04
9200.00000  9250.00000  1.001521713855e-04
9250.00000  9300.00000  9.530922305932e-05
9300.00000  9350.00000  1.005396072516e-04
9350.00000  9400.00000  9.104742853228e-05
9400.00000  9450.00000  8.523589054085e-05
9450.00000  9500.00000  9.065999266618e-05
9500.00000  9550.00000  9.259717199665e-05
9550.00000  9600.00000  9.627781272456e-05
9600.00000  9650.00000  8.891653126875e-05
9650.00000  9700.00000  9.259717199665e-05
9700.00000  9750.00000  9.375947959494e-05
9750.00000  9800.00000  8.639819813914e-05
9800.00000  9850.00000  9.124114646532e-05
9850.00000  9900.00000  8.872281333571e-05
9900.00000  9950.00000  8.116781394686e-05
9950.00000  10000.00000  8.329871121038e-05
