300.00000  350.00000  3.354491063397e-01
350.00000  400.00000  2.518759346635e-01
400.00000  450.00000  1.954592791040e-01
450.00000  500.00000  1.566088814102e-01
500.00000  550.00000  1.282096082570e-01
550.00000  600.00000  1.069444554925e-01
600.00000  650.00000  9.038200426163e-02
650.00000  700.00000  7.721752088693e-02
700.00000  750.00000  6.720883074836e-02
750.00000  800.00000  5.856111898463e-02
800.00000  850.00000  5.166272477930e-02
850.00000  900.00000  4.598630931485e-02
900.00000  950.00000  4.114675762604e-02
950.00000  1000.00000  3.699862164227e-02
1000.00000  1050.00000  3.348888088461e-02
1050.00000  1100.00000  3.049680628952e-02
1100.00000  1150.00000  2.783181073004e-02
1150.00000  1200.00000  2.557378317104e-02
1200.00000  1250.00000  2.336304414730e-02
1250.00000  1300.00000  2.166065687768e-02
1300.00000  1350.00000  2.020223546047e-02
1350.00000  1400.00000  1.866392507837e-02
1400.00000  1450.00000  1.714782597799e-02
1450.00000  1500.00000  1.605624895557e-02
1500.00000  1550.00000  1.517997806722e-02
1550.00000  1600.00000  1.421271257312e-02
1600.00000  1650.00000  1.330634898050e-02
1650.00000  1700.00000  1.255761383877e-02
1700.00000  1750.00000  1.183753841538e-02
1750.00000  1800.00000  1.109417697084e-02
1800.00000  1850.00000  1.060158806181e-02
1850.00000  1900.00000  9.921636244107e-03
1900.00000  1950.00000  9.529356349278e-03
1950.00000  2000.00000  8.982313975393e-03
2000.00000  2050.00000  8.588242848167e-03
2050.00000  2100.00000  8.197395939255e-03
2100.00000  2150.00000  7.783979502147e-03
2150.00000  2200.00000  7.401014015780e-03
2200.00000  2250.00000  7.132329156307e-03
2250.00000  2300.00000  6.744706465709e-03
2300.00000  2350.00000  6.675206648726e-03
2350.00000  2400.00000  6.276478317269e-03
2400.00000  2450.00000  5.998479049335e-03
2450.00000  2500.00000  5.686804612347e-03
2500.00000  2550.00000  5.541356541753e-03
2550.00000  2600.00000  5.316377752755e-03
2600.00000  2650.00000  5.131164322959e-03
2650.00000  2700.00000  4.912992217068e-03
2700.00000  2750.00000  4.821997611326e-03
2750.00000  2800.00000  4.520712322238e-03
2800.00000  2850.00000  4.493843836291e-03
2850.00000  2900.00000  4.196499258475e-03
2900.00000  2950.00000  4.090816547083e-03
2950.00000  3000.00000  4.073620716077e-03
3000.00000  3050.00000  3.823564673528e-03
3050.00000  3100.00000  3.735077793142e-03
3100.00000  3150.00000  3.622230152164e-03
3150.00000  3200.00000  3.486812982990e-03
3200.00000  3250.00000  3.348171595502e-03
3250.00000  3300.00000  3.270073863015e-03
3300.00000  3350.00000  3.214187412245e-03
3350.00000  3400.00000  3.081994461385e-03
3400.00000  3450.00000  2.972012792241e-03
3450.00000  3500.00000  2.877793968186e-03
3500.00000  3550.00000  2.863105862535e-03
3550.00000  3600.00000  2.758856137060e-03
3600.00000  3650.00000  2.667145038360e-03
3650.00000  3700.00000  2.681833144011e-03
3700.00000  3750.00000  2.604810150962e-03
3750.00000  3800.00000  2.470467721226e-03
3800.00000  3850.00000  2.405983354953e-03
3850.00000  3900.00000  2.374457664775e-03
3900.00000  3950.00000  2.323586664715e-03
3950.00000  4000.00000  2.232950305453e-03
4000.00000  4050.00000  2.166674706783e-03
4050.00000  4100.00000  2.177422101162e-03
4100.00000  4150.00000  2.056334791160e-03
4150.00000  4200.00000  2.028033319296e-03
4200.00000  4250.00000  2.047736875657e-03
4250.00000  4300.00000  1.958175255833e-03
4300.00000  4350.00000  1.889750178287e-03
4350.00000  4400.00000  1.847477093730e-03
4400.00000  4450.00000  1.781917988019e-03
4450.00000  4500.00000  1.806636995091e-03
4500.00000  4550.00000  1.756840734468e-03
4550.00000  4600.00000  1.704178502012e-03
4600.00000  4650.00000  1.676951769585e-03
4650.00000  4700.00000  1.637902903342e-03
4700.00000  4750.00000  1.621423565294e-03
4750.00000  4800.00000  1.584882424406e-03
4800.00000  4850.00000  1.585240670886e-03
4850.00000  4900.00000  1.521472797571e-03
4900.00000  4950.00000  1.497112036979e-03
4950.00000  5000.00000  1.476333741180e-03
5000.00000  5050.00000  1.389279846711e-03
5050.00000  5100.00000  1.386413874876e-03
5100.00000  5150.00000  1.416864825616e-03
5150.00000  5200.00000  1.326944959313e-03
5200.00000  5250.00000  1.286821353632e-03
5250.00000  5300.00000  1.310823867745e-03
5300.00000  5350.00000  1.287896093070e-03
5350.00000  5400.00000  1.284313628277e-03
5400.00000  5450.00000  1.251713198661e-03
5450.00000  5500.00000  1.230218409903e-03
5500.00000  5550.00000  1.220904001441e-03
5550.00000  5600.00000  1.117370768925e-03
5600.00000  5650.00000  1.150687691499e-03
5650.00000  5700.00000  1.124893944990e-03
5700.00000  5750.00000  1.118087261883e-03
5750.00000  5800.00000  1.101966170315e-03
5800.00000  5850.00000  1.066499768865e-03
5850.00000  5900.00000  1.061842564634e-03
5900.00000  5950.00000  1.046079719545e-03
5950.00000  6000.00000  1.019211233598e-03
6000.00000  6050.00000  1.008822085698e-03
6050.00000  6100.00000  1.006672606822e-03
6100.00000  6150.00000  9.841030786266e-04
6150.00000  6200.00000  9.737139307270e-04
6200.00000  6250.00000  9.694149729754e-04
6250.00000  6300.00000  9.873272969402e-04
6300.00000  6350.00000  9.694149729754e-04
6350.00000  6400.00000  1.628946741360e-03
6400.00000  6450.00000  8.948997052818e-04
6450.00000  6500.00000  8.934667193646e-04
6500.00000  6550.00000  8.425957193046e-04
6550.00000  6600.00000  8.798533531514e-04
6600.00000  6650.00000  8.393715009909e-04
6650.00000  6700.00000  8.064128248957e-04
6700.00000  6750.00000  8.250416418191e-04
6750.00000  6800.00000  8.060545784164e-04
6800.00000  6850.00000  8.046215924992e-04
6850.00000  6900.00000  7.541088389184e-04
6900.00000  6950.00000  7.730959023211e-04
6950.00000  7000.00000  7.469439093325e-04
7000.00000  7050.00000  7.444361839774e-04
7050.00000  7100.00000  8.379385150737e-04
7100.00000  7150.00000  7.050290712549e-04
7150.00000  7200.00000  7.025213458998e-04
7200.00000  7250.00000  6.709956557217e-04
7250.00000  7300.00000  6.681296838874e-04
7300.00000  7350.00000  6.957146627932e-04
7350.00000  7400.00000  6.860420078522e-04
7400.00000  7450.00000  6.509338528811e-04
7450.00000  7500.00000  6.297973106027e-04
7500.00000  7550.00000  6.258565993304e-04
7550.00000  7600.00000  6.237071204546e-04
7600.00000  7650.00000  6.186916697445e-04
7650.00000  7700.00000  5.810757894184e-04
7700.00000  7750.00000  5.699701485602e-04
7750.00000  7800.00000  5.925396767559e-04
7800.00000  7850.00000  5.782098175840e-04
7850.00000  7900.00000  6.000628528211e-04
7900.00000  7950.00000  5.660294372879e-04
7950.00000  8000.00000  5.742691063118e-04
8000.00000  8050.00000  5.534908105126e-04
8050.00000  8100.00000  5.653129443294e-04
8100.00000  8150.00000  5.559985358677e-04
8150.00000  8200.00000  5.491918527610e-04
8200.00000  8250.00000  5.431016626130e-04
8250.00000  8300.00000  5.112177259556e-04
8300.00000  8350.00000  5.216068738552e-04
8350.00000  8400.00000  5.069187682041e-04
8400.00000  8450.00000  5.165914231451e-04
8450.00000  8500.00000  5.176661625830e-04
8500.00000  8550.00000  5.090682470799e-04
8550.00000  8600.00000  4.811250216948e-04
8600.00000  8650.00000  4.990373456596e-04
8650.00000  8700.00000  4.839909935291e-04
8700.00000  8750.00000  4.782590498604e-04
8750.00000  8800.00000  4.746765850674e-04
8800.00000  8850.00000  4.771843104225e-04
8850.00000  8900.00000  4.721688597123e-04
8900.00000  8950.00000  4.535400427889e-04
8950.00000  9000.00000  4.667951625229e-04
9000.00000  9050.00000  4.513905639132e-04
9050.00000  9100.00000  4.474498526409e-04
9100.00000  9150.00000  4.392101836171e-04
9150.00000  9200.00000  4.316870075519e-04
9200.00000  9250.00000  4.148494230250e-04
9250.00000  9300.00000  4.212978596523e-04
9300.00000  9350.00000  4.352694723448e-04
9350.00000  9400.00000  4.119834511906e-04
9400.00000  9450.00000  4.166406554214e-04
9450.00000  9500.00000  4.341947329070e-04
9500.00000  9550.00000  3.922798948293e-04
9550.00000  9600.00000  3.854732117227e-04
9600.00000  9650.00000  4.202231202144e-04
9650.00000  9700.00000  4.005195638531e-04
9700.00000  9750.00000  3.775917891782e-04
9750.00000  9800.00000  3.790247750953e-04
9800.00000  9850.00000  3.772335426989e-04
9850.00000  9900.00000  3.761588032610e-04
9900.00000  9950.00000  3.725763384680e-04
9950.00000  10000.00000  3.736510779059e-04
