300.00000  350.00000  0.000000000000e+00
350.00000  400.00000  0.000000000000e+00
400.00000  450.00000  0.000000000000e+00
450.00000  500.00000  0.000000000000e+00
500.00000  550.00000  5.776127501894e-06
550.00000  600.00000  0.000000000000e+00
600.00000  650.00000  2.527055782079e-06
650.00000  700.00000  0.000000000000e+00
700.00000  750.00000  1.083023906605e-06
750.00000  800.00000  7.220159377367e-07
800.00000  850.00000  1.299628687926e-05
850.00000  900.00000  1.805039844342e-06
900.00000  950.00000  3.610079688684e-07
950.00000  1000.00000  3.610079688684e-07
1000.00000  1050.00000  2.166047813210e-06
1050.00000  1100.00000  3.610079688684e-06
1100.00000  1150.00000  8.664191252841e-06
1150.00000  1200.00000  1.624535859908e-05
1200.00000  1250.00000  3.249071719815e-05
1250.00000  1300.00000  9.025199221709e-05
1300.00000  1350.00000  5.920530689441e-05
1350.00000  1400.00000  1.086633986294e-04
1400.00000  1450.00000  1.794209605276e-04
1450.00000  1500.00000  2.465684427371e-04
1500.00000  1550.00000  3.115498771334e-04
1550.00000  1600.00000  4.140761402920e-04
1600.00000  1650.00000  4.978299890695e-04
1650.00000  1700.00000  6.249047941111e-04
1700.00000  1750.00000  8.209321212067e-04
1750.00000  1800.00000  8.758053324747e-04
1800.00000  1850.00000  8.978268185756e-04
1850.00000  1900.00000  8.602819898133e-04
1900.00000  1950.00000  9.913278825125e-04
1950.00000  2000.00000  1.075442739259e-03
2000.00000  2050.00000  1.206488631958e-03
2050.00000  2100.00000  1.211903751491e-03
2100.00000  2150.00000  1.298545664020e-03
2150.00000  2200.00000  1.391685719988e-03
2200.00000  2250.00000  1.420927365466e-03
2250.00000  2300.00000  1.455223122508e-03
2300.00000  2350.00000  1.630311987410e-03
2350.00000  2400.00000  1.483381744080e-03
2400.00000  2450.00000  1.537893947379e-03
2450.00000  2500.00000  1.458472194228e-03
2500.00000  2550.00000  1.411180150306e-03
2550.00000  2600.00000  1.379772457015e-03
2600.00000  2650.00000  1.406487046711e-03
2650.00000  2700.00000  1.398544871396e-03
2700.00000  2750.00000  1.353057867319e-03
2750.00000  2800.00000  1.363527098416e-03
2800.00000  2850.00000  1.322372189965e-03
2850.00000  2900.00000  1.295657600269e-03
2900.00000  2950.00000  1.249087572285e-03
2950.00000  3000.00000  1.332841421062e-03
3000.00000  3050.00000  1.253058659942e-03
3050.00000  3100.00000  1.205766616020e-03
3100.00000  3150.00000  1.207932663834e-03
3150.00000  3200.00000  1.156669532254e-03
3200.00000  3250.00000  1.118041679585e-03
3250.00000  3300.00000  1.038619926434e-03
3300.00000  3350.00000  1.055226293002e-03
3350.00000  3400.00000  1.027428679399e-03
3400.00000  3450.00000  9.761655478201e-04
3450.00000  3500.00000  9.591981732833e-04
3500.00000  3550.00000  9.433138226531e-04
3550.00000  3600.00000  8.924116990426e-04
3600.00000  3650.00000  8.916896831049e-04
3650.00000  3700.00000  8.631700535643e-04
3700.00000  3750.00000  8.447586471520e-04
3750.00000  3800.00000  7.804992286934e-04
3800.00000  3850.00000  7.613658063434e-04
3850.00000  3900.00000  7.884414040085e-04
3900.00000  3950.00000  7.440374238377e-04
3950.00000  4000.00000  7.129907385150e-04
4000.00000  4050.00000  6.664207105310e-04
4050.00000  4100.00000  6.563124874027e-04
4100.00000  4150.00000  6.606445830291e-04
4150.00000  4200.00000  6.082984275432e-04
4200.00000  4250.00000  6.115474992630e-04
4250.00000  4300.00000  5.754467023762e-04
4300.00000  4350.00000  5.653384792479e-04
4350.00000  4400.00000  5.306817142365e-04
4400.00000  4450.00000  5.137143396997e-04
4450.00000  4500.00000  4.989130129761e-04
4500.00000  4550.00000  4.942199093808e-04
4550.00000  4600.00000  4.815846304704e-04
4600.00000  4650.00000  4.895268057855e-04
4650.00000  4700.00000  4.631732240581e-04
4700.00000  4750.00000  4.512599610855e-04
4750.00000  4800.00000  4.321265387354e-04
4800.00000  4850.00000  4.184082359184e-04
4850.00000  4900.00000  4.147981562298e-04
4900.00000  4950.00000  4.068559809147e-04
4950.00000  5000.00000  3.700331680901e-04
5000.00000  5050.00000  3.667840963703e-04
5050.00000  5100.00000  3.678671202769e-04
5100.00000  5150.00000  3.476506740202e-04
5150.00000  5200.00000  3.389864827674e-04
5200.00000  5250.00000  3.202140683862e-04
5250.00000  5300.00000  3.046907257249e-04
5300.00000  5350.00000  3.173260046353e-04
5350.00000  5400.00000  3.068567735381e-04
5400.00000  5450.00000  3.039687097872e-04
5450.00000  5500.00000  2.772541200909e-04
5500.00000  5550.00000  2.729220244645e-04
5550.00000  5600.00000  2.848352874371e-04
5600.00000  5650.00000  2.602867455541e-04
5650.00000  5700.00000  2.707559766513e-04
5700.00000  5750.00000  2.433193710173e-04
5750.00000  5800.00000  2.613697694607e-04
5800.00000  5850.00000  2.285180442937e-04
5850.00000  5900.00000  2.389872753909e-04
5900.00000  5950.00000  2.303230841380e-04
5950.00000  6000.00000  2.252689725739e-04
6000.00000  6050.00000  1.999984147531e-04
6050.00000  6100.00000  2.111896617880e-04
6100.00000  6150.00000  2.075795820993e-04
6150.00000  6200.00000  2.173267972588e-04
6200.00000  6250.00000  2.043305103795e-04
6250.00000  6300.00000  2.018034545974e-04
6300.00000  6350.00000  2.028864785040e-04
6350.00000  6400.00000  7.613658063434e-04
6400.00000  6450.00000  1.786989445898e-04
6450.00000  6500.00000  1.743668489634e-04
6500.00000  6550.00000  1.678687055238e-04
6550.00000  6600.00000  1.743668489634e-04
6600.00000  6650.00000  1.685907214615e-04
6650.00000  6700.00000  1.602875381776e-04
6700.00000  6750.00000  1.548724186445e-04
6750.00000  6800.00000  1.483742752049e-04
6800.00000  6850.00000  1.548724186445e-04
6850.00000  6900.00000  1.458472194228e-04
6900.00000  6950.00000  1.451252034851e-04
6950.00000  7000.00000  1.407931078587e-04
7000.00000  7050.00000  1.259917811351e-04
7050.00000  7100.00000  1.909732155314e-04
7100.00000  7150.00000  1.216596855086e-04
7150.00000  7200.00000  1.083023906605e-04
7200.00000  7250.00000  1.137175101935e-04
7250.00000  7300.00000  1.158835580067e-04
7300.00000  7350.00000  1.205766616020e-04
7350.00000  7400.00000  1.173275898822e-04
7400.00000  7450.00000  1.079413826916e-04
7450.00000  7500.00000  1.180496058200e-04
7500.00000  7550.00000  9.422307987464e-05
7550.00000  7600.00000  1.028872711275e-04
7600.00000  7650.00000  8.700292049728e-05
7650.00000  7700.00000  1.036092870652e-04
7700.00000  7750.00000  9.025199221709e-05
7750.00000  7800.00000  9.241804003030e-05
7800.00000  7850.00000  8.772493643501e-05
7850.00000  7900.00000  7.942175315104e-05
7900.00000  7950.00000  9.350106393691e-05
7950.00000  8000.00000  9.314005596804e-05
8000.00000  8050.00000  8.339284080859e-05
8050.00000  8100.00000  8.375384877746e-05
8100.00000  8150.00000  7.617268143123e-05
8150.00000  8200.00000  7.545066549349e-05
8200.00000  8250.00000  7.472864955575e-05
8250.00000  8300.00000  8.375384877746e-05
8300.00000  8350.00000  7.364562564915e-05
8350.00000  8400.00000  7.508965752462e-05
8400.00000  8450.00000  7.256260174254e-05
8450.00000  8500.00000  7.220159377367e-05
8500.00000  8550.00000  6.967453799160e-05
8550.00000  8600.00000  7.400663361802e-05
8600.00000  8650.00000  7.184058580481e-05
8650.00000  8700.00000  5.956631486328e-05
8700.00000  8750.00000  7.075756189820e-05
8750.00000  8800.00000  6.967453799160e-05
8800.00000  8850.00000  6.606445830291e-05
8850.00000  8900.00000  6.498143439631e-05
8900.00000  8950.00000  5.631724314347e-05
8950.00000  9000.00000  6.534244236517e-05
9000.00000  9050.00000  6.462042642744e-05
9050.00000  9100.00000  5.848329095668e-05
9100.00000  9150.00000  6.137135470762e-05
9150.00000  9200.00000  6.173236267649e-05
9200.00000  9250.00000  5.451220329912e-05
9250.00000  9300.00000  5.451220329912e-05
9300.00000  9350.00000  6.064933876989e-05
9350.00000  9400.00000  5.920530689441e-05
9400.00000  9450.00000  5.451220329912e-05
9450.00000  9500.00000  5.342917939252e-05
9500.00000  9550.00000  5.306817142365e-05
9550.00000  9600.00000  5.342917939252e-05
9600.00000  9650.00000  5.451220329912e-05
9650.00000  9700.00000  5.198514751705e-05
9700.00000  9750.00000  5.523421923686e-05
9750.00000  9800.00000  5.415119533026e-05
9800.00000  9850.00000  5.487321126799e-05
9850.00000  9900.00000  4.404297220194e-05
9900.00000  9950.00000  4.909708376610e-05
9950.00000  10000.00000  4.404297220194e-05
