10001.00000  11001.00000  1.717535524716e-05
11001.00000  12001.00000  1.638413101667e-05
12001.00000  13001.00000  1.437712321251e-05
13001.00000  14001.00000  1.416484354091e-05
14001.00000  15001.00000  1.309379610696e-05
15001.00000  16001.00000  1.142450596215e-05
16001.00000  17001.00000  1.076836879541e-05
17001.00000  18001.00000  1.000609179287e-05
18001.00000  19001.00000  9.359603702101e-06
19001.00000  20001.00000  8.732413763301e-06
20001.00000  21001.00000  7.584173721497e-06
21001.00000  22001.00000  7.603471873460e-06
22001.00000  23001.00000  6.802598566991e-06
23001.00000  24001.00000  6.397337375766e-06
24001.00000  25001.00000  6.165759552209e-06
25001.00000  26001.00000  5.471026081538e-06
26001.00000  27001.00000  5.056115814331e-06
27001.00000  28001.00000  4.756994458903e-06
28001.00000  29001.00000  4.371031419641e-06
29001.00000  30001.00000  4.052611912250e-06
30001.00000  31001.00000  4.235944355899e-06
31001.00000  32001.00000  4.033313760287e-06
32001.00000  33001.00000  3.483316429339e-06
33001.00000  34001.00000  3.068406162132e-06
34001.00000  35001.00000  2.962266326335e-06
35001.00000  36001.00000  3.068406162132e-06
36001.00000  37001.00000  3.135949694003e-06
37001.00000  38001.00000  2.479812527258e-06
38001.00000  39001.00000  2.518408831184e-06
39001.00000  40001.00000  2.682443122870e-06
40001.00000  41001.00000  2.373672691461e-06
41001.00000  42001.00000  2.132445791922e-06
42001.00000  43001.00000  1.871920740420e-06
43001.00000  44001.00000  2.074551336033e-06
44001.00000  45001.00000  2.074551336033e-06
45001.00000  46001.00000  1.871920740420e-06
46001.00000  47001.00000  1.929815196310e-06
47001.00000  48001.00000  1.727184600697e-06
48001.00000  49001.00000  1.746482752660e-06
49001.00000  50001.00000  1.756131828642e-06
50001.00000  51001.00000  1.514904929103e-06
51001.00000  52001.00000  1.601746612937e-06
52001.00000  53001.00000  1.466659549195e-06
53001.00000  54001.00000  1.379817865361e-06
54001.00000  55001.00000  1.379817865361e-06
55001.00000  56001.00000  1.341221561435e-06
56001.00000  57001.00000  1.273678029564e-06
57001.00000  58001.00000  1.138590965823e-06
58001.00000  59001.00000  1.196485421712e-06
59001.00000  60001.00000  1.360519713398e-06
60001.00000  61001.00000  1.013152978063e-06
61001.00000  62001.00000  1.090345585915e-06
62001.00000  63001.00000  9.649075981548e-07
63001.00000  64001.00000  9.456094461917e-07
64001.00000  65001.00000  9.456094461917e-07
65001.00000  66001.00000  9.745566741363e-07
66001.00000  67001.00000  8.491186863762e-07
67001.00000  68001.00000  7.526279265607e-07
68001.00000  69001.00000  8.298205344131e-07
69001.00000  70001.00000  8.201714584316e-07
70001.00000  71001.00000  7.622770025423e-07
71001.00000  72001.00000  5.306991789851e-07
72001.00000  73001.00000  8.105223824500e-07
73001.00000  74001.00000  7.333297745976e-07
74001.00000  75001.00000  6.464880907637e-07
75001.00000  76001.00000  6.754353187083e-07
76001.00000  77001.00000  6.657862427268e-07
77001.00000  78001.00000  6.947334706714e-07
78001.00000  79001.00000  6.078917868375e-07
79001.00000  80001.00000  7.043825466530e-07
80001.00000  81001.00000  5.596464069298e-07
81001.00000  82001.00000  5.499973309482e-07
82001.00000  83001.00000  5.114010270220e-07
83001.00000  84001.00000  4.921028750589e-07
84001.00000  85001.00000  5.692954829113e-07
85001.00000  86001.00000  4.921028750589e-07
86001.00000  87001.00000  5.499973309482e-07
87001.00000  88001.00000  5.789445588929e-07
88001.00000  89001.00000  5.017519510405e-07
89001.00000  90001.00000  4.245593431881e-07
90001.00000  91001.00000  3.859630392619e-07
91001.00000  92001.00000  3.956121152435e-07
92001.00000  93001.00000  4.728047230958e-07
93001.00000  94001.00000  4.052611912250e-07
94001.00000  95001.00000  3.377176593542e-07
95001.00000  96001.00000  4.438574951512e-07
96001.00000  97001.00000  4.245593431881e-07
97001.00000  98001.00000  2.798232034649e-07
98001.00000  99001.00000  3.087704314095e-07
99001.00000  100001.00000  3.184195073911e-07
100001.00000  101001.00000  3.377176593542e-07
101001.00000  102001.00000  3.184195073911e-07
102001.00000  103001.00000  2.315778235571e-07
103001.00000  104001.00000  3.087704314095e-07
104001.00000  105001.00000  1.833324436494e-07
105001.00000  106001.00000  2.508759755202e-07
106001.00000  107001.00000  2.798232034649e-07
107001.00000  108001.00000  2.991213554280e-07
108001.00000  109001.00000  2.122796715941e-07
109001.00000  110001.00000  1.736833676679e-07
110001.00000  111001.00000  1.929815196310e-07
111001.00000  112001.00000  2.219287475756e-07
112001.00000  113001.00000  1.350870637417e-07
113001.00000  114001.00000  1.929815196310e-07
114001.00000  115001.00000  2.315778235571e-07
115001.00000  116001.00000  2.508759755202e-07
116001.00000  117001.00000  2.508759755202e-07
117001.00000  118001.00000  1.929815196310e-07
118001.00000  119001.00000  1.350870637417e-07
119001.00000  120001.00000  2.315778235571e-07
120001.00000  121001.00000  1.350870637417e-07
121001.00000  122001.00000  1.640342916863e-07
122001.00000  123001.00000  1.833324436494e-07
123001.00000  124001.00000  9.649075981548e-08
124001.00000  125001.00000  1.350870637417e-07
125001.00000  126001.00000  1.350870637417e-07
126001.00000  127001.00000  1.061398357970e-07
127001.00000  128001.00000  1.061398357970e-07
128001.00000  129001.00000  1.447361397232e-07
129001.00000  130001.00000  1.254379877601e-07
130001.00000  131001.00000  1.640342916863e-07
131001.00000  132001.00000  1.447361397232e-07
132001.00000  133001.00000  1.254379877601e-07
133001.00000  134001.00000  1.350870637417e-07
134001.00000  135001.00000  8.684168383393e-08
135001.00000  136001.00000  1.254379877601e-07
136001.00000  137001.00000  5.789445588929e-08
137001.00000  138001.00000  7.719260785238e-08
138001.00000  139001.00000  2.894722794464e-08
139001.00000  140001.00000  6.754353187083e-08
140001.00000  141001.00000  1.061398357970e-07
141001.00000  142001.00000  7.719260785238e-08
142001.00000  143001.00000  3.859630392619e-08
143001.00000  144001.00000  6.754353187083e-08
144001.00000  145001.00000  6.754353187083e-08
145001.00000  146001.00000  6.754353187083e-08
146001.00000  147001.00000  8.684168383393e-08
147001.00000  148001.00000  6.754353187083e-08
148001.00000  149001.00000  5.789445588929e-08
149001.00000  150001.00000  3.859630392619e-08
150001.00000  151001.00000  7.719260785238e-08
151001.00000  152001.00000  8.684168383393e-08
152001.00000  153001.00000  8.684168383393e-08
153001.00000  154001.00000  1.157889117786e-07
154001.00000  155001.00000  7.719260785238e-08
155001.00000  156001.00000  4.824537990774e-08
156001.00000  157001.00000  3.859630392619e-08
157001.00000  158001.00000  6.754353187083e-08
158001.00000  159001.00000  4.824537990774e-08
159001.00000  160001.00000  9.649075981548e-08
160001.00000  161001.00000  5.789445588929e-08
161001.00000  162001.00000  4.824537990774e-08
162001.00000  163001.00000  7.719260785238e-08
163001.00000  164001.00000  3.859630392619e-08
164001.00000  165001.00000  5.789445588929e-08
165001.00000  166001.00000  7.719260785238e-08
166001.00000  167001.00000  6.754353187083e-08
167001.00000  168001.00000  2.894722794464e-08
168001.00000  169001.00000  4.824537990774e-08
169001.00000  170001.00000  7.719260785238e-08
170001.00000  171001.00000  3.859630392619e-08
171001.00000  172001.00000  3.859630392619e-08
172001.00000  173001.00000  2.894722794464e-08
173001.00000  174001.00000  4.824537990774e-08
174001.00000  175001.00000  7.719260785238e-08
175001.00000  176001.00000  2.894722794464e-08
176001.00000  177001.00000  4.824537990774e-08
177001.00000  178001.00000  4.824537990774e-08
178001.00000  179001.00000  1.929815196310e-08
179001.00000  180001.00000  3.859630392619e-08
180001.00000  181001.00000  2.894722794464e-08
181001.00000  182001.00000  5.789445588929e-08
182001.00000  183001.00000  6.754353187083e-08
183001.00000  184001.00000  0.000000000000e+00
184001.00000  185001.00000  0.000000000000e+00
185001.00000  186001.00000  1.929815196310e-08
186001.00000  187001.00000  1.929815196310e-08
187001.00000  188001.00000  0.000000000000e+00
188001.00000  189001.00000  1.929815196310e-08
189001.00000  190001.00000  9.649075981548e-09
190001.00000  191001.00000  3.859630392619e-08
191001.00000  192001.00000  2.894722794464e-08
192001.00000  193001.00000  5.789445588929e-08
193001.00000  194001.00000  1.929815196310e-08
194001.00000  195001.00000  0.000000000000e+00
195001.00000  196001.00000  1.929815196310e-08
196001.00000  197001.00000  0.000000000000e+00
197001.00000  198001.00000  9.649075981548e-09
198001.00000  199001.00000  0.000000000000e+00
