300.00000  350.00000  3.376451766862e-01
350.00000  400.00000  2.534221755963e-01
400.00000  450.00000  1.972714709827e-01
450.00000  500.00000  1.574015119442e-01
500.00000  550.00000  1.288780310908e-01
550.00000  600.00000  1.070550876227e-01
600.00000  650.00000  9.079914820069e-02
650.00000  700.00000  7.797652415738e-02
700.00000  750.00000  6.747956683502e-02
750.00000  800.00000  5.892935325883e-02
800.00000  850.00000  5.205301574583e-02
850.00000  900.00000  4.643927546949e-02
900.00000  950.00000  4.142232090296e-02
950.00000  1000.00000  3.707405393899e-02
1000.00000  1050.00000  3.367561097823e-02
1050.00000  1100.00000  3.032534228562e-02
1100.00000  1150.00000  2.786989264825e-02
1150.00000  1200.00000  2.563266525538e-02
1200.00000  1250.00000  2.357231651868e-02
1250.00000  1300.00000  2.176829802961e-02
1300.00000  1350.00000  2.003114830081e-02
1350.00000  1400.00000  1.865458656414e-02
1400.00000  1450.00000  1.731074018867e-02
1450.00000  1500.00000  1.620057496463e-02
1500.00000  1550.00000  1.517956808760e-02
1550.00000  1600.00000  1.427216620112e-02
1600.00000  1650.00000  1.336584284302e-02
1650.00000  1700.00000  1.249798699755e-02
1700.00000  1750.00000  1.196339642496e-02
1750.00000  1800.00000  1.118901304006e-02
1800.00000  1850.00000  1.054692913782e-02
1850.00000  1900.00000  1.002528090593e-02
1900.00000  1950.00000  9.444313612518e-03
1950.00000  2000.00000  9.062514562024e-03
2000.00000  2050.00000  8.692938833296e-03
2050.00000  2100.00000  8.081772744934e-03
2100.00000  2150.00000  7.750664528827e-03
2150.00000  2200.00000  7.412006613981e-03
2200.00000  2250.00000  7.089886134468e-03
2250.00000  2300.00000  6.736488331609e-03
2300.00000  2350.00000  6.655239192803e-03
2350.00000  2400.00000  6.285663464076e-03
2400.00000  2450.00000  5.986911099706e-03
2450.00000  2500.00000  5.669104733757e-03
2500.00000  2550.00000  5.474610113872e-03
2550.00000  2600.00000  5.366757274750e-03
2600.00000  2650.00000  5.124447896187e-03
2650.00000  2700.00000  4.921684558636e-03
2700.00000  2750.00000  4.719640240013e-03
2750.00000  2800.00000  4.541683055460e-03
2800.00000  2850.00000  4.380622815704e-03
2850.00000  2900.00000  4.280679184783e-03
2900.00000  2950.00000  4.159884004966e-03
2950.00000  3000.00000  3.964670366153e-03
3000.00000  3050.00000  3.872635943435e-03
3050.00000  3100.00000  3.698633362984e-03
3100.00000  3150.00000  3.608755997048e-03
3150.00000  3200.00000  3.425046661076e-03
3200.00000  3250.00000  3.366446618486e-03
3250.00000  3300.00000  3.264345930783e-03
3300.00000  3350.00000  3.135282033299e-03
3350.00000  3400.00000  3.101128634244e-03
3400.00000  3450.00000  2.929283110575e-03
3450.00000  3500.00000  2.860976312464e-03
3500.00000  3550.00000  2.819632724133e-03
3550.00000  3600.00000  2.730474377125e-03
3600.00000  3650.00000  2.668279239898e-03
3650.00000  3700.00000  2.539934361342e-03
3700.00000  3750.00000  2.484929413389e-03
3750.00000  3800.00000  2.437114654711e-03
3800.00000  3850.00000  2.388580877106e-03
3850.00000  3900.00000  2.294029888142e-03
3900.00000  3950.00000  2.222847014321e-03
3950.00000  4000.00000  2.255562375521e-03
4000.00000  4050.00000  2.172156179933e-03
4050.00000  4100.00000  2.077245681505e-03
4100.00000  4150.00000  2.069695982766e-03
4150.00000  4200.00000  2.010736430712e-03
4200.00000  4250.00000  1.976583031657e-03
4250.00000  4300.00000  1.971190389701e-03
4300.00000  4350.00000  1.837452869188e-03
4350.00000  4400.00000  1.819477396001e-03
4400.00000  4450.00000  1.775976750888e-03
4450.00000  4500.00000  1.768427052150e-03
4500.00000  4550.00000  1.759439315556e-03
4550.00000  4600.00000  1.673516553722e-03
4600.00000  4650.00000  1.616714058451e-03
4650.00000  4700.00000  1.588672320279e-03
4700.00000  4750.00000  1.551283336049e-03
4750.00000  4800.00000  1.521444050559e-03
4800.00000  4850.00000  1.481178990620e-03
4850.00000  4900.00000  1.461765479577e-03
4900.00000  4950.00000  1.453137252448e-03
4950.00000  5000.00000  1.402086908596e-03
5000.00000  5050.00000  1.361821848657e-03
5050.00000  5100.00000  1.319399731935e-03
5100.00000  5150.00000  1.315445127834e-03
5150.00000  5200.00000  1.315804637298e-03
5200.00000  5250.00000  1.255407047389e-03
5250.00000  5300.00000  1.195368966944e-03
5300.00000  5350.00000  1.236353045811e-03
5350.00000  5400.00000  1.178472022148e-03
5400.00000  5450.00000  1.157620473251e-03
5450.00000  5500.00000  1.145397151484e-03
5500.00000  5550.00000  1.160496548961e-03
5550.00000  5600.00000  1.107648657791e-03
5600.00000  5650.00000  1.112322280820e-03
5650.00000  5700.00000  1.075652315518e-03
5700.00000  5750.00000  1.059114880186e-03
5750.00000  5800.00000  1.032870689333e-03
5800.00000  5850.00000  9.922461199296e-04
5850.00000  5900.00000  1.031792160941e-03
5900.00000  5950.00000  9.566546830191e-04
5950.00000  6000.00000  9.731921183512e-04
6000.00000  6050.00000  9.397577382232e-04
6050.00000  6100.00000  9.541381167729e-04
6100.00000  6150.00000  9.512620410629e-04
6150.00000  6200.00000  8.840337713431e-04
6200.00000  6250.00000  8.811576956331e-04
6250.00000  6300.00000  8.944595457916e-04
6300.00000  6350.00000  8.743270158220e-04
6350.00000  6400.00000  9.217822650360e-04
6400.00000  6450.00000  8.398141073027e-04
6450.00000  6500.00000  8.236361814343e-04
6500.00000  6550.00000  7.790570079302e-04
6550.00000  6600.00000  7.830116120314e-04
6600.00000  6650.00000  7.571269306419e-04
6650.00000  6700.00000  8.114128596671e-04
6700.00000  6750.00000  7.341183249624e-04
6750.00000  6800.00000  7.384324385273e-04
6800.00000  6850.00000  6.931342460957e-04
6850.00000  6900.00000  7.125477571378e-04
6900.00000  6950.00000  6.960103218057e-04
6950.00000  7000.00000  7.046385489355e-04
7000.00000  7050.00000  6.888201325308e-04
7050.00000  7100.00000  6.988863975156e-04
7100.00000  7150.00000  6.726422066624e-04
7150.00000  7200.00000  6.431624306355e-04
7200.00000  7250.00000  6.481955631279e-04
7250.00000  7300.00000  6.323771467232e-04
7300.00000  7350.00000  6.514311483016e-04
7350.00000  7400.00000  6.392078265344e-04
7400.00000  7450.00000  6.248274479847e-04
7450.00000  7500.00000  6.255464669121e-04
7500.00000  7550.00000  5.982237476677e-04
7550.00000  7600.00000  5.806077839443e-04
7600.00000  7650.00000  6.010998233776e-04
7650.00000  7700.00000  5.698225000320e-04
7700.00000  7750.00000  5.820458217993e-04
7750.00000  7800.00000  5.680249527133e-04
7800.00000  7850.00000  5.327930252665e-04
7850.00000  7900.00000  5.331525347303e-04
7900.00000  7950.00000  5.453758564975e-04
7950.00000  8000.00000  5.306359684841e-04
8000.00000  8050.00000  4.964825694285e-04
8050.00000  8100.00000  5.277598927741e-04
8100.00000  8150.00000  5.126604952970e-04
8150.00000  8200.00000  5.187721561806e-04
8200.00000  8250.00000  5.087058911958e-04
8250.00000  8300.00000  4.698788691116e-04
8300.00000  8350.00000  4.590935851993e-04
8350.00000  8400.00000  4.950445315736e-04
8400.00000  8450.00000  4.709573975028e-04
8450.00000  8500.00000  4.785070962414e-04
8500.00000  8550.00000  4.713169069666e-04
8550.00000  8600.00000  4.727549448215e-04
8600.00000  8650.00000  4.490273202145e-04
8650.00000  8700.00000  4.468702634321e-04
8700.00000  8750.00000  4.403990930847e-04
8750.00000  8800.00000  4.270972429262e-04
8800.00000  8850.00000  4.411181120122e-04
8850.00000  8900.00000  4.335684132736e-04
8900.00000  8950.00000  4.105598075941e-04
8950.00000  9000.00000  4.030101088555e-04
9000.00000  9050.00000  4.116383359853e-04
9050.00000  9100.00000  4.062456940291e-04
9100.00000  9150.00000  3.828775788859e-04
9150.00000  9200.00000  3.886297303058e-04
9200.00000  9250.00000  4.188285252601e-04
9250.00000  9300.00000  4.022910899280e-04
9300.00000  9350.00000  3.821585599584e-04
9350.00000  9400.00000  3.699352381911e-04
9400.00000  9450.00000  3.720922949736e-04
9450.00000  9500.00000  3.749683706835e-04
9500.00000  9550.00000  3.666996530175e-04
9550.00000  9600.00000  3.835965978134e-04
9600.00000  9650.00000  3.602284826701e-04
9650.00000  9700.00000  3.692162192637e-04
9700.00000  9750.00000  3.260750836145e-04
9750.00000  9800.00000  3.666996530175e-04
9800.00000  9850.00000  3.400959527005e-04
9850.00000  9900.00000  3.505217271490e-04
9900.00000  9950.00000  3.267941025420e-04
9950.00000  10000.00000  3.361413485993e-04
