300.00000  350.00000  4.267921207948e-06
350.00000  400.00000  7.371863904637e-06
400.00000  450.00000  7.759856741723e-06
450.00000  500.00000  1.066980301987e-05
500.00000  550.00000  7.818055667286e-05
550.00000  600.00000  8.341845997353e-06
600.00000  650.00000  3.181541264107e-05
650.00000  700.00000  1.707168483179e-05
700.00000  750.00000  2.774148785166e-05
750.00000  800.00000  1.901164901722e-05
800.00000  850.00000  7.604659606889e-05
850.00000  900.00000  3.317338757087e-05
900.00000  950.00000  3.705331594173e-05
950.00000  1000.00000  4.578315477617e-05
1000.00000  1050.00000  5.606496495895e-05
1050.00000  1100.00000  5.645295779604e-05
1100.00000  1150.00000  7.915053876558e-05
1150.00000  1200.00000  9.583423076028e-05
1200.00000  1250.00000  1.002961483868e-04
1250.00000  1300.00000  1.602410417166e-04
1300.00000  1350.00000  1.280376362384e-04
1350.00000  1400.00000  1.573310954384e-04
1400.00000  1450.00000  1.899224937537e-04
1450.00000  1500.00000  2.324077094146e-04
1500.00000  1550.00000  2.714009895418e-04
1550.00000  1600.00000  3.003064559047e-04
1600.00000  1650.00000  3.338678363127e-04
1650.00000  1700.00000  3.858588764822e-04
1700.00000  1750.00000  4.981828028186e-04
1750.00000  1800.00000  4.764552039418e-04
1800.00000  1850.00000  4.756792182676e-04
1850.00000  1900.00000  4.882889854729e-04
1900.00000  1950.00000  5.707374633538e-04
1950.00000  2000.00000  5.975089691127e-04
2000.00000  2050.00000  6.299063710094e-04
2050.00000  2100.00000  6.778234863895e-04
2100.00000  2150.00000  7.135188274015e-04
2150.00000  2200.00000  7.296205301405e-04
2200.00000  2250.00000  7.610479499445e-04
2250.00000  2300.00000  7.874314628664e-04
2300.00000  2350.00000  8.789977724187e-04
2350.00000  2400.00000  8.442724134995e-04
2400.00000  2450.00000  8.563001914492e-04
2450.00000  2500.00000  7.911173948187e-04
2500.00000  2550.00000  8.085770724876e-04
2550.00000  2600.00000  8.027571799313e-04
2600.00000  2650.00000  7.911173948187e-04
2650.00000  2700.00000  7.897594198889e-04
2700.00000  2750.00000  8.027571799313e-04
2750.00000  2800.00000  7.839395273326e-04
2800.00000  2850.00000  7.596899750147e-04
2850.00000  2900.00000  7.759856741723e-04
2900.00000  2950.00000  7.645398854783e-04
2950.00000  3000.00000  7.926693661671e-04
3000.00000  3050.00000  7.540640788770e-04
3050.00000  3100.00000  7.280685587922e-04
3100.00000  3150.00000  7.251586125141e-04
3150.00000  3200.00000  7.445582543684e-04
3200.00000  3250.00000  6.954771604770e-04
3250.00000  3300.00000  6.541559233273e-04
3300.00000  3350.00000  6.698696332293e-04
3350.00000  3400.00000  6.535739340717e-04
3400.00000  3450.00000  6.275784139869e-04
3450.00000  3500.00000  6.196245608266e-04
3500.00000  3550.00000  6.138046682703e-04
3550.00000  3600.00000  5.965389870200e-04
3600.00000  3650.00000  5.784973200955e-04
3650.00000  3700.00000  5.889731266968e-04
3700.00000  3750.00000  5.612316388451e-04
3750.00000  3800.00000  5.381460650385e-04
3800.00000  3850.00000  5.179704375100e-04
3850.00000  3900.00000  5.045846846306e-04
3900.00000  3950.00000  5.094345950941e-04
3950.00000  4000.00000  4.894529639842e-04
4000.00000  4050.00000  4.863490212875e-04
4050.00000  4100.00000  4.624874618067e-04
4100.00000  4150.00000  4.560855799948e-04
4150.00000  4200.00000  4.430878199524e-04
4200.00000  4250.00000  4.345519775365e-04
4250.00000  4300.00000  4.285380885617e-04
4300.00000  4350.00000  4.017665828027e-04
4350.00000  4400.00000  3.872168514120e-04
4400.00000  4450.00000  3.736371021140e-04
4450.00000  4500.00000  3.713091450915e-04
4500.00000  4550.00000  3.833369230411e-04
4550.00000  4600.00000  3.521034996557e-04
4600.00000  4650.00000  3.546254530968e-04
4650.00000  4700.00000  3.656832489537e-04
4700.00000  4750.00000  3.517155068186e-04
4750.00000  4800.00000  3.245560082226e-04
4800.00000  4850.00000  3.171841443179e-04
4850.00000  4900.00000  3.167961514809e-04
4900.00000  4950.00000  3.043803806941e-04
4950.00000  5000.00000  3.090362947391e-04
5000.00000  5050.00000  3.057383556239e-04
5050.00000  5100.00000  2.937105776742e-04
5100.00000  5150.00000  2.803248247948e-04
5150.00000  5200.00000  2.737289465643e-04
5200.00000  5250.00000  2.632531399630e-04
5250.00000  5300.00000  2.640291256371e-04
5300.00000  5350.00000  2.481214193166e-04
5350.00000  5400.00000  2.531653261987e-04
5400.00000  5450.00000  2.533593226173e-04
5450.00000  5500.00000  2.302737488106e-04
5500.00000  5550.00000  2.327957022517e-04
5550.00000  5600.00000  2.314377273219e-04
5600.00000  5650.00000  2.333776915073e-04
5650.00000  5700.00000  2.357056485298e-04
5700.00000  5750.00000  2.252298419285e-04
5750.00000  5800.00000  2.143660424901e-04
5800.00000  5850.00000  2.165000030941e-04
5850.00000  5900.00000  2.170819923497e-04
5900.00000  5950.00000  1.988463290067e-04
5950.00000  6000.00000  1.943844113802e-04
6000.00000  6050.00000  1.998163110994e-04
6050.00000  6100.00000  1.870125474755e-04
6100.00000  6150.00000  1.827446262676e-04
6150.00000  6200.00000  1.938024221245e-04
6200.00000  6250.00000  1.938024221245e-04
6250.00000  6300.00000  1.916684615206e-04
6300.00000  6350.00000  1.893405044981e-04
6350.00000  6400.00000  9.680421285300e-04
6400.00000  6450.00000  1.643149665060e-04
6450.00000  6500.00000  1.594650560424e-04
6500.00000  6550.00000  1.730448053404e-04
6550.00000  6600.00000  1.672249127841e-04
6600.00000  6650.00000  1.548091419974e-04
6650.00000  6700.00000  1.633449844133e-04
6700.00000  6750.00000  1.363794822358e-04
6750.00000  6800.00000  1.579130846941e-04
6800.00000  6850.00000  1.586890703682e-04
6850.00000  6900.00000  1.565551097643e-04
6900.00000  6950.00000  1.586890703682e-04
6950.00000  7000.00000  1.369614714914e-04
7000.00000  7050.00000  1.350215073060e-04
7050.00000  7100.00000  2.281397882067e-04
7100.00000  7150.00000  1.144578869404e-04
7150.00000  7200.00000  1.053400552689e-04
7200.00000  7250.00000  1.070860230358e-04
7250.00000  7300.00000  1.150398761961e-04
7300.00000  7350.00000  9.777419494572e-05
7350.00000  7400.00000  1.047580660133e-04
7400.00000  7450.00000  1.016541233166e-04
7450.00000  7500.00000  1.305595896795e-04
7500.00000  7550.00000  9.952016271260e-05
7550.00000  7600.00000  1.037880839206e-04
7600.00000  7650.00000  1.053400552689e-04
7650.00000  7700.00000  1.030120982464e-04
7700.00000  7750.00000  9.428225941194e-05
7750.00000  7800.00000  1.014601268980e-04
7800.00000  7850.00000  9.544623792320e-05
7850.00000  7900.00000  8.749238476293e-05
7900.00000  7950.00000  9.428225941194e-05
7950.00000  8000.00000  9.214829880797e-05
8000.00000  8050.00000  8.497043132187e-05
8050.00000  8100.00000  8.186648862518e-05
8100.00000  8150.00000  9.059632745962e-05
8150.00000  8200.00000  8.768638118147e-05
8200.00000  8250.00000  8.400044922916e-05
8250.00000  8300.00000  8.574641699604e-05
8300.00000  8350.00000  8.885035969273e-05
8350.00000  8400.00000  8.050851369538e-05
8400.00000  8450.00000  8.438844206624e-05
8450.00000  8500.00000  8.128449936955e-05
8500.00000  8550.00000  8.128449936955e-05
8550.00000  8600.00000  7.604659606889e-05
8600.00000  8650.00000  7.856854950995e-05
8650.00000  8700.00000  8.322446355498e-05
8700.00000  8750.00000  8.128449936955e-05
8750.00000  8800.00000  7.585259965035e-05
8800.00000  8850.00000  7.080869276823e-05
8850.00000  8900.00000  6.983871067551e-05
8900.00000  8950.00000  6.945071783842e-05
8950.00000  9000.00000  7.274865695366e-05
9000.00000  9050.00000  7.565860323180e-05
9050.00000  9100.00000  8.031451727684e-05
9100.00000  9150.00000  7.236066411657e-05
9150.00000  9200.00000  6.363082528213e-05
9200.00000  9250.00000  6.867473216425e-05
9250.00000  9300.00000  6.363082528213e-05
9300.00000  9350.00000  6.673476797882e-05
9350.00000  9400.00000  6.945071783842e-05
9400.00000  9450.00000  6.246684677087e-05
9450.00000  9500.00000  6.421281453776e-05
9500.00000  9550.00000  6.848073574571e-05
9550.00000  9600.00000  6.770475007154e-05
9600.00000  9650.00000  6.848073574571e-05
9650.00000  9700.00000  6.576478588611e-05
9700.00000  9750.00000  6.343682886359e-05
9750.00000  9800.00000  5.897491123710e-05
9800.00000  9850.00000  6.227285035233e-05
9850.00000  9900.00000  6.207885393379e-05
9900.00000  9950.00000  6.052688258544e-05
9950.00000  10000.00000  6.013888974836e-05
