300.00000  350.00000  0.000000000000e+00
350.00000  400.00000  0.000000000000e+00
400.00000  450.00000  0.000000000000e+00
450.00000  500.00000  0.000000000000e+00
500.00000  550.00000  3.458242389268e-06
550.00000  600.00000  0.000000000000e+00
600.00000  650.00000  1.921245771816e-06
650.00000  700.00000  0.000000000000e+00
700.00000  750.00000  7.684983087263e-07
750.00000  800.00000  3.842491543631e-07
800.00000  850.00000  7.684983087263e-06
850.00000  900.00000  3.842491543631e-07
900.00000  950.00000  0.000000000000e+00
950.00000  1000.00000  0.000000000000e+00
1000.00000  1050.00000  1.152747463089e-06
1050.00000  1100.00000  3.842491543631e-07
1100.00000  1150.00000  1.152747463089e-06
1150.00000  1200.00000  3.842491543631e-07
1200.00000  1250.00000  3.842491543631e-06
1250.00000  1300.00000  3.112418150341e-05
1300.00000  1350.00000  1.844395940943e-05
1350.00000  1400.00000  3.611942051013e-05
1400.00000  1450.00000  6.493810708737e-05
1450.00000  1500.00000  1.049000191411e-04
1500.00000  1550.00000  1.494729210473e-04
1550.00000  1600.00000  2.324707383897e-04
1600.00000  1650.00000  3.150843065778e-04
1650.00000  1700.00000  4.826169378801e-04
1700.00000  1750.00000  6.747415150617e-04
1750.00000  1800.00000  7.688825578806e-04
1800.00000  1850.00000  8.768565702567e-04
1850.00000  1900.00000  9.018327652903e-04
1900.00000  1950.00000  1.154668708861e-03
1950.00000  2000.00000  1.389060693023e-03
2000.00000  2050.00000  1.583490765130e-03
2050.00000  2100.00000  1.734884931950e-03
2100.00000  2150.00000  1.901264815789e-03
2150.00000  2200.00000  2.119134086313e-03
2200.00000  2250.00000  2.359674056944e-03
2250.00000  2300.00000  2.557946620595e-03
2300.00000  2350.00000  2.960639734368e-03
2350.00000  2400.00000  2.884942650958e-03
2400.00000  2450.00000  3.129709362288e-03
2450.00000  2500.00000  3.077451477294e-03
2500.00000  2550.00000  2.971782959844e-03
2550.00000  2600.00000  3.084752211227e-03
2600.00000  2650.00000  3.273418546020e-03
2650.00000  2700.00000  3.331824417483e-03
2700.00000  2750.00000  3.489366570772e-03
2750.00000  2800.00000  3.650751215604e-03
2800.00000  2850.00000  3.653440959685e-03
2850.00000  2900.00000  3.719147565081e-03
2900.00000  2950.00000  3.736438777027e-03
2950.00000  3000.00000  3.890522687927e-03
3000.00000  3050.00000  3.855556014880e-03
3050.00000  3100.00000  3.992732962987e-03
3100.00000  3150.00000  3.946238815309e-03
3150.00000  3200.00000  3.967756767954e-03
3200.00000  3250.00000  3.866314991202e-03
3250.00000  3300.00000  3.924720862665e-03
3300.00000  3350.00000  3.948544310236e-03
3350.00000  3400.00000  3.850560775873e-03
3400.00000  3450.00000  3.859782755578e-03
3450.00000  3500.00000  3.914730384652e-03
3500.00000  3550.00000  3.941243576303e-03
3550.00000  3600.00000  3.961224532330e-03
3600.00000  3650.00000  3.908582398182e-03
3650.00000  3700.00000  3.862088250504e-03
3700.00000  3750.00000  3.842107294477e-03
3750.00000  3800.00000  3.780243180625e-03
3800.00000  3850.00000  3.758340978826e-03
3850.00000  3900.00000  3.719916063389e-03
3900.00000  3950.00000  3.731827787175e-03
3950.00000  4000.00000  3.636918246047e-03
4000.00000  4050.00000  3.561605411792e-03
4050.00000  4100.00000  3.528944233671e-03
4100.00000  4150.00000  3.434803190852e-03
4150.00000  4200.00000  3.435571689161e-03
4200.00000  4250.00000  3.463237628275e-03
4250.00000  4300.00000  3.412516739899e-03
4300.00000  4350.00000  3.339125151416e-03
4350.00000  4400.00000  3.233456633966e-03
4400.00000  4450.00000  3.153917059013e-03
4450.00000  4500.00000  3.203100950771e-03
4500.00000  4550.00000  3.188499482905e-03
4550.00000  4600.00000  3.105885914717e-03
4600.00000  4650.00000  3.088594702771e-03
4650.00000  4700.00000  3.052091033106e-03
4700.00000  4750.00000  2.982541936167e-03
4750.00000  4800.00000  2.973704205616e-03
4800.00000  4850.00000  2.938353283415e-03
4850.00000  4900.00000  2.859966455925e-03
4900.00000  4950.00000  2.806555823468e-03
4950.00000  5000.00000  2.811551062475e-03
5000.00000  5050.00000  2.668610377052e-03
5050.00000  5100.00000  2.697044814475e-03
5100.00000  5150.00000  2.668610377052e-03
5150.00000  5200.00000  2.682059097455e-03
5200.00000  5250.00000  2.622500478528e-03
5250.00000  5300.00000  2.593297542797e-03
5300.00000  5350.00000  2.532201927253e-03
5350.00000  5400.00000  2.561020613830e-03
5400.00000  5450.00000  2.428838904729e-03
5450.00000  5500.00000  2.429223153884e-03
5500.00000  5550.00000  2.422690918260e-03
5550.00000  5600.00000  2.328549875441e-03
5600.00000  5650.00000  2.351604824702e-03
5650.00000  5700.00000  2.247473303870e-03
5700.00000  5750.00000  2.252852792031e-03
5750.00000  5800.00000  2.158711749212e-03
5800.00000  5850.00000  2.172928967924e-03
5850.00000  5900.00000  2.136041049105e-03
5900.00000  5950.00000  2.127971816863e-03
5950.00000  6000.00000  2.111833352380e-03
6000.00000  6050.00000  2.100690126903e-03
6050.00000  6100.00000  2.043437002903e-03
6100.00000  6150.00000  1.990026370447e-03
6150.00000  6200.00000  1.960439185561e-03
6200.00000  6250.00000  1.946606216004e-03
6250.00000  6300.00000  1.944300721077e-03
6300.00000  6350.00000  1.891658586930e-03
6350.00000  6400.00000  2.632106707387e-03
6400.00000  6450.00000  1.861302903735e-03
6450.00000  6500.00000  1.788679813560e-03
6500.00000  6550.00000  1.756402884594e-03
6550.00000  6600.00000  1.757939881211e-03
6600.00000  6650.00000  1.734116433641e-03
6650.00000  6700.00000  1.711829982688e-03
6700.00000  6750.00000  1.629216414500e-03
6750.00000  6800.00000  1.653808360379e-03
6800.00000  6850.00000  1.627679417882e-03
6850.00000  6900.00000  1.613846448325e-03
6900.00000  6950.00000  1.612309451708e-03
6950.00000  7000.00000  1.576190031198e-03
7000.00000  7050.00000  1.580801021050e-03
7050.00000  7100.00000  1.624605424647e-03
7100.00000  7150.00000  1.438244584781e-03
7150.00000  7200.00000  1.383681204862e-03
7200.00000  7250.00000  1.357936511519e-03
7250.00000  7300.00000  1.359473508137e-03
7300.00000  7350.00000  1.334881562258e-03
7350.00000  7400.00000  1.310673865533e-03
7400.00000  7450.00000  1.262642721237e-03
7450.00000  7500.00000  1.321432841855e-03
7500.00000  7550.00000  1.239587771975e-03
7550.00000  7600.00000  1.227676048190e-03
7600.00000  7650.00000  1.210769085398e-03
7650.00000  7700.00000  1.218838317640e-03
7700.00000  7750.00000  1.180413402204e-03
7750.00000  7800.00000  1.192709375143e-03
7800.00000  7850.00000  1.152363213935e-03
7850.00000  7900.00000  1.176955159814e-03
7900.00000  7950.00000  1.118933537505e-03
7950.00000  8000.00000  1.133535005371e-03
8000.00000  8050.00000  1.141988486767e-03
8050.00000  8100.00000  1.090114850928e-03
8100.00000  8150.00000  1.081277120378e-03
8150.00000  8200.00000  1.106253315411e-03
8200.00000  8250.00000  1.067059901666e-03
8250.00000  8300.00000  1.068981147438e-03
8300.00000  8350.00000  1.058606420270e-03
8350.00000  8400.00000  1.023639747223e-03
8400.00000  8450.00000  1.002121794579e-03
8450.00000  8500.00000  1.002121794579e-03
8500.00000  8550.00000  9.759928520824e-04
8550.00000  8600.00000  9.759928520824e-04
8600.00000  8650.00000  9.675393706864e-04
8650.00000  8700.00000  9.886730741763e-04
8700.00000  8750.00000  9.617756333709e-04
8750.00000  8800.00000  9.360309400286e-04
8800.00000  8850.00000  9.410261790353e-04
8850.00000  8900.00000  9.160499840017e-04
8900.00000  8950.00000  9.298829535588e-04
8950.00000  9000.00000  8.872312974245e-04
9000.00000  9050.00000  9.145129873843e-04
9050.00000  9100.00000  8.953005296661e-04
9100.00000  9150.00000  8.768565702567e-04
9150.00000  9200.00000  8.342049141224e-04
9200.00000  9250.00000  8.399686514378e-04
9250.00000  9300.00000  8.445796412902e-04
9300.00000  9350.00000  8.349734124311e-04
9350.00000  9400.00000  8.295939242700e-04
9400.00000  9450.00000  8.161452038673e-04
9450.00000  9500.00000  8.238301869546e-04
9500.00000  9550.00000  7.927060054511e-04
9550.00000  9600.00000  8.392001531291e-04
9600.00000  9650.00000  8.038492309277e-04
9650.00000  9700.00000  8.003909885384e-04
9700.00000  9750.00000  7.861737698270e-04
9750.00000  9800.00000  7.654243154914e-04
9800.00000  9850.00000  7.454433594645e-04
9850.00000  9900.00000  7.419851170752e-04
9900.00000  9950.00000  7.604290764846e-04
9950.00000  10000.00000  7.158561745785e-04
