300.00000  350.00000  3.660335441191e-06
350.00000  400.00000  8.669215518609e-06
400.00000  450.00000  4.623581609925e-06
450.00000  500.00000  7.705969349875e-06
500.00000  550.00000  6.164775479900e-05
550.00000  600.00000  6.357424713647e-06
600.00000  650.00000  1.714578180347e-05
650.00000  700.00000  5.394178544913e-06
700.00000  750.00000  1.483399099851e-05
750.00000  800.00000  7.898618583622e-06
800.00000  850.00000  4.816230843672e-05
850.00000  900.00000  7.320670882381e-06
900.00000  950.00000  7.128021648634e-06
950.00000  1000.00000  8.091267817369e-06
1000.00000  1050.00000  1.136630479107e-05
1050.00000  1100.00000  7.320670882381e-06
1100.00000  1150.00000  9.247163219850e-06
1150.00000  1200.00000  8.283917051116e-06
1200.00000  1250.00000  8.669215518609e-06
1250.00000  1300.00000  3.101652663325e-05
1300.00000  1350.00000  1.117365555732e-05
1350.00000  1400.00000  1.155895402481e-05
1400.00000  1450.00000  1.001776015484e-05
1450.00000  1500.00000  1.464134176476e-05
1500.00000  1550.00000  1.387074482978e-05
1550.00000  1600.00000  1.464134176476e-05
1600.00000  1650.00000  1.464134176476e-05
1650.00000  1700.00000  1.444869253102e-05
1700.00000  1750.00000  5.124469617667e-05
1750.00000  1800.00000  1.271484942729e-05
1800.00000  1850.00000  1.656783410223e-05
1850.00000  1900.00000  1.695313256973e-05
1900.00000  1950.00000  1.464134176476e-05
1950.00000  2000.00000  1.695313256973e-05
2000.00000  2050.00000  1.521928946600e-05
2050.00000  2100.00000  1.868697567345e-05
2100.00000  2150.00000  1.753108027097e-05
2150.00000  2200.00000  1.618253563474e-05
2200.00000  2250.00000  1.945757260843e-05
2250.00000  2300.00000  2.080611724466e-05
2300.00000  2350.00000  5.702417318908e-05
2350.00000  2400.00000  2.042081877717e-05
2400.00000  2450.00000  1.945757260843e-05
2450.00000  2500.00000  2.099876647841e-05
2500.00000  2550.00000  1.676048333598e-05
2550.00000  2600.00000  2.003552030968e-05
2600.00000  2650.00000  2.080611724466e-05
2650.00000  2700.00000  2.253996034838e-05
2700.00000  2750.00000  1.753108027097e-05
2750.00000  2800.00000  2.234731111464e-05
2800.00000  2850.00000  2.003552030968e-05
2850.00000  2900.00000  2.504440038709e-05
2900.00000  2950.00000  1.965022184218e-05
2950.00000  3000.00000  3.679600364565e-05
3000.00000  3050.00000  2.119141571216e-05
3050.00000  3100.00000  2.176936341340e-05
3100.00000  3150.00000  1.676048333598e-05
3150.00000  3200.00000  2.331055728337e-05
3200.00000  3250.00000  1.887962490719e-05
3250.00000  3300.00000  2.119141571216e-05
3300.00000  3350.00000  2.080611724466e-05
3350.00000  3400.00000  2.234731111464e-05
3400.00000  3450.00000  2.196201264714e-05
3450.00000  3500.00000  2.138406494590e-05
3500.00000  3550.00000  2.273260958213e-05
3550.00000  3600.00000  2.581499732208e-05
3600.00000  3650.00000  2.311790804963e-05
3650.00000  3700.00000  3.641070517816e-05
3700.00000  3750.00000  2.042081877717e-05
3750.00000  3800.00000  2.658559425707e-05
3800.00000  3850.00000  2.562234808833e-05
3850.00000  3900.00000  2.042081877717e-05
3900.00000  3950.00000  2.196201264714e-05
3950.00000  4000.00000  2.157671417965e-05
4000.00000  4050.00000  2.215466188089e-05
4050.00000  4100.00000  2.542969885459e-05
4100.00000  4150.00000  2.215466188089e-05
4150.00000  4200.00000  2.042081877717e-05
4200.00000  4250.00000  2.350320651712e-05
4250.00000  4300.00000  1.791637873846e-05
4300.00000  4350.00000  2.196201264714e-05
4350.00000  4400.00000  2.350320651712e-05
4400.00000  4450.00000  2.311790804963e-05
4450.00000  4500.00000  2.851208659454e-05
4500.00000  4550.00000  2.485175115335e-05
4550.00000  4600.00000  2.196201264714e-05
4600.00000  4650.00000  2.523704962084e-05
4650.00000  4700.00000  2.542969885459e-05
4700.00000  4750.00000  2.234731111464e-05
4750.00000  4800.00000  2.620029578958e-05
4800.00000  4850.00000  2.331055728337e-05
4850.00000  4900.00000  2.119141571216e-05
4900.00000  4950.00000  2.504440038709e-05
4950.00000  5000.00000  2.369585575087e-05
5000.00000  5050.00000  2.465910191960e-05
5050.00000  5100.00000  2.427380345211e-05
5100.00000  5150.00000  2.369585575087e-05
5150.00000  5200.00000  2.793413889330e-05
5200.00000  5250.00000  2.562234808833e-05
5250.00000  5300.00000  2.331055728337e-05
5300.00000  5350.00000  2.119141571216e-05
5350.00000  5400.00000  2.716354195831e-05
5400.00000  5450.00000  3.101652663325e-05
5450.00000  5500.00000  2.774148965955e-05
5500.00000  5550.00000  2.639294502332e-05
5550.00000  5600.00000  2.215466188089e-05
5600.00000  5650.00000  2.658559425707e-05
5650.00000  5700.00000  2.600764655583e-05
5700.00000  5750.00000  2.600764655583e-05
5750.00000  5800.00000  2.562234808833e-05
5800.00000  5850.00000  2.870473582828e-05
5850.00000  5900.00000  3.024592969826e-05
5900.00000  5950.00000  2.909003429578e-05
5950.00000  6000.00000  2.812678812704e-05
6000.00000  6050.00000  2.889738506203e-05
6050.00000  6100.00000  2.793413889330e-05
6100.00000  6150.00000  3.352096667196e-05
6150.00000  6200.00000  3.043857893201e-05
6200.00000  6250.00000  5.028145000794e-05
6250.00000  6300.00000  6.492279177270e-05
6300.00000  6350.00000  6.742723181141e-05
6350.00000  6400.00000  5.712049780595e-04
6400.00000  6450.00000  2.600764655583e-05
6450.00000  6500.00000  3.140182510074e-05
6500.00000  6550.00000  3.082387739950e-05
6550.00000  6600.00000  2.754884042580e-05
6600.00000  6650.00000  2.369585575087e-05
6650.00000  6700.00000  2.851208659454e-05
6700.00000  6750.00000  2.889738506203e-05
6750.00000  6800.00000  3.236507126948e-05
6800.00000  6850.00000  2.677824349082e-05
6850.00000  6900.00000  3.641070517816e-05
6900.00000  6950.00000  3.063122816575e-05
6950.00000  7000.00000  3.140182510074e-05
7000.00000  7050.00000  3.275036973697e-05
7050.00000  7100.00000  8.515096131612e-05
7100.00000  7150.00000  1.618253563474e-05
7150.00000  7200.00000  1.868697567345e-05
7200.00000  7250.00000  1.290749866104e-05
7250.00000  7300.00000  1.695313256973e-05
7300.00000  7350.00000  1.830167720595e-05
7350.00000  7400.00000  1.464134176476e-05
7400.00000  7450.00000  1.618253563474e-05
7450.00000  7500.00000  3.236507126948e-05
7500.00000  7550.00000  1.598988640099e-05
7550.00000  7600.00000  1.598988640099e-05
7600.00000  7650.00000  2.080611724466e-05
7650.00000  7700.00000  2.215466188089e-05
7700.00000  7750.00000  1.676048333598e-05
7750.00000  7800.00000  1.598988640099e-05
7800.00000  7850.00000  1.695313256973e-05
7850.00000  7900.00000  1.521928946600e-05
7900.00000  7950.00000  2.119141571216e-05
7950.00000  8000.00000  1.252220019355e-05
8000.00000  8050.00000  1.579723716724e-05
8050.00000  8100.00000  1.502664023226e-05
8100.00000  8150.00000  1.733843103722e-05
8150.00000  8200.00000  1.444869253102e-05
8200.00000  8250.00000  1.714578180347e-05
8250.00000  8300.00000  2.003552030968e-05
8300.00000  8350.00000  1.810902797221e-05
8350.00000  8400.00000  1.579723716724e-05
8400.00000  8450.00000  1.579723716724e-05
8450.00000  8500.00000  2.099876647841e-05
8500.00000  8550.00000  1.676048333598e-05
8550.00000  8600.00000  1.868697567345e-05
8600.00000  8650.00000  2.042081877717e-05
8650.00000  8700.00000  1.483399099851e-05
8700.00000  8750.00000  1.810902797221e-05
8750.00000  8800.00000  1.618253563474e-05
8800.00000  8850.00000  1.695313256973e-05
8850.00000  8900.00000  1.502664023226e-05
8900.00000  8950.00000  1.907227414094e-05
8950.00000  9000.00000  1.810902797221e-05
9000.00000  9050.00000  1.521928946600e-05
9050.00000  9100.00000  1.676048333598e-05
9100.00000  9150.00000  2.215466188089e-05
9150.00000  9200.00000  1.598988640099e-05
9200.00000  9250.00000  1.714578180347e-05
9250.00000  9300.00000  2.119141571216e-05
9300.00000  9350.00000  1.887962490719e-05
9350.00000  9400.00000  1.810902797221e-05
9400.00000  9450.00000  1.560458793350e-05
9450.00000  9500.00000  1.618253563474e-05
9500.00000  9550.00000  1.656783410223e-05
9550.00000  9600.00000  1.521928946600e-05
9600.00000  9650.00000  1.965022184218e-05
9650.00000  9700.00000  2.042081877717e-05
9700.00000  9750.00000  1.637518486848e-05
9750.00000  9800.00000  2.331055728337e-05
9800.00000  9850.00000  1.753108027097e-05
9850.00000  9900.00000  2.408115421836e-05
9900.00000  9950.00000  1.984287107593e-05
9950.00000  10000.00000  1.907227414094e-05
