10001.00000  11001.00000  2.493585149088e-04
11001.00000  12001.00000  2.000206316476e-04
12001.00000  13001.00000  1.562635909192e-04
13001.00000  14001.00000  1.287233462463e-04
14001.00000  15001.00000  1.088264293901e-04
15001.00000  16001.00000  8.678614547426e-05
16001.00000  17001.00000  7.744430036496e-05
17001.00000  18001.00000  6.559512020469e-05
18001.00000  19001.00000  5.317976761354e-05
19001.00000  20001.00000  4.666878465857e-05
20001.00000  21001.00000  3.979383371234e-05
21001.00000  22001.00000  3.445563650702e-05
22001.00000  23001.00000  3.166521524061e-05
23001.00000  24001.00000  2.640789981113e-05
24001.00000  25001.00000  2.487114607021e-05
25001.00000  26001.00000  2.175719770044e-05
26001.00000  27001.00000  1.747046358103e-05
27001.00000  28001.00000  1.738958180519e-05
28001.00000  29001.00000  1.504401030588e-05
29001.00000  30001.00000  1.342637478912e-05
30001.00000  31001.00000  1.156609394485e-05
31001.00000  32001.00000  1.112124417774e-05
32001.00000  33001.00000  9.948458428084e-06
33001.00000  34001.00000  8.896995342189e-06
34001.00000  35001.00000  8.169059359646e-06
35001.00000  36001.00000  7.926414032132e-06
36001.00000  37001.00000  6.147014963694e-06
37001.00000  38001.00000  6.147014963694e-06
38001.00000  39001.00000  5.419078981152e-06
39001.00000  40001.00000  5.459519869071e-06
40001.00000  41001.00000  4.327175007337e-06
41001.00000  42001.00000  4.124970567742e-06
42001.00000  43001.00000  3.882325240228e-06
43001.00000  44001.00000  3.518357248957e-06
44001.00000  45001.00000  3.275711921442e-06
45001.00000  46001.00000  2.749980378495e-06
46001.00000  47001.00000  2.911743930171e-06
47001.00000  48001.00000  2.790421266414e-06
48001.00000  49001.00000  2.345571499304e-06
49001.00000  50001.00000  2.466894163062e-06
50001.00000  51001.00000  2.507335050981e-06
51001.00000  52001.00000  2.183807947628e-06
52001.00000  53001.00000  1.698517292600e-06
53001.00000  54001.00000  1.860280844276e-06
54001.00000  55001.00000  1.415431077166e-06
55001.00000  56001.00000  1.455871965085e-06
56001.00000  57001.00000  1.374990189247e-06
57001.00000  58001.00000  1.496312853005e-06
58001.00000  59001.00000  1.132344861733e-06
59001.00000  60001.00000  1.617635516762e-06
60001.00000  61001.00000  1.011022197976e-06
61001.00000  62001.00000  1.011022197976e-06
62001.00000  63001.00000  1.172785749652e-06
63001.00000  64001.00000  1.091903973814e-06
64001.00000  65001.00000  6.470542067047e-07
65001.00000  66001.00000  1.213226637571e-06
66001.00000  67001.00000  5.257315429475e-07
67001.00000  68001.00000  9.705813100570e-07
68001.00000  69001.00000  4.852906550285e-07
69001.00000  70001.00000  6.874950946237e-07
70001.00000  71001.00000  7.279359825427e-07
71001.00000  72001.00000  7.683768704618e-07
72001.00000  73001.00000  4.044088791904e-07
73001.00000  74001.00000  5.257315429475e-07
74001.00000  75001.00000  4.852906550285e-07
75001.00000  76001.00000  4.852906550285e-07
76001.00000  77001.00000  6.470542067047e-07
77001.00000  78001.00000  5.257315429475e-07
78001.00000  79001.00000  4.448497671095e-07
79001.00000  80001.00000  2.022044395952e-07
80001.00000  81001.00000  3.639679912714e-07
81001.00000  82001.00000  3.235271033523e-07
82001.00000  83001.00000  2.830862154333e-07
83001.00000  84001.00000  1.617635516762e-07
84001.00000  85001.00000  1.213226637571e-07
85001.00000  86001.00000  4.852906550285e-07
86001.00000  87001.00000  1.617635516762e-07
87001.00000  88001.00000  8.088177583808e-08
88001.00000  89001.00000  2.426453275142e-07
89001.00000  90001.00000  8.088177583808e-08
90001.00000  91001.00000  1.617635516762e-07
91001.00000  92001.00000  2.426453275142e-07
92001.00000  93001.00000  0.000000000000e+00
93001.00000  94001.00000  1.617635516762e-07
94001.00000  95001.00000  8.088177583808e-08
95001.00000  96001.00000  1.617635516762e-07
96001.00000  97001.00000  1.213226637571e-07
97001.00000  98001.00000  1.617635516762e-07
98001.00000  99001.00000  1.617635516762e-07
99001.00000  100001.00000  4.044088791904e-08
100001.00000  101001.00000  1.213226637571e-07
101001.00000  102001.00000  4.044088791904e-08
102001.00000  103001.00000  2.022044395952e-07
103001.00000  104001.00000  1.213226637571e-07
104001.00000  105001.00000  1.617635516762e-07
105001.00000  106001.00000  1.213226637571e-07
106001.00000  107001.00000  1.617635516762e-07
107001.00000  108001.00000  2.022044395952e-07
108001.00000  109001.00000  0.000000000000e+00
109001.00000  110001.00000  1.213226637571e-07
110001.00000  111001.00000  4.044088791904e-08
111001.00000  112001.00000  4.044088791904e-08
112001.00000  113001.00000  8.088177583808e-08
113001.00000  114001.00000  4.044088791904e-08
114001.00000  115001.00000  4.044088791904e-08
115001.00000  116001.00000  0.000000000000e+00
116001.00000  117001.00000  4.044088791904e-08
117001.00000  118001.00000  1.213226637571e-07
118001.00000  119001.00000  1.213226637571e-07
119001.00000  120001.00000  0.000000000000e+00
120001.00000  121001.00000  8.088177583808e-08
121001.00000  122001.00000  4.044088791904e-08
122001.00000  123001.00000  4.044088791904e-08
123001.00000  124001.00000  8.088177583808e-08
124001.00000  125001.00000  4.044088791904e-08
125001.00000  126001.00000  1.213226637571e-07
126001.00000  127001.00000  1.213226637571e-07
127001.00000  128001.00000  8.088177583808e-08
128001.00000  129001.00000  4.044088791904e-08
129001.00000  130001.00000  4.044088791904e-08
130001.00000  131001.00000  4.044088791904e-08
131001.00000  132001.00000  8.088177583808e-08
132001.00000  133001.00000  4.044088791904e-08
133001.00000  134001.00000  4.044088791904e-08
134001.00000  135001.00000  8.088177583808e-08
135001.00000  136001.00000  0.000000000000e+00
136001.00000  137001.00000  0.000000000000e+00
137001.00000  138001.00000  0.000000000000e+00
138001.00000  139001.00000  4.044088791904e-08
139001.00000  140001.00000  0.000000000000e+00
140001.00000  141001.00000  0.000000000000e+00
141001.00000  142001.00000  0.000000000000e+00
142001.00000  143001.00000  0.000000000000e+00
143001.00000  144001.00000  0.000000000000e+00
144001.00000  145001.00000  0.000000000000e+00
145001.00000  146001.00000  0.000000000000e+00
146001.00000  147001.00000  8.088177583808e-08
147001.00000  148001.00000  0.000000000000e+00
148001.00000  149001.00000  0.000000000000e+00
149001.00000  150001.00000  0.000000000000e+00
150001.00000  151001.00000  4.044088791904e-08
151001.00000  152001.00000  0.000000000000e+00
152001.00000  153001.00000  0.000000000000e+00
153001.00000  154001.00000  4.044088791904e-08
154001.00000  155001.00000  0.000000000000e+00
155001.00000  156001.00000  8.088177583808e-08
156001.00000  157001.00000  0.000000000000e+00
157001.00000  158001.00000  0.000000000000e+00
158001.00000  159001.00000  0.000000000000e+00
159001.00000  160001.00000  0.000000000000e+00
160001.00000  161001.00000  4.044088791904e-08
161001.00000  162001.00000  0.000000000000e+00
162001.00000  163001.00000  0.000000000000e+00
163001.00000  164001.00000  0.000000000000e+00
164001.00000  165001.00000  0.000000000000e+00
165001.00000  166001.00000  0.000000000000e+00
166001.00000  167001.00000  0.000000000000e+00
167001.00000  168001.00000  4.044088791904e-08
168001.00000  169001.00000  0.000000000000e+00
169001.00000  170001.00000  4.044088791904e-08
170001.00000  171001.00000  0.000000000000e+00
171001.00000  172001.00000  0.000000000000e+00
172001.00000  173001.00000  0.000000000000e+00
173001.00000  174001.00000  0.000000000000e+00
174001.00000  175001.00000  0.000000000000e+00
175001.00000  176001.00000  0.000000000000e+00
176001.00000  177001.00000  0.000000000000e+00
177001.00000  178001.00000  4.044088791904e-08
178001.00000  179001.00000  0.000000000000e+00
179001.00000  180001.00000  4.044088791904e-08
180001.00000  181001.00000  0.000000000000e+00
181001.00000  182001.00000  0.000000000000e+00
182001.00000  183001.00000  0.000000000000e+00
183001.00000  184001.00000  0.000000000000e+00
184001.00000  185001.00000  0.000000000000e+00
185001.00000  186001.00000  0.000000000000e+00
186001.00000  187001.00000  0.000000000000e+00
187001.00000  188001.00000  0.000000000000e+00
188001.00000  189001.00000  4.044088791904e-08
189001.00000  190001.00000  0.000000000000e+00
190001.00000  191001.00000  0.000000000000e+00
191001.00000  192001.00000  0.000000000000e+00
192001.00000  193001.00000  0.000000000000e+00
193001.00000  194001.00000  0.000000000000e+00
194001.00000  195001.00000  0.000000000000e+00
195001.00000  196001.00000  0.000000000000e+00
196001.00000  197001.00000  0.000000000000e+00
197001.00000  198001.00000  0.000000000000e+00
198001.00000  199001.00000  0.000000000000e+00
