300.00000  350.00000  4.595551410300e-05
350.00000  400.00000  1.017048262935e-04
400.00000  450.00000  5.650268127418e-05
450.00000  500.00000  7.081669386364e-05
500.00000  550.00000  4.279136395164e-04
550.00000  600.00000  5.122909768859e-05
600.00000  650.00000  1.130053625484e-04
650.00000  700.00000  4.444877593569e-05
700.00000  750.00000  9.266439728965e-05
750.00000  800.00000  5.424257402321e-05
800.00000  850.00000  1.747816274081e-04
850.00000  900.00000  3.842182326644e-05
900.00000  950.00000  6.177626485977e-05
950.00000  1000.00000  4.670888318665e-05
1000.00000  1050.00000  5.047572860493e-05
1050.00000  1100.00000  5.725605035783e-05
1100.00000  1150.00000  4.294203776838e-05
1150.00000  1200.00000  4.520214501934e-05
1200.00000  1250.00000  5.198246677224e-05
1250.00000  1300.00000  1.438934949782e-04
1300.00000  1350.00000  4.746225227031e-05
1350.00000  1400.00000  7.458353928191e-05
1400.00000  1450.00000  5.574931219052e-05
1450.00000  1500.00000  5.424257402321e-05
1500.00000  1550.00000  5.499594310687e-05
1550.00000  1600.00000  5.650268127418e-05
1600.00000  1650.00000  4.896899043762e-05
1650.00000  1700.00000  5.574931219052e-05
1700.00000  1750.00000  1.340996968907e-04
1750.00000  1800.00000  6.177626485977e-05
1800.00000  1850.00000  4.520214501934e-05
1850.00000  1900.00000  4.670888318665e-05
1900.00000  1950.00000  6.177626485977e-05
1950.00000  2000.00000  5.876278852514e-05
2000.00000  2050.00000  5.348920493956e-05
2050.00000  2100.00000  6.855658661267e-05
2100.00000  2150.00000  5.800941944149e-05
2150.00000  2200.00000  4.972235952128e-05
2200.00000  2250.00000  5.800941944149e-05
2250.00000  2300.00000  4.821562135397e-05
2300.00000  2350.00000  1.416333877273e-04
2350.00000  2400.00000  6.554311027805e-05
2400.00000  2450.00000  4.369540685203e-05
2450.00000  2500.00000  7.232343203095e-05
2500.00000  2550.00000  5.198246677224e-05
2550.00000  2600.00000  4.972235952128e-05
2600.00000  2650.00000  4.369540685203e-05
2650.00000  2700.00000  4.896899043762e-05
2700.00000  2750.00000  5.574931219052e-05
2750.00000  2800.00000  5.348920493956e-05
2800.00000  2850.00000  5.800941944149e-05
2850.00000  2900.00000  4.520214501934e-05
2900.00000  2950.00000  4.746225227031e-05
2950.00000  3000.00000  8.437733736944e-05
3000.00000  3050.00000  5.574931219052e-05
3050.00000  3100.00000  5.499594310687e-05
3100.00000  3150.00000  5.800941944149e-05
3150.00000  3200.00000  4.746225227031e-05
3200.00000  3250.00000  5.424257402321e-05
3250.00000  3300.00000  4.294203776838e-05
3300.00000  3350.00000  4.896899043762e-05
3350.00000  3400.00000  5.348920493956e-05
3400.00000  3450.00000  3.992856143375e-05
3450.00000  3500.00000  4.821562135397e-05
3500.00000  3550.00000  4.821562135397e-05
3550.00000  3600.00000  4.369540685203e-05
3600.00000  3650.00000  5.122909768859e-05
3650.00000  3700.00000  8.362396828578e-05
3700.00000  3750.00000  6.102289577611e-05
3750.00000  3800.00000  5.122909768859e-05
3800.00000  3850.00000  6.704984844536e-05
3850.00000  3900.00000  5.951615760880e-05
3900.00000  3950.00000  7.307680111460e-05
3950.00000  4000.00000  7.307680111460e-05
4000.00000  4050.00000  6.855658661267e-05
4050.00000  4100.00000  6.554311027805e-05
4100.00000  4150.00000  8.513070645309e-05
4150.00000  4200.00000  1.114986243810e-04
4200.00000  4250.00000  8.814418278772e-05
4250.00000  4300.00000  9.793798087524e-05
4300.00000  4350.00000  9.793798087524e-05
4350.00000  4400.00000  1.084851480464e-04
4400.00000  4450.00000  1.160188388830e-04
4450.00000  4500.00000  1.333463278071e-04
4500.00000  4550.00000  1.401266495600e-04
4550.00000  4600.00000  1.167722079666e-04
4600.00000  4650.00000  1.431401258946e-04
4650.00000  4700.00000  1.627277220696e-04
4700.00000  4750.00000  1.521805548985e-04
4750.00000  4800.00000  1.868355327466e-04
4800.00000  4850.00000  1.642344602369e-04
4850.00000  4900.00000  1.823153182447e-04
4900.00000  4950.00000  1.762883655754e-04
4950.00000  5000.00000  2.124500815909e-04
5000.00000  5050.00000  1.966293308341e-04
5050.00000  5100.00000  2.056697598380e-04
5100.00000  5150.00000  1.883422709139e-04
5150.00000  5200.00000  2.116967125073e-04
5200.00000  5250.00000  2.124500815909e-04
5250.00000  5300.00000  2.245039869294e-04
5300.00000  5350.00000  2.094366052563e-04
5350.00000  5400.00000  2.380646304352e-04
5400.00000  5450.00000  2.267640941804e-04
5450.00000  5500.00000  2.486117976064e-04
5500.00000  5550.00000  2.508719048573e-04
5550.00000  5600.00000  2.350511541006e-04
5600.00000  5650.00000  2.320376777660e-04
5650.00000  5700.00000  2.440915831044e-04
5700.00000  5750.00000  2.282708323477e-04
5750.00000  5800.00000  2.478584285227e-04
5800.00000  5850.00000  2.440915831044e-04
5850.00000  5900.00000  2.365578922679e-04
5900.00000  5950.00000  2.380646304352e-04
5950.00000  6000.00000  2.719662391997e-04
6000.00000  6050.00000  2.335444159333e-04
6050.00000  6100.00000  2.455983212718e-04
6100.00000  6150.00000  2.636791792795e-04
6150.00000  6200.00000  2.388179995189e-04
6200.00000  6250.00000  2.832667754545e-04
6250.00000  6300.00000  2.425848449371e-04
6300.00000  6350.00000  2.779931918690e-04
6350.00000  6400.00000  8.957558404666e-04
6400.00000  6450.00000  2.471050594391e-04
6450.00000  6500.00000  2.712128701161e-04
6500.00000  6550.00000  2.674460246978e-04
6550.00000  6600.00000  2.538853811920e-04
6600.00000  6650.00000  2.712128701161e-04
6650.00000  6700.00000  2.516252739410e-04
6700.00000  6750.00000  2.591589647776e-04
6750.00000  6800.00000  2.493651666900e-04
6800.00000  6850.00000  2.305309395986e-04
6850.00000  6900.00000  2.636791792795e-04
6900.00000  6950.00000  2.418314758535e-04
6950.00000  7000.00000  2.433382140208e-04
7000.00000  7050.00000  2.425848449371e-04
7050.00000  7100.00000  2.990875262113e-04
7100.00000  7150.00000  1.378665423090e-04
7150.00000  7200.00000  1.130053625484e-04
7200.00000  7250.00000  1.054716717118e-04
7250.00000  7300.00000  1.182789461339e-04
7300.00000  7350.00000  1.009514572099e-04
7350.00000  7400.00000  1.122519934647e-04
7400.00000  7450.00000  1.062250407955e-04
7450.00000  7500.00000  1.438934949782e-04
7500.00000  7550.00000  1.197856843013e-04
7550.00000  7600.00000  1.107452552974e-04
7600.00000  7650.00000  1.084851480464e-04
7650.00000  7700.00000  1.099918862137e-04
7700.00000  7750.00000  1.250592678868e-04
7750.00000  7800.00000  1.160188388830e-04
7800.00000  7850.00000  1.160188388830e-04
7850.00000  7900.00000  1.047183026281e-04
7900.00000  7950.00000  8.965092095503e-05
7950.00000  8000.00000  1.152654697993e-04
8000.00000  8050.00000  1.190323152176e-04
8050.00000  8100.00000  1.092385171301e-04
8100.00000  8150.00000  1.084851480464e-04
8150.00000  8200.00000  1.152654697993e-04
8200.00000  8250.00000  1.107452552974e-04
8250.00000  8300.00000  1.024581953772e-04
8300.00000  8350.00000  1.107452552974e-04
8350.00000  8400.00000  1.039649335445e-04
8400.00000  8450.00000  1.001980881262e-04
8450.00000  8500.00000  1.122519934647e-04
8500.00000  8550.00000  1.114986243810e-04
8550.00000  8600.00000  1.205390533849e-04
8600.00000  8650.00000  1.077317789628e-04
8650.00000  8700.00000  9.944471904255e-05
8700.00000  8750.00000  1.017048262935e-04
8750.00000  8800.00000  1.077317789628e-04
8800.00000  8850.00000  1.001980881262e-04
8850.00000  8900.00000  8.814418278772e-05
8900.00000  8950.00000  1.069784098791e-04
8950.00000  9000.00000  1.017048262935e-04
9000.00000  9050.00000  1.069784098791e-04
9050.00000  9100.00000  1.099918862137e-04
9100.00000  9150.00000  1.001980881262e-04
9150.00000  9200.00000  1.160188388830e-04
9200.00000  9250.00000  1.024581953772e-04
9250.00000  9300.00000  9.567787362427e-05
9300.00000  9350.00000  1.107452552974e-04
9350.00000  9400.00000  1.084851480464e-04
9400.00000  9450.00000  1.054716717118e-04
9450.00000  9500.00000  9.643124270793e-05
9500.00000  9550.00000  9.492450454062e-05
9550.00000  9600.00000  8.889755187137e-05
9600.00000  9650.00000  8.739081370406e-05
9650.00000  9700.00000  8.889755187137e-05
9700.00000  9750.00000  8.211723011847e-05
9750.00000  9800.00000  9.266439728965e-05
9800.00000  9850.00000  8.061049195116e-05
9850.00000  9900.00000  9.793798087524e-05
9900.00000  9950.00000  9.266439728965e-05
9950.00000  10000.00000  1.099918862137e-04
