10001.00000  11001.00000  4.457451554969e-04
11001.00000  12001.00000  3.692587710942e-04
12001.00000  13001.00000  3.074806202382e-04
13001.00000  14001.00000  2.667295314188e-04
14001.00000  15001.00000  2.286380625004e-04
15001.00000  16001.00000  2.002925832865e-04
16001.00000  17001.00000  1.727860445783e-04
17001.00000  18001.00000  1.527407214315e-04
18001.00000  19001.00000  1.376040927329e-04
19001.00000  20001.00000  1.201648400931e-04
20001.00000  21001.00000  1.104545499846e-04
21001.00000  22001.00000  1.016367497757e-04
22001.00000  23001.00000  9.196215926317e-05
23001.00000  24001.00000  8.446524410585e-05
24001.00000  25001.00000  7.818211521209e-05
25001.00000  26001.00000  7.122069399457e-05
26001.00000  27001.00000  6.581220520250e-05
27001.00000  28001.00000  5.924347954085e-05
28001.00000  29001.00000  5.512017620432e-05
29001.00000  30001.00000  5.135386882767e-05
30001.00000  31001.00000  4.869424892662e-05
31001.00000  32001.00000  4.701636791521e-05
32001.00000  33001.00000  4.121518356729e-05
33001.00000  34001.00000  4.037624306159e-05
34001.00000  35001.00000  3.660993568493e-05
35001.00000  36001.00000  3.457505871366e-05
36001.00000  37001.00000  3.257588133837e-05
37001.00000  38001.00000  3.189758901461e-05
38001.00000  39001.00000  3.009475941726e-05
39001.00000  40001.00000  2.775643588009e-05
40001.00000  41001.00000  2.643555082856e-05
41001.00000  42001.00000  2.438282405930e-05
42001.00000  43001.00000  2.295484021980e-05
43001.00000  44001.00000  2.302623941178e-05
44001.00000  45001.00000  2.200880092614e-05
45001.00000  46001.00000  2.017027173280e-05
46001.00000  47001.00000  1.990252476289e-05
47001.00000  48001.00000  1.872443809532e-05
48001.00000  49001.00000  1.779624859965e-05
49001.00000  50001.00000  1.642181415414e-05
50001.00000  51001.00000  1.572567203239e-05
51001.00000  52001.00000  1.547577486048e-05
52001.00000  53001.00000  1.481533233471e-05
53001.00000  54001.00000  1.354799667716e-05
54001.00000  55001.00000  1.329809950525e-05
55001.00000  56001.00000  1.315530112130e-05
56001.00000  57001.00000  1.279830516143e-05
57001.00000  58001.00000  1.233421041360e-05
58001.00000  59001.00000  1.174516707981e-05
59001.00000  60001.00000  1.147742010990e-05
60001.00000  61001.00000  1.085267718013e-05
61001.00000  62001.00000  1.035288283630e-05
62001.00000  63001.00000  1.069202899818e-05
63001.00000  64001.00000  1.004943627041e-05
64001.00000  65001.00000  9.031997784775e-06
65001.00000  66001.00000  9.174796168725e-06
66001.00000  67001.00000  9.264045158693e-06
67001.00000  68001.00000  8.817800208852e-06
68001.00000  69001.00000  7.996709501145e-06
69001.00000  70001.00000  7.068520005476e-06
70001.00000  71001.00000  7.782511925222e-06
71001.00000  72001.00000  7.300567379394e-06
72001.00000  73001.00000  6.907871823534e-06
73001.00000  74001.00000  6.675824449617e-06
74001.00000  75001.00000  7.211318389425e-06
75001.00000  76001.00000  5.908283135891e-06
76001.00000  77001.00000  6.729373843598e-06
77001.00000  78001.00000  6.836472631559e-06
78001.00000  79001.00000  5.586986772005e-06
79001.00000  80001.00000  5.390638994075e-06
80001.00000  81001.00000  5.979682327865e-06
81001.00000  82001.00000  5.943982731878e-06
82001.00000  83001.00000  5.337089600095e-06
83001.00000  84001.00000  4.944394044235e-06
84001.00000  85001.00000  4.319651114458e-06
85001.00000  86001.00000  4.480299296400e-06
86001.00000  87001.00000  5.015793236209e-06
87001.00000  88001.00000  4.730196468311e-06
88001.00000  89001.00000  4.462449498407e-06
89001.00000  90001.00000  4.623097680350e-06
90001.00000  91001.00000  4.462449498407e-06
91001.00000  92001.00000  4.105453538534e-06
92001.00000  93001.00000  4.087603740541e-06
93001.00000  94001.00000  4.444599700413e-06
94001.00000  95001.00000  3.891255962611e-06
95001.00000  96001.00000  3.677058386687e-06
96001.00000  97001.00000  3.373611820796e-06
97001.00000  98001.00000  3.819856770636e-06
98001.00000  99001.00000  3.427161214776e-06
99001.00000  100001.00000  3.748457578662e-06
100001.00000  101001.00000  3.248663234840e-06
101001.00000  102001.00000  3.230813436847e-06
102001.00000  103001.00000  3.355762022802e-06
103001.00000  104001.00000  3.105864850891e-06
104001.00000  105001.00000  3.088015052898e-06
105001.00000  106001.00000  2.963066466942e-06
106001.00000  107001.00000  3.337912224808e-06
107001.00000  108001.00000  2.713169295031e-06
108001.00000  109001.00000  2.588220709076e-06
109001.00000  110001.00000  2.338323537165e-06
110001.00000  111001.00000  2.623920305063e-06
111001.00000  112001.00000  2.374023133152e-06
112001.00000  113001.00000  2.338323537165e-06
113001.00000  114001.00000  2.177675355223e-06
114001.00000  115001.00000  2.195525153216e-06
115001.00000  116001.00000  2.374023133152e-06
116001.00000  117001.00000  1.999177375286e-06
117001.00000  118001.00000  2.338323537165e-06
118001.00000  119001.00000  1.892078587325e-06
119001.00000  120001.00000  2.231224749203e-06
120001.00000  121001.00000  2.070576567261e-06
121001.00000  122001.00000  2.391872931146e-06
122001.00000  123001.00000  1.695730809395e-06
123001.00000  124001.00000  2.249074547197e-06
124001.00000  125001.00000  1.945627981305e-06
125001.00000  126001.00000  1.838529193344e-06
126001.00000  127001.00000  1.499383031465e-06
127001.00000  128001.00000  1.642181415414e-06
128001.00000  129001.00000  1.892078587325e-06
129001.00000  130001.00000  2.106276163248e-06
130001.00000  131001.00000  1.624331617420e-06
131001.00000  132001.00000  1.660031213407e-06
132001.00000  133001.00000  1.677881011401e-06
133001.00000  134001.00000  1.570782223439e-06
134001.00000  135001.00000  1.552932425446e-06
135001.00000  136001.00000  1.427983839490e-06
136001.00000  137001.00000  1.606481819426e-06
137001.00000  138001.00000  1.606481819426e-06
138001.00000  139001.00000  1.392284243503e-06
139001.00000  140001.00000  1.303035253535e-06
140001.00000  141001.00000  1.606481819426e-06
141001.00000  142001.00000  1.445833637484e-06
142001.00000  143001.00000  1.249485859554e-06
143001.00000  144001.00000  1.285185455541e-06
144001.00000  145001.00000  1.356584647516e-06
145001.00000  146001.00000  1.374434445509e-06
146001.00000  147001.00000  1.017438485637e-06
147001.00000  148001.00000  1.053138081624e-06
148001.00000  149001.00000  1.267335657548e-06
149001.00000  150001.00000  1.035288283630e-06
150001.00000  151001.00000  1.124537273599e-06
151001.00000  152001.00000  1.213786263567e-06
152001.00000  153001.00000  1.070987879618e-06
153001.00000  154001.00000  9.995886876431e-07
154001.00000  155001.00000  1.053138081624e-06
155001.00000  156001.00000  1.160236869586e-06
156001.00000  157001.00000  1.249485859554e-06
157001.00000  158001.00000  9.460392936623e-07
158001.00000  159001.00000  1.142387071592e-06
159001.00000  160001.00000  9.281894956686e-07
160001.00000  161001.00000  1.035288283630e-06
161001.00000  162001.00000  8.567903036941e-07
162001.00000  163001.00000  1.017438485637e-06
163001.00000  164001.00000  9.460392936623e-07
164001.00000  165001.00000  8.924898996814e-07
165001.00000  166001.00000  7.853911117196e-07
166001.00000  167001.00000  1.178086667579e-06
167001.00000  168001.00000  7.496915157324e-07
168001.00000  169001.00000  8.924898996814e-07
169001.00000  170001.00000  6.961421217515e-07
170001.00000  171001.00000  7.496915157324e-07
171001.00000  172001.00000  7.139919197451e-07
172001.00000  173001.00000  8.210907077069e-07
173001.00000  174001.00000  8.924898996814e-07
174001.00000  175001.00000  7.675413137260e-07
175001.00000  176001.00000  6.425927277706e-07
176001.00000  177001.00000  6.961421217515e-07
177001.00000  178001.00000  6.782923237578e-07
178001.00000  179001.00000  6.425927277706e-07
179001.00000  180001.00000  8.032409097132e-07
180001.00000  181001.00000  5.533437378025e-07
181001.00000  182001.00000  8.746401016877e-07
182001.00000  183001.00000  6.425927277706e-07
183001.00000  184001.00000  6.425927277706e-07
184001.00000  185001.00000  4.997943438216e-07
185001.00000  186001.00000  5.533437378025e-07
186001.00000  187001.00000  6.782923237578e-07
187001.00000  188001.00000  4.997943438216e-07
188001.00000  189001.00000  5.890433337897e-07
189001.00000  190001.00000  5.711935357961e-07
190001.00000  191001.00000  6.068931317833e-07
191001.00000  192001.00000  6.247429297770e-07
192001.00000  193001.00000  7.675413137260e-07
193001.00000  194001.00000  8.746401016877e-07
194001.00000  195001.00000  7.318417177387e-07
195001.00000  196001.00000  5.176441418152e-07
196001.00000  197001.00000  4.283951518471e-07
197001.00000  198001.00000  6.425927277706e-07
198001.00000  199001.00000  6.068931317833e-07
