300.00000  350.00000  6.024109866807e-06
350.00000  400.00000  1.385545269366e-05
400.00000  450.00000  1.164661240916e-05
450.00000  500.00000  1.244982705807e-05
500.00000  550.00000  1.118476398604e-04
550.00000  600.00000  9.437772124665e-06
600.00000  650.00000  3.012054933404e-05
650.00000  700.00000  1.224902339584e-05
700.00000  750.00000  2.409643946723e-05
750.00000  800.00000  1.827313326265e-05
800.00000  850.00000  5.983949134362e-05
850.00000  900.00000  1.686750762706e-05
900.00000  950.00000  2.048197354714e-05
950.00000  1000.00000  1.746991861374e-05
1000.00000  1050.00000  1.827313326265e-05
1050.00000  1100.00000  1.807232960042e-05
1100.00000  1150.00000  1.987956256046e-05
1150.00000  1200.00000  1.927715157378e-05
1200.00000  1250.00000  2.148599185828e-05
1250.00000  1300.00000  7.008047811719e-05
1300.00000  1350.00000  2.068277720937e-05
1350.00000  1400.00000  2.570286876504e-05
1400.00000  1450.00000  2.309242115609e-05
1450.00000  1500.00000  2.871492369845e-05
1500.00000  1550.00000  2.449804679168e-05
1550.00000  1600.00000  2.409643946723e-05
1600.00000  1650.00000  2.148599185828e-05
1650.00000  1700.00000  2.630527975172e-05
1700.00000  1750.00000  9.498013223333e-05
1750.00000  1800.00000  2.771090538731e-05
1800.00000  1850.00000  3.012054933404e-05
1850.00000  1900.00000  3.293180060521e-05
1900.00000  1950.00000  2.991974567181e-05
1950.00000  2000.00000  3.172697863185e-05
2000.00000  2050.00000  3.473903356525e-05
2050.00000  2100.00000  3.232938961853e-05
2100.00000  2150.00000  3.293180060521e-05
2150.00000  2200.00000  3.895591047202e-05
2200.00000  2250.00000  3.614465920084e-05
2250.00000  2300.00000  3.493983722748e-05
2300.00000  2350.00000  1.092371922514e-04
2350.00000  2400.00000  3.795189216089e-05
2400.00000  2450.00000  3.534144455194e-05
2450.00000  2500.00000  4.477921667660e-05
2500.00000  2550.00000  3.835349948534e-05
2550.00000  2600.00000  2.991974567181e-05
2600.00000  2650.00000  3.775108849866e-05
2650.00000  2700.00000  3.755028483643e-05
2700.00000  2750.00000  3.393581891635e-05
2750.00000  2800.00000  3.614465920084e-05
2800.00000  2850.00000  3.895591047202e-05
2850.00000  2900.00000  3.775108849866e-05
2900.00000  2950.00000  3.955832145870e-05
2950.00000  3000.00000  6.184752796589e-05
3000.00000  3050.00000  3.634546286307e-05
3050.00000  3100.00000  4.216876906765e-05
3100.00000  3150.00000  4.337359104101e-05
3150.00000  3200.00000  4.236957272988e-05
3200.00000  3250.00000  3.975912512093e-05
3250.00000  3300.00000  3.855430314757e-05
3300.00000  3350.00000  4.216876906765e-05
3350.00000  3400.00000  4.357439470324e-05
3400.00000  3450.00000  4.156635808097e-05
3450.00000  3500.00000  4.156635808097e-05
3500.00000  3550.00000  4.598403864996e-05
3550.00000  3600.00000  4.076314343206e-05
3600.00000  3650.00000  5.120493386786e-05
3650.00000  3700.00000  8.012066122854e-05
3700.00000  3750.00000  5.903627669471e-05
3750.00000  3800.00000  6.084350965475e-05
3800.00000  3850.00000  6.425717191261e-05
3850.00000  3900.00000  6.425717191261e-05
3900.00000  3950.00000  6.546199388597e-05
3950.00000  4000.00000  7.309253305059e-05
4000.00000  4050.00000  8.614477109534e-05
4050.00000  4100.00000  7.610458798400e-05
4100.00000  4150.00000  8.333351982417e-05
4150.00000  4200.00000  8.915682602875e-05
4200.00000  4250.00000  9.437772124665e-05
4250.00000  4300.00000  1.108436215493e-04
4300.00000  4350.00000  1.174701424027e-04
4350.00000  4400.00000  1.168677314161e-04
4400.00000  4450.00000  1.224902339584e-04
4450.00000  4500.00000  1.397593489099e-04
4500.00000  4550.00000  1.371489013010e-04
4550.00000  4600.00000  1.481931027235e-04
4600.00000  4650.00000  1.592373041459e-04
4650.00000  4700.00000  1.777112410708e-04
4700.00000  4750.00000  1.789160630442e-04
4750.00000  4800.00000  1.915666937645e-04
4800.00000  4850.00000  1.943779450356e-04
4850.00000  4900.00000  2.090366123782e-04
4900.00000  4950.00000  2.176711698540e-04
4950.00000  5000.00000  2.367475177655e-04
5000.00000  5050.00000  2.246992980319e-04
5050.00000  5100.00000  2.616471718817e-04
5100.00000  5150.00000  2.598399389216e-04
5150.00000  5200.00000  2.614463682194e-04
5200.00000  5250.00000  2.869484333222e-04
5250.00000  5300.00000  2.632536011795e-04
5300.00000  5350.00000  2.889564699445e-04
5350.00000  5400.00000  2.959845981225e-04
5400.00000  5450.00000  3.303220243633e-04
5450.00000  5500.00000  3.281131840788e-04
5500.00000  5550.00000  3.473903356525e-04
5550.00000  5600.00000  3.381533671901e-04
5600.00000  5650.00000  3.449806917058e-04
5650.00000  5700.00000  3.620490029951e-04
5700.00000  5750.00000  3.608441810218e-04
5750.00000  5800.00000  3.728924007554e-04
5800.00000  5850.00000  3.779124923110e-04
5850.00000  5900.00000  3.821293692178e-04
5900.00000  5950.00000  3.945791962759e-04
5950.00000  6000.00000  4.016073244538e-04
6000.00000  6050.00000  4.116475075652e-04
6050.00000  6100.00000  4.351415360457e-04
6100.00000  6150.00000  4.281134078678e-04
6150.00000  6200.00000  4.471897557793e-04
6200.00000  6250.00000  4.710853915843e-04
6250.00000  6300.00000  5.056236214874e-04
6300.00000  6350.00000  4.853424516024e-04
6350.00000  6400.00000  1.526107832924e-03
6400.00000  6450.00000  4.656636927042e-04
6450.00000  6500.00000  4.672701220020e-04
6500.00000  6550.00000  4.915673651315e-04
6550.00000  6600.00000  4.648604780553e-04
6600.00000  6650.00000  4.785151270867e-04
6650.00000  6700.00000  4.413664495747e-04
6700.00000  6750.00000  4.921697761181e-04
6750.00000  6800.00000  5.008043335939e-04
6800.00000  6850.00000  5.022099592295e-04
6850.00000  6900.00000  5.000011189450e-04
6900.00000  6950.00000  4.965874566871e-04
6950.00000  7000.00000  5.050212105007e-04
7000.00000  7050.00000  5.234951474255e-04
7050.00000  7100.00000  6.224913529034e-04
7100.00000  7150.00000  2.612455645572e-04
7150.00000  7200.00000  2.168679552051e-04
7200.00000  7250.00000  2.381531434011e-04
7250.00000  7300.00000  2.273097456409e-04
7300.00000  7350.00000  2.371491250900e-04
7350.00000  7400.00000  2.419684129834e-04
7400.00000  7450.00000  2.387555543878e-04
7450.00000  7500.00000  2.769082502109e-04
7500.00000  7550.00000  2.584343132860e-04
7550.00000  7600.00000  2.592375279349e-04
7600.00000  7650.00000  2.646592268151e-04
7650.00000  7700.00000  2.546190437037e-04
7700.00000  7750.00000  2.590367242727e-04
7750.00000  7800.00000  2.578319022993e-04
7800.00000  7850.00000  2.765066428865e-04
7850.00000  7900.00000  2.668680670996e-04
7900.00000  7950.00000  2.795186978199e-04
7950.00000  8000.00000  2.702817293574e-04
8000.00000  8050.00000  2.805227161310e-04
8050.00000  8100.00000  2.732937842908e-04
8100.00000  8150.00000  2.821291454288e-04
8150.00000  8200.00000  2.869484333222e-04
8200.00000  8250.00000  2.845387893755e-04
8250.00000  8300.00000  3.014062970026e-04
8300.00000  8350.00000  2.893580772690e-04
8350.00000  8400.00000  2.759042318998e-04
8400.00000  8450.00000  2.949805798113e-04
8450.00000  8500.00000  2.761050355620e-04
8500.00000  8550.00000  2.881532552956e-04
8550.00000  8600.00000  3.056231739094e-04
8600.00000  8650.00000  2.889564699445e-04
8650.00000  8700.00000  2.973902237580e-04
8700.00000  8750.00000  3.030127263004e-04
8750.00000  8800.00000  3.044183519360e-04
8800.00000  8850.00000  3.072296032072e-04
8850.00000  8900.00000  2.997998677048e-04
8900.00000  8950.00000  3.226914851986e-04
8950.00000  9000.00000  3.060247812338e-04
9000.00000  9050.00000  2.917677212157e-04
9050.00000  9100.00000  3.034143336249e-04
9100.00000  9150.00000  2.983942420692e-04
9150.00000  9200.00000  3.218882705497e-04
9200.00000  9250.00000  3.100408544783e-04
9250.00000  9300.00000  3.048199592604e-04
9300.00000  9350.00000  3.086352288428e-04
9350.00000  9400.00000  3.176713936430e-04
9400.00000  9450.00000  3.132537130740e-04
9450.00000  9500.00000  3.297196133766e-04
9500.00000  9550.00000  3.230930925231e-04
9550.00000  9600.00000  3.122496947628e-04
9600.00000  9650.00000  3.170689826563e-04
9650.00000  9700.00000  3.054223702471e-04
9700.00000  9750.00000  3.144585350473e-04
9750.00000  9800.00000  3.080328178561e-04
9800.00000  9850.00000  3.261051474565e-04
9850.00000  9900.00000  3.178721973052e-04
9900.00000  9950.00000  3.090368361672e-04
9950.00000  10000.00000  3.144585350473e-04
