300.00000  350.00000  2.590790287460e-05
350.00000  400.00000  4.965681384298e-05
400.00000  450.00000  3.454387049946e-05
450.00000  500.00000  3.382420653072e-05
500.00000  550.00000  2.727526441520e-04
550.00000  600.00000  2.123008707779e-05
600.00000  650.00000  8.096219648311e-05
650.00000  700.00000  3.562336645257e-05
700.00000  750.00000  6.189110131154e-05
750.00000  800.00000  3.634303042131e-05
800.00000  850.00000  1.295395143730e-04
850.00000  900.00000  3.202504660888e-05
900.00000  950.00000  3.490370248383e-05
950.00000  1000.00000  3.562336645257e-05
1000.00000  1050.00000  3.202504660888e-05
1050.00000  1100.00000  3.274471057761e-05
1100.00000  1150.00000  3.094555065577e-05
1150.00000  1200.00000  3.742252637442e-05
1200.00000  1250.00000  4.605849399928e-05
1250.00000  1300.00000  1.137069070607e-04
1300.00000  1350.00000  3.634303042131e-05
1350.00000  1400.00000  3.922168629626e-05
1400.00000  1450.00000  4.713798995239e-05
1450.00000  1500.00000  5.757311749910e-05
1500.00000  1550.00000  4.246017415559e-05
1550.00000  1600.00000  3.850202232752e-05
1600.00000  1650.00000  4.353967010870e-05
1650.00000  1700.00000  4.353967010870e-05
1700.00000  1750.00000  1.309788423105e-04
1750.00000  1800.00000  5.037647781171e-05
1800.00000  1850.00000  4.713798995239e-05
1850.00000  1900.00000  4.569866201491e-05
1900.00000  1950.00000  4.389950209307e-05
1950.00000  2000.00000  4.713798995239e-05
2000.00000  2050.00000  5.001664582735e-05
2050.00000  2100.00000  5.001664582735e-05
2100.00000  2150.00000  4.533883003054e-05
2150.00000  2200.00000  4.641832598365e-05
2200.00000  2250.00000  4.893714987424e-05
2250.00000  2300.00000  6.153126932717e-05
2300.00000  2350.00000  1.471712816071e-04
2350.00000  2400.00000  5.397479765541e-05
2400.00000  2450.00000  5.109614178045e-05
2450.00000  2500.00000  5.685345353036e-05
2500.00000  2550.00000  4.785765392113e-05
2550.00000  2600.00000  5.469446162415e-05
2600.00000  2650.00000  5.577395757726e-05
2650.00000  2700.00000  5.037647781171e-05
2700.00000  2750.00000  5.181580574919e-05
2750.00000  2800.00000  5.577395757726e-05
2800.00000  2850.00000  5.181580574919e-05
2850.00000  2900.00000  5.073630979608e-05
2900.00000  2950.00000  5.181580574919e-05
2950.00000  3000.00000  7.736387663942e-05
3000.00000  3050.00000  5.001664582735e-05
3050.00000  3100.00000  4.389950209307e-05
3100.00000  3150.00000  5.901244543658e-05
3150.00000  3200.00000  5.505429360852e-05
3200.00000  3250.00000  4.857731788987e-05
3250.00000  3300.00000  5.289530170230e-05
3300.00000  3350.00000  5.217563773356e-05
3350.00000  3400.00000  5.217563773356e-05
3400.00000  3450.00000  5.109614178045e-05
3450.00000  3500.00000  5.253546971793e-05
3500.00000  3550.00000  5.001664582735e-05
3550.00000  3600.00000  4.533883003054e-05
3600.00000  3650.00000  6.189110131154e-05
3650.00000  3700.00000  7.088690092077e-05
3700.00000  3750.00000  4.246017415559e-05
3750.00000  3800.00000  4.785765392113e-05
3800.00000  3850.00000  5.325513368667e-05
3850.00000  3900.00000  5.253546971793e-05
3900.00000  3950.00000  4.965681384298e-05
3950.00000  4000.00000  5.469446162415e-05
4000.00000  4050.00000  4.246017415559e-05
4050.00000  4100.00000  5.937227742095e-05
4100.00000  4150.00000  4.497899804617e-05
4150.00000  4200.00000  4.533883003054e-05
4200.00000  4250.00000  4.102084621811e-05
4250.00000  4300.00000  5.325513368667e-05
4300.00000  4350.00000  4.893714987424e-05
4350.00000  4400.00000  5.397479765541e-05
4400.00000  4450.00000  5.397479765541e-05
4450.00000  4500.00000  5.109614178045e-05
4500.00000  4550.00000  4.785765392113e-05
4550.00000  4600.00000  4.857731788987e-05
4600.00000  4650.00000  4.929698185861e-05
4650.00000  4700.00000  5.181580574919e-05
4700.00000  4750.00000  5.397479765541e-05
4750.00000  4800.00000  4.749782193676e-05
4800.00000  4850.00000  4.317983812433e-05
4850.00000  4900.00000  5.073630979608e-05
4900.00000  4950.00000  5.469446162415e-05
4950.00000  5000.00000  4.965681384298e-05
5000.00000  5050.00000  4.533883003054e-05
5050.00000  5100.00000  5.073630979608e-05
5100.00000  5150.00000  4.929698185861e-05
5150.00000  5200.00000  4.965681384298e-05
5200.00000  5250.00000  4.174051018685e-05
5250.00000  5300.00000  4.857731788987e-05
5300.00000  5350.00000  4.821748590550e-05
5350.00000  5400.00000  4.713798995239e-05
5400.00000  5450.00000  6.189110131154e-05
5450.00000  5500.00000  4.929698185861e-05
5500.00000  5550.00000  4.497899804617e-05
5550.00000  5600.00000  5.361496567104e-05
5600.00000  5650.00000  5.181580574919e-05
5650.00000  5700.00000  5.037647781171e-05
5700.00000  5750.00000  5.001664582735e-05
5750.00000  5800.00000  4.425933407744e-05
5800.00000  5850.00000  5.253546971793e-05
5850.00000  5900.00000  5.325513368667e-05
5900.00000  5950.00000  5.181580574919e-05
5950.00000  6000.00000  4.785765392113e-05
6000.00000  6050.00000  5.181580574919e-05
6050.00000  6100.00000  5.577395757726e-05
6100.00000  6150.00000  5.541412559289e-05
6150.00000  6200.00000  5.469446162415e-05
6200.00000  6250.00000  7.592454870194e-05
6250.00000  6300.00000  1.158658989669e-04
6300.00000  6350.00000  9.787429974847e-05
6350.00000  6400.00000  8.492034831118e-04
6400.00000  6450.00000  4.353967010870e-05
6450.00000  6500.00000  5.613378956163e-05
6500.00000  6550.00000  4.929698185861e-05
6550.00000  6600.00000  4.893714987424e-05
6600.00000  6650.00000  5.433462963978e-05
6650.00000  6700.00000  5.433462963978e-05
6700.00000  6750.00000  5.469446162415e-05
6750.00000  6800.00000  5.289530170230e-05
6800.00000  6850.00000  5.613378956163e-05
6850.00000  6900.00000  6.045177337406e-05
6900.00000  6950.00000  5.469446162415e-05
6950.00000  7000.00000  5.685345353036e-05
7000.00000  7050.00000  5.685345353036e-05
7050.00000  7100.00000  1.288198504042e-04
7100.00000  7150.00000  3.418403851509e-05
7150.00000  7200.00000  3.058571867140e-05
7200.00000  7250.00000  2.734723081207e-05
7250.00000  7300.00000  3.562336645257e-05
7300.00000  7350.00000  2.914639073392e-05
7350.00000  7400.00000  3.670286240568e-05
7400.00000  7450.00000  2.734723081207e-05
7450.00000  7500.00000  6.548942115523e-05
7500.00000  7550.00000  3.058571867140e-05
7550.00000  7600.00000  2.626773485897e-05
7600.00000  7650.00000  2.518823890586e-05
7650.00000  7700.00000  2.590790287460e-05
7700.00000  7750.00000  2.698739882770e-05
7750.00000  7800.00000  2.986605470266e-05
7800.00000  7850.00000  3.202504660888e-05
7850.00000  7900.00000  2.734723081207e-05
7900.00000  7950.00000  2.482840692149e-05
7950.00000  8000.00000  3.202504660888e-05
8000.00000  8050.00000  3.310454256198e-05
8050.00000  8100.00000  3.130538264014e-05
8100.00000  8150.00000  3.310454256198e-05
8150.00000  8200.00000  3.022588668703e-05
8200.00000  8250.00000  3.202504660888e-05
8250.00000  8300.00000  3.706269439005e-05
8300.00000  8350.00000  2.410874295275e-05
8350.00000  8400.00000  3.166521462451e-05
8400.00000  8450.00000  2.590790287460e-05
8450.00000  8500.00000  3.022588668703e-05
8500.00000  8550.00000  3.526353446820e-05
8550.00000  8600.00000  2.770706279644e-05
8600.00000  8650.00000  2.986605470266e-05
8650.00000  8700.00000  3.454387049946e-05
8700.00000  8750.00000  2.626773485897e-05
8750.00000  8800.00000  3.598319843694e-05
8800.00000  8850.00000  2.554807089023e-05
8850.00000  8900.00000  2.986605470266e-05
8900.00000  8950.00000  3.166521462451e-05
8950.00000  9000.00000  3.454387049946e-05
9000.00000  9050.00000  2.986605470266e-05
9050.00000  9100.00000  2.482840692149e-05
9100.00000  9150.00000  2.734723081207e-05
9150.00000  9200.00000  2.518823890586e-05
9200.00000  9250.00000  2.626773485897e-05
9250.00000  9300.00000  3.274471057761e-05
9300.00000  9350.00000  2.770706279644e-05
9350.00000  9400.00000  3.418403851509e-05
9400.00000  9450.00000  3.346437454635e-05
9450.00000  9500.00000  2.698739882770e-05
9500.00000  9550.00000  3.454387049946e-05
9550.00000  9600.00000  3.058571867140e-05
9600.00000  9650.00000  3.094555065577e-05
9650.00000  9700.00000  2.842672676518e-05
9700.00000  9750.00000  2.734723081207e-05
9750.00000  9800.00000  3.274471057761e-05
9800.00000  9850.00000  2.842672676518e-05
9850.00000  9900.00000  3.022588668703e-05
9900.00000  9950.00000  3.382420653072e-05
9950.00000  10000.00000  3.166521462451e-05
