10001.00000  11001.00000  2.483891306522e-05
11001.00000  12001.00000  2.468475379096e-05
12001.00000  13001.00000  2.799917818756e-05
13001.00000  14001.00000  3.031156730147e-05
14001.00000  15001.00000  3.210366886475e-05
15001.00000  16001.00000  3.187242995336e-05
16001.00000  17001.00000  3.233490777614e-05
17001.00000  18001.00000  2.992616911582e-05
18001.00000  19001.00000  3.194950959049e-05
19001.00000  20001.00000  2.984908947869e-05
20001.00000  21001.00000  2.584094834792e-05
21001.00000  22001.00000  2.401030696607e-05
22001.00000  23001.00000  2.192915676356e-05
23001.00000  24001.00000  2.165937803360e-05
24001.00000  25001.00000  1.830641381843e-05
25001.00000  26001.00000  1.701532989650e-05
26001.00000  27001.00000  1.528103806107e-05
27001.00000  28001.00000  1.346966658851e-05
28001.00000  29001.00000  1.142705620456e-05
29001.00000  30001.00000  1.048283064971e-05
30001.00000  31001.00000  8.844888360696e-06
31001.00000  32001.00000  9.769844006259e-06
32001.00000  33001.00000  7.958472533698e-06
33001.00000  34001.00000  7.380375255221e-06
34001.00000  35001.00000  7.168406253113e-06
35001.00000  36001.00000  6.224180698268e-06
36001.00000  37001.00000  5.511194054813e-06
37001.00000  38001.00000  4.990906504184e-06
38001.00000  39001.00000  4.778937502075e-06
39001.00000  40001.00000  4.258649951446e-06
40001.00000  41001.00000  3.545663307991e-06
41001.00000  42001.00000  3.468583670861e-06
42001.00000  43001.00000  3.584203126557e-06
43001.00000  44001.00000  2.408738660320e-06
44001.00000  45001.00000  2.505088206733e-06
45001.00000  46001.00000  2.736327118124e-06
46001.00000  47001.00000  2.158229839647e-06
47001.00000  48001.00000  1.869181200409e-06
48001.00000  49001.00000  1.869181200409e-06
49001.00000  50001.00000  1.503052924040e-06
50001.00000  51001.00000  1.445243196192e-06
51001.00000  52001.00000  1.580132561170e-06
52001.00000  53001.00000  1.368163559062e-06
53001.00000  54001.00000  1.252544103367e-06
54001.00000  55001.00000  8.864158269979e-07
55001.00000  56001.00000  8.864158269979e-07
56001.00000  57001.00000  8.286060991502e-07
57001.00000  58001.00000  1.040575101258e-06
58001.00000  59001.00000  1.059845010541e-06
59001.00000  60001.00000  7.322565527374e-07
60001.00000  61001.00000  8.478760084327e-07
61001.00000  62001.00000  6.937167341722e-07
62001.00000  63001.00000  7.900662805850e-07
63001.00000  64001.00000  6.166370970420e-07
64001.00000  65001.00000  7.129866434548e-07
65001.00000  66001.00000  5.780972784769e-07
66001.00000  67001.00000  4.817477320641e-07
67001.00000  68001.00000  4.624778227815e-07
68001.00000  69001.00000  5.010176413466e-07
69001.00000  70001.00000  5.202875506292e-07
70001.00000  71001.00000  3.661282763687e-07
71001.00000  72001.00000  4.239380042164e-07
72001.00000  73001.00000  4.432079134989e-07
73001.00000  74001.00000  3.468583670861e-07
74001.00000  75001.00000  2.119690021082e-07
75001.00000  76001.00000  1.348893649779e-07
76001.00000  77001.00000  2.505088206733e-07
77001.00000  78001.00000  2.312389113907e-07
78001.00000  79001.00000  3.468583670861e-07
79001.00000  80001.00000  1.734291835431e-07
80001.00000  81001.00000  2.890486392384e-07
81001.00000  82001.00000  2.119690021082e-07
82001.00000  83001.00000  2.119690021082e-07
83001.00000  84001.00000  1.926990928256e-07
84001.00000  85001.00000  1.541592742605e-07
85001.00000  86001.00000  1.541592742605e-07
86001.00000  87001.00000  1.734291835431e-07
87001.00000  88001.00000  1.541592742605e-07
88001.00000  89001.00000  2.505088206733e-07
89001.00000  90001.00000  7.707963713025e-08
90001.00000  91001.00000  9.634954641281e-08
91001.00000  92001.00000  1.926990928256e-07
92001.00000  93001.00000  1.541592742605e-07
93001.00000  94001.00000  1.541592742605e-07
94001.00000  95001.00000  5.780972784769e-08
95001.00000  96001.00000  1.156194556954e-07
96001.00000  97001.00000  1.156194556954e-07
97001.00000  98001.00000  3.853981856512e-08
98001.00000  99001.00000  1.348893649779e-07
99001.00000  100001.00000  7.707963713025e-08
100001.00000  101001.00000  1.926990928256e-08
101001.00000  102001.00000  5.780972784769e-08
102001.00000  103001.00000  1.926990928256e-08
103001.00000  104001.00000  9.634954641281e-08
104001.00000  105001.00000  5.780972784769e-08
105001.00000  106001.00000  7.707963713025e-08
106001.00000  107001.00000  1.926990928256e-08
107001.00000  108001.00000  1.926990928256e-08
108001.00000  109001.00000  1.926990928256e-08
109001.00000  110001.00000  7.707963713025e-08
110001.00000  111001.00000  9.634954641281e-08
111001.00000  112001.00000  9.634954641281e-08
112001.00000  113001.00000  0.000000000000e+00
113001.00000  114001.00000  3.853981856512e-08
114001.00000  115001.00000  5.780972784769e-08
115001.00000  116001.00000  7.707963713025e-08
116001.00000  117001.00000  3.853981856512e-08
117001.00000  118001.00000  1.926990928256e-08
118001.00000  119001.00000  1.926990928256e-08
119001.00000  120001.00000  1.926990928256e-08
120001.00000  121001.00000  3.853981856512e-08
121001.00000  122001.00000  0.000000000000e+00
122001.00000  123001.00000  3.853981856512e-08
123001.00000  124001.00000  1.926990928256e-08
124001.00000  125001.00000  1.926990928256e-08
125001.00000  126001.00000  1.926990928256e-08
126001.00000  127001.00000  0.000000000000e+00
127001.00000  128001.00000  0.000000000000e+00
128001.00000  129001.00000  0.000000000000e+00
129001.00000  130001.00000  0.000000000000e+00
130001.00000  131001.00000  0.000000000000e+00
131001.00000  132001.00000  0.000000000000e+00
132001.00000  133001.00000  3.853981856512e-08
133001.00000  134001.00000  1.926990928256e-08
134001.00000  135001.00000  0.000000000000e+00
135001.00000  136001.00000  0.000000000000e+00
136001.00000  137001.00000  0.000000000000e+00
137001.00000  138001.00000  0.000000000000e+00
138001.00000  139001.00000  0.000000000000e+00
139001.00000  140001.00000  0.000000000000e+00
140001.00000  141001.00000  0.000000000000e+00
141001.00000  142001.00000  0.000000000000e+00
142001.00000  143001.00000  0.000000000000e+00
143001.00000  144001.00000  1.926990928256e-08
144001.00000  145001.00000  0.000000000000e+00
145001.00000  146001.00000  0.000000000000e+00
146001.00000  147001.00000  3.853981856512e-08
147001.00000  148001.00000  3.853981856512e-08
148001.00000  149001.00000  0.000000000000e+00
149001.00000  150001.00000  1.926990928256e-08
150001.00000  151001.00000  0.000000000000e+00
151001.00000  152001.00000  0.000000000000e+00
152001.00000  153001.00000  1.926990928256e-08
153001.00000  154001.00000  0.000000000000e+00
154001.00000  155001.00000  1.926990928256e-08
155001.00000  156001.00000  0.000000000000e+00
156001.00000  157001.00000  0.000000000000e+00
157001.00000  158001.00000  0.000000000000e+00
158001.00000  159001.00000  1.926990928256e-08
159001.00000  160001.00000  0.000000000000e+00
160001.00000  161001.00000  0.000000000000e+00
161001.00000  162001.00000  1.926990928256e-08
162001.00000  163001.00000  0.000000000000e+00
163001.00000  164001.00000  3.853981856512e-08
164001.00000  165001.00000  0.000000000000e+00
165001.00000  166001.00000  0.000000000000e+00
166001.00000  167001.00000  0.000000000000e+00
167001.00000  168001.00000  0.000000000000e+00
168001.00000  169001.00000  0.000000000000e+00
169001.00000  170001.00000  0.000000000000e+00
170001.00000  171001.00000  0.000000000000e+00
171001.00000  172001.00000  0.000000000000e+00
172001.00000  173001.00000  1.926990928256e-08
173001.00000  174001.00000  0.000000000000e+00
174001.00000  175001.00000  0.000000000000e+00
175001.00000  176001.00000  0.000000000000e+00
176001.00000  177001.00000  1.926990928256e-08
177001.00000  178001.00000  0.000000000000e+00
178001.00000  179001.00000  0.000000000000e+00
179001.00000  180001.00000  0.000000000000e+00
180001.00000  181001.00000  0.000000000000e+00
181001.00000  182001.00000  0.000000000000e+00
182001.00000  183001.00000  0.000000000000e+00
183001.00000  184001.00000  0.000000000000e+00
184001.00000  185001.00000  0.000000000000e+00
185001.00000  186001.00000  0.000000000000e+00
186001.00000  187001.00000  1.926990928256e-08
187001.00000  188001.00000  0.000000000000e+00
188001.00000  189001.00000  0.000000000000e+00
189001.00000  190001.00000  0.000000000000e+00
190001.00000  191001.00000  0.000000000000e+00
191001.00000  192001.00000  0.000000000000e+00
192001.00000  193001.00000  0.000000000000e+00
193001.00000  194001.00000  0.000000000000e+00
194001.00000  195001.00000  0.000000000000e+00
195001.00000  196001.00000  0.000000000000e+00
196001.00000  197001.00000  0.000000000000e+00
197001.00000  198001.00000  0.000000000000e+00
198001.00000  199001.00000  0.000000000000e+00
