300.00000  350.00000  2.328688496729e-06
350.00000  400.00000  6.597950740731e-06
400.00000  450.00000  2.910860620911e-06
450.00000  500.00000  3.298975370366e-06
500.00000  550.00000  4.754405680821e-05
550.00000  600.00000  2.522745871456e-06
600.00000  650.00000  1.125532773419e-05
650.00000  700.00000  3.493032745093e-06
700.00000  750.00000  7.568237614368e-06
750.00000  800.00000  6.597950740731e-06
800.00000  850.00000  2.212254071892e-05
850.00000  900.00000  5.239549117639e-06
900.00000  950.00000  4.657376993457e-06
950.00000  1000.00000  4.269262244003e-06
1000.00000  1050.00000  3.881147494548e-06
1050.00000  1100.00000  5.045491742912e-06
1100.00000  1150.00000  4.657376993457e-06
1150.00000  1200.00000  6.015778616549e-06
1200.00000  1250.00000  7.180122864913e-06
1250.00000  1300.00000  2.503340133983e-05
1300.00000  1350.00000  1.571864735292e-05
1350.00000  1400.00000  2.619774558820e-05
1400.00000  1450.00000  4.055799131802e-05
1450.00000  1500.00000  7.044282702604e-05
1500.00000  1550.00000  1.042088102286e-04
1550.00000  1600.00000  1.480657769170e-04
1600.00000  1650.00000  2.134631122001e-04
1650.00000  1700.00000  2.842940539756e-04
1700.00000  1750.00000  4.249856506530e-04
1750.00000  1800.00000  4.977571661757e-04
1800.00000  1850.00000  5.746038865678e-04
1850.00000  1900.00000  5.843067553042e-04
1900.00000  1950.00000  7.533307286917e-04
1950.00000  2000.00000  8.790799075151e-04
2000.00000  2050.00000  1.045969249781e-03
2050.00000  2100.00000  1.191124166077e-03
2100.00000  2150.00000  1.331233590630e-03
2150.00000  2200.00000  1.531306743974e-03
2200.00000  2250.00000  1.647353054061e-03
2250.00000  2300.00000  1.795224773603e-03
2300.00000  2350.00000  2.078354483330e-03
2350.00000  2400.00000  2.101253253548e-03
2400.00000  2450.00000  2.274352431805e-03
2450.00000  2500.00000  2.251065546838e-03
2500.00000  2550.00000  2.310447103504e-03
2550.00000  2600.00000  2.396608577883e-03
2600.00000  2650.00000  2.474037470399e-03
2650.00000  2700.00000  2.613370665454e-03
2700.00000  2750.00000  2.733880295159e-03
2750.00000  2800.00000  2.792679679702e-03
2800.00000  2850.00000  2.891842998188e-03
2850.00000  2900.00000  2.960151194092e-03
2900.00000  2950.00000  3.066106520693e-03
2950.00000  3000.00000  3.163523322806e-03
3000.00000  3050.00000  3.214172297610e-03
3050.00000  3100.00000  3.175166765290e-03
3100.00000  3150.00000  3.279763690268e-03
3150.00000  3200.00000  3.323620656956e-03
3200.00000  3250.00000  3.248520452936e-03
3250.00000  3300.00000  3.324979058579e-03
3300.00000  3350.00000  3.334099755191e-03
3350.00000  3400.00000  3.394839713481e-03
3400.00000  3450.00000  3.363208361400e-03
3450.00000  3500.00000  3.440249139167e-03
3500.00000  3550.00000  3.390376393862e-03
3550.00000  3600.00000  3.377956721880e-03
3600.00000  3650.00000  3.436367991673e-03
3650.00000  3700.00000  3.461983565137e-03
3700.00000  3750.00000  3.448787663655e-03
3750.00000  3800.00000  3.351176804167e-03
3800.00000  3850.00000  3.385719016869e-03
3850.00000  3900.00000  3.416962254200e-03
3900.00000  3950.00000  3.351370861542e-03
3950.00000  4000.00000  3.378344836629e-03
4000.00000  4050.00000  3.355834181161e-03
4050.00000  4100.00000  3.286749755758e-03
4100.00000  4150.00000  3.306155493230e-03
4150.00000  4200.00000  3.254342174178e-03
4200.00000  4250.00000  3.250461026684e-03
4250.00000  4300.00000  3.219994018852e-03
4300.00000  4350.00000  3.227174141716e-03
4350.00000  4400.00000  3.209320863242e-03
4400.00000  4450.00000  3.125294019985e-03
4450.00000  4500.00000  3.160030290061e-03
4500.00000  4550.00000  3.166628240802e-03
4550.00000  4600.00000  3.078526192675e-03
4600.00000  4650.00000  3.080078651673e-03
4650.00000  4700.00000  3.005948734527e-03
4700.00000  4750.00000  3.000321070660e-03
4750.00000  4800.00000  3.044178037349e-03
4800.00000  4850.00000  2.970048120203e-03
4850.00000  4900.00000  2.952194841728e-03
4900.00000  4950.00000  2.892813285061e-03
4950.00000  5000.00000  2.871855088591e-03
5000.00000  5050.00000  2.825475376031e-03
5050.00000  5100.00000  2.817130908917e-03
5100.00000  5150.00000  2.822176400660e-03
5150.00000  5200.00000  2.765317589865e-03
5200.00000  5250.00000  2.732910008286e-03
5250.00000  5300.00000  2.739313901652e-03
5300.00000  5350.00000  2.680126402360e-03
5350.00000  5400.00000  2.653734599397e-03
5400.00000  5450.00000  2.636075378297e-03
5450.00000  5500.00000  2.624820050563e-03
5500.00000  5550.00000  2.567185010269e-03
5550.00000  5600.00000  2.587949149364e-03
5600.00000  5650.00000  2.516536035465e-03
5650.00000  5700.00000  2.487039314506e-03
5700.00000  5750.00000  2.487621486630e-03
5750.00000  5800.00000  2.436196282328e-03
5800.00000  5850.00000  2.432315134833e-03
5850.00000  5900.00000  2.396414520509e-03
5900.00000  5950.00000  2.359155504561e-03
5950.00000  6000.00000  2.329464726228e-03
6000.00000  6050.00000  2.347123947328e-03
6050.00000  6100.00000  2.343824971957e-03
6100.00000  6150.00000  2.273576202306e-03
6150.00000  6200.00000  2.263291161446e-03
6200.00000  6250.00000  2.223315342252e-03
6250.00000  6300.00000  2.212254071892e-03
6300.00000  6350.00000  2.235152842110e-03
6350.00000  6400.00000  2.850896892120e-03
6400.00000  6450.00000  2.155395261097e-03
6450.00000  6500.00000  2.102029483047e-03
6500.00000  6550.00000  2.080489114452e-03
6550.00000  6600.00000  2.108627433788e-03
6600.00000  6650.00000  2.057590344234e-03
6650.00000  6700.00000  2.051380508243e-03
6700.00000  6750.00000  2.000149361315e-03
6750.00000  6800.00000  1.975310017350e-03
6800.00000  6850.00000  1.960755714246e-03
6850.00000  6900.00000  1.980161451718e-03
6900.00000  6950.00000  1.948336042263e-03
6950.00000  7000.00000  1.939603460400e-03
7000.00000  7050.00000  1.912241370564e-03
7050.00000  7100.00000  1.931647108036e-03
7100.00000  7150.00000  1.717601823712e-03
7150.00000  7200.00000  1.739724364431e-03
7200.00000  7250.00000  1.693926823995e-03
7250.00000  7300.00000  1.656667808048e-03
7300.00000  7350.00000  1.660937070292e-03
7350.00000  7400.00000  1.630276005085e-03
7400.00000  7450.00000  1.604660431621e-03
7450.00000  7500.00000  1.641725390194e-03
7500.00000  7550.00000  1.603302029998e-03
7550.00000  7600.00000  1.600391169377e-03
7600.00000  7650.00000  1.598450595629e-03
7650.00000  7700.00000  1.570312276294e-03
7700.00000  7750.00000  1.545084817579e-03
7750.00000  7800.00000  1.520827645739e-03
7800.00000  7850.00000  1.527425596479e-03
7850.00000  7900.00000  1.523738506359e-03
7900.00000  7950.00000  1.498122932895e-03
7950.00000  8000.00000  1.487449777285e-03
8000.00000  8050.00000  1.442428466349e-03
8050.00000  8100.00000  1.469402441436e-03
8100.00000  8150.00000  1.458923343200e-03
8150.00000  8200.00000  1.443786867972e-03
8200.00000  8250.00000  1.415648548636e-03
8250.00000  8300.00000  1.431367195989e-03
8300.00000  8350.00000  1.388092401425e-03
8350.00000  8400.00000  1.398571499660e-03
8400.00000  8450.00000  1.385181540804e-03
8450.00000  8500.00000  1.342877033114e-03
8500.00000  8550.00000  1.353550188724e-03
8550.00000  8600.00000  1.321336664519e-03
8600.00000  8650.00000  1.328128672634e-03
8650.00000  8700.00000  1.294168632057e-03
8700.00000  8750.00000  1.295915148429e-03
8750.00000  8800.00000  1.290287484562e-03
8800.00000  8850.00000  1.299020066425e-03
8850.00000  8900.00000  1.281943017449e-03
8900.00000  8950.00000  1.267194656970e-03
8950.00000  9000.00000  1.250699780118e-03
9000.00000  9050.00000  1.259044247231e-03
9050.00000  9100.00000  1.237503878637e-03
9100.00000  9150.00000  1.230129698397e-03
9150.00000  9200.00000  1.218292198539e-03
9200.00000  9250.00000  1.233234616393e-03
9250.00000  9300.00000  1.183944043212e-03
9300.00000  9350.00000  1.196751829944e-03
9350.00000  9400.00000  1.168419453234e-03
9400.00000  9450.00000  1.139116789650e-03
9450.00000  9500.00000  1.170942199105e-03
9500.00000  9550.00000  1.161433387743e-03
9550.00000  9600.00000  1.132324781534e-03
9600.00000  9650.00000  1.147849371512e-03
9650.00000  9700.00000  1.136011871654e-03
9700.00000  9750.00000  1.137176215902e-03
9750.00000  9800.00000  1.101469658953e-03
9800.00000  9850.00000  1.086527241099e-03
9850.00000  9900.00000  1.118158593179e-03
9900.00000  9950.00000  1.062076011883e-03
9950.00000  10000.00000  1.091184618092e-03
