300.00000  350.00000  8.184557003043e-05
350.00000  400.00000  1.242564563189e-04
400.00000  450.00000  5.580379774802e-05
450.00000  500.00000  8.407772194035e-05
500.00000  550.00000  4.873531669994e-04
550.00000  600.00000  5.505974711138e-05
600.00000  650.00000  1.309529120487e-04
650.00000  700.00000  6.622050666098e-05
700.00000  750.00000  8.779797512355e-05
750.00000  800.00000  7.068481048083e-05
800.00000  850.00000  2.172627858990e-04
850.00000  900.00000  6.994075984419e-05
900.00000  950.00000  6.026810156786e-05
950.00000  1000.00000  5.580379774802e-05
1000.00000  1050.00000  7.142886111747e-05
1050.00000  1100.00000  6.622050666098e-05
1100.00000  1150.00000  6.101215220450e-05
1150.00000  1200.00000  5.654784838466e-05
1200.00000  1250.00000  6.175620284114e-05
1250.00000  1300.00000  1.287207601388e-04
1300.00000  1350.00000  4.910734201826e-05
1350.00000  1400.00000  4.464303819842e-05
1400.00000  1450.00000  5.133949392818e-05
1450.00000  1500.00000  6.622050666098e-05
1500.00000  1550.00000  5.357164583810e-05
1550.00000  1600.00000  4.613113947170e-05
1600.00000  1650.00000  5.133949392818e-05
1650.00000  1700.00000  5.208354456482e-05
1700.00000  1750.00000  1.108635448594e-04
1750.00000  1800.00000  5.952405093122e-05
1800.00000  1850.00000  3.720253183201e-05
1850.00000  1900.00000  4.538708883506e-05
1900.00000  1950.00000  4.092278501522e-05
1950.00000  2000.00000  4.613113947170e-05
2000.00000  2050.00000  4.315493692514e-05
2050.00000  2100.00000  4.241088628850e-05
2100.00000  2150.00000  3.943468374193e-05
2150.00000  2200.00000  3.943468374193e-05
2200.00000  2250.00000  4.464303819842e-05
2250.00000  2300.00000  3.571443055873e-05
2300.00000  2350.00000  9.449443085332e-05
2350.00000  2400.00000  2.901797482897e-05
2400.00000  2450.00000  4.092278501522e-05
2450.00000  2500.00000  3.497037992209e-05
2500.00000  2550.00000  4.017873437857e-05
2550.00000  2600.00000  3.273822801217e-05
2600.00000  2650.00000  3.497037992209e-05
2650.00000  2700.00000  4.241088628850e-05
2700.00000  2750.00000  3.720253183201e-05
2750.00000  2800.00000  3.199417737553e-05
2800.00000  2850.00000  2.976202546561e-05
2850.00000  2900.00000  3.720253183201e-05
2900.00000  2950.00000  3.497037992209e-05
2950.00000  3000.00000  4.761924074498e-05
3000.00000  3050.00000  4.910734201826e-05
3050.00000  3100.00000  2.678582291905e-05
3100.00000  3150.00000  4.017873437857e-05
3150.00000  3200.00000  3.869063310529e-05
3200.00000  3250.00000  4.017873437857e-05
3250.00000  3300.00000  3.645848119537e-05
3300.00000  3350.00000  4.538708883506e-05
3350.00000  3400.00000  4.538708883506e-05
3400.00000  3450.00000  4.464303819842e-05
3450.00000  3500.00000  4.613113947170e-05
3500.00000  3550.00000  5.431569647474e-05
3550.00000  3600.00000  6.622050666098e-05
3600.00000  3650.00000  5.803594965794e-05
3650.00000  3700.00000  8.556582321363e-05
3700.00000  3750.00000  6.622050666098e-05
3750.00000  3800.00000  7.589316493731e-05
3800.00000  3850.00000  8.407772194035e-05
3850.00000  3900.00000  9.449443085332e-05
3900.00000  3950.00000  9.672658276324e-05
3950.00000  4000.00000  1.183040512258e-04
4000.00000  4050.00000  1.183040512258e-04
4050.00000  4100.00000  9.672658276324e-05
4100.00000  4150.00000  1.346731652319e-04
4150.00000  4200.00000  1.324410133220e-04
4200.00000  4250.00000  1.309529120487e-04
4250.00000  4300.00000  1.458339247815e-04
4300.00000  4350.00000  1.584827856044e-04
4350.00000  4400.00000  1.904769629799e-04
4400.00000  4450.00000  1.666673426074e-04
4450.00000  4500.00000  1.763400008837e-04
4500.00000  4550.00000  2.008936718929e-04
4550.00000  4600.00000  1.979174693463e-04
4600.00000  4650.00000  2.113103808058e-04
4650.00000  4700.00000  2.388402543615e-04
4700.00000  4750.00000  2.135425327158e-04
4750.00000  4800.00000  2.566974696409e-04
4800.00000  4850.00000  2.678582291905e-04
4850.00000  4900.00000  2.589296215508e-04
4900.00000  4950.00000  2.805070900134e-04
4950.00000  5000.00000  2.544653177310e-04
5000.00000  5050.00000  2.790189887401e-04
5050.00000  5100.00000  2.939000014729e-04
5100.00000  5150.00000  3.035726597492e-04
5150.00000  5200.00000  3.117572167523e-04
5200.00000  5250.00000  3.050607610225e-04
5250.00000  5300.00000  3.132453180256e-04
5300.00000  5350.00000  3.392870903080e-04
5350.00000  5400.00000  3.303584826683e-04
5400.00000  5450.00000  3.236620269385e-04
5450.00000  5500.00000  3.154774699355e-04
5500.00000  5550.00000  3.422632928545e-04
5550.00000  5600.00000  3.318465839416e-04
5600.00000  5650.00000  3.772336727766e-04
5650.00000  5700.00000  3.757455715033e-04
5700.00000  5750.00000  3.541681030408e-04
5750.00000  5800.00000  3.377989890347e-04
5800.00000  5850.00000  3.549121536774e-04
5850.00000  5900.00000  3.958349386926e-04
5900.00000  5950.00000  3.816979765965e-04
5950.00000  6000.00000  3.742574702301e-04
6000.00000  6050.00000  3.839301285064e-04
6050.00000  6100.00000  3.623526600438e-04
6100.00000  6150.00000  3.913706348728e-04
6150.00000  6200.00000  3.846741791430e-04
6200.00000  6250.00000  4.270850654315e-04
6250.00000  6300.00000  4.337815211613e-04
6300.00000  6350.00000  4.308053186147e-04
6350.00000  6400.00000  1.142861777879e-03
6400.00000  6450.00000  3.980670906025e-04
6450.00000  6500.00000  4.136921539720e-04
6500.00000  6550.00000  3.757455715033e-04
6550.00000  6600.00000  4.055075969690e-04
6600.00000  6650.00000  4.092278501522e-04
6650.00000  6700.00000  4.144362046086e-04
6700.00000  6750.00000  4.062516476056e-04
6750.00000  6800.00000  3.958349386926e-04
6800.00000  6850.00000  4.047635463323e-04
6850.00000  6900.00000  4.218767109750e-04
6900.00000  6950.00000  4.002992425125e-04
6950.00000  7000.00000  3.988111412392e-04
7000.00000  7050.00000  4.032754450590e-04
7050.00000  7100.00000  4.933055720925e-04
7100.00000  7150.00000  2.269354441753e-04
7150.00000  7200.00000  1.919650642532e-04
7200.00000  7250.00000  2.142865833524e-04
7250.00000  7300.00000  1.741078489738e-04
7300.00000  7350.00000  1.941972161631e-04
7350.00000  7400.00000  1.971734187097e-04
7400.00000  7450.00000  2.090782288959e-04
7450.00000  7500.00000  2.291675960852e-04
7500.00000  7550.00000  1.971734187097e-04
7550.00000  7600.00000  2.276794948119e-04
7600.00000  7650.00000  2.053579757127e-04
7650.00000  7700.00000  2.008936718929e-04
7700.00000  7750.00000  2.135425327158e-04
7750.00000  7800.00000  1.919650642532e-04
7800.00000  7850.00000  2.001496212562e-04
7850.00000  7900.00000  1.956853174364e-04
7900.00000  7950.00000  1.815483553402e-04
7950.00000  8000.00000  2.023817731662e-04
8000.00000  8050.00000  2.061020263494e-04
8050.00000  8100.00000  2.172627858990e-04
8100.00000  8150.00000  2.284235454486e-04
8150.00000  8200.00000  2.053579757127e-04
8200.00000  8250.00000  2.120544314425e-04
8250.00000  8300.00000  2.194949378089e-04
8300.00000  8350.00000  1.830364566135e-04
8350.00000  8400.00000  1.919650642532e-04
8400.00000  8450.00000  2.194949378089e-04
8450.00000  8500.00000  2.068460769860e-04
8500.00000  8550.00000  2.105663301692e-04
8550.00000  8600.00000  2.180068365356e-04
8600.00000  8650.00000  2.068460769860e-04
8650.00000  8700.00000  2.120544314425e-04
8700.00000  8750.00000  2.447926594547e-04
8750.00000  8800.00000  2.217270897188e-04
8800.00000  8850.00000  2.165187352623e-04
8850.00000  8900.00000  2.053579757127e-04
8900.00000  8950.00000  2.008936718929e-04
8950.00000  9000.00000  2.291675960852e-04
9000.00000  9050.00000  2.209830390822e-04
9050.00000  9100.00000  2.247032922654e-04
9100.00000  9150.00000  2.150306339890e-04
9150.00000  9200.00000  1.845245578868e-04
9200.00000  9250.00000  2.061020263494e-04
9250.00000  9300.00000  2.150306339890e-04
9300.00000  9350.00000  2.075901276226e-04
9350.00000  9400.00000  1.919650642532e-04
9400.00000  9450.00000  1.971734187097e-04
9450.00000  9500.00000  1.800602540669e-04
9500.00000  9550.00000  1.971734187097e-04
9550.00000  9600.00000  1.860126591601e-04
9600.00000  9650.00000  2.120544314425e-04
9650.00000  9700.00000  1.956853174364e-04
9700.00000  9750.00000  1.867567097967e-04
9750.00000  9800.00000  2.075901276226e-04
9800.00000  9850.00000  2.023817731662e-04
9850.00000  9900.00000  1.971734187097e-04
9900.00000  9950.00000  2.075901276226e-04
9950.00000  10000.00000  2.001496212562e-04
