300.00000  350.00000  2.071062254593e+00
350.00000  400.00000  1.466609677282e+00
400.00000  450.00000  1.082449174580e+00
450.00000  500.00000  8.266705298370e-01
500.00000  550.00000  6.511357980307e-01
550.00000  600.00000  5.222872879231e-01
600.00000  650.00000  4.280468115099e-01
650.00000  700.00000  3.545948630432e-01
700.00000  750.00000  2.994376294334e-01
750.00000  800.00000  2.547343042435e-01
800.00000  850.00000  2.191164413017e-01
850.00000  900.00000  1.904413419968e-01
900.00000  950.00000  1.662437025347e-01
950.00000  1000.00000  1.467118343129e-01
1000.00000  1050.00000  1.298193266352e-01
1050.00000  1100.00000  1.157312333162e-01
1100.00000  1150.00000  1.036657994703e-01
1150.00000  1200.00000  9.374381448020e-02
1200.00000  1250.00000  8.476038549935e-02
1250.00000  1300.00000  7.660447632524e-02
1300.00000  1350.00000  7.003908572800e-02
1350.00000  1400.00000  6.407464106475e-02
1400.00000  1450.00000  5.883868391949e-02
1450.00000  1500.00000  5.426444252178e-02
1500.00000  1550.00000  5.006007171764e-02
1550.00000  1600.00000  4.613854313213e-02
1600.00000  1650.00000  4.295375475534e-02
1650.00000  1700.00000  3.971269803267e-02
1700.00000  1750.00000  3.682800750057e-02
1750.00000  1800.00000  3.461103467291e-02
1800.00000  1850.00000  3.220575044771e-02
1850.00000  1900.00000  3.064149043225e-02
1900.00000  1950.00000  2.839975953240e-02
1950.00000  2000.00000  2.669970524223e-02
2000.00000  2050.00000  2.518871259420e-02
2050.00000  2100.00000  2.349541050553e-02
2100.00000  2150.00000  2.249308370426e-02
2150.00000  2200.00000  2.116064927383e-02
2200.00000  2250.00000  1.995650667200e-02
2250.00000  2300.00000  1.894517693539e-02
2300.00000  2350.00000  1.805163560282e-02
2350.00000  2400.00000  1.710407665821e-02
2400.00000  2450.00000  1.629156174370e-02
2450.00000  2500.00000  1.544153459861e-02
2500.00000  2550.00000  1.488335260749e-02
2550.00000  2600.00000  1.410384845590e-02
2600.00000  2650.00000  1.344813466525e-02
2650.00000  2700.00000  1.274965693173e-02
2700.00000  2750.00000  1.237078340281e-02
2750.00000  2800.00000  1.184786290843e-02
2800.00000  2850.00000  1.121840767919e-02
2850.00000  2900.00000  1.082227852420e-02
2900.00000  2950.00000  1.026709751152e-02
2950.00000  3000.00000  9.915983033227e-03
3000.00000  3050.00000  9.591127116349e-03
3050.00000  3100.00000  9.137979370864e-03
3100.00000  3150.00000  8.770359511117e-03
3150.00000  3200.00000  8.449254817296e-03
3200.00000  3250.00000  8.210677030767e-03
3250.00000  3300.00000  7.858812307865e-03
3300.00000  3350.00000  7.632238435123e-03
3350.00000  3400.00000  7.305131784409e-03
3400.00000  3450.00000  7.147580415946e-03
3450.00000  3500.00000  6.838479635913e-03
3500.00000  3550.00000  6.570642309526e-03
3550.00000  3600.00000  6.335815746055e-03
3600.00000  3650.00000  6.090485758019e-03
3650.00000  3700.00000  5.909676806592e-03
3700.00000  3750.00000  5.778383999540e-03
3750.00000  3800.00000  5.552560371409e-03
3800.00000  3850.00000  5.329737721726e-03
3850.00000  3900.00000  5.255463505164e-03
3900.00000  3950.00000  5.120419475053e-03
3950.00000  4000.00000  4.884842666970e-03
4000.00000  4050.00000  4.835326522596e-03
4050.00000  4100.00000  4.574991642326e-03
4100.00000  4150.00000  4.487213022754e-03
4150.00000  4200.00000  4.377677309441e-03
4200.00000  4250.00000  4.229879120930e-03
4250.00000  4300.00000  4.106839004607e-03
4300.00000  4350.00000  4.071577507855e-03
4350.00000  4400.00000  3.813493361421e-03
4400.00000  4450.00000  3.690453245097e-03
4450.00000  4500.00000  3.746721590977e-03
4500.00000  4550.00000  3.557659948821e-03
4550.00000  4600.00000  3.418114451039e-03
4600.00000  4650.00000  3.441372034003e-03
4650.00000  4700.00000  3.321332896126e-03
4700.00000  4750.00000  3.201293758249e-03
4750.00000  4800.00000  3.133771743194e-03
4800.00000  4850.00000  3.000978446918e-03
4850.00000  4900.00000  3.060998015856e-03
4900.00000  4950.00000  2.887691510546e-03
4950.00000  5000.00000  2.908698359675e-03
5000.00000  5050.00000  2.876437841371e-03
5050.00000  5100.00000  2.716635739072e-03
5100.00000  5150.00000  2.685875709991e-03
5150.00000  5200.00000  2.643862011734e-03
5200.00000  5250.00000  2.604099047313e-03
5250.00000  5300.00000  2.469055017201e-03
5300.00000  5350.00000  2.471305751037e-03
5350.00000  5400.00000  2.440545721956e-03
5400.00000  5450.00000  2.297249001115e-03
5450.00000  5500.00000  2.292747533445e-03
5500.00000  5550.00000  2.258986525917e-03
5550.00000  5600.00000  2.204218669261e-03
5600.00000  5650.00000  2.055670236139e-03
5650.00000  5700.00000  2.070675128373e-03
5700.00000  5750.00000  1.974643818072e-03
5750.00000  5800.00000  2.052669257692e-03
5800.00000  5850.00000  1.972393084237e-03
5850.00000  5900.00000  1.988898465695e-03
5900.00000  5950.00000  1.823844651114e-03
5950.00000  6000.00000  1.888365687723e-03
6000.00000  6050.00000  1.845601744854e-03
6050.00000  6100.00000  1.725562606978e-03
6100.00000  6150.00000  1.731564563871e-03
6150.00000  6200.00000  1.708306980908e-03
6200.00000  6250.00000  1.679797685662e-03
6250.00000  6300.00000  1.616777138277e-03
6300.00000  6350.00000  1.603272735266e-03
6350.00000  6400.00000  1.754822146835e-03
6400.00000  6450.00000  1.530499007928e-03
6450.00000  6500.00000  1.509492158800e-03
6500.00000  6550.00000  1.462226748261e-03
6550.00000  6600.00000  1.492236532730e-03
6600.00000  6650.00000  1.485484331224e-03
6650.00000  6700.00000  1.416461826945e-03
6700.00000  6750.00000  1.450973079085e-03
6750.00000  6800.00000  1.352691034948e-03
6800.00000  6850.00000  1.378949596359e-03
6850.00000  6900.00000  1.315929048973e-03
6900.00000  6950.00000  1.282918286057e-03
6950.00000  7000.00000  1.269413883046e-03
7000.00000  7050.00000  1.249907523141e-03
7050.00000  7100.00000  1.289670487563e-03
7100.00000  7150.00000  1.159878169734e-03
7150.00000  7200.00000  1.201891867990e-03
7200.00000  7250.00000  1.170381594298e-03
7250.00000  7300.00000  1.131368874488e-03
7300.00000  7350.00000  1.141122054440e-03
7350.00000  7400.00000  1.089355176231e-03
7400.00000  7450.00000  1.066097593267e-03
7450.00000  7500.00000  1.053343434868e-03
7500.00000  7550.00000  1.090855665455e-03
7550.00000  7600.00000  9.648145706840e-04
7600.00000  7650.00000  1.018081938117e-03
7650.00000  7700.00000  1.035337564187e-03
7700.00000  7750.00000  1.017331693505e-03
7750.00000  7800.00000  9.903228874828e-04
7800.00000  7850.00000  9.625638368488e-04
7850.00000  7900.00000  9.318038077679e-04
7900.00000  7950.00000  9.483091892260e-04
7950.00000  8000.00000  8.642817927123e-04
8000.00000  8050.00000  8.552788573715e-04
8050.00000  8100.00000  8.477764112542e-04
8100.00000  8150.00000  8.762857064999e-04
8150.00000  8200.00000  8.732847280530e-04
8200.00000  8250.00000  8.020114899387e-04
8250.00000  8300.00000  7.847558638689e-04
8300.00000  8350.00000  8.155158929499e-04
8350.00000  8400.00000  7.945090438214e-04
8400.00000  8450.00000  7.772534177517e-04
8450.00000  8500.00000  7.652495039640e-04
8500.00000  8550.00000  7.975100222683e-04
8550.00000  8600.00000  7.847558638689e-04
8600.00000  8650.00000  7.502446117294e-04
8650.00000  8700.00000  7.502446117294e-04
8700.00000  8750.00000  7.629987701288e-04
8750.00000  8800.00000  7.149831149781e-04
8800.00000  8850.00000  6.677177044392e-04
8850.00000  8900.00000  6.827225966738e-04
8900.00000  8950.00000  6.782211290034e-04
8950.00000  9000.00000  6.872240643441e-04
9000.00000  9050.00000  6.384581645817e-04
9050.00000  9100.00000  6.076981355008e-04
9100.00000  9150.00000  6.594650137101e-04
9150.00000  9200.00000  6.609655029336e-04
9200.00000  9250.00000  6.497118337577e-04
9250.00000  9300.00000  6.091986247243e-04
9300.00000  9350.00000  5.836903079255e-04
9350.00000  9400.00000  6.009459339952e-04
9400.00000  9450.00000  5.619332141853e-04
9450.00000  9500.00000  5.791888402551e-04
9500.00000  9550.00000  6.076981355008e-04
9550.00000  9600.00000  5.821898187020e-04
9600.00000  9650.00000  5.476785665625e-04
9650.00000  9700.00000  5.716863941378e-04
9700.00000  9750.00000  5.679351710792e-04
9750.00000  9800.00000  5.371751419982e-04
9800.00000  9850.00000  5.116668251994e-04
9850.00000  9900.00000  4.861585084006e-04
9900.00000  9950.00000  5.274219620458e-04
9950.00000  10000.00000  5.409263650569e-04
