10001.00000  11001.00000  1.294267508099e-05
11001.00000  12001.00000  1.907853381586e-05
12001.00000  13001.00000  2.444619470595e-05
13001.00000  14001.00000  3.307140341882e-05
14001.00000  15001.00000  3.955732699435e-05
15001.00000  16001.00000  4.723930544212e-05
16001.00000  17001.00000  5.333626808358e-05
17001.00000  18001.00000  5.708001707395e-05
18001.00000  19001.00000  6.023060063987e-05
19001.00000  20001.00000  6.092100629783e-05
20001.00000  21001.00000  6.083349008767e-05
21001.00000  22001.00000  6.202954495992e-05
22001.00000  23001.00000  5.911233795443e-05
23001.00000  24001.00000  5.713836121406e-05
24001.00000  25001.00000  5.246110598193e-05
25001.00000  26001.00000  5.131367122644e-05
26001.00000  27001.00000  4.868818492151e-05
27001.00000  28001.00000  4.541118905202e-05
28001.00000  29001.00000  4.222170939269e-05
29001.00000  30001.00000  3.897388559325e-05
30001.00000  31001.00000  3.653315573200e-05
31001.00000  32001.00000  3.380070517019e-05
32001.00000  33001.00000  3.262409834465e-05
33001.00000  34001.00000  3.057232941746e-05
34001.00000  35001.00000  2.941517063862e-05
35001.00000  36001.00000  2.627431109605e-05
36001.00000  37001.00000  2.394054549166e-05
37001.00000  38001.00000  2.303621131996e-05
38001.00000  39001.00000  2.211242910156e-05
39001.00000  40001.00000  2.046906915514e-05
40001.00000  41001.00000  1.967169924031e-05
41001.00000  42001.00000  1.775606664004e-05
42001.00000  43001.00000  1.711428109883e-05
43001.00000  44001.00000  1.614187876367e-05
44001.00000  45001.00000  1.501389205488e-05
45001.00000  46001.00000  1.438183053703e-05
46001.00000  47001.00000  1.372059694912e-05
47001.00000  48001.00000  1.299129519775e-05
48001.00000  49001.00000  1.196054872248e-05
49001.00000  50001.00000  1.132848720462e-05
50001.00000  51001.00000  1.043387705628e-05
51001.00000  52001.00000  1.041442900957e-05
52001.00000  53001.00000  9.558714954632e-06
53001.00000  54001.00000  9.189202067271e-06
54001.00000  55001.00000  8.809965156558e-06
55001.00000  56001.00000  8.722448946394e-06
56001.00000  57001.00000  8.177903638704e-06
57001.00000  58001.00000  7.468049934036e-06
58001.00000  59001.00000  6.952676696401e-06
59001.00000  60001.00000  6.680404042556e-06
60001.00000  61001.00000  6.155306781569e-06
61001.00000  62001.00000  5.970550337888e-06
62001.00000  63001.00000  5.805241940911e-06
63001.00000  64001.00000  5.999722407943e-06
64001.00000  65001.00000  5.037044096134e-06
65001.00000  66001.00000  4.618911092014e-06
66001.00000  67001.00000  4.550842928553e-06
67001.00000  68001.00000  4.511946835147e-06
68001.00000  69001.00000  4.395258554927e-06
69001.00000  70001.00000  4.453602695037e-06
70001.00000  71001.00000  3.879885317292e-06
71001.00000  72001.00000  3.782645083776e-06
72001.00000  73001.00000  3.782645083776e-06
73001.00000  74001.00000  3.510372429931e-06
74001.00000  75001.00000  3.461752313173e-06
75001.00000  76001.00000  3.004723215647e-06
76001.00000  77001.00000  2.732450561802e-06
77001.00000  78001.00000  2.994999192296e-06
78001.00000  79001.00000  2.849138842022e-06
79001.00000  80001.00000  2.839414818670e-06
80001.00000  81001.00000  2.781070678560e-06
81001.00000  82001.00000  2.635210328286e-06
82001.00000  83001.00000  2.314317557683e-06
83001.00000  84001.00000  2.333765604386e-06
84001.00000  85001.00000  2.149009160706e-06
85001.00000  86001.00000  2.246249394222e-06
86001.00000  87001.00000  1.935080646970e-06
87001.00000  88001.00000  2.071216973893e-06
88001.00000  89001.00000  1.964252717025e-06
89001.00000  90001.00000  1.614187876367e-06
90001.00000  91001.00000  2.003148810432e-06
91001.00000  92001.00000  1.750324203290e-06
92001.00000  93001.00000  1.798944320048e-06
93001.00000  94001.00000  1.409983385983e-06
94001.00000  95001.00000  1.662807993125e-06
95001.00000  96001.00000  1.487775572796e-06
96001.00000  97001.00000  1.371087292577e-06
97001.00000  98001.00000  1.293295105764e-06
98001.00000  99001.00000  1.303019129116e-06
99001.00000  100001.00000  1.176606825545e-06
100001.00000  101001.00000  1.273847059061e-06
101001.00000  102001.00000  1.205778895600e-06
102001.00000  103001.00000  1.215502918951e-06
103001.00000  104001.00000  1.332191199170e-06
104001.00000  105001.00000  1.244674989006e-06
105001.00000  106001.00000  9.626783118093e-07
106001.00000  107001.00000  1.011298428567e-06
107001.00000  108001.00000  9.335062417545e-07
108001.00000  109001.00000  1.001574405216e-06
109001.00000  110001.00000  8.459900315900e-07
110001.00000  111001.00000  8.751621016448e-07
111001.00000  112001.00000  1.030746475271e-06
112001.00000  113001.00000  9.237822184029e-07
113001.00000  114001.00000  8.265419848868e-07
114001.00000  115001.00000  8.070939381836e-07
115001.00000  116001.00000  8.946101483481e-07
116001.00000  117001.00000  8.557140549416e-07
117001.00000  118001.00000  6.806816346127e-07
118001.00000  119001.00000  8.168179615352e-07
119001.00000  120001.00000  5.931654244482e-07
120001.00000  121001.00000  6.904056579643e-07
121001.00000  122001.00000  6.612335879094e-07
122001.00000  123001.00000  5.542693310417e-07
123001.00000  124001.00000  6.612335879094e-07
124001.00000  125001.00000  5.056492142837e-07
125001.00000  126001.00000  6.126134711514e-07
126001.00000  127001.00000  6.126134711514e-07
127001.00000  128001.00000  6.126134711514e-07
128001.00000  129001.00000  5.348212843385e-07
129001.00000  130001.00000  3.792369107128e-07
130001.00000  131001.00000  4.181330041192e-07
131001.00000  132001.00000  4.959251909321e-07
132001.00000  133001.00000  4.278570274708e-07
133001.00000  134001.00000  4.181330041192e-07
134001.00000  135001.00000  4.667531208773e-07
135001.00000  136001.00000  3.500648406579e-07
136001.00000  137001.00000  3.889609340644e-07
137001.00000  138001.00000  2.917207005483e-07
138001.00000  139001.00000  3.695128873612e-07
139001.00000  140001.00000  3.889609340644e-07
140001.00000  141001.00000  2.528246071418e-07
141001.00000  142001.00000  3.597888640095e-07
142001.00000  143001.00000  3.792369107128e-07
143001.00000  144001.00000  3.208927706031e-07
144001.00000  145001.00000  2.042044903838e-07
145001.00000  146001.00000  3.403408173063e-07
146001.00000  147001.00000  2.528246071418e-07
147001.00000  148001.00000  3.500648406579e-07
148001.00000  149001.00000  3.403408173063e-07
149001.00000  150001.00000  3.208927706031e-07
150001.00000  151001.00000  1.847564436806e-07
151001.00000  152001.00000  2.722726538451e-07
152001.00000  153001.00000  3.208927706031e-07
153001.00000  154001.00000  2.236525370870e-07
154001.00000  155001.00000  1.847564436806e-07
155001.00000  156001.00000  1.458603502741e-07
156001.00000  157001.00000  1.944804670322e-07
157001.00000  158001.00000  2.042044903838e-07
158001.00000  159001.00000  1.847564436806e-07
159001.00000  160001.00000  1.166882802193e-07
160001.00000  161001.00000  2.431005837902e-07
161001.00000  162001.00000  1.555843736258e-07
162001.00000  163001.00000  1.166882802193e-07
163001.00000  164001.00000  1.653083969774e-07
164001.00000  165001.00000  1.750324203290e-07
165001.00000  166001.00000  1.750324203290e-07
166001.00000  167001.00000  2.139285137354e-07
167001.00000  168001.00000  1.264123035709e-07
168001.00000  169001.00000  1.458603502741e-07
169001.00000  170001.00000  1.361363269225e-07
170001.00000  171001.00000  1.264123035709e-07
171001.00000  172001.00000  1.361363269225e-07
172001.00000  173001.00000  9.724023351609e-08
173001.00000  174001.00000  1.264123035709e-07
174001.00000  175001.00000  1.458603502741e-07
175001.00000  176001.00000  1.069642568677e-07
176001.00000  177001.00000  6.806816346127e-08
177001.00000  178001.00000  8.751621016448e-08
178001.00000  179001.00000  6.806816346127e-08
179001.00000  180001.00000  1.166882802193e-07
180001.00000  181001.00000  1.264123035709e-07
181001.00000  182001.00000  9.724023351609e-08
182001.00000  183001.00000  7.779218681288e-08
183001.00000  184001.00000  7.779218681288e-08
184001.00000  185001.00000  1.361363269225e-07
185001.00000  186001.00000  6.806816346127e-08
186001.00000  187001.00000  9.724023351609e-08
187001.00000  188001.00000  1.264123035709e-07
188001.00000  189001.00000  7.779218681288e-08
189001.00000  190001.00000  1.069642568677e-07
190001.00000  191001.00000  5.834414010966e-08
191001.00000  192001.00000  6.806816346127e-08
192001.00000  193001.00000  7.779218681288e-08
193001.00000  194001.00000  3.889609340644e-08
194001.00000  195001.00000  9.724023351609e-09
195001.00000  196001.00000  1.264123035709e-07
196001.00000  197001.00000  4.862011675805e-08
197001.00000  198001.00000  4.862011675805e-08
198001.00000  199001.00000  4.862011675805e-08
