10001.00000  11001.00000  3.368368660920e-04
11001.00000  12001.00000  2.614731978850e-04
12001.00000  13001.00000  2.088235260381e-04
13001.00000  14001.00000  1.692858414327e-04
14001.00000  15001.00000  1.400763683161e-04
15001.00000  16001.00000  1.162730684007e-04
16001.00000  17001.00000  1.019910884514e-04
17001.00000  18001.00000  8.085053056035e-05
18001.00000  19001.00000  7.136955517029e-05
19001.00000  20001.00000  6.007307385447e-05
20001.00000  21001.00000  5.099554422569e-05
21001.00000  22001.00000  4.776797813546e-05
22001.00000  23001.00000  3.937630630085e-05
23001.00000  24001.00000  3.602770648223e-05
24001.00000  25001.00000  3.058118870496e-05
25001.00000  26001.00000  2.610294075476e-05
26001.00000  27001.00000  2.529604923221e-05
27001.00000  28001.00000  2.243158432712e-05
28001.00000  29001.00000  1.984953145494e-05
29001.00000  30001.00000  1.625886417955e-05
30001.00000  31001.00000  1.690437739760e-05
31001.00000  32001.00000  1.545197265699e-05
32001.00000  33001.00000  1.153854877258e-05
33001.00000  34001.00000  1.331371012221e-05
34001.00000  35001.00000  1.081234640228e-05
35001.00000  36001.00000  9.642353694573e-06
36001.00000  37001.00000  8.674083867503e-06
37001.00000  38001.00000  6.939267094002e-06
38001.00000  39001.00000  7.383057431409e-06
39001.00000  40001.00000  7.544435735921e-06
40001.00000  41001.00000  7.181334550770e-06
41001.00000  42001.00000  4.962382863734e-06
42001.00000  43001.00000  5.043072015990e-06
43001.00000  44001.00000  4.760659983094e-06
44001.00000  45001.00000  4.679970830839e-06
45001.00000  46001.00000  3.832734732152e-06
46001.00000  47001.00000  3.469633547001e-06
47001.00000  48001.00000  3.671356427641e-06
48001.00000  49001.00000  3.711701003769e-06
49001.00000  50001.00000  2.743431176699e-06
50001.00000  51001.00000  2.864464905082e-06
51001.00000  52001.00000  2.339985415419e-06
52001.00000  53001.00000  1.976884230268e-06
53001.00000  54001.00000  1.936539654140e-06
54001.00000  55001.00000  2.017228806396e-06
55001.00000  56001.00000  1.936539654140e-06
56001.00000  57001.00000  1.533093892861e-06
57001.00000  58001.00000  1.371715588349e-06
58001.00000  59001.00000  1.533093892861e-06
59001.00000  60001.00000  1.976884230268e-06
60001.00000  61001.00000  1.048958979326e-06
61001.00000  62001.00000  1.371715588349e-06
62001.00000  63001.00000  1.533093892861e-06
63001.00000  64001.00000  1.371715588349e-06
64001.00000  65001.00000  1.250681859965e-06
65001.00000  66001.00000  1.129648131582e-06
66001.00000  67001.00000  1.089303555454e-06
67001.00000  68001.00000  1.008614403198e-06
68001.00000  69001.00000  7.262023703025e-07
69001.00000  70001.00000  8.068915225584e-07
70001.00000  71001.00000  6.455132180467e-07
71001.00000  72001.00000  6.051686419188e-07
72001.00000  73001.00000  5.244794896629e-07
73001.00000  74001.00000  3.227566090234e-07
74001.00000  75001.00000  4.034457612792e-07
75001.00000  76001.00000  6.455132180467e-07
76001.00000  77001.00000  5.244794896629e-07
77001.00000  78001.00000  1.008614403198e-06
78001.00000  79001.00000  5.648240657909e-07
79001.00000  80001.00000  5.244794896629e-07
80001.00000  81001.00000  5.244794896629e-07
81001.00000  82001.00000  4.841349135350e-07
82001.00000  83001.00000  3.631011851513e-07
83001.00000  84001.00000  2.420674567675e-07
84001.00000  85001.00000  3.227566090234e-07
85001.00000  86001.00000  3.631011851513e-07
86001.00000  87001.00000  3.631011851513e-07
87001.00000  88001.00000  2.420674567675e-07
88001.00000  89001.00000  2.017228806396e-07
89001.00000  90001.00000  1.613783045117e-07
90001.00000  91001.00000  4.034457612792e-07
91001.00000  92001.00000  4.034457612792e-08
92001.00000  93001.00000  3.631011851513e-07
93001.00000  94001.00000  3.227566090234e-07
94001.00000  95001.00000  2.824120328954e-07
95001.00000  96001.00000  1.210337283838e-07
96001.00000  97001.00000  3.227566090234e-07
97001.00000  98001.00000  1.613783045117e-07
98001.00000  99001.00000  8.068915225584e-08
99001.00000  100001.00000  4.034457612792e-08
100001.00000  101001.00000  2.017228806396e-07
101001.00000  102001.00000  8.068915225584e-08
102001.00000  103001.00000  2.017228806396e-07
103001.00000  104001.00000  1.613783045117e-07
104001.00000  105001.00000  4.034457612792e-08
105001.00000  106001.00000  4.034457612792e-08
106001.00000  107001.00000  1.613783045117e-07
107001.00000  108001.00000  2.017228806396e-07
108001.00000  109001.00000  8.068915225584e-08
109001.00000  110001.00000  1.210337283838e-07
110001.00000  111001.00000  1.210337283838e-07
111001.00000  112001.00000  1.210337283838e-07
112001.00000  113001.00000  0.000000000000e+00
113001.00000  114001.00000  4.034457612792e-08
114001.00000  115001.00000  0.000000000000e+00
115001.00000  116001.00000  0.000000000000e+00
116001.00000  117001.00000  4.034457612792e-08
117001.00000  118001.00000  8.068915225584e-08
118001.00000  119001.00000  8.068915225584e-08
119001.00000  120001.00000  8.068915225584e-08
120001.00000  121001.00000  0.000000000000e+00
121001.00000  122001.00000  8.068915225584e-08
122001.00000  123001.00000  8.068915225584e-08
123001.00000  124001.00000  4.034457612792e-08
124001.00000  125001.00000  1.210337283838e-07
125001.00000  126001.00000  4.034457612792e-08
126001.00000  127001.00000  1.210337283838e-07
127001.00000  128001.00000  4.034457612792e-08
128001.00000  129001.00000  0.000000000000e+00
129001.00000  130001.00000  8.068915225584e-08
130001.00000  131001.00000  0.000000000000e+00
131001.00000  132001.00000  0.000000000000e+00
132001.00000  133001.00000  4.034457612792e-08
133001.00000  134001.00000  0.000000000000e+00
134001.00000  135001.00000  0.000000000000e+00
135001.00000  136001.00000  0.000000000000e+00
136001.00000  137001.00000  0.000000000000e+00
137001.00000  138001.00000  4.034457612792e-08
138001.00000  139001.00000  0.000000000000e+00
139001.00000  140001.00000  1.210337283838e-07
140001.00000  141001.00000  4.034457612792e-08
141001.00000  142001.00000  0.000000000000e+00
142001.00000  143001.00000  0.000000000000e+00
143001.00000  144001.00000  4.034457612792e-08
144001.00000  145001.00000  0.000000000000e+00
145001.00000  146001.00000  4.034457612792e-08
146001.00000  147001.00000  0.000000000000e+00
147001.00000  148001.00000  0.000000000000e+00
148001.00000  149001.00000  4.034457612792e-08
149001.00000  150001.00000  4.034457612792e-08
150001.00000  151001.00000  0.000000000000e+00
151001.00000  152001.00000  0.000000000000e+00
152001.00000  153001.00000  4.034457612792e-08
153001.00000  154001.00000  0.000000000000e+00
154001.00000  155001.00000  0.000000000000e+00
155001.00000  156001.00000  4.034457612792e-08
156001.00000  157001.00000  0.000000000000e+00
157001.00000  158001.00000  0.000000000000e+00
158001.00000  159001.00000  0.000000000000e+00
159001.00000  160001.00000  0.000000000000e+00
160001.00000  161001.00000  0.000000000000e+00
161001.00000  162001.00000  4.034457612792e-08
162001.00000  163001.00000  4.034457612792e-08
163001.00000  164001.00000  4.034457612792e-08
164001.00000  165001.00000  4.034457612792e-08
165001.00000  166001.00000  4.034457612792e-08
166001.00000  167001.00000  0.000000000000e+00
167001.00000  168001.00000  0.000000000000e+00
168001.00000  169001.00000  4.034457612792e-08
169001.00000  170001.00000  0.000000000000e+00
170001.00000  171001.00000  0.000000000000e+00
171001.00000  172001.00000  0.000000000000e+00
172001.00000  173001.00000  0.000000000000e+00
173001.00000  174001.00000  4.034457612792e-08
174001.00000  175001.00000  4.034457612792e-08
175001.00000  176001.00000  0.000000000000e+00
176001.00000  177001.00000  0.000000000000e+00
177001.00000  178001.00000  0.000000000000e+00
178001.00000  179001.00000  0.000000000000e+00
179001.00000  180001.00000  0.000000000000e+00
180001.00000  181001.00000  0.000000000000e+00
181001.00000  182001.00000  0.000000000000e+00
182001.00000  183001.00000  0.000000000000e+00
183001.00000  184001.00000  0.000000000000e+00
184001.00000  185001.00000  0.000000000000e+00
185001.00000  186001.00000  0.000000000000e+00
186001.00000  187001.00000  0.000000000000e+00
187001.00000  188001.00000  0.000000000000e+00
188001.00000  189001.00000  0.000000000000e+00
189001.00000  190001.00000  0.000000000000e+00
190001.00000  191001.00000  0.000000000000e+00
191001.00000  192001.00000  0.000000000000e+00
192001.00000  193001.00000  0.000000000000e+00
193001.00000  194001.00000  0.000000000000e+00
194001.00000  195001.00000  0.000000000000e+00
195001.00000  196001.00000  0.000000000000e+00
196001.00000  197001.00000  0.000000000000e+00
197001.00000  198001.00000  0.000000000000e+00
198001.00000  199001.00000  0.000000000000e+00
