10001.00000  11001.00000  1.814619483806e-04
11001.00000  12001.00000  1.509053808482e-04
12001.00000  13001.00000  1.224178473556e-04
13001.00000  14001.00000  1.040072759457e-04
14001.00000  15001.00000  9.036697746106e-05
15001.00000  16001.00000  7.737804154446e-05
16001.00000  17001.00000  6.636235105472e-05
17001.00000  18001.00000  5.682180520447e-05
18001.00000  19001.00000  5.111280387240e-05
19001.00000  20001.00000  4.367960750715e-05
20001.00000  21001.00000  3.837291834948e-05
21001.00000  22001.00000  3.532684045754e-05
22001.00000  23001.00000  3.093972198423e-05
23001.00000  24001.00000  2.682081162720e-05
24001.00000  25001.00000  2.469430441961e-05
25001.00000  26001.00000  2.205053870207e-05
26001.00000  27001.00000  1.894698764235e-05
27001.00000  28001.00000  1.706953082845e-05
28001.00000  29001.00000  1.660974548627e-05
29001.00000  30001.00000  1.431081877537e-05
30001.00000  31001.00000  1.312303997474e-05
31001.00000  32001.00000  1.254830829701e-05
32001.00000  33001.00000  1.174368394819e-05
33001.00000  34001.00000  1.000033119243e-05
34001.00000  35001.00000  9.712965353563e-06
35001.00000  36001.00000  9.138233675837e-06
36001.00000  37001.00000  7.950454875205e-06
37001.00000  38001.00000  7.414038642661e-06
38001.00000  39001.00000  6.628572016436e-06
39001.00000  40001.00000  6.187944396846e-06
40001.00000  41001.00000  5.479108660984e-06
41001.00000  42001.00000  5.517424106166e-06
42001.00000  43001.00000  5.268373712485e-06
43001.00000  44001.00000  5.268373712485e-06
44001.00000  45001.00000  4.770272925123e-06
45001.00000  46001.00000  4.042279466670e-06
46001.00000  47001.00000  3.544178679308e-06
47001.00000  48001.00000  3.582494124490e-06
48001.00000  49001.00000  3.410074621172e-06
49001.00000  50001.00000  3.256812840445e-06
50001.00000  51001.00000  3.046077891946e-06
51001.00000  52001.00000  3.275970563036e-06
52001.00000  53001.00000  2.433030769038e-06
53001.00000  54001.00000  2.452188491629e-06
54001.00000  55001.00000  2.413873046448e-06
55001.00000  56001.00000  2.183980375357e-06
56001.00000  57001.00000  2.452188491629e-06
57001.00000  58001.00000  1.877456813904e-06
58001.00000  59001.00000  2.049876317221e-06
59001.00000  60001.00000  1.570933252450e-06
60001.00000  61001.00000  1.398513749132e-06
61001.00000  62001.00000  1.417671471723e-06
62001.00000  63001.00000  1.513460084677e-06
63001.00000  64001.00000  1.245251968406e-06
64001.00000  65001.00000  1.264409690996e-06
65001.00000  66001.00000  1.168621078042e-06
66001.00000  67001.00000  9.962015747244e-07
67001.00000  68001.00000  9.770438521336e-07
68001.00000  69001.00000  8.620975165884e-07
69001.00000  70001.00000  7.663089036342e-07
70001.00000  71001.00000  9.387284069519e-07
71001.00000  72001.00000  9.004129617701e-07
72001.00000  73001.00000  9.578861295427e-07
73001.00000  74001.00000  9.578861295427e-07
74001.00000  75001.00000  8.620975165884e-07
75001.00000  76001.00000  4.597853421805e-07
76001.00000  77001.00000  5.938894003165e-07
77001.00000  78001.00000  7.854666262250e-07
78001.00000  79001.00000  5.172585099531e-07
79001.00000  80001.00000  5.555739551348e-07
80001.00000  81001.00000  5.172585099531e-07
81001.00000  82001.00000  5.364162325439e-07
82001.00000  83001.00000  5.938894003165e-07
83001.00000  84001.00000  4.981007873622e-07
84001.00000  85001.00000  3.639967292262e-07
85001.00000  86001.00000  4.597853421805e-07
86001.00000  87001.00000  5.364162325439e-07
87001.00000  88001.00000  4.023121744079e-07
88001.00000  89001.00000  3.831544518171e-07
89001.00000  90001.00000  4.597853421805e-07
90001.00000  91001.00000  2.682081162720e-07
91001.00000  92001.00000  3.065235614537e-07
92001.00000  93001.00000  2.873658388628e-07
93001.00000  94001.00000  1.915772259085e-07
94001.00000  95001.00000  2.682081162720e-07
95001.00000  96001.00000  3.448390066354e-07
96001.00000  97001.00000  3.256812840445e-07
97001.00000  98001.00000  2.107349484994e-07
98001.00000  99001.00000  2.873658388628e-07
99001.00000  100001.00000  1.341040581360e-07
100001.00000  101001.00000  2.873658388628e-07
101001.00000  102001.00000  1.341040581360e-07
102001.00000  103001.00000  1.532617807268e-07
103001.00000  104001.00000  2.298926710903e-07
104001.00000  105001.00000  1.532617807268e-07
105001.00000  106001.00000  1.724195033177e-07
106001.00000  107001.00000  1.149463355451e-07
107001.00000  108001.00000  1.532617807268e-07
108001.00000  109001.00000  1.341040581360e-07
109001.00000  110001.00000  1.341040581360e-07
110001.00000  111001.00000  1.149463355451e-07
111001.00000  112001.00000  1.724195033177e-07
112001.00000  113001.00000  1.149463355451e-07
113001.00000  114001.00000  7.663089036342e-08
114001.00000  115001.00000  9.578861295427e-08
115001.00000  116001.00000  3.831544518171e-08
116001.00000  117001.00000  1.532617807268e-07
117001.00000  118001.00000  7.663089036342e-08
118001.00000  119001.00000  7.663089036342e-08
119001.00000  120001.00000  9.578861295427e-08
120001.00000  121001.00000  3.831544518171e-08
121001.00000  122001.00000  5.747316777256e-08
122001.00000  123001.00000  1.149463355451e-07
123001.00000  124001.00000  5.747316777256e-08
124001.00000  125001.00000  1.915772259085e-08
125001.00000  126001.00000  1.724195033177e-07
126001.00000  127001.00000  5.747316777256e-08
127001.00000  128001.00000  7.663089036342e-08
128001.00000  129001.00000  1.915772259085e-08
129001.00000  130001.00000  7.663089036342e-08
130001.00000  131001.00000  0.000000000000e+00
131001.00000  132001.00000  5.747316777256e-08
132001.00000  133001.00000  5.747316777256e-08
133001.00000  134001.00000  7.663089036342e-08
134001.00000  135001.00000  1.915772259085e-08
135001.00000  136001.00000  7.663089036342e-08
136001.00000  137001.00000  3.831544518171e-08
137001.00000  138001.00000  3.831544518171e-08
138001.00000  139001.00000  3.831544518171e-08
139001.00000  140001.00000  1.915772259085e-08
140001.00000  141001.00000  5.747316777256e-08
141001.00000  142001.00000  0.000000000000e+00
142001.00000  143001.00000  3.831544518171e-08
143001.00000  144001.00000  1.915772259085e-08
144001.00000  145001.00000  3.831544518171e-08
145001.00000  146001.00000  3.831544518171e-08
146001.00000  147001.00000  0.000000000000e+00
147001.00000  148001.00000  3.831544518171e-08
148001.00000  149001.00000  1.915772259085e-08
149001.00000  150001.00000  1.915772259085e-08
150001.00000  151001.00000  0.000000000000e+00
151001.00000  152001.00000  1.915772259085e-08
152001.00000  153001.00000  1.915772259085e-08
153001.00000  154001.00000  1.915772259085e-08
154001.00000  155001.00000  1.915772259085e-08
155001.00000  156001.00000  1.915772259085e-08
156001.00000  157001.00000  3.831544518171e-08
157001.00000  158001.00000  1.915772259085e-08
158001.00000  159001.00000  3.831544518171e-08
159001.00000  160001.00000  1.915772259085e-08
160001.00000  161001.00000  0.000000000000e+00
161001.00000  162001.00000  1.915772259085e-08
162001.00000  163001.00000  3.831544518171e-08
163001.00000  164001.00000  0.000000000000e+00
164001.00000  165001.00000  0.000000000000e+00
165001.00000  166001.00000  3.831544518171e-08
166001.00000  167001.00000  1.915772259085e-08
167001.00000  168001.00000  0.000000000000e+00
168001.00000  169001.00000  0.000000000000e+00
169001.00000  170001.00000  1.915772259085e-08
170001.00000  171001.00000  0.000000000000e+00
171001.00000  172001.00000  1.915772259085e-08
172001.00000  173001.00000  0.000000000000e+00
173001.00000  174001.00000  3.831544518171e-08
174001.00000  175001.00000  0.000000000000e+00
175001.00000  176001.00000  0.000000000000e+00
176001.00000  177001.00000  0.000000000000e+00
177001.00000  178001.00000  1.915772259085e-08
178001.00000  179001.00000  0.000000000000e+00
179001.00000  180001.00000  0.000000000000e+00
180001.00000  181001.00000  0.000000000000e+00
181001.00000  182001.00000  0.000000000000e+00
182001.00000  183001.00000  0.000000000000e+00
183001.00000  184001.00000  0.000000000000e+00
184001.00000  185001.00000  0.000000000000e+00
185001.00000  186001.00000  1.915772259085e-08
186001.00000  187001.00000  1.915772259085e-08
187001.00000  188001.00000  0.000000000000e+00
188001.00000  189001.00000  0.000000000000e+00
189001.00000  190001.00000  0.000000000000e+00
190001.00000  191001.00000  0.000000000000e+00
191001.00000  192001.00000  1.915772259085e-08
192001.00000  193001.00000  0.000000000000e+00
193001.00000  194001.00000  0.000000000000e+00
194001.00000  195001.00000  0.000000000000e+00
195001.00000  196001.00000  0.000000000000e+00
196001.00000  197001.00000  0.000000000000e+00
197001.00000  198001.00000  0.000000000000e+00
198001.00000  199001.00000  0.000000000000e+00
