300.00000  350.00000  1.944585054172e-01
350.00000  400.00000  1.373291037097e-01
400.00000  450.00000  1.019235991789e-01
450.00000  500.00000  7.753098168967e-02
500.00000  550.00000  6.062908637724e-02
550.00000  600.00000  4.865757958436e-02
600.00000  650.00000  4.014240279908e-02
650.00000  700.00000  3.280823912442e-02
700.00000  750.00000  2.812272415941e-02
750.00000  800.00000  2.385550139741e-02
800.00000  850.00000  2.039756566158e-02
850.00000  900.00000  1.779387734227e-02
900.00000  950.00000  1.555790078683e-02
950.00000  1000.00000  1.368803026704e-02
1000.00000  1050.00000  1.202048150379e-02
1050.00000  1100.00000  1.056729745878e-02
1100.00000  1150.00000  9.483430905874e-03
1150.00000  1200.00000  8.609111886529e-03
1200.00000  1250.00000  7.906605787423e-03
1250.00000  1300.00000  7.157533569748e-03
1300.00000  1350.00000  6.492762083966e-03
1350.00000  1400.00000  5.918714242982e-03
1400.00000  1450.00000  5.394443977021e-03
1450.00000  1500.00000  5.108624352699e-03
1500.00000  1550.00000  4.669457682743e-03
1550.00000  1600.00000  4.253574072072e-03
1600.00000  1650.00000  3.901919590463e-03
1650.00000  1700.00000  3.645003074218e-03
1700.00000  1750.00000  3.359986314010e-03
1750.00000  1800.00000  3.212259317169e-03
1800.00000  1850.00000  2.954539936811e-03
1850.00000  1900.00000  2.765064006081e-03
1900.00000  1950.00000  2.557122200746e-03
1950.00000  2000.00000  2.456764186588e-03
2000.00000  2050.00000  2.280134081670e-03
2050.00000  2100.00000  2.131604220716e-03
2100.00000  2150.00000  1.993511593234e-03
2150.00000  2200.00000  1.934902512966e-03
2200.00000  2250.00000  1.817684352430e-03
2250.00000  2300.00000  1.699663327780e-03
2300.00000  2350.00000  1.683606045515e-03
2350.00000  2400.00000  1.567190749091e-03
2400.00000  2450.00000  1.452381180895e-03
2450.00000  2500.00000  1.357643215529e-03
2500.00000  2550.00000  1.338374476811e-03
2550.00000  2600.00000  1.261299521938e-03
2600.00000  2650.00000  1.179407382385e-03
2650.00000  2700.00000  1.140067040835e-03
2700.00000  2750.00000  1.119192573890e-03
2750.00000  2800.00000  1.071823591207e-03
2800.00000  2850.00000  9.835085387484e-04
2850.00000  2900.00000  9.393510125188e-04
2900.00000  2950.00000  9.064335838750e-04
2950.00000  3000.00000  9.835085387484e-04
3000.00000  3050.00000  8.518388241731e-04
3050.00000  3100.00000  8.341758136813e-04
3100.00000  3150.00000  7.876096951119e-04
3150.00000  3200.00000  7.595094511477e-04
3200.00000  3250.00000  7.298034789569e-04
3250.00000  3300.00000  6.687858063489e-04
3300.00000  3350.00000  6.760115833683e-04
3350.00000  3400.00000  6.479113394040e-04
3400.00000  3450.00000  6.093738619673e-04
3450.00000  3500.00000  5.804707538898e-04
3500.00000  3550.00000  6.101767260806e-04
3550.00000  3600.00000  5.812736180031e-04
3600.00000  3650.00000  5.202559453950e-04
3650.00000  3700.00000  5.331017712073e-04
3700.00000  3750.00000  5.258759941879e-04
3750.00000  3800.00000  5.074101195828e-04
3800.00000  3850.00000  4.881413808645e-04
3850.00000  3900.00000  4.704783703727e-04
3900.00000  3950.00000  4.704783703727e-04
3950.00000  4000.00000  4.439838546350e-04
4000.00000  4050.00000  4.512096316543e-04
4050.00000  4100.00000  4.255179800299e-04
4100.00000  4150.00000  3.733318126677e-04
4150.00000  4200.00000  3.677117638749e-04
4200.00000  4250.00000  3.484430251566e-04
4250.00000  4300.00000  4.174893388973e-04
4300.00000  4350.00000  3.452315687035e-04
4350.00000  4400.00000  3.139198682862e-04
4400.00000  4450.00000  3.612888509688e-04
4450.00000  4500.00000  3.436258404770e-04
4500.00000  4550.00000  2.978625860209e-04
4550.00000  4600.00000  2.874253525485e-04
4600.00000  4650.00000  2.890310807750e-04
4650.00000  4700.00000  2.922425372281e-04
4700.00000  4750.00000  2.625365650373e-04
4750.00000  4800.00000  2.601279726975e-04
4800.00000  4850.00000  2.801995755291e-04
4850.00000  4900.00000  2.545079239047e-04
4900.00000  4950.00000  2.545079239047e-04
4950.00000  5000.00000  2.456764186588e-04
5000.00000  5050.00000  2.384506416394e-04
5050.00000  5100.00000  2.320277287333e-04
5100.00000  5150.00000  2.344363210731e-04
5150.00000  5200.00000  2.416620980925e-04
5200.00000  5250.00000  2.392535057527e-04
5250.00000  5300.00000  2.175761746945e-04
5300.00000  5350.00000  2.047303488823e-04
5350.00000  5400.00000  1.830530178242e-04
5400.00000  5450.00000  2.031246206558e-04
5450.00000  5500.00000  1.862644742772e-04
5500.00000  5550.00000  1.854616101640e-04
5550.00000  5600.00000  1.846587460507e-04
5600.00000  5650.00000  1.878702025038e-04
5650.00000  5700.00000  1.702071920120e-04
5700.00000  5750.00000  1.918845230701e-04
5750.00000  5800.00000  1.605728226528e-04
5800.00000  5850.00000  1.324725786886e-04
5850.00000  5900.00000  1.605728226528e-04
5900.00000  5950.00000  1.694043278987e-04
5950.00000  6000.00000  1.613756867661e-04
6000.00000  6050.00000  1.421069480477e-04
6050.00000  6100.00000  1.533470456334e-04
6100.00000  6150.00000  1.589670944263e-04
6150.00000  6200.00000  1.429098121610e-04
6200.00000  6250.00000  1.453184045008e-04
6250.00000  6300.00000  1.372897633681e-04
6300.00000  6350.00000  1.292611222355e-04
6350.00000  6400.00000  1.525441815202e-04
6400.00000  6450.00000  1.308668504620e-04
6450.00000  6500.00000  1.364868992549e-04
6500.00000  6550.00000  1.204296169896e-04
6550.00000  6600.00000  1.372897633681e-04
6600.00000  6650.00000  1.212324811029e-04
6650.00000  6700.00000  1.156124323100e-04
6700.00000  6750.00000  1.091895194039e-04
6750.00000  6800.00000  1.244439375559e-04
6800.00000  6850.00000  1.156124323100e-04
6850.00000  6900.00000  1.011608782713e-04
6900.00000  6950.00000  1.107952476304e-04
6950.00000  7000.00000  1.075837911774e-04
7000.00000  7050.00000  1.156124323100e-04
7050.00000  7100.00000  1.148095681967e-04
7100.00000  7150.00000  1.083866552906e-04
7150.00000  7200.00000  9.955515004473e-05
7200.00000  7250.00000  8.430073189272e-05
7250.00000  7300.00000  9.794942181820e-05
7300.00000  7350.00000  1.019637423845e-04
7350.00000  7400.00000  1.051751988376e-04
7400.00000  7450.00000  8.349786777945e-05
7450.00000  7500.00000  8.189213955292e-05
7500.00000  7550.00000  9.393510125188e-05
7550.00000  7600.00000  6.904631374070e-05
7600.00000  7650.00000  8.269500366619e-05
7650.00000  7700.00000  8.430073189272e-05
7700.00000  7750.00000  8.028641132640e-05
7750.00000  7800.00000  8.430073189272e-05
7800.00000  7850.00000  6.262340083459e-05
7850.00000  7900.00000  8.028641132640e-05
7900.00000  7950.00000  7.466636253355e-05
7950.00000  8000.00000  6.904631374070e-05
8000.00000  8050.00000  8.028641132640e-05
8050.00000  8100.00000  7.225777019376e-05
8100.00000  8150.00000  6.583485728764e-05
8150.00000  8200.00000  7.546922664681e-05
8200.00000  8250.00000  5.700335204174e-05
8250.00000  8300.00000  5.780621615501e-05
8300.00000  8350.00000  5.620048792848e-05
8350.00000  8400.00000  7.627209076008e-05
8400.00000  8450.00000  6.021480849480e-05
8450.00000  8500.00000  7.306063430702e-05
8500.00000  8550.00000  5.459475970195e-05
8550.00000  8600.00000  5.138330324889e-05
8600.00000  8650.00000  6.182053672132e-05
8650.00000  8700.00000  7.065204196723e-05
8700.00000  8750.00000  6.583485728764e-05
8750.00000  8800.00000  5.459475970195e-05
8800.00000  8850.00000  6.422912906112e-05
8850.00000  8900.00000  6.262340083459e-05
8900.00000  8950.00000  6.182053672132e-05
8950.00000  9000.00000  6.101767260806e-05
9000.00000  9050.00000  4.897471090910e-05
9050.00000  9100.00000  5.218616736216e-05
9100.00000  9150.00000  5.379189558869e-05
9150.00000  9200.00000  6.262340083459e-05
9200.00000  9250.00000  5.138330324889e-05
9250.00000  9300.00000  4.897471090910e-05
9300.00000  9350.00000  6.422912906112e-05
9350.00000  9400.00000  4.415752622952e-05
9400.00000  9450.00000  4.255179800299e-05
9450.00000  9500.00000  5.860908026827e-05
9500.00000  9550.00000  3.452315687035e-05
9550.00000  9600.00000  4.817184679584e-05
9600.00000  9650.00000  4.255179800299e-05
9650.00000  9700.00000  3.050883630403e-05
9700.00000  9750.00000  4.255179800299e-05
9750.00000  9800.00000  4.817184679584e-05
9800.00000  9850.00000  4.415752622952e-05
9850.00000  9900.00000  5.138330324889e-05
9900.00000  9950.00000  4.335466211625e-05
9950.00000  10000.00000  3.050883630403e-05
