300.00000  350.00000  3.033977940982e-05
350.00000  400.00000  3.671693049596e-05
400.00000  450.00000  2.628159235500e-05
450.00000  500.00000  2.164366429235e-05
500.00000  550.00000  1.648396932266e-04
550.00000  600.00000  1.681248922710e-05
600.00000  650.00000  5.024422067868e-05
650.00000  700.00000  2.222340530018e-05
700.00000  750.00000  3.826290651684e-05
750.00000  800.00000  2.299639331063e-05
800.00000  850.00000  9.778298332081e-05
850.00000  900.00000  2.029093527408e-05
900.00000  950.00000  1.893820625581e-05
950.00000  1000.00000  2.087067628191e-05
1000.00000  1050.00000  2.396262832368e-05
1050.00000  1100.00000  2.473561633412e-05
1100.00000  1150.00000  2.396262832368e-05
1150.00000  1200.00000  2.608834535239e-05
1200.00000  1250.00000  2.666808636022e-05
1250.00000  1300.00000  9.507752528427e-05
1300.00000  1350.00000  2.492886333673e-05
1350.00000  1400.00000  2.686133336283e-05
1400.00000  1450.00000  3.014653240721e-05
1450.00000  1500.00000  3.285199044375e-05
1500.00000  1550.00000  3.265874344114e-05
1550.00000  1600.00000  3.575069548291e-05
1600.00000  1650.00000  3.710342450118e-05
1650.00000  1700.00000  3.691017749857e-05
1700.00000  1750.00000  1.294754917489e-04
1750.00000  1800.00000  4.193459956644e-05
1800.00000  1850.00000  3.362497845419e-05
1850.00000  1900.00000  3.420471946202e-05
1900.00000  1950.00000  4.058187054816e-05
1950.00000  2000.00000  3.710342450118e-05
2000.00000  2050.00000  4.483330460559e-05
2050.00000  2100.00000  4.328732858471e-05
2100.00000  2150.00000  4.579953961864e-05
2150.00000  2200.00000  4.251434057427e-05
2200.00000  2250.00000  4.831175065258e-05
2250.00000  2300.00000  4.541304561342e-05
2300.00000  2350.00000  1.696708682918e-04
2350.00000  2400.00000  5.140370269434e-05
2400.00000  2450.00000  5.043746768129e-05
2450.00000  2500.00000  5.449565473610e-05
2500.00000  2550.00000  4.637928062647e-05
2550.00000  2600.00000  4.618603362386e-05
2600.00000  2650.00000  5.082396168651e-05
2650.00000  2700.00000  5.642812476221e-05
2700.00000  2750.00000  5.179019669956e-05
2750.00000  2800.00000  5.043746768129e-05
2800.00000  2850.00000  5.179019669956e-05
2850.00000  2900.00000  5.739435977526e-05
2900.00000  2950.00000  5.797410078309e-05
2950.00000  3000.00000  9.179232623989e-05
3000.00000  3050.00000  5.372266672566e-05
3050.00000  3100.00000  5.836059478831e-05
3100.00000  3150.00000  5.681461876743e-05
3150.00000  3200.00000  6.357826385879e-05
3200.00000  3250.00000  5.642812476221e-05
3250.00000  3300.00000  6.299852285096e-05
3300.00000  3350.00000  5.604163075699e-05
3350.00000  3400.00000  5.913358279875e-05
3400.00000  3450.00000  6.898917993188e-05
3450.00000  3500.00000  6.995541494493e-05
3500.00000  3550.00000  6.261202884574e-05
3550.00000  3600.00000  6.724995690838e-05
3600.00000  3650.00000  7.671906003629e-05
3650.00000  3700.00000  1.082183214618e-04
3700.00000  3750.00000  6.782969791622e-05
3750.00000  3800.00000  7.208113197364e-05
3800.00000  3850.00000  6.686346290316e-05
3850.00000  3900.00000  7.227437897625e-05
3900.00000  3950.00000  7.246762597886e-05
3950.00000  4000.00000  7.420684900236e-05
4000.00000  4050.00000  8.618816316419e-05
4050.00000  4100.00000  8.232322311199e-05
4100.00000  4150.00000  8.000425908066e-05
4150.00000  4200.00000  7.401360199975e-05
4200.00000  4250.00000  8.251647011460e-05
4250.00000  4300.00000  7.845828305978e-05
4300.00000  4350.00000  7.865153006239e-05
4350.00000  4400.00000  8.696115117464e-05
4400.00000  4450.00000  8.328945812504e-05
4450.00000  4500.00000  8.541517515375e-05
4500.00000  4550.00000  9.140583223467e-05
4550.00000  4600.00000  9.043959722162e-05
4600.00000  4650.00000  8.792738618769e-05
4650.00000  4700.00000  8.406244613548e-05
4700.00000  4750.00000  9.527077228688e-05
4750.00000  4800.00000  9.797623032342e-05
4800.00000  4850.00000  9.643025430254e-05
4850.00000  4900.00000  9.488427828166e-05
4900.00000  4950.00000  1.035803933991e-04
4950.00000  5000.00000  1.064790984383e-04
5000.00000  5050.00000  1.070588394461e-04
5050.00000  5100.00000  9.643025430254e-05
5100.00000  5150.00000  1.039668874043e-04
5150.00000  5200.00000  1.035803933991e-04
5200.00000  5250.00000  1.014546763704e-04
5250.00000  5300.00000  1.080250744592e-04
5300.00000  5350.00000  1.001019473521e-04
5350.00000  5400.00000  1.105372854931e-04
5400.00000  5450.00000  1.287025037385e-04
5450.00000  5500.00000  9.411129027122e-05
5500.00000  5550.00000  1.022276643808e-04
5550.00000  5600.00000  1.024209113835e-04
5600.00000  5650.00000  9.913571233908e-05
5650.00000  5700.00000  1.041601344070e-04
5700.00000  5750.00000  1.037736404017e-04
5750.00000  5800.00000  1.111170265009e-04
5800.00000  5850.00000  1.116967675088e-04
5850.00000  5900.00000  1.167211895766e-04
5900.00000  5950.00000  1.176874245897e-04
5950.00000  6000.00000  1.132427435296e-04
6000.00000  6050.00000  1.097642974827e-04
6050.00000  6100.00000  1.221321056497e-04
6100.00000  6150.00000  1.213591176393e-04
6150.00000  6200.00000  1.207793766314e-04
6200.00000  6250.00000  1.658059282396e-04
6250.00000  6300.00000  2.119919618635e-04
6300.00000  6350.00000  2.036823407513e-04
6350.00000  6400.00000  1.712554937132e-03
6400.00000  6450.00000  1.149819665531e-04
6450.00000  6500.00000  1.132427435296e-04
6500.00000  6550.00000  1.097642974827e-04
6550.00000  6600.00000  1.173009305845e-04
6600.00000  6650.00000  1.087980624696e-04
6650.00000  6700.00000  1.151752135557e-04
6700.00000  6750.00000  1.068655924435e-04
6750.00000  6800.00000  1.225185996549e-04
6800.00000  6850.00000  1.078318274565e-04
6850.00000  6900.00000  1.273497747202e-04
6900.00000  6950.00000  1.209726236340e-04
6950.00000  7000.00000  1.103440384905e-04
7000.00000  7050.00000  1.163346955714e-04
7050.00000  7100.00000  2.788554247667e-04
7100.00000  7150.00000  7.420684900236e-05
7150.00000  7200.00000  6.628372189533e-05
7200.00000  7250.00000  7.150139096581e-05
7250.00000  7300.00000  7.729880104412e-05
7300.00000  7350.00000  7.401360199975e-05
7350.00000  7400.00000  7.285411998408e-05
7400.00000  7450.00000  7.440009600497e-05
7450.00000  7500.00000  1.335336788037e-04
7500.00000  7550.00000  7.072840295537e-05
7550.00000  7600.00000  7.555957802063e-05
7600.00000  7650.00000  7.111489696059e-05
7650.00000  7700.00000  7.111489696059e-05
7700.00000  7750.00000  7.150139096581e-05
7750.00000  7800.00000  6.821619192144e-05
7800.00000  7850.00000  7.343386099191e-05
7850.00000  7900.00000  6.879593292927e-05
7900.00000  7950.00000  7.266087298147e-05
7950.00000  8000.00000  7.208113197364e-05
8000.00000  8050.00000  7.710555404151e-05
8050.00000  8100.00000  6.763645091361e-05
8100.00000  8150.00000  6.705670990577e-05
8150.00000  8200.00000  7.497983701280e-05
8200.00000  8250.00000  7.285411998408e-05
8250.00000  8300.00000  7.575282502324e-05
8300.00000  8350.00000  7.266087298147e-05
8350.00000  8400.00000  7.072840295537e-05
8400.00000  8450.00000  7.536633101802e-05
8450.00000  8500.00000  7.266087298147e-05
8500.00000  8550.00000  7.691230703890e-05
8550.00000  8600.00000  7.575282502324e-05
8600.00000  8650.00000  7.517308401541e-05
8650.00000  8700.00000  7.401360199975e-05
8700.00000  8750.00000  7.188788497103e-05
8750.00000  8800.00000  7.459334300758e-05
8800.00000  8850.00000  7.034190895015e-05
8850.00000  8900.00000  7.092164995798e-05
8900.00000  8950.00000  7.266087298147e-05
8950.00000  9000.00000  6.956892093971e-05
9000.00000  9050.00000  7.092164995798e-05
9050.00000  9100.00000  7.111489696059e-05
9100.00000  9150.00000  7.266087298147e-05
9150.00000  9200.00000  7.304736698669e-05
9200.00000  9250.00000  7.111489696059e-05
9250.00000  9300.00000  6.840943892405e-05
9300.00000  9350.00000  7.420684900236e-05
9350.00000  9400.00000  7.072840295537e-05
9400.00000  9450.00000  7.208113197364e-05
9450.00000  9500.00000  6.589722789011e-05
9500.00000  9550.00000  7.130814396320e-05
9550.00000  9600.00000  7.169463796842e-05
9600.00000  9650.00000  7.111489696059e-05
9650.00000  9700.00000  7.092164995798e-05
9700.00000  9750.00000  6.763645091361e-05
9750.00000  9800.00000  7.343386099191e-05
9800.00000  9850.00000  6.667021590055e-05
9850.00000  9900.00000  6.995541494493e-05
9900.00000  9950.00000  7.285411998408e-05
9950.00000  10000.00000  6.782969791622e-05
