10001.00000  11001.00000  5.865205571945e-05
11001.00000  12001.00000  4.735353348027e-05
12001.00000  13001.00000  4.083663840033e-05
13001.00000  14001.00000  3.617069576913e-05
14001.00000  15001.00000  3.252663313567e-05
15001.00000  16001.00000  2.778356748577e-05
16001.00000  17001.00000  2.529635013278e-05
17001.00000  18001.00000  2.323330938262e-05
18001.00000  19001.00000  1.930003542905e-05
19001.00000  20001.00000  1.644648373724e-05
20001.00000  21001.00000  1.579093807831e-05
21001.00000  22001.00000  1.374717808283e-05
22001.00000  23001.00000  1.305307091455e-05
23001.00000  24001.00000  1.174197959669e-05
24001.00000  25001.00000  1.002599243068e-05
25001.00000  26001.00000  8.965550923584e-06
26001.00000  27001.00000  7.808705643122e-06
27001.00000  28001.00000  7.673740360401e-06
28001.00000  29001.00000  6.208403005149e-06
29001.00000  30001.00000  6.555456589288e-06
30001.00000  31001.00000  5.128680743384e-06
31001.00000  32001.00000  5.244365271430e-06
32001.00000  33001.00000  4.376731311083e-06
33001.00000  34001.00000  3.875431689549e-06
34001.00000  35001.00000  3.779027916178e-06
35001.00000  36001.00000  3.354851313341e-06
36001.00000  37001.00000  3.721185652154e-06
37001.00000  38001.00000  3.316289803993e-06
38001.00000  39001.00000  2.969236219854e-06
39001.00000  40001.00000  2.583621126366e-06
40001.00000  41001.00000  2.622182635715e-06
41001.00000  42001.00000  2.120883014181e-06
42001.00000  43001.00000  2.159444523530e-06
43001.00000  44001.00000  1.908794712763e-06
44001.00000  45001.00000  1.715987166019e-06
45001.00000  46001.00000  1.600302637973e-06
46001.00000  47001.00000  1.677425656671e-06
47001.00000  48001.00000  1.446056600578e-06
48001.00000  49001.00000  1.349652827206e-06
49001.00000  50001.00000  1.079722261765e-06
50001.00000  51001.00000  1.195406789811e-06
51001.00000  52001.00000  1.137564525788e-06
52001.00000  53001.00000  9.254762243700e-07
53001.00000  54001.00000  9.640377337188e-07
54001.00000  55001.00000  1.099003016439e-06
55001.00000  56001.00000  8.290724509981e-07
56001.00000  57001.00000  7.133879229519e-07
57001.00000  58001.00000  5.977033949056e-07
58001.00000  59001.00000  7.519494323006e-07
59001.00000  60001.00000  7.519494323006e-07
60001.00000  61001.00000  5.591418855569e-07
61001.00000  62001.00000  5.398611308825e-07
62001.00000  63001.00000  5.784226402313e-07
63001.00000  64001.00000  5.977033949056e-07
64001.00000  65001.00000  4.820188668594e-07
65001.00000  66001.00000  3.856150934875e-07
66001.00000  67001.00000  5.205803762081e-07
67001.00000  68001.00000  3.663343388131e-07
68001.00000  69001.00000  4.241766028363e-07
69001.00000  70001.00000  3.663343388131e-07
70001.00000  71001.00000  4.048958481619e-07
71001.00000  72001.00000  2.892113201156e-07
72001.00000  73001.00000  4.627381121850e-07
73001.00000  74001.00000  2.313690560925e-07
74001.00000  75001.00000  3.663343388131e-07
75001.00000  76001.00000  2.313690560925e-07
76001.00000  77001.00000  1.928075467438e-07
77001.00000  78001.00000  1.542460373950e-07
78001.00000  79001.00000  3.277728294644e-07
79001.00000  80001.00000  2.313690560925e-07
80001.00000  81001.00000  2.506498107669e-07
81001.00000  82001.00000  2.699305654413e-07
82001.00000  83001.00000  1.349652827206e-07
83001.00000  84001.00000  9.640377337188e-08
84001.00000  85001.00000  3.856150934875e-08
85001.00000  86001.00000  9.640377337188e-08
86001.00000  87001.00000  7.712301869750e-08
87001.00000  88001.00000  1.156845280463e-07
88001.00000  89001.00000  7.712301869750e-08
89001.00000  90001.00000  1.542460373950e-07
90001.00000  91001.00000  1.735267920694e-07
91001.00000  92001.00000  1.349652827206e-07
92001.00000  93001.00000  7.712301869750e-08
93001.00000  94001.00000  3.856150934875e-08
94001.00000  95001.00000  7.712301869750e-08
95001.00000  96001.00000  7.712301869750e-08
96001.00000  97001.00000  9.640377337188e-08
97001.00000  98001.00000  1.156845280463e-07
98001.00000  99001.00000  7.712301869750e-08
99001.00000  100001.00000  3.856150934875e-08
100001.00000  101001.00000  1.928075467438e-08
101001.00000  102001.00000  7.712301869750e-08
102001.00000  103001.00000  3.856150934875e-08
103001.00000  104001.00000  3.856150934875e-08
104001.00000  105001.00000  5.784226402313e-08
105001.00000  106001.00000  1.928075467438e-08
106001.00000  107001.00000  1.928075467438e-08
107001.00000  108001.00000  5.784226402313e-08
108001.00000  109001.00000  1.928075467438e-08
109001.00000  110001.00000  1.928075467438e-08
110001.00000  111001.00000  5.784226402313e-08
111001.00000  112001.00000  3.856150934875e-08
112001.00000  113001.00000  9.640377337188e-08
113001.00000  114001.00000  9.640377337188e-08
114001.00000  115001.00000  7.712301869750e-08
115001.00000  116001.00000  1.928075467438e-08
116001.00000  117001.00000  5.784226402313e-08
117001.00000  118001.00000  1.928075467438e-08
118001.00000  119001.00000  5.784226402313e-08
119001.00000  120001.00000  3.856150934875e-08
120001.00000  121001.00000  7.712301869750e-08
121001.00000  122001.00000  3.856150934875e-08
122001.00000  123001.00000  3.856150934875e-08
123001.00000  124001.00000  1.928075467438e-08
124001.00000  125001.00000  5.784226402313e-08
125001.00000  126001.00000  0.000000000000e+00
126001.00000  127001.00000  1.928075467438e-08
127001.00000  128001.00000  1.928075467438e-08
128001.00000  129001.00000  1.928075467438e-08
129001.00000  130001.00000  0.000000000000e+00
130001.00000  131001.00000  1.928075467438e-08
131001.00000  132001.00000  3.856150934875e-08
132001.00000  133001.00000  0.000000000000e+00
133001.00000  134001.00000  0.000000000000e+00
134001.00000  135001.00000  0.000000000000e+00
135001.00000  136001.00000  5.784226402313e-08
136001.00000  137001.00000  1.928075467438e-08
137001.00000  138001.00000  0.000000000000e+00
138001.00000  139001.00000  1.928075467438e-08
139001.00000  140001.00000  3.856150934875e-08
140001.00000  141001.00000  1.928075467438e-08
141001.00000  142001.00000  0.000000000000e+00
142001.00000  143001.00000  3.856150934875e-08
143001.00000  144001.00000  3.856150934875e-08
144001.00000  145001.00000  1.928075467438e-08
145001.00000  146001.00000  0.000000000000e+00
146001.00000  147001.00000  0.000000000000e+00
147001.00000  148001.00000  1.928075467438e-08
148001.00000  149001.00000  1.928075467438e-08
149001.00000  150001.00000  0.000000000000e+00
150001.00000  151001.00000  0.000000000000e+00
151001.00000  152001.00000  1.928075467438e-08
152001.00000  153001.00000  0.000000000000e+00
153001.00000  154001.00000  0.000000000000e+00
154001.00000  155001.00000  1.928075467438e-08
155001.00000  156001.00000  0.000000000000e+00
156001.00000  157001.00000  1.928075467438e-08
157001.00000  158001.00000  0.000000000000e+00
158001.00000  159001.00000  0.000000000000e+00
159001.00000  160001.00000  1.928075467438e-08
160001.00000  161001.00000  1.928075467438e-08
161001.00000  162001.00000  0.000000000000e+00
162001.00000  163001.00000  0.000000000000e+00
163001.00000  164001.00000  0.000000000000e+00
164001.00000  165001.00000  0.000000000000e+00
165001.00000  166001.00000  0.000000000000e+00
166001.00000  167001.00000  0.000000000000e+00
167001.00000  168001.00000  0.000000000000e+00
168001.00000  169001.00000  0.000000000000e+00
169001.00000  170001.00000  0.000000000000e+00
170001.00000  171001.00000  0.000000000000e+00
171001.00000  172001.00000  0.000000000000e+00
172001.00000  173001.00000  0.000000000000e+00
173001.00000  174001.00000  0.000000000000e+00
174001.00000  175001.00000  0.000000000000e+00
175001.00000  176001.00000  0.000000000000e+00
176001.00000  177001.00000  0.000000000000e+00
177001.00000  178001.00000  0.000000000000e+00
178001.00000  179001.00000  0.000000000000e+00
179001.00000  180001.00000  1.928075467438e-08
180001.00000  181001.00000  0.000000000000e+00
181001.00000  182001.00000  0.000000000000e+00
182001.00000  183001.00000  0.000000000000e+00
183001.00000  184001.00000  1.928075467438e-08
184001.00000  185001.00000  0.000000000000e+00
185001.00000  186001.00000  0.000000000000e+00
186001.00000  187001.00000  0.000000000000e+00
187001.00000  188001.00000  0.000000000000e+00
188001.00000  189001.00000  1.928075467438e-08
189001.00000  190001.00000  0.000000000000e+00
190001.00000  191001.00000  0.000000000000e+00
191001.00000  192001.00000  0.000000000000e+00
192001.00000  193001.00000  0.000000000000e+00
193001.00000  194001.00000  0.000000000000e+00
194001.00000  195001.00000  0.000000000000e+00
195001.00000  196001.00000  0.000000000000e+00
196001.00000  197001.00000  0.000000000000e+00
197001.00000  198001.00000  0.000000000000e+00
198001.00000  199001.00000  0.000000000000e+00
