10001.00000  11001.00000  3.060040513504e-04
11001.00000  12001.00000  2.531486405404e-04
12001.00000  13001.00000  2.108752399580e-04
13001.00000  14001.00000  1.820251466696e-04
14001.00000  15001.00000  1.560527773329e-04
15001.00000  16001.00000  1.359087096707e-04
16001.00000  17001.00000  1.178591879226e-04
17001.00000  18001.00000  1.086978262281e-04
18001.00000  19001.00000  9.186860514323e-05
19001.00000  20001.00000  8.350863492896e-05
20001.00000  21001.00000  7.385551028069e-05
21001.00000  22001.00000  6.795435483533e-05
22001.00000  23001.00000  6.010436101758e-05
23001.00000  24001.00000  5.414856524402e-05
24001.00000  25001.00000  5.130726817773e-05
25001.00000  26001.00000  4.671748060912e-05
26001.00000  27001.00000  4.256481566608e-05
27001.00000  28001.00000  3.859428515038e-05
28001.00000  29001.00000  3.506087726025e-05
29001.00000  30001.00000  3.449626053554e-05
30001.00000  31001.00000  3.012503427972e-05
31001.00000  32001.00000  2.877723951751e-05
32001.00000  33001.00000  2.854046476198e-05
33001.00000  34001.00000  2.398710407883e-05
34001.00000  35001.00000  2.280323030121e-05
35001.00000  36001.00000  2.225682701924e-05
36001.00000  37001.00000  2.074511127243e-05
37001.00000  38001.00000  2.001657356313e-05
38001.00000  39001.00000  1.817701584713e-05
39001.00000  40001.00000  1.741205125236e-05
40001.00000  41001.00000  1.602782960469e-05
41001.00000  42001.00000  1.622817747475e-05
42001.00000  43001.00000  1.429755254509e-05
43001.00000  44001.00000  1.376936270584e-05
44001.00000  45001.00000  1.364186860672e-05
45001.00000  46001.00000  1.274940991282e-05
46001.00000  47001.00000  1.198444531805e-05
47001.00000  48001.00000  1.131054793694e-05
48001.00000  49001.00000  1.096449252502e-05
49001.00000  50001.00000  1.047272957124e-05
50001.00000  51001.00000  9.361709564556e-06
51001.00000  52001.00000  1.007203383113e-05
52001.00000  53001.00000  9.052081038101e-06
53001.00000  54001.00000  9.489203663684e-06
54001.00000  55001.00000  7.740713161354e-06
55001.00000  56001.00000  8.287116443332e-06
56001.00000  57001.00000  8.013914802343e-06
57001.00000  58001.00000  7.157882993911e-06
58001.00000  59001.00000  7.176096436644e-06
59001.00000  60001.00000  6.392918399142e-06
60001.00000  61001.00000  7.048602337516e-06
61001.00000  62001.00000  6.228997414549e-06
62001.00000  63001.00000  6.301851185479e-06
63001.00000  64001.00000  6.010436101758e-06
64001.00000  65001.00000  5.300111835186e-06
65001.00000  66001.00000  4.844775766871e-06
66001.00000  67001.00000  5.263684949721e-06
67001.00000  68001.00000  5.063337079662e-06
68001.00000  69001.00000  4.626214454080e-06
69001.00000  70001.00000  4.425866584021e-06
70001.00000  71001.00000  4.061597729369e-06
71001.00000  72001.00000  4.025170843904e-06
72001.00000  73001.00000  3.934103630241e-06
73001.00000  74001.00000  4.134451500300e-06
74001.00000  75001.00000  3.897676744776e-06
75001.00000  76001.00000  4.152664943032e-06
76001.00000  77001.00000  3.843036416578e-06
77001.00000  78001.00000  3.806609531113e-06
78001.00000  79001.00000  3.241992806403e-06
79001.00000  80001.00000  3.041644936344e-06
80001.00000  81001.00000  3.169139035472e-06
81001.00000  82001.00000  3.241992806403e-06
82001.00000  83001.00000  3.096285264542e-06
83001.00000  84001.00000  2.750229852622e-06
84001.00000  85001.00000  2.185613127912e-06
85001.00000  86001.00000  2.841297066285e-06
86001.00000  87001.00000  2.495241654366e-06
87001.00000  88001.00000  2.458814768901e-06
88001.00000  89001.00000  2.568095425296e-06
89001.00000  90001.00000  2.549881982564e-06
90001.00000  91001.00000  2.076332471516e-06
91001.00000  92001.00000  2.385960997970e-06
92001.00000  93001.00000  2.294893784307e-06
93001.00000  94001.00000  2.112759356981e-06
94001.00000  95001.00000  2.240253456110e-06
95001.00000  96001.00000  2.094545914249e-06
96001.00000  97001.00000  1.712063616864e-06
97001.00000  98001.00000  1.602782960469e-06
98001.00000  99001.00000  2.112759356981e-06
99001.00000  100001.00000  1.712063616864e-06
100001.00000  101001.00000  2.331320669773e-06
101001.00000  102001.00000  1.566356075003e-06
102001.00000  103001.00000  1.948838372388e-06
103001.00000  104001.00000  1.493502304073e-06
104001.00000  105001.00000  1.420648533143e-06
105001.00000  106001.00000  1.220300663084e-06
106001.00000  107001.00000  1.511715746806e-06
107001.00000  108001.00000  1.329581319480e-06
108001.00000  109001.00000  1.548142632271e-06
109001.00000  110001.00000  1.366008204945e-06
110001.00000  111001.00000  1.274940991282e-06
111001.00000  112001.00000  1.256727548549e-06
112001.00000  113001.00000  1.293154434014e-06
113001.00000  114001.00000  1.293154434014e-06
114001.00000  115001.00000  1.420648533143e-06
115001.00000  116001.00000  1.238514105817e-06
116001.00000  117001.00000  1.220300663084e-06
117001.00000  118001.00000  1.092806563956e-06
118001.00000  119001.00000  1.183873777619e-06
119001.00000  120001.00000  1.183873777619e-06
120001.00000  121001.00000  1.129233449421e-06
121001.00000  122001.00000  9.288855793625e-07
122001.00000  123001.00000  7.831780375017e-07
123001.00000  124001.00000  1.019952793026e-06
124001.00000  125001.00000  8.560318084321e-07
125001.00000  126001.00000  9.288855793625e-07
126001.00000  127001.00000  8.924586938973e-07
127001.00000  128001.00000  8.742452511647e-07
128001.00000  129001.00000  8.924586938973e-07
129001.00000  130001.00000  8.560318084321e-07
130001.00000  131001.00000  8.560318084321e-07
131001.00000  132001.00000  9.653124648277e-07
132001.00000  133001.00000  8.013914802343e-07
133001.00000  134001.00000  8.013914802343e-07
134001.00000  135001.00000  6.374704956410e-07
135001.00000  136001.00000  6.010436101758e-07
136001.00000  137001.00000  6.738973811061e-07
137001.00000  138001.00000  5.281898392454e-07
138001.00000  139001.00000  8.560318084321e-07
139001.00000  140001.00000  7.831780375017e-07
140001.00000  141001.00000  6.374704956410e-07
141001.00000  142001.00000  7.103242665713e-07
142001.00000  143001.00000  6.374704956410e-07
143001.00000  144001.00000  6.010436101758e-07
144001.00000  145001.00000  6.010436101758e-07
145001.00000  146001.00000  5.464032819780e-07
146001.00000  147001.00000  4.189091828498e-07
147001.00000  148001.00000  5.281898392454e-07
148001.00000  149001.00000  5.646167247106e-07
149001.00000  150001.00000  6.010436101758e-07
150001.00000  151001.00000  3.460554119194e-07
151001.00000  152001.00000  4.189091828498e-07
152001.00000  153001.00000  4.006957401172e-07
153001.00000  154001.00000  4.371226255824e-07
154001.00000  155001.00000  4.189091828498e-07
155001.00000  156001.00000  6.192570529084e-07
156001.00000  157001.00000  4.917629537802e-07
157001.00000  158001.00000  6.738973811061e-07
158001.00000  159001.00000  4.371226255824e-07
159001.00000  160001.00000  3.642688546520e-07
160001.00000  161001.00000  4.553360683150e-07
161001.00000  162001.00000  4.917629537802e-07
162001.00000  163001.00000  4.006957401172e-07
163001.00000  164001.00000  4.006957401172e-07
164001.00000  165001.00000  2.549881982564e-07
165001.00000  166001.00000  4.553360683150e-07
166001.00000  167001.00000  2.367747555238e-07
167001.00000  168001.00000  5.281898392454e-07
168001.00000  169001.00000  3.278419691868e-07
169001.00000  170001.00000  1.821344273260e-07
170001.00000  171001.00000  4.189091828498e-07
171001.00000  172001.00000  2.732016409890e-07
172001.00000  173001.00000  3.824822973846e-07
173001.00000  174001.00000  4.553360683150e-07
174001.00000  175001.00000  4.006957401172e-07
175001.00000  176001.00000  3.278419691868e-07
176001.00000  177001.00000  3.642688546520e-07
177001.00000  178001.00000  2.185613127912e-07
178001.00000  179001.00000  4.189091828498e-07
179001.00000  180001.00000  2.549881982564e-07
180001.00000  181001.00000  2.732016409890e-07
181001.00000  182001.00000  2.003478700586e-07
182001.00000  183001.00000  4.917629537802e-07
183001.00000  184001.00000  2.549881982564e-07
184001.00000  185001.00000  2.185613127912e-07
185001.00000  186001.00000  2.185613127912e-07
186001.00000  187001.00000  1.639209845934e-07
187001.00000  188001.00000  2.549881982564e-07
188001.00000  189001.00000  2.003478700586e-07
189001.00000  190001.00000  2.185613127912e-07
190001.00000  191001.00000  3.278419691868e-07
191001.00000  192001.00000  2.367747555238e-07
192001.00000  193001.00000  2.549881982564e-07
193001.00000  194001.00000  1.457075418608e-07
194001.00000  195001.00000  3.278419691868e-07
195001.00000  196001.00000  3.278419691868e-07
196001.00000  197001.00000  1.639209845934e-07
197001.00000  198001.00000  2.367747555238e-07
198001.00000  199001.00000  2.185613127912e-07
