300.00000  350.00000  2.124821633681e-06
350.00000  400.00000  5.794968091856e-06
400.00000  450.00000  2.704318442866e-06
450.00000  500.00000  5.215471282671e-06
500.00000  550.00000  5.234787842977e-05
550.00000  600.00000  5.215471282671e-06
600.00000  650.00000  1.815756668782e-05
650.00000  700.00000  8.306120931661e-06
700.00000  750.00000  1.081727377147e-05
750.00000  800.00000  1.023777696228e-05
800.00000  850.00000  4.790506955935e-05
850.00000  900.00000  1.004461135922e-05
900.00000  950.00000  1.120360497759e-05
950.00000  1000.00000  1.294209540515e-05
1000.00000  1050.00000  1.487375143576e-05
1050.00000  1100.00000  1.757806987863e-05
1100.00000  1150.00000  1.468058583270e-05
1150.00000  1200.00000  1.873706349700e-05
1200.00000  1250.00000  2.163454754293e-05
1250.00000  1300.00000  4.964355998690e-05
1300.00000  1350.00000  1.912339470313e-05
1350.00000  1400.00000  2.144138193987e-05
1400.00000  1450.00000  2.221404435212e-05
1450.00000  1500.00000  2.994066847459e-05
1500.00000  1550.00000  2.453203158886e-05
1550.00000  1600.00000  2.182771314599e-05
1600.00000  1650.00000  2.723635003173e-05
1650.00000  1700.00000  2.337303797049e-05
1700.00000  1750.00000  9.040150223296e-05
1750.00000  1800.00000  2.820217804703e-05
1800.00000  1850.00000  3.187232450521e-05
1850.00000  1900.00000  3.109966209296e-05
1900.00000  1950.00000  3.438347734501e-05
1950.00000  2000.00000  3.380398053583e-05
2000.00000  2050.00000  3.554247096339e-05
2050.00000  2100.00000  3.109966209296e-05
2100.00000  2150.00000  3.187232450521e-05
2150.00000  2200.00000  3.380398053583e-05
2200.00000  2250.00000  2.916800606234e-05
2250.00000  2300.00000  3.921261742156e-05
2300.00000  2350.00000  1.386929029984e-04
2350.00000  2400.00000  4.017844543687e-05
2400.00000  2450.00000  4.307592948280e-05
2450.00000  2500.00000  4.616657913179e-05
2500.00000  2550.00000  3.670146458176e-05
2550.00000  2600.00000  3.592880216951e-05
2600.00000  2650.00000  4.326909508586e-05
2650.00000  2700.00000  4.230326707055e-05
2700.00000  2750.00000  4.230326707055e-05
2750.00000  2800.00000  4.829140076547e-05
2800.00000  2850.00000  5.118888481140e-05
2850.00000  2900.00000  5.022305679609e-05
2900.00000  2950.00000  5.099571920834e-05
2950.00000  3000.00000  8.016372527068e-05
3000.00000  3050.00000  5.060938800221e-05
3050.00000  3100.00000  4.790506955935e-05
3100.00000  3150.00000  5.427953446039e-05
3150.00000  3200.00000  5.505219687264e-05
3200.00000  3250.00000  5.775651531550e-05
3250.00000  3300.00000  5.524536247570e-05
3300.00000  3350.00000  5.968817134612e-05
3350.00000  3400.00000  6.316515220124e-05
3400.00000  3450.00000  6.548313943798e-05
3450.00000  3500.00000  7.475508838495e-05
3500.00000  3550.00000  7.378926036964e-05
3550.00000  3600.00000  7.939106285843e-05
3600.00000  3650.00000  8.460653414110e-05
3650.00000  3700.00000  1.373407437770e-04
3700.00000  3750.00000  9.658280153094e-05
3750.00000  3800.00000  9.600330472176e-05
3800.00000  3850.00000  1.095248969361e-04
3850.00000  3900.00000  1.178310178677e-04
3900.00000  3950.00000  1.269098012117e-04
3950.00000  4000.00000  1.317389412882e-04
4000.00000  4050.00000  1.454536991056e-04
4050.00000  4100.00000  1.323184380974e-04
4100.00000  4150.00000  1.491238455638e-04
4150.00000  4200.00000  1.611001129536e-04
4200.00000  4250.00000  1.632249345873e-04
4250.00000  4300.00000  1.806098388629e-04
4300.00000  4350.00000  1.811893356720e-04
4350.00000  4400.00000  1.869843037639e-04
4400.00000  4450.00000  1.941314310772e-04
4450.00000  4500.00000  2.122889977650e-04
4500.00000  4550.00000  2.051418704517e-04
4550.00000  4600.00000  2.258105899793e-04
4600.00000  4650.00000  2.354688701324e-04
4650.00000  4700.00000  2.482177999345e-04
4700.00000  4750.00000  2.516947807896e-04
4750.00000  4800.00000  2.617393921488e-04
4800.00000  4850.00000  2.694660162713e-04
4850.00000  4900.00000  2.818286148673e-04
4900.00000  4950.00000  2.843397677071e-04
4950.00000  5000.00000  2.893620733867e-04
5000.00000  5050.00000  2.938048822571e-04
5050.00000  5100.00000  3.171779202276e-04
5100.00000  5150.00000  3.098376273113e-04
5150.00000  5200.00000  3.256772067623e-04
5200.00000  5250.00000  3.260635379685e-04
5250.00000  5300.00000  3.405509581981e-04
5300.00000  5350.00000  3.390056333736e-04
5350.00000  5400.00000  3.531067223971e-04
5400.00000  5450.00000  3.816952316503e-04
5450.00000  5500.00000  3.664351490084e-04
5500.00000  5550.00000  3.724232827033e-04
5550.00000  5600.00000  3.699121298635e-04
5600.00000  5650.00000  3.867175373299e-04
5650.00000  5700.00000  3.791840788105e-04
5700.00000  5750.00000  3.961826518799e-04
5750.00000  5800.00000  3.919330086126e-04
5800.00000  5850.00000  3.917398430095e-04
5850.00000  5900.00000  4.199420210565e-04
5900.00000  5950.00000  3.903876837881e-04
5950.00000  6000.00000  4.218736770871e-04
6000.00000  6050.00000  4.029434479871e-04
6050.00000  6100.00000  4.052614352238e-04
6100.00000  6150.00000  4.220668426902e-04
6150.00000  6200.00000  4.143402185677e-04
6200.00000  6250.00000  4.769258739598e-04
6250.00000  6300.00000  5.217402938701e-04
6300.00000  6350.00000  5.084118672589e-04
6350.00000  6400.00000  2.419399178350e-03
6400.00000  6450.00000  4.135675561555e-04
6450.00000  6500.00000  4.073862568575e-04
6500.00000  6550.00000  4.118290657279e-04
6550.00000  6600.00000  4.265096515606e-04
6600.00000  6650.00000  4.098974096973e-04
6650.00000  6700.00000  4.137607217586e-04
6700.00000  6750.00000  4.247711611331e-04
6750.00000  6800.00000  4.062272632391e-04
6800.00000  6850.00000  4.147265497739e-04
6850.00000  6900.00000  4.195556898504e-04
6900.00000  6950.00000  4.249643267361e-04
6950.00000  7000.00000  4.126017281402e-04
7000.00000  7050.00000  4.149197153769e-04
7050.00000  7100.00000  6.225727386684e-04
7100.00000  7150.00000  2.188566282691e-04
7150.00000  7200.00000  2.113231697497e-04
7200.00000  7250.00000  1.956767559017e-04
7250.00000  7300.00000  2.140274881926e-04
7300.00000  7350.00000  2.169249722385e-04
7350.00000  7400.00000  2.151864818109e-04
7400.00000  7450.00000  2.271627492008e-04
7450.00000  7500.00000  3.036563280133e-04
7500.00000  7550.00000  2.080393544976e-04
7550.00000  7600.00000  2.107436729405e-04
7600.00000  7650.00000  2.146069850018e-04
7650.00000  7700.00000  2.258105899793e-04
7700.00000  7750.00000  2.219472779181e-04
7750.00000  7800.00000  2.229131059334e-04
7800.00000  7850.00000  2.327645516896e-04
7850.00000  7900.00000  2.335372141018e-04
7900.00000  7950.00000  2.242652651548e-04
7950.00000  8000.00000  2.283217428191e-04
8000.00000  8050.00000  2.281285772161e-04
8050.00000  8100.00000  2.219472779181e-04
8100.00000  8150.00000  2.325713860865e-04
8150.00000  8200.00000  2.254242587732e-04
8200.00000  8250.00000  2.298670676436e-04
8250.00000  8300.00000  2.348893733232e-04
8300.00000  8350.00000  2.202087874905e-04
8350.00000  8400.00000  2.039828768333e-04
8400.00000  8450.00000  2.283217428191e-04
8450.00000  8500.00000  2.148001506048e-04
8500.00000  8550.00000  2.231062715365e-04
8550.00000  8600.00000  2.275490804069e-04
8600.00000  8650.00000  2.242652651548e-04
8650.00000  8700.00000  2.171181378416e-04
8700.00000  8750.00000  2.091983481160e-04
8750.00000  8800.00000  2.205951186967e-04
8800.00000  8850.00000  2.169249722385e-04
8850.00000  8900.00000  2.188566282691e-04
8900.00000  8950.00000  2.287080740253e-04
8950.00000  9000.00000  2.128684945742e-04
9000.00000  9050.00000  2.242652651548e-04
9050.00000  9100.00000  2.184702970630e-04
9100.00000  9150.00000  2.190497938722e-04
9150.00000  9200.00000  2.238789339487e-04
9200.00000  9250.00000  2.097778449252e-04
9250.00000  9300.00000  2.117095009558e-04
9300.00000  9350.00000  2.165386410324e-04
9350.00000  9400.00000  2.175044690477e-04
9400.00000  9450.00000  2.188566282691e-04
9450.00000  9500.00000  2.202087874905e-04
9500.00000  9550.00000  2.138343225895e-04
9550.00000  9600.00000  2.142206537956e-04
9600.00000  9650.00000  2.063008640701e-04
9650.00000  9700.00000  2.061076984670e-04
9700.00000  9750.00000  2.084256857038e-04
9750.00000  9800.00000  2.107436729405e-04
9800.00000  9850.00000  2.109368385436e-04
9850.00000  9900.00000  2.035965456272e-04
9900.00000  9950.00000  2.059145328640e-04
9950.00000  10000.00000  2.003127303752e-04
