300.00000  350.00000  1.928112491260e-06
350.00000  400.00000  1.118305244931e-05
400.00000  450.00000  1.503927743183e-05
450.00000  500.00000  1.021899620368e-04
500.00000  550.00000  3.138967135771e-04
550.00000  600.00000  1.631183167606e-04
600.00000  650.00000  4.600476404146e-04
650.00000  700.00000  8.838467659935e-04
700.00000  750.00000  1.272554244231e-03
750.00000  800.00000  1.862556666557e-03
800.00000  850.00000  2.579428890807e-03
850.00000  900.00000  2.713239897701e-03
900.00000  950.00000  2.912992351795e-03
950.00000  1000.00000  3.406974772056e-03
1000.00000  1050.00000  3.695806023247e-03
1050.00000  1100.00000  3.906355907292e-03
1100.00000  1150.00000  4.025513259252e-03
1150.00000  1200.00000  4.089912216460e-03
1200.00000  1250.00000  4.012402094312e-03
1250.00000  1300.00000  3.801080965270e-03
1300.00000  1350.00000  3.464818146794e-03
1350.00000  1400.00000  3.442837664393e-03
1400.00000  1450.00000  3.371497502217e-03
1450.00000  1500.00000  3.230745290355e-03
1500.00000  1550.00000  2.990116851446e-03
1550.00000  1600.00000  2.774168252425e-03
1600.00000  1650.00000  2.648840940493e-03
1650.00000  1700.00000  2.488807603718e-03
1700.00000  1750.00000  2.296767599589e-03
1750.00000  1800.00000  2.082361490561e-03
1800.00000  1850.00000  1.855229839090e-03
1850.00000  1900.00000  1.807798271805e-03
1900.00000  1950.00000  1.631954412602e-03
1950.00000  2000.00000  1.595705897767e-03
2000.00000  2050.00000  1.471149830831e-03
2050.00000  2100.00000  1.401737781146e-03
2100.00000  2150.00000  1.314972719039e-03
2150.00000  2200.00000  1.203913439543e-03
2200.00000  2250.00000  1.156096249759e-03
2250.00000  2300.00000  1.060847492691e-03
2300.00000  2350.00000  1.016115282894e-03
2350.00000  2400.00000  9.652131131247e-04
2400.00000  2450.00000  8.811474085057e-04
2450.00000  2500.00000  8.159772063011e-04
2500.00000  2550.00000  7.781862014725e-04
2550.00000  2600.00000  7.022185693168e-04
2600.00000  2650.00000  6.455320620738e-04
2650.00000  2700.00000  6.007998522766e-04
2700.00000  2750.00000  5.996429847818e-04
2750.00000  2800.00000  5.633944699461e-04
2800.00000  2850.00000  5.117210551803e-04
2850.00000  2900.00000  4.928255527660e-04
2900.00000  2950.00000  4.727731828569e-04
2950.00000  3000.00000  4.315115755439e-04
3000.00000  3050.00000  4.037467556698e-04
3050.00000  3100.00000  4.083742256488e-04
3100.00000  3150.00000  3.802237832764e-04
3150.00000  3200.00000  3.590145458726e-04
3200.00000  3250.00000  3.339490834862e-04
3250.00000  3300.00000  3.027136611278e-04
3300.00000  3350.00000  2.888312511907e-04
3350.00000  3400.00000  2.818900462222e-04
3400.00000  3450.00000  2.591383188253e-04
3450.00000  3500.00000  2.356153464319e-04
3500.00000  3550.00000  2.425565514005e-04
3550.00000  3600.00000  2.136348640316e-04
3600.00000  3650.00000  2.194192015054e-04
3650.00000  3700.00000  2.190335790071e-04
3700.00000  3750.00000  2.140204865298e-04
3750.00000  3800.00000  1.739157467116e-04
3800.00000  3850.00000  1.654320517501e-04
3850.00000  3900.00000  1.611902042693e-04
3900.00000  3950.00000  1.669745417431e-04
3950.00000  4000.00000  1.469221718340e-04
4000.00000  4050.00000  1.469221718340e-04
4050.00000  4100.00000  1.361247418829e-04
4100.00000  4150.00000  1.318828944022e-04
4150.00000  4200.00000  1.241704444371e-04
4200.00000  4250.00000  1.176148619668e-04
4250.00000  4300.00000  1.110592794966e-04
4300.00000  4350.00000  1.133730144861e-04
4350.00000  4400.00000  1.068174320158e-04
4400.00000  4450.00000  1.079742995105e-04
4450.00000  4500.00000  1.018043395385e-04
4500.00000  4550.00000  8.290883712417e-05
4550.00000  4600.00000  8.830755209970e-05
4600.00000  4650.00000  7.828136714515e-05
4650.00000  4700.00000  6.786955969234e-05
4700.00000  4750.00000  8.020947963641e-05
4750.00000  4800.00000  6.401333470983e-05
4800.00000  4850.00000  7.635325465389e-05
4850.00000  4900.00000  7.789574464690e-05
4900.00000  4950.00000  6.285646721507e-05
4950.00000  5000.00000  6.131397722206e-05
5000.00000  5050.00000  7.326827466787e-05
5050.00000  5100.00000  5.707212974129e-05
5100.00000  5150.00000  6.324208971332e-05
5150.00000  5200.00000  5.013092477275e-05
5200.00000  5250.00000  4.858843477975e-05
5250.00000  5300.00000  5.514401725003e-05
5300.00000  5350.00000  4.935967977625e-05
5350.00000  5400.00000  4.974530227450e-05
5400.00000  5450.00000  4.974530227450e-05
5450.00000  5500.00000  4.434658729898e-05
5500.00000  5550.00000  4.820281228149e-05
5550.00000  5600.00000  3.277791235142e-05
5600.00000  5650.00000  4.550345479373e-05
5650.00000  5700.00000  3.354915734792e-05
5700.00000  5750.00000  3.971911731995e-05
5750.00000  5800.00000  4.743156728499e-05
5800.00000  5850.00000  3.740538233044e-05
5850.00000  5900.00000  3.084979986016e-05
5900.00000  5950.00000  3.856224982520e-05
5950.00000  6000.00000  3.200666735491e-05
6000.00000  6050.00000  3.393477984617e-05
6050.00000  6100.00000  3.046417736190e-05
6100.00000  6150.00000  2.776481987414e-05
6150.00000  6200.00000  3.239228985316e-05
6200.00000  6250.00000  2.776481987414e-05
6250.00000  6300.00000  2.545108488463e-05
6300.00000  6350.00000  2.776481987414e-05
6350.00000  6400.00000  7.519638715913e-05
6400.00000  6450.00000  2.198048240036e-05
6450.00000  6500.00000  2.082361490561e-05
6500.00000  6550.00000  2.313734989512e-05
6550.00000  6600.00000  1.928112491260e-05
6600.00000  6650.00000  2.545108488463e-05
6650.00000  6700.00000  2.043799240735e-05
6700.00000  6750.00000  1.812425741784e-05
6750.00000  6800.00000  1.581052242833e-05
6800.00000  6850.00000  1.889550241435e-05
6850.00000  6900.00000  1.850987991609e-05
6900.00000  6950.00000  1.619614492658e-05
6950.00000  7000.00000  1.503927743183e-05
7000.00000  7050.00000  1.850987991609e-05
7050.00000  7100.00000  2.120923740386e-05
7100.00000  7150.00000  2.275172739687e-05
7150.00000  7200.00000  1.349678743882e-05
7200.00000  7250.00000  1.311116494057e-05
7250.00000  7300.00000  1.156867494756e-05
7300.00000  7350.00000  1.812425741784e-05
7350.00000  7400.00000  1.349678743882e-05
7400.00000  7450.00000  1.619614492658e-05
7450.00000  7500.00000  1.426803243532e-05
7500.00000  7550.00000  1.465365493357e-05
7550.00000  7600.00000  1.311116494057e-05
7600.00000  7650.00000  1.581052242833e-05
7650.00000  7700.00000  1.349678743882e-05
7700.00000  7750.00000  1.118305244931e-05
7750.00000  7800.00000  1.272554244231e-05
7800.00000  7850.00000  9.254939958047e-06
7850.00000  7900.00000  1.311116494057e-05
7900.00000  7950.00000  1.118305244931e-05
7950.00000  8000.00000  8.869317459795e-06
8000.00000  8050.00000  9.254939958047e-06
8050.00000  8100.00000  1.233991994406e-05
8100.00000  8150.00000  1.002618495455e-05
8150.00000  8200.00000  8.869317459795e-06
8200.00000  8250.00000  7.712449965039e-06
8250.00000  8300.00000  1.118305244931e-05
8300.00000  8350.00000  1.233991994406e-05
8350.00000  8400.00000  8.483694961543e-06
8400.00000  8450.00000  8.098072463291e-06
8450.00000  8500.00000  8.869317459795e-06
8500.00000  8550.00000  3.470602484268e-06
8550.00000  8600.00000  8.483694961543e-06
8600.00000  8650.00000  9.254939958047e-06
8650.00000  8700.00000  8.098072463291e-06
8700.00000  8750.00000  8.098072463291e-06
8750.00000  8800.00000  8.098072463291e-06
8800.00000  8850.00000  5.013092477275e-06
8850.00000  8900.00000  1.195429744581e-05
8900.00000  8950.00000  6.941204968535e-06
8950.00000  9000.00000  8.483694961543e-06
9000.00000  9050.00000  8.098072463291e-06
9050.00000  9100.00000  9.640562456299e-06
9100.00000  9150.00000  8.098072463291e-06
9150.00000  9200.00000  6.941204968535e-06
9200.00000  9250.00000  5.013092477275e-06
9250.00000  9300.00000  5.013092477275e-06
9300.00000  9350.00000  6.169959972031e-06
9350.00000  9400.00000  8.869317459795e-06
9400.00000  9450.00000  5.784337473779e-06
9450.00000  9500.00000  3.084979986016e-06
9500.00000  9550.00000  5.784337473779e-06
9550.00000  9600.00000  6.169959972031e-06
9600.00000  9650.00000  6.555582470283e-06
9650.00000  9700.00000  3.470602484268e-06
9700.00000  9750.00000  4.627469979024e-06
9750.00000  9800.00000  3.470602484268e-06
9800.00000  9850.00000  6.941204968535e-06
9850.00000  9900.00000  3.856224982520e-06
9900.00000  9950.00000  6.169959972031e-06
9950.00000  10000.00000  4.627469979024e-06
