300.00000  350.00000  2.331116577603e-05
350.00000  400.00000  2.893799889438e-05
400.00000  450.00000  2.250733247341e-05
450.00000  500.00000  4.340699834157e-05
500.00000  550.00000  2.226618248262e-04
550.00000  600.00000  2.733033228914e-05
600.00000  650.00000  5.707216448614e-05
650.00000  700.00000  3.456483201273e-05
700.00000  750.00000  5.948366439400e-05
750.00000  800.00000  4.340699834157e-05
800.00000  850.00000  1.535321608007e-04
850.00000  900.00000  4.501466494681e-05
900.00000  950.00000  4.421083164419e-05
950.00000  1000.00000  4.179933173632e-05
1000.00000  1050.00000  5.867983109138e-05
1050.00000  1100.00000  6.269899760449e-05
1100.00000  1150.00000  5.385683127565e-05
1150.00000  1200.00000  5.305299797303e-05
1200.00000  1250.00000  8.118716356478e-05
1250.00000  1300.00000  1.969391591423e-04
1300.00000  1350.00000  1.101251624592e-04
1350.00000  1400.00000  1.696088268532e-04
1400.00000  1450.00000  2.676764897730e-04
1450.00000  1500.00000  3.552943197588e-04
1500.00000  1550.00000  4.605964824022e-04
1550.00000  1600.00000  5.715254781640e-04
1600.00000  1650.00000  7.290768054778e-04
1650.00000  1700.00000  8.826089662785e-04
1700.00000  1750.00000  1.141443289723e-03
1750.00000  1800.00000  1.186457954670e-03
1800.00000  1850.00000  1.206553787235e-03
1850.00000  1900.00000  1.245137785761e-03
1900.00000  1950.00000  1.482268610034e-03
1950.00000  2000.00000  1.546575274244e-03
2000.00000  2050.00000  1.655092770098e-03
2050.00000  2100.00000  1.865697095385e-03
2100.00000  2150.00000  1.925180759779e-03
2150.00000  2200.00000  1.997525757015e-03
2200.00000  2250.00000  2.057813254711e-03
2250.00000  2300.00000  2.049774921685e-03
2300.00000  2350.00000  2.341566410537e-03
2350.00000  2400.00000  2.159096250842e-03
2400.00000  2450.00000  2.180799750012e-03
2450.00000  2500.00000  2.095593419935e-03
2500.00000  2550.00000  2.024856089304e-03
2550.00000  2600.00000  1.997525757015e-03
2600.00000  2650.00000  1.921161593266e-03
2650.00000  2700.00000  1.959745591792e-03
2700.00000  2750.00000  1.893027427674e-03
2750.00000  2800.00000  1.883381428042e-03
2800.00000  2850.00000  1.807017264293e-03
2850.00000  2900.00000  1.854443429148e-03
2900.00000  2950.00000  1.831132263372e-03
2950.00000  3000.00000  1.736279933663e-03
3000.00000  3050.00000  1.665542603032e-03
3050.00000  3100.00000  1.597216772309e-03
3100.00000  3150.00000  1.564259606902e-03
3150.00000  3200.00000  1.503972109205e-03
3200.00000  3250.00000  1.505579775810e-03
3250.00000  3300.00000  1.426804112153e-03
3300.00000  3350.00000  1.369731947667e-03
3350.00000  3400.00000  1.317482782997e-03
3400.00000  3450.00000  1.331951782444e-03
3450.00000  3500.00000  1.289348617405e-03
3500.00000  3550.00000  1.198515454209e-03
3550.00000  3600.00000  1.221826619985e-03
3600.00000  3650.00000  1.123758957065e-03
3650.00000  3700.00000  1.028906627356e-03
3700.00000  3750.00000  1.024083627540e-03
3750.00000  3800.00000  9.975571285534e-04
3800.00000  3850.00000  9.613846299355e-04
3850.00000  3900.00000  8.978817990283e-04
3900.00000  3950.00000  9.469156304883e-04
3950.00000  4000.00000  8.810012996733e-04
4000.00000  4050.00000  8.834127995812e-04
4050.00000  4100.00000  8.134793022531e-04
4100.00000  4150.00000  8.215176352793e-04
4150.00000  4200.00000  7.531918045565e-04
4200.00000  4250.00000  7.121963061228e-04
4250.00000  4300.00000  6.776314741100e-04
4300.00000  4350.00000  6.993349732808e-04
4350.00000  4400.00000  6.527126417288e-04
4400.00000  4450.00000  6.454781420052e-04
4450.00000  4500.00000  5.892098108216e-04
4500.00000  4550.00000  5.851906443085e-04
4550.00000  4600.00000  5.578603120194e-04
4600.00000  4650.00000  5.313338130329e-04
4650.00000  4700.00000  5.112379804674e-04
4700.00000  4750.00000  5.297261464276e-04
4750.00000  4800.00000  4.975728143228e-04
4800.00000  4850.00000  5.064149806516e-04
4850.00000  4900.00000  4.364814833235e-04
4900.00000  4950.00000  4.525581493760e-04
4950.00000  5000.00000  4.196009839685e-04
5000.00000  5050.00000  4.035243179161e-04
5050.00000  5100.00000  3.922706516794e-04
5100.00000  5150.00000  3.810169854426e-04
5150.00000  5200.00000  3.681556526007e-04
5200.00000  5250.00000  3.657441526928e-04
5250.00000  5300.00000  3.826246520479e-04
5300.00000  5350.00000  3.657441526928e-04
5350.00000  5400.00000  3.327869872854e-04
5400.00000  5450.00000  3.327869872854e-04
5450.00000  5500.00000  2.909876555490e-04
5500.00000  5550.00000  2.893799889438e-04
5550.00000  5600.00000  3.054566549962e-04
5600.00000  5650.00000  2.692841563782e-04
5650.00000  5700.00000  2.837531558254e-04
5700.00000  5750.00000  2.733033228914e-04
5750.00000  5800.00000  2.668726564704e-04
5800.00000  5850.00000  2.556189902337e-04
5850.00000  5900.00000  2.644611565625e-04
5900.00000  5950.00000  2.459729906022e-04
5950.00000  6000.00000  2.210541582209e-04
6000.00000  6050.00000  2.491883238127e-04
6050.00000  6100.00000  2.331116577603e-04
6100.00000  6150.00000  2.114081585895e-04
6150.00000  6200.00000  2.130158251947e-04
6200.00000  6250.00000  2.186426583131e-04
6250.00000  6300.00000  2.057813254711e-04
6300.00000  6350.00000  1.945276592344e-04
6350.00000  6400.00000  6.728084742943e-04
6400.00000  6450.00000  1.913123260239e-04
6450.00000  6500.00000  1.856854929056e-04
6500.00000  6550.00000  1.535321608007e-04
6550.00000  6600.00000  1.663934936427e-04
6600.00000  6650.00000  1.543359941034e-04
6650.00000  6700.00000  1.631781604322e-04
6700.00000  6750.00000  1.438861611693e-04
6750.00000  6800.00000  1.511206608929e-04
6800.00000  6850.00000  1.583551606165e-04
6850.00000  6900.00000  1.495129942876e-04
6900.00000  6950.00000  1.623743271296e-04
6950.00000  7000.00000  1.189673287880e-04
7000.00000  7050.00000  1.374554947483e-04
7050.00000  7100.00000  1.631781604322e-04
7100.00000  7150.00000  9.887149622246e-05
7150.00000  7200.00000  1.044983293408e-04
7200.00000  7250.00000  9.887149622246e-05
7250.00000  7300.00000  1.020868294329e-04
7300.00000  7350.00000  9.645999631459e-05
7350.00000  7400.00000  9.967532952508e-05
7400.00000  7450.00000  8.922549659100e-05
7450.00000  7500.00000  1.117328290644e-04
7500.00000  7550.00000  9.002932989362e-05
7550.00000  7600.00000  1.004791628277e-04
7600.00000  7650.00000  9.404849640673e-05
7650.00000  7700.00000  7.957949695954e-05
7700.00000  7750.00000  8.118716356478e-05
7750.00000  7800.00000  7.957949695954e-05
7800.00000  7850.00000  7.957949695954e-05
7850.00000  7900.00000  9.163699649886e-05
7900.00000  7950.00000  7.957949695954e-05
7950.00000  8000.00000  7.797183035430e-05
8000.00000  8050.00000  9.083316319624e-05
8050.00000  8100.00000  7.797183035430e-05
8100.00000  8150.00000  7.957949695954e-05
8150.00000  8200.00000  6.993349732808e-05
8200.00000  8250.00000  7.636416374905e-05
8250.00000  8300.00000  6.028749769662e-05
8300.00000  8350.00000  6.269899760449e-05
8350.00000  8400.00000  6.591433081497e-05
8400.00000  8450.00000  5.546449788089e-05
8450.00000  8500.00000  6.109133099924e-05
8500.00000  8550.00000  6.752199742022e-05
8550.00000  8600.00000  6.993349732808e-05
8600.00000  8650.00000  6.993349732808e-05
8650.00000  8700.00000  4.581849824943e-05
8700.00000  8750.00000  5.787599778876e-05
8750.00000  8800.00000  7.073733063070e-05
8800.00000  8850.00000  5.064149806516e-05
8850.00000  8900.00000  6.269899760449e-05
8900.00000  8950.00000  5.948366439400e-05
8950.00000  9000.00000  5.305299797303e-05
9000.00000  9050.00000  4.421083164419e-05
9050.00000  9100.00000  5.144533136778e-05
9100.00000  9150.00000  5.064149806516e-05
9150.00000  9200.00000  4.019166513108e-05
9200.00000  9250.00000  4.179933173632e-05
9250.00000  9300.00000  3.456483201273e-05
9300.00000  9350.00000  5.385683127565e-05
9350.00000  9400.00000  4.662233155205e-05
9400.00000  9450.00000  4.179933173632e-05
9450.00000  9500.00000  5.385683127565e-05
9500.00000  9550.00000  5.064149806516e-05
9550.00000  9600.00000  4.099549843370e-05
9600.00000  9650.00000  4.983766476254e-05
9650.00000  9700.00000  4.099549843370e-05
9700.00000  9750.00000  4.179933173632e-05
9750.00000  9800.00000  4.421083164419e-05
9800.00000  9850.00000  4.340699834157e-05
9850.00000  9900.00000  5.224916467041e-05
9900.00000  9950.00000  2.893799889438e-05
9950.00000  10000.00000  4.501466494681e-05
