300.00000  350.00000  1.804925156893e-01
350.00000  400.00000  1.276869517591e-01
400.00000  450.00000  9.448078372633e-02
450.00000  500.00000  7.221179542529e-02
500.00000  550.00000  5.665828829794e-02
550.00000  600.00000  4.584787270518e-02
600.00000  650.00000  3.734033897109e-02
650.00000  700.00000  3.070182173893e-02
700.00000  750.00000  2.621678577304e-02
750.00000  800.00000  2.232633398298e-02
800.00000  850.00000  1.926211274181e-02
850.00000  900.00000  1.675323915725e-02
900.00000  950.00000  1.471143106107e-02
950.00000  1000.00000  1.276243242381e-02
1000.00000  1050.00000  1.144951812693e-02
1050.00000  1100.00000  1.001059423949e-02
1100.00000  1150.00000  9.168518173211e-03
1150.00000  1200.00000  8.168741481622e-03
1200.00000  1250.00000  7.423247616497e-03
1250.00000  1300.00000  6.848281700277e-03
1300.00000  1350.00000  6.114860610296e-03
1350.00000  1400.00000  5.639495089012e-03
1400.00000  1450.00000  5.183747827336e-03
1450.00000  1500.00000  4.764973439538e-03
1500.00000  1550.00000  4.357517278437e-03
1550.00000  1600.00000  3.982506700536e-03
1600.00000  1650.00000  3.713132905141e-03
1650.00000  1700.00000  3.489786564982e-03
1700.00000  1750.00000  3.225694608713e-03
1750.00000  1800.00000  2.962357200891e-03
1800.00000  1850.00000  2.774474637717e-03
1850.00000  1900.00000  2.666574209870e-03
1900.00000  1950.00000  2.457564290194e-03
1950.00000  2000.00000  2.323254666720e-03
2000.00000  2050.00000  2.240254337607e-03
2050.00000  2100.00000  2.075762776274e-03
2100.00000  2150.00000  1.961825960855e-03
2150.00000  2200.00000  1.893916600672e-03
2200.00000  2250.00000  1.732443233124e-03
2250.00000  2300.00000  1.724143200213e-03
2300.00000  2350.00000  1.527960604127e-03
2350.00000  2400.00000  1.529469701020e-03
2400.00000  2450.00000  1.432132951424e-03
2450.00000  2500.00000  1.351396267650e-03
2500.00000  2550.00000  1.333287104935e-03
2550.00000  2600.00000  1.228404870874e-03
2600.00000  2650.00000  1.196713836122e-03
2650.00000  2700.00000  1.119749894580e-03
2700.00000  2750.00000  1.091077053614e-03
2750.00000  2800.00000  1.008831272947e-03
2800.00000  2850.00000  1.002794885375e-03
2850.00000  2900.00000  9.695947537302e-04
2900.00000  2950.00000  9.250763953878e-04
2950.00000  3000.00000  9.265854922807e-04
3000.00000  3050.00000  8.420760662747e-04
3050.00000  3100.00000  7.779394483236e-04
3100.00000  3150.00000  7.681303185194e-04
3150.00000  3200.00000  7.530393495897e-04
3200.00000  3250.00000  7.175755726050e-04
3250.00000  3300.00000  7.153119272656e-04
3300.00000  3350.00000  6.640026329048e-04
3350.00000  3400.00000  6.413661795103e-04
3400.00000  3450.00000  6.164660807764e-04
3450.00000  3500.00000  5.938296273819e-04
3500.00000  3550.00000  5.742113677733e-04
3550.00000  3600.00000  6.006205634002e-04
3600.00000  3650.00000  5.327112032168e-04
3650.00000  3700.00000  5.893023367030e-04
3700.00000  3750.00000  5.198838796266e-04
3750.00000  3800.00000  4.957383293391e-04
3800.00000  3850.00000  4.557472616755e-04
3850.00000  3900.00000  5.100747498223e-04
3900.00000  3950.00000  4.527290678896e-04
3950.00000  4000.00000  4.248107753697e-04
4000.00000  4050.00000  4.421653896389e-04
4050.00000  4100.00000  4.157561940120e-04
4100.00000  4150.00000  3.878379014921e-04
4150.00000  4200.00000  4.172652909049e-04
4200.00000  4250.00000  3.697287387765e-04
4250.00000  4300.00000  3.923651921710e-04
4300.00000  4350.00000  3.659559965441e-04
4350.00000  4400.00000  3.440740915961e-04
4400.00000  4450.00000  3.742560294554e-04
4450.00000  4500.00000  3.237012835411e-04
4500.00000  4550.00000  3.561468667398e-04
4550.00000  4600.00000  3.237012835411e-04
4600.00000  4650.00000  2.822011189845e-04
4650.00000  4700.00000  2.988011848071e-04
4700.00000  4750.00000  2.912557003423e-04
4750.00000  4800.00000  2.754101829662e-04
4800.00000  4850.00000  2.942738941282e-04
4850.00000  4900.00000  2.557919233576e-04
4900.00000  4950.00000  2.814465705380e-04
4950.00000  5000.00000  2.784283767521e-04
5000.00000  5050.00000  2.852193127705e-04
5050.00000  5100.00000  2.588101171436e-04
5100.00000  5150.00000  2.625828593760e-04
5150.00000  5200.00000  2.701283438408e-04
5200.00000  5250.00000  2.550373749111e-04
5250.00000  5300.00000  2.346645668561e-04
5300.00000  5350.00000  2.346645668561e-04
5350.00000  5400.00000  2.391918575350e-04
5400.00000  5450.00000  2.142917588011e-04
5450.00000  5500.00000  2.241008886054e-04
5500.00000  5550.00000  2.331554699631e-04
5550.00000  5600.00000  2.195735979265e-04
5600.00000  5650.00000  2.180645010335e-04
5650.00000  5700.00000  1.856189178347e-04
5700.00000  5750.00000  1.939189507460e-04
5750.00000  5800.00000  2.052371774433e-04
5800.00000  5850.00000  1.893916600672e-04
5850.00000  5900.00000  1.976916929785e-04
5900.00000  5950.00000  1.886371116207e-04
5950.00000  6000.00000  1.539278830825e-04
6000.00000  6050.00000  1.569460768684e-04
6050.00000  6100.00000  1.810916271558e-04
6100.00000  6150.00000  1.818461756023e-04
6150.00000  6200.00000  1.961825960855e-04
6200.00000  6250.00000  1.682643035656e-04
6250.00000  6300.00000  1.652461097797e-04
6300.00000  6350.00000  1.584551737614e-04
6350.00000  6400.00000  3.380377040242e-04
6400.00000  6450.00000  1.463823986176e-04
6450.00000  6500.00000  1.312914296880e-04
6500.00000  6550.00000  1.486460439571e-04
6550.00000  6600.00000  1.388369141528e-04
6600.00000  6650.00000  1.373278172598e-04
6650.00000  6700.00000  1.222368483302e-04
6700.00000  6750.00000  1.501551408501e-04
6750.00000  6800.00000  1.373278172598e-04
6800.00000  6850.00000  1.350641719204e-04
6850.00000  6900.00000  1.350641719204e-04
6900.00000  6950.00000  1.441187532782e-04
6950.00000  7000.00000  1.290277843485e-04
7000.00000  7050.00000  1.207277514372e-04
7050.00000  7100.00000  1.343096234739e-04
7100.00000  7150.00000  1.252550421161e-04
7150.00000  7200.00000  1.056367825076e-04
7200.00000  7250.00000  1.086549762935e-04
7250.00000  7300.00000  1.101640731865e-04
7300.00000  7350.00000  1.109186216330e-04
7350.00000  7400.00000  8.979126513144e-05
7400.00000  7450.00000  1.177095576513e-04
7450.00000  7500.00000  1.222368483302e-04
7500.00000  7550.00000  1.094095247400e-04
7550.00000  7600.00000  1.018640402752e-04
7600.00000  7650.00000  1.094095247400e-04
7650.00000  7700.00000  9.280945891737e-05
7700.00000  7750.00000  1.079004278470e-04
7750.00000  7800.00000  1.086549762935e-04
7800.00000  7850.00000  1.079004278470e-04
7850.00000  7900.00000  9.280945891737e-05
7900.00000  7950.00000  9.431855581034e-05
7950.00000  8000.00000  9.658220114978e-05
8000.00000  8050.00000  9.733674959627e-05
8050.00000  8100.00000  9.582765270330e-05
8100.00000  8150.00000  7.998213532716e-05
8150.00000  8200.00000  8.601852289903e-05
8200.00000  8250.00000  8.828216823847e-05
8250.00000  8300.00000  8.450942600606e-05
8300.00000  8350.00000  7.922758688068e-05
8350.00000  8400.00000  7.168210241585e-05
8400.00000  8450.00000  7.545484464827e-05
8450.00000  8500.00000  6.941845707641e-05
8500.00000  8550.00000  6.941845707641e-05
8550.00000  8600.00000  6.262752105806e-05
8600.00000  8650.00000  6.866390862992e-05
8650.00000  8700.00000  7.319119930882e-05
8700.00000  8750.00000  8.375487755958e-05
8750.00000  8800.00000  7.620939309475e-05
8800.00000  8850.00000  7.243665086234e-05
8850.00000  8900.00000  6.866390862992e-05
8900.00000  8950.00000  7.092755396937e-05
8950.00000  9000.00000  7.168210241585e-05
9000.00000  9050.00000  6.338206950455e-05
9050.00000  9100.00000  6.187297261158e-05
9100.00000  9150.00000  7.545484464827e-05
9150.00000  9200.00000  6.489116639751e-05
9200.00000  9250.00000  6.640026329048e-05
9250.00000  9300.00000  7.470029620179e-05
9300.00000  9350.00000  5.960932727213e-05
9350.00000  9400.00000  7.470029620179e-05
9400.00000  9450.00000  7.168210241585e-05
9450.00000  9500.00000  5.659113348620e-05
9500.00000  9550.00000  5.508203659324e-05
9550.00000  9600.00000  5.281839125379e-05
9600.00000  9650.00000  6.262752105806e-05
9650.00000  9700.00000  5.281839125379e-05
9700.00000  9750.00000  6.036387571861e-05
9750.00000  9800.00000  6.564571484399e-05
9800.00000  9850.00000  5.960932727213e-05
9850.00000  9900.00000  5.583658503972e-05
9900.00000  9950.00000  4.376380989600e-05
9950.00000  10000.00000  5.734568193268e-05
