10001.00000  11001.00000  3.257279746666e-04
11001.00000  12001.00000  2.644357236111e-04
12001.00000  13001.00000  2.177540680920e-04
13001.00000  14001.00000  1.782572933450e-04
14001.00000  15001.00000  1.510430522083e-04
15001.00000  16001.00000  1.239492280678e-04
16001.00000  17001.00000  1.072112655988e-04
17001.00000  18001.00000  8.874732618459e-05
18001.00000  19001.00000  7.726757254877e-05
19001.00000  20001.00000  6.859754882382e-05
20001.00000  21001.00000  5.804099215871e-05
21001.00000  22001.00000  5.450876027077e-05
22001.00000  23001.00000  4.624012653308e-05
23001.00000  24001.00000  3.929607975338e-05
24001.00000  25001.00000  3.532231887944e-05
25001.00000  26001.00000  3.203092098385e-05
26001.00000  27001.00000  2.890007908318e-05
27001.00000  28001.00000  2.601007117486e-05
28001.00000  29001.00000  2.239756128946e-05
29001.00000  30001.00000  2.123353032639e-05
30001.00000  31001.00000  1.962797037732e-05
31001.00000  32001.00000  1.697879646137e-05
32001.00000  33001.00000  1.561407050466e-05
33001.00000  34001.00000  1.348670357215e-05
34001.00000  35001.00000  1.264378459889e-05
35001.00000  36001.00000  1.099808565110e-05
36001.00000  37001.00000  1.043613966893e-05
37001.00000  38001.00000  8.629884726227e-06
38001.00000  39001.00000  7.867243750420e-06
39001.00000  40001.00000  7.265158769521e-06
40001.00000  41001.00000  7.265158769521e-06
41001.00000  42001.00000  6.903907780981e-06
42001.00000  43001.00000  6.101127806449e-06
43001.00000  44001.00000  4.977235842103e-06
44001.00000  45001.00000  5.338486830642e-06
45001.00000  46001.00000  5.097652838283e-06
46001.00000  47001.00000  3.652648884124e-06
47001.00000  48001.00000  3.933621875210e-06
48001.00000  49001.00000  4.294872863750e-06
49001.00000  50001.00000  3.010424904498e-06
50001.00000  51001.00000  3.612509885397e-06
51001.00000  52001.00000  3.211119898131e-06
52001.00000  53001.00000  2.809729910864e-06
53001.00000  54001.00000  2.849868909591e-06
54001.00000  55001.00000  2.609034917231e-06
55001.00000  56001.00000  3.170980899404e-06
56001.00000  57001.00000  2.528756919778e-06
57001.00000  58001.00000  2.328061926145e-06
58001.00000  59001.00000  1.766115943972e-06
59001.00000  60001.00000  1.806254942699e-06
60001.00000  61001.00000  1.605559949065e-06
61001.00000  62001.00000  1.766115943972e-06
62001.00000  63001.00000  1.685837946519e-06
63001.00000  64001.00000  1.645698947792e-06
64001.00000  65001.00000  1.324586957979e-06
65001.00000  66001.00000  1.083752965619e-06
66001.00000  67001.00000  1.605559949065e-06
67001.00000  68001.00000  1.043613966893e-06
68001.00000  69001.00000  1.003474968166e-06
69001.00000  70001.00000  1.284447959252e-06
70001.00000  71001.00000  6.020849808995e-07
71001.00000  72001.00000  8.429189732593e-07
72001.00000  73001.00000  1.003474968166e-06
73001.00000  74001.00000  9.633359694392e-07
74001.00000  75001.00000  6.020849808995e-07
75001.00000  76001.00000  6.020849808995e-07
76001.00000  77001.00000  6.823629783528e-07
77001.00000  78001.00000  6.823629783528e-07
78001.00000  79001.00000  6.823629783528e-07
79001.00000  80001.00000  5.218069834463e-07
80001.00000  81001.00000  4.415289859930e-07
81001.00000  82001.00000  6.823629783528e-07
82001.00000  83001.00000  4.013899872664e-07
83001.00000  84001.00000  5.619459821729e-07
84001.00000  85001.00000  5.619459821729e-07
85001.00000  86001.00000  4.415289859930e-07
86001.00000  87001.00000  2.006949936332e-07
87001.00000  88001.00000  3.612509885397e-07
88001.00000  89001.00000  2.408339923598e-07
89001.00000  90001.00000  6.422239796262e-07
90001.00000  91001.00000  2.408339923598e-07
91001.00000  92001.00000  2.809729910864e-07
92001.00000  93001.00000  2.809729910864e-07
93001.00000  94001.00000  2.408339923598e-07
94001.00000  95001.00000  3.612509885397e-07
95001.00000  96001.00000  2.006949936332e-07
96001.00000  97001.00000  2.809729910864e-07
97001.00000  98001.00000  2.006949936332e-07
98001.00000  99001.00000  1.605559949065e-07
99001.00000  100001.00000  2.006949936332e-07
100001.00000  101001.00000  1.605559949065e-07
101001.00000  102001.00000  1.605559949065e-07
102001.00000  103001.00000  2.006949936332e-07
103001.00000  104001.00000  8.027799745327e-08
104001.00000  105001.00000  1.204169961799e-07
105001.00000  106001.00000  1.204169961799e-07
106001.00000  107001.00000  2.408339923598e-07
107001.00000  108001.00000  3.612509885397e-07
108001.00000  109001.00000  8.027799745327e-08
109001.00000  110001.00000  1.605559949065e-07
110001.00000  111001.00000  4.013899872664e-08
111001.00000  112001.00000  2.408339923598e-07
112001.00000  113001.00000  0.000000000000e+00
113001.00000  114001.00000  1.605559949065e-07
114001.00000  115001.00000  1.204169961799e-07
115001.00000  116001.00000  0.000000000000e+00
116001.00000  117001.00000  8.027799745327e-08
117001.00000  118001.00000  4.013899872664e-08
118001.00000  119001.00000  0.000000000000e+00
119001.00000  120001.00000  1.204169961799e-07
120001.00000  121001.00000  1.204169961799e-07
121001.00000  122001.00000  1.204169961799e-07
122001.00000  123001.00000  8.027799745327e-08
123001.00000  124001.00000  8.027799745327e-08
124001.00000  125001.00000  1.204169961799e-07
125001.00000  126001.00000  0.000000000000e+00
126001.00000  127001.00000  4.013899872664e-08
127001.00000  128001.00000  1.204169961799e-07
128001.00000  129001.00000  8.027799745327e-08
129001.00000  130001.00000  8.027799745327e-08
130001.00000  131001.00000  4.013899872664e-08
131001.00000  132001.00000  4.013899872664e-08
132001.00000  133001.00000  4.013899872664e-08
133001.00000  134001.00000  0.000000000000e+00
134001.00000  135001.00000  1.204169961799e-07
135001.00000  136001.00000  4.013899872664e-08
136001.00000  137001.00000  0.000000000000e+00
137001.00000  138001.00000  4.013899872664e-08
138001.00000  139001.00000  0.000000000000e+00
139001.00000  140001.00000  1.204169961799e-07
140001.00000  141001.00000  8.027799745327e-08
141001.00000  142001.00000  8.027799745327e-08
142001.00000  143001.00000  0.000000000000e+00
143001.00000  144001.00000  1.204169961799e-07
144001.00000  145001.00000  0.000000000000e+00
145001.00000  146001.00000  8.027799745327e-08
146001.00000  147001.00000  0.000000000000e+00
147001.00000  148001.00000  0.000000000000e+00
148001.00000  149001.00000  0.000000000000e+00
149001.00000  150001.00000  0.000000000000e+00
150001.00000  151001.00000  0.000000000000e+00
151001.00000  152001.00000  0.000000000000e+00
152001.00000  153001.00000  0.000000000000e+00
153001.00000  154001.00000  0.000000000000e+00
154001.00000  155001.00000  0.000000000000e+00
155001.00000  156001.00000  8.027799745327e-08
156001.00000  157001.00000  0.000000000000e+00
157001.00000  158001.00000  8.027799745327e-08
158001.00000  159001.00000  0.000000000000e+00
159001.00000  160001.00000  4.013899872664e-08
160001.00000  161001.00000  0.000000000000e+00
161001.00000  162001.00000  4.013899872664e-08
162001.00000  163001.00000  0.000000000000e+00
163001.00000  164001.00000  4.013899872664e-08
164001.00000  165001.00000  0.000000000000e+00
165001.00000  166001.00000  0.000000000000e+00
166001.00000  167001.00000  0.000000000000e+00
167001.00000  168001.00000  0.000000000000e+00
168001.00000  169001.00000  0.000000000000e+00
169001.00000  170001.00000  0.000000000000e+00
170001.00000  171001.00000  4.013899872664e-08
171001.00000  172001.00000  0.000000000000e+00
172001.00000  173001.00000  0.000000000000e+00
173001.00000  174001.00000  8.027799745327e-08
174001.00000  175001.00000  0.000000000000e+00
175001.00000  176001.00000  0.000000000000e+00
176001.00000  177001.00000  0.000000000000e+00
177001.00000  178001.00000  0.000000000000e+00
178001.00000  179001.00000  0.000000000000e+00
179001.00000  180001.00000  0.000000000000e+00
180001.00000  181001.00000  4.013899872664e-08
181001.00000  182001.00000  0.000000000000e+00
182001.00000  183001.00000  0.000000000000e+00
183001.00000  184001.00000  4.013899872664e-08
184001.00000  185001.00000  0.000000000000e+00
185001.00000  186001.00000  0.000000000000e+00
186001.00000  187001.00000  4.013899872664e-08
187001.00000  188001.00000  0.000000000000e+00
188001.00000  189001.00000  0.000000000000e+00
189001.00000  190001.00000  0.000000000000e+00
190001.00000  191001.00000  0.000000000000e+00
191001.00000  192001.00000  0.000000000000e+00
192001.00000  193001.00000  4.013899872664e-08
193001.00000  194001.00000  0.000000000000e+00
194001.00000  195001.00000  0.000000000000e+00
195001.00000  196001.00000  0.000000000000e+00
196001.00000  197001.00000  0.000000000000e+00
197001.00000  198001.00000  0.000000000000e+00
198001.00000  199001.00000  0.000000000000e+00
