10001.00000  11001.00000  1.457716602417e-04
11001.00000  12001.00000  1.288728348104e-04
12001.00000  13001.00000  1.157936069081e-04
13001.00000  14001.00000  1.032931059041e-04
14001.00000  15001.00000  9.113984103911e-05
15001.00000  16001.00000  8.176446528612e-05
16001.00000  17001.00000  7.280384381027e-05
17001.00000  18001.00000  6.763388351849e-05
18001.00000  19001.00000  6.062164260036e-05
19001.00000  20001.00000  5.543239141198e-05
20001.00000  21001.00000  5.060966725920e-05
21001.00000  22001.00000  4.593162483101e-05
22001.00000  23001.00000  4.236280895796e-05
23001.00000  24001.00000  3.880363853321e-05
24001.00000  25001.00000  3.638263100852e-05
25001.00000  26001.00000  3.281381513547e-05
26001.00000  27001.00000  3.083649823283e-05
27001.00000  28001.00000  2.993947154042e-05
28001.00000  29001.00000  2.769208208522e-05
29001.00000  30001.00000  2.559901980292e-05
30001.00000  31001.00000  2.507816559442e-05
31001.00000  32001.00000  2.358312110706e-05
32001.00000  33001.00000  2.148041337645e-05
33001.00000  34001.00000  1.994678709587e-05
34001.00000  35001.00000  1.915586033482e-05
35001.00000  36001.00000  1.787301571018e-05
36001.00000  37001.00000  1.792124295171e-05
37001.00000  38001.00000  1.658052563723e-05
38001.00000  39001.00000  1.553881722024e-05
39001.00000  40001.00000  1.476718135579e-05
40001.00000  41001.00000  1.456462694138e-05
41001.00000  42001.00000  1.381228197354e-05
42001.00000  43001.00000  1.355185486929e-05
43001.00000  44001.00000  1.263553728027e-05
44001.00000  45001.00000  1.170957424293e-05
45001.00000  46001.00000  1.119836548274e-05
46001.00000  47001.00000  1.029169334202e-05
47001.00000  48001.00000  1.038814782507e-05
48001.00000  49001.00000  1.005055713438e-05
49001.00000  50001.00000  9.192112235186e-06
50001.00000  51001.00000  8.680903474992e-06
51001.00000  52001.00000  8.459058163964e-06
52001.00000  53001.00000  8.516930853798e-06
53001.00000  54001.00000  8.015367541909e-06
54001.00000  55001.00000  7.465576988493e-06
55001.00000  56001.00000  7.639195057993e-06
56001.00000  57001.00000  7.195504435938e-06
57001.00000  58001.00000  7.205149884243e-06
58001.00000  59001.00000  6.529968502855e-06
59001.00000  60001.00000  6.086277880800e-06
60001.00000  61001.00000  6.308123191827e-06
61001.00000  62001.00000  5.835496224856e-06
62001.00000  63001.00000  5.912659811300e-06
63001.00000  64001.00000  5.526841879078e-06
64001.00000  65001.00000  5.382160154495e-06
65001.00000  66001.00000  5.295351119745e-06
66001.00000  67001.00000  5.092796705329e-06
67001.00000  68001.00000  4.938469532440e-06
68001.00000  69001.00000  4.610524290051e-06
69001.00000  70001.00000  4.552651600218e-06
70001.00000  71001.00000  4.928824084134e-06
71001.00000  72001.00000  4.388678979024e-06
72001.00000  73001.00000  4.195770012913e-06
73001.00000  74001.00000  3.858179322219e-06
74001.00000  75001.00000  3.752079390858e-06
75001.00000  76001.00000  3.665270356108e-06
76001.00000  77001.00000  3.906406563746e-06
77001.00000  78001.00000  3.318034217108e-06
78001.00000  79001.00000  3.414488700163e-06
79001.00000  80001.00000  3.607397666274e-06
80001.00000  81001.00000  3.539879528136e-06
81001.00000  82001.00000  3.491652286608e-06
82001.00000  83001.00000  2.951507181497e-06
83001.00000  84001.00000  2.787534560303e-06
84001.00000  85001.00000  2.787534560303e-06
85001.00000  86001.00000  2.758598215386e-06
86001.00000  87001.00000  2.855052698442e-06
87001.00000  88001.00000  2.700725525553e-06
88001.00000  89001.00000  2.633207387414e-06
89001.00000  90001.00000  2.517462007748e-06
90001.00000  91001.00000  2.382425731470e-06
91001.00000  92001.00000  2.064125937387e-06
92001.00000  93001.00000  2.295616696720e-06
93001.00000  94001.00000  2.131644075526e-06
94001.00000  95001.00000  2.228098558581e-06
95001.00000  96001.00000  2.170225868748e-06
96001.00000  97001.00000  2.131644075526e-06
97001.00000  98001.00000  1.784407936526e-06
98001.00000  99001.00000  1.929089661109e-06
99001.00000  100001.00000  1.900153316193e-06
100001.00000  101001.00000  1.765117039915e-06
101001.00000  102001.00000  1.649371660248e-06
102001.00000  103001.00000  1.716889798387e-06
103001.00000  104001.00000  1.822989729748e-06
104001.00000  105001.00000  1.572208073804e-06
105001.00000  106001.00000  1.311780969554e-06
106001.00000  107001.00000  1.379299107693e-06
107001.00000  108001.00000  1.562562625499e-06
108001.00000  109001.00000  1.533626280582e-06
109001.00000  110001.00000  1.466108142443e-06
110001.00000  111001.00000  1.292490072943e-06
111001.00000  112001.00000  1.369653659388e-06
112001.00000  113001.00000  1.379299107693e-06
113001.00000  114001.00000  1.340717314471e-06
114001.00000  115001.00000  1.321426417860e-06
115001.00000  116001.00000  1.369653659388e-06
116001.00000  117001.00000  1.215326486499e-06
117001.00000  118001.00000  1.234617383110e-06
118001.00000  119001.00000  1.167099244971e-06
119001.00000  120001.00000  1.089935658527e-06
120001.00000  121001.00000  1.118872003443e-06
121001.00000  122001.00000  1.224971934804e-06
122001.00000  123001.00000  1.234617383110e-06
123001.00000  124001.00000  1.176744693277e-06
124001.00000  125001.00000  1.060999313610e-06
125001.00000  126001.00000  8.487994508881e-07
126001.00000  127001.00000  1.012772072082e-06
127001.00000  128001.00000  8.680903474992e-07
128001.00000  129001.00000  1.109226555138e-06
129001.00000  130001.00000  8.873812441103e-07
130001.00000  131001.00000  9.163175890269e-07
131001.00000  132001.00000  7.812813127493e-07
132001.00000  133001.00000  9.356084856380e-07
133001.00000  134001.00000  9.356084856380e-07
134001.00000  135001.00000  7.426995195271e-07
135001.00000  136001.00000  9.838357271658e-07
136001.00000  137001.00000  8.873812441103e-07
137001.00000  138001.00000  5.787268983328e-07
138001.00000  139001.00000  8.487994508881e-07
139001.00000  140001.00000  7.137631746104e-07
140001.00000  141001.00000  7.330540712215e-07
141001.00000  142001.00000  6.173086915550e-07
142001.00000  143001.00000  6.655359330827e-07
143001.00000  144001.00000  5.883723466383e-07
144001.00000  145001.00000  4.051088288330e-07
145001.00000  146001.00000  7.137631746104e-07
146001.00000  147001.00000  6.173086915550e-07
147001.00000  148001.00000  4.919178635829e-07
148001.00000  149001.00000  5.208542084995e-07
149001.00000  150001.00000  4.629815186662e-07
150001.00000  151001.00000  3.954633805274e-07
151001.00000  152001.00000  6.076632432494e-07
152001.00000  153001.00000  4.629815186662e-07
153001.00000  154001.00000  3.665270356108e-07
154001.00000  155001.00000  4.147542771385e-07
155001.00000  156001.00000  4.533360703607e-07
156001.00000  157001.00000  4.243997254441e-07
157001.00000  158001.00000  2.797180008609e-07
158001.00000  159001.00000  3.665270356108e-07
159001.00000  160001.00000  3.279452423886e-07
160001.00000  161001.00000  3.375906906941e-07
161001.00000  162001.00000  3.086543457775e-07
162001.00000  163001.00000  3.665270356108e-07
163001.00000  164001.00000  4.436906220551e-07
164001.00000  165001.00000  2.990088974719e-07
165001.00000  166001.00000  2.893634491664e-07
166001.00000  167001.00000  3.472361389997e-07
167001.00000  168001.00000  3.472361389997e-07
168001.00000  169001.00000  2.218453110276e-07
169001.00000  170001.00000  3.858179322219e-07
170001.00000  171001.00000  3.954633805274e-07
171001.00000  172001.00000  2.507816559442e-07
172001.00000  173001.00000  2.314907593331e-07
173001.00000  174001.00000  1.929089661109e-07
174001.00000  175001.00000  2.121998627220e-07
175001.00000  176001.00000  1.639726211943e-07
176001.00000  177001.00000  1.832635178054e-07
177001.00000  178001.00000  1.832635178054e-07
178001.00000  179001.00000  1.929089661109e-07
179001.00000  180001.00000  1.736180694998e-07
180001.00000  181001.00000  1.350362762777e-07
181001.00000  182001.00000  1.446817245832e-07
182001.00000  183001.00000  6.751813813883e-08
183001.00000  184001.00000  1.060999313610e-07
184001.00000  185001.00000  5.787268983328e-08
185001.00000  186001.00000  1.350362762777e-07
186001.00000  187001.00000  1.060999313610e-07
187001.00000  188001.00000  6.751813813883e-08
188001.00000  189001.00000  6.751813813883e-08
189001.00000  190001.00000  6.751813813883e-08
190001.00000  191001.00000  9.645448305547e-09
191001.00000  192001.00000  3.858179322219e-08
192001.00000  193001.00000  2.893634491664e-08
193001.00000  194001.00000  1.929089661109e-08
194001.00000  195001.00000  9.645448305547e-09
195001.00000  196001.00000  4.822724152773e-08
196001.00000  197001.00000  1.929089661109e-08
197001.00000  198001.00000  9.645448305547e-09
198001.00000  199001.00000  9.645448305547e-09
