300.00000  350.00000  1.172067701141e-01
350.00000  400.00000  9.333745387592e-02
400.00000  450.00000  7.601303147230e-02
450.00000  500.00000  6.375473541146e-02
500.00000  550.00000  5.445029001967e-02
550.00000  600.00000  4.683326066688e-02
600.00000  650.00000  4.096783198984e-02
650.00000  700.00000  3.628875258038e-02
700.00000  750.00000  3.225559167540e-02
750.00000  800.00000  2.905237108838e-02
800.00000  850.00000  2.638667259514e-02
850.00000  900.00000  2.400912627773e-02
900.00000  950.00000  2.182936947534e-02
950.00000  1000.00000  2.000253121937e-02
1000.00000  1050.00000  1.853636796140e-02
1050.00000  1100.00000  1.712488768699e-02
1100.00000  1150.00000  1.591119692761e-02
1150.00000  1200.00000  1.488715140912e-02
1200.00000  1250.00000  1.392050363224e-02
1250.00000  1300.00000  1.313845940272e-02
1300.00000  1350.00000  1.227090029464e-02
1350.00000  1400.00000  1.151988187140e-02
1400.00000  1450.00000  1.096083562451e-02
1450.00000  1500.00000  1.035757760367e-02
1500.00000  1550.00000  9.830914542084e-03
1550.00000  1600.00000  9.315110512696e-03
1600.00000  1650.00000  8.858837249105e-03
1650.00000  1700.00000  8.414780396736e-03
1700.00000  1750.00000  8.047706326198e-03
1750.00000  1800.00000  7.718444957062e-03
1800.00000  1850.00000  7.310649515782e-03
1850.00000  1900.00000  7.034713751188e-03
1900.00000  1950.00000  6.694399438565e-03
1950.00000  2000.00000  6.432813109375e-03
2000.00000  2050.00000  6.273999763484e-03
2050.00000  2100.00000  6.031998474508e-03
2100.00000  2150.00000  5.740743718064e-03
2150.00000  2200.00000  5.568162670637e-03
2200.00000  2250.00000  5.316271905909e-03
2250.00000  2300.00000  5.148150818135e-03
2300.00000  2350.00000  5.022884125283e-03
2350.00000  2400.00000  4.764400376721e-03
2400.00000  2450.00000  4.662015216000e-03
2450.00000  2500.00000  4.475666467037e-03
2500.00000  2550.00000  4.363004007986e-03
2550.00000  2600.00000  4.219897476524e-03
2600.00000  2650.00000  4.034130461429e-03
2650.00000  2700.00000  3.973048405317e-03
2700.00000  2750.00000  3.783984898304e-03
2750.00000  2800.00000  3.717085503515e-03
2800.00000  2850.00000  3.650186108726e-03
2850.00000  2900.00000  3.549933972187e-03
2900.00000  2950.00000  3.417104739055e-03
2950.00000  3000.00000  3.366106069984e-03
3000.00000  3050.00000  3.280397280138e-03
3050.00000  3100.00000  3.196433691895e-03
3100.00000  3150.00000  3.113245748810e-03
3150.00000  3200.00000  3.000389378470e-03
3200.00000  3250.00000  2.912935387021e-03
3250.00000  3300.00000  2.838085629373e-03
3300.00000  3350.00000  2.816949298845e-03
3350.00000  3400.00000  2.737445670255e-03
3400.00000  3450.00000  2.664535025500e-03
3450.00000  3500.00000  2.612566799982e-03
3500.00000  3550.00000  2.547994340664e-03
3550.00000  3600.00000  2.446384825100e-03
3600.00000  3650.00000  2.448130026703e-03
3650.00000  3700.00000  2.376382849683e-03
3700.00000  3750.00000  2.339733616016e-03
3750.00000  3800.00000  2.280978495375e-03
3800.00000  3850.00000  2.223774665048e-03
3850.00000  3900.00000  2.184216762043e-03
3900.00000  3950.00000  2.125073818823e-03
3950.00000  4000.00000  2.097538415751e-03
4000.00000  4050.00000  2.037425916085e-03
4050.00000  4100.00000  1.990305472799e-03
4100.00000  4150.00000  1.968975230982e-03
4150.00000  4200.00000  1.918170473200e-03
4200.00000  4250.00000  1.889471602392e-03
4250.00000  4300.00000  1.867365715418e-03
4300.00000  4350.00000  1.826062610809e-03
4350.00000  4400.00000  1.787474264250e-03
4400.00000  4450.00000  1.736087772600e-03
4450.00000  4500.00000  1.740547732253e-03
4500.00000  4550.00000  1.698856805065e-03
4550.00000  4600.00000  1.673260514885e-03
4600.00000  4650.00000  1.612372370063e-03
4650.00000  4700.00000  1.612372370063e-03
4700.00000  4750.00000  1.553617249422e-03
4750.00000  4800.00000  1.552453781686e-03
4800.00000  4850.00000  1.516968015755e-03
4850.00000  4900.00000  1.493698661045e-03
4900.00000  4950.00000  1.462866766056e-03
4950.00000  5000.00000  1.475470999856e-03
5000.00000  5050.00000  1.417103701794e-03
5050.00000  5100.00000  1.395773459977e-03
5100.00000  5150.00000  1.396936927713e-03
5150.00000  5200.00000  1.365911121434e-03
5200.00000  5250.00000  1.368625879483e-03
5250.00000  5300.00000  1.303083863719e-03
5300.00000  5350.00000  1.312973339470e-03
5350.00000  5400.00000  1.255381686565e-03
5400.00000  5450.00000  1.255381686565e-03
5450.00000  5500.00000  1.231530597988e-03
5500.00000  5550.00000  1.227070638335e-03
5550.00000  5600.00000  1.221447210947e-03
5600.00000  5650.00000  1.183440598255e-03
5650.00000  5700.00000  1.165600759645e-03
5700.00000  5750.00000  1.195075275610e-03
5750.00000  5800.00000  1.115377735731e-03
5800.00000  5850.00000  1.128369792110e-03
5850.00000  5900.00000  1.106069993847e-03
5900.00000  5950.00000  1.090557090707e-03
5950.00000  6000.00000  1.082994550427e-03
6000.00000  6050.00000  1.057204348957e-03
6050.00000  6100.00000  1.060888663453e-03
6100.00000  6150.00000  1.023851607207e-03
6150.00000  6200.00000  1.015513421770e-03
6200.00000  6250.00000  9.823545913093e-04
6250.00000  6300.00000  1.002909187969e-03
6300.00000  6350.00000  9.759555187642e-04
6350.00000  6400.00000  1.065154711816e-03
6400.00000  6450.00000  9.586974140215e-04
6450.00000  6500.00000  9.544313656582e-04
6500.00000  6550.00000  9.313559222382e-04
6550.00000  6600.00000  9.253446722716e-04
6600.00000  6650.00000  9.053718094795e-04
6650.00000  6700.00000  8.960640675958e-04
6700.00000  6750.00000  8.885015273153e-04
6750.00000  6800.00000  8.615478581104e-04
6800.00000  6850.00000  8.568939871685e-04
6850.00000  6900.00000  8.619356806889e-04
6900.00000  6950.00000  8.400237050043e-04
6950.00000  7000.00000  8.442897533677e-04
7000.00000  7050.00000  8.504949146235e-04
7050.00000  7100.00000  8.109370116177e-04
7100.00000  7150.00000  8.214082212369e-04
7150.00000  7200.00000  7.816564069419e-04
7200.00000  7250.00000  7.863102778838e-04
7250.00000  7300.00000  7.704095521658e-04
7300.00000  7350.00000  7.740938666614e-04
7350.00000  7400.00000  7.706034634550e-04
7400.00000  7450.00000  7.488853990597e-04
7450.00000  7500.00000  7.614896328606e-04
7500.00000  7550.00000  7.316272943170e-04
7550.00000  7600.00000  7.356994313911e-04
7600.00000  7650.00000  7.291064475568e-04
7650.00000  7700.00000  7.337603184987e-04
7700.00000  7750.00000  6.953658832284e-04
7750.00000  7800.00000  6.920693913113e-04
7800.00000  7850.00000  6.839251171630e-04
7850.00000  7900.00000  6.837312058738e-04
7900.00000  7950.00000  6.942024154929e-04
7950.00000  8000.00000  6.686061253128e-04
8000.00000  8050.00000  6.629826979247e-04
8050.00000  8100.00000  6.585227382721e-04
8100.00000  8150.00000  6.393255206369e-04
8150.00000  8200.00000  6.465002383390e-04
8200.00000  8250.00000  6.604618511645e-04
8250.00000  8300.00000  6.298238674640e-04
8300.00000  8350.00000  6.185770126879e-04
8350.00000  8400.00000  6.160561659277e-04
8400.00000  8450.00000  6.170257223739e-04
8450.00000  8500.00000  6.121779401428e-04
8500.00000  8550.00000  5.991858837635e-04
8550.00000  8600.00000  5.891024967228e-04
8600.00000  8650.00000  5.879390289873e-04
8650.00000  8700.00000  5.799886661283e-04
8700.00000  8750.00000  5.825095128885e-04
8750.00000  8800.00000  5.627305613856e-04
8800.00000  8850.00000  5.528410856342e-04
8850.00000  8900.00000  5.454724566429e-04
8900.00000  8950.00000  5.605975372039e-04
8950.00000  9000.00000  5.474115695354e-04
9000.00000  9050.00000  5.373281824947e-04
9050.00000  9100.00000  5.313169325281e-04
9100.00000  9150.00000  5.334499567098e-04
9150.00000  9200.00000  5.350012470238e-04
9200.00000  9250.00000  5.291839083464e-04
9250.00000  9300.00000  5.274387067432e-04
9300.00000  9350.00000  5.041693520340e-04
9350.00000  9400.00000  5.256935051401e-04
9400.00000  9450.00000  5.072719326619e-04
9450.00000  9500.00000  5.076597552404e-04
9500.00000  9550.00000  4.849721343988e-04
9550.00000  9600.00000  4.801243521677e-04
9600.00000  9650.00000  4.748887473582e-04
9650.00000  9700.00000  4.694592312593e-04
9700.00000  9750.00000  4.954433440180e-04
9750.00000  9800.00000  4.721739893088e-04
9800.00000  9850.00000  4.700409651271e-04
9850.00000  9900.00000  4.768278602506e-04
9900.00000  9950.00000  4.618966909788e-04
9950.00000  10000.00000  4.541402394091e-04
