300.00000  350.00000  7.723225215974e-07
350.00000  400.00000  5.792418911980e-06
400.00000  450.00000  6.950902694376e-06
450.00000  500.00000  6.892978505257e-05
500.00000  550.00000  2.581488028439e-04
550.00000  600.00000  1.353495219099e-04
600.00000  650.00000  4.174403229234e-04
650.00000  700.00000  9.667547164095e-04
700.00000  750.00000  1.480542273902e-03
750.00000  800.00000  2.401150719646e-03
800.00000  850.00000  3.419457964372e-03
850.00000  900.00000  3.683206105498e-03
900.00000  950.00000  4.301836445297e-03
950.00000  1000.00000  5.320336770654e-03
1000.00000  1050.00000  6.314895097841e-03
1050.00000  1100.00000  7.168118403576e-03
1100.00000  1150.00000  7.815324676674e-03
1150.00000  1200.00000  8.581854779360e-03
1200.00000  1250.00000  9.107806416568e-03
1250.00000  1300.00000  9.606147523628e-03
1300.00000  1350.00000  9.258216227649e-03
1350.00000  1400.00000  9.727788320780e-03
1400.00000  1450.00000  9.828190248588e-03
1450.00000  1500.00000  1.005312918300e-02
1500.00000  1550.00000  1.016820523872e-02
1550.00000  1600.00000  1.005486690868e-02
1600.00000  1650.00000  1.005177761859e-02
1650.00000  1700.00000  9.938825449806e-03
1700.00000  1750.00000  9.862944762059e-03
1750.00000  1800.00000  9.734353062213e-03
1800.00000  1850.00000  9.553050350268e-03
1850.00000  1900.00000  9.204732893028e-03
1900.00000  1950.00000  9.115722722414e-03
1950.00000  2000.00000  8.964540588811e-03
2000.00000  2050.00000  8.838845098421e-03
2050.00000  2100.00000  8.648467596848e-03
2100.00000  2150.00000  8.436465064669e-03
2150.00000  2200.00000  8.302467107172e-03
2200.00000  2250.00000  8.011687677790e-03
2250.00000  2300.00000  7.947005666607e-03
2300.00000  2350.00000  7.814745434783e-03
2350.00000  2400.00000  7.579573226957e-03
2400.00000  2450.00000  7.407345304641e-03
2450.00000  2500.00000  7.265624121927e-03
2500.00000  2550.00000  7.008440722235e-03
2550.00000  2600.00000  6.822697155791e-03
2600.00000  2650.00000  6.745271823001e-03
2650.00000  2700.00000  6.546591854320e-03
2700.00000  2750.00000  6.400429817108e-03
2750.00000  2800.00000  6.254074699265e-03
2800.00000  2850.00000  6.124324515637e-03
2850.00000  2900.00000  6.031452732415e-03
2900.00000  2950.00000  5.892820839788e-03
2950.00000  3000.00000  5.797052847110e-03
3000.00000  3050.00000  5.522878351943e-03
3050.00000  3100.00000  5.468815775431e-03
3100.00000  3150.00000  5.368800008884e-03
3150.00000  3200.00000  5.234802051387e-03
3200.00000  3250.00000  5.100031771368e-03
3250.00000  3300.00000  4.991134295823e-03
3300.00000  3350.00000  4.903089528361e-03
3350.00000  3400.00000  4.849992355001e-03
3400.00000  3450.00000  4.740708718195e-03
3450.00000  3500.00000  4.643202999843e-03
3500.00000  3550.00000  4.540484104471e-03
3550.00000  3600.00000  4.449350046923e-03
3600.00000  3650.00000  4.361112198830e-03
3650.00000  3700.00000  4.265730367413e-03
3700.00000  3750.00000  4.215143242248e-03
3750.00000  3800.00000  4.091185477532e-03
3800.00000  3850.00000  4.012408580329e-03
3850.00000  3900.00000  4.006616161417e-03
3900.00000  3950.00000  3.906793475500e-03
3950.00000  4000.00000  3.826085771993e-03
4000.00000  4050.00000  3.789786613478e-03
4050.00000  4100.00000  3.660036429850e-03
4100.00000  4150.00000  3.614469401076e-03
4150.00000  4200.00000  3.545925777284e-03
4200.00000  4250.00000  3.456722526039e-03
4250.00000  4300.00000  3.452088590910e-03
4300.00000  4350.00000  3.337205615822e-03
4350.00000  4400.00000  3.305540392437e-03
4400.00000  4450.00000  3.252829380338e-03
4450.00000  4500.00000  3.201276852021e-03
4500.00000  4550.00000  3.111494358885e-03
4550.00000  4600.00000  3.108984310690e-03
4600.00000  4650.00000  3.069402781458e-03
4650.00000  4700.00000  3.021904946380e-03
4700.00000  4750.00000  2.956064451414e-03
4750.00000  4800.00000  2.890417037078e-03
4800.00000  4850.00000  2.917448325334e-03
4850.00000  4900.00000  2.790401270531e-03
4900.00000  4950.00000  2.795807528183e-03
4950.00000  5000.00000  2.720313001696e-03
5000.00000  5050.00000  2.694633277853e-03
5050.00000  5100.00000  2.638253733777e-03
5100.00000  5150.00000  2.608712397326e-03
5150.00000  5200.00000  2.560635320356e-03
5200.00000  5250.00000  2.531287064535e-03
5250.00000  5300.00000  2.473942117307e-03
5300.00000  5350.00000  2.456178699310e-03
5350.00000  5400.00000  2.400378397125e-03
5400.00000  5450.00000  2.360024545371e-03
5450.00000  5500.00000  2.334924063419e-03
5500.00000  5550.00000  2.377401802107e-03
5550.00000  5600.00000  2.285495422037e-03
5600.00000  5650.00000  2.255761004956e-03
5650.00000  5700.00000  2.236066780655e-03
5700.00000  5750.00000  2.191851316293e-03
5750.00000  5800.00000  2.202084589705e-03
5800.00000  5850.00000  2.097821049289e-03
5850.00000  5900.00000  2.130644756457e-03
5900.00000  5950.00000  2.108826645222e-03
5950.00000  6000.00000  2.050130133580e-03
6000.00000  6050.00000  1.991626702569e-03
6050.00000  6100.00000  1.993364428243e-03
6100.00000  6150.00000  2.013058652544e-03
6150.00000  6200.00000  1.951272850816e-03
6200.00000  6250.00000  1.913235966627e-03
6250.00000  6300.00000  1.897403354934e-03
6300.00000  6350.00000  1.907057386454e-03
6350.00000  6400.00000  2.144932723106e-03
6400.00000  6450.00000  1.840444568967e-03
6450.00000  6500.00000  1.819205699623e-03
6500.00000  6550.00000  1.806462378016e-03
6550.00000  6600.00000  1.745255818180e-03
6600.00000  6650.00000  1.772866348327e-03
6650.00000  6700.00000  1.749503592048e-03
6700.00000  6750.00000  1.684242338973e-03
6750.00000  6800.00000  1.662424227738e-03
6800.00000  6850.00000  1.680380726366e-03
6850.00000  6900.00000  1.648136261089e-03
6900.00000  6950.00000  1.658755695761e-03
6950.00000  7000.00000  1.622070375985e-03
7000.00000  7050.00000  1.586929701252e-03
7050.00000  7100.00000  1.600059184119e-03
7100.00000  7150.00000  1.511435174766e-03
7150.00000  7200.00000  1.494250998661e-03
7200.00000  7250.00000  1.489617063531e-03
7250.00000  7300.00000  1.477066822555e-03
7300.00000  7350.00000  1.484210805880e-03
7350.00000  7400.00000  1.473012129317e-03
7400.00000  7450.00000  1.441539986562e-03
7450.00000  7500.00000  1.426479697390e-03
7500.00000  7550.00000  1.407750876242e-03
7550.00000  7600.00000  1.379368023573e-03
7600.00000  7650.00000  1.380140346095e-03
7650.00000  7700.00000  1.361990766837e-03
7700.00000  7750.00000  1.343648106949e-03
7750.00000  7800.00000  1.293640223676e-03
7800.00000  7850.00000  1.321636915084e-03
7850.00000  7900.00000  1.301170368261e-03
7900.00000  7950.00000  1.284565434047e-03
7950.00000  8000.00000  1.296729513762e-03
8000.00000  8050.00000  1.238805324642e-03
8050.00000  8100.00000  1.284951595308e-03
8100.00000  8150.00000  1.271629031810e-03
8150.00000  8200.00000  1.246142388597e-03
8200.00000  8250.00000  1.222393471058e-03
8250.00000  8300.00000  1.210229391343e-03
8300.00000  8350.00000  1.196906827846e-03
8350.00000  8400.00000  1.204243891801e-03
8400.00000  8450.00000  1.214670245842e-03
8450.00000  8500.00000  1.166207007612e-03
8500.00000  8550.00000  1.173350990937e-03
8550.00000  8600.00000  1.131645574771e-03
8600.00000  8650.00000  1.114847559926e-03
8650.00000  8700.00000  1.135893348639e-03
8700.00000  8750.00000  1.111179027948e-03
8750.00000  8800.00000  1.084533900953e-03
8800.00000  8850.00000  1.098628786972e-03
8850.00000  8900.00000  1.087816271670e-03
8900.00000  8950.00000  1.083182336540e-03
8950.00000  9000.00000  1.062136547827e-03
9000.00000  9050.00000  1.031629808224e-03
9050.00000  9100.00000  1.032981372637e-03
9100.00000  9150.00000  1.061557305936e-03
9150.00000  9200.00000  1.021203454182e-03
9200.00000  9250.00000  1.012707906445e-03
9250.00000  9300.00000  1.009618616358e-03
9300.00000  9350.00000  1.007494729424e-03
9350.00000  9400.00000  9.818150055807e-04
9400.00000  9450.00000  9.740917803647e-04
9450.00000  9500.00000  9.943652465566e-04
9500.00000  9550.00000  9.704232483871e-04
9550.00000  9600.00000  9.569076042592e-04
9600.00000  9650.00000  9.735125384735e-04
9650.00000  9700.00000  9.708094096479e-04
9700.00000  9750.00000  9.385649443712e-04
9750.00000  9800.00000  9.202222844833e-04
9800.00000  9850.00000  9.337379286112e-04
9850.00000  9900.00000  9.190638007009e-04
9900.00000  9950.00000  8.910671092930e-04
9950.00000  10000.00000  8.918394318146e-04
