10001.00000  11001.00000  3.333252444388e-04
11001.00000  12001.00000  2.694004006912e-04
12001.00000  13001.00000  2.271024666974e-04
13001.00000  14001.00000  1.861985324115e-04
14001.00000  15001.00000  1.540170534407e-04
15001.00000  16001.00000  1.296419728341e-04
16001.00000  17001.00000  1.082142058956e-04
17001.00000  18001.00000  9.292003767186e-05
18001.00000  19001.00000  8.356032534743e-05
19001.00000  20001.00000  7.264729906278e-05
20001.00000  21001.00000  6.249101547670e-05
21001.00000  22001.00000  5.603878825731e-05
22001.00000  23001.00000  4.898913259168e-05
23001.00000  24001.00000  4.297501956620e-05
24001.00000  25001.00000  3.528810689124e-05
25001.00000  26001.00000  3.190267902922e-05
26001.00000  27001.00000  2.975193662275e-05
27001.00000  28001.00000  2.780033703170e-05
28001.00000  29001.00000  2.373782359727e-05
29001.00000  30001.00000  2.063119567682e-05
30001.00000  31001.00000  1.927702453201e-05
31001.00000  32001.00000  1.680765362089e-05
32001.00000  33001.00000  1.613056804848e-05
33001.00000  34001.00000  1.489588259292e-05
34001.00000  35001.00000  1.194856892480e-05
35001.00000  36001.00000  1.226719742946e-05
36001.00000  37001.00000  1.035542640149e-05
37001.00000  38001.00000  9.757997955253e-06
38001.00000  39001.00000  9.080912382848e-06
39001.00000  40001.00000  8.483483936608e-06
40001.00000  41001.00000  6.890341413301e-06
41001.00000  42001.00000  7.049655665632e-06
42001.00000  43001.00000  6.691198597888e-06
43001.00000  44001.00000  5.137884637664e-06
44001.00000  45001.00000  6.332741530144e-06
45001.00000  46001.00000  4.381141939093e-06
46001.00000  47001.00000  4.460799065259e-06
47001.00000  48001.00000  4.739599006837e-06
48001.00000  49001.00000  3.106627920448e-06
49001.00000  50001.00000  3.743884929771e-06
50001.00000  51001.00000  2.947313668117e-06
51001.00000  52001.00000  2.947313668117e-06
52001.00000  53001.00000  2.907485105035e-06
53001.00000  54001.00000  2.190570969547e-06
54001.00000  55001.00000  2.150742406464e-06
55001.00000  56001.00000  2.190570969547e-06
56001.00000  57001.00000  2.549028037291e-06
57001.00000  58001.00000  2.230399532629e-06
58001.00000  59001.00000  1.752456775637e-06
59001.00000  60001.00000  1.752456775637e-06
60001.00000  61001.00000  1.832113901803e-06
61001.00000  62001.00000  1.553313960224e-06
62001.00000  63001.00000  1.593142523307e-06
63001.00000  64001.00000  1.672799649472e-06
64001.00000  65001.00000  1.513485397141e-06
65001.00000  66001.00000  1.155028329397e-06
66001.00000  67001.00000  1.155028329397e-06
67001.00000  68001.00000  9.957140770667e-07
68001.00000  69001.00000  1.314342581728e-06
69001.00000  70001.00000  1.075371203232e-06
70001.00000  71001.00000  9.160569509013e-07
71001.00000  72001.00000  6.372570093227e-07
72001.00000  73001.00000  9.558855139840e-07
73001.00000  74001.00000  7.169141354880e-07
74001.00000  75001.00000  8.762283878187e-07
75001.00000  76001.00000  6.770855724053e-07
76001.00000  77001.00000  3.584570677440e-07
77001.00000  78001.00000  4.779427569920e-07
78001.00000  79001.00000  5.575998831573e-07
79001.00000  80001.00000  5.974284462400e-07
80001.00000  81001.00000  5.974284462400e-07
81001.00000  82001.00000  3.584570677440e-07
82001.00000  83001.00000  6.372570093227e-07
83001.00000  84001.00000  5.177713200747e-07
84001.00000  85001.00000  4.779427569920e-07
85001.00000  86001.00000  5.177713200747e-07
86001.00000  87001.00000  3.186285046613e-07
87001.00000  88001.00000  2.389713784960e-07
88001.00000  89001.00000  1.991428154133e-07
89001.00000  90001.00000  3.982856308267e-07
90001.00000  91001.00000  1.991428154133e-07
91001.00000  92001.00000  1.991428154133e-07
92001.00000  93001.00000  2.787999415787e-07
93001.00000  94001.00000  1.593142523307e-07
94001.00000  95001.00000  4.381141939093e-07
95001.00000  96001.00000  1.194856892480e-07
96001.00000  97001.00000  1.194856892480e-07
97001.00000  98001.00000  1.991428154133e-07
98001.00000  99001.00000  1.991428154133e-07
99001.00000  100001.00000  3.982856308267e-08
100001.00000  101001.00000  2.389713784960e-07
101001.00000  102001.00000  1.991428154133e-07
102001.00000  103001.00000  1.593142523307e-07
103001.00000  104001.00000  7.965712616533e-08
104001.00000  105001.00000  1.194856892480e-07
105001.00000  106001.00000  1.593142523307e-07
106001.00000  107001.00000  1.194856892480e-07
107001.00000  108001.00000  3.982856308267e-08
108001.00000  109001.00000  0.000000000000e+00
109001.00000  110001.00000  3.982856308267e-08
110001.00000  111001.00000  1.194856892480e-07
111001.00000  112001.00000  7.965712616533e-08
112001.00000  113001.00000  1.593142523307e-07
113001.00000  114001.00000  3.982856308267e-08
114001.00000  115001.00000  3.982856308267e-08
115001.00000  116001.00000  3.982856308267e-08
116001.00000  117001.00000  3.982856308267e-08
117001.00000  118001.00000  3.982856308267e-08
118001.00000  119001.00000  1.194856892480e-07
119001.00000  120001.00000  7.965712616533e-08
120001.00000  121001.00000  0.000000000000e+00
121001.00000  122001.00000  1.593142523307e-07
122001.00000  123001.00000  7.965712616533e-08
123001.00000  124001.00000  1.194856892480e-07
124001.00000  125001.00000  3.982856308267e-08
125001.00000  126001.00000  3.982856308267e-08
126001.00000  127001.00000  7.965712616533e-08
127001.00000  128001.00000  3.982856308267e-08
128001.00000  129001.00000  3.982856308267e-08
129001.00000  130001.00000  0.000000000000e+00
130001.00000  131001.00000  0.000000000000e+00
131001.00000  132001.00000  3.982856308267e-08
132001.00000  133001.00000  0.000000000000e+00
133001.00000  134001.00000  0.000000000000e+00
134001.00000  135001.00000  0.000000000000e+00
135001.00000  136001.00000  7.965712616533e-08
136001.00000  137001.00000  3.982856308267e-08
137001.00000  138001.00000  3.982856308267e-08
138001.00000  139001.00000  0.000000000000e+00
139001.00000  140001.00000  0.000000000000e+00
140001.00000  141001.00000  3.982856308267e-08
141001.00000  142001.00000  3.982856308267e-08
142001.00000  143001.00000  7.965712616533e-08
143001.00000  144001.00000  3.982856308267e-08
144001.00000  145001.00000  0.000000000000e+00
145001.00000  146001.00000  0.000000000000e+00
146001.00000  147001.00000  0.000000000000e+00
147001.00000  148001.00000  0.000000000000e+00
148001.00000  149001.00000  3.982856308267e-08
149001.00000  150001.00000  0.000000000000e+00
150001.00000  151001.00000  0.000000000000e+00
151001.00000  152001.00000  3.982856308267e-08
152001.00000  153001.00000  0.000000000000e+00
153001.00000  154001.00000  0.000000000000e+00
154001.00000  155001.00000  3.982856308267e-08
155001.00000  156001.00000  0.000000000000e+00
156001.00000  157001.00000  3.982856308267e-08
157001.00000  158001.00000  0.000000000000e+00
158001.00000  159001.00000  3.982856308267e-08
159001.00000  160001.00000  0.000000000000e+00
160001.00000  161001.00000  3.982856308267e-08
161001.00000  162001.00000  3.982856308267e-08
162001.00000  163001.00000  0.000000000000e+00
163001.00000  164001.00000  0.000000000000e+00
164001.00000  165001.00000  3.982856308267e-08
165001.00000  166001.00000  0.000000000000e+00
166001.00000  167001.00000  0.000000000000e+00
167001.00000  168001.00000  0.000000000000e+00
168001.00000  169001.00000  0.000000000000e+00
169001.00000  170001.00000  3.982856308267e-08
170001.00000  171001.00000  0.000000000000e+00
171001.00000  172001.00000  0.000000000000e+00
172001.00000  173001.00000  0.000000000000e+00
173001.00000  174001.00000  3.982856308267e-08
174001.00000  175001.00000  0.000000000000e+00
175001.00000  176001.00000  0.000000000000e+00
176001.00000  177001.00000  0.000000000000e+00
177001.00000  178001.00000  0.000000000000e+00
178001.00000  179001.00000  0.000000000000e+00
179001.00000  180001.00000  0.000000000000e+00
180001.00000  181001.00000  0.000000000000e+00
181001.00000  182001.00000  3.982856308267e-08
182001.00000  183001.00000  0.000000000000e+00
183001.00000  184001.00000  0.000000000000e+00
184001.00000  185001.00000  0.000000000000e+00
185001.00000  186001.00000  0.000000000000e+00
186001.00000  187001.00000  0.000000000000e+00
187001.00000  188001.00000  0.000000000000e+00
188001.00000  189001.00000  0.000000000000e+00
189001.00000  190001.00000  0.000000000000e+00
190001.00000  191001.00000  0.000000000000e+00
191001.00000  192001.00000  0.000000000000e+00
192001.00000  193001.00000  0.000000000000e+00
193001.00000  194001.00000  0.000000000000e+00
194001.00000  195001.00000  0.000000000000e+00
195001.00000  196001.00000  0.000000000000e+00
196001.00000  197001.00000  0.000000000000e+00
197001.00000  198001.00000  0.000000000000e+00
198001.00000  199001.00000  0.000000000000e+00
