300.00000  350.00000  1.605524634553e+00
350.00000  400.00000  1.136124491397e+00
400.00000  450.00000  8.396495588804e-01
450.00000  500.00000  6.428931036658e-01
500.00000  550.00000  5.051316350228e-01
550.00000  600.00000  4.048701578442e-01
600.00000  650.00000  3.315021745441e-01
650.00000  700.00000  2.758506872113e-01
700.00000  750.00000  2.319816971967e-01
750.00000  800.00000  1.979902049338e-01
800.00000  850.00000  1.702244612538e-01
850.00000  900.00000  1.475857164068e-01
900.00000  950.00000  1.295002205234e-01
950.00000  1000.00000  1.136849741232e-01
1000.00000  1050.00000  9.993072725394e-02
1050.00000  1100.00000  8.996022952341e-02
1100.00000  1150.00000  8.050873167474e-02
1150.00000  1200.00000  7.250098349745e-02
1200.00000  1250.00000  6.569473504668e-02
1250.00000  1300.00000  5.945023646804e-02
1300.00000  1350.00000  5.460373757119e-02
1350.00000  1400.00000  4.956223871873e-02
1400.00000  1450.00000  4.539298966773e-02
1450.00000  1500.00000  4.189949046291e-02
1500.00000  1550.00000  3.901274111999e-02
1550.00000  1600.00000  3.564299188700e-02
1600.00000  1650.00000  3.319649244387e-02
1650.00000  1700.00000  3.085799297616e-02
1700.00000  1750.00000  2.876924345159e-02
1750.00000  1800.00000  2.695799386387e-02
1800.00000  1850.00000  2.520299426334e-02
1850.00000  1900.00000  2.356049463720e-02
1900.00000  1950.00000  2.208674497265e-02
1950.00000  2000.00000  2.071124528574e-02
2000.00000  2050.00000  1.966349552423e-02
2050.00000  2100.00000  1.829849583493e-02
2100.00000  2150.00000  1.748924601913e-02
2150.00000  2200.00000  1.642274626188e-02
2200.00000  2250.00000  1.566374643465e-02
2250.00000  2300.00000  1.472849664753e-02
2300.00000  2350.00000  1.412399678512e-02
2350.00000  2400.00000  1.326824697990e-02
2400.00000  2450.00000  1.260674713047e-02
2450.00000  2500.00000  1.212974723905e-02
2500.00000  2550.00000  1.177274732031e-02
2550.00000  2600.00000  1.091324751595e-02
2600.00000  2650.00000  1.042199762776e-02
2650.00000  2700.00000  9.961497732581e-03
2700.00000  2750.00000  9.668247799330e-03
2750.00000  2800.00000  9.197247906538e-03
2800.00000  2850.00000  8.744998009479e-03
2850.00000  2900.00000  8.460748074179e-03
2900.00000  2950.00000  8.124748150659e-03
2950.00000  3000.00000  7.693498248819e-03
3000.00000  3050.00000  7.359748324787e-03
3050.00000  3100.00000  7.100248383854e-03
3100.00000  3150.00000  6.873748435409e-03
3150.00000  3200.00000  6.580498502158e-03
3200.00000  3250.00000  6.393748544666e-03
3250.00000  3300.00000  6.200998588540e-03
3300.00000  3350.00000  5.851498668092e-03
3350.00000  3400.00000  5.784748683286e-03
3400.00000  3450.00000  5.489248750547e-03
3450.00000  3500.00000  5.179498821052e-03
3500.00000  3550.00000  5.054998849390e-03
3550.00000  3600.00000  4.910998882167e-03
3600.00000  3650.00000  4.920748879948e-03
3650.00000  3700.00000  4.679998934747e-03
3700.00000  3750.00000  4.553248963597e-03
3750.00000  3800.00000  4.355999008495e-03
3800.00000  3850.00000  4.229249037346e-03
3850.00000  3900.00000  4.141499057319e-03
3900.00000  3950.00000  3.968999096583e-03
3950.00000  4000.00000  3.846749124410e-03
4000.00000  4050.00000  3.764249143188e-03
4050.00000  4100.00000  3.631499173404e-03
4100.00000  4150.00000  3.590249182794e-03
4150.00000  4200.00000  3.360749235032e-03
4200.00000  4250.00000  3.266999256371e-03
4250.00000  4300.00000  3.197249272248e-03
4300.00000  4350.00000  3.092999295977e-03
4350.00000  4400.00000  3.082499298367e-03
4400.00000  4450.00000  2.918999335582e-03
4450.00000  4500.00000  2.932499332510e-03
4500.00000  4550.00000  2.763749370920e-03
4550.00000  4600.00000  2.675999390894e-03
4600.00000  4650.00000  2.661749394137e-03
4650.00000  4700.00000  2.538749422134e-03
4700.00000  4750.00000  2.548499419915e-03
4750.00000  4800.00000  2.471249437499e-03
4800.00000  4850.00000  2.445749443303e-03
4850.00000  4900.00000  2.345999466008e-03
4900.00000  4950.00000  2.313749473348e-03
4950.00000  5000.00000  2.308499474543e-03
5000.00000  5050.00000  2.262749484957e-03
5050.00000  5100.00000  2.224499493663e-03
5100.00000  5150.00000  2.044499534635e-03
5150.00000  5200.00000  2.020499540097e-03
5200.00000  5250.00000  2.019749540268e-03
5250.00000  5300.00000  1.922999562290e-03
5300.00000  5350.00000  1.875749573045e-03
5350.00000  5400.00000  1.907999565704e-03
5400.00000  5450.00000  1.833749582605e-03
5450.00000  5500.00000  1.754999600530e-03
5500.00000  5550.00000  1.694999614187e-03
5550.00000  5600.00000  1.641749626308e-03
5600.00000  5650.00000  1.726499607017e-03
5650.00000  5700.00000  1.710749610602e-03
5700.00000  5750.00000  1.562249644403e-03
5750.00000  5800.00000  1.502999657890e-03
5800.00000  5850.00000  1.487999661304e-03
5850.00000  5900.00000  1.462499667108e-03
5900.00000  5950.00000  1.406249679912e-03
5950.00000  6000.00000  1.370999687935e-03
6000.00000  6050.00000  1.394999682473e-03
6050.00000  6100.00000  1.373249687423e-03
6100.00000  6150.00000  1.322249699032e-03
6150.00000  6200.00000  1.302749703470e-03
6200.00000  6250.00000  1.337249695618e-03
6250.00000  6300.00000  1.345499693740e-03
6300.00000  6350.00000  1.271999710470e-03
6350.00000  6400.00000  1.390499683497e-03
6400.00000  6450.00000  1.192499728565e-03
6450.00000  6500.00000  1.166999734370e-03
6500.00000  6550.00000  1.166999734370e-03
6550.00000  6600.00000  1.090499751782e-03
6600.00000  6650.00000  1.103999748710e-03
6650.00000  6700.00000  1.159499736077e-03
6700.00000  6750.00000  1.079249754343e-03
6750.00000  6800.00000  1.074749755367e-03
6800.00000  6850.00000  9.907497744873e-04
6850.00000  6900.00000  1.016249768683e-03
6900.00000  6950.00000  1.043999762367e-03
6950.00000  7000.00000  9.434997852422e-04
7000.00000  7050.00000  9.787497772187e-04
7050.00000  7100.00000  9.359997869494e-04
7100.00000  7150.00000  9.052497939486e-04
7150.00000  7200.00000  8.827497990700e-04
7200.00000  7250.00000  8.977497956558e-04
7250.00000  7300.00000  8.819997992407e-04
7300.00000  7350.00000  8.707498018014e-04
7350.00000  7400.00000  8.714998016307e-04
7400.00000  7450.00000  8.594998043622e-04
7450.00000  7500.00000  8.662498028257e-04
7500.00000  7550.00000  7.897498202385e-04
7550.00000  7600.00000  7.582498274085e-04
7600.00000  7650.00000  7.979998183607e-04
7650.00000  7700.00000  7.657498257014e-04
7700.00000  7750.00000  7.364998323592e-04
7750.00000  7800.00000  7.627498263842e-04
7800.00000  7850.00000  7.312498335542e-04
7850.00000  7900.00000  6.794998453334e-04
7900.00000  7950.00000  6.959998415777e-04
7950.00000  8000.00000  6.877498434556e-04
8000.00000  8050.00000  7.079998388463e-04
8050.00000  8100.00000  6.892498431142e-04
8100.00000  8150.00000  7.289998340663e-04
8150.00000  8200.00000  6.734998466991e-04
8200.00000  8250.00000  6.599998497720e-04
8250.00000  8300.00000  6.359998552348e-04
8300.00000  8350.00000  6.254998576248e-04
8350.00000  8400.00000  6.359998552348e-04
8400.00000  8450.00000  6.494998521620e-04
8450.00000  8500.00000  6.007498632584e-04
8500.00000  8550.00000  6.179998593319e-04
8550.00000  8600.00000  5.947498646241e-04
8600.00000  8650.00000  5.752498690626e-04
8650.00000  8700.00000  5.902498656484e-04
8700.00000  8750.00000  5.317498789640e-04
8750.00000  8800.00000  5.639998716233e-04
8800.00000  8850.00000  5.009998859633e-04
8850.00000  8900.00000  5.392498772569e-04
8900.00000  8950.00000  5.399998770862e-04
8950.00000  9000.00000  4.889998886947e-04
9000.00000  9050.00000  5.062498847683e-04
9050.00000  9100.00000  5.294998794762e-04
9100.00000  9150.00000  4.912498881826e-04
9150.00000  9200.00000  4.972498868168e-04
9200.00000  9250.00000  4.642498943282e-04
9250.00000  9300.00000  5.137498830611e-04
9300.00000  9350.00000  5.084998842561e-04
9350.00000  9400.00000  4.664998938161e-04
9400.00000  9450.00000  4.732498922797e-04
9450.00000  9500.00000  4.784998910847e-04
9500.00000  9550.00000  4.514998972304e-04
9550.00000  9600.00000  4.529998968890e-04
9600.00000  9650.00000  4.462498984254e-04
9650.00000  9700.00000  4.627498946697e-04
9700.00000  9750.00000  4.012499086682e-04
9750.00000  9800.00000  4.379999003032e-04
9800.00000  9850.00000  4.552498963768e-04
9850.00000  9900.00000  3.982499093510e-04
9900.00000  9950.00000  4.034999081561e-04
9950.00000  10000.00000  3.959999098632e-04
