300.00000  350.00000  2.060835629036e+00
350.00000  400.00000  1.456797883218e+00
400.00000  450.00000  1.078587708965e+00
450.00000  500.00000  8.234006778798e-01
500.00000  550.00000  6.479701000752e-01
550.00000  600.00000  5.206683263245e-01
600.00000  650.00000  4.255328595009e-01
650.00000  700.00000  3.544808457049e-01
700.00000  750.00000  2.979075922908e-01
750.00000  800.00000  2.536315729266e-01
800.00000  850.00000  2.187286458097e-01
850.00000  900.00000  1.893191307201e-01
900.00000  950.00000  1.653148700868e-01
950.00000  1000.00000  1.462048488376e-01
1000.00000  1050.00000  1.287772924170e-01
1050.00000  1100.00000  1.151322934688e-01
1100.00000  1150.00000  1.034304965718e-01
1150.00000  1200.00000  9.319450606650e-02
1200.00000  1250.00000  8.335522463045e-02
1250.00000  1300.00000  7.646025664463e-02
1300.00000  1350.00000  6.976028125218e-02
1350.00000  1400.00000  6.374165928948e-02
1400.00000  1450.00000  5.842755079634e-02
1450.00000  1500.00000  5.363790514057e-02
1500.00000  1550.00000  4.967903252632e-02
1550.00000  1600.00000  4.599658619388e-02
1600.00000  1650.00000  4.243666394309e-02
1650.00000  1700.00000  3.941988198115e-02
1700.00000  1750.00000  3.676469547973e-02
1750.00000  1800.00000  3.448006961554e-02
1800.00000  1850.00000  3.229779618541e-02
1850.00000  1900.00000  3.030603276032e-02
1900.00000  1950.00000  2.815663164479e-02
1950.00000  2000.00000  2.679616607949e-02
2000.00000  2050.00000  2.521904207709e-02
2050.00000  2100.00000  2.382570419720e-02
2100.00000  2150.00000  2.238081655124e-02
2150.00000  2200.00000  2.102259228011e-02
2200.00000  2250.00000  2.005211190156e-02
2250.00000  2300.00000  1.904352952201e-02
2300.00000  2350.00000  1.810517436000e-02
2350.00000  2400.00000  1.677085722676e-02
2400.00000  2450.00000  1.620380980004e-02
2450.00000  2500.00000  1.544924076052e-02
2500.00000  2550.00000  1.481047192014e-02
2550.00000  2600.00000  1.406038546898e-02
2600.00000  2650.00000  1.328788607605e-02
2650.00000  2700.00000  1.256021256666e-02
2700.00000  2750.00000  1.228303918680e-02
2750.00000  2800.00000  1.174662278049e-02
2800.00000  2850.00000  1.127296261113e-02
2850.00000  2900.00000  1.074252298929e-02
2900.00000  2950.00000  1.040259337248e-02
2950.00000  3000.00000  9.900543476883e-03
3000.00000  3050.00000  9.504581505652e-03
3050.00000  3100.00000  9.028680042116e-03
3100.00000  3150.00000  8.747771171960e-03
3150.00000  3200.00000  8.523641754283e-03
3200.00000  3250.00000  8.138886253936e-03
3250.00000  3300.00000  7.806427617714e-03
3300.00000  3350.00000  7.589022082567e-03
3350.00000  3400.00000  7.411959842601e-03
3400.00000  3450.00000  6.954735830539e-03
3450.00000  3500.00000  6.809051709048e-03
3500.00000  3550.00000  6.552049976778e-03
3550.00000  3600.00000  6.426537502878e-03
3600.00000  3650.00000  6.125456985131e-03
3650.00000  3700.00000  5.911039842220e-03
3700.00000  3750.00000  5.602488343883e-03
3750.00000  3800.00000  5.512836576812e-03
3800.00000  3850.00000  5.387324102913e-03
3850.00000  3900.00000  5.236410295010e-03
3900.00000  3950.00000  5.133310762878e-03
3950.00000  4000.00000  4.819529578129e-03
4000.00000  4050.00000  4.787404361596e-03
4050.00000  4100.00000  4.593158866275e-03
4100.00000  4150.00000  4.395177880660e-03
4150.00000  4200.00000  4.393683684542e-03
4200.00000  4250.00000  4.310008701942e-03
4250.00000  4300.00000  4.173289757159e-03
4300.00000  4350.00000  4.106050931855e-03
4350.00000  4400.00000  3.862496964646e-03
4400.00000  4450.00000  3.863991160763e-03
4450.00000  4500.00000  3.651068213970e-03
4500.00000  4550.00000  3.519578955599e-03
4550.00000  4600.00000  3.551704172133e-03
4600.00000  4650.00000  3.465040797297e-03
4650.00000  4700.00000  3.279013380625e-03
4700.00000  4750.00000  3.234934595148e-03
4750.00000  4800.00000  3.190855809671e-03
4800.00000  4850.00000  3.033965217297e-03
4850.00000  4900.00000  3.033965217297e-03
4900.00000  4950.00000  2.924141802635e-03
4950.00000  5000.00000  2.904717253103e-03
5000.00000  5050.00000  2.735125993727e-03
5050.00000  5100.00000  2.856902977332e-03
5100.00000  5150.00000  2.676105247072e-03
5150.00000  5200.00000  2.655933599481e-03
5200.00000  5250.00000  2.520708850815e-03
5250.00000  5300.00000  2.481112653692e-03
5300.00000  5350.00000  2.478871359515e-03
5350.00000  5400.00000  2.360082768146e-03
5400.00000  5450.00000  2.339911120555e-03
5450.00000  5500.00000  2.251006451543e-03
5500.00000  5550.00000  2.265201314663e-03
5550.00000  5600.00000  2.233823196188e-03
5600.00000  5650.00000  2.067967427106e-03
5650.00000  5700.00000  2.144171429117e-03
5700.00000  5750.00000  2.041818995044e-03
5750.00000  5800.00000  1.979809856153e-03
5800.00000  5850.00000  2.020900249394e-03
5850.00000  5900.00000  1.923030403675e-03
5900.00000  5950.00000  1.926018795910e-03
5950.00000  6000.00000  1.856538676430e-03
6000.00000  6050.00000  1.793035341422e-03
6050.00000  6100.00000  1.784070164714e-03
6100.00000  6150.00000  1.760163026829e-03
6150.00000  6200.00000  1.683959024818e-03
6200.00000  6250.00000  1.696659691820e-03
6250.00000  6300.00000  1.636144749047e-03
6300.00000  6350.00000  1.549481374212e-03
6350.00000  6400.00000  1.937972364853e-03
6400.00000  6450.00000  1.557699452860e-03
6450.00000  6500.00000  1.510632275148e-03
6500.00000  6550.00000  1.429198586725e-03
6550.00000  6600.00000  1.446381842080e-03
6600.00000  6650.00000  1.420233410018e-03
6650.00000  6700.00000  1.453105724610e-03
6700.00000  6750.00000  1.439657959550e-03
6750.00000  6800.00000  1.358971369186e-03
6800.00000  6850.00000  1.385866899307e-03
6850.00000  6900.00000  1.299950622531e-03
6900.00000  6950.00000  1.287249955529e-03
6950.00000  7000.00000  1.280526072999e-03
7000.00000  7050.00000  1.223746620520e-03
7050.00000  7100.00000  1.258860229290e-03
7100.00000  7150.00000  1.255871837054e-03
7150.00000  7200.00000  1.129612265096e-03
7200.00000  7250.00000  1.172196854454e-03
7250.00000  7300.00000  1.143807128215e-03
7300.00000  7350.00000  1.113176107799e-03
7350.00000  7400.00000  1.107199323328e-03
7400.00000  7450.00000  1.099728342739e-03
7450.00000  7500.00000  1.077315400971e-03
7500.00000  7550.00000  1.051914066967e-03
7550.00000  7600.00000  1.050419870849e-03
7600.00000  7650.00000  1.022030144610e-03
7650.00000  7700.00000  9.973759086657e-04
7700.00000  7750.00000  9.779513591337e-04
7750.00000  7800.00000  9.682390843676e-04
7800.00000  7850.00000  9.420906523052e-04
7850.00000  7900.00000  9.144480241250e-04
7900.00000  7950.00000  9.458261425999e-04
7950.00000  8000.00000  9.271486911267e-04
8000.00000  8050.00000  9.077241415947e-04
8050.00000  8100.00000  8.696221405894e-04
8100.00000  8150.00000  8.374969240556e-04
8150.00000  8200.00000  9.099654357714e-04
8200.00000  8250.00000  8.643924541770e-04
8250.00000  8300.00000  8.023833152861e-04
8300.00000  8350.00000  8.315201395842e-04
8350.00000  8400.00000  7.829587657541e-04
8400.00000  8450.00000  7.814645696362e-04
8450.00000  8500.00000  8.210607667593e-04
8500.00000  8550.00000  7.672697065166e-04
8550.00000  8600.00000  7.411212744542e-04
8600.00000  8650.00000  7.612929220452e-04
8650.00000  8700.00000  7.493393531024e-04
8700.00000  8750.00000  7.164670385097e-04
8750.00000  8800.00000  7.127315482151e-04
8800.00000  8850.00000  6.910657045062e-04
8850.00000  8900.00000  6.708940569152e-04
8900.00000  8950.00000  6.821005277991e-04
8950.00000  9000.00000  6.701469588563e-04
9000.00000  9050.00000  6.574462918546e-04
9050.00000  9100.00000  6.559520957367e-04
9100.00000  9150.00000  6.671585666206e-04
9150.00000  9200.00000  6.365275462046e-04
9200.00000  9250.00000  6.559520957367e-04
9250.00000  9300.00000  6.671585666206e-04
9300.00000  9350.00000  6.245739772618e-04
9350.00000  9400.00000  6.604346840903e-04
9400.00000  9450.00000  6.238268792029e-04
9450.00000  9500.00000  6.088849180244e-04
9500.00000  9550.00000  6.103791141422e-04
9550.00000  9600.00000  5.872190743156e-04
9600.00000  9650.00000  5.976784471405e-04
9650.00000  9700.00000  5.648061325478e-04
9700.00000  9750.00000  5.461286810746e-04
9750.00000  9800.00000  5.573351519585e-04
9800.00000  9850.00000  5.416460927211e-04
9850.00000  9900.00000  5.438873868979e-04
9900.00000  9950.00000  5.095208761873e-04
9950.00000  10000.00000  5.416460927211e-04
