10001.00000  11001.00000  5.782573517757e-04
11001.00000  12001.00000  5.021767174931e-04
12001.00000  13001.00000  4.388455672860e-04
13001.00000  14001.00000  3.870150906415e-04
14001.00000  15001.00000  3.453783928365e-04
15001.00000  16001.00000  3.066265441238e-04
16001.00000  17001.00000  2.747092707773e-04
17001.00000  18001.00000  2.515530324258e-04
18001.00000  19001.00000  2.285129624942e-04
19001.00000  20001.00000  2.124236363487e-04
20001.00000  21001.00000  1.932171242712e-04
21001.00000  22001.00000  1.780184226776e-04
22001.00000  23001.00000  1.640298087906e-04
23001.00000  24001.00000  1.527711527694e-04
24001.00000  25001.00000  1.412898406102e-04
25001.00000  26001.00000  1.331096477143e-04
26001.00000  27001.00000  1.229739530847e-04
27001.00000  28001.00000  1.189177390925e-04
28001.00000  29001.00000  1.090821462141e-04
29001.00000  30001.00000  1.036512725874e-04
30001.00000  31001.00000  9.721360598885e-05
31001.00000  32001.00000  8.896564818139e-05
32001.00000  33001.00000  8.545155348173e-05
33001.00000  34001.00000  7.950760266744e-05
34001.00000  35001.00000  7.567404481327e-05
35001.00000  36001.00000  7.385407290270e-05
36001.00000  37001.00000  7.012700276670e-05
37001.00000  38001.00000  6.658386596209e-05
38001.00000  39001.00000  6.148213619151e-05
39001.00000  40001.00000  6.105618531883e-05
40001.00000  41001.00000  5.699997132666e-05
41001.00000  42001.00000  5.368917136170e-05
42001.00000  43001.00000  5.120123103714e-05
43001.00000  44001.00000  4.973944508770e-05
44001.00000  45001.00000  4.736767318297e-05
45001.00000  46001.00000  4.531536443276e-05
46001.00000  47001.00000  4.353411532880e-05
47001.00000  48001.00000  4.136563815877e-05
48001.00000  49001.00000  3.977800308785e-05
49001.00000  50001.00000  3.762888732112e-05
50001.00000  51001.00000  3.749335749799e-05
51001.00000  52001.00000  3.528615752134e-05
52001.00000  53001.00000  3.315640315792e-05
53001.00000  54001.00000  3.237226632411e-05
54001.00000  55001.00000  3.164621370021e-05
55001.00000  56001.00000  3.077495055154e-05
56001.00000  57001.00000  2.934220670705e-05
57001.00000  58001.00000  2.869359969637e-05
58001.00000  59001.00000  2.780297514439e-05
59001.00000  60001.00000  2.664129094616e-05
60001.00000  61001.00000  2.580875060409e-05
61001.00000  62001.00000  2.474387342238e-05
62001.00000  63001.00000  2.355314711919e-05
63001.00000  64001.00000  2.288517870520e-05
64001.00000  65001.00000  2.260443835730e-05
65001.00000  66001.00000  2.221721029122e-05
66001.00000  67001.00000  2.211072257305e-05
67001.00000  68001.00000  2.058117171204e-05
68001.00000  69001.00000  1.950661382867e-05
69001.00000  70001.00000  1.910002435929e-05
70001.00000  71001.00000  1.940980681215e-05
71001.00000  72001.00000  1.834492963044e-05
72001.00000  73001.00000  1.772536472471e-05
73001.00000  74001.00000  1.763823840985e-05
74001.00000  75001.00000  1.674761385787e-05
75001.00000  76001.00000  1.603124193562e-05
76001.00000  77001.00000  1.533423141668e-05
77001.00000  78001.00000  1.473402791426e-05
78001.00000  79001.00000  1.491796124565e-05
79001.00000  80001.00000  1.402733669367e-05
80001.00000  81001.00000  1.443392616305e-05
81001.00000  82001.00000  1.315607354500e-05
82001.00000  83001.00000  1.342713319125e-05
83001.00000  84001.00000  1.266235776075e-05
84001.00000  85001.00000  1.257523144588e-05
85001.00000  86001.00000  1.257523144588e-05
86001.00000  87001.00000  1.186854022529e-05
87001.00000  88001.00000  1.160716128068e-05
88001.00000  89001.00000  1.125865602121e-05
89001.00000  90001.00000  1.081334374522e-05
90001.00000  91001.00000  1.067781392210e-05
91001.00000  92001.00000  1.007761041968e-05
92001.00000  93001.00000  1.033898936428e-05
93001.00000  94001.00000  9.332196392476e-06
94001.00000  95001.00000  1.000984550811e-05
95001.00000  96001.00000  9.496768320559e-06
96001.00000  97001.00000  8.828799906575e-06
97001.00000  98001.00000  9.487087618908e-06
98001.00000  99001.00000  9.177305166045e-06
99001.00000  100001.00000  8.393168332238e-06
100001.00000  101001.00000  8.276999912414e-06
101001.00000  102001.00000  8.093066581027e-06
102001.00000  103001.00000  7.696157813297e-06
103001.00000  104001.00000  7.105635012529e-06
104001.00000  105001.00000  7.483182376955e-06
105001.00000  106001.00000  6.902340277838e-06
106001.00000  107001.00000  7.154038520788e-06
107001.00000  108001.00000  7.163719222440e-06
108001.00000  109001.00000  6.069799935770e-06
109001.00000  110001.00000  7.212122730700e-06
110001.00000  111001.00000  6.660322736539e-06
111001.00000  112001.00000  6.253733267157e-06
112001.00000  113001.00000  5.934270112643e-06
113001.00000  114001.00000  5.760017482908e-06
114001.00000  115001.00000  6.350540283677e-06
115001.00000  116001.00000  6.195649057246e-06
116001.00000  117001.00000  6.002035024207e-06
117001.00000  118001.00000  5.885866604383e-06
118001.00000  119001.00000  5.972992919251e-06
119001.00000  120001.00000  5.479277135002e-06
120001.00000  121001.00000  5.043645560664e-06
121001.00000  122001.00000  5.682571869693e-06
122001.00000  123001.00000  5.256620997007e-06
123001.00000  124001.00000  4.966199947449e-06
124001.00000  125001.00000  4.617694687978e-06
125001.00000  126001.00000  4.201424516945e-06
126001.00000  127001.00000  4.704821002846e-06
127001.00000  128001.00000  4.714501704498e-06
128001.00000  129001.00000  4.627375389630e-06
129001.00000  130001.00000  4.414399953288e-06
130001.00000  131001.00000  4.627375389630e-06
131001.00000  132001.00000  4.482164864851e-06
132001.00000  133001.00000  4.104617500425e-06
133001.00000  134001.00000  4.046533290514e-06
134001.00000  135001.00000  3.736750837651e-06
135001.00000  136001.00000  3.949726273994e-06
136001.00000  137001.00000  3.775473644259e-06
137001.00000  138001.00000  3.920684169038e-06
138001.00000  139001.00000  3.765792942607e-06
139001.00000  140001.00000  3.659305224436e-06
140001.00000  141001.00000  3.794835047563e-06
141001.00000  142001.00000  3.678666627740e-06
142001.00000  143001.00000  3.359203473225e-06
143001.00000  144001.00000  3.407606981485e-06
144001.00000  145001.00000  3.475371893049e-06
145001.00000  146001.00000  2.981656108800e-06
146001.00000  147001.00000  3.359203473225e-06
147001.00000  148001.00000  3.659305224436e-06
148001.00000  149001.00000  3.252715755054e-06
149001.00000  150001.00000  3.339842069922e-06
150001.00000  151001.00000  2.846126285672e-06
151001.00000  152001.00000  3.078463125319e-06
152001.00000  153001.00000  2.817084180716e-06
153001.00000  154001.00000  2.807403479064e-06
154001.00000  155001.00000  2.642831550981e-06
155001.00000  156001.00000  2.817084180716e-06
156001.00000  157001.00000  2.865487688976e-06
157001.00000  158001.00000  2.400814009683e-06
158001.00000  159001.00000  2.236242081600e-06
159001.00000  160001.00000  2.352410501423e-06
160001.00000  161001.00000  2.507301727854e-06
161001.00000  162001.00000  2.255603484904e-06
162001.00000  163001.00000  2.487940324550e-06
163001.00000  164001.00000  2.449217517942e-06
164001.00000  165001.00000  2.429856114639e-06
165001.00000  166001.00000  2.323368396467e-06
166001.00000  167001.00000  2.526663131158e-06
167001.00000  168001.00000  2.149115766732e-06
168001.00000  169001.00000  2.149115766732e-06
169001.00000  170001.00000  1.945821032041e-06
170001.00000  171001.00000  1.955501733693e-06
171001.00000  172001.00000  1.955501733693e-06
172001.00000  173001.00000  1.916778927085e-06
173001.00000  174001.00000  2.091031556820e-06
174001.00000  175001.00000  1.636038579179e-06
175001.00000  176001.00000  1.810291208914e-06
176001.00000  177001.00000  2.023266645257e-06
177001.00000  178001.00000  1.868375418826e-06
178001.00000  179001.00000  1.984543838649e-06
179001.00000  180001.00000  1.597315772571e-06
180001.00000  181001.00000  1.936140330389e-06
181001.00000  182001.00000  1.839333313870e-06
182001.00000  183001.00000  1.732845595698e-06
183001.00000  184001.00000  1.752206999002e-06
184001.00000  185001.00000  1.752206999002e-06
185001.00000  186001.00000  1.394021037880e-06
186001.00000  187001.00000  1.423063142836e-06
187001.00000  188001.00000  1.694122789091e-06
188001.00000  189001.00000  1.568273667615e-06
189001.00000  190001.00000  1.587635070919e-06
190001.00000  191001.00000  1.665080684135e-06
191001.00000  192001.00000  1.548912264311e-06
192001.00000  193001.00000  1.471466651096e-06
193001.00000  194001.00000  1.384340336228e-06
194001.00000  195001.00000  1.287533319709e-06
195001.00000  196001.00000  1.423063142836e-06
196001.00000  197001.00000  1.355298231273e-06
197001.00000  198001.00000  1.326256126317e-06
198001.00000  199001.00000  1.239129811449e-06
