10001.00000  11001.00000  1.502283979545e-04
11001.00000  12001.00000  1.338599891849e-04
12001.00000  13001.00000  1.160620250642e-04
13001.00000  14001.00000  9.858571089749e-05
14001.00000  15001.00000  8.705992087957e-05
15001.00000  16001.00000  7.558773918731e-05
16001.00000  17001.00000  6.747501257004e-05
17001.00000  18001.00000  5.995197753509e-05
18001.00000  19001.00000  5.153547040572e-05
19001.00000  20001.00000  4.744336821331e-05
20001.00000  21001.00000  4.227909950761e-05
21001.00000  22001.00000  3.647153089392e-05
22001.00000  23001.00000  3.312994526082e-05
23001.00000  24001.00000  2.925227637107e-05
24001.00000  25001.00000  2.734024608903e-05
25001.00000  26001.00000  2.598216850552e-05
26001.00000  27001.00000  2.353405496683e-05
27001.00000  28001.00000  1.956703886764e-05
28001.00000  29001.00000  1.978147217030e-05
29001.00000  30001.00000  1.831617793546e-05
30001.00000  31001.00000  1.597528104810e-05
31001.00000  32001.00000  1.497459230236e-05
32001.00000  33001.00000  1.445637848760e-05
33001.00000  34001.00000  1.261582597311e-05
34001.00000  35001.00000  1.313403978787e-05
35001.00000  36001.00000  1.231204546101e-05
36001.00000  37001.00000  1.191891773946e-05
37001.00000  38001.00000  9.720976387210e-06
38001.00000  39001.00000  9.971148573645e-06
39001.00000  40001.00000  9.363587549445e-06
40001.00000  41001.00000  9.149154246786e-06
41001.00000  42001.00000  8.523723780697e-06
42001.00000  43001.00000  7.826815547055e-06
43001.00000  44001.00000  6.808257359424e-06
44001.00000  45001.00000  7.433687825513e-06
45001.00000  46001.00000  6.933343452642e-06
46001.00000  47001.00000  6.004132474453e-06
47001.00000  48001.00000  5.771829729906e-06
48001.00000  49001.00000  5.217877031370e-06
49001.00000  50001.00000  4.967704844934e-06
50001.00000  51001.00000  5.200007589482e-06
51001.00000  52001.00000  4.699663216611e-06
52001.00000  53001.00000  4.485229913952e-06
53001.00000  54001.00000  4.181449401851e-06
54001.00000  55001.00000  4.002754982969e-06
55001.00000  56001.00000  4.038493866745e-06
56001.00000  57001.00000  3.145021772333e-06
57001.00000  58001.00000  3.770452238421e-06
58001.00000  59001.00000  3.502410610098e-06
59001.00000  60001.00000  3.663235587092e-06
60001.00000  61001.00000  3.270107865550e-06
61001.00000  62001.00000  2.823371818344e-06
62001.00000  63001.00000  2.805502376456e-06
63001.00000  64001.00000  2.841241260232e-06
64001.00000  65001.00000  2.430244096802e-06
65001.00000  66001.00000  2.644677399461e-06
66001.00000  67001.00000  2.465982980579e-06
67001.00000  68001.00000  2.001377491484e-06
68001.00000  69001.00000  2.180071910367e-06
69001.00000  70001.00000  2.019246933373e-06
70001.00000  71001.00000  1.751205305049e-06
71001.00000  72001.00000  2.233680236032e-06
72001.00000  73001.00000  1.518902560502e-06
73001.00000  74001.00000  1.840552514490e-06
74001.00000  75001.00000  1.715466421272e-06
75001.00000  76001.00000  1.679727537496e-06
76001.00000  77001.00000  1.447424792948e-06
77001.00000  78001.00000  1.554641444278e-06
78001.00000  79001.00000  1.518902560502e-06
79001.00000  80001.00000  1.769074746937e-06
80001.00000  81001.00000  1.429555351060e-06
81001.00000  82001.00000  1.393816467284e-06
82001.00000  83001.00000  1.322338699731e-06
83001.00000  84001.00000  9.828193038539e-07
84001.00000  85001.00000  1.322338699731e-06
85001.00000  86001.00000  1.197252606513e-06
86001.00000  87001.00000  1.090035955183e-06
87001.00000  88001.00000  1.358077583507e-06
88001.00000  89001.00000  1.161513722736e-06
89001.00000  90001.00000  1.286599815954e-06
90001.00000  91001.00000  1.054297071407e-06
91001.00000  92001.00000  1.036427629519e-06
92001.00000  93001.00000  7.683860011949e-07
93001.00000  94001.00000  8.934720944126e-07
94001.00000  95001.00000  7.505165593066e-07
95001.00000  96001.00000  8.041248849714e-07
96001.00000  97001.00000  1.036427629519e-06
97001.00000  98001.00000  1.054297071407e-06
98001.00000  99001.00000  6.790387917536e-07
99001.00000  100001.00000  5.718221404241e-07
100001.00000  101001.00000  7.147776755301e-07
101001.00000  102001.00000  4.467360472063e-07
102001.00000  103001.00000  8.041248849714e-07
103001.00000  104001.00000  6.075610242006e-07
104001.00000  105001.00000  8.219943268596e-07
105001.00000  106001.00000  7.505165593066e-07
106001.00000  107001.00000  5.360832566476e-07
107001.00000  108001.00000  6.790387917536e-07
108001.00000  109001.00000  5.360832566476e-07
109001.00000  110001.00000  4.467360472063e-07
110001.00000  111001.00000  5.360832566476e-07
111001.00000  112001.00000  5.718221404241e-07
112001.00000  113001.00000  6.611693498654e-07
113001.00000  114001.00000  4.109971634298e-07
114001.00000  115001.00000  6.432999079771e-07
115001.00000  116001.00000  5.539526985358e-07
116001.00000  117001.00000  3.752582796533e-07
117001.00000  118001.00000  5.360832566476e-07
118001.00000  119001.00000  4.646054890946e-07
119001.00000  120001.00000  3.573888377651e-07
120001.00000  121001.00000  4.824749309828e-07
121001.00000  122001.00000  2.144333026590e-07
122001.00000  123001.00000  4.288666053181e-07
123001.00000  124001.00000  3.216499539886e-07
124001.00000  125001.00000  4.288666053181e-07
125001.00000  126001.00000  3.752582796533e-07
126001.00000  127001.00000  4.646054890946e-07
127001.00000  128001.00000  3.216499539886e-07
128001.00000  129001.00000  4.109971634298e-07
129001.00000  130001.00000  3.037805121003e-07
130001.00000  131001.00000  1.965638607708e-07
131001.00000  132001.00000  3.573888377651e-07
132001.00000  133001.00000  3.037805121003e-07
133001.00000  134001.00000  3.752582796533e-07
134001.00000  135001.00000  3.931277215416e-07
135001.00000  136001.00000  3.573888377651e-07
136001.00000  137001.00000  2.144333026590e-07
137001.00000  138001.00000  3.395193958768e-07
138001.00000  139001.00000  3.573888377651e-07
139001.00000  140001.00000  2.859110702120e-07
140001.00000  141001.00000  3.037805121003e-07
141001.00000  142001.00000  2.680416283238e-07
142001.00000  143001.00000  1.250860932178e-07
143001.00000  144001.00000  1.786944188825e-07
144001.00000  145001.00000  2.144333026590e-07
145001.00000  146001.00000  2.323027445473e-07
146001.00000  147001.00000  1.608249769943e-07
147001.00000  148001.00000  1.250860932178e-07
148001.00000  149001.00000  1.608249769943e-07
149001.00000  150001.00000  2.144333026590e-07
150001.00000  151001.00000  7.147776755301e-08
151001.00000  152001.00000  2.144333026590e-07
152001.00000  153001.00000  7.147776755301e-08
153001.00000  154001.00000  1.072166513295e-07
154001.00000  155001.00000  1.965638607708e-07
155001.00000  156001.00000  8.934720944126e-08
156001.00000  157001.00000  8.934720944126e-08
157001.00000  158001.00000  1.250860932178e-07
158001.00000  159001.00000  1.429555351060e-07
159001.00000  160001.00000  3.573888377651e-08
160001.00000  161001.00000  8.934720944126e-08
161001.00000  162001.00000  8.934720944126e-08
162001.00000  163001.00000  7.147776755301e-08
163001.00000  164001.00000  7.147776755301e-08
164001.00000  165001.00000  1.429555351060e-07
165001.00000  166001.00000  1.072166513295e-07
166001.00000  167001.00000  1.608249769943e-07
167001.00000  168001.00000  8.934720944126e-08
168001.00000  169001.00000  1.250860932178e-07
169001.00000  170001.00000  8.934720944126e-08
170001.00000  171001.00000  7.147776755301e-08
171001.00000  172001.00000  1.786944188825e-07
172001.00000  173001.00000  1.250860932178e-07
173001.00000  174001.00000  1.429555351060e-07
174001.00000  175001.00000  7.147776755301e-08
175001.00000  176001.00000  7.147776755301e-08
176001.00000  177001.00000  8.934720944126e-08
177001.00000  178001.00000  5.360832566476e-08
178001.00000  179001.00000  1.429555351060e-07
179001.00000  180001.00000  1.786944188825e-08
180001.00000  181001.00000  7.147776755301e-08
181001.00000  182001.00000  5.360832566476e-08
182001.00000  183001.00000  7.147776755301e-08
183001.00000  184001.00000  7.147776755301e-08
184001.00000  185001.00000  5.360832566476e-08
185001.00000  186001.00000  5.360832566476e-08
186001.00000  187001.00000  1.786944188825e-08
187001.00000  188001.00000  3.573888377651e-08
188001.00000  189001.00000  7.147776755301e-08
189001.00000  190001.00000  1.786944188825e-08
190001.00000  191001.00000  3.573888377651e-08
191001.00000  192001.00000  3.573888377651e-08
192001.00000  193001.00000  1.786944188825e-08
193001.00000  194001.00000  0.000000000000e+00
194001.00000  195001.00000  0.000000000000e+00
195001.00000  196001.00000  0.000000000000e+00
196001.00000  197001.00000  0.000000000000e+00
197001.00000  198001.00000  3.573888377651e-08
198001.00000  199001.00000  0.000000000000e+00
