300.00000  350.00000  1.157348769531e-01
350.00000  400.00000  9.200586929925e-02
400.00000  450.00000  7.499628517746e-02
450.00000  500.00000  6.277167783492e-02
500.00000  550.00000  5.341979339360e-02
550.00000  600.00000  4.635551188599e-02
600.00000  650.00000  4.023606789850e-02
650.00000  700.00000  3.572705469232e-02
700.00000  750.00000  3.184966999989e-02
750.00000  800.00000  2.850877393204e-02
800.00000  850.00000  2.582440099398e-02
850.00000  900.00000  2.350418418345e-02
900.00000  950.00000  2.159675484342e-02
950.00000  1000.00000  1.971364117486e-02
1000.00000  1050.00000  1.834347238548e-02
1050.00000  1100.00000  1.691367230654e-02
1100.00000  1150.00000  1.583181790748e-02
1150.00000  1200.00000  1.465675343445e-02
1200.00000  1250.00000  1.382500308484e-02
1250.00000  1300.00000  1.283886751953e-02
1300.00000  1350.00000  1.208932729728e-02
1350.00000  1400.00000  1.146310226608e-02
1400.00000  1450.00000  1.070719365368e-02
1450.00000  1500.00000  1.019772244186e-02
1500.00000  1550.00000  9.689988063710e-03
1550.00000  1600.00000  9.145008252272e-03
1600.00000  1650.00000  8.686870124668e-03
1650.00000  1700.00000  8.314801754819e-03
1700.00000  1750.00000  7.988084042084e-03
1750.00000  1800.00000  7.572787811838e-03
1800.00000  1850.00000  7.187210735616e-03
1850.00000  1900.00000  6.972229322747e-03
1900.00000  1950.00000  6.680827228104e-03
1950.00000  2000.00000  6.392126874736e-03
2000.00000  2050.00000  6.092619556269e-03
2050.00000  2100.00000  5.900216981197e-03
2100.00000  2150.00000  5.676744381464e-03
2150.00000  2200.00000  5.480675157519e-03
2200.00000  2250.00000  5.279974377103e-03
2250.00000  2300.00000  5.024273863592e-03
2300.00000  2350.00000  4.949590015495e-03
2350.00000  2400.00000  4.801573189938e-03
2400.00000  2450.00000  4.571346237018e-03
2450.00000  2500.00000  4.486627349900e-03
2500.00000  2550.00000  4.323172002773e-03
2550.00000  2600.00000  4.156628951331e-03
2600.00000  2650.00000  4.029454129894e-03
2650.00000  2700.00000  3.941261575423e-03
2700.00000  2750.00000  3.775104487021e-03
2750.00000  2800.00000  3.740174831968e-03
2800.00000  2850.00000  3.554333628563e-03
2850.00000  2900.00000  3.479070835907e-03
2900.00000  2950.00000  3.388369521680e-03
2950.00000  3000.00000  3.287826149953e-03
3000.00000  3050.00000  3.217966839846e-03
3050.00000  3100.00000  3.152739086211e-03
3100.00000  3150.00000  3.044862416737e-03
3150.00000  3200.00000  2.986967960848e-03
3200.00000  3250.00000  2.897038572700e-03
3250.00000  3300.00000  2.839144116811e-03
3300.00000  3350.00000  2.745934042829e-03
3350.00000  3400.00000  2.712355258413e-03
3400.00000  3450.00000  2.701162330274e-03
3450.00000  3500.00000  2.535391204911e-03
3500.00000  3550.00000  2.503163291133e-03
3550.00000  3600.00000  2.462444190491e-03
3600.00000  3650.00000  2.381005989207e-03
3650.00000  3700.00000  2.336427258172e-03
3700.00000  3750.00000  2.263673225271e-03
3750.00000  3800.00000  2.264638132869e-03
3800.00000  3850.00000  2.195357767322e-03
3850.00000  3900.00000  2.139200145109e-03
3900.00000  3950.00000  2.104849434615e-03
3950.00000  4000.00000  2.079375874024e-03
4000.00000  4050.00000  2.045797089608e-03
4050.00000  4100.00000  2.009323582398e-03
4100.00000  4150.00000  1.963586962245e-03
4150.00000  4200.00000  1.930008177829e-03
4200.00000  4250.00000  1.905499524836e-03
4250.00000  4300.00000  1.869411980665e-03
4300.00000  4350.00000  1.842780530956e-03
4350.00000  4400.00000  1.801289504235e-03
4400.00000  4450.00000  1.755745865602e-03
4450.00000  4500.00000  1.719272358392e-03
4500.00000  4550.00000  1.675079590397e-03
4550.00000  4600.00000  1.665044551376e-03
4600.00000  4650.00000  1.602325557496e-03
4650.00000  4700.00000  1.580132682738e-03
4700.00000  4750.00000  1.575308144747e-03
4750.00000  4800.00000  1.548483713519e-03
4800.00000  4850.00000  1.502747093366e-03
4850.00000  4900.00000  1.495606777140e-03
4900.00000  4950.00000  1.483448941403e-03
4950.00000  5000.00000  1.399308998844e-03
5000.00000  5050.00000  1.411659816100e-03
5050.00000  5100.00000  1.394677442373e-03
5100.00000  5150.00000  1.373256493694e-03
5150.00000  5200.00000  1.339098764719e-03
5200.00000  5250.00000  1.327133910502e-03
5250.00000  5300.00000  1.291239347851e-03
5300.00000  5350.00000  1.308028740059e-03
5350.00000  5400.00000  1.250134284169e-03
5400.00000  5450.00000  1.271748214368e-03
5450.00000  5500.00000  1.243186949463e-03
5500.00000  5550.00000  1.234888744118e-03
5550.00000  5600.00000  1.179889011024e-03
5600.00000  5650.00000  1.189345105486e-03
5650.00000  5700.00000  1.178152177347e-03
5700.00000  5750.00000  1.143608485333e-03
5750.00000  5800.00000  1.138012021264e-03
5800.00000  5850.00000  1.126433130086e-03
5850.00000  5900.00000  1.106363052044e-03
5900.00000  5950.00000  1.087836826160e-03
5950.00000  6000.00000  1.070275507873e-03
6000.00000  6050.00000  1.061591339490e-03
6050.00000  6100.00000  1.060047487333e-03
6100.00000  6150.00000  1.040170390811e-03
6150.00000  6200.00000  1.037275668016e-03
6200.00000  6250.00000  1.033802000663e-03
6250.00000  6300.00000  1.036503741938e-03
6300.00000  6350.00000  9.828548794805e-04
6350.00000  6400.00000  1.165608378571e-03
6400.00000  6450.00000  9.689602100670e-04
6450.00000  6500.00000  9.367322962887e-04
6500.00000  6550.00000  9.309428506997e-04
6550.00000  6600.00000  9.193639595219e-04
6600.00000  6650.00000  9.340305550138e-04
6650.00000  6700.00000  9.222586823163e-04
6700.00000  6750.00000  8.938903989306e-04
6750.00000  6800.00000  8.552940950044e-04
6800.00000  6850.00000  8.755571545656e-04
6850.00000  6900.00000  8.651361525056e-04
6900.00000  6950.00000  8.659080785841e-04
6950.00000  7000.00000  8.552940950044e-04
7000.00000  7050.00000  8.363819060806e-04
7050.00000  7100.00000  8.296275528935e-04
7100.00000  7150.00000  8.186276062745e-04
7150.00000  7200.00000  7.968206945562e-04
7200.00000  7250.00000  7.838909327409e-04
7250.00000  7300.00000  7.684524111705e-04
7300.00000  7350.00000  7.767506165146e-04
7350.00000  7400.00000  7.452946288148e-04
7400.00000  7450.00000  7.742418567594e-04
7450.00000  7500.00000  7.588033351889e-04
7500.00000  7550.00000  7.313999594013e-04
7550.00000  7600.00000  7.350666082743e-04
7600.00000  7650.00000  7.232947355768e-04
7650.00000  7700.00000  7.261894583713e-04
7700.00000  7750.00000  6.962773228285e-04
7750.00000  7800.00000  7.242596431750e-04
7800.00000  7850.00000  6.756283002280e-04
7850.00000  7900.00000  6.928036554751e-04
7900.00000  7950.00000  6.779440784635e-04
7950.00000  8000.00000  6.706107807176e-04
8000.00000  8050.00000  6.654002796875e-04
8050.00000  8100.00000  6.381898854196e-04
8100.00000  8150.00000  6.551722591471e-04
8150.00000  8200.00000  6.588389080201e-04
8200.00000  8250.00000  6.578740004219e-04
8250.00000  8300.00000  6.509266657152e-04
8300.00000  8350.00000  6.387688299785e-04
8350.00000  8400.00000  6.121373802694e-04
8400.00000  8450.00000  6.208215486528e-04
8450.00000  8500.00000  6.295057170362e-04
8500.00000  8550.00000  5.934181728652e-04
8550.00000  8600.00000  6.186987519368e-04
8600.00000  8650.00000  5.986286738952e-04
8650.00000  8700.00000  5.799094664910e-04
8700.00000  8750.00000  5.669797046757e-04
8750.00000  8800.00000  5.640849818813e-04
8800.00000  8850.00000  5.615762221261e-04
8850.00000  8900.00000  5.627341112439e-04
8900.00000  8950.00000  5.544359058997e-04
8950.00000  9000.00000  5.517341646249e-04
9000.00000  9050.00000  5.505762755071e-04
9050.00000  9100.00000  5.453657744771e-04
9100.00000  9150.00000  5.604183330083e-04
9150.00000  9200.00000  5.459447190360e-04
9200.00000  9250.00000  5.359096800152e-04
9250.00000  9300.00000  5.291553268281e-04
9300.00000  9350.00000  5.287693637888e-04
9350.00000  9400.00000  5.262606040336e-04
9400.00000  9450.00000  5.181553802091e-04
9450.00000  9500.00000  5.059975444724e-04
9500.00000  9550.00000  4.868923740289e-04
9550.00000  9600.00000  5.075413966294e-04
9600.00000  9650.00000  4.963484684908e-04
9650.00000  9700.00000  4.915239305000e-04
9700.00000  9750.00000  5.162255650128e-04
9750.00000  9800.00000  4.874713185878e-04
9800.00000  9850.00000  4.809099469203e-04
9850.00000  9900.00000  4.681731666247e-04
9900.00000  9950.00000  4.591030352020e-04
9950.00000  10000.00000  4.784011871651e-04
