10001.00000  11001.00000  1.882975886364e-04
11001.00000  12001.00000  1.572196942665e-04
12001.00000  13001.00000  1.331935392079e-04
13001.00000  14001.00000  1.098133450024e-04
14001.00000  15001.00000  9.687618458624e-05
15001.00000  16001.00000  8.623577386950e-05
16001.00000  17001.00000  7.649253100410e-05
17001.00000  18001.00000  6.626481749898e-05
18001.00000  19001.00000  5.820825019406e-05
19001.00000  20001.00000  5.307645008448e-05
20001.00000  21001.00000  4.754989612031e-05
21001.00000  22001.00000  4.250781279585e-05
22001.00000  23001.00000  3.954715888647e-05
23001.00000  24001.00000  3.513309305795e-05
24001.00000  25001.00000  3.122144122616e-05
25001.00000  26001.00000  2.994746287728e-05
26001.00000  27001.00000  2.720212925222e-05
27001.00000  28001.00000  2.481566276769e-05
28001.00000  29001.00000  2.381083477421e-05
29001.00000  30001.00000  2.363140120394e-05
30001.00000  31001.00000  2.050925708132e-05
31001.00000  32001.00000  1.916350530433e-05
32001.00000  33001.00000  1.796130038356e-05
33001.00000  34001.00000  1.641817167928e-05
34001.00000  35001.00000  1.562866397011e-05
35001.00000  36001.00000  1.512624997336e-05
36001.00000  37001.00000  1.478532618986e-05
37001.00000  38001.00000  1.247063313344e-05
38001.00000  39001.00000  1.175289885238e-05
39001.00000  40001.00000  1.141197506887e-05
40001.00000  41001.00000  1.098133450024e-05
41001.00000  42001.00000  1.067629743079e-05
42001.00000  43001.00000  1.004827993486e-05
43001.00000  44001.00000  9.330545653796e-06
44001.00000  45001.00000  8.971678513265e-06
45001.00000  46001.00000  7.518266594116e-06
46001.00000  47001.00000  8.917848442186e-06
47001.00000  48001.00000  6.997909240347e-06
48001.00000  49001.00000  7.679756807355e-06
49001.00000  50001.00000  7.051739311426e-06
50001.00000  51001.00000  6.495495243604e-06
51001.00000  52001.00000  7.033795954400e-06
52001.00000  53001.00000  5.993081246861e-06
53001.00000  54001.00000  6.208401531179e-06
54001.00000  55001.00000  6.100741389020e-06
55001.00000  56001.00000  6.082798031994e-06
56001.00000  57001.00000  5.472723893092e-06
57001.00000  58001.00000  5.024139967428e-06
58001.00000  59001.00000  4.683216183924e-06
59001.00000  60001.00000  4.503782613659e-06
60001.00000  61001.00000  4.701159540951e-06
61001.00000  62001.00000  4.719102897977e-06
62001.00000  63001.00000  3.929595188810e-06
63001.00000  64001.00000  4.126972116102e-06
64001.00000  65001.00000  3.714274904492e-06
65001.00000  66001.00000  3.481011263147e-06
66001.00000  67001.00000  3.534841334226e-06
67001.00000  68001.00000  3.355407763961e-06
68001.00000  69001.00000  3.624558119359e-06
69001.00000  70001.00000  3.516897977200e-06
70001.00000  71001.00000  3.552784691253e-06
71001.00000  72001.00000  3.086257408563e-06
72001.00000  73001.00000  3.319521049908e-06
73001.00000  74001.00000  2.745333625059e-06
74001.00000  75001.00000  2.870937124245e-06
75001.00000  76001.00000  3.014483980457e-06
76001.00000  77001.00000  2.530013340741e-06
77001.00000  78001.00000  2.512069983714e-06
78001.00000  79001.00000  2.458239912635e-06
79001.00000  80001.00000  2.835050410192e-06
80001.00000  81001.00000  2.260862985343e-06
81001.00000  82001.00000  2.135259486157e-06
82001.00000  83001.00000  2.135259486157e-06
83001.00000  84001.00000  2.458239912635e-06
84001.00000  85001.00000  2.583843411820e-06
85001.00000  86001.00000  1.812279059680e-06
86001.00000  87001.00000  1.758448988600e-06
87001.00000  88001.00000  2.224976271290e-06
88001.00000  89001.00000  2.171146200210e-06
89001.00000  90001.00000  1.794335702653e-06
90001.00000  91001.00000  1.453411919149e-06
91001.00000  92001.00000  1.614902132388e-06
92001.00000  93001.00000  1.901995844812e-06
93001.00000  94001.00000  1.471355276175e-06
94001.00000  95001.00000  1.525185347255e-06
95001.00000  96001.00000  1.758448988600e-06
96001.00000  97001.00000  1.686675560494e-06
97001.00000  98001.00000  1.489298633202e-06
98001.00000  99001.00000  1.471355276175e-06
99001.00000  100001.00000  1.704618917520e-06
100001.00000  101001.00000  1.363695134016e-06
101001.00000  102001.00000  1.381638491043e-06
102001.00000  103001.00000  1.345751776990e-06
103001.00000  104001.00000  1.166318206724e-06
104001.00000  105001.00000  1.256034991857e-06
105001.00000  106001.00000  1.148374849698e-06
106001.00000  107001.00000  1.148374849698e-06
107001.00000  108001.00000  1.273978348884e-06
108001.00000  109001.00000  1.130431492671e-06
109001.00000  110001.00000  1.094544778618e-06
110001.00000  111001.00000  1.076601421592e-06
111001.00000  112001.00000  1.094544778618e-06
112001.00000  113001.00000  1.004827993486e-06
113001.00000  114001.00000  1.094544778618e-06
114001.00000  115001.00000  1.148374849698e-06
115001.00000  116001.00000  1.220148277804e-06
116001.00000  117001.00000  1.112488135645e-06
117001.00000  118001.00000  1.112488135645e-06
118001.00000  119001.00000  8.792244943000e-07
119001.00000  120001.00000  7.356776380877e-07
120001.00000  121001.00000  1.004827993486e-06
121001.00000  122001.00000  8.612811372735e-07
122001.00000  123001.00000  8.074510661939e-07
123001.00000  124001.00000  8.792244943000e-07
124001.00000  125001.00000  7.356776380877e-07
125001.00000  126001.00000  7.715643521408e-07
126001.00000  127001.00000  6.997909240347e-07
127001.00000  128001.00000  8.792244943000e-07
128001.00000  129001.00000  1.004827993486e-06
129001.00000  130001.00000  6.818475670081e-07
130001.00000  131001.00000  6.280174959286e-07
131001.00000  132001.00000  9.330545653796e-07
132001.00000  133001.00000  5.921307818755e-07
133001.00000  134001.00000  8.074510661939e-07
134001.00000  135001.00000  4.485839256633e-07
135001.00000  136001.00000  6.459608529551e-07
136001.00000  137001.00000  7.356776380877e-07
137001.00000  138001.00000  8.074510661939e-07
138001.00000  139001.00000  5.741874248490e-07
139001.00000  140001.00000  6.100741389020e-07
140001.00000  141001.00000  6.997909240347e-07
141001.00000  142001.00000  5.921307818755e-07
142001.00000  143001.00000  5.921307818755e-07
143001.00000  144001.00000  4.844706397163e-07
144001.00000  145001.00000  4.126972116102e-07
145001.00000  146001.00000  5.024139967428e-07
146001.00000  147001.00000  5.562440678224e-07
147001.00000  148001.00000  4.126972116102e-07
148001.00000  149001.00000  7.177342810612e-07
149001.00000  150001.00000  6.459608529551e-07
150001.00000  151001.00000  4.306405686367e-07
151001.00000  152001.00000  4.485839256633e-07
152001.00000  153001.00000  5.024139967428e-07
153001.00000  154001.00000  6.639042099816e-07
154001.00000  155001.00000  5.024139967428e-07
155001.00000  156001.00000  3.050370694510e-07
156001.00000  157001.00000  3.588671405306e-07
157001.00000  158001.00000  3.768104975571e-07
158001.00000  159001.00000  4.306405686367e-07
159001.00000  160001.00000  3.947538545837e-07
160001.00000  161001.00000  4.126972116102e-07
161001.00000  162001.00000  5.203573537694e-07
162001.00000  163001.00000  4.844706397163e-07
163001.00000  164001.00000  4.844706397163e-07
164001.00000  165001.00000  4.306405686367e-07
165001.00000  166001.00000  3.050370694510e-07
166001.00000  167001.00000  1.973769272918e-07
167001.00000  168001.00000  3.050370694510e-07
168001.00000  169001.00000  3.768104975571e-07
169001.00000  170001.00000  4.844706397163e-07
170001.00000  171001.00000  3.050370694510e-07
171001.00000  172001.00000  4.306405686367e-07
172001.00000  173001.00000  3.409237835041e-07
173001.00000  174001.00000  4.126972116102e-07
174001.00000  175001.00000  3.229804264775e-07
175001.00000  176001.00000  3.409237835041e-07
176001.00000  177001.00000  4.306405686367e-07
177001.00000  178001.00000  2.512069983714e-07
178001.00000  179001.00000  3.229804264775e-07
179001.00000  180001.00000  3.050370694510e-07
180001.00000  181001.00000  4.126972116102e-07
181001.00000  182001.00000  4.126972116102e-07
182001.00000  183001.00000  4.306405686367e-07
183001.00000  184001.00000  3.050370694510e-07
184001.00000  185001.00000  2.691503553980e-07
185001.00000  186001.00000  2.691503553980e-07
186001.00000  187001.00000  3.050370694510e-07
187001.00000  188001.00000  2.512069983714e-07
188001.00000  189001.00000  1.435468562122e-07
189001.00000  190001.00000  4.126972116102e-07
190001.00000  191001.00000  3.409237835041e-07
191001.00000  192001.00000  3.050370694510e-07
192001.00000  193001.00000  2.870937124245e-07
193001.00000  194001.00000  1.794335702653e-07
194001.00000  195001.00000  3.947538545837e-07
195001.00000  196001.00000  1.614902132388e-07
196001.00000  197001.00000  1.794335702653e-07
197001.00000  198001.00000  2.870937124245e-07
198001.00000  199001.00000  1.973769272918e-07
