300.00000  350.00000  2.182568843469e-02
350.00000  400.00000  1.733658716094e-02
400.00000  450.00000  1.424231722563e-02
450.00000  500.00000  1.176092480585e-02
500.00000  550.00000  1.017465358917e-02
550.00000  600.00000  8.755530785811e-03
600.00000  650.00000  7.637352242208e-03
650.00000  700.00000  6.752256088126e-03
700.00000  750.00000  6.007125041398e-03
750.00000  800.00000  5.417575043754e-03
800.00000  850.00000  4.896465284554e-03
850.00000  900.00000  4.448229920093e-03
900.00000  950.00000  4.079038211300e-03
950.00000  1000.00000  3.803927731693e-03
1000.00000  1050.00000  3.426060499717e-03
1050.00000  1100.00000  3.240789882406e-03
1100.00000  1150.00000  3.001923810764e-03
1150.00000  1200.00000  2.768841421244e-03
1200.00000  1250.00000  2.617116160242e-03
1250.00000  1300.00000  2.461535111158e-03
1300.00000  1350.00000  2.279541913716e-03
1350.00000  1400.00000  2.180640949429e-03
1400.00000  1450.00000  2.053785521551e-03
1450.00000  1500.00000  1.927894040694e-03
1500.00000  1550.00000  1.852127804895e-03
1550.00000  1600.00000  1.700595333296e-03
1600.00000  1650.00000  1.699438596872e-03
1650.00000  1700.00000  1.544628705404e-03
1700.00000  1750.00000  1.552725860375e-03
1750.00000  1800.00000  1.448234003369e-03
1800.00000  1850.00000  1.362635507962e-03
1850.00000  1900.00000  1.317522787410e-03
1900.00000  1950.00000  1.274337960899e-03
1950.00000  2000.00000  1.214573245637e-03
2000.00000  2050.00000  1.165990315812e-03
2050.00000  2100.00000  1.130902644271e-03
2100.00000  2150.00000  1.099092392600e-03
2150.00000  2200.00000  1.060920090594e-03
2200.00000  2250.00000  9.845754865823e-04
2250.00000  2300.00000  9.749360163788e-04
2300.00000  2350.00000  9.573921806085e-04
2350.00000  2400.00000  9.072669355505e-04
2400.00000  2450.00000  8.596479527454e-04
2450.00000  2500.00000  8.438392216117e-04
2500.00000  2550.00000  8.129929169606e-04
2550.00000  2600.00000  8.047029725856e-04
2600.00000  2650.00000  7.539993593153e-04
2650.00000  2700.00000  7.455166255363e-04
2700.00000  2750.00000  7.459022043444e-04
2750.00000  2800.00000  6.788114917283e-04
2800.00000  2850.00000  6.940418546498e-04
2850.00000  2900.00000  6.635811288068e-04
2900.00000  2950.00000  6.514353963504e-04
2950.00000  3000.00000  6.541344480074e-04
3000.00000  3050.00000  5.918634704930e-04
3050.00000  3100.00000  6.184684082546e-04
3100.00000  3150.00000  5.791393698244e-04
3150.00000  3200.00000  5.666080585599e-04
3200.00000  3250.00000  5.552334837198e-04
3250.00000  3300.00000  5.560046413361e-04
3300.00000  3350.00000  5.211097591995e-04
3350.00000  3400.00000  5.160972346937e-04
3400.00000  3450.00000  4.914201909728e-04
3450.00000  3500.00000  4.941192426298e-04
3500.00000  3550.00000  4.742619340107e-04
3550.00000  3600.00000  4.630801485746e-04
3600.00000  3650.00000  4.621162015543e-04
3650.00000  3700.00000  4.407165777026e-04
3700.00000  3750.00000  4.341617379642e-04
3750.00000  3800.00000  4.181602174265e-04
3800.00000  3850.00000  4.229799525282e-04
3850.00000  3900.00000  4.108342200718e-04
3900.00000  3950.00000  4.114125882841e-04
3950.00000  4000.00000  3.992668558277e-04
4000.00000  4050.00000  4.204736902753e-04
4050.00000  4100.00000  3.799879154207e-04
4100.00000  4150.00000  3.605161856097e-04
4150.00000  4200.00000  3.740114438946e-04
4200.00000  4250.00000  3.516478730225e-04
4250.00000  4300.00000  3.668782359440e-04
4300.00000  4350.00000  3.435507180516e-04
4350.00000  4400.00000  3.468281379208e-04
4400.00000  4450.00000  3.317905644034e-04
4450.00000  4500.00000  3.389237723540e-04
4500.00000  4550.00000  3.236934094325e-04
4550.00000  4600.00000  3.140539392290e-04
4600.00000  4650.00000  3.142467286331e-04
4650.00000  4700.00000  2.961245246506e-04
4700.00000  4750.00000  3.130899922087e-04
4750.00000  4800.00000  3.038361008133e-04
4800.00000  4850.00000  2.934254729936e-04
4850.00000  4900.00000  2.913047895488e-04
4900.00000  4950.00000  2.878345802756e-04
4950.00000  5000.00000  2.909192107407e-04
5000.00000  5050.00000  2.714474809297e-04
5050.00000  5100.00000  2.743393219907e-04
5100.00000  5150.00000  2.623863789384e-04
5150.00000  5200.00000  2.606512743018e-04
5200.00000  5250.00000  2.523613299268e-04
5250.00000  5300.00000  2.591089590692e-04
5300.00000  5350.00000  2.527469087350e-04
5350.00000  5400.00000  2.427218597233e-04
5400.00000  5450.00000  2.425290703193e-04
5450.00000  5500.00000  2.542892239675e-04
5500.00000  5550.00000  2.222861828920e-04
5550.00000  5600.00000  2.274914968019e-04
5600.00000  5650.00000  2.234429193164e-04
5650.00000  5700.00000  2.323112319036e-04
5700.00000  5750.00000  2.207438676594e-04
5750.00000  5800.00000  2.222861828920e-04
5800.00000  5850.00000  2.172736583862e-04
5850.00000  5900.00000  2.070558199705e-04
5900.00000  5950.00000  2.084053457990e-04
5950.00000  6000.00000  2.089837140112e-04
6000.00000  6050.00000  2.001154014240e-04
6050.00000  6100.00000  2.099476610316e-04
6100.00000  6150.00000  2.008865590403e-04
6150.00000  6200.00000  2.003081908281e-04
6200.00000  6250.00000  1.935605616857e-04
6250.00000  6300.00000  1.939461404938e-04
6300.00000  6350.00000  1.870057219473e-04
6350.00000  6400.00000  2.982452080953e-04
6400.00000  6450.00000  1.835355126740e-04
6450.00000  6500.00000  1.904759312205e-04
6500.00000  6550.00000  1.904759312205e-04
6550.00000  6600.00000  1.875840901595e-04
6600.00000  6650.00000  1.692690967729e-04
6650.00000  6700.00000  1.731248848543e-04
6700.00000  6750.00000  1.812220398252e-04
6750.00000  6800.00000  1.681123603485e-04
6800.00000  6850.00000  1.690763073688e-04
6850.00000  6900.00000  1.629070464386e-04
6900.00000  6950.00000  1.721609378340e-04
6950.00000  7000.00000  1.663772557119e-04
7000.00000  7050.00000  1.657988874997e-04
7050.00000  7100.00000  1.735104636624e-04
7100.00000  7150.00000  1.540387338514e-04
7150.00000  7200.00000  1.553882596799e-04
7200.00000  7250.00000  1.509541033863e-04
7250.00000  7300.00000  1.521108398107e-04
7300.00000  7350.00000  1.430497378195e-04
7350.00000  7400.00000  1.507613139823e-04
7400.00000  7450.00000  1.324463205957e-04
7450.00000  7500.00000  1.507613139823e-04
7500.00000  7550.00000  1.511468927904e-04
7550.00000  7600.00000  1.430497378195e-04
7600.00000  7650.00000  1.420857907991e-04
7650.00000  7700.00000  1.413146331829e-04
7700.00000  7750.00000  1.391939497381e-04
7750.00000  7800.00000  1.276265854939e-04
7800.00000  7850.00000  1.378444239096e-04
7850.00000  7900.00000  1.395795285462e-04
7900.00000  7950.00000  1.390011603340e-04
7950.00000  8000.00000  1.322535311916e-04
8000.00000  8050.00000  1.247347444329e-04
8050.00000  8100.00000  1.237707974125e-04
8100.00000  8150.00000  1.278193748980e-04
8150.00000  8200.00000  1.243491656247e-04
8200.00000  8250.00000  1.237707974125e-04
8250.00000  8300.00000  1.185654835027e-04
8300.00000  8350.00000  1.237707974125e-04
8350.00000  8400.00000  1.310967947672e-04
8400.00000  8450.00000  1.189510623108e-04
8450.00000  8500.00000  1.195294305230e-04
8500.00000  8550.00000  1.152880636335e-04
8550.00000  8600.00000  1.150952742294e-04
8600.00000  8650.00000  1.037206993893e-04
8650.00000  8700.00000  1.149024848253e-04
8700.00000  8750.00000  1.129745907847e-04
8750.00000  8800.00000  1.083476450870e-04
8800.00000  8850.00000  1.172159576742e-04
8850.00000  8900.00000  1.033351205812e-04
8900.00000  8950.00000  1.127818013806e-04
8950.00000  9000.00000  1.060341722382e-04
9000.00000  9050.00000  1.046846464097e-04
9050.00000  9100.00000  1.102755391277e-04
9100.00000  9150.00000  9.967212190387e-05
9150.00000  9200.00000  1.006360689242e-04
9200.00000  9250.00000  1.098899603195e-04
9250.00000  9300.00000  1.008288583283e-04
9300.00000  9350.00000  1.118178543602e-04
9350.00000  9400.00000  9.658749143876e-05
9400.00000  9450.00000  9.890096428759e-05
9450.00000  9500.00000  1.010216477324e-04
9500.00000  9550.00000  9.485238680213e-05
9550.00000  9600.00000  9.678028084283e-05
9600.00000  9650.00000  1.006360689242e-04
9650.00000  9700.00000  8.714081063936e-05
9700.00000  9750.00000  9.118938812482e-05
9750.00000  9800.00000  9.273170335737e-05
9800.00000  9850.00000  9.138217752889e-05
9850.00000  9900.00000  9.793701726724e-05
9900.00000  9950.00000  9.331007156958e-05
9950.00000  10000.00000  8.502012719460e-05
