300.00000  350.00000  7.288104068395e-07
350.00000  400.00000  4.372862441037e-06
400.00000  450.00000  2.915241627358e-06
450.00000  500.00000  6.559293661555e-06
500.00000  550.00000  4.773708164798e-05
550.00000  600.00000  1.822026017099e-06
600.00000  650.00000  1.894907057783e-05
650.00000  700.00000  5.101672847876e-06
700.00000  750.00000  9.474535288913e-06
750.00000  800.00000  7.652509271814e-06
800.00000  850.00000  2.805920066332e-05
850.00000  900.00000  8.381319678654e-06
900.00000  950.00000  9.838940492333e-06
950.00000  1000.00000  8.381319678654e-06
1000.00000  1050.00000  8.381319678654e-06
1050.00000  1100.00000  9.474535288913e-06
1100.00000  1150.00000  9.838940492333e-06
1150.00000  1200.00000  6.559293661555e-06
1200.00000  1250.00000  6.559293661555e-06
1250.00000  1300.00000  2.915241627358e-05
1300.00000  1350.00000  9.110130085493e-06
1350.00000  1400.00000  8.381319678654e-06
1400.00000  1450.00000  9.110130085493e-06
1450.00000  1500.00000  1.421180293337e-05
1500.00000  1550.00000  1.238977691627e-05
1550.00000  1600.00000  1.421180293337e-05
1600.00000  1650.00000  1.129656130601e-05
1650.00000  1700.00000  1.129656130601e-05
1700.00000  1750.00000  5.429637530954e-05
1750.00000  1800.00000  1.384739772995e-05
1800.00000  1850.00000  1.712704456073e-05
1850.00000  1900.00000  1.238977691627e-05
1900.00000  1950.00000  1.749144976415e-05
1950.00000  2000.00000  1.566942374705e-05
2000.00000  2050.00000  1.494061334021e-05
2050.00000  2100.00000  1.967788098467e-05
2100.00000  2150.00000  1.421180293337e-05
2150.00000  2200.00000  1.712704456073e-05
2200.00000  2250.00000  1.494061334021e-05
2250.00000  2300.00000  1.421180293337e-05
2300.00000  2350.00000  5.466078051296e-05
2350.00000  2400.00000  2.113550179834e-05
2400.00000  2450.00000  2.077109659492e-05
2450.00000  2500.00000  2.040669139150e-05
2500.00000  2550.00000  1.749144976415e-05
2550.00000  2600.00000  1.749144976415e-05
2600.00000  2650.00000  1.676263935731e-05
2650.00000  2700.00000  1.639823415389e-05
2700.00000  2750.00000  1.639823415389e-05
2750.00000  2800.00000  2.405074342570e-05
2800.00000  2850.00000  1.785585496757e-05
2850.00000  2900.00000  2.222871740860e-05
2900.00000  2950.00000  1.931347578125e-05
2950.00000  3000.00000  4.154219318985e-05
3000.00000  3050.00000  2.259312261202e-05
3050.00000  3100.00000  2.186431220518e-05
3100.00000  3150.00000  2.878801107016e-05
3150.00000  3200.00000  2.988122668042e-05
3200.00000  3250.00000  2.951682147700e-05
3250.00000  3300.00000  3.061003708726e-05
3300.00000  3350.00000  3.425408912145e-05
3350.00000  3400.00000  4.190659839327e-05
3400.00000  3450.00000  5.028791807192e-05
3450.00000  3500.00000  5.575399612322e-05
3500.00000  3550.00000  4.846589205482e-05
3550.00000  3600.00000  7.105901466685e-05
3600.00000  3650.00000  6.923698864975e-05
3650.00000  3700.00000  1.140588286704e-04
3700.00000  3750.00000  8.235557597286e-05
3750.00000  3800.00000  9.401654248229e-05
3800.00000  3850.00000  9.255892166861e-05
3850.00000  3900.00000  1.042198881780e-04
3900.00000  3950.00000  1.122368026533e-04
3950.00000  4000.00000  1.180672859080e-04
4000.00000  4050.00000  1.319146836379e-04
4050.00000  4100.00000  1.279062264003e-04
4100.00000  4150.00000  1.322790888414e-04
4150.00000  4200.00000  1.344655200619e-04
4200.00000  4250.00000  1.676263935731e-04
4250.00000  4300.00000  1.796517652859e-04
4300.00000  4350.00000  1.811093860996e-04
4350.00000  4400.00000  1.931347578125e-04
4400.00000  4450.00000  1.978720254569e-04
4450.00000  4500.00000  1.986008358638e-04
4500.00000  4550.00000  2.233803896963e-04
4550.00000  4600.00000  2.219227688826e-04
4600.00000  4650.00000  2.361345718160e-04
4650.00000  4700.00000  2.481599435288e-04
4700.00000  4750.00000  2.623717464622e-04
4750.00000  4800.00000  2.488887539357e-04
4800.00000  4850.00000  2.638293672759e-04
4850.00000  4900.00000  2.733039025648e-04
4900.00000  4950.00000  2.685666349203e-04
4950.00000  5000.00000  2.889733263118e-04
5000.00000  5050.00000  2.816852222435e-04
5050.00000  5100.00000  3.035495344486e-04
5100.00000  5150.00000  3.312443299085e-04
5150.00000  5200.00000  3.035495344486e-04
5200.00000  5250.00000  3.327019507222e-04
5250.00000  5300.00000  3.195833633991e-04
5300.00000  5350.00000  3.166681217717e-04
5350.00000  5400.00000  3.491001848761e-04
5400.00000  5450.00000  3.545662629274e-04
5450.00000  5500.00000  3.432697016214e-04
5500.00000  5550.00000  3.629475826061e-04
5550.00000  5600.00000  3.585747201650e-04
5600.00000  5650.00000  3.399900547906e-04
5650.00000  5700.00000  3.614899617924e-04
5700.00000  5750.00000  3.450917276385e-04
5750.00000  5800.00000  3.702356866744e-04
5800.00000  5850.00000  3.611255565890e-04
5850.00000  5900.00000  3.552950733342e-04
5900.00000  5950.00000  3.520154265035e-04
5950.00000  6000.00000  3.582103149616e-04
6000.00000  6050.00000  3.644052034197e-04
6050.00000  6100.00000  3.793458167599e-04
6100.00000  6150.00000  3.640407982163e-04
6150.00000  6200.00000  3.851763000147e-04
6200.00000  6250.00000  4.070406122198e-04
6250.00000  6300.00000  5.221926565005e-04
6300.00000  6350.00000  4.999639390919e-04
6350.00000  6400.00000  2.192261703773e-03
6400.00000  6450.00000  3.622187721992e-04
6450.00000  6500.00000  3.665916346403e-04
6500.00000  6550.00000  3.749729543189e-04
6550.00000  6600.00000  3.746085491155e-04
6600.00000  6650.00000  3.771593855394e-04
6650.00000  6700.00000  3.724221178950e-04
6700.00000  6750.00000  3.578459097582e-04
6750.00000  6800.00000  3.618543669958e-04
6800.00000  6850.00000  3.501934004864e-04
6850.00000  6900.00000  3.552950733342e-04
6900.00000  6950.00000  3.560238837411e-04
6950.00000  7000.00000  3.607611513855e-04
7000.00000  7050.00000  3.491001848761e-04
7050.00000  7100.00000  5.298451657723e-04
7100.00000  7150.00000  1.807449808962e-04
7150.00000  7200.00000  1.738212820312e-04
7200.00000  7250.00000  1.807449808962e-04
7250.00000  7300.00000  1.727280664210e-04
7300.00000  7350.00000  1.723636612175e-04
7350.00000  7400.00000  1.811093860996e-04
7400.00000  7450.00000  1.847534381338e-04
7450.00000  7500.00000  2.408718394604e-04
7500.00000  7550.00000  1.865754641509e-04
7550.00000  7600.00000  1.924059474056e-04
7600.00000  7650.00000  1.949567838296e-04
7650.00000  7700.00000  1.760077132517e-04
7700.00000  7750.00000  1.785585496757e-04
7750.00000  7800.00000  1.749144976415e-04
7800.00000  7850.00000  1.822026017099e-04
7850.00000  7900.00000  1.738212820312e-04
7900.00000  7950.00000  1.840246277270e-04
7950.00000  8000.00000  1.719992560141e-04
8000.00000  8050.00000  1.785585496757e-04
8050.00000  8100.00000  1.719992560141e-04
8100.00000  8150.00000  1.749144976415e-04
8150.00000  8200.00000  1.803805756928e-04
8200.00000  8250.00000  1.745500924381e-04
8250.00000  8300.00000  1.880330849646e-04
8300.00000  8350.00000  1.883974901680e-04
8350.00000  8400.00000  1.716348508107e-04
8400.00000  8450.00000  1.931347578125e-04
8450.00000  8500.00000  1.807449808962e-04
8500.00000  8550.00000  1.763721184552e-04
8550.00000  8600.00000  1.818381965064e-04
8600.00000  8650.00000  1.690840143868e-04
8650.00000  8700.00000  1.687196091833e-04
8700.00000  8750.00000  1.796517652859e-04
8750.00000  8800.00000  1.698128247936e-04
8800.00000  8850.00000  1.745500924381e-04
8850.00000  8900.00000  1.683552039799e-04
8900.00000  8950.00000  1.734568768278e-04
8950.00000  9000.00000  1.574230478773e-04
9000.00000  9050.00000  1.672619883697e-04
9050.00000  9100.00000  1.814737913030e-04
9100.00000  9150.00000  1.756433080483e-04
9150.00000  9200.00000  1.661687727594e-04
9200.00000  9250.00000  1.661687727594e-04
9250.00000  9300.00000  1.672619883697e-04
9300.00000  9350.00000  1.512281594192e-04
9350.00000  9400.00000  1.610670999115e-04
9400.00000  9450.00000  1.548722114534e-04
9450.00000  9500.00000  1.643467467423e-04
9500.00000  9550.00000  1.763721184552e-04
9550.00000  9600.00000  1.570586426739e-04
9600.00000  9650.00000  1.545078062500e-04
9650.00000  9700.00000  1.534145906397e-04
9700.00000  9750.00000  1.534145906397e-04
9750.00000  9800.00000  1.563298322671e-04
9800.00000  9850.00000  1.497705386055e-04
9850.00000  9900.00000  1.556010218602e-04
9900.00000  9950.00000  1.279062264003e-04
9950.00000  10000.00000  1.552366166568e-04
