300.00000  350.00000  1.793602091743e-01
350.00000  400.00000  1.278944708889e-01
400.00000  450.00000  9.416922856536e-02
450.00000  500.00000  7.199848361183e-02
500.00000  550.00000  5.682823706486e-02
550.00000  600.00000  4.541398966295e-02
600.00000  650.00000  3.706349156367e-02
650.00000  700.00000  3.097049295055e-02
700.00000  750.00000  2.579174412933e-02
750.00000  800.00000  2.217749495200e-02
800.00000  850.00000  1.914299564270e-02
850.00000  900.00000  1.657124622808e-02
900.00000  950.00000  1.425074675627e-02
950.00000  1000.00000  1.265774711887e-02
1000.00000  1050.00000  1.135574741522e-02
1050.00000  1100.00000  1.014074769178e-02
1100.00000  1150.00000  9.041247942047e-03
1150.00000  1200.00000  8.196748134270e-03
1200.00000  1250.00000  7.290748340493e-03
1250.00000  1300.00000  6.638998488843e-03
1300.00000  1350.00000  6.045748623877e-03
1350.00000  1400.00000  5.598748725623e-03
1400.00000  1450.00000  5.209498814223e-03
1450.00000  1500.00000  4.630498946014e-03
1500.00000  1550.00000  4.378499003374e-03
1550.00000  1600.00000  3.982499093510e-03
1600.00000  1650.00000  3.772499141310e-03
1650.00000  1700.00000  3.554999190817e-03
1700.00000  1750.00000  3.215999267980e-03
1750.00000  1800.00000  2.990999319194e-03
1800.00000  1850.00000  2.801999362214e-03
1850.00000  1900.00000  2.612999405234e-03
1900.00000  1950.00000  2.554499418549e-03
1950.00000  2000.00000  2.281499480689e-03
2000.00000  2050.00000  2.192249501004e-03
2050.00000  2100.00000  2.071499528489e-03
2100.00000  2150.00000  1.895249568607e-03
2150.00000  2200.00000  1.819499585849e-03
2200.00000  2250.00000  1.747499602237e-03
2250.00000  2300.00000  1.618499631600e-03
2300.00000  2350.00000  1.575749641331e-03
2350.00000  2400.00000  1.457249668303e-03
2400.00000  2450.00000  1.389749683668e-03
2450.00000  2500.00000  1.297499704665e-03
2500.00000  2550.00000  1.338749695276e-03
2550.00000  2600.00000  1.232249719517e-03
2600.00000  2650.00000  1.157249736589e-03
2650.00000  2700.00000  1.133999741881e-03
2700.00000  2750.00000  1.073999755538e-03
2750.00000  2800.00000  9.967497731216e-04
2800.00000  2850.00000  9.149997917293e-04
2850.00000  2900.00000  9.494997838765e-04
2900.00000  2950.00000  9.232497898515e-04
2950.00000  3000.00000  8.722498014600e-04
3000.00000  3050.00000  8.347498099957e-04
3050.00000  3100.00000  7.919998197264e-04
3100.00000  3150.00000  7.589998272378e-04
3150.00000  3200.00000  7.237498352613e-04
3200.00000  3250.00000  7.192498362856e-04
3250.00000  3300.00000  6.764998460163e-04
3300.00000  3350.00000  6.802498451627e-04
3350.00000  3400.00000  6.524998514791e-04
3400.00000  3450.00000  6.097498612098e-04
3450.00000  3500.00000  6.074998617219e-04
3500.00000  3550.00000  5.639998716233e-04
3550.00000  3600.00000  5.444998760619e-04
3600.00000  3650.00000  5.017498857926e-04
3650.00000  3700.00000  5.242498806712e-04
3700.00000  3750.00000  4.724998924504e-04
3750.00000  3800.00000  4.934998876704e-04
3800.00000  3850.00000  4.814998904018e-04
3850.00000  3900.00000  4.289999023518e-04
3900.00000  3950.00000  4.514998972304e-04
3950.00000  4000.00000  4.357499008154e-04
4000.00000  4050.00000  4.199999044004e-04
4050.00000  4100.00000  3.982499093510e-04
4100.00000  4150.00000  4.057499076439e-04
4150.00000  4200.00000  3.719999153260e-04
4200.00000  4250.00000  3.787499137896e-04
4250.00000  4300.00000  3.209999269346e-04
4300.00000  4350.00000  3.397499226667e-04
4350.00000  4400.00000  3.607499178867e-04
4400.00000  4450.00000  3.352499236910e-04
4450.00000  4500.00000  3.374999231789e-04
4500.00000  4550.00000  3.464999211303e-04
4550.00000  4600.00000  3.104999293245e-04
4600.00000  4650.00000  2.999999317145e-04
4650.00000  4700.00000  2.819999358117e-04
4700.00000  4750.00000  2.827499356410e-04
4750.00000  4800.00000  2.669999392259e-04
4800.00000  4850.00000  2.849999351288e-04
4850.00000  4900.00000  2.744999375188e-04
4900.00000  4950.00000  2.444999443473e-04
4950.00000  5000.00000  2.557499417866e-04
5000.00000  5050.00000  2.474999436645e-04
5050.00000  5100.00000  2.317499472495e-04
5100.00000  5150.00000  2.317499472495e-04
5150.00000  5200.00000  2.024999539073e-04
5200.00000  5250.00000  2.324999470788e-04
5250.00000  5300.00000  2.039999535659e-04
5300.00000  5350.00000  2.242499489566e-04
5350.00000  5400.00000  2.054999532245e-04
5400.00000  5450.00000  2.032499537366e-04
5450.00000  5500.00000  2.024999539073e-04
5500.00000  5550.00000  2.002499544195e-04
5550.00000  5600.00000  1.837499581752e-04
5600.00000  5650.00000  1.762499598823e-04
5650.00000  5700.00000  1.972499551023e-04
5700.00000  5750.00000  1.754999600530e-04
5750.00000  5800.00000  1.522499653451e-04
5800.00000  5850.00000  1.694999614187e-04
5850.00000  5900.00000  1.649999624430e-04
5900.00000  5950.00000  1.837499581752e-04
5950.00000  6000.00000  1.627499629551e-04
6000.00000  6050.00000  1.537499650037e-04
6050.00000  6100.00000  1.492499660280e-04
6100.00000  6150.00000  1.627499629551e-04
6150.00000  6200.00000  1.574999641501e-04
6200.00000  6250.00000  1.349999692715e-04
6250.00000  6300.00000  1.447499670523e-04
6300.00000  6350.00000  1.454999668816e-04
6350.00000  6400.00000  1.604999634673e-04
6400.00000  6450.00000  1.267499711494e-04
6450.00000  6500.00000  1.199999726858e-04
6500.00000  6550.00000  1.267499711494e-04
6550.00000  6600.00000  1.199999726858e-04
6600.00000  6650.00000  1.357499691008e-04
6650.00000  6700.00000  1.327499697837e-04
6700.00000  6750.00000  1.244999716615e-04
6750.00000  6800.00000  1.312499701251e-04
6800.00000  6850.00000  1.244999716615e-04
6850.00000  6900.00000  1.094999750758e-04
6900.00000  6950.00000  1.124999743930e-04
6950.00000  7000.00000  1.109999747344e-04
7000.00000  7050.00000  1.004999771244e-04
7050.00000  7100.00000  9.524997831937e-05
7100.00000  7150.00000  9.899997746580e-05
7150.00000  7200.00000  9.374997866079e-05
7200.00000  7250.00000  9.899997746580e-05
7250.00000  7300.00000  9.749997780722e-05
7300.00000  7350.00000  1.072499755879e-04
7350.00000  7400.00000  7.949998190435e-05
7400.00000  7450.00000  9.374997866079e-05
7450.00000  7500.00000  8.624998036793e-05
7500.00000  7550.00000  8.174998139221e-05
7550.00000  7600.00000  8.624998036793e-05
7600.00000  7650.00000  9.149997917293e-05
7650.00000  7700.00000  8.624998036793e-05
7700.00000  7750.00000  8.099998156293e-05
7750.00000  7800.00000  9.449997849008e-05
7800.00000  7850.00000  7.724998241649e-05
7850.00000  7900.00000  7.424998309935e-05
7900.00000  7950.00000  7.874998207507e-05
7950.00000  8000.00000  8.774998002650e-05
8000.00000  8050.00000  8.249998122150e-05
8050.00000  8100.00000  8.249998122150e-05
8100.00000  8150.00000  7.574998275792e-05
8150.00000  8200.00000  6.899998429434e-05
8200.00000  8250.00000  6.749998463577e-05
8250.00000  8300.00000  8.024998173364e-05
8300.00000  8350.00000  7.349998327006e-05
8350.00000  8400.00000  6.074998617219e-05
8400.00000  8450.00000  8.399998088007e-05
8450.00000  8500.00000  9.074997934365e-05
8500.00000  8550.00000  5.549998736719e-05
8550.00000  8600.00000  5.024998856219e-05
8600.00000  8650.00000  5.849998668433e-05
8650.00000  8700.00000  6.374998548934e-05
8700.00000  8750.00000  6.374998548934e-05
8750.00000  8800.00000  6.074998617219e-05
8800.00000  8850.00000  4.874998890361e-05
8850.00000  8900.00000  5.999998634291e-05
8900.00000  8950.00000  5.699998702576e-05
8950.00000  9000.00000  5.699998702576e-05
9000.00000  9050.00000  4.499998975718e-05
9050.00000  9100.00000  5.249998805004e-05
9100.00000  9150.00000  6.674998480648e-05
9150.00000  9200.00000  6.299998566005e-05
9200.00000  9250.00000  5.324998787933e-05
9250.00000  9300.00000  4.949998873290e-05
9300.00000  9350.00000  5.024998856219e-05
9350.00000  9400.00000  5.699998702576e-05
9400.00000  9450.00000  5.249998805004e-05
9450.00000  9500.00000  4.424998992789e-05
9500.00000  9550.00000  6.149998600148e-05
9550.00000  9600.00000  5.249998805004e-05
9600.00000  9650.00000  5.174998822076e-05
9650.00000  9700.00000  5.324998787933e-05
9700.00000  9750.00000  5.549998736719e-05
9750.00000  9800.00000  4.424998992789e-05
9800.00000  9850.00000  4.349999009861e-05
9850.00000  9900.00000  4.574998958647e-05
9900.00000  9950.00000  4.649998941575e-05
9950.00000  10000.00000  5.324998787933e-05
