300.00000  350.00000  0.000000000000e+00
350.00000  400.00000  3.860184242521e-07
400.00000  450.00000  0.000000000000e+00
450.00000  500.00000  0.000000000000e+00
500.00000  550.00000  3.474165818269e-06
550.00000  600.00000  0.000000000000e+00
600.00000  650.00000  1.930092121261e-06
650.00000  700.00000  0.000000000000e+00
700.00000  750.00000  3.860184242521e-07
750.00000  800.00000  0.000000000000e+00
800.00000  850.00000  6.176294788034e-06
850.00000  900.00000  0.000000000000e+00
900.00000  950.00000  0.000000000000e+00
950.00000  1000.00000  3.860184242521e-07
1000.00000  1050.00000  3.860184242521e-07
1050.00000  1100.00000  7.720368485043e-07
1100.00000  1150.00000  3.860184242521e-07
1150.00000  1200.00000  1.544073697009e-06
1200.00000  1250.00000  1.158055272756e-06
1250.00000  1300.00000  1.505471854583e-05
1300.00000  1350.00000  2.316110545513e-06
1350.00000  1400.00000  2.316110545513e-06
1400.00000  1450.00000  3.474165818269e-06
1450.00000  1500.00000  3.860184242521e-06
1500.00000  1550.00000  3.088147394017e-06
1550.00000  1600.00000  3.860184242521e-06
1600.00000  1650.00000  5.018239515278e-06
1650.00000  1700.00000  4.246202666774e-06
1700.00000  1750.00000  3.242554763718e-05
1750.00000  1800.00000  5.790276363782e-06
1800.00000  1850.00000  5.018239515278e-06
1850.00000  1900.00000  5.790276363782e-06
1900.00000  1950.00000  6.176294788034e-06
1950.00000  2000.00000  8.106386909295e-06
2000.00000  2050.00000  1.080851587906e-05
2050.00000  2100.00000  8.492405333547e-06
2100.00000  2150.00000  8.492405333547e-06
2150.00000  2200.00000  8.106386909295e-06
2200.00000  2250.00000  1.042249745481e-05
2250.00000  2300.00000  1.003647903056e-05
2300.00000  2350.00000  5.404257939530e-05
2350.00000  2400.00000  8.492405333547e-06
2400.00000  2450.00000  8.878423757799e-06
2450.00000  2500.00000  1.466870012158e-05
2500.00000  2550.00000  1.273860800032e-05
2550.00000  2600.00000  1.080851587906e-05
2600.00000  2650.00000  1.196657115182e-05
2650.00000  2700.00000  1.273860800032e-05
2700.00000  2750.00000  1.003647903056e-05
2750.00000  2800.00000  1.196657115182e-05
2800.00000  2850.00000  1.466870012158e-05
2850.00000  2900.00000  1.312462642457e-05
2900.00000  2950.00000  1.196657115182e-05
2950.00000  3000.00000  3.821582400096e-05
3000.00000  3050.00000  1.119453430331e-05
3050.00000  3100.00000  1.775684751560e-05
3100.00000  3150.00000  1.119453430331e-05
3150.00000  3200.00000  1.621277381859e-05
3200.00000  3250.00000  1.737082909135e-05
3250.00000  3300.00000  1.466870012158e-05
3300.00000  3350.00000  1.891490278835e-05
3350.00000  3400.00000  1.544073697009e-05
3400.00000  3450.00000  2.045897648536e-05
3450.00000  3500.00000  2.161703175812e-05
3500.00000  3550.00000  2.238906860662e-05
3550.00000  3600.00000  2.933740024316e-05
3600.00000  3650.00000  3.049545551592e-05
3650.00000  3700.00000  5.751674521357e-05
3700.00000  3750.00000  2.856536339466e-05
3750.00000  3800.00000  3.705776872821e-05
3800.00000  3850.00000  4.014591612222e-05
3850.00000  3900.00000  4.863832145577e-05
3900.00000  3950.00000  5.906081891058e-05
3950.00000  4000.00000  4.632221091026e-05
4000.00000  4050.00000  6.716720581987e-05
4050.00000  4100.00000  7.218544533515e-05
4100.00000  4150.00000  7.643164800192e-05
4150.00000  4200.00000  7.411553745641e-05
4200.00000  4250.00000  8.569609018397e-05
4250.00000  4300.00000  9.341645866902e-05
4300.00000  4350.00000  9.843469818430e-05
4350.00000  4400.00000  1.104012693361e-04
4400.00000  4450.00000  1.119453430331e-04
4450.00000  4500.00000  1.343344116397e-04
4500.00000  4550.00000  1.366505221853e-04
4550.00000  4600.00000  1.389666327308e-04
4600.00000  4650.00000  1.563374618221e-04
4650.00000  4700.00000  1.740943093377e-04
4700.00000  4750.00000  1.540213512766e-04
4750.00000  4800.00000  1.899210647321e-04
4800.00000  4850.00000  1.991855069141e-04
4850.00000  4900.00000  2.099940227932e-04
4900.00000  4950.00000  2.215745755207e-04
4950.00000  5000.00000  2.231186492177e-04
5000.00000  5050.00000  2.300669808543e-04
5050.00000  5100.00000  2.482098467941e-04
5100.00000  5150.00000  2.590183626732e-04
5150.00000  5200.00000  2.540001231579e-04
5200.00000  5250.00000  2.532280863094e-04
5250.00000  5300.00000  2.960761314014e-04
5300.00000  5350.00000  2.806353944313e-04
5350.00000  5400.00000  3.169211263110e-04
5400.00000  5450.00000  3.196232552808e-04
5450.00000  5500.00000  3.080427025532e-04
5500.00000  5550.00000  3.149910341897e-04
5550.00000  5600.00000  3.416263054631e-04
5600.00000  5650.00000  3.458725081299e-04
5650.00000  5700.00000  3.404682501904e-04
5700.00000  5750.00000  3.674895398880e-04
5750.00000  5800.00000  3.582250977060e-04
5800.00000  5850.00000  3.933527743129e-04
5850.00000  5900.00000  3.921947190402e-04
5900.00000  5950.00000  3.667175030395e-04
5950.00000  6000.00000  4.049333270405e-04
6000.00000  6050.00000  4.003011059495e-04
6050.00000  6100.00000  4.111096218285e-04
6100.00000  6150.00000  4.373588746777e-04
6150.00000  6200.00000  4.234622114046e-04
6200.00000  6250.00000  4.566597958903e-04
6250.00000  6300.00000  5.184227437706e-04
6300.00000  6350.00000  5.593406967413e-04
6350.00000  6400.00000  1.882611855078e-03
6400.00000  6450.00000  4.369728562534e-04
6450.00000  6500.00000  4.454652615870e-04
6500.00000  6550.00000  4.223041561318e-04
6550.00000  6600.00000  4.454652615870e-04
6600.00000  6650.00000  4.250062851016e-04
6650.00000  6700.00000  4.582038695873e-04
6700.00000  6750.00000  4.744166434059e-04
6750.00000  6800.00000  4.620640538298e-04
6800.00000  6850.00000  4.385169299504e-04
6850.00000  6900.00000  4.798209013454e-04
6900.00000  6950.00000  4.886993251032e-04
6950.00000  7000.00000  4.651522012238e-04
7000.00000  7050.00000  4.844531224364e-04
7050.00000  7100.00000  6.160854051064e-04
7100.00000  7150.00000  2.181004097025e-04
7150.00000  7200.00000  2.026596727324e-04
7200.00000  7250.00000  1.937812489746e-04
7250.00000  7300.00000  2.126961517629e-04
7300.00000  7350.00000  1.964833779443e-04
7350.00000  7400.00000  1.949393042473e-04
7400.00000  7450.00000  2.096080043689e-04
7450.00000  7500.00000  2.578603074004e-04
7500.00000  7550.00000  2.103800412174e-04
7550.00000  7600.00000  2.130821701872e-04
7600.00000  7650.00000  2.327691098240e-04
7650.00000  7700.00000  2.196444833995e-04
7700.00000  7750.00000  2.165563360054e-04
7750.00000  7800.00000  2.397174414606e-04
7800.00000  7850.00000  2.296809624300e-04
7850.00000  7900.00000  2.389454046121e-04
7900.00000  7950.00000  2.262067966118e-04
7950.00000  8000.00000  2.331551282483e-04
8000.00000  8050.00000  2.370153124908e-04
8050.00000  8100.00000  2.354712387938e-04
8100.00000  8150.00000  2.370153124908e-04
8150.00000  8200.00000  2.497539204911e-04
8200.00000  8250.00000  2.651946574612e-04
8250.00000  8300.00000  2.586323442489e-04
8300.00000  8350.00000  2.586323442489e-04
8350.00000  8400.00000  2.543861415822e-04
8400.00000  8450.00000  2.559302152792e-04
8450.00000  8500.00000  2.524560494609e-04
8500.00000  8550.00000  2.374013309151e-04
8550.00000  8600.00000  2.601764179459e-04
8600.00000  8650.00000  2.346992019453e-04
8650.00000  8700.00000  2.520700310366e-04
8700.00000  8750.00000  2.424195704303e-04
8750.00000  8800.00000  2.509119757639e-04
8800.00000  8850.00000  2.648086390370e-04
8850.00000  8900.00000  2.512979941881e-04
8900.00000  8950.00000  2.424195704303e-04
8950.00000  9000.00000  2.497539204911e-04
9000.00000  9050.00000  2.574742889762e-04
9050.00000  9100.00000  2.644226206127e-04
9100.00000  9150.00000  2.547721600064e-04
9150.00000  9200.00000  2.478238283699e-04
9200.00000  9250.00000  2.482098467941e-04
9250.00000  9300.00000  2.651946574612e-04
9300.00000  9350.00000  2.512979941881e-04
9350.00000  9400.00000  2.516840126124e-04
9400.00000  9450.00000  2.482098467941e-04
9450.00000  9500.00000  2.532280863094e-04
9500.00000  9550.00000  2.763891917645e-04
9550.00000  9600.00000  2.543861415822e-04
9600.00000  9650.00000  2.540001231579e-04
9650.00000  9700.00000  2.335411466725e-04
9700.00000  9750.00000  2.478238283699e-04
9750.00000  9800.00000  2.686688232795e-04
9800.00000  9850.00000  2.694408601280e-04
9850.00000  9900.00000  2.733010443705e-04
9900.00000  9950.00000  2.640366021885e-04
9950.00000  10000.00000  2.447356809759e-04
