300.00000  350.00000  6.341579015071e-02
350.00000  400.00000  4.733901067268e-02
400.00000  450.00000  3.713984802055e-02
450.00000  500.00000  2.958750710089e-02
500.00000  550.00000  2.424811786468e-02
550.00000  600.00000  2.026716360082e-02
600.00000  650.00000  1.700170179016e-02
650.00000  700.00000  1.447353315181e-02
700.00000  750.00000  1.253398392926e-02
750.00000  800.00000  1.096040087658e-02
800.00000  850.00000  9.771010824497e-03
850.00000  900.00000  8.584837271955e-03
900.00000  950.00000  7.761413389744e-03
950.00000  1000.00000  6.947639006153e-03
1000.00000  1050.00000  6.334359760548e-03
1050.00000  1100.00000  5.766468897339e-03
1100.00000  1150.00000  5.283636577519e-03
1150.00000  1200.00000  4.786866093025e-03
1200.00000  1250.00000  4.394810537997e-03
1250.00000  1300.00000  4.087456137519e-03
1300.00000  1350.00000  3.787249513796e-03
1350.00000  1400.00000  3.460596116079e-03
1400.00000  1450.00000  3.253667979013e-03
1450.00000  1500.00000  2.968829075314e-03
1500.00000  1550.00000  2.838382149530e-03
1550.00000  1600.00000  2.663619007863e-03
1600.00000  1650.00000  2.558546689560e-03
1650.00000  1700.00000  2.325171778499e-03
1700.00000  1750.00000  2.286931172859e-03
1750.00000  1800.00000  2.084291701846e-03
1800.00000  1850.00000  1.990655826351e-03
1850.00000  1900.00000  1.849844624272e-03
1900.00000  1950.00000  1.762641747857e-03
1950.00000  2000.00000  1.701885645437e-03
2000.00000  2050.00000  1.582875162461e-03
2050.00000  2100.00000  1.548923222874e-03
2100.00000  2150.00000  1.505321784666e-03
2150.00000  2200.00000  1.414545019874e-03
2200.00000  2250.00000  1.376304414233e-03
2250.00000  2300.00000  1.293747592710e-03
2300.00000  2350.00000  1.209046438159e-03
2350.00000  2400.00000  1.232634101452e-03
2400.00000  2450.00000  1.139713003633e-03
2450.00000  2500.00000  1.096468954263e-03
2500.00000  2550.00000  1.018915576468e-03
2550.00000  2600.00000  1.007121744822e-03
2600.00000  2650.00000  9.531560303194e-04
2650.00000  2700.00000  9.188467018940e-04
2700.00000  2750.00000  8.999050934924e-04
2750.00000  2800.00000  8.727435418223e-04
2800.00000  2850.00000  8.198499938330e-04
2850.00000  2900.00000  7.894719426230e-04
2900.00000  2950.00000  7.844684988943e-04
2950.00000  3000.00000  7.515887258199e-04
3000.00000  3050.00000  7.254993406631e-04
3050.00000  3100.00000  7.079872876126e-04
3100.00000  3150.00000  6.779666252403e-04
3150.00000  3200.00000  6.890456792110e-04
3200.00000  3250.00000  6.697466819717e-04
3250.00000  3300.00000  6.357947423840e-04
3300.00000  3350.00000  6.100627460650e-04
3350.00000  3400.00000  5.961245813921e-04
3400.00000  3450.00000  5.689630297220e-04
3450.00000  3500.00000  5.410867003763e-04
3500.00000  3550.00000  5.221450919748e-04
3550.00000  3600.00000  5.239320361636e-04
3600.00000  3650.00000  5.282207022168e-04
3650.00000  3700.00000  5.117808156796e-04
3700.00000  3750.00000  4.949835403046e-04
3750.00000  3800.00000  4.896227077381e-04
3800.00000  3850.00000  4.878357635493e-04
3850.00000  3900.00000  4.513821020973e-04
3900.00000  3950.00000  4.320831048580e-04
3950.00000  4000.00000  4.395882704510e-04
4000.00000  4050.00000  4.256501057782e-04
4050.00000  4100.00000  4.227909950761e-04
4100.00000  4150.00000  4.113545522676e-04
4150.00000  4200.00000  3.941998880549e-04
4200.00000  4250.00000  3.959868322437e-04
4250.00000  4300.00000  3.838356117597e-04
4300.00000  4350.00000  3.799043345443e-04
4350.00000  4400.00000  3.413063400656e-04
4400.00000  4450.00000  3.613201149805e-04
4450.00000  4500.00000  3.409489512279e-04
4500.00000  4550.00000  3.466671726321e-04
4550.00000  4600.00000  3.187908432864e-04
4600.00000  4650.00000  3.248664535284e-04
4650.00000  4700.00000  3.048526786136e-04
4700.00000  4750.00000  3.248664535284e-04
4750.00000  4800.00000  2.987770683716e-04
4800.00000  4850.00000  2.934162358051e-04
4850.00000  4900.00000  3.030657344248e-04
4900.00000  4950.00000  2.855536813743e-04
4950.00000  5000.00000  2.966327353450e-04
5000.00000  5050.00000  2.544608524887e-04
5050.00000  5100.00000  2.844815148610e-04
5100.00000  5150.00000  2.608938515685e-04
5150.00000  5200.00000  2.694711836749e-04
5200.00000  5250.00000  2.465982980579e-04
5250.00000  5300.00000  2.398079101404e-04
5300.00000  5350.00000  2.698285725126e-04
5350.00000  5400.00000  2.498147975978e-04
5400.00000  5450.00000  2.448113538691e-04
5450.00000  5500.00000  2.473130757334e-04
5500.00000  5550.00000  2.405226878159e-04
5550.00000  5600.00000  2.401652989781e-04
5600.00000  5650.00000  2.272993008186e-04
5650.00000  5700.00000  2.172924133612e-04
5700.00000  5750.00000  2.315879668718e-04
5750.00000  5800.00000  2.172924133612e-04
5800.00000  5850.00000  2.119315807947e-04
5850.00000  5900.00000  2.194367463877e-04
5900.00000  5950.00000  2.276566896563e-04
5950.00000  6000.00000  1.954916942575e-04
6000.00000  6050.00000  2.029968598506e-04
6050.00000  6100.00000  1.947769165820e-04
6100.00000  6150.00000  2.051411928771e-04
6150.00000  6200.00000  2.137185249835e-04
6200.00000  6250.00000  1.969212496085e-04
6250.00000  6300.00000  2.058559705527e-04
6300.00000  6350.00000  1.997803603107e-04
6350.00000  6400.00000  4.256501057782e-04
6400.00000  6450.00000  1.779796412070e-04
6450.00000  6500.00000  1.776222523692e-04
6500.00000  6550.00000  1.790518077203e-04
6550.00000  6600.00000  1.722614198028e-04
6600.00000  6650.00000  1.665431983985e-04
6650.00000  6700.00000  1.672579760740e-04
6700.00000  6750.00000  1.604675881565e-04
6750.00000  6800.00000  1.711892532895e-04
6800.00000  6850.00000  1.654710318852e-04
6850.00000  6900.00000  1.683301425873e-04
6900.00000  6950.00000  1.433129239438e-04
6950.00000  7000.00000  1.568936997789e-04
7000.00000  7050.00000  1.461720346459e-04
7050.00000  7100.00000  1.751205305049e-04
7100.00000  7150.00000  1.290173704332e-04
7150.00000  7200.00000  1.440277016193e-04
7200.00000  7250.00000  1.415259797550e-04
7250.00000  7300.00000  1.308043146220e-04
7300.00000  7350.00000  1.315190922975e-04
7350.00000  7400.00000  1.390242578906e-04
7400.00000  7450.00000  1.261582597311e-04
7450.00000  7500.00000  1.425981462683e-04
7500.00000  7550.00000  1.182957053002e-04
7550.00000  7600.00000  1.125774838960e-04
7600.00000  7650.00000  1.222269825157e-04
7650.00000  7700.00000  1.254434820555e-04
7700.00000  7750.00000  1.283025927577e-04
7750.00000  7800.00000  1.229417601912e-04
7800.00000  7850.00000  1.175809276247e-04
7850.00000  7900.00000  1.204400383268e-04
7900.00000  7950.00000  1.275878150821e-04
7950.00000  8000.00000  1.075740401673e-04
8000.00000  8050.00000  1.086462066806e-04
8050.00000  8100.00000  1.140070392471e-04
8100.00000  8150.00000  1.172235387869e-04
8150.00000  8200.00000  1.161513722736e-04
8200.00000  8250.00000  1.025705964386e-04
8250.00000  8300.00000  9.863931922316e-05
8300.00000  8350.00000  1.029279852763e-04
8350.00000  8400.00000  1.075740401673e-04
8400.00000  8450.00000  1.040001517896e-04
8450.00000  8500.00000  1.182957053002e-04
8500.00000  8550.00000  9.649498619657e-05
8550.00000  8600.00000  1.004262634120e-04
8600.00000  8650.00000  1.014984299253e-04
8650.00000  8700.00000  9.149154246786e-05
8700.00000  8750.00000  9.363587549445e-05
8750.00000  8800.00000  9.399326433221e-05
8800.00000  8850.00000  1.004262634120e-04
8850.00000  8900.00000  1.014984299253e-04
8900.00000  8950.00000  1.129348727338e-04
8950.00000  9000.00000  1.011410410875e-04
9000.00000  9050.00000  8.720287641467e-05
9050.00000  9100.00000  8.756026525244e-05
9100.00000  9150.00000  8.684548757691e-05
9150.00000  9200.00000  8.791765409020e-05
9200.00000  9250.00000  8.541593222585e-05
9250.00000  9300.00000  8.291421036149e-05
9300.00000  9350.00000  9.435065316998e-05
9350.00000  9400.00000  7.898293314608e-05
9400.00000  9450.00000  7.576643360619e-05
9450.00000  9500.00000  8.148465501043e-05
9500.00000  9550.00000  8.112726617267e-05
9550.00000  9600.00000  7.934032198384e-05
9600.00000  9650.00000  7.791076663278e-05
9650.00000  9700.00000  8.219943268596e-05
9700.00000  9750.00000  7.112037871525e-05
9750.00000  9800.00000  8.255682152373e-05
9800.00000  9850.00000  7.540904476843e-05
9850.00000  9900.00000  8.327159919926e-05
9900.00000  9950.00000  8.112726617267e-05
9950.00000  10000.00000  8.541593222585e-05
