10001.00000  11001.00000  1.127638455451e-05
11001.00000  12001.00000  1.063715637781e-05
12001.00000  13001.00000  1.120646897268e-05
13001.00000  14001.00000  1.097674634668e-05
14001.00000  15001.00000  1.119648103242e-05
15001.00000  16001.00000  1.173582980651e-05
16001.00000  17001.00000  1.163595040390e-05
17001.00000  18001.00000  1.138625189738e-05
18001.00000  19001.00000  1.103667398825e-05
19001.00000  20001.00000  1.092680664538e-05
20001.00000  21001.00000  1.007783172321e-05
21001.00000  22001.00000  9.059061816599e-06
22001.00000  23001.00000  8.959182413991e-06
23001.00000  24001.00000  7.870496925557e-06
24001.00000  25001.00000  7.411051673557e-06
25001.00000  26001.00000  6.741859676080e-06
26001.00000  27001.00000  6.312378244863e-06
27001.00000  28001.00000  6.122607379907e-06
28001.00000  29001.00000  5.783017411037e-06
29001.00000  30001.00000  4.784223384951e-06
30001.00000  31001.00000  4.604440460256e-06
31001.00000  32001.00000  4.274838431648e-06
32001.00000  33001.00000  3.635610254953e-06
33001.00000  34001.00000  3.965212283561e-06
34001.00000  35001.00000  3.266056465301e-06
35001.00000  36001.00000  3.036333839301e-06
36001.00000  37001.00000  2.706731810693e-06
37001.00000  38001.00000  2.656792109389e-06
38001.00000  39001.00000  2.447045363910e-06
39001.00000  40001.00000  2.107455395041e-06
40001.00000  41001.00000  1.937660410607e-06
41001.00000  42001.00000  1.887720709302e-06
42001.00000  43001.00000  1.807817187215e-06
43001.00000  44001.00000  1.707937784607e-06
44001.00000  45001.00000  1.468227218346e-06
45001.00000  46001.00000  1.408299576781e-06
46001.00000  47001.00000  1.198552831303e-06
47001.00000  48001.00000  1.128637249477e-06
48001.00000  49001.00000  1.018769906608e-06
49001.00000  50001.00000  9.388663845208e-07
50001.00000  51001.00000  9.089025637382e-07
51001.00000  52001.00000  9.888060858250e-07
52001.00000  53001.00000  9.089025637382e-07
53001.00000  54001.00000  7.790593403470e-07
54001.00000  55001.00000  7.091437585210e-07
55001.00000  56001.00000  6.492161169558e-07
56001.00000  57001.00000  6.592040572167e-07
57001.00000  58001.00000  5.793005351298e-07
58001.00000  59001.00000  4.694331922604e-07
59001.00000  60001.00000  4.194934909561e-07
60001.00000  61001.00000  4.794211325212e-07
61001.00000  62001.00000  5.393487740864e-07
62001.00000  63001.00000  3.695537896518e-07
63001.00000  64001.00000  3.495779091301e-07
64001.00000  65001.00000  2.896502675649e-07
65001.00000  66001.00000  3.995176104344e-07
66001.00000  67001.00000  3.795417299126e-07
67001.00000  68001.00000  1.598070441737e-07
68001.00000  69001.00000  2.796623273041e-07
69001.00000  70001.00000  2.896502675649e-07
70001.00000  71001.00000  2.496985065215e-07
71001.00000  72001.00000  2.197346857389e-07
72001.00000  73001.00000  1.897708649563e-07
73001.00000  74001.00000  1.797829246955e-07
74001.00000  75001.00000  2.097467454780e-07
75001.00000  76001.00000  1.997588052172e-07
76001.00000  77001.00000  2.197346857389e-07
77001.00000  78001.00000  1.598070441737e-07
78001.00000  79001.00000  1.298432233912e-07
79001.00000  80001.00000  1.697949844346e-07
80001.00000  81001.00000  1.797829246955e-07
81001.00000  82001.00000  1.098673428694e-07
82001.00000  83001.00000  6.991558182601e-08
83001.00000  84001.00000  7.990352208687e-08
84001.00000  85001.00000  5.992764156515e-08
85001.00000  86001.00000  9.987940260859e-08
86001.00000  87001.00000  1.098673428694e-07
87001.00000  88001.00000  6.991558182601e-08
88001.00000  89001.00000  5.992764156515e-08
89001.00000  90001.00000  8.989146234773e-08
90001.00000  91001.00000  9.987940260859e-08
91001.00000  92001.00000  4.993970130430e-08
92001.00000  93001.00000  6.991558182601e-08
93001.00000  94001.00000  9.987940260859e-08
94001.00000  95001.00000  4.993970130430e-08
95001.00000  96001.00000  8.989146234773e-08
96001.00000  97001.00000  9.987940260859e-09
97001.00000  98001.00000  3.995176104344e-08
98001.00000  99001.00000  2.996382078258e-08
99001.00000  100001.00000  8.989146234773e-08
100001.00000  101001.00000  3.995176104344e-08
101001.00000  102001.00000  2.996382078258e-08
102001.00000  103001.00000  9.987940260859e-09
103001.00000  104001.00000  3.995176104344e-08
104001.00000  105001.00000  4.993970130430e-08
105001.00000  106001.00000  9.987940260859e-09
106001.00000  107001.00000  4.993970130430e-08
107001.00000  108001.00000  6.991558182601e-08
108001.00000  109001.00000  4.993970130430e-08
109001.00000  110001.00000  3.995176104344e-08
110001.00000  111001.00000  5.992764156515e-08
111001.00000  112001.00000  9.987940260859e-09
112001.00000  113001.00000  9.987940260859e-09
113001.00000  114001.00000  3.995176104344e-08
114001.00000  115001.00000  9.987940260859e-09
115001.00000  116001.00000  9.987940260859e-09
116001.00000  117001.00000  9.987940260859e-09
117001.00000  118001.00000  4.993970130430e-08
118001.00000  119001.00000  1.997588052172e-08
119001.00000  120001.00000  1.997588052172e-08
120001.00000  121001.00000  9.987940260859e-09
121001.00000  122001.00000  0.000000000000e+00
122001.00000  123001.00000  2.996382078258e-08
123001.00000  124001.00000  1.997588052172e-08
124001.00000  125001.00000  9.987940260859e-09
125001.00000  126001.00000  1.997588052172e-08
126001.00000  127001.00000  9.987940260859e-09
127001.00000  128001.00000  9.987940260859e-09
128001.00000  129001.00000  2.996382078258e-08
129001.00000  130001.00000  0.000000000000e+00
130001.00000  131001.00000  0.000000000000e+00
131001.00000  132001.00000  1.997588052172e-08
132001.00000  133001.00000  9.987940260859e-09
133001.00000  134001.00000  9.987940260859e-09
134001.00000  135001.00000  0.000000000000e+00
135001.00000  136001.00000  9.987940260859e-09
136001.00000  137001.00000  0.000000000000e+00
137001.00000  138001.00000  9.987940260859e-09
138001.00000  139001.00000  0.000000000000e+00
139001.00000  140001.00000  0.000000000000e+00
140001.00000  141001.00000  0.000000000000e+00
141001.00000  142001.00000  9.987940260859e-09
142001.00000  143001.00000  0.000000000000e+00
143001.00000  144001.00000  0.000000000000e+00
144001.00000  145001.00000  0.000000000000e+00
145001.00000  146001.00000  1.997588052172e-08
146001.00000  147001.00000  1.997588052172e-08
147001.00000  148001.00000  9.987940260859e-09
148001.00000  149001.00000  0.000000000000e+00
149001.00000  150001.00000  1.997588052172e-08
150001.00000  151001.00000  0.000000000000e+00
151001.00000  152001.00000  0.000000000000e+00
152001.00000  153001.00000  0.000000000000e+00
153001.00000  154001.00000  0.000000000000e+00
154001.00000  155001.00000  0.000000000000e+00
155001.00000  156001.00000  9.987940260859e-09
156001.00000  157001.00000  0.000000000000e+00
157001.00000  158001.00000  0.000000000000e+00
158001.00000  159001.00000  0.000000000000e+00
159001.00000  160001.00000  0.000000000000e+00
160001.00000  161001.00000  9.987940260859e-09
161001.00000  162001.00000  0.000000000000e+00
162001.00000  163001.00000  0.000000000000e+00
163001.00000  164001.00000  0.000000000000e+00
164001.00000  165001.00000  0.000000000000e+00
165001.00000  166001.00000  1.997588052172e-08
166001.00000  167001.00000  0.000000000000e+00
167001.00000  168001.00000  0.000000000000e+00
168001.00000  169001.00000  0.000000000000e+00
169001.00000  170001.00000  0.000000000000e+00
170001.00000  171001.00000  0.000000000000e+00
171001.00000  172001.00000  9.987940260859e-09
172001.00000  173001.00000  0.000000000000e+00
173001.00000  174001.00000  0.000000000000e+00
174001.00000  175001.00000  0.000000000000e+00
175001.00000  176001.00000  0.000000000000e+00
176001.00000  177001.00000  0.000000000000e+00
177001.00000  178001.00000  9.987940260859e-09
178001.00000  179001.00000  0.000000000000e+00
179001.00000  180001.00000  0.000000000000e+00
180001.00000  181001.00000  9.987940260859e-09
181001.00000  182001.00000  0.000000000000e+00
182001.00000  183001.00000  9.987940260859e-09
183001.00000  184001.00000  0.000000000000e+00
184001.00000  185001.00000  0.000000000000e+00
185001.00000  186001.00000  0.000000000000e+00
186001.00000  187001.00000  0.000000000000e+00
187001.00000  188001.00000  9.987940260859e-09
188001.00000  189001.00000  0.000000000000e+00
189001.00000  190001.00000  0.000000000000e+00
190001.00000  191001.00000  0.000000000000e+00
191001.00000  192001.00000  0.000000000000e+00
192001.00000  193001.00000  0.000000000000e+00
193001.00000  194001.00000  0.000000000000e+00
194001.00000  195001.00000  0.000000000000e+00
195001.00000  196001.00000  0.000000000000e+00
196001.00000  197001.00000  0.000000000000e+00
197001.00000  198001.00000  0.000000000000e+00
198001.00000  199001.00000  0.000000000000e+00
