10001.00000  11001.00000  4.531524434316e-04
11001.00000  12001.00000  3.959374450866e-04
12001.00000  13001.00000  3.447095014209e-04
13001.00000  14001.00000  2.998548740264e-04
14001.00000  15001.00000  2.684904327396e-04
15001.00000  16001.00000  2.403319626681e-04
16001.00000  17001.00000  2.172238629146e-04
17001.00000  18001.00000  1.967616550677e-04
18001.00000  19001.00000  1.789936218264e-04
19001.00000  20001.00000  1.643349944023e-04
20001.00000  21001.00000  1.507385863568e-04
21001.00000  22001.00000  1.394500913247e-04
22001.00000  23001.00000  1.275628908247e-04
23001.00000  24001.00000  1.195479627865e-04
24001.00000  25001.00000  1.085974466476e-04
25001.00000  26001.00000  1.032090974364e-04
26001.00000  27001.00000  9.480790780598e-05
27001.00000  28001.00000  8.889810544529e-05
28001.00000  29001.00000  8.375116972919e-05
29001.00000  30001.00000  7.814072010246e-05
30001.00000  31001.00000  7.425879110083e-05
31001.00000  32001.00000  6.993266126817e-05
32001.00000  33001.00000  6.524923946272e-05
33001.00000  34001.00000  6.199498554842e-05
34001.00000  35001.00000  5.966775945540e-05
35001.00000  36001.00000  5.592102201104e-05
36001.00000  37001.00000  5.374830055491e-05
37001.00000  38001.00000  5.016572428723e-05
38001.00000  39001.00000  4.649623916131e-05
39001.00000  40001.00000  4.627413874580e-05
40001.00000  41001.00000  4.297160213247e-05
41001.00000  42001.00000  4.088578953458e-05
42001.00000  43001.00000  3.964975243953e-05
43001.00000  44001.00000  3.775707063774e-05
44001.00000  45001.00000  3.562297534083e-05
45001.00000  46001.00000  3.470560405935e-05
46001.00000  47001.00000  3.354681928274e-05
47001.00000  48001.00000  3.188589443627e-05
48001.00000  49001.00000  3.065951388103e-05
49001.00000  50001.00000  2.978076875877e-05
50001.00000  51001.00000  2.773358232010e-05
51001.00000  52001.00000  2.696105913570e-05
52001.00000  53001.00000  2.659411062311e-05
53001.00000  54001.00000  2.589883975714e-05
54001.00000  55001.00000  2.491387269703e-05
55001.00000  56001.00000  2.348470480588e-05
56001.00000  57001.00000  2.222935463122e-05
57001.00000  58001.00000  2.270252508167e-05
58001.00000  59001.00000  2.071327788183e-05
59001.00000  60001.00000  2.064568210320e-05
60001.00000  61001.00000  1.957380618484e-05
61001.00000  62001.00000  1.953518002562e-05
62001.00000  63001.00000  1.756524590539e-05
63001.00000  64001.00000  1.736245856948e-05
64001.00000  65001.00000  1.699551005689e-05
65001.00000  66001.00000  1.673478348215e-05
66001.00000  67001.00000  1.581741220067e-05
67001.00000  68001.00000  1.603951261619e-05
68001.00000  69001.00000  1.485175822017e-05
69001.00000  70001.00000  1.435927469011e-05
70001.00000  71001.00000  1.475519282212e-05
71001.00000  72001.00000  1.370262998337e-05
72001.00000  73001.00000  1.351915572707e-05
73001.00000  74001.00000  1.299770257760e-05
74001.00000  75001.00000  1.284319794072e-05
75001.00000  76001.00000  1.265972368442e-05
76001.00000  77001.00000  1.214792707475e-05
77001.00000  78001.00000  1.209964437573e-05
78001.00000  79001.00000  1.147196928840e-05
79001.00000  80001.00000  1.124021233308e-05
80001.00000  81001.00000  1.085395074088e-05
81001.00000  82001.00000  1.026490181277e-05
82001.00000  83001.00000  1.042906298945e-05
83001.00000  84001.00000  9.675852884660e-06
84001.00000  85001.00000  9.444095929338e-06
85001.00000  86001.00000  9.019208177916e-06
86001.00000  87001.00000  8.719855443960e-06
87001.00000  88001.00000  8.526724647859e-06
88001.00000  89001.00000  8.603976966299e-06
89001.00000  90001.00000  8.806764302205e-06
90001.00000  91001.00000  8.063210737216e-06
91001.00000  92001.00000  7.474161809108e-06
92001.00000  93001.00000  7.918362640141e-06
93001.00000  94001.00000  7.783171082870e-06
94001.00000  95001.00000  7.203778694567e-06
95001.00000  96001.00000  7.367939871253e-06
96001.00000  97001.00000  7.010647898466e-06
97001.00000  98001.00000  6.778890943145e-06
98001.00000  99001.00000  6.576103607239e-06
99001.00000  100001.00000  6.914082500415e-06
100001.00000  101001.00000  6.431255510163e-06
101001.00000  102001.00000  6.431255510163e-06
102001.00000  103001.00000  6.373316271333e-06
103001.00000  104001.00000  5.938771980105e-06
104001.00000  105001.00000  5.851863121860e-06
105001.00000  106001.00000  5.475258069463e-06
106001.00000  107001.00000  5.513884228683e-06
107001.00000  108001.00000  5.214531494727e-06
108001.00000  109001.00000  5.349723051997e-06
109001.00000  110001.00000  5.224188034532e-06
110001.00000  111001.00000  5.127622636481e-06
111001.00000  112001.00000  5.185561875312e-06
112001.00000  113001.00000  4.924835300575e-06
113001.00000  114001.00000  4.586856407399e-06
114001.00000  115001.00000  4.306816753052e-06
115001.00000  116001.00000  4.461321389933e-06
116001.00000  117001.00000  4.548230248178e-06
117001.00000  118001.00000  4.606169487009e-06
118001.00000  119001.00000  4.364755991882e-06
119001.00000  120001.00000  4.480634469543e-06
120001.00000  121001.00000  3.843302842410e-06
121001.00000  122001.00000  3.901242081240e-06
122001.00000  123001.00000  3.708111285139e-06
123001.00000  124001.00000  3.843302842410e-06
124001.00000  125001.00000  3.852959382215e-06
125001.00000  126001.00000  3.476354329818e-06
126001.00000  127001.00000  3.553606648258e-06
127001.00000  128001.00000  3.611545887089e-06
128001.00000  129001.00000  3.360475852157e-06
129001.00000  130001.00000  3.447384710403e-06
130001.00000  131001.00000  3.457041250208e-06
131001.00000  132001.00000  3.215627755081e-06
132001.00000  133001.00000  2.974214259955e-06
133001.00000  134001.00000  3.128718896836e-06
134001.00000  135001.00000  3.679141665724e-06
135001.00000  136001.00000  3.283223533717e-06
136001.00000  137001.00000  3.244597374497e-06
137001.00000  138001.00000  3.051466578396e-06
138001.00000  139001.00000  2.472074190093e-06
139001.00000  140001.00000  2.616922287168e-06
140001.00000  141001.00000  2.906618481320e-06
141001.00000  142001.00000  2.781083463854e-06
142001.00000  143001.00000  2.530013428923e-06
143001.00000  144001.00000  2.491387269703e-06
144001.00000  145001.00000  2.491387269703e-06
145001.00000  146001.00000  2.443104570678e-06
146001.00000  147001.00000  2.694174605609e-06
147001.00000  148001.00000  2.153408376526e-06
148001.00000  149001.00000  2.530013428923e-06
149001.00000  150001.00000  2.240317234771e-06
150001.00000  151001.00000  2.520356889118e-06
151001.00000  152001.00000  2.153408376526e-06
152001.00000  153001.00000  2.085812597891e-06
153001.00000  154001.00000  2.095469137696e-06
154001.00000  155001.00000  1.950621040620e-06
155001.00000  156001.00000  2.336882632822e-06
156001.00000  157001.00000  2.365852252237e-06
157001.00000  158001.00000  1.863712182375e-06
158001.00000  159001.00000  1.911994881400e-06
159001.00000  160001.00000  1.998903739645e-06
160001.00000  161001.00000  2.018216819255e-06
161001.00000  162001.00000  1.873368722180e-06
162001.00000  163001.00000  1.883025261985e-06
163001.00000  164001.00000  1.834742562959e-06
164001.00000  165001.00000  1.622298687248e-06
165001.00000  166001.00000  1.554702908613e-06
166001.00000  167001.00000  1.699551005689e-06
167001.00000  168001.00000  1.458137510562e-06
168001.00000  169001.00000  1.409854811537e-06
169001.00000  170001.00000  1.641611766858e-06
170001.00000  171001.00000  1.496763669783e-06
171001.00000  172001.00000  1.371228652317e-06
172001.00000  173001.00000  1.351915572707e-06
173001.00000  174001.00000  1.351915572707e-06
174001.00000  175001.00000  1.371228652317e-06
175001.00000  176001.00000  1.535389829003e-06
176001.00000  177001.00000  1.371228652317e-06
177001.00000  178001.00000  1.351915572707e-06
178001.00000  179001.00000  1.303632873682e-06
179001.00000  180001.00000  1.274663254267e-06
180001.00000  181001.00000  1.255350174656e-06
181001.00000  182001.00000  1.332602493097e-06
182001.00000  183001.00000  1.178097856216e-06
183001.00000  184001.00000  1.274663254267e-06
184001.00000  185001.00000  1.129815157191e-06
185001.00000  186001.00000  1.255350174656e-06
186001.00000  187001.00000  1.187754396021e-06
187001.00000  188001.00000  1.129815157191e-06
188001.00000  189001.00000  1.081532458166e-06
189001.00000  190001.00000  1.216724015436e-06
190001.00000  191001.00000  1.274663254267e-06
191001.00000  192001.00000  1.081532458166e-06
192001.00000  193001.00000  1.158784776606e-06
193001.00000  194001.00000  1.013936679530e-06
194001.00000  195001.00000  1.187754396021e-06
195001.00000  196001.00000  7.145839455737e-07
196001.00000  197001.00000  9.559974406999e-07
197001.00000  198001.00000  1.013936679530e-06
198001.00000  199001.00000  1.120158617386e-06
