300.00000  350.00000  2.288178275631e-01
350.00000  400.00000  1.615144648882e-01
400.00000  450.00000  1.201936656148e-01
450.00000  500.00000  9.177651241307e-02
500.00000  550.00000  7.194765084422e-02
550.00000  600.00000  5.734571432002e-02
600.00000  650.00000  4.728882561828e-02
650.00000  700.00000  4.051247064155e-02
700.00000  750.00000  3.446281110818e-02
750.00000  800.00000  3.054201708066e-02
800.00000  850.00000  2.739513769381e-02
850.00000  900.00000  2.460680407636e-02
900.00000  950.00000  2.206977262765e-02
950.00000  1000.00000  2.072682664313e-02
1000.00000  1050.00000  1.946151222028e-02
1050.00000  1100.00000  1.809535679979e-02
1100.00000  1150.00000  1.697890289729e-02
1150.00000  1200.00000  1.588085647847e-02
1200.00000  1250.00000  1.517336884420e-02
1250.00000  1300.00000  1.410013251211e-02
1300.00000  1350.00000  1.330300843548e-02
1350.00000  1400.00000  1.233381440255e-02
1400.00000  1450.00000  1.164313360121e-02
1450.00000  1500.00000  1.128378750643e-02
1500.00000  1550.00000  1.053708392862e-02
1550.00000  1600.00000  9.986460068458e-03
1600.00000  1650.00000  9.314186750818e-03
1650.00000  1700.00000  9.018066360906e-03
1700.00000  1750.00000  8.538671459398e-03
1750.00000  1800.00000  8.030464844278e-03
1800.00000  1850.00000  7.548668966637e-03
1850.00000  1900.00000  7.238943045296e-03
1900.00000  1950.00000  6.812369618746e-03
1950.00000  2000.00000  6.404203675893e-03
2000.00000  2050.00000  6.195318752198e-03
2050.00000  2100.00000  5.880790878588e-03
2100.00000  2150.00000  5.547055195903e-03
2150.00000  2200.00000  5.254936432881e-03
2200.00000  2250.00000  5.058056389858e-03
2250.00000  2300.00000  4.907595218768e-03
2300.00000  2350.00000  4.661095002300e-03
2350.00000  2400.00000  4.474619189193e-03
2400.00000  2450.00000  4.260932313229e-03
2450.00000  2500.00000  4.085661055416e-03
2500.00000  2550.00000  3.836759862813e-03
2550.00000  2600.00000  3.732717563655e-03
2600.00000  2650.00000  3.512628084666e-03
2650.00000  2700.00000  3.424592293070e-03
2700.00000  2750.00000  3.255723638282e-03
2750.00000  2800.00000  3.136475156939e-03
2800.00000  2850.00000  3.009223421814e-03
2850.00000  2900.00000  2.881171361312e-03
2900.00000  2950.00000  2.783531665178e-03
2950.00000  3000.00000  2.651477977785e-03
3000.00000  3050.00000  2.631469843331e-03
3050.00000  3100.00000  2.493813878291e-03
3100.00000  3150.00000  2.360159540141e-03
3150.00000  3200.00000  2.348154659469e-03
3200.00000  3250.00000  2.202495440647e-03
3250.00000  3300.00000  2.199294139135e-03
3300.00000  3350.00000  2.017620278296e-03
3350.00000  3400.00000  2.093651189220e-03
3400.00000  3450.00000  1.927183510566e-03
3450.00000  3500.00000  1.900772773088e-03
3500.00000  3550.00000  1.777522664854e-03
3550.00000  3600.00000  1.748710951241e-03
3600.00000  3650.00000  1.747110300484e-03
3650.00000  3700.00000  1.676681667208e-03
3700.00000  3750.00000  1.593447827881e-03
3750.00000  3800.00000  1.520618218470e-03
3800.00000  3850.00000  1.521418543848e-03
3850.00000  3900.00000  1.433382752253e-03
3900.00000  3950.00000  1.365355095110e-03
3950.00000  4000.00000  1.391765832589e-03
4000.00000  4050.00000  1.350148912926e-03
4050.00000  4100.00000  1.232501082339e-03
4100.00000  4150.00000  1.277319303515e-03
4150.00000  4200.00000  1.203689368726e-03
4200.00000  4250.00000  1.189283511919e-03
4250.00000  4300.00000  1.181280258138e-03
4300.00000  4350.00000  1.154069195281e-03
4350.00000  4400.00000  1.095645442677e-03
4400.00000  4450.00000  1.070835355954e-03
4450.00000  4500.00000  1.073236332089e-03
4500.00000  4550.00000  1.022815833266e-03
4550.00000  4600.00000  1.057229824526e-03
4600.00000  4650.00000  9.755966359553e-04
4650.00000  4700.00000  9.667930567957e-04
4700.00000  4750.00000  8.659520591498e-04
4750.00000  4800.00000  8.811582413345e-04
4800.00000  4850.00000  9.091696295695e-04
4850.00000  4900.00000  8.755559636875e-04
4900.00000  4950.00000  8.323383932678e-04
4950.00000  5000.00000  8.099292826798e-04
5000.00000  5050.00000  7.779162675542e-04
5050.00000  5100.00000  7.835185452012e-04
5100.00000  5150.00000  7.987247273859e-04
5150.00000  5200.00000  7.555071569662e-04
5200.00000  5250.00000  7.082879596558e-04
5250.00000  5300.00000  7.459032524285e-04
5300.00000  5350.00000  6.898804759585e-04
5350.00000  5400.00000  6.946824282274e-04
5400.00000  5450.00000  7.298967448656e-04
5450.00000  5500.00000  7.034860073869e-04
5500.00000  5550.00000  6.306563979760e-04
5550.00000  5600.00000  6.066466366317e-04
5600.00000  5650.00000  5.834372006656e-04
5650.00000  5700.00000  6.290557472197e-04
5700.00000  5750.00000  6.362586756230e-04
5750.00000  5800.00000  5.466222332711e-04
5800.00000  5850.00000  5.938414305815e-04
5850.00000  5900.00000  5.986433828503e-04
5900.00000  5950.00000  5.722326453716e-04
5950.00000  6000.00000  5.226124719268e-04
6000.00000  6050.00000  5.002033613388e-04
6050.00000  6100.00000  5.114079166328e-04
6100.00000  6150.00000  4.753932746164e-04
6150.00000  6200.00000  4.954014090700e-04
6200.00000  6250.00000  4.801952268853e-04
6250.00000  6300.00000  4.857975045323e-04
6300.00000  6350.00000  4.689906715913e-04
6350.00000  6400.00000  9.355803670482e-04
6400.00000  6450.00000  4.809955522634e-04
6450.00000  6500.00000  4.209711489028e-04
6500.00000  6550.00000  4.577861162973e-04
6550.00000  6600.00000  4.377779818437e-04
6600.00000  6650.00000  4.233721250372e-04
6650.00000  6700.00000  4.313753788186e-04
6700.00000  6750.00000  4.049646413399e-04
6750.00000  6800.00000  4.369776564656e-04
6800.00000  6850.00000  4.081659428525e-04
6850.00000  6900.00000  3.793542292394e-04
6900.00000  6950.00000  3.777535784831e-04
6950.00000  7000.00000  3.713509754580e-04
7000.00000  7050.00000  3.617470709202e-04
7050.00000  7100.00000  4.137682204995e-04
7100.00000  7150.00000  3.289337304164e-04
7150.00000  7200.00000  3.353363334416e-04
7200.00000  7250.00000  3.289337304164e-04
7250.00000  7300.00000  3.161285243661e-04
7300.00000  7350.00000  2.673086762995e-04
7350.00000  7400.00000  3.169288497443e-04
7400.00000  7450.00000  2.921187630219e-04
7450.00000  7500.00000  3.049239690722e-04
7500.00000  7550.00000  3.145278736099e-04
7550.00000  7600.00000  3.129272228536e-04
7600.00000  7650.00000  3.097259213410e-04
7650.00000  7700.00000  2.849158346186e-04
7700.00000  7750.00000  2.609060732743e-04
7750.00000  7800.00000  2.689093270558e-04
7800.00000  7850.00000  2.721106285683e-04
7850.00000  7900.00000  2.721106285683e-04
7900.00000  7950.00000  2.729109539465e-04
7950.00000  8000.00000  2.705099778120e-04
8000.00000  8050.00000  2.376966373082e-04
8050.00000  8100.00000  2.489011926022e-04
8100.00000  8150.00000  2.553037956273e-04
8150.00000  8200.00000  2.176885028547e-04
8200.00000  8250.00000  2.160878520984e-04
8250.00000  8300.00000  2.432989149552e-04
8300.00000  8350.00000  2.000813445355e-04
8350.00000  8400.00000  2.296933835268e-04
8400.00000  8450.00000  2.200894789891e-04
8450.00000  8500.00000  2.184888282328e-04
8500.00000  8550.00000  2.288930581487e-04
8550.00000  8600.00000  1.968800430230e-04
8600.00000  8650.00000  2.208898043672e-04
8650.00000  8700.00000  2.152875267202e-04
8700.00000  8750.00000  2.048832968044e-04
8750.00000  8800.00000  2.216901297454e-04
8800.00000  8850.00000  1.896771146197e-04
8850.00000  8900.00000  1.968800430230e-04
8900.00000  8950.00000  1.856754877290e-04
8950.00000  9000.00000  2.048832968044e-04
9000.00000  9050.00000  1.952793922667e-04
9050.00000  9100.00000  1.792728847038e-04
9100.00000  9150.00000  2.056836221825e-04
9150.00000  9200.00000  1.720699563006e-04
9200.00000  9250.00000  1.792728847038e-04
9250.00000  9300.00000  1.752712578131e-04
9300.00000  9350.00000  1.824741862164e-04
9350.00000  9400.00000  1.824741862164e-04
9400.00000  9450.00000  1.528621472251e-04
9450.00000  9500.00000  1.768719085694e-04
9500.00000  9550.00000  1.616657263847e-04
9550.00000  9600.00000  1.600650756284e-04
9600.00000  9650.00000  1.672680040317e-04
9650.00000  9700.00000  1.720699563006e-04
9700.00000  9750.00000  1.664676786536e-04
9750.00000  9800.00000  1.672680040317e-04
9800.00000  9850.00000  1.704693055443e-04
9850.00000  9900.00000  1.592647502503e-04
9900.00000  9950.00000  1.528621472251e-04
9950.00000  10000.00000  1.768719085694e-04
