300.00000  350.00000  2.183362115384e-02
350.00000  400.00000  1.729503539799e-02
400.00000  450.00000  1.413550444529e-02
450.00000  500.00000  1.181177012217e-02
500.00000  550.00000  1.014403112463e-02
550.00000  600.00000  8.706776971211e-03
600.00000  650.00000  7.636255809744e-03
650.00000  700.00000  6.659778631499e-03
700.00000  750.00000  6.000507183546e-03
750.00000  800.00000  5.335647056262e-03
800.00000  850.00000  4.889901701361e-03
850.00000  900.00000  4.478651987847e-03
900.00000  950.00000  4.063162586565e-03
950.00000  1000.00000  3.713388345690e-03
1000.00000  1050.00000  3.432605387588e-03
1050.00000  1100.00000  3.229293087795e-03
1100.00000  1150.00000  2.972984690900e-03
1150.00000  1200.00000  2.762542007134e-03
1200.00000  1250.00000  2.594110774889e-03
1250.00000  1300.00000  2.492743694613e-03
1300.00000  1350.00000  2.292900230267e-03
1350.00000  1400.00000  2.122541867218e-03
1400.00000  1450.00000  2.036591833372e-03
1450.00000  1500.00000  1.940235293186e-03
1500.00000  1550.00000  1.812466520900e-03
1550.00000  1600.00000  1.723047651607e-03
1600.00000  1650.00000  1.649431254905e-03
1650.00000  1700.00000  1.560975951014e-03
1700.00000  1750.00000  1.484276145026e-03
1750.00000  1800.00000  1.448238798996e-03
1800.00000  1850.00000  1.354194815775e-03
1850.00000  1900.00000  1.333189090014e-03
1900.00000  1950.00000  1.253020448579e-03
1950.00000  2000.00000  1.191159549780e-03
2000.00000  2050.00000  1.164565144689e-03
2050.00000  2100.00000  1.128527798659e-03
2100.00000  2150.00000  1.094224870353e-03
2150.00000  2200.00000  1.009816541150e-03
2200.00000  2250.00000  9.961339124433e-04
2250.00000  2300.00000  9.375491360102e-04
2300.00000  2350.00000  9.356220052065e-04
2350.00000  2400.00000  9.107620178385e-04
2400.00000  2450.00000  8.647035916296e-04
2450.00000  2500.00000  8.313642287252e-04
2500.00000  2550.00000  8.111293552861e-04
2550.00000  2600.00000  8.253901232337e-04
2600.00000  2650.00000  7.546644227371e-04
2650.00000  2700.00000  7.380910978251e-04
2700.00000  2750.00000  7.193979290290e-04
2750.00000  2800.00000  6.929962370180e-04
2800.00000  2850.00000  6.845168614817e-04
2850.00000  2900.00000  6.625475703193e-04
2900.00000  2950.00000  6.428908361213e-04
2950.00000  3000.00000  6.186089879944e-04
3000.00000  3050.00000  6.268956504504e-04
3050.00000  3100.00000  5.902801651797e-04
3100.00000  3150.00000  5.671545955351e-04
3150.00000  3200.00000  5.663837432136e-04
3200.00000  3250.00000  5.885457474564e-04
3250.00000  3300.00000  5.284192663803e-04
3300.00000  3350.00000  5.253358570943e-04
3350.00000  3400.00000  5.228305870495e-04
3400.00000  3450.00000  4.968143211993e-04
3450.00000  3500.00000  4.889130849040e-04
3500.00000  3550.00000  4.601988359286e-04
3550.00000  3600.00000  4.544174435174e-04
3600.00000  3650.00000  4.615478274912e-04
3650.00000  3700.00000  4.467089203025e-04
3700.00000  3750.00000  4.347607093194e-04
3750.00000  3800.00000  4.247396291401e-04
3800.00000  3850.00000  4.328335785157e-04
3850.00000  3900.00000  4.166456797645e-04
3900.00000  3950.00000  4.043120426206e-04
3950.00000  4000.00000  4.045047557010e-04
4000.00000  4050.00000  4.143331228000e-04
4050.00000  4100.00000  3.977597978880e-04
4100.00000  4150.00000  3.840771691816e-04
4150.00000  4200.00000  3.700091143144e-04
4200.00000  4250.00000  3.480398231520e-04
4250.00000  4300.00000  3.490033885539e-04
4300.00000  4350.00000  3.578681902510e-04
4350.00000  4400.00000  3.474616839109e-04
4400.00000  4450.00000  3.412948653390e-04
4450.00000  4500.00000  3.229871227036e-04
4500.00000  4550.00000  3.285758020344e-04
4550.00000  4600.00000  3.129660425243e-04
4600.00000  4650.00000  3.064137977916e-04
4650.00000  4700.00000  3.042939539075e-04
4700.00000  4750.00000  3.089190678365e-04
4750.00000  4800.00000  3.083409285953e-04
4800.00000  4850.00000  2.909967513619e-04
4850.00000  4900.00000  2.888769074778e-04
4900.00000  4950.00000  2.753869918517e-04
4950.00000  5000.00000  2.809756711825e-04
5000.00000  5050.00000  2.800121057806e-04
5050.00000  5100.00000  2.782776880573e-04
5100.00000  5150.00000  2.746161395302e-04
5150.00000  5200.00000  2.898404728796e-04
5200.00000  5250.00000  2.530322745286e-04
5250.00000  5300.00000  2.694128863602e-04
5300.00000  5350.00000  2.503342914033e-04
5350.00000  5400.00000  2.489852998407e-04
5400.00000  5450.00000  2.599699454220e-04
5450.00000  5500.00000  2.453237513137e-04
5500.00000  5550.00000  2.405059243044e-04
5550.00000  5600.00000  2.480217344389e-04
5600.00000  5650.00000  2.320265487680e-04
5650.00000  5700.00000  2.310629833661e-04
5700.00000  5750.00000  2.433966205100e-04
5750.00000  5800.00000  2.316411226073e-04
5800.00000  5850.00000  2.223908947494e-04
5850.00000  5900.00000  2.169949284990e-04
5900.00000  5950.00000  2.264378694372e-04
5950.00000  6000.00000  2.106353968467e-04
6000.00000  6050.00000  2.133333799719e-04
6050.00000  6100.00000  2.208491901064e-04
6100.00000  6150.00000  2.067811352393e-04
6150.00000  6200.00000  2.015778820692e-04
6200.00000  6250.00000  2.094791183645e-04
6250.00000  6300.00000  2.179584939008e-04
6300.00000  6350.00000  2.187293462223e-04
6350.00000  6400.00000  4.181873844074e-04
6400.00000  6450.00000  1.865462618002e-04
6450.00000  6500.00000  1.921349411310e-04
6500.00000  6550.00000  1.907859495684e-04
6550.00000  6600.00000  1.942547850151e-04
6600.00000  6650.00000  1.853899833180e-04
6650.00000  6700.00000  1.961819158188e-04
6700.00000  6750.00000  1.782595993442e-04
6750.00000  6800.00000  1.744053377367e-04
6800.00000  6850.00000  1.738271984956e-04
6850.00000  6900.00000  1.863535487198e-04
6900.00000  6950.00000  1.749834769779e-04
6950.00000  7000.00000  1.761397554601e-04
7000.00000  7050.00000  1.757543292993e-04
7050.00000  7100.00000  1.957964896580e-04
7100.00000  7150.00000  1.580247259051e-04
7150.00000  7200.00000  1.618789875126e-04
7200.00000  7250.00000  1.512797680921e-04
7250.00000  7300.00000  1.616862744322e-04
7300.00000  7350.00000  1.537850381369e-04
7350.00000  7400.00000  1.435712448772e-04
7400.00000  7450.00000  1.474255064847e-04
7450.00000  7500.00000  1.586028651462e-04
7500.00000  7550.00000  1.483890718865e-04
7550.00000  7600.00000  1.451129495202e-04
7600.00000  7650.00000  1.424149663950e-04
7650.00000  7700.00000  1.437639579576e-04
7700.00000  7750.00000  1.447275233594e-04
7750.00000  7800.00000  1.360554347427e-04
7800.00000  7850.00000  1.383679917072e-04
7850.00000  7900.00000  1.420295402342e-04
7900.00000  7950.00000  1.312376077334e-04
7950.00000  8000.00000  1.327793123764e-04
8000.00000  8050.00000  1.258416414830e-04
8050.00000  8100.00000  1.399096963501e-04
8100.00000  8150.00000  1.322011731353e-04
8150.00000  8200.00000  1.269979199652e-04
8200.00000  8250.00000  1.300813292512e-04
8250.00000  8300.00000  1.331647385371e-04
8300.00000  8350.00000  1.322011731353e-04
8350.00000  8400.00000  1.298886161708e-04
8400.00000  8450.00000  1.264197807241e-04
8450.00000  8500.00000  1.248780760811e-04
8500.00000  8550.00000  1.241072237596e-04
8550.00000  8600.00000  1.165914136251e-04
8600.00000  8650.00000  1.210238144737e-04
8650.00000  8700.00000  1.212165275540e-04
8700.00000  8750.00000  1.171695528662e-04
8750.00000  8800.00000  1.254562153222e-04
8800.00000  8850.00000  1.175549790270e-04
8850.00000  8900.00000  1.138934304999e-04
8900.00000  8950.00000  1.192893967503e-04
8950.00000  9000.00000  1.173622659466e-04
9000.00000  9050.00000  1.094610296513e-04
9050.00000  9100.00000  1.111954473747e-04
9100.00000  9150.00000  1.125444389373e-04
9150.00000  9200.00000  1.119662996962e-04
9200.00000  9250.00000  1.098464558121e-04
9250.00000  9300.00000  1.129298650980e-04
9300.00000  9350.00000  1.032942110794e-04
9350.00000  9400.00000  1.009816541150e-04
9400.00000  9450.00000  1.071484726869e-04
9450.00000  9500.00000  1.081120380887e-04
9500.00000  9550.00000  1.023306456776e-04
9550.00000  9600.00000  1.071484726869e-04
9600.00000  9650.00000  1.108100212140e-04
9650.00000  9700.00000  1.040650634009e-04
9700.00000  9750.00000  1.036796372402e-04
9750.00000  9800.00000  1.032942110794e-04
9800.00000  9850.00000  9.924723639163e-05
9850.00000  9900.00000  1.000180887131e-04
9900.00000  9950.00000  1.019452195168e-04
9950.00000  10000.00000  9.577840094493e-05
