300.00000  350.00000  7.730010266579e-07
350.00000  400.00000  4.444755903283e-06
400.00000  450.00000  8.116510779908e-06
450.00000  500.00000  6.879709137256e-05
500.00000  550.00000  2.539308372571e-04
550.00000  600.00000  1.329561765852e-04
600.00000  650.00000  4.431228385317e-04
650.00000  700.00000  9.824843048823e-04
700.00000  750.00000  1.537112541509e-03
750.00000  800.00000  2.320355831770e-03
800.00000  850.00000  3.449517081461e-03
850.00000  900.00000  3.777656017277e-03
900.00000  950.00000  4.356247285731e-03
950.00000  1000.00000  5.388976657346e-03
1000.00000  1050.00000  6.339767920135e-03
1050.00000  1100.00000  7.235096359262e-03
1100.00000  1150.00000  7.973312339720e-03
1150.00000  1200.00000  8.691043792972e-03
1200.00000  1250.00000  9.252629038839e-03
1250.00000  1300.00000  9.645120310125e-03
1300.00000  1350.00000  9.393315225691e-03
1350.00000  1400.00000  9.800107015969e-03
1400.00000  1450.00000  1.000186028393e-02
1450.00000  1500.00000  1.002910857012e-02
1500.00000  1550.00000  1.022815633448e-02
1550.00000  1600.00000  1.018834678161e-02
1600.00000  1650.00000  1.015491448721e-02
1650.00000  1700.00000  1.012051594152e-02
1700.00000  1750.00000  9.946977211034e-03
1750.00000  1800.00000  9.917023421251e-03
1800.00000  1850.00000  9.612074516235e-03
1850.00000  1900.00000  9.323551883035e-03
1900.00000  1950.00000  9.174749185403e-03
1950.00000  2000.00000  9.002756456972e-03
2000.00000  2050.00000  8.922557600456e-03
2050.00000  2100.00000  8.676163523209e-03
2100.00000  2150.00000  8.610651686200e-03
2150.00000  2200.00000  8.273236738063e-03
2200.00000  2250.00000  8.186080872308e-03
2250.00000  2300.00000  7.988579109997e-03
2300.00000  2350.00000  7.886929474991e-03
2350.00000  2400.00000  7.642467900310e-03
2400.00000  2450.00000  7.570192304318e-03
2450.00000  2500.00000  7.264470398275e-03
2500.00000  2550.00000  7.085327410347e-03
2550.00000  2600.00000  6.874684630582e-03
2600.00000  2650.00000  6.714673418064e-03
2650.00000  2700.00000  6.619014541015e-03
2700.00000  2750.00000  6.363344451448e-03
2750.00000  2800.00000  6.323148398062e-03
2800.00000  2850.00000  6.188259718910e-03
2850.00000  2900.00000  6.022450998692e-03
2900.00000  2950.00000  5.882731063124e-03
2950.00000  3000.00000  5.771612165542e-03
3000.00000  3050.00000  5.663778522323e-03
3050.00000  3100.00000  5.548987869864e-03
3100.00000  3150.00000  5.412359938402e-03
3150.00000  3200.00000  5.314575308530e-03
3200.00000  3250.00000  5.194953399655e-03
3250.00000  3300.00000  5.109343535952e-03
3300.00000  3350.00000  5.014650910187e-03
3350.00000  3400.00000  4.867394214608e-03
3400.00000  3450.00000  4.759560571390e-03
3450.00000  3500.00000  4.708735753887e-03
3500.00000  3550.00000  4.627377395831e-03
3550.00000  3600.00000  4.479154448969e-03
3600.00000  3650.00000  4.421952372997e-03
3650.00000  3700.00000  4.365716548307e-03
3700.00000  3750.00000  4.196429323469e-03
3750.00000  3800.00000  4.161644277270e-03
3800.00000  3850.00000  4.122607725424e-03
3850.00000  3900.00000  4.003758817575e-03
3900.00000  3950.00000  3.913124447199e-03
3950.00000  4000.00000  3.927424966192e-03
4000.00000  4050.00000  3.787511780367e-03
4050.00000  4100.00000  3.746156225441e-03
4100.00000  4150.00000  3.688374398698e-03
4150.00000  4200.00000  3.603730786279e-03
4200.00000  4250.00000  3.493964640494e-03
4250.00000  4300.00000  3.474059864057e-03
4300.00000  4350.00000  3.428839303998e-03
4350.00000  4400.00000  3.352505452616e-03
4400.00000  4450.00000  3.360042212625e-03
4450.00000  4500.00000  3.282548859703e-03
4500.00000  4550.00000  3.234816046307e-03
4550.00000  4600.00000  3.187469733424e-03
4600.00000  4650.00000  3.147660180551e-03
4650.00000  4700.00000  3.055286557866e-03
4700.00000  4750.00000  3.055673058379e-03
4750.00000  4800.00000  2.990934222396e-03
4800.00000  4850.00000  2.937210651044e-03
4850.00000  4900.00000  2.893729343294e-03
4900.00000  4950.00000  2.864935055051e-03
4950.00000  5000.00000  2.786668701102e-03
5000.00000  5050.00000  2.756714911319e-03
5050.00000  5100.00000  2.716712108189e-03
5100.00000  5150.00000  2.679221558396e-03
5150.00000  5200.00000  2.656418028110e-03
5200.00000  5250.00000  2.638445754240e-03
5250.00000  5300.00000  2.555154893618e-03
5300.00000  5350.00000  2.528293107941e-03
5350.00000  5400.00000  2.453505258612e-03
5400.00000  5450.00000  2.500078570468e-03
5450.00000  5500.00000  2.393211178533e-03
5500.00000  5550.00000  2.407318447270e-03
5550.00000  5600.00000  2.359972134387e-03
5600.00000  5650.00000  2.363257388750e-03
5650.00000  5700.00000  2.284218033774e-03
5700.00000  5750.00000  2.280353028641e-03
5750.00000  5800.00000  2.263347006054e-03
5800.00000  5850.00000  2.247113984495e-03
5850.00000  5900.00000  2.239963724998e-03
5900.00000  5950.00000  2.164402874642e-03
5950.00000  6000.00000  2.147976602826e-03
6000.00000  6050.00000  2.087875773003e-03
6050.00000  6100.00000  2.087489272490e-03
6100.00000  6150.00000  2.051931225264e-03
6150.00000  6200.00000  2.037244205757e-03
6200.00000  6250.00000  2.050771723724e-03
6250.00000  6300.00000  2.080918763763e-03
6300.00000  6350.00000  2.052317725777e-03
6350.00000  6400.00000  3.552132967750e-03
6400.00000  6450.00000  1.909119285588e-03
6450.00000  6500.00000  1.899650023012e-03
6500.00000  6550.00000  1.880131747089e-03
6550.00000  6600.00000  1.856941716289e-03
6600.00000  6650.00000  1.831046181896e-03
6650.00000  6700.00000  1.811527905973e-03
6700.00000  6750.00000  1.772877854640e-03
6750.00000  6800.00000  1.766500596170e-03
6800.00000  6850.00000  1.779834863880e-03
6850.00000  6900.00000  1.746016068964e-03
6900.00000  6950.00000  1.737126557157e-03
6950.00000  7000.00000  1.674706724254e-03
7000.00000  7050.00000  1.685915239141e-03
7050.00000  7100.00000  1.819837667009e-03
7100.00000  7150.00000  1.580980349772e-03
7150.00000  7200.00000  1.573443589762e-03
7200.00000  7250.00000  1.551606310759e-03
7250.00000  7300.00000  1.531121783553e-03
7300.00000  7350.00000  1.504259997876e-03
7350.00000  7400.00000  1.511410257373e-03
7400.00000  7450.00000  1.500201742486e-03
7450.00000  7500.00000  1.519333517896e-03
7500.00000  7550.00000  1.440873913690e-03
7550.00000  7600.00000  1.419809635714e-03
7600.00000  7650.00000  1.437202158814e-03
7650.00000  7700.00000  1.482615969130e-03
7700.00000  7750.00000  1.398552107481e-03
7750.00000  7800.00000  1.398552107481e-03
7800.00000  7850.00000  1.375555326938e-03
7850.00000  7900.00000  1.356423551528e-03
7900.00000  7950.00000  1.349659792545e-03
7950.00000  8000.00000  1.332267269445e-03
8000.00000  8050.00000  1.331687518675e-03
8050.00000  8100.00000  1.293423967855e-03
8100.00000  8150.00000  1.306564985309e-03
8150.00000  8200.00000  1.284534456049e-03
8200.00000  8250.00000  1.278736948349e-03
8250.00000  8300.00000  1.286466958615e-03
8300.00000  8350.00000  1.277577446809e-03
8350.00000  8400.00000  1.263276927816e-03
8400.00000  8450.00000  1.233709638546e-03
8450.00000  8500.00000  1.235255640599e-03
8500.00000  8550.00000  1.197765090806e-03
8550.00000  8600.00000  1.212645360570e-03
8600.00000  8650.00000  1.166072048714e-03
8650.00000  8700.00000  1.155636534854e-03
8700.00000  8750.00000  1.192933834390e-03
8750.00000  8800.00000  1.133992506107e-03
8800.00000  8850.00000  1.128001748151e-03
8850.00000  8900.00000  1.147520024074e-03
8900.00000  8950.00000  1.141529266117e-03
8950.00000  9000.00000  1.111961976847e-03
9000.00000  9050.00000  1.110609225051e-03
9050.00000  9100.00000  1.109256473254e-03
9100.00000  9150.00000  1.096115455801e-03
9150.00000  9200.00000  1.095922205544e-03
9200.00000  9250.00000  1.062103410628e-03
9250.00000  9300.00000  1.059591157291e-03
9300.00000  9350.00000  1.055146401388e-03
9350.00000  9400.00000  1.062876411655e-03
9400.00000  9450.00000  1.052440897795e-03
9450.00000  9500.00000  1.011085342869e-03
9500.00000  9550.00000  1.028477865968e-03
9550.00000  9600.00000  1.016882850569e-03
9600.00000  9650.00000  1.010312341842e-03
9650.00000  9700.00000  9.873155612989e-04
9700.00000  9750.00000  9.913738166888e-04
9750.00000  9800.00000  9.724352915357e-04
9800.00000  9850.00000  9.815180535989e-04
9850.00000  9900.00000  9.799720515456e-04
9900.00000  9950.00000  9.478925089393e-04
9950.00000  10000.00000  9.407422494427e-04
