300.00000  350.00000  2.303152668309e-06
350.00000  400.00000  7.293316782977e-06
400.00000  450.00000  5.757881670772e-06
450.00000  500.00000  6.909458004926e-06
500.00000  550.00000  5.796267548577e-05
550.00000  600.00000  6.909458004926e-06
600.00000  650.00000  1.573820990011e-05
650.00000  700.00000  5.757881670772e-06
700.00000  750.00000  1.381891600985e-05
750.00000  800.00000  1.036418700739e-05
800.00000  850.00000  3.416343124658e-05
850.00000  900.00000  1.228348089765e-05
900.00000  950.00000  7.293316782977e-06
950.00000  1000.00000  8.828751895183e-06
1000.00000  1050.00000  8.828751895183e-06
1050.00000  1100.00000  8.828751895183e-06
1100.00000  1150.00000  1.420277478790e-05
1150.00000  1200.00000  1.151576334154e-05
1200.00000  1250.00000  1.573820990011e-05
1250.00000  1300.00000  3.224413735632e-05
1300.00000  1350.00000  1.420277478790e-05
1350.00000  1400.00000  1.381891600985e-05
1400.00000  1450.00000  1.842522134647e-05
1450.00000  1500.00000  2.111223279283e-05
1500.00000  1550.00000  1.880908012452e-05
1550.00000  1600.00000  1.727364501231e-05
1600.00000  1650.00000  1.727364501231e-05
1650.00000  1700.00000  1.458663356595e-05
1700.00000  1750.00000  6.026582815408e-05
1750.00000  1800.00000  1.880908012452e-05
1800.00000  1850.00000  2.149609157088e-05
1850.00000  1900.00000  2.264766790503e-05
1900.00000  1950.00000  2.379924423919e-05
1950.00000  2000.00000  2.264766790503e-05
2000.00000  2050.00000  2.495082057334e-05
2050.00000  2100.00000  1.880908012452e-05
2100.00000  2150.00000  2.034451523673e-05
2150.00000  2200.00000  2.034451523673e-05
2200.00000  2250.00000  2.303152668309e-05
2250.00000  2300.00000  2.303152668309e-05
2300.00000  2350.00000  8.982295406404e-05
2350.00000  2400.00000  2.379924423919e-05
2400.00000  2450.00000  2.802169079776e-05
2450.00000  2500.00000  3.493114880268e-05
2500.00000  2550.00000  2.878940835386e-05
2550.00000  2600.00000  2.802169079776e-05
2600.00000  2650.00000  3.377957246853e-05
2650.00000  2700.00000  2.802169079776e-05
2700.00000  2750.00000  3.838587780514e-05
2750.00000  2800.00000  3.608272513684e-05
2800.00000  2850.00000  3.186027857827e-05
2850.00000  2900.00000  3.800201902709e-05
2900.00000  2950.00000  4.567919458812e-05
2950.00000  3000.00000  6.947843882731e-05
3000.00000  3050.00000  4.683077092228e-05
3050.00000  3100.00000  5.873039304187e-05
3100.00000  3150.00000  6.180126326628e-05
3150.00000  3200.00000  6.487213349069e-05
3200.00000  3250.00000  5.873039304187e-05
3250.00000  3300.00000  7.331702660782e-05
3300.00000  3350.00000  8.329735483716e-05
3350.00000  3400.00000  8.560050750547e-05
3400.00000  3450.00000  8.905523650793e-05
3450.00000  3500.00000  1.036418700739e-04
3500.00000  3550.00000  1.090158929666e-04
3550.00000  3600.00000  1.255218204228e-04
3600.00000  3650.00000  1.216832326423e-04
3650.00000  3700.00000  1.627561218938e-04
3700.00000  3750.00000  1.351182898741e-04
3750.00000  3800.00000  1.639076982280e-04
3800.00000  3850.00000  1.827167783525e-04
3850.00000  3900.00000  1.807974844622e-04
3900.00000  3950.00000  1.865553661330e-04
3950.00000  4000.00000  1.946164004721e-04
4000.00000  4050.00000  2.084353164819e-04
4050.00000  4100.00000  2.030612935892e-04
4100.00000  4150.00000  2.191833622674e-04
4150.00000  4200.00000  2.168802095991e-04
4200.00000  4250.00000  2.422148889505e-04
4250.00000  4300.00000  2.360731485016e-04
4300.00000  4350.00000  2.491243469554e-04
4350.00000  4400.00000  2.725397324165e-04
4400.00000  4450.00000  2.606401102969e-04
4450.00000  4500.00000  2.729235911946e-04
4500.00000  4550.00000  2.809846255337e-04
4550.00000  4600.00000  3.324217017925e-04
4600.00000  4650.00000  3.036322934387e-04
4650.00000  4700.00000  3.040161522167e-04
4700.00000  4750.00000  3.097740338875e-04
4750.00000  4800.00000  3.308862666803e-04
4800.00000  4850.00000  3.385634422414e-04
4850.00000  4900.00000  3.397150185755e-04
4900.00000  4950.00000  3.585240987000e-04
4950.00000  5000.00000  3.266638201218e-04
5000.00000  5050.00000  3.523823582512e-04
5050.00000  5100.00000  3.481599116927e-04
5100.00000  5150.00000  3.558370872537e-04
5150.00000  5200.00000  3.757977437124e-04
5200.00000  5250.00000  3.708075795977e-04
5250.00000  5300.00000  3.685044269294e-04
5300.00000  5350.00000  3.669689918172e-04
5350.00000  5400.00000  3.673528505952e-04
5400.00000  5450.00000  4.007485642857e-04
5450.00000  5500.00000  3.546855109195e-04
5500.00000  5550.00000  3.765654612685e-04
5550.00000  5600.00000  3.711914383757e-04
5600.00000  5650.00000  3.635142628147e-04
5650.00000  5700.00000  3.800201902709e-04
5700.00000  5750.00000  3.604433925903e-04
5750.00000  5800.00000  3.781008963807e-04
5800.00000  5850.00000  3.876973658320e-04
5850.00000  5900.00000  3.892328009442e-04
5900.00000  5950.00000  3.842426368295e-04
5950.00000  6000.00000  3.750300261563e-04
6000.00000  6050.00000  3.681205681513e-04
6050.00000  6100.00000  3.750300261563e-04
6100.00000  6150.00000  3.903843772783e-04
6150.00000  6200.00000  3.773331788246e-04
6200.00000  6250.00000  4.103450337370e-04
6250.00000  6300.00000  4.587112397715e-04
6300.00000  6350.00000  4.575596634373e-04
6350.00000  6400.00000  1.951538027614e-03
6400.00000  6450.00000  3.493114880268e-04
6450.00000  6500.00000  3.512307819171e-04
6500.00000  6550.00000  3.462406178024e-04
6550.00000  6600.00000  3.481599116927e-04
6600.00000  6650.00000  3.335732781267e-04
6650.00000  6700.00000  3.347248544609e-04
6700.00000  6750.00000  3.281992552340e-04
6750.00000  6800.00000  3.481599116927e-04
6800.00000  6850.00000  3.247445262315e-04
6850.00000  6900.00000  3.427858887999e-04
6900.00000  6950.00000  3.400988773536e-04
6950.00000  7000.00000  3.139964804461e-04
7000.00000  7050.00000  3.036322934387e-04
7050.00000  7100.00000  4.840459191229e-04
7100.00000  7150.00000  1.831006371305e-04
7150.00000  7200.00000  1.850199310208e-04
7200.00000  7250.00000  1.742718852354e-04
7250.00000  7300.00000  1.796459081281e-04
7300.00000  7350.00000  1.700494386768e-04
7350.00000  7400.00000  1.811813432403e-04
7400.00000  7450.00000  1.880908012452e-04
7450.00000  7500.00000  2.291636904967e-04
7500.00000  7550.00000  1.635238394499e-04
7550.00000  7600.00000  1.562305226669e-04
7600.00000  7650.00000  1.811813432403e-04
7650.00000  7700.00000  1.700494386768e-04
7700.00000  7750.00000  1.742718852354e-04
7750.00000  7800.00000  1.804136256842e-04
7800.00000  7850.00000  1.742718852354e-04
7850.00000  7900.00000  1.604529692255e-04
7900.00000  7950.00000  1.627561218938e-04
7950.00000  8000.00000  1.784943317939e-04
8000.00000  8050.00000  1.639076982280e-04
8050.00000  8100.00000  1.754234615695e-04
8100.00000  8150.00000  1.731203089012e-04
8150.00000  8200.00000  1.804136256842e-04
8200.00000  8250.00000  1.754234615695e-04
8250.00000  8300.00000  1.796459081281e-04
8300.00000  8350.00000  1.662108508963e-04
8350.00000  8400.00000  1.696655798987e-04
8400.00000  8450.00000  1.497049234401e-04
8450.00000  8500.00000  1.546950875547e-04
8500.00000  8550.00000  1.535435112206e-04
8550.00000  8600.00000  1.497049234401e-04
8600.00000  8650.00000  1.554628051108e-04
8650.00000  8700.00000  1.681301447865e-04
8700.00000  8750.00000  1.500887822181e-04
8750.00000  8800.00000  1.550789463328e-04
8800.00000  8850.00000  1.554628051108e-04
8850.00000  8900.00000  1.500887822181e-04
8900.00000  8950.00000  1.427954654351e-04
8950.00000  9000.00000  1.546950875547e-04
9000.00000  9050.00000  1.569982402230e-04
9050.00000  9100.00000  1.343505723180e-04
9100.00000  9150.00000  1.347344310961e-04
9150.00000  9200.00000  1.312797020936e-04
9200.00000  9250.00000  1.635238394499e-04
9250.00000  9300.00000  1.416438891010e-04
9300.00000  9350.00000  1.324312784277e-04
9350.00000  9400.00000  1.424116066571e-04
9400.00000  9450.00000  1.366537249863e-04
9450.00000  9500.00000  1.374214425424e-04
9500.00000  9550.00000  1.239863853106e-04
9550.00000  9600.00000  1.466340532156e-04
9600.00000  9650.00000  1.450986181034e-04
9650.00000  9700.00000  1.347344310961e-04
9700.00000  9750.00000  1.224509501984e-04
9750.00000  9800.00000  1.266733967570e-04
9800.00000  9850.00000  1.312797020936e-04
9850.00000  9900.00000  1.232186677545e-04
9900.00000  9950.00000  1.163092097496e-04
9950.00000  10000.00000  1.285926906472e-04
