300.00000  350.00000  0.000000000000e+00
350.00000  400.00000  1.743609745759e-06
400.00000  450.00000  9.686720809775e-07
450.00000  500.00000  1.162406497173e-06
500.00000  550.00000  2.150452019770e-05
550.00000  600.00000  2.324812994346e-06
600.00000  650.00000  6.974438983038e-06
650.00000  700.00000  2.712281826737e-06
700.00000  750.00000  6.199501318256e-06
750.00000  800.00000  4.262157156301e-06
800.00000  850.00000  2.053584811672e-05
850.00000  900.00000  3.099750659128e-06
900.00000  950.00000  2.324812994346e-06
950.00000  1000.00000  3.099750659128e-06
1000.00000  1050.00000  4.068422740105e-06
1050.00000  1100.00000  3.680953907714e-06
1100.00000  1150.00000  3.874688323910e-06
1150.00000  1200.00000  4.649625988692e-06
1200.00000  1250.00000  5.424563653474e-06
1250.00000  1300.00000  1.627369096042e-05
1300.00000  1350.00000  6.199501318256e-06
1350.00000  1400.00000  7.555642231624e-06
1400.00000  1450.00000  5.230829237278e-06
1450.00000  1500.00000  9.105517561188e-06
1500.00000  1550.00000  7.168173399233e-06
1550.00000  1600.00000  6.005766902060e-06
1600.00000  1650.00000  4.262157156301e-06
1650.00000  1700.00000  7.361907815429e-06
1700.00000  1750.00000  3.448472608280e-05
1750.00000  1800.00000  7.943111064015e-06
1800.00000  1850.00000  9.105517561188e-06
1850.00000  1900.00000  6.780704566842e-06
1900.00000  1950.00000  8.718048728797e-06
1950.00000  2000.00000  1.065539289075e-05
2000.00000  2050.00000  1.065539289075e-05
2050.00000  2100.00000  1.065539289075e-05
2100.00000  2150.00000  9.880455225970e-06
2150.00000  2200.00000  1.007418964217e-05
2200.00000  2250.00000  1.007418964217e-05
2250.00000  2300.00000  1.104286172314e-05
2300.00000  2350.00000  5.192082354039e-05
2350.00000  2400.00000  1.123659613934e-05
2400.00000  2450.00000  9.880455225970e-06
2450.00000  2500.00000  1.375514354988e-05
2500.00000  2550.00000  1.259273705271e-05
2550.00000  2600.00000  1.162406497173e-05
2600.00000  2650.00000  1.278647146890e-05
2650.00000  2700.00000  1.278647146890e-05
2700.00000  2750.00000  1.414261238227e-05
2750.00000  2800.00000  1.007418964217e-05
2800.00000  2850.00000  9.105517561188e-06
2850.00000  2900.00000  1.220526822032e-05
2900.00000  2950.00000  1.336767471749e-05
2950.00000  3000.00000  3.080377217508e-05
3000.00000  3050.00000  1.549875329564e-05
3050.00000  3100.00000  1.181779938793e-05
3100.00000  3150.00000  1.821103512238e-05
3150.00000  3200.00000  2.111705136531e-05
3200.00000  3250.00000  1.549875329564e-05
3250.00000  3300.00000  1.840476953857e-05
3300.00000  3350.00000  2.014837928433e-05
3350.00000  3400.00000  2.111705136531e-05
3400.00000  3450.00000  2.169825461390e-05
3450.00000  3500.00000  2.654161501878e-05
3500.00000  3550.00000  3.002883451030e-05
3550.00000  3600.00000  3.041630334269e-05
3600.00000  3650.00000  3.661580466095e-05
3650.00000  3700.00000  7.342534373809e-05
3700.00000  3750.00000  4.940227612985e-05
3750.00000  3800.00000  5.947646577202e-05
3800.00000  3850.00000  5.947646577202e-05
3850.00000  3900.00000  6.586970150647e-05
3900.00000  3950.00000  7.245667165711e-05
3950.00000  4000.00000  7.613762556483e-05
4000.00000  4050.00000  9.221758210906e-05
4050.00000  4100.00000  8.330579896406e-05
4100.00000  4150.00000  9.163637886047e-05
4150.00000  4200.00000  9.725467693014e-05
4200.00000  4250.00000  1.141095711391e-04
4250.00000  4300.00000  1.272835114404e-04
4300.00000  4350.00000  1.317394030129e-04
4350.00000  4400.00000  1.466569530600e-04
4400.00000  4450.00000  1.489817660543e-04
4450.00000  4500.00000  1.623494407718e-04
4500.00000  4550.00000  1.702925518358e-04
4550.00000  4600.00000  1.917970720335e-04
4600.00000  4650.00000  1.914096032011e-04
4650.00000  4700.00000  2.134953266474e-04
4700.00000  4750.00000  2.196948279657e-04
4750.00000  4800.00000  2.344186435965e-04
4800.00000  4850.00000  2.320938306022e-04
4850.00000  4900.00000  2.535983507999e-04
4900.00000  4950.00000  2.627038683611e-04
4950.00000  5000.00000  2.851770606398e-04
5000.00000  5050.00000  2.805274346511e-04
5050.00000  5100.00000  2.952512502819e-04
5100.00000  5150.00000  3.004820795192e-04
5150.00000  5200.00000  3.281861010352e-04
5200.00000  5250.00000  3.370978841802e-04
5250.00000  5300.00000  3.452347296604e-04
5300.00000  5350.00000  3.442660575794e-04
5350.00000  5400.00000  3.675141875229e-04
5400.00000  5450.00000  4.062610707620e-04
5450.00000  5500.00000  3.903748486339e-04
5500.00000  5550.00000  3.859189570614e-04
5550.00000  5600.00000  3.903748486339e-04
5600.00000  5650.00000  4.211786208090e-04
5650.00000  5700.00000  4.236971682195e-04
5700.00000  5750.00000  4.469452981630e-04
5750.00000  5800.00000  4.531447994813e-04
5800.00000  5850.00000  4.709683657712e-04
5850.00000  5900.00000  4.796864145000e-04
5900.00000  5950.00000  4.740681164304e-04
5950.00000  6000.00000  4.647688644530e-04
6000.00000  6050.00000  4.756179917599e-04
6050.00000  6100.00000  4.820112274944e-04
6100.00000  6150.00000  5.170771568258e-04
6150.00000  6200.00000  5.192082354039e-04
6200.00000  6250.00000  5.901150317315e-04
6250.00000  6300.00000  6.813639417596e-04
6300.00000  6350.00000  6.509476384169e-04
6350.00000  6400.00000  2.769239745098e-03
6400.00000  6450.00000  5.316072380404e-04
6450.00000  6500.00000  5.335445822024e-04
6500.00000  6550.00000  5.350944575320e-04
6550.00000  6600.00000  5.411002244340e-04
6600.00000  6650.00000  5.587300563078e-04
6650.00000  6700.00000  5.653170264585e-04
6700.00000  6750.00000  5.558240400649e-04
6750.00000  6800.00000  5.691917147824e-04
6800.00000  6850.00000  5.525305549895e-04
6850.00000  6900.00000  5.934085168068e-04
6900.00000  6950.00000  5.978644083793e-04
6950.00000  7000.00000  5.765536225978e-04
7000.00000  7050.00000  5.691917147824e-04
7050.00000  7100.00000  8.214339246689e-04
7100.00000  7150.00000  3.010632827678e-04
7150.00000  7200.00000  2.768464807434e-04
7200.00000  7250.00000  2.770402151596e-04
7250.00000  7300.00000  2.836271853102e-04
7300.00000  7350.00000  2.729717924195e-04
7350.00000  7400.00000  2.811086378997e-04
7400.00000  7450.00000  2.937013749524e-04
7450.00000  7500.00000  3.677079219390e-04
7500.00000  7550.00000  3.055191743403e-04
7550.00000  7600.00000  3.006758139354e-04
7600.00000  7650.00000  3.221803341331e-04
7650.00000  7700.00000  3.150121607339e-04
7700.00000  7750.00000  3.258612880408e-04
7750.00000  7800.00000  3.192743178902e-04
7800.00000  7850.00000  3.264424912894e-04
7850.00000  7900.00000  3.169495048958e-04
7900.00000  7950.00000  3.320607893591e-04
7950.00000  8000.00000  3.336106646886e-04
8000.00000  8050.00000  3.289610386999e-04
8050.00000  8100.00000  3.471720738223e-04
8100.00000  8150.00000  3.398101660069e-04
8150.00000  8200.00000  3.403913692555e-04
8200.00000  8250.00000  3.677079219390e-04
8250.00000  8300.00000  3.392289627583e-04
8300.00000  8350.00000  3.450409952442e-04
8350.00000  8400.00000  3.456221984928e-04
8400.00000  8450.00000  3.334169302724e-04
8450.00000  8500.00000  3.417475101689e-04
8500.00000  8550.00000  3.448472608280e-04
8550.00000  8600.00000  3.558901225511e-04
8600.00000  8650.00000  3.419412445850e-04
8650.00000  8700.00000  3.626708271180e-04
8700.00000  8750.00000  3.553089193025e-04
8750.00000  8800.00000  3.673204531067e-04
8800.00000  8850.00000  3.539527783892e-04
8850.00000  8900.00000  3.591836076264e-04
8900.00000  8950.00000  3.690640628524e-04
8950.00000  9000.00000  3.684828596038e-04
9000.00000  9050.00000  3.837878784833e-04
9050.00000  9100.00000  3.801069245756e-04
9100.00000  9150.00000  3.940558025416e-04
9150.00000  9200.00000  3.801069245756e-04
9200.00000  9250.00000  3.750698297545e-04
9250.00000  9300.00000  3.791382524946e-04
9300.00000  9350.00000  3.715826102630e-04
9350.00000  9400.00000  3.742948920897e-04
9400.00000  9450.00000  3.686765940200e-04
9450.00000  9500.00000  3.744886265059e-04
9500.00000  9550.00000  3.711951414306e-04
9550.00000  9600.00000  3.799131901594e-04
9600.00000  9650.00000  3.837878784833e-04
9650.00000  9700.00000  3.921184583797e-04
9700.00000  9750.00000  3.684828596038e-04
9750.00000  9800.00000  3.675141875229e-04
9800.00000  9850.00000  3.597648108750e-04
9850.00000  9900.00000  3.810755966565e-04
9900.00000  9950.00000  3.748760953383e-04
9950.00000  10000.00000  3.863064258938e-04
