300.00000  350.00000  0.000000000000e+00
350.00000  400.00000  2.904544164473e-06
400.00000  450.00000  2.178408123354e-06
450.00000  500.00000  1.089204061677e-06
500.00000  550.00000  4.683577465212e-05
550.00000  600.00000  1.815340102795e-06
600.00000  650.00000  1.270738071957e-05
650.00000  700.00000  2.904544164473e-06
700.00000  750.00000  1.270738071957e-05
750.00000  800.00000  4.719884267268e-06
800.00000  850.00000  4.974031881659e-05
850.00000  900.00000  9.439768534536e-06
900.00000  950.00000  6.535224370063e-06
950.00000  1000.00000  6.172156349504e-06
1000.00000  1050.00000  6.535224370063e-06
1050.00000  1100.00000  1.052897259621e-05
1100.00000  1150.00000  9.802836555095e-06
1150.00000  1200.00000  1.016590457565e-05
1200.00000  1250.00000  1.561192488404e-05
1250.00000  1300.00000  4.102668632317e-05
1300.00000  1350.00000  2.396248935690e-05
1350.00000  1400.00000  3.594373403535e-05
1400.00000  1450.00000  5.119259089883e-05
1450.00000  1500.00000  9.693916148927e-05
1500.00000  1550.00000  1.270738071957e-04
1550.00000  1600.00000  1.873430986085e-04
1600.00000  1650.00000  2.592305666792e-04
1650.00000  1700.00000  3.474560956750e-04
1700.00000  1750.00000  5.297162419957e-04
1750.00000  1800.00000  5.380668064685e-04
1800.00000  1850.00000  6.019667780869e-04
1850.00000  1900.00000  6.328275598345e-04
1900.00000  1950.00000  7.471939863106e-04
1950.00000  2000.00000  8.924211945342e-04
2000.00000  2050.00000  1.001704668722e-03
2050.00000  2100.00000  1.077585885019e-03
2100.00000  2150.00000  1.195946059722e-03
2150.00000  2200.00000  1.290343745067e-03
2200.00000  2250.00000  1.358237464911e-03
2250.00000  2300.00000  1.478776047737e-03
2300.00000  2350.00000  1.688266295600e-03
2350.00000  2400.00000  1.531783978739e-03
2400.00000  2450.00000  1.642156656989e-03
2450.00000  2500.00000  1.608754399097e-03
2500.00000  2550.00000  1.515445917814e-03
2550.00000  2600.00000  1.572084529021e-03
2600.00000  2650.00000  1.622914051899e-03
2650.00000  2700.00000  1.689355499661e-03
2700.00000  2750.00000  1.608028263056e-03
2750.00000  2800.00000  1.665029942284e-03
2800.00000  2850.00000  1.634895296577e-03
2850.00000  2900.00000  1.648691881359e-03
2900.00000  2950.00000  1.681731071230e-03
2950.00000  3000.00000  1.669749826551e-03
3000.00000  3050.00000  1.607665195036e-03
3050.00000  3100.00000  1.575715209226e-03
3100.00000  3150.00000  1.528153298533e-03
3150.00000  3200.00000  1.516898189896e-03
3200.00000  3250.00000  1.456628898483e-03
3250.00000  3300.00000  1.450819810154e-03
3300.00000  3350.00000  1.422137436530e-03
3350.00000  3400.00000  1.357148260850e-03
3400.00000  3450.00000  1.349886900439e-03
3450.00000  3500.00000  1.359689736994e-03
3500.00000  3550.00000  1.331007363370e-03
3550.00000  3600.00000  1.301961921725e-03
3600.00000  3650.00000  1.217730140955e-03
3650.00000  3700.00000  1.198850603886e-03
3700.00000  3750.00000  1.184690951084e-03
3750.00000  3800.00000  1.120790979466e-03
3800.00000  3850.00000  1.112077346972e-03
3850.00000  3900.00000  1.086662585533e-03
3900.00000  3950.00000  1.065604640341e-03
3950.00000  4000.00000  1.000978532681e-03
4000.00000  4050.00000  1.011144437257e-03
4050.00000  4100.00000  9.232819762817e-04
4100.00000  4150.00000  9.341740168985e-04
4150.00000  4200.00000  8.659172290334e-04
4200.00000  4250.00000  8.648280249717e-04
4250.00000  4300.00000  8.172661142785e-04
4300.00000  4350.00000  8.114570259495e-04
4350.00000  4400.00000  7.958451010655e-04
4400.00000  4450.00000  7.991127132505e-04
4450.00000  4500.00000  7.638951152563e-04
4500.00000  4550.00000  7.424741020433e-04
4550.00000  4600.00000  7.203269527892e-04
4600.00000  4650.00000  6.847462867744e-04
4650.00000  4700.00000  6.829309466716e-04
4700.00000  4750.00000  6.495286887802e-04
4750.00000  4800.00000  6.259292674438e-04
4800.00000  4850.00000  6.252031314027e-04
4850.00000  4900.00000  6.157633628682e-04
4900.00000  4950.00000  5.714690643600e-04
4950.00000  5000.00000  5.623923638460e-04
5000.00000  5050.00000  5.264486298107e-04
5050.00000  5100.00000  5.159196572144e-04
5100.00000  5150.00000  4.865111475492e-04
5150.00000  5200.00000  4.912310318164e-04
5200.00000  5250.00000  4.865111475492e-04
5250.00000  5300.00000  4.618225221511e-04
5300.00000  5350.00000  4.327770805064e-04
5350.00000  5400.00000  4.560134338222e-04
5400.00000  5450.00000  4.469367333082e-04
5450.00000  5500.00000  4.269679921775e-04
5500.00000  5550.00000  4.113560672934e-04
5550.00000  5600.00000  4.001009586561e-04
5600.00000  5650.00000  3.964702784505e-04
5650.00000  5700.00000  3.692401769086e-04
5700.00000  5750.00000  3.703293809703e-04
5750.00000  5800.00000  3.754123332581e-04
5800.00000  5850.00000  3.412839393255e-04
5850.00000  5900.00000  3.619788164974e-04
5900.00000  5950.00000  3.187737220509e-04
5950.00000  6000.00000  3.100600895574e-04
6000.00000  6050.00000  3.067924773724e-04
6050.00000  6100.00000  2.919066885295e-04
6100.00000  6150.00000  3.115123616397e-04
6150.00000  6200.00000  2.773839677071e-04
6200.00000  6250.00000  2.890021443650e-04
6250.00000  6300.00000  2.726640834399e-04
6300.00000  6350.00000  2.755686276043e-04
6350.00000  6400.00000  8.673695011156e-04
6400.00000  6450.00000  2.534214783502e-04
6450.00000  6500.00000  2.643135189670e-04
6500.00000  6550.00000  2.457970499185e-04
6550.00000  6600.00000  2.309112610756e-04
6600.00000  6650.00000  2.258283087877e-04
6650.00000  6700.00000  2.316373971167e-04
6700.00000  6750.00000  2.174777443149e-04
6750.00000  6800.00000  2.080379757803e-04
6800.00000  6850.00000  2.065857036981e-04
6850.00000  6900.00000  2.069487717187e-04
6900.00000  6950.00000  1.851646904851e-04
6950.00000  7000.00000  2.073118397392e-04
7000.00000  7050.00000  1.818970783001e-04
7050.00000  7100.00000  2.512430702269e-04
7100.00000  7150.00000  1.597499290460e-04
7150.00000  7200.00000  1.575715209226e-04
7200.00000  7250.00000  1.731834458067e-04
7250.00000  7300.00000  1.539408407170e-04
7300.00000  7350.00000  1.575715209226e-04
7350.00000  7400.00000  1.481317523881e-04
7400.00000  7450.00000  1.535777726965e-04
7450.00000  7500.00000  1.568453848815e-04
7500.00000  7550.00000  1.437749361414e-04
7550.00000  7600.00000  1.474056163470e-04
7600.00000  7650.00000  1.474056163470e-04
7650.00000  7700.00000  1.307044874013e-04
7700.00000  7750.00000  1.248953990723e-04
7750.00000  7800.00000  1.165448345995e-04
7800.00000  7850.00000  1.299783513601e-04
7850.00000  7900.00000  1.230800589695e-04
7900.00000  7950.00000  1.212647188667e-04
7950.00000  8000.00000  1.176340386611e-04
8000.00000  8050.00000  1.230800589695e-04
8050.00000  8100.00000  1.034743858593e-04
8100.00000  8150.00000  1.176340386611e-04
8150.00000  8200.00000  1.114618823116e-04
8200.00000  8250.00000  1.063789300238e-04
8250.00000  8300.00000  1.132772224144e-04
8300.00000  8350.00000  1.060158620032e-04
8350.00000  8400.00000  1.089204061677e-04
8400.00000  8450.00000  1.060158620032e-04
8450.00000  8500.00000  9.839143357151e-05
8500.00000  8550.00000  9.584995742759e-05
8550.00000  8600.00000  9.657609346871e-05
8600.00000  8650.00000  9.439768534536e-05
8650.00000  8700.00000  7.878576046132e-05
8700.00000  8750.00000  1.005698416949e-04
8750.00000  8800.00000  9.548688940704e-05
8800.00000  8850.00000  1.005698416949e-04
8850.00000  8900.00000  8.532098483138e-05
8900.00000  8950.00000  8.096416858467e-05
8950.00000  9000.00000  7.733348837908e-05
9000.00000  9050.00000  8.169030462579e-05
9050.00000  9100.00000  8.786246097529e-05
9100.00000  9150.00000  8.205337264635e-05
9150.00000  9200.00000  8.568405285194e-05
9200.00000  9250.00000  7.842269244076e-05
9250.00000  9300.00000  7.588121629685e-05
9300.00000  9350.00000  6.825678786511e-05
9350.00000  9400.00000  7.624428431740e-05
9400.00000  9450.00000  7.116133202958e-05
9450.00000  9500.00000  7.043519598846e-05
9500.00000  9550.00000  6.825678786511e-05
9550.00000  9600.00000  6.680451578287e-05
9600.00000  9650.00000  7.442894421461e-05
9650.00000  9700.00000  6.898292390622e-05
9700.00000  9750.00000  7.697042035852e-05
9750.00000  9800.00000  5.300793100162e-05
9800.00000  9850.00000  5.990622339225e-05
9850.00000  9900.00000  5.627554318666e-05
9900.00000  9950.00000  5.518633912498e-05
9950.00000  10000.00000  5.845395131001e-05
