300.00000  350.00000  0.000000000000e+00
350.00000  400.00000  2.017071181922e-07
400.00000  450.00000  0.000000000000e+00
450.00000  500.00000  0.000000000000e+00
500.00000  550.00000  2.218778300114e-06
550.00000  600.00000  0.000000000000e+00
600.00000  650.00000  8.068284727689e-07
650.00000  700.00000  4.034142363844e-07
700.00000  750.00000  1.008535590961e-06
750.00000  800.00000  1.210242709153e-06
800.00000  850.00000  9.681941673227e-06
850.00000  900.00000  3.025606772883e-06
900.00000  950.00000  1.815364063730e-06
950.00000  1000.00000  2.823899654691e-06
1000.00000  1050.00000  4.639263718421e-06
1050.00000  1100.00000  1.028706302780e-05
1100.00000  1150.00000  2.581851112860e-05
1150.00000  1200.00000  4.578751582963e-05
1200.00000  1250.00000  8.552381811350e-05
1250.00000  1300.00000  1.633827657357e-04
1300.00000  1350.00000  1.482547318713e-04
1350.00000  1400.00000  2.307529432119e-04
1400.00000  1450.00000  3.422969795722e-04
1450.00000  1500.00000  4.641280789603e-04
1500.00000  1550.00000  6.174254887864e-04
1550.00000  1600.00000  7.499470654387e-04
1600.00000  1650.00000  9.028410610284e-04
1650.00000  1700.00000  1.095067944666e-03
1700.00000  1750.00000  1.384719366390e-03
1750.00000  1800.00000  1.452896372339e-03
1800.00000  1850.00000  1.533579219615e-03
1850.00000  1900.00000  1.539630433161e-03
1900.00000  1950.00000  1.777443125510e-03
1950.00000  2000.00000  1.923882493317e-03
2000.00000  2050.00000  2.057009191324e-03
2050.00000  2100.00000  2.188320525267e-03
2100.00000  2150.00000  2.355939140485e-03
2150.00000  2200.00000  2.473736097509e-03
2200.00000  2250.00000  2.573984535251e-03
2250.00000  2300.00000  2.726878530841e-03
2300.00000  2350.00000  2.931409548688e-03
2350.00000  2400.00000  2.861215471557e-03
2400.00000  2450.00000  2.936048812406e-03
2450.00000  2500.00000  2.956017817107e-03
2500.00000  2550.00000  2.874326434239e-03
2550.00000  2600.00000  2.915676393469e-03
2600.00000  2650.00000  3.023387994583e-03
2650.00000  2700.00000  3.038516028448e-03
2700.00000  2750.00000  3.068166974822e-03
2750.00000  2800.00000  3.121215946906e-03
2800.00000  2850.00000  3.109718641169e-03
2850.00000  2900.00000  3.140781537371e-03
2900.00000  2950.00000  3.106693034397e-03
2950.00000  3000.00000  3.222876334475e-03
3000.00000  3050.00000  3.168011998327e-03
3050.00000  3100.00000  3.149253236335e-03
3100.00000  3150.00000  3.113147662179e-03
3150.00000  3200.00000  3.092573536123e-03
3200.00000  3250.00000  3.102457184915e-03
3250.00000  3300.00000  3.039524564039e-03
3300.00000  3350.00000  3.041138220984e-03
3350.00000  3400.00000  3.045374070466e-03
3400.00000  3450.00000  2.986475591954e-03
3450.00000  3500.00000  2.989299491609e-03
3500.00000  3550.00000  2.963884394716e-03
3550.00000  3600.00000  2.945125632725e-03
3600.00000  3650.00000  2.905187623323e-03
3650.00000  3700.00000  2.845482316338e-03
3700.00000  3750.00000  2.895102267413e-03
3750.00000  3800.00000  2.838422567201e-03
3800.00000  3850.00000  2.798686264917e-03
3850.00000  3900.00000  2.751083385024e-03
3900.00000  3950.00000  2.736560472514e-03
3950.00000  4000.00000  2.674232972992e-03
4000.00000  4050.00000  2.681292722129e-03
4050.00000  4100.00000  2.619973758199e-03
4100.00000  4150.00000  2.630865942581e-03
4150.00000  4200.00000  2.566521371878e-03
4200.00000  4250.00000  2.517103127921e-03
4250.00000  4300.00000  2.502983629647e-03
4300.00000  4350.00000  2.473534390391e-03
4350.00000  4400.00000  2.451144900272e-03
4400.00000  4450.00000  2.377723509250e-03
4450.00000  4500.00000  2.413627376288e-03
4500.00000  4550.00000  2.328910386647e-03
4550.00000  4600.00000  2.380143994668e-03
4600.00000  4650.00000  2.284938234881e-03
4650.00000  4700.00000  2.276264828799e-03
4700.00000  4750.00000  2.252866803089e-03
4750.00000  4800.00000  2.199212709650e-03
4800.00000  4850.00000  2.187311989676e-03
4850.00000  4900.00000  2.163913963966e-03
4900.00000  4950.00000  2.132649360646e-03
4950.00000  5000.00000  2.125993025746e-03
5000.00000  5050.00000  2.080608924153e-03
5050.00000  5100.00000  2.056000655733e-03
5100.00000  5150.00000  2.027559952068e-03
5150.00000  5200.00000  1.972695615920e-03
5200.00000  5250.00000  1.957970996292e-03
5250.00000  5300.00000  1.943044669546e-03
5300.00000  5350.00000  1.904518609971e-03
5350.00000  5400.00000  1.857924265669e-03
5400.00000  5450.00000  1.869623278524e-03
5450.00000  5500.00000  1.854898658896e-03
5500.00000  5550.00000  1.809312850184e-03
5550.00000  5600.00000  1.783292631937e-03
5600.00000  5650.00000  1.756868999454e-03
5650.00000  5700.00000  1.754851928272e-03
5700.00000  5750.00000  1.750010957436e-03
5750.00000  5800.00000  1.702811491779e-03
5800.00000  5850.00000  1.692726135869e-03
5850.00000  5900.00000  1.670941767104e-03
5900.00000  5950.00000  1.614665481129e-03
5950.00000  6000.00000  1.635643021421e-03
6000.00000  6050.00000  1.619909866202e-03
6050.00000  6100.00000  1.575937714436e-03
6100.00000  6150.00000  1.548303839243e-03
6150.00000  6200.00000  1.545479939589e-03
6200.00000  6250.00000  1.542656039934e-03
6250.00000  6300.00000  1.519056307106e-03
6300.00000  6350.00000  1.515223871860e-03
6350.00000  6400.00000  2.082424288216e-03
6400.00000  6450.00000  1.443617844902e-03
6450.00000  6500.00000  1.442609309311e-03
6500.00000  6550.00000  1.411949827346e-03
6550.00000  6600.00000  1.391375701290e-03
6600.00000  6650.00000  1.389762044344e-03
6650.00000  6700.00000  1.379071567080e-03
6700.00000  6750.00000  1.341352335978e-03
6750.00000  6800.00000  1.339940386151e-03
6800.00000  6850.00000  1.309886025540e-03
6850.00000  6900.00000  1.316945774677e-03
6900.00000  6950.00000  1.282050443230e-03
6950.00000  7000.00000  1.290723849312e-03
7000.00000  7050.00000  1.280436786284e-03
7050.00000  7100.00000  1.300607498103e-03
7100.00000  7150.00000  1.179583227188e-03
7150.00000  7200.00000  1.183415662434e-03
7200.00000  7250.00000  1.145898138450e-03
7250.00000  7300.00000  1.139040096431e-03
7300.00000  7350.00000  1.117457434785e-03
7350.00000  7400.00000  1.107977200230e-03
7400.00000  7450.00000  1.091437216538e-03
7450.00000  7500.00000  1.100715743975e-03
7500.00000  7550.00000  1.101522572448e-03
7550.00000  7600.00000  1.053516278318e-03
7600.00000  7650.00000  1.048271893245e-03
7650.00000  7700.00000  1.070056262010e-03
7700.00000  7750.00000  1.031933616671e-03
7750.00000  7800.00000  1.040405315635e-03
7800.00000  7850.00000  1.006316812661e-03
7850.00000  7900.00000  9.970382852241e-04
7900.00000  7950.00000  9.917939001512e-04
7950.00000  8000.00000  9.869529293145e-04
8000.00000  8050.00000  9.752539164594e-04
8050.00000  8100.00000  9.883648791419e-04
8100.00000  8150.00000  9.633531964860e-04
8150.00000  8200.00000  9.617395395405e-04
8200.00000  8250.00000  9.468132127943e-04
8250.00000  8300.00000  9.101025172833e-04
8300.00000  8350.00000  9.280544508024e-04
8350.00000  8400.00000  8.943693620643e-04
8400.00000  8450.00000  8.990086257827e-04
8450.00000  8500.00000  8.856959559820e-04
8500.00000  8550.00000  8.959830190098e-04
8550.00000  8600.00000  8.715764577086e-04
8600.00000  8650.00000  8.624996373899e-04
8650.00000  8700.00000  8.627013445081e-04
8700.00000  8750.00000  8.261923561153e-04
8750.00000  8800.00000  8.393033187978e-04
8800.00000  8850.00000  8.199394354514e-04
8850.00000  8900.00000  8.380930760887e-04
8900.00000  8950.00000  8.159052930875e-04
8950.00000  9000.00000  7.999704307503e-04
9000.00000  9050.00000  8.199394354514e-04
9050.00000  9100.00000  7.937175100864e-04
9100.00000  9150.00000  8.267974774699e-04
9150.00000  9200.00000  7.910953175499e-04
9200.00000  9250.00000  7.789928904584e-04
9250.00000  9300.00000  7.691092416669e-04
9300.00000  9350.00000  7.541829149207e-04
9350.00000  9400.00000  7.422821949474e-04
9400.00000  9450.00000  7.376429312290e-04
9450.00000  9500.00000  7.388531739381e-04
9500.00000  9550.00000  7.340122031015e-04
9550.00000  9600.00000  7.206995333008e-04
9600.00000  9650.00000  7.108158845094e-04
9650.00000  9700.00000  7.247336756646e-04
9700.00000  9750.00000  7.087988133275e-04
9750.00000  9800.00000  6.835854235534e-04
9800.00000  9850.00000  7.053697923182e-04
9850.00000  9900.00000  6.870144445627e-04
9900.00000  9950.00000  6.755171388257e-04
9950.00000  10000.00000  6.694659252800e-04
