300.00000  350.00000  6.187550377947e-06
350.00000  400.00000  1.778920733660e-05
400.00000  450.00000  1.121493506003e-05
450.00000  500.00000  1.411534929969e-05
500.00000  550.00000  1.049949954758e-04
550.00000  600.00000  1.160165695865e-05
600.00000  650.00000  3.035766904180e-05
650.00000  700.00000  1.276182265452e-05
700.00000  750.00000  2.629708910628e-05
750.00000  800.00000  1.566223689418e-05
800.00000  850.00000  6.786969320811e-05
850.00000  900.00000  1.566223689418e-05
900.00000  950.00000  1.546887594487e-05
950.00000  1000.00000  2.126970442419e-05
1000.00000  1050.00000  2.107634347488e-05
1050.00000  1100.00000  2.687717195421e-05
1100.00000  1150.00000  2.184978727213e-05
1150.00000  1200.00000  2.668381100490e-05
1200.00000  1250.00000  3.209791758560e-05
1250.00000  1300.00000  9.049292427748e-05
1300.00000  1350.00000  4.640662783460e-05
1350.00000  1400.00000  7.985807206538e-05
1400.00000  1450.00000  1.245244513562e-04
1450.00000  1500.00000  1.805991266563e-04
1500.00000  1550.00000  2.380273286017e-04
1550.00000  1600.00000  3.155650692753e-04
1600.00000  1650.00000  4.062513545021e-04
1650.00000  1700.00000  5.180139832038e-04
1700.00000  1750.00000  7.517873709206e-04
1750.00000  1800.00000  7.763442114831e-04
1800.00000  1850.00000  9.165308997334e-04
1850.00000  1900.00000  9.043491599269e-04
1900.00000  1950.00000  1.098483553035e-03
1950.00000  2000.00000  1.246211318308e-03
2000.00000  2050.00000  1.419849450790e-03
2050.00000  2100.00000  1.621331559971e-03
2100.00000  2150.00000  1.700609549189e-03
2150.00000  2200.00000  1.902478380269e-03
2200.00000  2250.00000  2.064708216741e-03
2250.00000  2300.00000  2.174730596899e-03
2300.00000  2350.00000  2.440215180303e-03
2350.00000  2400.00000  2.443115594543e-03
2400.00000  2450.00000  2.582335478046e-03
2450.00000  2500.00000  2.596257466397e-03
2500.00000  2550.00000  2.572860791530e-03
2550.00000  2600.00000  2.658326331126e-03
2600.00000  2650.00000  2.731610130914e-03
2650.00000  2700.00000  2.793098912795e-03
2700.00000  2750.00000  2.907955316686e-03
2750.00000  2800.00000  3.008696371277e-03
2800.00000  2850.00000  3.000381850456e-03
2850.00000  2900.00000  3.054716277213e-03
2900.00000  2950.00000  3.164545296421e-03
2950.00000  3000.00000  3.245563534183e-03
3000.00000  3050.00000  3.213078894698e-03
3050.00000  3100.00000  3.251171001713e-03
3100.00000  3150.00000  3.208824953814e-03
3150.00000  3200.00000  3.273214149934e-03
3200.00000  3250.00000  3.191229107426e-03
3250.00000  3300.00000  3.253878055003e-03
3300.00000  3350.00000  3.294483854358e-03
3350.00000  3400.00000  3.290036552524e-03
3400.00000  3450.00000  3.329095464285e-03
3450.00000  3500.00000  3.296610824801e-03
3500.00000  3550.00000  3.306472233216e-03
3550.00000  3600.00000  3.307632398911e-03
3600.00000  3650.00000  3.298544434294e-03
3650.00000  3700.00000  3.249624114118e-03
3700.00000  3750.00000  3.283075558349e-03
3750.00000  3800.00000  3.250590918865e-03
3800.00000  3850.00000  3.242083037095e-03
3850.00000  3900.00000  3.134574349278e-03
3900.00000  3950.00000  3.155070609905e-03
3950.00000  4000.00000  3.145015840541e-03
4000.00000  4050.00000  3.121812526624e-03
4050.00000  4100.00000  3.061677271388e-03
4100.00000  4150.00000  3.070765236006e-03
4150.00000  4200.00000  3.046401756392e-03
4200.00000  4250.00000  2.989553637295e-03
4250.00000  4300.00000  2.982592643120e-03
4300.00000  4350.00000  2.928644938262e-03
4350.00000  4400.00000  2.998061519065e-03
4400.00000  4450.00000  2.902927932004e-03
4450.00000  4500.00000  2.881078144732e-03
4500.00000  4550.00000  2.854781055625e-03
4550.00000  4600.00000  2.884945363718e-03
4600.00000  4650.00000  2.798126297477e-03
4650.00000  4700.00000  2.719428391108e-03
4700.00000  4750.00000  2.763321326601e-03
4750.00000  4800.00000  2.750946225845e-03
4800.00000  4850.00000  2.694098106748e-03
4850.00000  4900.00000  2.664900603402e-03
4900.00000  4950.00000  2.662000189163e-03
4950.00000  5000.00000  2.621587750757e-03
5000.00000  5050.00000  2.607859123355e-03
5050.00000  5100.00000  2.547723868120e-03
5100.00000  5150.00000  2.548110590018e-03
5150.00000  5200.00000  2.504604376423e-03
5200.00000  5250.00000  2.470572849345e-03
5250.00000  5300.00000  2.444469121188e-03
5300.00000  5350.00000  2.417591949234e-03
5350.00000  5400.00000  2.409857511261e-03
5400.00000  5450.00000  2.345468315141e-03
5450.00000  5500.00000  2.345274954191e-03
5500.00000  5550.00000  2.302928906292e-03
5550.00000  5600.00000  2.283399450412e-03
5600.00000  5650.00000  2.289973722688e-03
5650.00000  5700.00000  2.248014396688e-03
5700.00000  5750.00000  2.237186183527e-03
5750.00000  5800.00000  2.234672491186e-03
5800.00000  5850.00000  2.158874999056e-03
5850.00000  5900.00000  2.157134750512e-03
5900.00000  5950.00000  2.131224383304e-03
5950.00000  6000.00000  2.119236004447e-03
6000.00000  6050.00000  2.079403648889e-03
6050.00000  6100.00000  2.081337258382e-03
6100.00000  6150.00000  2.069542240474e-03
6150.00000  6200.00000  2.021782085994e-03
6200.00000  6250.00000  1.999932298722e-03
6250.00000  6300.00000  1.972281682971e-03
6300.00000  6350.00000  1.971121517275e-03
6350.00000  6400.00000  2.475020151179e-03
6400.00000  6450.00000  1.919494143809e-03
6450.00000  6500.00000  1.883142285338e-03
6500.00000  6550.00000  1.875987930214e-03
6550.00000  6600.00000  1.846597065919e-03
6600.00000  6650.00000  1.834415326112e-03
6650.00000  6700.00000  1.795743136250e-03
6700.00000  6750.00000  1.801350603780e-03
6750.00000  6800.00000  1.796709940996e-03
6800.00000  6850.00000  1.727873443042e-03
6850.00000  6900.00000  1.759777999678e-03
6900.00000  6950.00000  1.747789620821e-03
6950.00000  7000.00000  1.724586306903e-03
7000.00000  7050.00000  1.695775525456e-03
7050.00000  7100.00000  1.732514105825e-03
7100.00000  7150.00000  1.575891736883e-03
7150.00000  7200.00000  1.538573073666e-03
7200.00000  7250.00000  1.453494255970e-03
7250.00000  7300.00000  1.508022043675e-03
7300.00000  7350.00000  1.569317464607e-03
7350.00000  7400.00000  1.499900883804e-03
7400.00000  7450.00000  1.474763960394e-03
7450.00000  7500.00000  1.490619558237e-03
7500.00000  7550.00000  1.424683474522e-03
7550.00000  7600.00000  1.410954847121e-03
7600.00000  7650.00000  1.426617084015e-03
7650.00000  7700.00000  1.406314184338e-03
7700.00000  7750.00000  1.394132444531e-03
7750.00000  7800.00000  1.392585556937e-03
7800.00000  7850.00000  1.342311710116e-03
7850.00000  7900.00000  1.359714195554e-03
7900.00000  7950.00000  1.353139923277e-03
7950.00000  8000.00000  1.369768964918e-03
8000.00000  8050.00000  1.346372290051e-03
8050.00000  8100.00000  1.293584750890e-03
8100.00000  8150.00000  1.297645330825e-03
8150.00000  8200.00000  1.256652809571e-03
8200.00000  8250.00000  1.312147402023e-03
8250.00000  8300.00000  1.302092632659e-03
8300.00000  8350.00000  1.252398868686e-03
8350.00000  8400.00000  1.242150738373e-03
8400.00000  8450.00000  1.231515886161e-03
8450.00000  8500.00000  1.217400536861e-03
8500.00000  8550.00000  1.207345767497e-03
8550.00000  8600.00000  1.198257802879e-03
8600.00000  8650.00000  1.164419636750e-03
8650.00000  8700.00000  1.192650335349e-03
8700.00000  8750.00000  1.200191412372e-03
8750.00000  8800.00000  1.202125021866e-03
8800.00000  8850.00000  1.134061967708e-03
8850.00000  8900.00000  1.155718394031e-03
8900.00000  8950.00000  1.136769020999e-03
8950.00000  9000.00000  1.161905944409e-03
9000.00000  9050.00000  1.116272760372e-03
9050.00000  9100.00000  1.110665292842e-03
9100.00000  9150.00000  1.090749115063e-03
9150.00000  9200.00000  1.095003055947e-03
9200.00000  9250.00000  1.063678582159e-03
9250.00000  9300.00000  1.092102641708e-03
9300.00000  9350.00000  1.069479410638e-03
9350.00000  9400.00000  1.058844558426e-03
9400.00000  9450.00000  1.047436262417e-03
9450.00000  9500.00000  1.042988960583e-03
9500.00000  9550.00000  1.054977339440e-03
9550.00000  9600.00000  1.027326723689e-03
9600.00000  9650.00000  1.032934191219e-03
9650.00000  9700.00000  1.014371540085e-03
9700.00000  9750.00000  9.851740367388e-04
9750.00000  9800.00000  9.888478947757e-04
9800.00000  9850.00000  1.017658676223e-03
9850.00000  9900.00000  9.654512199091e-04
9900.00000  9950.00000  9.874943681305e-04
9950.00000  10000.00000  9.818869006005e-04
