10001.00000  11001.00000  9.613525501874e-06
11001.00000  12001.00000  1.267401114854e-05
12001.00000  13001.00000  1.602254250312e-05
13001.00000  14001.00000  2.019920526798e-05
14001.00000  15001.00000  2.475392802449e-05
15001.00000  16001.00000  2.812046223582e-05
16001.00000  17001.00000  3.042482789919e-05
17001.00000  18001.00000  3.116294502574e-05
18001.00000  19001.00000  3.267518499233e-05
19001.00000  20001.00000  3.179304501182e-05
20001.00000  21001.00000  3.199107643601e-05
21001.00000  22001.00000  2.916462792703e-05
22001.00000  23001.00000  2.842651080049e-05
23001.00000  24001.00000  2.653621084225e-05
24001.00000  25001.00000  2.572608228872e-05
25001.00000  26001.00000  2.327769377139e-05
26001.00000  27001.00000  2.252157378810e-05
27001.00000  28001.00000  2.014519669775e-05
28001.00000  29001.00000  1.976713670610e-05
29001.00000  30001.00000  1.733675104551e-05
30001.00000  31001.00000  1.658063106222e-05
31001.00000  32001.00000  1.505038823889e-05
32001.00000  33001.00000  1.337612256160e-05
33001.00000  34001.00000  1.344813398858e-05
34001.00000  35001.00000  1.234995972713e-05
35001.00000  36001.00000  1.112576546846e-05
36001.00000  37001.00000  1.065769119309e-05
37001.00000  38001.00000  9.649531215364e-06
38001.00000  39001.00000  9.415494077678e-06
39001.00000  40001.00000  9.055436942777e-06
40001.00000  41001.00000  7.813239827366e-06
41001.00000  42001.00000  7.849245540856e-06
42001.00000  43001.00000  7.219145554778e-06
43001.00000  44001.00000  7.021114130582e-06
44001.00000  45001.00000  6.030957009603e-06
45001.00000  46001.00000  6.156977006818e-06
46001.00000  47001.00000  4.860771321172e-06
47001.00000  48001.00000  5.382854166780e-06
48001.00000  49001.00000  5.040799888623e-06
49001.00000  50001.00000  4.194665621604e-06
50001.00000  51001.00000  4.212668478349e-06
51001.00000  52001.00000  3.852611343448e-06
52001.00000  53001.00000  3.312525641095e-06
53001.00000  54001.00000  3.762597059722e-06
54001.00000  55001.00000  3.906619913683e-06
55001.00000  56001.00000  3.168502787135e-06
56001.00000  57001.00000  3.168502787135e-06
57001.00000  58001.00000  2.628417084782e-06
58001.00000  59001.00000  2.934465649449e-06
59001.00000  60001.00000  2.988474219684e-06
60001.00000  61001.00000  2.700428511762e-06
61001.00000  62001.00000  2.484394230821e-06
62001.00000  63001.00000  2.070328525685e-06
63001.00000  64001.00000  2.214351379645e-06
64001.00000  65001.00000  1.746277104273e-06
65001.00000  66001.00000  1.926305671724e-06
66001.00000  67001.00000  1.602254250312e-06
67001.00000  68001.00000  1.998317098704e-06
68001.00000  69001.00000  1.476234253097e-06
69001.00000  70001.00000  1.530242823332e-06
70001.00000  71001.00000  1.566248536822e-06
71001.00000  72001.00000  1.332211399136e-06
72001.00000  73001.00000  1.494237109842e-06
73001.00000  74001.00000  1.206191401921e-06
74001.00000  75001.00000  1.584251393567e-06
75001.00000  76001.00000  1.062168547960e-06
76001.00000  77001.00000  1.044165691215e-06
77001.00000  78001.00000  1.170185688430e-06
78001.00000  79001.00000  9.901571209796e-07
79001.00000  80001.00000  8.821399805091e-07
80001.00000  81001.00000  1.152182831685e-06
81001.00000  82001.00000  9.001428372541e-07
82001.00000  83001.00000  1.044165691215e-06
83001.00000  84001.00000  8.641371237640e-07
84001.00000  85001.00000  9.001428372541e-07
85001.00000  86001.00000  8.461342670189e-07
86001.00000  87001.00000  7.201142698033e-07
87001.00000  88001.00000  7.201142698033e-07
88001.00000  89001.00000  8.461342670189e-07
89001.00000  90001.00000  5.760914158427e-07
90001.00000  91001.00000  7.021114130582e-07
91001.00000  92001.00000  5.760914158427e-07
92001.00000  93001.00000  4.860771321172e-07
93001.00000  94001.00000  6.120971293328e-07
94001.00000  95001.00000  6.300999860779e-07
95001.00000  96001.00000  7.561199832935e-07
96001.00000  97001.00000  4.500714186271e-07
97001.00000  98001.00000  5.220828456074e-07
98001.00000  99001.00000  3.780599916467e-07
99001.00000  100001.00000  6.300999860779e-07
100001.00000  101001.00000  3.780599916467e-07
101001.00000  102001.00000  4.860771321172e-07
102001.00000  103001.00000  3.600571349017e-07
103001.00000  104001.00000  5.760914158427e-07
104001.00000  105001.00000  3.240514214115e-07
105001.00000  106001.00000  3.420542781566e-07
106001.00000  107001.00000  3.600571349017e-07
107001.00000  108001.00000  5.940942725877e-07
108001.00000  109001.00000  3.060485646664e-07
109001.00000  110001.00000  3.240514214115e-07
110001.00000  111001.00000  3.240514214115e-07
111001.00000  112001.00000  3.960628483918e-07
112001.00000  113001.00000  3.240514214115e-07
113001.00000  114001.00000  2.880457079213e-07
114001.00000  115001.00000  3.780599916467e-07
115001.00000  116001.00000  3.420542781566e-07
116001.00000  117001.00000  2.340371376861e-07
117001.00000  118001.00000  3.060485646664e-07
118001.00000  119001.00000  3.240514214115e-07
119001.00000  120001.00000  1.800285674508e-07
120001.00000  121001.00000  1.980314241959e-07
121001.00000  122001.00000  2.520399944312e-07
122001.00000  123001.00000  2.880457079213e-07
123001.00000  124001.00000  1.980314241959e-07
124001.00000  125001.00000  1.080171404705e-07
125001.00000  126001.00000  1.440228539607e-07
126001.00000  127001.00000  2.160342809410e-07
127001.00000  128001.00000  1.980314241959e-07
128001.00000  129001.00000  3.600571349017e-07
129001.00000  130001.00000  1.980314241959e-07
130001.00000  131001.00000  1.800285674508e-07
131001.00000  132001.00000  9.001428372541e-08
132001.00000  133001.00000  1.620257107057e-07
133001.00000  134001.00000  1.620257107057e-07
134001.00000  135001.00000  1.620257107057e-07
135001.00000  136001.00000  9.001428372541e-08
136001.00000  137001.00000  1.260199972156e-07
137001.00000  138001.00000  7.201142698033e-08
138001.00000  139001.00000  1.260199972156e-07
139001.00000  140001.00000  1.080171404705e-07
140001.00000  141001.00000  1.800285674508e-08
141001.00000  142001.00000  9.001428372541e-08
142001.00000  143001.00000  1.260199972156e-07
143001.00000  144001.00000  1.260199972156e-07
144001.00000  145001.00000  1.800285674508e-07
145001.00000  146001.00000  1.080171404705e-07
146001.00000  147001.00000  1.260199972156e-07
147001.00000  148001.00000  3.600571349017e-08
148001.00000  149001.00000  1.800285674508e-08
149001.00000  150001.00000  5.400857023525e-08
150001.00000  151001.00000  3.600571349017e-08
151001.00000  152001.00000  5.400857023525e-08
152001.00000  153001.00000  0.000000000000e+00
153001.00000  154001.00000  7.201142698033e-08
154001.00000  155001.00000  5.400857023525e-08
155001.00000  156001.00000  7.201142698033e-08
156001.00000  157001.00000  1.080171404705e-07
157001.00000  158001.00000  3.600571349017e-08
158001.00000  159001.00000  1.800285674508e-08
159001.00000  160001.00000  7.201142698033e-08
160001.00000  161001.00000  3.600571349017e-08
161001.00000  162001.00000  3.600571349017e-08
162001.00000  163001.00000  1.800285674508e-08
163001.00000  164001.00000  1.800285674508e-08
164001.00000  165001.00000  1.080171404705e-07
165001.00000  166001.00000  1.800285674508e-08
166001.00000  167001.00000  7.201142698033e-08
167001.00000  168001.00000  1.800285674508e-08
168001.00000  169001.00000  9.001428372541e-08
169001.00000  170001.00000  7.201142698033e-08
170001.00000  171001.00000  9.001428372541e-08
171001.00000  172001.00000  5.400857023525e-08
172001.00000  173001.00000  7.201142698033e-08
173001.00000  174001.00000  1.800285674508e-08
174001.00000  175001.00000  3.600571349017e-08
175001.00000  176001.00000  1.800285674508e-08
176001.00000  177001.00000  5.400857023525e-08
177001.00000  178001.00000  1.800285674508e-08
178001.00000  179001.00000  3.600571349017e-08
179001.00000  180001.00000  0.000000000000e+00
180001.00000  181001.00000  3.600571349017e-08
181001.00000  182001.00000  1.800285674508e-08
182001.00000  183001.00000  1.800285674508e-08
183001.00000  184001.00000  3.600571349017e-08
184001.00000  185001.00000  0.000000000000e+00
185001.00000  186001.00000  3.600571349017e-08
186001.00000  187001.00000  0.000000000000e+00
187001.00000  188001.00000  1.800285674508e-08
188001.00000  189001.00000  0.000000000000e+00
189001.00000  190001.00000  1.800285674508e-08
190001.00000  191001.00000  0.000000000000e+00
191001.00000  192001.00000  0.000000000000e+00
192001.00000  193001.00000  0.000000000000e+00
193001.00000  194001.00000  0.000000000000e+00
194001.00000  195001.00000  0.000000000000e+00
195001.00000  196001.00000  0.000000000000e+00
196001.00000  197001.00000  3.600571349017e-08
197001.00000  198001.00000  0.000000000000e+00
198001.00000  199001.00000  0.000000000000e+00
