10001.00000  11001.00000  3.608061134846e-04
11001.00000  12001.00000  2.886978281759e-04
12001.00000  13001.00000  2.378401230159e-04
13001.00000  14001.00000  1.945449018946e-04
14001.00000  15001.00000  1.561652953984e-04
15001.00000  16001.00000  1.384312703277e-04
16001.00000  17001.00000  1.161597548339e-04
17001.00000  18001.00000  1.051941529778e-04
18001.00000  19001.00000  8.655262982249e-05
19001.00000  20001.00000  7.683483783281e-05
20001.00000  21001.00000  6.983954009705e-05
21001.00000  22001.00000  6.034862262853e-05
22001.00000  23001.00000  5.237020196774e-05
23001.00000  24001.00000  4.537490423197e-05
24001.00000  25001.00000  4.216084851554e-05
25001.00000  26001.00000  3.958960394240e-05
26001.00000  27001.00000  3.319930492973e-05
27001.00000  28001.00000  3.164899570180e-05
28001.00000  29001.00000  2.805681578344e-05
29001.00000  30001.00000  2.533432152952e-05
30001.00000  31001.00000  2.280088937657e-05
31001.00000  32001.00000  2.208245339289e-05
32001.00000  33001.00000  1.913308461782e-05
33001.00000  34001.00000  1.830121137356e-05
34001.00000  35001.00000  1.777183749086e-05
35001.00000  36001.00000  1.792308717163e-05
36001.00000  37001.00000  1.440653209365e-05
37001.00000  38001.00000  1.209997446186e-05
38001.00000  39001.00000  1.478465629559e-05
39001.00000  40001.00000  1.266716076476e-05
40001.00000  41001.00000  1.123028879741e-05
41001.00000  42001.00000  1.096560185606e-05
42001.00000  43001.00000  1.013372861181e-05
43001.00000  44001.00000  8.583419383882e-06
44001.00000  45001.00000  9.264042947362e-06
45001.00000  46001.00000  8.659044224269e-06
46001.00000  47001.00000  8.318732442529e-06
47001.00000  48001.00000  7.713733719436e-06
48001.00000  49001.00000  8.016233080982e-06
49001.00000  50001.00000  6.995297735763e-06
50001.00000  51001.00000  5.898737550157e-06
51001.00000  52001.00000  6.087799651123e-06
52001.00000  53001.00000  5.444988507837e-06
53001.00000  54001.00000  5.974362390543e-06
54001.00000  55001.00000  5.142489146290e-06
55001.00000  56001.00000  5.180301566484e-06
56001.00000  57001.00000  4.424053162618e-06
57001.00000  58001.00000  4.839989784744e-06
58001.00000  59001.00000  4.083741380878e-06
59001.00000  60001.00000  4.121553801071e-06
60001.00000  61001.00000  3.478742657785e-06
61001.00000  62001.00000  3.705617178945e-06
62001.00000  63001.00000  2.457807312565e-06
63001.00000  64001.00000  2.911556354885e-06
64001.00000  65001.00000  3.024993615465e-06
65001.00000  66001.00000  2.911556354885e-06
66001.00000  67001.00000  3.554367498171e-06
67001.00000  68001.00000  2.798119094305e-06
68001.00000  69001.00000  2.533432152952e-06
69001.00000  70001.00000  2.798119094305e-06
70001.00000  71001.00000  2.533432152952e-06
71001.00000  72001.00000  2.230932791405e-06
72001.00000  73001.00000  2.268745211599e-06
73001.00000  74001.00000  2.230932791405e-06
74001.00000  75001.00000  2.457807312565e-06
75001.00000  76001.00000  2.155307951019e-06
76001.00000  77001.00000  1.966245850052e-06
77001.00000  78001.00000  1.323434706766e-06
78001.00000  79001.00000  1.814996169279e-06
79001.00000  80001.00000  1.361247126959e-06
80001.00000  81001.00000  1.663746488506e-06
81001.00000  82001.00000  1.814996169279e-06
82001.00000  83001.00000  1.890621009666e-06
83001.00000  84001.00000  1.436871967346e-06
84001.00000  85001.00000  1.209997446186e-06
85001.00000  86001.00000  1.399059547153e-06
86001.00000  87001.00000  1.512496807732e-06
87001.00000  88001.00000  1.323434706766e-06
88001.00000  89001.00000  9.453105048328e-07
89001.00000  90001.00000  1.096560185606e-06
90001.00000  91001.00000  1.020935345219e-06
91001.00000  92001.00000  1.096560185606e-06
92001.00000  93001.00000  1.247809866379e-06
93001.00000  94001.00000  1.134372605799e-06
94001.00000  95001.00000  1.096560185606e-06
95001.00000  96001.00000  9.831229250261e-07
96001.00000  97001.00000  1.096560185606e-06
97001.00000  98001.00000  5.671863028997e-07
98001.00000  99001.00000  9.453105048328e-07
99001.00000  100001.00000  7.562484038662e-07
100001.00000  101001.00000  9.074980846395e-07
101001.00000  102001.00000  1.096560185606e-06
102001.00000  103001.00000  5.293738827064e-07
103001.00000  104001.00000  7.184359836729e-07
104001.00000  105001.00000  1.058747765413e-06
105001.00000  106001.00000  4.537490423197e-07
106001.00000  107001.00000  7.184359836729e-07
107001.00000  108001.00000  9.831229250261e-07
108001.00000  109001.00000  6.806235634796e-07
109001.00000  110001.00000  6.049987230930e-07
110001.00000  111001.00000  3.403117817398e-07
111001.00000  112001.00000  6.806235634796e-07
112001.00000  113001.00000  3.403117817398e-07
113001.00000  114001.00000  7.940608240596e-07
114001.00000  115001.00000  5.293738827064e-07
115001.00000  116001.00000  7.184359836729e-07
116001.00000  117001.00000  6.049987230930e-07
117001.00000  118001.00000  3.403117817398e-07
118001.00000  119001.00000  8.318732442529e-07
119001.00000  120001.00000  4.915614625131e-07
120001.00000  121001.00000  6.049987230930e-07
121001.00000  122001.00000  6.428111432863e-07
122001.00000  123001.00000  6.428111432863e-07
123001.00000  124001.00000  5.293738827064e-07
124001.00000  125001.00000  3.024993615465e-07
125001.00000  126001.00000  3.403117817398e-07
126001.00000  127001.00000  5.671863028997e-07
127001.00000  128001.00000  4.159366221264e-07
128001.00000  129001.00000  2.646869413532e-07
129001.00000  130001.00000  3.781242019331e-07
130001.00000  131001.00000  3.024993615465e-07
131001.00000  132001.00000  4.159366221264e-07
132001.00000  133001.00000  2.646869413532e-07
133001.00000  134001.00000  3.403117817398e-07
134001.00000  135001.00000  2.646869413532e-07
135001.00000  136001.00000  3.024993615465e-07
136001.00000  137001.00000  3.024993615465e-07
137001.00000  138001.00000  2.646869413532e-07
138001.00000  139001.00000  1.512496807732e-07
139001.00000  140001.00000  2.646869413532e-07
140001.00000  141001.00000  4.537490423197e-07
141001.00000  142001.00000  2.646869413532e-07
142001.00000  143001.00000  2.646869413532e-07
143001.00000  144001.00000  2.268745211599e-07
144001.00000  145001.00000  2.268745211599e-07
145001.00000  146001.00000  2.268745211599e-07
146001.00000  147001.00000  1.134372605799e-07
147001.00000  148001.00000  3.403117817398e-07
148001.00000  149001.00000  3.781242019331e-07
149001.00000  150001.00000  2.646869413532e-07
150001.00000  151001.00000  2.268745211599e-07
151001.00000  152001.00000  1.512496807732e-07
152001.00000  153001.00000  3.403117817398e-07
153001.00000  154001.00000  1.512496807732e-07
154001.00000  155001.00000  1.890621009666e-07
155001.00000  156001.00000  3.024993615465e-07
156001.00000  157001.00000  2.268745211599e-07
157001.00000  158001.00000  3.403117817398e-07
158001.00000  159001.00000  1.134372605799e-07
159001.00000  160001.00000  3.781242019331e-08
160001.00000  161001.00000  1.890621009666e-07
161001.00000  162001.00000  7.562484038662e-08
162001.00000  163001.00000  2.646869413532e-07
163001.00000  164001.00000  1.890621009666e-07
164001.00000  165001.00000  7.562484038662e-08
165001.00000  166001.00000  2.646869413532e-07
166001.00000  167001.00000  2.268745211599e-07
167001.00000  168001.00000  3.781242019331e-08
168001.00000  169001.00000  3.781242019331e-08
169001.00000  170001.00000  1.890621009666e-07
170001.00000  171001.00000  7.562484038662e-08
171001.00000  172001.00000  1.890621009666e-07
172001.00000  173001.00000  2.268745211599e-07
173001.00000  174001.00000  1.134372605799e-07
174001.00000  175001.00000  1.890621009666e-07
175001.00000  176001.00000  7.562484038662e-08
176001.00000  177001.00000  1.890621009666e-07
177001.00000  178001.00000  7.562484038662e-08
178001.00000  179001.00000  1.890621009666e-07
179001.00000  180001.00000  1.134372605799e-07
180001.00000  181001.00000  3.781242019331e-08
181001.00000  182001.00000  1.890621009666e-07
182001.00000  183001.00000  2.268745211599e-07
183001.00000  184001.00000  1.512496807732e-07
184001.00000  185001.00000  7.562484038662e-08
185001.00000  186001.00000  1.134372605799e-07
186001.00000  187001.00000  1.890621009666e-07
187001.00000  188001.00000  3.781242019331e-08
188001.00000  189001.00000  1.512496807732e-07
189001.00000  190001.00000  1.890621009666e-07
190001.00000  191001.00000  1.890621009666e-07
191001.00000  192001.00000  7.562484038662e-08
192001.00000  193001.00000  7.562484038662e-08
193001.00000  194001.00000  3.781242019331e-08
194001.00000  195001.00000  0.000000000000e+00
195001.00000  196001.00000  1.134372605799e-07
196001.00000  197001.00000  3.781242019331e-08
197001.00000  198001.00000  7.562484038662e-08
198001.00000  199001.00000  7.562484038662e-08
