300.00000  350.00000  0.000000000000e+00
350.00000  400.00000  9.648100398829e-07
400.00000  450.00000  5.788860239298e-07
450.00000  500.00000  1.929620079766e-07
500.00000  550.00000  2.933022521244e-05
550.00000  600.00000  3.859240159532e-07
600.00000  650.00000  7.911442327040e-06
650.00000  700.00000  2.701468111672e-06
700.00000  750.00000  5.209974215368e-06
750.00000  800.00000  5.209974215368e-06
800.00000  850.00000  2.624283308482e-05
850.00000  900.00000  4.245164175485e-06
900.00000  950.00000  3.473316143579e-06
950.00000  1000.00000  5.209974215368e-06
1000.00000  1050.00000  5.402936223344e-06
1050.00000  1100.00000  5.209974215368e-06
1100.00000  1150.00000  3.859240159532e-06
1150.00000  1200.00000  6.174784255251e-06
1200.00000  1250.00000  7.718480319064e-06
1250.00000  1300.00000  3.396131340388e-05
1300.00000  1350.00000  1.196364449455e-05
1350.00000  1400.00000  2.141878288540e-05
1400.00000  1450.00000  4.071498368306e-05
1450.00000  1500.00000  5.692379235309e-05
1500.00000  1550.00000  8.934140969316e-05
1550.00000  1600.00000  1.163560908099e-04
1600.00000  1650.00000  1.705784150513e-04
1650.00000  1700.00000  2.242218532688e-04
1700.00000  1750.00000  3.496471584536e-04
1750.00000  1800.00000  3.637333850359e-04
1800.00000  1850.00000  4.112020389981e-04
1850.00000  1900.00000  4.262530756203e-04
1900.00000  1950.00000  5.065252709385e-04
1950.00000  2000.00000  6.109177172539e-04
2000.00000  2050.00000  6.798051541015e-04
2050.00000  2100.00000  7.564110712682e-04
2100.00000  2150.00000  8.745038201499e-04
2150.00000  2200.00000  9.341290806147e-04
2200.00000  2250.00000  1.002244669430e-03
2250.00000  2300.00000  1.096989015347e-03
2300.00000  2350.00000  1.277408492805e-03
2350.00000  2400.00000  1.200995537646e-03
2400.00000  2450.00000  1.226659484707e-03
2450.00000  2500.00000  1.214502878205e-03
2500.00000  2550.00000  1.196557411463e-03
2550.00000  2600.00000  1.249043077632e-03
2600.00000  2650.00000  1.252323431768e-03
2650.00000  2700.00000  1.281460694973e-03
2700.00000  2750.00000  1.291108795371e-03
2750.00000  2800.00000  1.311755730225e-03
2800.00000  2850.00000  1.329508234959e-03
2850.00000  2900.00000  1.318316438496e-03
2900.00000  2950.00000  1.332981551102e-03
2950.00000  3000.00000  1.360768080251e-03
3000.00000  3050.00000  1.325263070783e-03
3050.00000  3100.00000  1.323719374719e-03
3100.00000  3150.00000  1.316193856408e-03
3150.00000  3200.00000  1.297669503643e-03
3200.00000  3250.00000  1.289565099308e-03
3250.00000  3300.00000  1.243061255385e-03
3300.00000  3350.00000  1.238237205186e-03
3350.00000  3400.00000  1.213923992181e-03
3400.00000  3450.00000  1.189031893152e-03
3450.00000  3500.00000  1.165104604163e-03
3500.00000  3550.00000  1.168770882314e-03
3550.00000  3600.00000  1.123810734456e-03
3600.00000  3650.00000  1.133458834854e-03
3650.00000  3700.00000  1.130564404735e-03
3700.00000  3750.00000  1.083095750773e-03
3750.00000  3800.00000  1.037170792874e-03
3800.00000  3850.00000  1.012085731837e-03
3850.00000  3900.00000  9.910528729678e-04
3900.00000  3950.00000  9.704059381143e-04
3950.00000  4000.00000  9.800540385131e-04
4000.00000  4050.00000  9.615296857473e-04
4050.00000  4100.00000  8.938000209476e-04
4100.00000  4150.00000  8.889759707481e-04
4150.00000  4200.00000  8.455595189534e-04
4200.00000  4250.00000  8.345606844987e-04
4250.00000  4300.00000  8.364903045785e-04
4300.00000  4350.00000  8.202814959085e-04
4350.00000  4400.00000  7.816890943132e-04
4400.00000  4450.00000  7.454122368136e-04
4450.00000  4500.00000  7.517799830768e-04
4500.00000  4550.00000  7.212919858165e-04
4550.00000  4600.00000  7.081705692741e-04
4600.00000  4650.00000  6.809629261494e-04
4650.00000  4700.00000  6.726655598064e-04
4700.00000  4750.00000  6.406338664823e-04
4750.00000  4800.00000  6.307928040755e-04
4800.00000  4850.00000  6.093740211901e-04
4850.00000  4900.00000  6.066725530784e-04
4900.00000  4950.00000  5.885341243286e-04
4950.00000  5000.00000  5.769564038500e-04
5000.00000  5050.00000  5.790789859377e-04
5050.00000  5100.00000  5.636420252996e-04
5100.00000  5150.00000  5.375921542228e-04
5150.00000  5200.00000  5.323821800074e-04
5200.00000  5250.00000  5.192607634650e-04
5250.00000  5300.00000  5.094197010582e-04
5300.00000  5350.00000  4.760372736782e-04
5350.00000  5400.00000  4.719850715107e-04
5400.00000  5450.00000  4.770020837181e-04
5450.00000  5500.00000  4.469000104738e-04
5500.00000  5550.00000  4.403393022026e-04
5550.00000  5600.00000  4.295334297559e-04
5600.00000  5650.00000  4.245164175485e-04
5650.00000  5700.00000  4.015539385993e-04
5700.00000  5750.00000  3.951861923361e-04
5750.00000  5800.00000  3.812929277617e-04
5800.00000  5850.00000  3.853451299292e-04
5850.00000  5900.00000  3.882395600489e-04
5900.00000  5950.00000  3.527345505812e-04
5950.00000  6000.00000  3.573656387726e-04
6000.00000  6050.00000  3.500330824695e-04
6050.00000  6100.00000  3.262987554884e-04
6100.00000  6150.00000  3.405779440787e-04
6150.00000  6200.00000  3.060377446509e-04
6200.00000  6250.00000  3.286142995841e-04
6250.00000  6300.00000  3.232113633608e-04
6300.00000  6350.00000  3.083532887466e-04
6350.00000  6400.00000  1.103549723618e-03
6400.00000  6450.00000  2.828823036937e-04
6450.00000  6500.00000  2.826893416857e-04
6500.00000  6550.00000  2.799878735740e-04
6550.00000  6600.00000  2.757427093985e-04
6600.00000  6650.00000  2.711116212071e-04
6650.00000  6700.00000  2.512365343855e-04
6700.00000  6750.00000  2.481491422579e-04
6750.00000  6800.00000  2.442899020984e-04
6800.00000  6850.00000  2.404306619388e-04
6850.00000  6900.00000  2.421673200106e-04
6900.00000  6950.00000  2.234500052369e-04
6950.00000  7000.00000  2.209414991332e-04
7000.00000  7050.00000  2.249937013007e-04
7050.00000  7100.00000  3.039151625631e-04
7100.00000  7150.00000  1.974001341600e-04
7150.00000  7200.00000  1.904535018729e-04
7200.00000  7250.00000  2.001016022717e-04
7250.00000  7300.00000  1.887168438011e-04
7300.00000  7350.00000  1.877520337612e-04
7350.00000  7400.00000  1.892957298250e-04
7400.00000  7450.00000  1.750165412348e-04
7450.00000  7500.00000  2.020312223515e-04
7500.00000  7550.00000  1.698065670194e-04
7550.00000  7600.00000  1.732798831630e-04
7600.00000  7650.00000  1.682628709556e-04
7650.00000  7700.00000  1.728939591470e-04
7700.00000  7750.00000  1.624740107163e-04
7750.00000  7800.00000  1.661402888678e-04
7800.00000  7850.00000  1.593866185887e-04
7850.00000  7900.00000  1.522470242935e-04
7900.00000  7950.00000  1.572640365009e-04
7950.00000  8000.00000  1.478088981101e-04
8000.00000  8050.00000  1.443355819665e-04
8050.00000  8100.00000  1.553344164212e-04
8100.00000  8150.00000  1.412481898389e-04
8150.00000  8200.00000  1.358452536155e-04
8200.00000  8250.00000  1.335297095198e-04
8250.00000  8300.00000  1.412481898389e-04
8300.00000  8350.00000  1.304423173922e-04
8350.00000  8400.00000  1.348804435756e-04
8400.00000  8450.00000  1.352663675916e-04
8450.00000  8500.00000  1.304423173922e-04
8500.00000  8550.00000  1.304423173922e-04
8550.00000  8600.00000  1.370030256634e-04
8600.00000  8650.00000  1.333367475118e-04
8650.00000  8700.00000  1.298634313682e-04
8700.00000  8750.00000  1.209871790013e-04
8750.00000  8800.00000  1.173209008498e-04
8800.00000  8850.00000  1.236886471130e-04
8850.00000  8900.00000  1.188645969136e-04
8900.00000  8950.00000  1.123038886424e-04
8950.00000  9000.00000  1.163560908099e-04
9000.00000  9050.00000  1.084446484828e-04
9050.00000  9100.00000  1.072868764350e-04
9100.00000  9150.00000  1.018839402116e-04
9150.00000  9200.00000  1.094094585227e-04
9200.00000  9250.00000  1.020769022196e-04
9250.00000  9300.00000  9.860358607604e-05
9300.00000  9350.00000  1.094094585227e-04
9350.00000  9400.00000  9.802470005211e-05
9400.00000  9450.00000  1.016909782037e-04
9450.00000  9500.00000  9.570915595639e-05
9500.00000  9550.00000  9.802470005211e-05
9550.00000  9600.00000  9.898951009199e-05
9600.00000  9650.00000  8.914844768518e-05
9650.00000  9700.00000  9.725285202020e-05
9700.00000  9750.00000  8.914844768518e-05
9750.00000  9800.00000  9.262176382876e-05
9800.00000  9850.00000  9.358657386864e-05
9850.00000  9900.00000  8.914844768518e-05
9900.00000  9950.00000  8.702586559744e-05
9950.00000  10000.00000  8.953437170114e-05
