10001.00000  11001.00000  3.635703427746e-04
11001.00000  12001.00000  2.985592960575e-04
12001.00000  13001.00000  2.497338111781e-04
13001.00000  14001.00000  2.030971211380e-04
14001.00000  15001.00000  1.735291908532e-04
15001.00000  16001.00000  1.488380490699e-04
16001.00000  17001.00000  1.276796989571e-04
17001.00000  18001.00000  1.121277356254e-04
18001.00000  19001.00000  1.000317641453e-04
19001.00000  20001.00000  8.488299986303e-05
20001.00000  21001.00000  7.528302249784e-05
21001.00000  22001.00000  6.623984381983e-05
22001.00000  23001.00000  5.783026364792e-05
23001.00000  24001.00000  5.529586962351e-05
24001.00000  25001.00000  4.790388705231e-05
25001.00000  26001.00000  4.254709968253e-05
26001.00000  27001.00000  3.911030778579e-05
27001.00000  28001.00000  3.417591942008e-05
28001.00000  29001.00000  3.154552562202e-05
29001.00000  30001.00000  2.899193164288e-05
30001.00000  31001.00000  2.663033721104e-05
31001.00000  32001.00000  2.436474255286e-05
32001.00000  33001.00000  2.323194522377e-05
33001.00000  34001.00000  2.073595110882e-05
34001.00000  35001.00000  1.891195540943e-05
35001.00000  36001.00000  1.691516011747e-05
36001.00000  37001.00000  1.607036210933e-05
37001.00000  38001.00000  1.493756478024e-05
38001.00000  39001.00000  1.484156500659e-05
39001.00000  40001.00000  1.313276903558e-05
40001.00000  41001.00000  1.132797329093e-05
41001.00000  42001.00000  1.023357587130e-05
42001.00000  43001.00000  1.015677605237e-05
43001.00000  44001.00000  1.034877559968e-05
44001.00000  45001.00000  8.639979628673e-06
45001.00000  46001.00000  7.795181620536e-06
46001.00000  47001.00000  7.814381575267e-06
47001.00000  48001.00000  6.854383838747e-06
48001.00000  49001.00000  6.815983929287e-06
49001.00000  50001.00000  6.393584925218e-06
50001.00000  51001.00000  6.009585830610e-06
51001.00000  52001.00000  5.337587415047e-06
52001.00000  53001.00000  5.183987777204e-06
53001.00000  54001.00000  4.819188637327e-06
54001.00000  55001.00000  4.223990040685e-06
55001.00000  56001.00000  4.127990267033e-06
56001.00000  57001.00000  3.763191127155e-06
57001.00000  58001.00000  3.302392213626e-06
58001.00000  59001.00000  3.647991398773e-06
59001.00000  60001.00000  3.206392439974e-06
60001.00000  61001.00000  2.937593073749e-06
61001.00000  62001.00000  3.052792802131e-06
62001.00000  63001.00000  2.764793481175e-06
63001.00000  64001.00000  2.515194069680e-06
64001.00000  65001.00000  2.707193616984e-06
65001.00000  66001.00000  2.495994114950e-06
66001.00000  67001.00000  2.111995020342e-06
67001.00000  68001.00000  2.188794839264e-06
68001.00000  69001.00000  2.246394703455e-06
69001.00000  70001.00000  1.919995473038e-06
70001.00000  71001.00000  1.612796197352e-06
71001.00000  72001.00000  1.727995925735e-06
72001.00000  73001.00000  1.363196785857e-06
73001.00000  74001.00000  1.497596468970e-06
74001.00000  75001.00000  1.727995925735e-06
75001.00000  76001.00000  1.535996378431e-06
76001.00000  77001.00000  1.228797102745e-06
77001.00000  78001.00000  1.267197012205e-06
78001.00000  79001.00000  1.343996831127e-06
79001.00000  80001.00000  1.228797102745e-06
80001.00000  81001.00000  1.036797555441e-06
81001.00000  82001.00000  8.255980534065e-07
82001.00000  83001.00000  1.209597148014e-06
83001.00000  84001.00000  7.487982344850e-07
84001.00000  85001.00000  7.487982344850e-07
85001.00000  86001.00000  1.017597600710e-06
86001.00000  87001.00000  1.036797555441e-06
87001.00000  88001.00000  6.143985513723e-07
88001.00000  89001.00000  6.143985513723e-07
89001.00000  90001.00000  8.063980986762e-07
90001.00000  91001.00000  6.335985061027e-07
91001.00000  92001.00000  5.759986419115e-07
92001.00000  93001.00000  6.911983702939e-07
93001.00000  94001.00000  4.991988229900e-07
94001.00000  95001.00000  5.567986871812e-07
95001.00000  96001.00000  6.143985513723e-07
96001.00000  97001.00000  4.223990040685e-07
97001.00000  98001.00000  5.951985966419e-07
98001.00000  99001.00000  5.759986419115e-07
99001.00000  100001.00000  4.991988229900e-07
100001.00000  101001.00000  5.375987324508e-07
101001.00000  102001.00000  5.759986419115e-07
102001.00000  103001.00000  3.263992304165e-07
103001.00000  104001.00000  3.839990946077e-07
104001.00000  105001.00000  4.607989135292e-07
105001.00000  106001.00000  2.687993662254e-07
106001.00000  107001.00000  3.647991398773e-07
107001.00000  108001.00000  2.303994567646e-07
108001.00000  109001.00000  3.263992304165e-07
109001.00000  110001.00000  2.303994567646e-07
110001.00000  111001.00000  3.263992304165e-07
111001.00000  112001.00000  3.263992304165e-07
112001.00000  113001.00000  3.455991851469e-07
113001.00000  114001.00000  2.111995020342e-07
114001.00000  115001.00000  2.495994114950e-07
115001.00000  116001.00000  1.535996378431e-07
116001.00000  117001.00000  2.495994114950e-07
117001.00000  118001.00000  1.919995473038e-07
118001.00000  119001.00000  1.919995473038e-07
119001.00000  120001.00000  1.343996831127e-07
120001.00000  121001.00000  2.111995020342e-07
121001.00000  122001.00000  9.599977365192e-08
122001.00000  123001.00000  1.919995473038e-07
123001.00000  124001.00000  1.535996378431e-07
124001.00000  125001.00000  5.759986419115e-08
125001.00000  126001.00000  1.535996378431e-07
126001.00000  127001.00000  1.727995925735e-07
127001.00000  128001.00000  9.599977365192e-08
128001.00000  129001.00000  1.535996378431e-07
129001.00000  130001.00000  1.919995473038e-08
130001.00000  131001.00000  2.495994114950e-07
131001.00000  132001.00000  3.839990946077e-08
132001.00000  133001.00000  1.343996831127e-07
133001.00000  134001.00000  3.839990946077e-08
134001.00000  135001.00000  9.599977365192e-08
135001.00000  136001.00000  9.599977365192e-08
136001.00000  137001.00000  3.839990946077e-08
137001.00000  138001.00000  0.000000000000e+00
138001.00000  139001.00000  5.759986419115e-08
139001.00000  140001.00000  1.151997283823e-07
140001.00000  141001.00000  3.839990946077e-08
141001.00000  142001.00000  5.759986419115e-08
142001.00000  143001.00000  1.919995473038e-08
143001.00000  144001.00000  7.679981892154e-08
144001.00000  145001.00000  5.759986419115e-08
145001.00000  146001.00000  1.919995473038e-08
146001.00000  147001.00000  3.839990946077e-08
147001.00000  148001.00000  9.599977365192e-08
148001.00000  149001.00000  9.599977365192e-08
149001.00000  150001.00000  1.343996831127e-07
150001.00000  151001.00000  3.839990946077e-08
151001.00000  152001.00000  1.919995473038e-08
152001.00000  153001.00000  3.839990946077e-08
153001.00000  154001.00000  1.919995473038e-08
154001.00000  155001.00000  3.839990946077e-08
155001.00000  156001.00000  1.919995473038e-08
156001.00000  157001.00000  5.759986419115e-08
157001.00000  158001.00000  5.759986419115e-08
158001.00000  159001.00000  3.839990946077e-08
159001.00000  160001.00000  3.839990946077e-08
160001.00000  161001.00000  3.839990946077e-08
161001.00000  162001.00000  1.919995473038e-08
162001.00000  163001.00000  1.151997283823e-07
163001.00000  164001.00000  0.000000000000e+00
164001.00000  165001.00000  3.839990946077e-08
165001.00000  166001.00000  1.919995473038e-08
166001.00000  167001.00000  0.000000000000e+00
167001.00000  168001.00000  1.919995473038e-08
168001.00000  169001.00000  1.919995473038e-08
169001.00000  170001.00000  1.919995473038e-08
170001.00000  171001.00000  3.839990946077e-08
171001.00000  172001.00000  1.919995473038e-08
172001.00000  173001.00000  7.679981892154e-08
173001.00000  174001.00000  1.919995473038e-08
174001.00000  175001.00000  0.000000000000e+00
175001.00000  176001.00000  3.839990946077e-08
176001.00000  177001.00000  3.839990946077e-08
177001.00000  178001.00000  7.679981892154e-08
178001.00000  179001.00000  0.000000000000e+00
179001.00000  180001.00000  0.000000000000e+00
180001.00000  181001.00000  1.919995473038e-08
181001.00000  182001.00000  0.000000000000e+00
182001.00000  183001.00000  3.839990946077e-08
183001.00000  184001.00000  0.000000000000e+00
184001.00000  185001.00000  0.000000000000e+00
185001.00000  186001.00000  1.919995473038e-08
186001.00000  187001.00000  1.919995473038e-08
187001.00000  188001.00000  3.839990946077e-08
188001.00000  189001.00000  1.919995473038e-08
189001.00000  190001.00000  0.000000000000e+00
190001.00000  191001.00000  1.919995473038e-08
191001.00000  192001.00000  1.919995473038e-08
192001.00000  193001.00000  3.839990946077e-08
193001.00000  194001.00000  0.000000000000e+00
194001.00000  195001.00000  0.000000000000e+00
195001.00000  196001.00000  1.919995473038e-08
196001.00000  197001.00000  1.919995473038e-08
197001.00000  198001.00000  1.919995473038e-08
198001.00000  199001.00000  1.919995473038e-08
