300.00000  350.00000  1.743461397427e-06
350.00000  400.00000  3.293204861806e-06
400.00000  450.00000  5.424102125327e-06
450.00000  500.00000  3.603153554682e-05
500.00000  550.00000  1.249480668156e-04
550.00000  600.00000  6.450807170478e-05
600.00000  650.00000  2.010792145032e-04
650.00000  700.00000  3.581844582046e-04
700.00000  750.00000  5.433788021979e-04
750.00000  800.00000  8.449976239527e-04
800.00000  850.00000  1.220616696132e-03
850.00000  900.00000  1.293648356891e-03
900.00000  950.00000  1.418983859572e-03
950.00000  1000.00000  1.680696787119e-03
1000.00000  1050.00000  1.875383309832e-03
1050.00000  1100.00000  2.079368293331e-03
1100.00000  1150.00000  2.156661748617e-03
1150.00000  1200.00000  2.201798027017e-03
1200.00000  1250.00000  2.233567768036e-03
1250.00000  1300.00000  2.091378805180e-03
1300.00000  1350.00000  1.960425482440e-03
1350.00000  1400.00000  2.022608938948e-03
1400.00000  1450.00000  1.980959583343e-03
1450.00000  1500.00000  1.893399077605e-03
1500.00000  1550.00000  1.832184210762e-03
1550.00000  1600.00000  1.714597425402e-03
1600.00000  1650.00000  1.644084097773e-03
1650.00000  1700.00000  1.576282821207e-03
1700.00000  1750.00000  1.474968342223e-03
1750.00000  1800.00000  1.344208737416e-03
1800.00000  1850.00000  1.228559131387e-03
1850.00000  1900.00000  1.153977727163e-03
1900.00000  1950.00000  1.111166063960e-03
1950.00000  2000.00000  1.074747092547e-03
2000.00000  2050.00000  1.022443250624e-03
2050.00000  2100.00000  9.492178719322e-04
2100.00000  2150.00000  8.938145430807e-04
2150.00000  2200.00000  8.519714695424e-04
2200.00000  2250.00000  8.167148057278e-04
2250.00000  2300.00000  7.587931437466e-04
2300.00000  2350.00000  7.082327632213e-04
2350.00000  2400.00000  6.979657127698e-04
2400.00000  2450.00000  6.570912288968e-04
2450.00000  2500.00000  6.142795656933e-04
2500.00000  2550.00000  5.581013651095e-04
2550.00000  2600.00000  5.187766247009e-04
2600.00000  2650.00000  4.997922672623e-04
2650.00000  2700.00000  4.800330380914e-04
2700.00000  2750.00000  4.480695791386e-04
2750.00000  2800.00000  4.298600934322e-04
2800.00000  2850.00000  4.029333007386e-04
2850.00000  2900.00000  3.942159937514e-04
2900.00000  2950.00000  3.665143293257e-04
2950.00000  3000.00000  3.535352278115e-04
3000.00000  3050.00000  3.182785639969e-04
3050.00000  3100.00000  3.064617700810e-04
3100.00000  3150.00000  3.134356156707e-04
3150.00000  3200.00000  2.853465153788e-04
3200.00000  3250.00000  2.665558758732e-04
3250.00000  3300.00000  2.578385688861e-04
3300.00000  3350.00000  2.436971597736e-04
3350.00000  3400.00000  2.353672886526e-04
3400.00000  3450.00000  2.330426734560e-04
3450.00000  3500.00000  2.163829312139e-04
3500.00000  3550.00000  2.065033166285e-04
3550.00000  3600.00000  2.053410090302e-04
3600.00000  3650.00000  1.892624205873e-04
3650.00000  3700.00000  1.888749847212e-04
3700.00000  3750.00000  1.739587038766e-04
3750.00000  3800.00000  1.652413968894e-04
3800.00000  3850.00000  1.526497312413e-04
3850.00000  3900.00000  1.555555002371e-04
3900.00000  3950.00000  1.443198601203e-04
3950.00000  4000.00000  1.458696035847e-04
4000.00000  4050.00000  1.344402455349e-04
4050.00000  4100.00000  1.303721689409e-04
4100.00000  4150.00000  1.317281944722e-04
4150.00000  4200.00000  1.253355026817e-04
4200.00000  4250.00000  1.212674260877e-04
4250.00000  4300.00000  1.146810163641e-04
4300.00000  4350.00000  1.065448631761e-04
4350.00000  4400.00000  1.001521713855e-04
4400.00000  4450.00000  1.042202479795e-04
4450.00000  4500.00000  1.015081969168e-04
4500.00000  4550.00000  9.492178719322e-05
4550.00000  4600.00000  9.046627473313e-05
4600.00000  4650.00000  8.523589054085e-05
4650.00000  4700.00000  9.279088992970e-05
4700.00000  4750.00000  8.833537746961e-05
4750.00000  4800.00000  8.659191607219e-05
4800.00000  4850.00000  8.697935193828e-05
4850.00000  4900.00000  8.717306987133e-05
4900.00000  4950.00000  7.632486562067e-05
4950.00000  5000.00000  7.535627595544e-05
5000.00000  5050.00000  7.516255802239e-05
5050.00000  5100.00000  6.780127656659e-05
5100.00000  5150.00000  7.303166075887e-05
5150.00000  5200.00000  7.322537869192e-05
5200.00000  5250.00000  7.225678902668e-05
5250.00000  5300.00000  6.644525103526e-05
5300.00000  5350.00000  6.470178963783e-05
5350.00000  5400.00000  7.012589176316e-05
5400.00000  5450.00000  6.780127656659e-05
5450.00000  5500.00000  6.063371304383e-05
5500.00000  5550.00000  6.295832824040e-05
5550.00000  5600.00000  6.102114890993e-05
5600.00000  5650.00000  5.966512337860e-05
5650.00000  5700.00000  6.179602064212e-05
5700.00000  5750.00000  4.997922672623e-05
5750.00000  5800.00000  5.191640605670e-05
5800.00000  5850.00000  5.559704678460e-05
5850.00000  5900.00000  6.005255924469e-05
5900.00000  5950.00000  5.675935438289e-05
5950.00000  6000.00000  5.482217505241e-05
6000.00000  6050.00000  5.385358538718e-05
6050.00000  6100.00000  4.939807292709e-05
6100.00000  6150.00000  5.017294465928e-05
6150.00000  6200.00000  5.404730332022e-05
6200.00000  6250.00000  5.249755985584e-05
6250.00000  6300.00000  7.109448142839e-05
6300.00000  6350.00000  6.605781516916e-05
6350.00000  6400.00000  3.758127901119e-04
6400.00000  6450.00000  4.823576532880e-05
6450.00000  6500.00000  4.339281700262e-05
6500.00000  6550.00000  4.552371426614e-05
6550.00000  6600.00000  4.087448387300e-05
6600.00000  6650.00000  4.746089359661e-05
6650.00000  6700.00000  4.223050940433e-05
6700.00000  6750.00000  4.068076593995e-05
6750.00000  6800.00000  3.680640727901e-05
6800.00000  6850.00000  4.319909906957e-05
6850.00000  6900.00000  4.474884253395e-05
6900.00000  6950.00000  3.641897141291e-05
6950.00000  7000.00000  3.467551001548e-05
7000.00000  7050.00000  3.428807414939e-05
7050.00000  7100.00000  7.245050695973e-05
7100.00000  7150.00000  2.247128023350e-05
7150.00000  7200.00000  3.118858722063e-05
7200.00000  7250.00000  2.847653615797e-05
7250.00000  7300.00000  3.041371548844e-05
7300.00000  7350.00000  2.905768995711e-05
7350.00000  7400.00000  3.215717688587e-05
7400.00000  7450.00000  3.041371548844e-05
7450.00000  7500.00000  4.009961214081e-05
7500.00000  7550.00000  2.653935682749e-05
7550.00000  7600.00000  3.041371548844e-05
7600.00000  7650.00000  2.537704922921e-05
7650.00000  7700.00000  2.557076716226e-05
7700.00000  7750.00000  2.944512582320e-05
7750.00000  7800.00000  2.343986989873e-05
7800.00000  7850.00000  2.673307476054e-05
7850.00000  7900.00000  2.557076716226e-05
7900.00000  7950.00000  2.421474163092e-05
7950.00000  8000.00000  2.227756230045e-05
8000.00000  8050.00000  2.227756230045e-05
8050.00000  8100.00000  2.576448509530e-05
8100.00000  8150.00000  2.653935682749e-05
8150.00000  8200.00000  2.828281822492e-05
8200.00000  8250.00000  3.080115135454e-05
8250.00000  8300.00000  2.537704922921e-05
8300.00000  8350.00000  2.285871609959e-05
8350.00000  8400.00000  2.305243403264e-05
8400.00000  8450.00000  2.634563889445e-05
8450.00000  8500.00000  2.266499816655e-05
8500.00000  8550.00000  2.034038296998e-05
8550.00000  8600.00000  1.995294710388e-05
8600.00000  8650.00000  2.343986989873e-05
8650.00000  8700.00000  2.673307476054e-05
8700.00000  8750.00000  2.343986989873e-05
8750.00000  8800.00000  1.840320363950e-05
8800.00000  8850.00000  2.053410090302e-05
8850.00000  8900.00000  2.092153676912e-05
8900.00000  8950.00000  2.557076716226e-05
8950.00000  9000.00000  1.937179330474e-05
9000.00000  9050.00000  2.053410090302e-05
9050.00000  9100.00000  1.995294710388e-05
9100.00000  9150.00000  1.995294710388e-05
9150.00000  9200.00000  2.034038296998e-05
9200.00000  9250.00000  2.053410090302e-05
9250.00000  9300.00000  2.072781883607e-05
9300.00000  9350.00000  2.034038296998e-05
9350.00000  9400.00000  2.343986989873e-05
9400.00000  9450.00000  2.169640850131e-05
9450.00000  9500.00000  2.053410090302e-05
9500.00000  9550.00000  2.130897263521e-05
9550.00000  9600.00000  2.034038296998e-05
9600.00000  9650.00000  2.285871609959e-05
9650.00000  9700.00000  2.363358783178e-05
9700.00000  9750.00000  2.169640850131e-05
9750.00000  9800.00000  1.937179330474e-05
9800.00000  9850.00000  1.782204984036e-05
9850.00000  9900.00000  1.956551123779e-05
9900.00000  9950.00000  1.956551123779e-05
9950.00000  10000.00000  2.092153676912e-05
