300.00000  350.00000  9.062522756546e-05
350.00000  400.00000  1.192437204809e-04
400.00000  450.00000  9.062522756546e-05
450.00000  500.00000  1.001647252039e-04
500.00000  550.00000  5.477261560754e-04
550.00000  600.00000  7.472606483467e-05
600.00000  650.00000  1.605815435809e-04
650.00000  700.00000  7.154623228852e-05
700.00000  750.00000  1.041395158866e-04
750.00000  800.00000  7.154623228852e-05
800.00000  850.00000  2.249731526406e-04
850.00000  900.00000  7.552102297121e-05
900.00000  950.00000  8.029077179045e-05
950.00000  1000.00000  5.564706955774e-05
1000.00000  1050.00000  6.041681837697e-05
1050.00000  1100.00000  6.121177651351e-05
1100.00000  1150.00000  8.506052060968e-05
1150.00000  1200.00000  7.631598110775e-05
1200.00000  1250.00000  8.426556247314e-05
1250.00000  1300.00000  1.987395341348e-04
1300.00000  1350.00000  1.287832181193e-04
1350.00000  1400.00000  2.035092829540e-04
1400.00000  1450.00000  2.392823990983e-04
1450.00000  1500.00000  3.632958683984e-04
1500.00000  1550.00000  4.563059703734e-04
1550.00000  1600.00000  5.938337279947e-04
1600.00000  1650.00000  7.043329089736e-04
1650.00000  1700.00000  8.529900805064e-04
1700.00000  1750.00000  1.206746451266e-03
1750.00000  1800.00000  1.166203586303e-03
1800.00000  1850.00000  1.211516200086e-03
1850.00000  1900.00000  1.144739716616e-03
1900.00000  1950.00000  1.436489352726e-03
1950.00000  2000.00000  1.519164998926e-03
2000.00000  2050.00000  1.574812068484e-03
2050.00000  2100.00000  1.818864216401e-03
2100.00000  2150.00000  1.866561704594e-03
2150.00000  2200.00000  1.934928104336e-03
2200.00000  2250.00000  1.919028941605e-03
2250.00000  2300.00000  2.061326448046e-03
2300.00000  2350.00000  2.208393703306e-03
2350.00000  2400.00000  2.044632327179e-03
2400.00000  2450.00000  2.151156717475e-03
2450.00000  2500.00000  2.010449127307e-03
2500.00000  2550.00000  1.893590281236e-03
2550.00000  2600.00000  1.915849109059e-03
2600.00000  2650.00000  1.870536495276e-03
2650.00000  2700.00000  1.879281034778e-03
2700.00000  2750.00000  1.905514653284e-03
2750.00000  2800.00000  1.848277667453e-03
2800.00000  2850.00000  1.761627230571e-03
2850.00000  2900.00000  1.743343193430e-03
2900.00000  2950.00000  1.693260830828e-03
2950.00000  3000.00000  1.692465872692e-03
3000.00000  3050.00000  1.611380142765e-03
3050.00000  3100.00000  1.577196942894e-03
3100.00000  3150.00000  1.512805333834e-03
3150.00000  3200.00000  1.465107845642e-03
3200.00000  3250.00000  1.384022115715e-03
3250.00000  3300.00000  1.372892701803e-03
3300.00000  3350.00000  1.348248999570e-03
3350.00000  3400.00000  1.273522934736e-03
3400.00000  3450.00000  1.254443939459e-03
3450.00000  3500.00000  1.192437204809e-03
3500.00000  3550.00000  1.170973335122e-03
3550.00000  3600.00000  1.116916181837e-03
3600.00000  3650.00000  1.098632144697e-03
3650.00000  3700.00000  9.936976706739e-04
3700.00000  3750.00000  9.857480893085e-04
3750.00000  3800.00000  1.015161540360e-03
3800.00000  3850.00000  8.903531129238e-04
3850.00000  3900.00000  8.943279036065e-04
3900.00000  3950.00000  8.084724248603e-04
3950.00000  4000.00000  8.068825085872e-04
4000.00000  4050.00000  7.997278853583e-04
4050.00000  4100.00000  7.496455227564e-04
4100.00000  4150.00000  7.059228252467e-04
4150.00000  4200.00000  7.377211507083e-04
4200.00000  4250.00000  6.836639974236e-04
4250.00000  4300.00000  6.240421371832e-04
4300.00000  4350.00000  6.439160905967e-04
4350.00000  4400.00000  6.025782674966e-04
4400.00000  4450.00000  5.763446489908e-04
4450.00000  4500.00000  5.834992722197e-04
4500.00000  4550.00000  5.628303606697e-04
4550.00000  4600.00000  5.199026212966e-04
4600.00000  4650.00000  5.151328724773e-04
4650.00000  4700.00000  4.809496726061e-04
4700.00000  4750.00000  4.833345470158e-04
4750.00000  4800.00000  4.348421006869e-04
4800.00000  4850.00000  4.578958866465e-04
4850.00000  4900.00000  4.427916820523e-04
4900.00000  4950.00000  4.014538589522e-04
4950.00000  5000.00000  4.030437752253e-04
5000.00000  5050.00000  3.871446124945e-04
5050.00000  5100.00000  3.489866219407e-04
5100.00000  5150.00000  3.553462870330e-04
5150.00000  5200.00000  3.434219149849e-04
5200.00000  5250.00000  3.473967056676e-04
5250.00000  5300.00000  3.155983802060e-04
5300.00000  5350.00000  3.092387151137e-04
5350.00000  5400.00000  2.996992174752e-04
5400.00000  5450.00000  2.766454315156e-04
5450.00000  5500.00000  2.798252640618e-04
5500.00000  5550.00000  2.567714781021e-04
5550.00000  5600.00000  2.925445942464e-04
5600.00000  5650.00000  2.416672735079e-04
5650.00000  5700.00000  2.456420641906e-04
5700.00000  5750.00000  2.448471060540e-04
5750.00000  5800.00000  2.233832363675e-04
5800.00000  5850.00000  2.305378595963e-04
5850.00000  5900.00000  2.090739899098e-04
5900.00000  5950.00000  2.058941573636e-04
5950.00000  6000.00000  2.130487805925e-04
6000.00000  6050.00000  1.923798690425e-04
6050.00000  6100.00000  1.597865854444e-04
6100.00000  6150.00000  1.725059156290e-04
6150.00000  6200.00000  1.597865854444e-04
6200.00000  6250.00000  1.733008737655e-04
6250.00000  6300.00000  1.653512924001e-04
6300.00000  6350.00000  1.597865854444e-04
6350.00000  6400.00000  3.155983802060e-04
6400.00000  6450.00000  1.446823808501e-04
6450.00000  6500.00000  1.534269203520e-04
6500.00000  6550.00000  1.438874227136e-04
6550.00000  6600.00000  1.279882599828e-04
6600.00000  6650.00000  1.287832181193e-04
6650.00000  6700.00000  1.208336367539e-04
6700.00000  6750.00000  1.176538042078e-04
6750.00000  6800.00000  1.224235530270e-04
6800.00000  6850.00000  1.089092647059e-04
6850.00000  6900.00000  1.192437204809e-04
6900.00000  6950.00000  1.343479250751e-04
6950.00000  7000.00000  1.057294321597e-04
7000.00000  7050.00000  1.160638879347e-04
7050.00000  7100.00000  1.104991809789e-04
7100.00000  7150.00000  8.188068806353e-05
7150.00000  7200.00000  8.903531129238e-05
7200.00000  7250.00000  7.870085551737e-05
7250.00000  7300.00000  8.824035315584e-05
7300.00000  7350.00000  8.108572992699e-05
7350.00000  7400.00000  8.347060433660e-05
7400.00000  7450.00000  7.313614856160e-05
7450.00000  7500.00000  8.108572992699e-05
7500.00000  7550.00000  7.790589738083e-05
7550.00000  7600.00000  8.029077179045e-05
7600.00000  7650.00000  6.518656719621e-05
7650.00000  7700.00000  7.393110669814e-05
7700.00000  7750.00000  6.598152533274e-05
7750.00000  7800.00000  6.439160905967e-05
7800.00000  7850.00000  6.836639974236e-05
7850.00000  7900.00000  7.472606483467e-05
7900.00000  7950.00000  6.518656719621e-05
7950.00000  8000.00000  5.485211142120e-05
8000.00000  8050.00000  6.916135787890e-05
8050.00000  8100.00000  6.439160905967e-05
8100.00000  8150.00000  5.167227887504e-05
8150.00000  8200.00000  4.531261378273e-05
8200.00000  8250.00000  5.485211142120e-05
8250.00000  8300.00000  6.041681837697e-05
8300.00000  8350.00000  4.849244632888e-05
8350.00000  8400.00000  5.167227887504e-05
8400.00000  8450.00000  4.928740446542e-05
8450.00000  8500.00000  5.803194396735e-05
8500.00000  8550.00000  4.769748819235e-05
8550.00000  8600.00000  3.815799055388e-05
8600.00000  8650.00000  4.769748819235e-05
8650.00000  8700.00000  3.497815800772e-05
8700.00000  8750.00000  3.815799055388e-05
8750.00000  8800.00000  3.656807428080e-05
8800.00000  8850.00000  3.577311614426e-05
8850.00000  8900.00000  4.054286496349e-05
8900.00000  8950.00000  5.008236260196e-05
8950.00000  9000.00000  4.292773937311e-05
9000.00000  9050.00000  3.656807428080e-05
9050.00000  9100.00000  4.133782310003e-05
9100.00000  9150.00000  3.815799055388e-05
9150.00000  9200.00000  3.656807428080e-05
9200.00000  9250.00000  3.497815800772e-05
9250.00000  9300.00000  2.941345105195e-05
9300.00000  9350.00000  2.623361850579e-05
9350.00000  9400.00000  3.656807428080e-05
9400.00000  9450.00000  2.623361850579e-05
9450.00000  9500.00000  3.179832546156e-05
9500.00000  9550.00000  3.179832546156e-05
9550.00000  9600.00000  3.736303241734e-05
9600.00000  9650.00000  3.895294869042e-05
9650.00000  9700.00000  4.054286496349e-05
9700.00000  9750.00000  3.020840918849e-05
9750.00000  9800.00000  2.543866036925e-05
9800.00000  9850.00000  2.702857664233e-05
9850.00000  9900.00000  2.861849291541e-05
9900.00000  9950.00000  2.702857664233e-05
9950.00000  10000.00000  2.225882782309e-05
