300.00000  350.00000  6.335799366068e-02
350.00000  400.00000  4.775229718756e-02
400.00000  450.00000  3.696833961462e-02
450.00000  500.00000  2.968226006043e-02
500.00000  550.00000  2.426910811266e-02
550.00000  600.00000  2.014931333937e-02
600.00000  650.00000  1.705946725940e-02
650.00000  700.00000  1.463890839652e-02
700.00000  750.00000  1.272614653750e-02
750.00000  800.00000  1.102188648712e-02
800.00000  850.00000  9.854491678970e-03
850.00000  900.00000  8.788656271595e-03
900.00000  950.00000  7.726409535624e-03
950.00000  1000.00000  7.089779228323e-03
1000.00000  1050.00000  6.391423772850e-03
1050.00000  1100.00000  5.780273032526e-03
1100.00000  1150.00000  5.146154795209e-03
1150.00000  1200.00000  4.878439908373e-03
1200.00000  1250.00000  4.456053283969e-03
1250.00000  1300.00000  4.119077039010e-03
1300.00000  1350.00000  3.800403018219e-03
1350.00000  1400.00000  3.507926298687e-03
1400.00000  1450.00000  3.309472769973e-03
1450.00000  1500.00000  3.060777841586e-03
1500.00000  1550.00000  2.825360997397e-03
1550.00000  1600.00000  2.683967344028e-03
1600.00000  1650.00000  2.493408892407e-03
1650.00000  1700.00000  2.412304918647e-03
1700.00000  1750.00000  2.271270132418e-03
1750.00000  1800.00000  2.149255304638e-03
1800.00000  1850.00000  2.019345399766e-03
1850.00000  1900.00000  1.913120726169e-03
1900.00000  1950.00000  1.820891871052e-03
1950.00000  2000.00000  1.738711295871e-03
2000.00000  2050.00000  1.620285139496e-03
2050.00000  2100.00000  1.528056284379e-03
2100.00000  2150.00000  1.467766604770e-03
2150.00000  2200.00000  1.405323722318e-03
2200.00000  2250.00000  1.326731818542e-03
2250.00000  2300.00000  1.280796824554e-03
2300.00000  2350.00000  1.217995074961e-03
2350.00000  2400.00000  1.182108360908e-03
2400.00000  2450.00000  1.122177548439e-03
2450.00000  2500.00000  1.068706344500e-03
2500.00000  2550.00000  1.060093533127e-03
2550.00000  2600.00000  9.965740492535e-04
2600.00000  2650.00000  9.782718250864e-04
2650.00000  2700.00000  9.366432367849e-04
2700.00000  2750.00000  8.849663685485e-04
2750.00000  2800.00000  8.820954314242e-04
2800.00000  2850.00000  8.465675845117e-04
2850.00000  2900.00000  7.981205205401e-04
2900.00000  2950.00000  8.178582132692e-04
2950.00000  3000.00000  7.604394707844e-04
3000.00000  3050.00000  7.263470924339e-04
3050.00000  3100.00000  6.854362384135e-04
3100.00000  3150.00000  6.962022526294e-04
3150.00000  3200.00000  6.717992870733e-04
3200.00000  3250.00000  6.351948387392e-04
3250.00000  3300.00000  6.194046845558e-04
3300.00000  3350.00000  5.953605861403e-04
3350.00000  3400.00000  5.924896490160e-04
3400.00000  3450.00000  5.558852006819e-04
3450.00000  3500.00000  5.637802777736e-04
3500.00000  3550.00000  5.400950464986e-04
3550.00000  3600.00000  5.368652422338e-04
3600.00000  3650.00000  5.178452837857e-04
3650.00000  3700.00000  4.841117725758e-04
3700.00000  3750.00000  5.153332138019e-04
3750.00000  3800.00000  4.981075910565e-04
3800.00000  3850.00000  4.471484571011e-04
3850.00000  3900.00000  4.525314642091e-04
3900.00000  3950.00000  4.421243171337e-04
3950.00000  4000.00000  4.170036172966e-04
4000.00000  4050.00000  4.259752958098e-04
4050.00000  4100.00000  3.829112389462e-04
4100.00000  4150.00000  3.961893231458e-04
4150.00000  4200.00000  3.814757703840e-04
4200.00000  4250.00000  3.868587774920e-04
4250.00000  4300.00000  3.717863575897e-04
4300.00000  4350.00000  3.617380776548e-04
4350.00000  4400.00000  3.527663991416e-04
4400.00000  4450.00000  3.509720634389e-04
4450.00000  4500.00000  3.305166364287e-04
4500.00000  4550.00000  3.315932378503e-04
4550.00000  4600.00000  3.165208179480e-04
4600.00000  4650.00000  3.079080065753e-04
4650.00000  4700.00000  3.215449579154e-04
4700.00000  4750.00000  2.964242580783e-04
4750.00000  4800.00000  2.914001181109e-04
4800.00000  4850.00000  2.745333625059e-04
4850.00000  4900.00000  2.781220339112e-04
4900.00000  4950.00000  2.809929710355e-04
4950.00000  5000.00000  2.608964111657e-04
5000.00000  5050.00000  2.311104385017e-04
5050.00000  5100.00000  2.526424669335e-04
5100.00000  5150.00000  2.393643827339e-04
5150.00000  5200.00000  2.522835997930e-04
5200.00000  5250.00000  2.390055155934e-04
5250.00000  5300.00000  2.429530541392e-04
5300.00000  5350.00000  2.458239912635e-04
5350.00000  5400.00000  2.196266900047e-04
5400.00000  5450.00000  2.289572356585e-04
5450.00000  5500.00000  2.178323543021e-04
5500.00000  5550.00000  2.329047742044e-04
5550.00000  5600.00000  2.149614171778e-04
5600.00000  5650.00000  2.146025500373e-04
5650.00000  5700.00000  2.117316129131e-04
5700.00000  5750.00000  2.034776686809e-04
5750.00000  5800.00000  1.840988430922e-04
5800.00000  5850.00000  2.045542701024e-04
5850.00000  5900.00000  1.930705216055e-04
5900.00000  5950.00000  1.787158359842e-04
5950.00000  6000.00000  1.848165773733e-04
6000.00000  6050.00000  1.837399759517e-04
6050.00000  6100.00000  1.830222416706e-04
6100.00000  6150.00000  1.762037660005e-04
6150.00000  6200.00000  1.819456402490e-04
6200.00000  6250.00000  1.876875144975e-04
6250.00000  6300.00000  1.589781432551e-04
6300.00000  6350.00000  1.647200175035e-04
6350.00000  6400.00000  2.024010672593e-04
6400.00000  6450.00000  1.611313460982e-04
6450.00000  6500.00000  1.647200175035e-04
6500.00000  6550.00000  1.500064647418e-04
6550.00000  6600.00000  1.496475976013e-04
6600.00000  6650.00000  1.489298633202e-04
6650.00000  6700.00000  1.471355276175e-04
6700.00000  6750.00000  1.453411919149e-04
6750.00000  6800.00000  1.535951361471e-04
6800.00000  6850.00000  1.403170519475e-04
6850.00000  6900.00000  1.406759190880e-04
6900.00000  6950.00000  1.403170519475e-04
6950.00000  7000.00000  1.248857649047e-04
7000.00000  7050.00000  1.223736949209e-04
7050.00000  7100.00000  1.342163105584e-04
7100.00000  7150.00000  1.388815833853e-04
7150.00000  7200.00000  1.248857649047e-04
7200.00000  7250.00000  1.151963521103e-04
7250.00000  7300.00000  1.277567020289e-04
7300.00000  7350.00000  1.141197506887e-04
7350.00000  7400.00000  1.248857649047e-04
7400.00000  7450.00000  1.245268977641e-04
7450.00000  7500.00000  1.216559606399e-04
7500.00000  7550.00000  1.195027577967e-04
7550.00000  7600.00000  1.083778764402e-04
7600.00000  7650.00000  9.832959650539e-05
7650.00000  7700.00000  1.083778764402e-04
7700.00000  7750.00000  1.069424078781e-04
7750.00000  7800.00000  1.169906878130e-04
7800.00000  7850.00000  1.202204920778e-04
7850.00000  7900.00000  9.904733078645e-05
7900.00000  7950.00000  1.076601421592e-04
7950.00000  8000.00000  1.055069393160e-04
8000.00000  8050.00000  9.904733078645e-05
8050.00000  8100.00000  1.069424078781e-04
8100.00000  8150.00000  1.019182679107e-04
8150.00000  8200.00000  1.001239322080e-04
8200.00000  8250.00000  8.864018371106e-05
8250.00000  8300.00000  9.474092510008e-05
8300.00000  8350.00000  9.115225369477e-05
8350.00000  8400.00000  9.904733078645e-05
8400.00000  8450.00000  1.051480721755e-04
8450.00000  8500.00000  8.002737233832e-05
8500.00000  8550.00000  9.151112083530e-05
8550.00000  8600.00000  8.397491088416e-05
8600.00000  8650.00000  8.899905085159e-05
8650.00000  8700.00000  7.572096665196e-05
8700.00000  8750.00000  8.469264516522e-05
8750.00000  8800.00000  7.930963805726e-05
8800.00000  8850.00000  8.433377802469e-05
8850.00000  8900.00000  8.253944232204e-05
8900.00000  8950.00000  7.930963805726e-05
8950.00000  9000.00000  8.505151230575e-05
9000.00000  9050.00000  8.648698086788e-05
9050.00000  9100.00000  8.325717660310e-05
9100.00000  9150.00000  8.038623947886e-05
9150.00000  9200.00000  7.679756807355e-05
9200.00000  9250.00000  8.038623947886e-05
9250.00000  9300.00000  7.859190377620e-05
9300.00000  9350.00000  7.105569382506e-05
9350.00000  9400.00000  7.285002952771e-05
9400.00000  9450.00000  6.818475670081e-05
9450.00000  9500.00000  6.603155385763e-05
9500.00000  9550.00000  7.500323237090e-05
9550.00000  9600.00000  7.141456096559e-05
9600.00000  9650.00000  7.141456096559e-05
9650.00000  9700.00000  6.459608529551e-05
9700.00000  9750.00000  6.674928813869e-05
9750.00000  9800.00000  6.746702241975e-05
9800.00000  9850.00000  6.674928813869e-05
9850.00000  9900.00000  6.603155385763e-05
9900.00000  9950.00000  5.849534390649e-05
9950.00000  10000.00000  7.069682668453e-05
