300.00000  350.00000  1.936156286333e-07
350.00000  400.00000  1.936156286333e-07
400.00000  450.00000  0.000000000000e+00
450.00000  500.00000  0.000000000000e+00
500.00000  550.00000  2.904234429500e-06
550.00000  600.00000  0.000000000000e+00
600.00000  650.00000  1.355309400433e-06
650.00000  700.00000  3.872312572666e-07
700.00000  750.00000  7.744625145333e-07
750.00000  800.00000  0.000000000000e+00
800.00000  850.00000  3.872312572666e-06
850.00000  900.00000  3.872312572666e-07
900.00000  950.00000  3.872312572666e-07
950.00000  1000.00000  3.872312572666e-07
1000.00000  1050.00000  7.744625145333e-07
1050.00000  1100.00000  1.936156286333e-07
1100.00000  1150.00000  3.872312572666e-07
1150.00000  1200.00000  7.744625145333e-07
1200.00000  1250.00000  1.936156286333e-07
1250.00000  1300.00000  6.389315744900e-06
1300.00000  1350.00000  1.936156286333e-07
1350.00000  1400.00000  3.872312572666e-07
1400.00000  1450.00000  1.936156286333e-07
1450.00000  1500.00000  2.129771914967e-06
1500.00000  1550.00000  5.808468859000e-07
1550.00000  1600.00000  1.161693771800e-06
1600.00000  1650.00000  7.744625145333e-07
1650.00000  1700.00000  1.161693771800e-06
1700.00000  1750.00000  1.819986909153e-05
1750.00000  1800.00000  9.680781431666e-07
1800.00000  1850.00000  1.161693771800e-06
1850.00000  1900.00000  2.129771914967e-06
1900.00000  1950.00000  1.355309400433e-06
1950.00000  2000.00000  1.936156286333e-06
2000.00000  2050.00000  2.517003172233e-06
2050.00000  2100.00000  1.355309400433e-06
2100.00000  2150.00000  2.904234429500e-06
2150.00000  2200.00000  2.129771914967e-06
2200.00000  2250.00000  3.097850058133e-06
2250.00000  2300.00000  3.291465686766e-06
2300.00000  2350.00000  3.252742561040e-05
2350.00000  2400.00000  3.872312572666e-06
2400.00000  2450.00000  3.872312572666e-06
2450.00000  2500.00000  5.034006344466e-06
2500.00000  2550.00000  4.453159458566e-06
2550.00000  2600.00000  2.129771914967e-06
2600.00000  2650.00000  4.646775087200e-06
2650.00000  2700.00000  6.776547002166e-06
2700.00000  2750.00000  4.840390715833e-06
2750.00000  2800.00000  5.034006344466e-06
2800.00000  2850.00000  4.259543829933e-06
2850.00000  2900.00000  7.744625145333e-06
2900.00000  2950.00000  7.744625145333e-06
2950.00000  3000.00000  1.781263783427e-05
3000.00000  3050.00000  8.325472031233e-06
3050.00000  3100.00000  7.551009516699e-06
3100.00000  3150.00000  7.357393888066e-06
3150.00000  3200.00000  8.712703288499e-06
3200.00000  3250.00000  9.293550174399e-06
3250.00000  3300.00000  8.906318917133e-06
3300.00000  3350.00000  1.045524394620e-05
3350.00000  3400.00000  8.325472031233e-06
3400.00000  3450.00000  1.161693771800e-05
3450.00000  3500.00000  9.680781431666e-06
3500.00000  3550.00000  1.413394089023e-05
3550.00000  3600.00000  1.607009717657e-05
3600.00000  3650.00000  1.181055334663e-05
3650.00000  3700.00000  2.962319118090e-05
3700.00000  3750.00000  1.568286591930e-05
3750.00000  3800.00000  1.529563466203e-05
3800.00000  3850.00000  1.665094406247e-05
3850.00000  3900.00000  2.013602537787e-05
3900.00000  3950.00000  2.381472232190e-05
3950.00000  4000.00000  2.536364735096e-05
4000.00000  4050.00000  3.136573183860e-05
4050.00000  4100.00000  2.555726297960e-05
4100.00000  4150.00000  2.981680680953e-05
4150.00000  4200.00000  3.601250692580e-05
4200.00000  4250.00000  3.388273501083e-05
4250.00000  4300.00000  3.775504758350e-05
4300.00000  4350.00000  4.588690398610e-05
4350.00000  4400.00000  4.995283218740e-05
4400.00000  4450.00000  4.511244147156e-05
4450.00000  4500.00000  5.440599164596e-05
4500.00000  4550.00000  5.072729470193e-05
4550.00000  4600.00000  5.827830421863e-05
4600.00000  4650.00000  7.221862948023e-05
4650.00000  4700.00000  6.834631690756e-05
4700.00000  4750.00000  7.086332007979e-05
4750.00000  4800.00000  8.286748905506e-05
4800.00000  4850.00000  8.306110468369e-05
4850.00000  4900.00000  8.499726097003e-05
4900.00000  4950.00000  9.700142994529e-05
4950.00000  5000.00000  9.216103922946e-05
5000.00000  5050.00000  1.020354362898e-04
5050.00000  5100.00000  1.051332863479e-04
5100.00000  5150.00000  1.171374553232e-04
5150.00000  5200.00000  1.150076834082e-04
5200.00000  5250.00000  1.159757615514e-04
5250.00000  5300.00000  1.192672272381e-04
5300.00000  5350.00000  1.281735461553e-04
5350.00000  5400.00000  1.343692462715e-04
5400.00000  5450.00000  1.485031871618e-04
5450.00000  5500.00000  1.492776496763e-04
5500.00000  5550.00000  1.496648809336e-04
5550.00000  5600.00000  1.467606465041e-04
5600.00000  5650.00000  1.502457278195e-04
5650.00000  5700.00000  1.643796687097e-04
5700.00000  5750.00000  1.514074215913e-04
5750.00000  5800.00000  1.541180403921e-04
5800.00000  5850.00000  1.777391470854e-04
5850.00000  5900.00000  1.796753033717e-04
5900.00000  5950.00000  1.883880066602e-04
5950.00000  6000.00000  1.837412315730e-04
6000.00000  6050.00000  1.771583001995e-04
6050.00000  6100.00000  1.852901566021e-04
6100.00000  6150.00000  1.798689190004e-04
6150.00000  6200.00000  1.961326318056e-04
6200.00000  6250.00000  2.122027289821e-04
6250.00000  6300.00000  2.309834449595e-04
6300.00000  6350.00000  2.195601228702e-04
6350.00000  6400.00000  9.287741705540e-04
6400.00000  6450.00000  2.063942601231e-04
6450.00000  6500.00000  2.000049443782e-04
6500.00000  6550.00000  2.023283319218e-04
6550.00000  6600.00000  1.990368662351e-04
6600.00000  6650.00000  2.046517194654e-04
6650.00000  6700.00000  2.056197976086e-04
6700.00000  6750.00000  2.048453350941e-04
6750.00000  6800.00000  2.019411006646e-04
6800.00000  6850.00000  2.027155631791e-04
6850.00000  6900.00000  2.135580383826e-04
6900.00000  6950.00000  2.125899602394e-04
6950.00000  7000.00000  2.071687226377e-04
7000.00000  7050.00000  2.096857258099e-04
7050.00000  7100.00000  2.917787523504e-04
7100.00000  7150.00000  9.138657671493e-05
7150.00000  7200.00000  7.744625145333e-05
7200.00000  7250.00000  8.732064851363e-05
7250.00000  7300.00000  9.235465485809e-05
7300.00000  7350.00000  8.906318917133e-05
7350.00000  7400.00000  8.577172348456e-05
7400.00000  7450.00000  8.848234228543e-05
7450.00000  7500.00000  1.121034489787e-04
7500.00000  7550.00000  9.061211420039e-05
7550.00000  7600.00000  9.874397060299e-05
7600.00000  7650.00000  9.390357988716e-05
7650.00000  7700.00000  1.051332863479e-04
7700.00000  7750.00000  9.312911737263e-05
7750.00000  7800.00000  1.016482050325e-04
7800.00000  7850.00000  9.777589245983e-05
7850.00000  7900.00000  1.016482050325e-04
7900.00000  7950.00000  1.014545894039e-04
7950.00000  8000.00000  1.062949801197e-04
8000.00000  8050.00000  1.022290519184e-04
8050.00000  8100.00000  1.024226675470e-04
8100.00000  8150.00000  1.099736770637e-04
8150.00000  8200.00000  1.091992145492e-04
8200.00000  8250.00000  1.045524394620e-04
8250.00000  8300.00000  1.208161522672e-04
8300.00000  8350.00000  1.070694426342e-04
8350.00000  8400.00000  9.816312371709e-05
8400.00000  8450.00000  1.074566738915e-04
8450.00000  8500.00000  1.122970646073e-04
8500.00000  8550.00000  9.390357988716e-05
8550.00000  8600.00000  1.022290519184e-04
8600.00000  8650.00000  1.030035144329e-04
8650.00000  8700.00000  1.076502895201e-04
8700.00000  8750.00000  1.126842958646e-04
8750.00000  8800.00000  1.043588238334e-04
8800.00000  8850.00000  1.159757615514e-04
8850.00000  8900.00000  1.049396707193e-04
8900.00000  8950.00000  1.128779114932e-04
8950.00000  9000.00000  1.026162831757e-04
9000.00000  9050.00000  1.140396052650e-04
9050.00000  9100.00000  1.072630582629e-04
9100.00000  9150.00000  1.157821459227e-04
9150.00000  9200.00000  1.043588238334e-04
9200.00000  9250.00000  1.043588238334e-04
9250.00000  9300.00000  1.061013644911e-04
9300.00000  9350.00000  1.171374553232e-04
9350.00000  9400.00000  1.053269019765e-04
9400.00000  9450.00000  1.053269019765e-04
9450.00000  9500.00000  1.109417552069e-04
9500.00000  9550.00000  1.066822113770e-04
9550.00000  9600.00000  1.157821459227e-04
9600.00000  9650.00000  1.101672926924e-04
9650.00000  9700.00000  1.068758270056e-04
9700.00000  9750.00000  1.020354362898e-04
9750.00000  9800.00000  1.082311364060e-04
9800.00000  9850.00000  1.107481395783e-04
9850.00000  9900.00000  1.055205176052e-04
9900.00000  9950.00000  1.150076834082e-04
9950.00000  10000.00000  1.117162177214e-04
