10001.00000  11001.00000  1.868709328435e-04
11001.00000  12001.00000  1.558885569278e-04
12001.00000  13001.00000  1.297172212886e-04
13001.00000  14001.00000  1.119742494420e-04
14001.00000  15001.00000  9.627506538194e-05
15001.00000  16001.00000  8.516988218740e-05
16001.00000  17001.00000  7.330506105448e-05
17001.00000  18001.00000  6.426175226414e-05
18001.00000  19001.00000  5.764205022961e-05
19001.00000  20001.00000  5.107660804783e-05
20001.00000  21001.00000  4.619322130105e-05
21001.00000  22001.00000  4.129174793668e-05
22001.00000  23001.00000  3.758399133264e-05
23001.00000  24001.00000  3.436457340328e-05
24001.00000  25001.00000  3.275486443860e-05
25001.00000  26001.00000  2.911945430489e-05
26001.00000  27001.00000  2.613516240408e-05
27001.00000  28001.00000  2.533935123053e-05
28001.00000  29001.00000  2.219227977149e-05
29001.00000  30001.00000  2.166776786165e-05
30001.00000  31001.00000  2.032935816068e-05
31001.00000  32001.00000  1.904520831245e-05
32001.00000  33001.00000  1.618752273470e-05
33001.00000  34001.00000  1.560875097212e-05
34001.00000  35001.00000  1.555449111938e-05
35001.00000  36001.00000  1.358304980309e-05
36001.00000  37001.00000  1.325749068664e-05
37001.00000  38001.00000  1.262445907131e-05
38001.00000  39001.00000  1.153926201647e-05
39001.00000  40001.00000  1.058067128470e-05
40001.00000  41001.00000  1.020085231550e-05
41001.00000  42001.00000  9.423127759532e-06
42001.00000  43001.00000  9.495474229855e-06
43001.00000  44001.00000  8.536883498079e-06
44001.00000  45001.00000  8.482623645337e-06
45001.00000  46001.00000  7.722985706949e-06
46001.00000  47001.00000  7.668725854207e-06
47001.00000  48001.00000  8.066631440981e-06
48001.00000  49001.00000  7.198473797109e-06
49001.00000  50001.00000  6.746308357592e-06
50001.00000  51001.00000  5.841977478558e-06
51001.00000  52001.00000  5.751544390655e-06
52001.00000  53001.00000  5.245119098396e-06
53001.00000  54001.00000  5.462158509364e-06
54001.00000  55001.00000  4.937646599525e-06
55001.00000  56001.00000  4.178008661136e-06
56001.00000  57001.00000  4.051402338071e-06
57001.00000  58001.00000  4.340788219362e-06
58001.00000  59001.00000  4.756780423718e-06
59001.00000  60001.00000  4.322701601782e-06
60001.00000  61001.00000  4.015229102910e-06
61001.00000  62001.00000  4.033315720491e-06
62001.00000  63001.00000  3.581150280974e-06
63001.00000  64001.00000  3.816276309523e-06
64001.00000  65001.00000  3.725843221619e-06
65001.00000  66001.00000  3.780103074361e-06
66001.00000  67001.00000  2.930032048069e-06
67001.00000  68001.00000  3.273677782102e-06
68001.00000  69001.00000  2.857685577747e-06
69001.00000  70001.00000  3.255591164522e-06
70001.00000  71001.00000  2.712992637101e-06
71001.00000  72001.00000  2.278913815165e-06
72001.00000  73001.00000  2.640646166779e-06
73001.00000  74001.00000  2.351260285488e-06
74001.00000  75001.00000  2.278913815165e-06
75001.00000  76001.00000  2.278913815165e-06
76001.00000  77001.00000  1.808661758068e-06
77001.00000  78001.00000  2.459779990972e-06
78001.00000  79001.00000  1.899094845971e-06
79001.00000  80001.00000  1.953354698713e-06
80001.00000  81001.00000  1.899094845971e-06
81001.00000  82001.00000  1.772488522906e-06
82001.00000  83001.00000  1.519275876777e-06
83001.00000  84001.00000  1.573535729519e-06
84001.00000  85001.00000  1.465016024035e-06
85001.00000  86001.00000  1.645882199842e-06
86001.00000  87001.00000  1.410756171293e-06
87001.00000  88001.00000  1.826748375648e-06
88001.00000  89001.00000  1.501189259196e-06
89001.00000  90001.00000  1.519275876777e-06
90001.00000  91001.00000  1.302236465809e-06
91001.00000  92001.00000  1.266063230647e-06
92001.00000  93001.00000  1.049023819679e-06
93001.00000  94001.00000  1.085197054841e-06
94001.00000  95001.00000  1.121370290002e-06
95001.00000  96001.00000  1.266063230647e-06
96001.00000  97001.00000  1.229889995486e-06
97001.00000  98001.00000  1.139456907583e-06
98001.00000  99001.00000  1.356496318551e-06
99001.00000  100001.00000  9.766773493565e-07
100001.00000  101001.00000  1.012850584518e-06
101001.00000  102001.00000  1.103283672421e-06
102001.00000  103001.00000  9.043308790338e-07
103001.00000  104001.00000  9.947639669372e-07
104001.00000  105001.00000  7.596379383884e-07
105001.00000  106001.00000  1.157543525163e-06
106001.00000  107001.00000  1.049023819679e-06
107001.00000  108001.00000  8.319844087111e-07
108001.00000  109001.00000  9.585907317758e-07
109001.00000  110001.00000  7.415513208077e-07
110001.00000  111001.00000  8.319844087111e-07
111001.00000  112001.00000  9.043308790338e-07
112001.00000  113001.00000  9.405041141951e-07
113001.00000  114001.00000  8.862442614531e-07
114001.00000  115001.00000  7.777245559691e-07
115001.00000  116001.00000  7.596379383884e-07
116001.00000  117001.00000  6.330316153237e-07
117001.00000  118001.00000  7.777245559691e-07
118001.00000  119001.00000  7.596379383884e-07
119001.00000  120001.00000  6.511182329043e-07
120001.00000  121001.00000  8.319844087111e-07
121001.00000  122001.00000  8.862442614531e-07
122001.00000  123001.00000  7.596379383884e-07
123001.00000  124001.00000  6.692048504850e-07
124001.00000  125001.00000  7.053780856464e-07
125001.00000  126001.00000  6.330316153237e-07
126001.00000  127001.00000  4.521654395169e-07
127001.00000  128001.00000  6.872914680657e-07
128001.00000  129001.00000  4.521654395169e-07
129001.00000  130001.00000  7.053780856464e-07
130001.00000  131001.00000  3.798189691942e-07
131001.00000  132001.00000  4.702520570976e-07
132001.00000  133001.00000  3.979055867749e-07
133001.00000  134001.00000  3.436457340328e-07
134001.00000  135001.00000  3.798189691942e-07
135001.00000  136001.00000  3.436457340328e-07
136001.00000  137001.00000  3.617323516135e-07
137001.00000  138001.00000  5.606851450010e-07
138001.00000  139001.00000  4.883386746782e-07
139001.00000  140001.00000  3.979055867749e-07
140001.00000  141001.00000  3.436457340328e-07
141001.00000  142001.00000  3.436457340328e-07
142001.00000  143001.00000  4.702520570976e-07
143001.00000  144001.00000  4.521654395169e-07
144001.00000  145001.00000  4.340788219362e-07
145001.00000  146001.00000  3.255591164522e-07
146001.00000  147001.00000  3.798189691942e-07
147001.00000  148001.00000  3.798189691942e-07
148001.00000  149001.00000  3.255591164522e-07
149001.00000  150001.00000  2.712992637101e-07
150001.00000  151001.00000  2.532126461295e-07
151001.00000  152001.00000  3.979055867749e-07
152001.00000  153001.00000  2.712992637101e-07
153001.00000  154001.00000  3.617323516135e-07
154001.00000  155001.00000  3.436457340328e-07
155001.00000  156001.00000  3.074724988715e-07
156001.00000  157001.00000  1.989527933874e-07
157001.00000  158001.00000  1.808661758068e-07
158001.00000  159001.00000  2.532126461295e-07
159001.00000  160001.00000  3.255591164522e-07
160001.00000  161001.00000  2.532126461295e-07
161001.00000  162001.00000  1.627795582261e-07
162001.00000  163001.00000  3.979055867749e-07
163001.00000  164001.00000  2.532126461295e-07
164001.00000  165001.00000  1.989527933874e-07
165001.00000  166001.00000  2.893858812908e-07
166001.00000  167001.00000  1.808661758068e-07
167001.00000  168001.00000  2.532126461295e-07
168001.00000  169001.00000  2.351260285488e-07
169001.00000  170001.00000  3.255591164522e-07
170001.00000  171001.00000  1.627795582261e-07
171001.00000  172001.00000  1.808661758068e-07
172001.00000  173001.00000  1.266063230647e-07
173001.00000  174001.00000  1.808661758068e-07
174001.00000  175001.00000  2.351260285488e-07
175001.00000  176001.00000  9.043308790338e-08
176001.00000  177001.00000  1.266063230647e-07
177001.00000  178001.00000  1.627795582261e-07
178001.00000  179001.00000  3.436457340328e-07
179001.00000  180001.00000  1.446929406454e-07
180001.00000  181001.00000  2.893858812908e-07
181001.00000  182001.00000  7.234647032270e-08
182001.00000  183001.00000  1.808661758068e-07
183001.00000  184001.00000  2.351260285488e-07
184001.00000  185001.00000  2.351260285488e-07
185001.00000  186001.00000  1.989527933874e-07
186001.00000  187001.00000  1.266063230647e-07
187001.00000  188001.00000  1.808661758068e-07
188001.00000  189001.00000  2.532126461295e-07
189001.00000  190001.00000  9.043308790338e-08
190001.00000  191001.00000  1.989527933874e-07
191001.00000  192001.00000  1.627795582261e-07
192001.00000  193001.00000  1.627795582261e-07
193001.00000  194001.00000  1.627795582261e-07
194001.00000  195001.00000  1.266063230647e-07
195001.00000  196001.00000  1.266063230647e-07
196001.00000  197001.00000  1.085197054841e-07
197001.00000  198001.00000  7.234647032270e-08
198001.00000  199001.00000  1.446929406454e-07
