10001.00000  11001.00000  5.115999423789e-04
11001.00000  12001.00000  4.208417782571e-04
12001.00000  13001.00000  3.521754706823e-04
13001.00000  14001.00000  3.038933497016e-04
14001.00000  15001.00000  2.577682855034e-04
15001.00000  16001.00000  2.257899187035e-04
16001.00000  17001.00000  1.973527201215e-04
17001.00000  18001.00000  1.748654031644e-04
18001.00000  19001.00000  1.542475354188e-04
19001.00000  20001.00000  1.378179529257e-04
20001.00000  21001.00000  1.250553669629e-04
21001.00000  22001.00000  1.126702659369e-04
22001.00000  23001.00000  1.019389084442e-04
23001.00000  24001.00000  9.248380954779e-05
24001.00000  25001.00000  8.412521451577e-05
25001.00000  26001.00000  7.963134621899e-05
26001.00000  27001.00000  7.091324172323e-05
27001.00000  28001.00000  6.634747153370e-05
28001.00000  29001.00000  6.214121080791e-05
29001.00000  30001.00000  5.707212736914e-05
30001.00000  31001.00000  5.123009858332e-05
31001.00000  32001.00000  4.912696822043e-05
32001.00000  33001.00000  4.585543210037e-05
33001.00000  34001.00000  4.272769976581e-05
34001.00000  35001.00000  3.891689945014e-05
35001.00000  36001.00000  3.764064085385e-05
36001.00000  37001.00000  3.467468777797e-05
37001.00000  38001.00000  3.309284613751e-05
38001.00000  39001.00000  3.030664779350e-05
39001.00000  40001.00000  2.901241372403e-05
40001.00000  41001.00000  2.847314952841e-05
41001.00000  42001.00000  2.590265686265e-05
42001.00000  43001.00000  2.442866806131e-05
43001.00000  44001.00000  2.246934148391e-05
44001.00000  45001.00000  2.193007728830e-05
45001.00000  46001.00000  2.086952437026e-05
46001.00000  47001.00000  2.033026017464e-05
47001.00000  48001.00000  1.853271285593e-05
48001.00000  49001.00000  1.700479763503e-05
49001.00000  50001.00000  1.709467500096e-05
50001.00000  51001.00000  1.668123911766e-05
51001.00000  52001.00000  1.504547105763e-05
52001.00000  53001.00000  1.556675978005e-05
53001.00000  54001.00000  1.407479550552e-05
54001.00000  55001.00000  1.416467287146e-05
55001.00000  56001.00000  1.339172752441e-05
56001.00000  57001.00000  1.202559156219e-05
57001.00000  58001.00000  1.189976324988e-05
58001.00000  59001.00000  1.198964061582e-05
59001.00000  60001.00000  1.121669526877e-05
60001.00000  61001.00000  1.083921033184e-05
61001.00000  62001.00000  1.105491601009e-05
62001.00000  63001.00000  9.850559306547e-06
63001.00000  64001.00000  9.383197003682e-06
64001.00000  65001.00000  9.149515852249e-06
65001.00000  66001.00000  8.951785647191e-06
66001.00000  67001.00000  8.915834700817e-06
67001.00000  68001.00000  8.538349763887e-06
68001.00000  69001.00000  7.819330836402e-06
69001.00000  70001.00000  8.088962934209e-06
70001.00000  71001.00000  7.172213801665e-06
71001.00000  72001.00000  7.873257255963e-06
72001.00000  73001.00000  6.704851498800e-06
73001.00000  74001.00000  6.776753391548e-06
74001.00000  75001.00000  6.273440142308e-06
75001.00000  76001.00000  6.039758990876e-06
76001.00000  77001.00000  5.842028785817e-06
77001.00000  78001.00000  5.698225000320e-06
78001.00000  79001.00000  5.680249527133e-06
79001.00000  80001.00000  5.967857098127e-06
80001.00000  81001.00000  5.248838170642e-06
81001.00000  82001.00000  5.446568375700e-06
82001.00000  83001.00000  5.248838170642e-06
83001.00000  84001.00000  4.871353233712e-06
84001.00000  85001.00000  4.529819243157e-06
85001.00000  86001.00000  4.691598501841e-06
86001.00000  87001.00000  3.936628627982e-06
87001.00000  88001.00000  3.720922949736e-06
88001.00000  89001.00000  4.314113564911e-06
89001.00000  90001.00000  3.990555047543e-06
90001.00000  91001.00000  4.278162618537e-06
91001.00000  92001.00000  3.828775788859e-06
92001.00000  93001.00000  3.127732334561e-06
93001.00000  94001.00000  4.062456940291e-06
94001.00000  95001.00000  3.702947476549e-06
95001.00000  96001.00000  3.163683280935e-06
96001.00000  97001.00000  3.577119164239e-06
97001.00000  98001.00000  3.181658754122e-06
98001.00000  99001.00000  3.037854968625e-06
99001.00000  100001.00000  3.109756861374e-06
100001.00000  101001.00000  2.965953075877e-06
101001.00000  102001.00000  2.588468138947e-06
102001.00000  103001.00000  2.588468138947e-06
103001.00000  104001.00000  2.786198344005e-06
104001.00000  105001.00000  2.696320978070e-06
105001.00000  106001.00000  2.318836041140e-06
106001.00000  107001.00000  2.121105836081e-06
107001.00000  108001.00000  2.031228470146e-06
108001.00000  109001.00000  2.480615299824e-06
109001.00000  110001.00000  2.067179416520e-06
110001.00000  111001.00000  2.228958675204e-06
111001.00000  112001.00000  2.103130362894e-06
112001.00000  113001.00000  2.013252996959e-06
113001.00000  114001.00000  1.653743533216e-06
114001.00000  115001.00000  1.977302050584e-06
115001.00000  116001.00000  1.995277523771e-06
116001.00000  117001.00000  1.887424684649e-06
117001.00000  118001.00000  1.959326577397e-06
118001.00000  119001.00000  1.977302050584e-06
119001.00000  120001.00000  1.725645425965e-06
120001.00000  121001.00000  1.599817113655e-06
121001.00000  122001.00000  1.635768060029e-06
122001.00000  123001.00000  1.617792586842e-06
123001.00000  124001.00000  1.797547318713e-06
124001.00000  125001.00000  1.545890694093e-06
125001.00000  126001.00000  1.761596372339e-06
126001.00000  127001.00000  1.689694479590e-06
127001.00000  128001.00000  1.563866167280e-06
128001.00000  129001.00000  1.869449211462e-06
129001.00000  130001.00000  1.348160489035e-06
130001.00000  131001.00000  1.527915220906e-06
131001.00000  132001.00000  1.258283123099e-06
132001.00000  133001.00000  1.294234069473e-06
133001.00000  134001.00000  1.078528391228e-06
134001.00000  135001.00000  1.114479337602e-06
135001.00000  136001.00000  1.402086908596e-06
136001.00000  137001.00000  1.258283123099e-06
137001.00000  138001.00000  1.240307649912e-06
138001.00000  139001.00000  1.060552918041e-06
139001.00000  140001.00000  1.438037854970e-06
140001.00000  141001.00000  9.347246057308e-07
141001.00000  142001.00000  1.186381230351e-06
142001.00000  143001.00000  1.078528391228e-06
143001.00000  144001.00000  8.987736593565e-07
144001.00000  145001.00000  1.168405757163e-06
145001.00000  146001.00000  9.527000789179e-07
146001.00000  147001.00000  9.347246057308e-07
147001.00000  148001.00000  1.204356703538e-06
148001.00000  149001.00000  8.628227129823e-07
149001.00000  150001.00000  8.268717666080e-07
150001.00000  151001.00000  7.729453470466e-07
151001.00000  152001.00000  8.807981861694e-07
152001.00000  153001.00000  8.987736593565e-07
153001.00000  154001.00000  8.628227129823e-07
154001.00000  155001.00000  9.347246057308e-07
155001.00000  156001.00000  8.448472397951e-07
156001.00000  157001.00000  8.807981861694e-07
157001.00000  158001.00000  7.010434542981e-07
158001.00000  159001.00000  8.628227129823e-07
159001.00000  160001.00000  8.987736593565e-07
160001.00000  161001.00000  8.628227129823e-07
161001.00000  162001.00000  8.088962934209e-07
162001.00000  163001.00000  7.190189274852e-07
163001.00000  164001.00000  7.909208202337e-07
164001.00000  165001.00000  8.448472397951e-07
165001.00000  166001.00000  8.448472397951e-07
166001.00000  167001.00000  4.314113564911e-07
167001.00000  168001.00000  8.628227129823e-07
168001.00000  169001.00000  6.471170347367e-07
169001.00000  170001.00000  6.650925079238e-07
170001.00000  171001.00000  7.010434542981e-07
171001.00000  172001.00000  7.010434542981e-07
172001.00000  173001.00000  6.830679811110e-07
173001.00000  174001.00000  4.853377760525e-07
174001.00000  175001.00000  7.729453470466e-07
175001.00000  176001.00000  6.650925079238e-07
176001.00000  177001.00000  5.033132492396e-07
177001.00000  178001.00000  7.190189274852e-07
178001.00000  179001.00000  3.954604101169e-07
179001.00000  180001.00000  4.493868296783e-07
180001.00000  181001.00000  4.853377760525e-07
181001.00000  182001.00000  5.212887224268e-07
182001.00000  183001.00000  6.291415615496e-07
183001.00000  184001.00000  5.752151419882e-07
184001.00000  185001.00000  4.673623028654e-07
185001.00000  186001.00000  5.752151419882e-07
186001.00000  187001.00000  4.673623028654e-07
187001.00000  188001.00000  4.853377760525e-07
188001.00000  189001.00000  4.314113564911e-07
189001.00000  190001.00000  4.853377760525e-07
190001.00000  191001.00000  3.235585173683e-07
191001.00000  192001.00000  4.673623028654e-07
192001.00000  193001.00000  3.595094637426e-07
193001.00000  194001.00000  4.853377760525e-07
194001.00000  195001.00000  2.336811514327e-07
195001.00000  196001.00000  3.415339905555e-07
196001.00000  197001.00000  3.774849369297e-07
197001.00000  198001.00000  5.392641956139e-07
198001.00000  199001.00000  5.033132492396e-07
