300.00000  350.00000  1.745967766888e-06
350.00000  400.00000  4.655914045034e-06
400.00000  450.00000  2.521953441060e-06
450.00000  500.00000  1.551971348345e-06
500.00000  550.00000  3.938127296425e-05
550.00000  600.00000  2.327957022517e-06
600.00000  650.00000  1.377374571656e-05
650.00000  700.00000  4.461917626491e-06
700.00000  750.00000  6.789874649008e-06
750.00000  800.00000  4.655914045034e-06
800.00000  850.00000  2.638351292186e-05
850.00000  900.00000  3.685931952319e-06
900.00000  950.00000  4.655914045034e-06
950.00000  1000.00000  5.237903300663e-06
1000.00000  1050.00000  7.177867486094e-06
1050.00000  1100.00000  7.371863904637e-06
1100.00000  1150.00000  7.177867486094e-06
1150.00000  1200.00000  6.595878230465e-06
1200.00000  1250.00000  4.849910463577e-06
1250.00000  1300.00000  2.463754515497e-05
1300.00000  1350.00000  8.341845997353e-06
1350.00000  1400.00000  8.729838834439e-06
1400.00000  1450.00000  6.983871067551e-06
1450.00000  1500.00000  1.183378153113e-05
1500.00000  1550.00000  1.086379943841e-05
1550.00000  1600.00000  7.177867486094e-06
1600.00000  1650.00000  1.047580660133e-05
1650.00000  1700.00000  1.163978511259e-05
1700.00000  1750.00000  3.860528729007e-05
1750.00000  1800.00000  7.177867486094e-06
1800.00000  1850.00000  1.260976720530e-05
1850.00000  1900.00000  1.047580660133e-05
1900.00000  1950.00000  1.183378153113e-05
1950.00000  2000.00000  1.066980301987e-05
2000.00000  2050.00000  1.222177436821e-05
2050.00000  2100.00000  1.338575287947e-05
2100.00000  2150.00000  1.416173855365e-05
2150.00000  2200.00000  1.357974929802e-05
2200.00000  2250.00000  1.299776004239e-05
2250.00000  2300.00000  1.396774213510e-05
2300.00000  2350.00000  4.791711538014e-05
2350.00000  2400.00000  1.260976720530e-05
2400.00000  2450.00000  1.454973139073e-05
2450.00000  2500.00000  1.726568125033e-05
2500.00000  2550.00000  1.474372780927e-05
2550.00000  2600.00000  1.377374571656e-05
2600.00000  2650.00000  1.241577078676e-05
2650.00000  2700.00000  1.260976720530e-05
2700.00000  2750.00000  1.687768841325e-05
2750.00000  2800.00000  1.474372780927e-05
2800.00000  2850.00000  1.474372780927e-05
2850.00000  2900.00000  1.513172064636e-05
2900.00000  2950.00000  1.260976720530e-05
2950.00000  3000.00000  2.715949859603e-05
3000.00000  3050.00000  1.784767050596e-05
3050.00000  3100.00000  1.435573497219e-05
3100.00000  3150.00000  1.978763469139e-05
3150.00000  3200.00000  1.862365618014e-05
3200.00000  3250.00000  1.629569915762e-05
3250.00000  3300.00000  1.726568125033e-05
3300.00000  3350.00000  1.377374571656e-05
3350.00000  3400.00000  1.435573497219e-05
3400.00000  3450.00000  1.959363827285e-05
3450.00000  3500.00000  1.784767050596e-05
3500.00000  3550.00000  1.416173855365e-05
3550.00000  3600.00000  1.532571706490e-05
3600.00000  3650.00000  1.784767050596e-05
3650.00000  3700.00000  2.812948068875e-05
3700.00000  3750.00000  1.726568125033e-05
3750.00000  3800.00000  1.745967766888e-05
3800.00000  3850.00000  1.920564543577e-05
3850.00000  3900.00000  2.133960603974e-05
3900.00000  3950.00000  1.804166692451e-05
3950.00000  4000.00000  2.114560962120e-05
4000.00000  4050.00000  1.881765259868e-05
4050.00000  4100.00000  1.998163110994e-05
4100.00000  4150.00000  1.629569915762e-05
4150.00000  4200.00000  2.075761678411e-05
4200.00000  4250.00000  1.881765259868e-05
4250.00000  4300.00000  1.939964185431e-05
4300.00000  4350.00000  2.192159529537e-05
4350.00000  4400.00000  2.036962394702e-05
4400.00000  4450.00000  2.017562752848e-05
4450.00000  4500.00000  1.862365618014e-05
4500.00000  4550.00000  1.939964185431e-05
4550.00000  4600.00000  2.172759887683e-05
4600.00000  4650.00000  1.784767050596e-05
4650.00000  4700.00000  2.114560962120e-05
4700.00000  4750.00000  1.959363827285e-05
4750.00000  4800.00000  2.289157738808e-05
4800.00000  4850.00000  1.978763469139e-05
4850.00000  4900.00000  1.939964185431e-05
4900.00000  4950.00000  2.056362036557e-05
4950.00000  5000.00000  1.474372780927e-05
5000.00000  5050.00000  1.784767050596e-05
5050.00000  5100.00000  1.629569915762e-05
5100.00000  5150.00000  1.862365618014e-05
5150.00000  5200.00000  2.114560962120e-05
5200.00000  5250.00000  2.075761678411e-05
5250.00000  5300.00000  1.454973139073e-05
5300.00000  5350.00000  1.804166692451e-05
5350.00000  5400.00000  1.726568125033e-05
5400.00000  5450.00000  2.289157738808e-05
5450.00000  5500.00000  2.153360245828e-05
5500.00000  5550.00000  2.172759887683e-05
5550.00000  5600.00000  1.998163110994e-05
5600.00000  5650.00000  2.075761678411e-05
5650.00000  5700.00000  2.172759887683e-05
5700.00000  5750.00000  2.056362036557e-05
5750.00000  5800.00000  1.726568125033e-05
5800.00000  5850.00000  1.939964185431e-05
5850.00000  5900.00000  2.172759887683e-05
5900.00000  5950.00000  1.668369199471e-05
5950.00000  6000.00000  1.939964185431e-05
6000.00000  6050.00000  1.920564543577e-05
6050.00000  6100.00000  2.017562752848e-05
6100.00000  6150.00000  1.784767050596e-05
6150.00000  6200.00000  1.804166692451e-05
6200.00000  6250.00000  2.327957022517e-05
6250.00000  6300.00000  1.959363827285e-05
6300.00000  6350.00000  2.172759887683e-05
6350.00000  6400.00000  2.440474945272e-04
6400.00000  6450.00000  1.745967766888e-05
6450.00000  6500.00000  1.842965976159e-05
6500.00000  6550.00000  1.571370990199e-05
6550.00000  6600.00000  1.687768841325e-05
6600.00000  6650.00000  1.784767050596e-05
6650.00000  6700.00000  1.862365618014e-05
6700.00000  6750.00000  1.804166692451e-05
6750.00000  6800.00000  1.998163110994e-05
6800.00000  6850.00000  1.823566334305e-05
6850.00000  6900.00000  1.765367408742e-05
6900.00000  6950.00000  2.017562752848e-05
6950.00000  7000.00000  1.687768841325e-05
7000.00000  7050.00000  1.707168483179e-05
7050.00000  7100.00000  4.578315477617e-05
7100.00000  7150.00000  1.183378153113e-05
7150.00000  7200.00000  1.202777794967e-05
7200.00000  7250.00000  1.241577078676e-05
7250.00000  7300.00000  1.163978511259e-05
7300.00000  7350.00000  1.454973139073e-05
7350.00000  7400.00000  8.729838834439e-06
7400.00000  7450.00000  1.086379943841e-05
7450.00000  7500.00000  2.211559171391e-05
7500.00000  7550.00000  1.590770632053e-05
7550.00000  7600.00000  8.729838834439e-06
7600.00000  7650.00000  1.377374571656e-05
7650.00000  7700.00000  1.280376362384e-05
7700.00000  7750.00000  1.474372780927e-05
7750.00000  7800.00000  1.066980301987e-05
7800.00000  7850.00000  1.202777794967e-05
7850.00000  7900.00000  9.505824508611e-06
7900.00000  7950.00000  1.416173855365e-05
7950.00000  8000.00000  1.610170273908e-05
8000.00000  8050.00000  1.280376362384e-05
8050.00000  8100.00000  8.341845997353e-06
8100.00000  8150.00000  1.066980301987e-05
8150.00000  8200.00000  1.066980301987e-05
8200.00000  8250.00000  1.144578869404e-05
8250.00000  8300.00000  1.435573497219e-05
8300.00000  8350.00000  1.260976720530e-05
8350.00000  8400.00000  1.086379943841e-05
8400.00000  8450.00000  1.105779585696e-05
8450.00000  8500.00000  1.066980301987e-05
8500.00000  8550.00000  1.105779585696e-05
8550.00000  8600.00000  9.893817345697e-06
8600.00000  8650.00000  1.066980301987e-05
8650.00000  8700.00000  1.105779585696e-05
8700.00000  8750.00000  1.008781376424e-05
8750.00000  8800.00000  1.202777794967e-05
8800.00000  8850.00000  8.923835252982e-06
8850.00000  8900.00000  1.144578869404e-05
8900.00000  8950.00000  1.086379943841e-05
8950.00000  9000.00000  1.241577078676e-05
9000.00000  9050.00000  1.222177436821e-05
9050.00000  9100.00000  8.341845997353e-06
9100.00000  9150.00000  9.893817345697e-06
9150.00000  9200.00000  1.028181018278e-05
9200.00000  9250.00000  1.028181018278e-05
9250.00000  9300.00000  1.163978511259e-05
9300.00000  9350.00000  1.066980301987e-05
9350.00000  9400.00000  1.086379943841e-05
9400.00000  9450.00000  1.008781376424e-05
9450.00000  9500.00000  8.341845997353e-06
9500.00000  9550.00000  1.028181018278e-05
9550.00000  9600.00000  1.066980301987e-05
9600.00000  9650.00000  1.008781376424e-05
9650.00000  9700.00000  9.311828090068e-06
9700.00000  9750.00000  7.565860323180e-06
9750.00000  9800.00000  9.311828090068e-06
9800.00000  9850.00000  9.311828090068e-06
9850.00000  9900.00000  9.505824508611e-06
9900.00000  9950.00000  1.047580660133e-05
9950.00000  10000.00000  1.105779585696e-05
