300.00000  350.00000  8.022188564395e-05
350.00000  400.00000  1.169590108454e-04
400.00000  450.00000  9.896531686917e-05
450.00000  500.00000  8.472030913800e-05
500.00000  550.00000  5.345626585433e-04
550.00000  600.00000  6.372766616575e-05
600.00000  650.00000  1.476982380547e-04
650.00000  700.00000  6.822608965981e-05
700.00000  750.00000  1.064626893593e-04
750.00000  800.00000  9.146794437908e-05
800.00000  850.00000  2.241714374537e-04
850.00000  900.00000  5.623029367566e-05
900.00000  950.00000  5.323134467963e-05
950.00000  1000.00000  7.197477590485e-05
1000.00000  1050.00000  5.623029367566e-05
1050.00000  1100.00000  6.222819166774e-05
1100.00000  1150.00000  5.098213293260e-05
1150.00000  1200.00000  5.548055642666e-05
1200.00000  1250.00000  5.623029367566e-05
1250.00000  1300.00000  1.357024420706e-04
1300.00000  1350.00000  4.723344668756e-05
1350.00000  1400.00000  4.573397218954e-05
1400.00000  1450.00000  4.573397218954e-05
1450.00000  1500.00000  5.698003092467e-05
1500.00000  1550.00000  4.423449769152e-05
1550.00000  1600.00000  5.248160743062e-05
1600.00000  1650.00000  4.873292118558e-05
1650.00000  1700.00000  4.348476044251e-05
1700.00000  1750.00000  1.274553323315e-04
1750.00000  1800.00000  5.248160743062e-05
1800.00000  1850.00000  4.648370943855e-05
1850.00000  1900.00000  4.348476044251e-05
1900.00000  1950.00000  4.498423494053e-05
1950.00000  2000.00000  3.823659969945e-05
2000.00000  2050.00000  4.573397218954e-05
2050.00000  2100.00000  4.198528594450e-05
2100.00000  2150.00000  4.723344668756e-05
2150.00000  2200.00000  5.023239568359e-05
2200.00000  2250.00000  4.498423494053e-05
2250.00000  2300.00000  4.798318393657e-05
2300.00000  2350.00000  1.169590108454e-04
2350.00000  2400.00000  4.198528594450e-05
2400.00000  2450.00000  4.273502319351e-05
2450.00000  2500.00000  5.772976817368e-05
2500.00000  2550.00000  3.823659969945e-05
2550.00000  2600.00000  4.198528594450e-05
2600.00000  2650.00000  4.423449769152e-05
2650.00000  2700.00000  4.348476044251e-05
2700.00000  2750.00000  5.023239568359e-05
2750.00000  2800.00000  3.898633694846e-05
2800.00000  2850.00000  4.423449769152e-05
2850.00000  2900.00000  3.523765070342e-05
2900.00000  2950.00000  4.348476044251e-05
2950.00000  3000.00000  6.522714066377e-05
3000.00000  3050.00000  5.173187018161e-05
3050.00000  3100.00000  3.598738795243e-05
3100.00000  3150.00000  4.498423494053e-05
3150.00000  3200.00000  4.348476044251e-05
3200.00000  3250.00000  5.173187018161e-05
3250.00000  3300.00000  4.273502319351e-05
3300.00000  3350.00000  5.173187018161e-05
3350.00000  3400.00000  4.423449769152e-05
3400.00000  3450.00000  3.973607419747e-05
3450.00000  3500.00000  4.798318393657e-05
3500.00000  3550.00000  4.198528594450e-05
3550.00000  3600.00000  5.698003092467e-05
3600.00000  3650.00000  5.698003092467e-05
3650.00000  3700.00000  7.497372490089e-05
3700.00000  3750.00000  4.573397218954e-05
3750.00000  3800.00000  5.023239568359e-05
3800.00000  3850.00000  4.948265843459e-05
3850.00000  3900.00000  5.698003092467e-05
3900.00000  3950.00000  5.623029367566e-05
3950.00000  4000.00000  5.098213293260e-05
4000.00000  4050.00000  5.323134467963e-05
4050.00000  4100.00000  6.972556415782e-05
4100.00000  4150.00000  7.197477590485e-05
4150.00000  4200.00000  5.997897992071e-05
4200.00000  4250.00000  5.548055642666e-05
4250.00000  4300.00000  5.173187018161e-05
4300.00000  4350.00000  5.772976817368e-05
4350.00000  4400.00000  5.548055642666e-05
4400.00000  4450.00000  7.272451315386e-05
4450.00000  4500.00000  6.597687791278e-05
4500.00000  4550.00000  6.747635241080e-05
4550.00000  4600.00000  5.997897992071e-05
4600.00000  4650.00000  7.422398765188e-05
4650.00000  4700.00000  5.698003092467e-05
4700.00000  4750.00000  6.672661516179e-05
4750.00000  4800.00000  6.072871716972e-05
4800.00000  4850.00000  6.222819166774e-05
4850.00000  4900.00000  7.722293664791e-05
4900.00000  4950.00000  4.498423494053e-05
4950.00000  5000.00000  6.822608965981e-05
5000.00000  5050.00000  6.372766616575e-05
5050.00000  5100.00000  5.772976817368e-05
5100.00000  5150.00000  5.922924267170e-05
5150.00000  5200.00000  5.248160743062e-05
5200.00000  5250.00000  6.297792891674e-05
5250.00000  5300.00000  7.722293664791e-05
5300.00000  5350.00000  7.497372490089e-05
5350.00000  5400.00000  6.747635241080e-05
5400.00000  5450.00000  7.947214839494e-05
5450.00000  5500.00000  6.972556415782e-05
5500.00000  5550.00000  5.623029367566e-05
5550.00000  5600.00000  6.447740341476e-05
5600.00000  5650.00000  6.072871716972e-05
5650.00000  5700.00000  6.297792891674e-05
5700.00000  5750.00000  6.822608965981e-05
5750.00000  5800.00000  6.372766616575e-05
5800.00000  5850.00000  5.847950542269e-05
5850.00000  5900.00000  6.372766616575e-05
5900.00000  5950.00000  6.372766616575e-05
5950.00000  6000.00000  6.147845441873e-05
6000.00000  6050.00000  6.522714066377e-05
6050.00000  6100.00000  6.372766616575e-05
6100.00000  6150.00000  6.822608965981e-05
6150.00000  6200.00000  5.997897992071e-05
6200.00000  6250.00000  7.947214839494e-05
6250.00000  6300.00000  9.446689337512e-05
6300.00000  6350.00000  8.846899538305e-05
6350.00000  6400.00000  6.852598455941e-04
6400.00000  6450.00000  5.772976817368e-05
6450.00000  6500.00000  7.572346214990e-05
6500.00000  6550.00000  5.323134467963e-05
6550.00000  6600.00000  6.147845441873e-05
6600.00000  6650.00000  7.047530140683e-05
6650.00000  6700.00000  5.772976817368e-05
6700.00000  6750.00000  6.447740341476e-05
6750.00000  6800.00000  5.772976817368e-05
6800.00000  6850.00000  5.398108192864e-05
6850.00000  6900.00000  6.222819166774e-05
6900.00000  6950.00000  4.798318393657e-05
6950.00000  7000.00000  5.772976817368e-05
7000.00000  7050.00000  4.573397218954e-05
7050.00000  7100.00000  1.342029675726e-04
7100.00000  7150.00000  3.073922720936e-05
7150.00000  7200.00000  4.123554869549e-05
7200.00000  7250.00000  3.148896445837e-05
7250.00000  7300.00000  3.673712520143e-05
7300.00000  7350.00000  3.673712520143e-05
7350.00000  7400.00000  2.699054096432e-05
7400.00000  7450.00000  3.373817620540e-05
7450.00000  7500.00000  5.698003092467e-05
7500.00000  7550.00000  2.624080371531e-05
7550.00000  7600.00000  3.373817620540e-05
7600.00000  7650.00000  3.373817620540e-05
7650.00000  7700.00000  3.298843895639e-05
7700.00000  7750.00000  2.923975271135e-05
7750.00000  7800.00000  2.849001546234e-05
7800.00000  7850.00000  3.448791345441e-05
7850.00000  7900.00000  3.298843895639e-05
7900.00000  7950.00000  3.748686245044e-05
7950.00000  8000.00000  3.748686245044e-05
8000.00000  8050.00000  3.598738795243e-05
8050.00000  8100.00000  3.073922720936e-05
8100.00000  8150.00000  3.298843895639e-05
8150.00000  8200.00000  3.673712520143e-05
8200.00000  8250.00000  2.923975271135e-05
8250.00000  8300.00000  3.523765070342e-05
8300.00000  8350.00000  2.923975271135e-05
8350.00000  8400.00000  2.998948996035e-05
8400.00000  8450.00000  3.373817620540e-05
8450.00000  8500.00000  2.998948996035e-05
8500.00000  8550.00000  3.298843895639e-05
8550.00000  8600.00000  2.774027821333e-05
8600.00000  8650.00000  2.399159196828e-05
8650.00000  8700.00000  2.024290572324e-05
8700.00000  8750.00000  3.223870170738e-05
8750.00000  8800.00000  2.699054096432e-05
8800.00000  8850.00000  2.923975271135e-05
8850.00000  8900.00000  2.324185471927e-05
8900.00000  8950.00000  3.223870170738e-05
8950.00000  9000.00000  3.298843895639e-05
9000.00000  9050.00000  3.223870170738e-05
9050.00000  9100.00000  2.624080371531e-05
9100.00000  9150.00000  2.923975271135e-05
9150.00000  9200.00000  2.624080371531e-05
9200.00000  9250.00000  3.073922720936e-05
9250.00000  9300.00000  1.949316847423e-05
9300.00000  9350.00000  2.174238022126e-05
9350.00000  9400.00000  2.774027821333e-05
9400.00000  9450.00000  2.174238022126e-05
9450.00000  9500.00000  2.249211747027e-05
9500.00000  9550.00000  2.699054096432e-05
9550.00000  9600.00000  3.073922720936e-05
9600.00000  9650.00000  2.324185471927e-05
9650.00000  9700.00000  2.923975271135e-05
9700.00000  9750.00000  2.249211747027e-05
9750.00000  9800.00000  2.024290572324e-05
9800.00000  9850.00000  2.849001546234e-05
9850.00000  9900.00000  2.624080371531e-05
9900.00000  9950.00000  2.849001546234e-05
9950.00000  10000.00000  1.949316847423e-05
