300.00000  350.00000  2.688032937883e-02
350.00000  400.00000  2.134226389342e-02
400.00000  450.00000  1.737198838336e-02
450.00000  500.00000  1.472333090835e-02
500.00000  550.00000  1.257806091647e-02
550.00000  600.00000  1.089120082645e-02
600.00000  650.00000  9.674195826371e-03
650.00000  700.00000  8.845122464663e-03
700.00000  750.00000  8.110622499265e-03
750.00000  800.00000  7.729317022423e-03
800.00000  850.00000  7.509248142686e-03
850.00000  900.00000  6.979356013467e-03
900.00000  950.00000  6.769527565178e-03
950.00000  1000.00000  6.660497089177e-03
1000.00000  1050.00000  6.700655643873e-03
1050.00000  1100.00000  6.685194600315e-03
1100.00000  1150.00000  6.778964825531e-03
1150.00000  1200.00000  6.747841945642e-03
1200.00000  1250.00000  6.715112723564e-03
1250.00000  1300.00000  6.777760068891e-03
1300.00000  1350.00000  6.396454592048e-03
1350.00000  1400.00000  6.429986985219e-03
1400.00000  1450.00000  6.376776900247e-03
1450.00000  1500.00000  6.369548360401e-03
1500.00000  1550.00000  6.370953909816e-03
1550.00000  1600.00000  6.192248341417e-03
1600.00000  1650.00000  6.067756821858e-03
1650.00000  1700.00000  5.964549336288e-03
1700.00000  1750.00000  5.896882171624e-03
1750.00000  1800.00000  5.774197787027e-03
1800.00000  1850.00000  5.540274205920e-03
1850.00000  1900.00000  5.360163088106e-03
1900.00000  1950.00000  5.278842014846e-03
1950.00000  2000.00000  5.120014931022e-03
2000.00000  2050.00000  5.091903942734e-03
2050.00000  2100.00000  4.962191811065e-03
2100.00000  2150.00000  4.801959177826e-03
2150.00000  2200.00000  4.641726544587e-03
2200.00000  2250.00000  4.641927337361e-03
2250.00000  2300.00000  4.454587679702e-03
2300.00000  2350.00000  4.397763324806e-03
2350.00000  2400.00000  4.239940204849e-03
2400.00000  2450.00000  4.141953331390e-03
2450.00000  2500.00000  3.979913563190e-03
2500.00000  2550.00000  3.883533031919e-03
2550.00000  2600.00000  3.850201431521e-03
2600.00000  2650.00000  3.721694056492e-03
2650.00000  2700.00000  3.653223720735e-03
2700.00000  2750.00000  3.490179988667e-03
2750.00000  2800.00000  3.517487805861e-03
2800.00000  2850.00000  3.337979066368e-03
2850.00000  2900.00000  3.301836367141e-03
2900.00000  2950.00000  3.229952554234e-03
2950.00000  3000.00000  3.161080632930e-03
3000.00000  3050.00000  3.060483453415e-03
3050.00000  3100.00000  3.056467597946e-03
3100.00000  3150.00000  2.948039500265e-03
3150.00000  3200.00000  2.877762029546e-03
3200.00000  3250.00000  2.839209817038e-03
3250.00000  3300.00000  2.758691914872e-03
3300.00000  3350.00000  2.706686586540e-03
3350.00000  3400.00000  2.631790882031e-03
3400.00000  3450.00000  2.597254524992e-03
3450.00000  3500.00000  2.540028584549e-03
3500.00000  3550.00000  2.439029819488e-03
3550.00000  3600.00000  2.436620306206e-03
3600.00000  3650.00000  2.374374546427e-03
3650.00000  3700.00000  2.323774767509e-03
3700.00000  3750.00000  2.246067964172e-03
3750.00000  3800.00000  2.239441802647e-03
3800.00000  3850.00000  2.184424582713e-03
3850.00000  3900.00000  2.147478712392e-03
3900.00000  3950.00000  2.102902716679e-03
3950.00000  4000.00000  2.074992521165e-03
4000.00000  4050.00000  2.010738833650e-03
4050.00000  4100.00000  1.981623881496e-03
4100.00000  4150.00000  1.947689902777e-03
4150.00000  4200.00000  1.902109943197e-03
4200.00000  4250.00000  1.890463962335e-03
4250.00000  4300.00000  1.857734740257e-03
4300.00000  4350.00000  1.800107214268e-03
4350.00000  4400.00000  1.751916948632e-03
4400.00000  4450.00000  1.728022608588e-03
4450.00000  4500.00000  1.711156015615e-03
4500.00000  4550.00000  1.713163943350e-03
4550.00000  4600.00000  1.645898364233e-03
4600.00000  4650.00000  1.633047626730e-03
4650.00000  4700.00000  1.589475594885e-03
4700.00000  4750.00000  1.540080572608e-03
4750.00000  4800.00000  1.566986804255e-03
4800.00000  4850.00000  1.484260181580e-03
4850.00000  4900.00000  1.487272073182e-03
4900.00000  4950.00000  1.456952364387e-03
4950.00000  5000.00000  1.418400151878e-03
5000.00000  5050.00000  1.386875686441e-03
5050.00000  5100.00000  1.394706604607e-03
5100.00000  5150.00000  1.379044768276e-03
5150.00000  5200.00000  1.340492555767e-03
5200.00000  5250.00000  1.345713167877e-03
5250.00000  5300.00000  1.306558577048e-03
5300.00000  5350.00000  1.275234904385e-03
5350.00000  5400.00000  1.234273178595e-03
5400.00000  5450.00000  1.257765933092e-03
5450.00000  5500.00000  1.234072385821e-03
5500.00000  5550.00000  1.196524137180e-03
5550.00000  5600.00000  1.199536028782e-03
5600.00000  5650.00000  1.155763204163e-03
5650.00000  5700.00000  1.142310088340e-03
5700.00000  5750.00000  1.114801478373e-03
5750.00000  5800.00000  1.105966596340e-03
5800.00000  5850.00000  1.122431603765e-03
5850.00000  5900.00000  1.088296832273e-03
5900.00000  5950.00000  1.059382672892e-03
5950.00000  6000.00000  1.045327178748e-03
6000.00000  6050.00000  1.044323214881e-03
6050.00000  6100.00000  1.014806677179e-03
6100.00000  6150.00000  9.949281926041e-04
6150.00000  6200.00000  1.013802713311e-03
6200.00000  6250.00000  9.895067877201e-04
6250.00000  6300.00000  9.949281926041e-04
6300.00000  6350.00000  9.439268281397e-04
6350.00000  6400.00000  1.233670800274e-03
6400.00000  6450.00000  9.184261459074e-04
6450.00000  6500.00000  9.216388302832e-04
6500.00000  6550.00000  9.156150470787e-04
6550.00000  6600.00000  9.220404158301e-04
6600.00000  6650.00000  8.917207070343e-04
6650.00000  6700.00000  8.702358802717e-04
6700.00000  6750.00000  8.591922777302e-04
6750.00000  6800.00000  8.429280630781e-04
6800.00000  6850.00000  8.517629451114e-04
6850.00000  6900.00000  8.371050726472e-04
6900.00000  6950.00000  8.108012193210e-04
6950.00000  7000.00000  8.005607878734e-04
7000.00000  7050.00000  7.728513851329e-04
7050.00000  7100.00000  8.385106220615e-04
7100.00000  7150.00000  7.575911343482e-04
7150.00000  7200.00000  7.670283947019e-04
7200.00000  7250.00000  7.614061970444e-04
7250.00000  7300.00000  7.589966837626e-04
7300.00000  7350.00000  7.373110642265e-04
7350.00000  7400.00000  7.296809388342e-04
7400.00000  7450.00000  7.053850132429e-04
7450.00000  7500.00000  7.160270302374e-04
7500.00000  7550.00000  6.959477528892e-04
7550.00000  7600.00000  7.174325796518e-04
7600.00000  7650.00000  7.041802566020e-04
7650.00000  7700.00000  6.800851237841e-04
7700.00000  7750.00000  6.457495595187e-04
7750.00000  7800.00000  6.439424245573e-04
7800.00000  7850.00000  6.541828560049e-04
7850.00000  7900.00000  6.549860270988e-04
7900.00000  7950.00000  6.575963331541e-04
7950.00000  8000.00000  6.355091280711e-04
8000.00000  8050.00000  6.310916870545e-04
8050.00000  8100.00000  6.154298507228e-04
8100.00000  8150.00000  6.124179591206e-04
8150.00000  8200.00000  5.859133130210e-04
8200.00000  8250.00000  6.045870409548e-04
8250.00000  8300.00000  5.726609899711e-04
8300.00000  8350.00000  5.728617827446e-04
8350.00000  8400.00000  5.871180696619e-04
8400.00000  8450.00000  5.606134235622e-04
8450.00000  8500.00000  5.576015319600e-04
8500.00000  8550.00000  5.529832981699e-04
8550.00000  8600.00000  5.555936042252e-04
8600.00000  8650.00000  5.421404884019e-04
8650.00000  8700.00000  5.551920186782e-04
8700.00000  8750.00000  5.429436594958e-04
8750.00000  8800.00000  5.429436594958e-04
8800.00000  8850.00000  5.427428667223e-04
8850.00000  8900.00000  5.057969964016e-04
8900.00000  8950.00000  5.220612110536e-04
8950.00000  9000.00000  4.987692493297e-04
9000.00000  9050.00000  4.885288178821e-04
9050.00000  9100.00000  5.094112663243e-04
9100.00000  9150.00000  5.055962036281e-04
9150.00000  9200.00000  4.947533938601e-04
9200.00000  9250.00000  4.802963141693e-04
9250.00000  9300.00000  4.911391239374e-04
9300.00000  9350.00000  4.764812514732e-04
9350.00000  9400.00000  4.529884969758e-04
9400.00000  9450.00000  4.752764948323e-04
9450.00000  9500.00000  4.666424055726e-04
9500.00000  9550.00000  4.652368561582e-04
9550.00000  9600.00000  4.529884969758e-04
9600.00000  9650.00000  4.419448944343e-04
9650.00000  9700.00000  4.309012918927e-04
9700.00000  9750.00000  4.421456872077e-04
9750.00000  9800.00000  4.321060485336e-04
9800.00000  9850.00000  4.304997063458e-04
9850.00000  9900.00000  4.481694704122e-04
9900.00000  9950.00000  4.359211112298e-04
9950.00000  10000.00000  4.168457977490e-04
