10001.00000  11001.00000  2.348457277778e-04
11001.00000  12001.00000  1.957483375669e-04
12001.00000  13001.00000  1.700520327638e-04
13001.00000  14001.00000  1.462155935274e-04
14001.00000  15001.00000  1.248924861380e-04
15001.00000  16001.00000  1.122454002842e-04
16001.00000  17001.00000  9.818079526876e-05
17001.00000  18001.00000  8.686074863016e-05
18001.00000  19001.00000  7.783286063596e-05
19001.00000  20001.00000  7.123787786959e-05
20001.00000  21001.00000  6.284334950082e-05
21001.00000  22001.00000  5.667060648475e-05
22001.00000  23001.00000  5.042749017695e-05
23001.00000  24001.00000  4.715010544855e-05
24001.00000  25001.00000  4.253562817757e-05
25001.00000  26001.00000  3.816243076390e-05
26001.00000  27001.00000  3.520675251190e-05
27001.00000  28001.00000  3.335694027255e-05
28001.00000  29001.00000  3.054200860398e-05
29001.00000  30001.00000  2.740537045901e-05
30001.00000  31001.00000  2.625929113680e-05
31001.00000  32001.00000  2.510315848721e-05
32001.00000  33001.00000  2.271046656893e-05
33001.00000  34001.00000  2.016697473983e-05
34001.00000  35001.00000  1.966430837044e-05
35001.00000  36001.00000  1.697001663052e-05
36001.00000  37001.00000  1.660809684456e-05
37001.00000  38001.00000  1.584404396309e-05
38001.00000  39001.00000  1.464769800395e-05
39001.00000  40001.00000  1.391380510465e-05
40001.00000  41001.00000  1.286825905632e-05
41001.00000  42001.00000  1.149095320420e-05
42001.00000  43001.00000  1.151105985897e-05
43001.00000  44001.00000  1.029460724506e-05
44001.00000  45001.00000  1.020412729857e-05
45001.00000  46001.00000  9.078154631138e-06
46001.00000  47001.00000  8.897194738159e-06
47001.00000  48001.00000  8.283941767506e-06
48001.00000  49001.00000  7.891861999384e-06
49001.00000  50001.00000  7.690795451629e-06
50001.00000  51001.00000  6.916689242772e-06
51001.00000  52001.00000  6.333596254282e-06
52001.00000  53001.00000  6.293382944731e-06
53001.00000  54001.00000  5.921409831385e-06
54001.00000  55001.00000  5.549436718038e-06
55001.00000  56001.00000  5.308156860732e-06
56001.00000  57001.00000  4.966343729548e-06
57001.00000  58001.00000  4.775330509181e-06
58001.00000  59001.00000  4.453624032773e-06
59001.00000  60001.00000  4.493837342324e-06
60001.00000  61001.00000  4.373197413671e-06
61001.00000  62001.00000  3.639304514365e-06
62001.00000  63001.00000  3.478451276161e-06
63001.00000  64001.00000  3.850424389508e-06
64001.00000  65001.00000  3.267331401019e-06
65001.00000  66001.00000  3.026051543713e-06
66001.00000  67001.00000  3.015998216325e-06
67001.00000  68001.00000  2.784771686407e-06
68001.00000  69001.00000  2.543491829101e-06
69001.00000  70001.00000  2.513331846937e-06
70001.00000  71001.00000  2.824984995958e-06
71001.00000  72001.00000  2.523385174325e-06
72001.00000  73001.00000  2.171518715754e-06
73001.00000  74001.00000  2.191625370529e-06
74001.00000  75001.00000  2.362531936121e-06
75001.00000  76001.00000  1.990558822774e-06
76001.00000  77001.00000  1.960398840611e-06
77001.00000  78001.00000  2.040825459713e-06
78001.00000  79001.00000  1.749278965468e-06
79001.00000  80001.00000  1.829705584570e-06
80001.00000  81001.00000  1.427572489060e-06
81001.00000  82001.00000  1.568319072489e-06
82001.00000  83001.00000  1.558265745101e-06
83001.00000  84001.00000  1.236559268693e-06
84001.00000  85001.00000  1.226505941305e-06
85001.00000  86001.00000  1.357199197346e-06
86001.00000  87001.00000  1.065652703101e-06
87001.00000  88001.00000  1.015386066163e-06
88001.00000  89001.00000  1.166185976979e-06
89001.00000  90001.00000  1.186292631754e-06
90001.00000  91001.00000  9.852260839995e-07
91001.00000  92001.00000  1.015386066163e-06
92001.00000  93001.00000  1.015386066163e-06
93001.00000  94001.00000  8.243728457955e-07
94001.00000  95001.00000  9.349594470607e-07
95001.00000  96001.00000  6.936795897547e-07
96001.00000  97001.00000  5.629863337140e-07
97001.00000  98001.00000  8.645861553465e-07
98001.00000  99001.00000  8.947461375097e-07
99001.00000  100001.00000  7.942128636322e-07
100001.00000  101001.00000  7.640528814690e-07
101001.00000  102001.00000  6.233062980405e-07
102001.00000  103001.00000  7.338928993057e-07
103001.00000  104001.00000  5.830929884895e-07
104001.00000  105001.00000  5.529330063262e-07
105001.00000  106001.00000  5.629863337140e-07
106001.00000  107001.00000  4.926130419997e-07
107001.00000  108001.00000  5.026663693875e-07
108001.00000  109001.00000  4.423464050610e-07
109001.00000  110001.00000  4.725063872242e-07
110001.00000  111001.00000  4.725063872242e-07
111001.00000  112001.00000  5.227730241630e-07
112001.00000  113001.00000  3.719731133467e-07
113001.00000  114001.00000  3.015998216325e-07
114001.00000  115001.00000  3.920797681222e-07
115001.00000  116001.00000  2.211732025305e-07
116001.00000  117001.00000  3.719731133467e-07
117001.00000  118001.00000  1.910132203672e-07
118001.00000  119001.00000  3.518664585712e-07
119001.00000  120001.00000  2.613865120815e-07
120001.00000  121001.00000  3.217064764080e-07
121001.00000  122001.00000  3.418131311835e-07
122001.00000  123001.00000  2.814931668570e-07
123001.00000  124001.00000  1.608532382040e-07
124001.00000  125001.00000  1.608532382040e-07
125001.00000  126001.00000  2.613865120815e-07
126001.00000  127001.00000  2.211732025305e-07
127001.00000  128001.00000  1.910132203672e-07
128001.00000  129001.00000  1.910132203672e-07
129001.00000  130001.00000  2.111198751427e-07
130001.00000  131001.00000  2.211732025305e-07
131001.00000  132001.00000  2.412798573060e-07
132001.00000  133001.00000  1.608532382040e-07
133001.00000  134001.00000  1.105866012652e-07
134001.00000  135001.00000  1.105866012652e-07
135001.00000  136001.00000  1.809598929795e-07
136001.00000  137001.00000  1.206399286530e-07
137001.00000  138001.00000  1.306932560407e-07
138001.00000  139001.00000  1.407465834285e-07
139001.00000  140001.00000  1.608532382040e-07
140001.00000  141001.00000  1.407465834285e-07
141001.00000  142001.00000  9.047994648975e-08
142001.00000  143001.00000  1.306932560407e-07
143001.00000  144001.00000  1.608532382040e-07
144001.00000  145001.00000  1.809598929795e-07
145001.00000  146001.00000  1.105866012652e-07
146001.00000  147001.00000  1.709065655917e-07
147001.00000  148001.00000  5.026663693875e-08
148001.00000  149001.00000  1.005332738775e-07
149001.00000  150001.00000  9.047994648975e-08
150001.00000  151001.00000  8.042661910200e-08
151001.00000  152001.00000  8.042661910200e-08
152001.00000  153001.00000  1.206399286530e-07
153001.00000  154001.00000  9.047994648975e-08
154001.00000  155001.00000  9.047994648975e-08
155001.00000  156001.00000  6.031996432650e-08
156001.00000  157001.00000  4.021330955100e-08
157001.00000  158001.00000  8.042661910200e-08
158001.00000  159001.00000  4.021330955100e-08
159001.00000  160001.00000  2.010665477550e-08
160001.00000  161001.00000  4.021330955100e-08
161001.00000  162001.00000  3.015998216325e-08
162001.00000  163001.00000  1.005332738775e-07
163001.00000  164001.00000  6.031996432650e-08
164001.00000  165001.00000  5.026663693875e-08
165001.00000  166001.00000  1.206399286530e-07
166001.00000  167001.00000  3.015998216325e-08
167001.00000  168001.00000  8.042661910200e-08
168001.00000  169001.00000  5.026663693875e-08
169001.00000  170001.00000  6.031996432650e-08
170001.00000  171001.00000  7.037329171425e-08
171001.00000  172001.00000  7.037329171425e-08
172001.00000  173001.00000  7.037329171425e-08
173001.00000  174001.00000  9.047994648975e-08
174001.00000  175001.00000  2.010665477550e-08
175001.00000  176001.00000  2.010665477550e-08
176001.00000  177001.00000  4.021330955100e-08
177001.00000  178001.00000  2.010665477550e-08
178001.00000  179001.00000  4.021330955100e-08
179001.00000  180001.00000  3.015998216325e-08
180001.00000  181001.00000  1.005332738775e-08
181001.00000  182001.00000  6.031996432650e-08
182001.00000  183001.00000  7.037329171425e-08
183001.00000  184001.00000  7.037329171425e-08
184001.00000  185001.00000  2.010665477550e-08
185001.00000  186001.00000  2.010665477550e-08
186001.00000  187001.00000  3.015998216325e-08
187001.00000  188001.00000  6.031996432650e-08
188001.00000  189001.00000  4.021330955100e-08
189001.00000  190001.00000  7.037329171425e-08
190001.00000  191001.00000  1.005332738775e-08
191001.00000  192001.00000  3.015998216325e-08
192001.00000  193001.00000  1.005332738775e-08
193001.00000  194001.00000  3.015998216325e-08
194001.00000  195001.00000  4.021330955100e-08
195001.00000  196001.00000  2.010665477550e-08
196001.00000  197001.00000  1.005332738775e-08
197001.00000  198001.00000  3.015998216325e-08
198001.00000  199001.00000  2.010665477550e-08
