300.00000  350.00000  8.048556479197e-07
350.00000  400.00000  7.243700831277e-06
400.00000  450.00000  1.609711295839e-06
450.00000  500.00000  5.633989535438e-06
500.00000  550.00000  8.853412127117e-05
550.00000  600.00000  6.438845183358e-06
600.00000  650.00000  2.736509202927e-05
650.00000  700.00000  5.633989535438e-06
700.00000  750.00000  2.173110249383e-05
750.00000  800.00000  1.046312342296e-05
800.00000  850.00000  6.519330748150e-05
850.00000  900.00000  1.368254601463e-05
900.00000  950.00000  1.287769036672e-05
950.00000  1000.00000  1.046312342296e-05
1000.00000  1050.00000  1.609711295839e-05
1050.00000  1100.00000  1.529225731047e-05
1100.00000  1150.00000  1.931653555007e-05
1150.00000  1200.00000  1.931653555007e-05
1200.00000  1250.00000  2.012139119799e-05
1250.00000  1300.00000  4.668162757934e-05
1300.00000  1350.00000  1.368254601463e-05
1350.00000  1400.00000  1.207283471880e-05
1400.00000  1450.00000  1.931653555007e-05
1450.00000  1500.00000  2.495052508551e-05
1500.00000  1550.00000  1.529225731047e-05
1550.00000  1600.00000  1.529225731047e-05
1600.00000  1650.00000  1.770682425423e-05
1650.00000  1700.00000  2.092624684591e-05
1700.00000  1750.00000  7.565643090445e-05
1750.00000  1800.00000  2.495052508551e-05
1800.00000  1850.00000  2.092624684591e-05
1850.00000  1900.00000  1.529225731047e-05
1900.00000  1950.00000  1.046312342296e-05
1950.00000  2000.00000  1.770682425423e-05
2000.00000  2050.00000  2.173110249383e-05
2050.00000  2100.00000  1.931653555007e-05
2100.00000  2150.00000  1.690196860631e-05
2150.00000  2200.00000  1.770682425423e-05
2200.00000  2250.00000  1.690196860631e-05
2250.00000  2300.00000  1.770682425423e-05
2300.00000  2350.00000  5.151076146686e-05
2350.00000  2400.00000  1.448740166255e-05
2400.00000  2450.00000  1.770682425423e-05
2450.00000  2500.00000  1.770682425423e-05
2500.00000  2550.00000  1.448740166255e-05
2550.00000  2600.00000  1.609711295839e-05
2600.00000  2650.00000  1.770682425423e-05
2650.00000  2700.00000  1.931653555007e-05
2700.00000  2750.00000  1.368254601463e-05
2750.00000  2800.00000  1.529225731047e-05
2800.00000  2850.00000  1.126797907088e-05
2850.00000  2900.00000  1.529225731047e-05
2900.00000  2950.00000  1.690196860631e-05
2950.00000  3000.00000  2.334081378967e-05
3000.00000  3050.00000  1.046312342296e-05
3050.00000  3100.00000  1.287769036672e-05
3100.00000  3150.00000  1.046312342296e-05
3150.00000  3200.00000  1.126797907088e-05
3200.00000  3250.00000  1.046312342296e-05
3250.00000  3300.00000  1.770682425423e-05
3300.00000  3350.00000  1.690196860631e-05
3350.00000  3400.00000  1.287769036672e-05
3400.00000  3450.00000  2.173110249383e-05
3450.00000  3500.00000  2.253595814175e-05
3500.00000  3550.00000  2.495052508551e-05
3550.00000  3600.00000  2.173110249383e-05
3600.00000  3650.00000  2.414566943759e-05
3650.00000  3700.00000  3.863307110015e-05
3700.00000  3750.00000  3.380393721263e-05
3750.00000  3800.00000  3.380393721263e-05
3800.00000  3850.00000  4.024278239598e-05
3850.00000  3900.00000  4.426706063558e-05
3900.00000  3950.00000  4.668162757934e-05
3950.00000  4000.00000  6.519330748150e-05
4000.00000  4050.00000  5.070590581894e-05
4050.00000  4100.00000  6.197388488982e-05
4100.00000  4150.00000  5.794960665022e-05
4150.00000  4200.00000  7.324186396069e-05
4200.00000  4250.00000  7.646128655237e-05
4250.00000  4300.00000  9.497296645452e-05
4300.00000  4350.00000  8.209527608781e-05
4350.00000  4400.00000  9.899724469412e-05
4400.00000  4450.00000  1.030215229337e-04
4450.00000  4500.00000  1.062409455254e-04
4500.00000  4550.00000  1.336060375547e-04
4550.00000  4600.00000  1.207283471880e-04
4600.00000  4650.00000  1.400448827380e-04
4650.00000  4700.00000  1.569468513443e-04
4700.00000  4750.00000  1.641905521756e-04
4750.00000  4800.00000  1.690196860631e-04
4800.00000  4850.00000  1.601662739360e-04
4850.00000  4900.00000  1.762633868944e-04
4900.00000  4950.00000  1.730439643027e-04
4950.00000  5000.00000  1.931653555007e-04
5000.00000  5050.00000  2.044333345716e-04
5050.00000  5100.00000  2.100673241070e-04
5100.00000  5150.00000  2.076527571633e-04
5150.00000  5200.00000  2.205304475300e-04
5200.00000  5250.00000  2.342129935446e-04
5250.00000  5300.00000  2.430664056717e-04
5300.00000  5350.00000  2.374324161363e-04
5350.00000  5400.00000  2.382372717842e-04
5400.00000  5450.00000  2.317984266009e-04
5450.00000  5500.00000  2.784800541802e-04
5500.00000  5550.00000  2.881383219553e-04
5550.00000  5600.00000  2.994063010261e-04
5600.00000  5650.00000  2.752606315885e-04
5650.00000  5700.00000  2.841140437157e-04
5700.00000  5750.00000  3.082597131532e-04
5750.00000  5800.00000  2.897480332511e-04
5800.00000  5850.00000  2.945771671386e-04
5850.00000  5900.00000  3.235519704637e-04
5900.00000  5950.00000  3.050402905616e-04
5950.00000  6000.00000  3.388442277742e-04
6000.00000  6050.00000  3.316005269429e-04
6050.00000  6100.00000  4.072569578474e-04
6100.00000  6150.00000  3.324053825908e-04
6150.00000  6200.00000  3.581607633243e-04
6200.00000  6250.00000  3.637947528597e-04
6250.00000  6300.00000  4.136958030307e-04
6300.00000  6350.00000  4.000132570161e-04
6350.00000  6400.00000  1.255574810755e-03
6400.00000  6450.00000  3.460879286055e-04
6450.00000  6500.00000  3.557461963805e-04
6500.00000  6550.00000  3.726481649868e-04
6550.00000  6600.00000  3.533316294367e-04
6600.00000  6650.00000  3.460879286055e-04
6650.00000  6700.00000  3.678190310993e-04
6700.00000  6750.00000  3.645996085076e-04
6750.00000  6800.00000  3.428685060138e-04
6800.00000  6850.00000  3.758675875785e-04
6850.00000  6900.00000  3.702335980431e-04
6900.00000  6950.00000  3.654044641555e-04
6950.00000  7000.00000  3.565510520284e-04
7000.00000  7050.00000  4.024278239598e-04
7050.00000  7100.00000  4.660114201455e-04
7100.00000  7150.00000  1.786779538382e-04
7150.00000  7200.00000  1.585565626402e-04
7200.00000  7250.00000  1.384351714422e-04
7250.00000  7300.00000  1.722391086548e-04
7300.00000  7350.00000  1.690196860631e-04
7350.00000  7400.00000  1.625808408798e-04
7400.00000  7450.00000  1.770682425423e-04
7450.00000  7500.00000  1.682148304152e-04
7500.00000  7550.00000  1.722391086548e-04
7550.00000  7600.00000  1.577517069923e-04
7600.00000  7650.00000  1.722391086548e-04
7650.00000  7700.00000  1.770682425423e-04
7700.00000  7750.00000  1.867265103174e-04
7750.00000  7800.00000  1.786779538382e-04
7800.00000  7850.00000  1.730439643027e-04
7850.00000  7900.00000  1.891410772611e-04
7900.00000  7950.00000  1.931653555007e-04
7950.00000  8000.00000  1.851167990215e-04
8000.00000  8050.00000  1.674099747673e-04
8050.00000  8100.00000  1.690196860631e-04
8100.00000  8150.00000  1.867265103174e-04
8150.00000  8200.00000  1.859216546694e-04
8200.00000  8250.00000  1.891410772611e-04
8250.00000  8300.00000  1.939702111486e-04
8300.00000  8350.00000  1.899459329090e-04
8350.00000  8400.00000  1.641905521756e-04
8400.00000  8450.00000  1.963847780924e-04
8450.00000  8500.00000  1.706293973590e-04
8500.00000  8550.00000  1.762633868944e-04
8550.00000  8600.00000  1.899459329090e-04
8600.00000  8650.00000  2.140916023466e-04
8650.00000  8700.00000  1.794828094861e-04
8700.00000  8750.00000  1.609711295839e-04
8750.00000  8800.00000  1.786779538382e-04
8800.00000  8850.00000  1.722391086548e-04
8850.00000  8900.00000  1.770682425423e-04
8900.00000  8950.00000  1.859216546694e-04
8950.00000  9000.00000  1.923604998528e-04
9000.00000  9050.00000  1.778730981903e-04
9050.00000  9100.00000  1.987993450362e-04
9100.00000  9150.00000  1.987993450362e-04
9150.00000  9200.00000  1.746536755986e-04
9200.00000  9250.00000  1.859216546694e-04
9250.00000  9300.00000  1.947750667966e-04
9300.00000  9350.00000  1.746536755986e-04
9350.00000  9400.00000  1.979944893882e-04
9400.00000  9450.00000  1.955799224445e-04
9450.00000  9500.00000  1.794828094861e-04
9500.00000  9550.00000  1.690196860631e-04
9550.00000  9600.00000  1.762633868944e-04
9600.00000  9650.00000  1.633856965277e-04
9650.00000  9700.00000  1.666051191194e-04
9700.00000  9750.00000  1.915556442049e-04
9750.00000  9800.00000  1.698245417111e-04
9800.00000  9850.00000  1.714342530069e-04
9850.00000  9900.00000  1.641905521756e-04
9900.00000  9950.00000  1.835070877257e-04
9950.00000  10000.00000  1.633856965277e-04
