10001.00000  11001.00000  2.051808411834e-04
11001.00000  12001.00000  1.728048796876e-04
12001.00000  13001.00000  1.490491994197e-04
13001.00000  14001.00000  1.277434938165e-04
14001.00000  15001.00000  1.135517887214e-04
15001.00000  16001.00000  1.013926552000e-04
16001.00000  17001.00000  8.877982266664e-05
17001.00000  18001.00000  8.083101597653e-05
18001.00000  19001.00000  7.282776540499e-05
19001.00000  20001.00000  6.649412719758e-05
20001.00000  21001.00000  5.970678997817e-05
21001.00000  22001.00000  5.440758551811e-05
22001.00000  23001.00000  5.085058526409e-05
23001.00000  24001.00000  4.575100836929e-05
24001.00000  25001.00000  4.183104890568e-05
25001.00000  26001.00000  3.774775779775e-05
26001.00000  27001.00000  3.644110464321e-05
27001.00000  28001.00000  3.337409932215e-05
28001.00000  29001.00000  3.061560932923e-05
29001.00000  30001.00000  2.684083354946e-05
30001.00000  31001.00000  2.702231315426e-05
31001.00000  32001.00000  2.351975678168e-05
32001.00000  33001.00000  2.246717507385e-05
33001.00000  34001.00000  2.172310869419e-05
34001.00000  35001.00000  1.999905244862e-05
35001.00000  36001.00000  1.952720547614e-05
36001.00000  37001.00000  1.709537877187e-05
37001.00000  38001.00000  1.606094502452e-05
38001.00000  39001.00000  1.564354193349e-05
39001.00000  40001.00000  1.537132252630e-05
40001.00000  41001.00000  1.393763364840e-05
41001.00000  42001.00000  1.257653661242e-05
42001.00000  43001.00000  1.210468963995e-05
43001.00000  44001.00000  1.108840385309e-05
44001.00000  45001.00000  1.045322523630e-05
45001.00000  46001.00000  1.009026602671e-05
46001.00000  47001.00000  1.003582214527e-05
47001.00000  48001.00000  9.328051686560e-06
48001.00000  49001.00000  8.148434255380e-06
49001.00000  50001.00000  8.856204714088e-06
50001.00000  51001.00000  7.948806690104e-06
51001.00000  52001.00000  7.603995440989e-06
52001.00000  53001.00000  7.259184191875e-06
53001.00000  54001.00000  6.442525970289e-06
54001.00000  55001.00000  5.898087155899e-06
55001.00000  56001.00000  6.006974918777e-06
56001.00000  57001.00000  5.789199393021e-06
57001.00000  58001.00000  5.698459590622e-06
58001.00000  59001.00000  5.389944262467e-06
59001.00000  60001.00000  4.918097289996e-06
60001.00000  61001.00000  5.262908539110e-06
61001.00000  62001.00000  4.010699266011e-06
62001.00000  63001.00000  4.409954396564e-06
63001.00000  64001.00000  4.065143147450e-06
64001.00000  65001.00000  4.192178870808e-06
65001.00000  66001.00000  3.992551305531e-06
66001.00000  67001.00000  4.065143147450e-06
67001.00000  68001.00000  3.774775779775e-06
68001.00000  69001.00000  3.829219661214e-06
69001.00000  70001.00000  3.085153281547e-06
70001.00000  71001.00000  3.411816570181e-06
71001.00000  72001.00000  3.429964530661e-06
72001.00000  73001.00000  3.230336965385e-06
73001.00000  74001.00000  2.740342032433e-06
74001.00000  75001.00000  2.994413479149e-06
75001.00000  76001.00000  2.613306309075e-06
76001.00000  77001.00000  2.468122625238e-06
77001.00000  78001.00000  2.322938941400e-06
78001.00000  79001.00000  2.613306309075e-06
79001.00000  80001.00000  2.395530783319e-06
80001.00000  81001.00000  2.304790980920e-06
81001.00000  82001.00000  1.959979731806e-06
82001.00000  83001.00000  2.359234862359e-06
83001.00000  84001.00000  2.159607297083e-06
84001.00000  85001.00000  2.068867494684e-06
85001.00000  86001.00000  2.159607297083e-06
86001.00000  87001.00000  1.832944008449e-06
87001.00000  88001.00000  2.395530783319e-06
88001.00000  89001.00000  2.068867494684e-06
89001.00000  90001.00000  1.633316443172e-06
90001.00000  91001.00000  1.869239929408e-06
91001.00000  92001.00000  1.796648087489e-06
92001.00000  93001.00000  1.324801115017e-06
93001.00000  94001.00000  1.597020522213e-06
94001.00000  95001.00000  1.415540917416e-06
95001.00000  96001.00000  1.469984798855e-06
96001.00000  97001.00000  1.488132759334e-06
97001.00000  98001.00000  1.379244996456e-06
98001.00000  99001.00000  1.143321510220e-06
99001.00000  100001.00000  1.034433747342e-06
100001.00000  101001.00000  1.252209273098e-06
101001.00000  102001.00000  1.324801115017e-06
102001.00000  103001.00000  9.436939449438e-07
103001.00000  104001.00000  1.088877628781e-06
104001.00000  105001.00000  1.161469470700e-06
105001.00000  106001.00000  1.125173549741e-06
106001.00000  107001.00000  1.052581707822e-06
107001.00000  108001.00000  9.799898659032e-07
108001.00000  109001.00000  1.034433747342e-06
109001.00000  110001.00000  1.161469470700e-06
110001.00000  111001.00000  8.529541425454e-07
111001.00000  112001.00000  9.618419054235e-07
112001.00000  113001.00000  8.348061820657e-07
113001.00000  114001.00000  9.981378263829e-07
114001.00000  115001.00000  9.618419054235e-07
115001.00000  116001.00000  7.077704587078e-07
116001.00000  117001.00000  6.170306563094e-07
117001.00000  118001.00000  8.529541425454e-07
118001.00000  119001.00000  7.259184191875e-07
119001.00000  120001.00000  8.348061820657e-07
120001.00000  121001.00000  6.896224982282e-07
121001.00000  122001.00000  7.440663796672e-07
122001.00000  123001.00000  7.622143401469e-07
123001.00000  124001.00000  7.259184191875e-07
124001.00000  125001.00000  7.259184191875e-07
125001.00000  126001.00000  6.351786167891e-07
126001.00000  127001.00000  7.440663796672e-07
127001.00000  128001.00000  4.174030910328e-07
128001.00000  129001.00000  5.444388143907e-07
129001.00000  130001.00000  5.444388143907e-07
130001.00000  131001.00000  3.448112491141e-07
131001.00000  132001.00000  6.170306563094e-07
132001.00000  133001.00000  4.899949329516e-07
133001.00000  134001.00000  5.807347353500e-07
134001.00000  135001.00000  5.807347353500e-07
135001.00000  136001.00000  5.988826958297e-07
136001.00000  137001.00000  5.807347353500e-07
137001.00000  138001.00000  4.899949329516e-07
138001.00000  139001.00000  5.988826958297e-07
139001.00000  140001.00000  5.081428934313e-07
140001.00000  141001.00000  3.811071700735e-07
141001.00000  142001.00000  5.081428934313e-07
142001.00000  143001.00000  3.629592095938e-07
143001.00000  144001.00000  3.992551305531e-07
144001.00000  145001.00000  5.081428934313e-07
145001.00000  146001.00000  4.174030910328e-07
146001.00000  147001.00000  5.444388143907e-07
147001.00000  148001.00000  3.992551305531e-07
148001.00000  149001.00000  4.536990119922e-07
149001.00000  150001.00000  2.359234862359e-07
150001.00000  151001.00000  3.992551305531e-07
151001.00000  152001.00000  3.266632886344e-07
152001.00000  153001.00000  2.722194071953e-07
153001.00000  154001.00000  3.448112491141e-07
154001.00000  155001.00000  3.448112491141e-07
155001.00000  156001.00000  3.085153281547e-07
156001.00000  157001.00000  3.085153281547e-07
157001.00000  158001.00000  2.903673676750e-07
158001.00000  159001.00000  2.722194071953e-07
159001.00000  160001.00000  1.814796047969e-07
160001.00000  161001.00000  4.536990119922e-07
161001.00000  162001.00000  2.177755257563e-07
162001.00000  163001.00000  2.359234862359e-07
163001.00000  164001.00000  3.448112491141e-07
164001.00000  165001.00000  1.633316443172e-07
165001.00000  166001.00000  2.722194071953e-07
166001.00000  167001.00000  1.996275652766e-07
167001.00000  168001.00000  2.359234862359e-07
168001.00000  169001.00000  2.722194071953e-07
169001.00000  170001.00000  3.085153281547e-07
170001.00000  171001.00000  2.540714467156e-07
171001.00000  172001.00000  1.996275652766e-07
172001.00000  173001.00000  3.629592095938e-07
173001.00000  174001.00000  2.359234862359e-07
174001.00000  175001.00000  1.814796047969e-07
175001.00000  176001.00000  1.814796047969e-07
176001.00000  177001.00000  2.359234862359e-07
177001.00000  178001.00000  1.451836838375e-07
178001.00000  179001.00000  1.633316443172e-07
179001.00000  180001.00000  2.359234862359e-07
180001.00000  181001.00000  1.088877628781e-07
181001.00000  182001.00000  2.722194071953e-07
182001.00000  183001.00000  1.451836838375e-07
183001.00000  184001.00000  2.359234862359e-07
184001.00000  185001.00000  2.722194071953e-07
185001.00000  186001.00000  1.451836838375e-07
186001.00000  187001.00000  1.088877628781e-07
187001.00000  188001.00000  2.540714467156e-07
188001.00000  189001.00000  3.629592095938e-08
189001.00000  190001.00000  1.270357233578e-07
190001.00000  191001.00000  1.451836838375e-07
191001.00000  192001.00000  2.177755257563e-07
192001.00000  193001.00000  1.451836838375e-07
193001.00000  194001.00000  1.088877628781e-07
194001.00000  195001.00000  1.814796047969e-07
195001.00000  196001.00000  1.451836838375e-07
196001.00000  197001.00000  1.996275652766e-07
197001.00000  198001.00000  9.073980239844e-08
198001.00000  199001.00000  9.073980239844e-08
