10001.00000  11001.00000  4.770649774079e-05
11001.00000  12001.00000  3.881961362431e-05
12001.00000  13001.00000  3.335001719096e-05
13001.00000  14001.00000  3.031027687224e-05
14001.00000  15001.00000  2.646703831642e-05
15001.00000  16001.00000  2.375644185388e-05
16001.00000  17001.00000  2.231401730774e-05
17001.00000  18001.00000  2.088127346325e-05
18001.00000  19001.00000  1.853854366348e-05
19001.00000  20001.00000  1.735749806194e-05
20001.00000  21001.00000  1.668952964796e-05
21001.00000  22001.00000  1.574082088606e-05
22001.00000  23001.00000  1.414350511349e-05
23001.00000  24001.00000  1.312703144004e-05
24001.00000  25001.00000  1.259459284918e-05
25001.00000  26001.00000  1.128769812617e-05
26001.00000  27001.00000  1.001952620976e-05
27001.00000  28001.00000  1.017441743620e-05
28001.00000  29001.00000  9.186985867697e-06
29001.00000  30001.00000  9.216027972653e-06
30001.00000  31001.00000  8.180192895895e-06
31001.00000  32001.00000  7.957536757900e-06
32001.00000  33001.00000  7.095954310877e-06
33001.00000  34001.00000  6.873298172882e-06
34001.00000  35001.00000  6.699045543147e-06
35001.00000  36001.00000  6.253733267157e-06
36001.00000  37001.00000  5.614806958129e-06
37001.00000  38001.00000  5.392150820134e-06
38001.00000  39001.00000  5.643849063085e-06
39001.00000  40001.00000  4.549929776415e-06
40001.00000  41001.00000  4.617694687978e-06
41001.00000  42001.00000  4.182063113641e-06
42001.00000  43001.00000  3.814196450867e-06
43001.00000  44001.00000  3.881961362431e-06
44001.00000  45001.00000  3.514094699657e-06
45001.00000  46001.00000  3.456010489745e-06
46001.00000  47001.00000  3.368884174877e-06
47001.00000  48001.00000  3.165589440186e-06
48001.00000  49001.00000  2.991336810451e-06
49001.00000  50001.00000  3.097824528623e-06
50001.00000  51001.00000  2.797722777413e-06
51001.00000  52001.00000  2.710596462545e-06
52001.00000  53001.00000  2.323368396467e-06
53001.00000  54001.00000  2.197519274992e-06
54001.00000  55001.00000  2.226561379948e-06
55001.00000  56001.00000  2.091031556820e-06
56001.00000  57001.00000  1.819971910566e-06
57001.00000  58001.00000  1.829652612218e-06
58001.00000  59001.00000  1.858694717174e-06
59001.00000  60001.00000  1.558592965963e-06
60001.00000  61001.00000  1.432743844488e-06
61001.00000  62001.00000  1.713484192395e-06
62001.00000  63001.00000  1.558592965963e-06
63001.00000  64001.00000  1.558592965963e-06
64001.00000  65001.00000  1.529550861008e-06
65001.00000  66001.00000  1.210087706493e-06
66001.00000  67001.00000  1.152003496582e-06
67001.00000  68001.00000  1.297214021361e-06
68001.00000  69001.00000  1.161684198234e-06
69001.00000  70001.00000  1.035835076758e-06
70001.00000  71001.00000  1.045515778410e-06
71001.00000  72001.00000  1.084238585018e-06
72001.00000  73001.00000  8.712631486752e-07
73001.00000  74001.00000  9.487087618908e-07
74001.00000  75001.00000  7.647754305038e-07
75001.00000  76001.00000  1.084238585018e-06
76001.00000  77001.00000  7.163719222440e-07
77001.00000  78001.00000  5.614806958129e-07
78001.00000  79001.00000  7.938175354596e-07
79001.00000  80001.00000  7.163719222440e-07
80001.00000  81001.00000  6.970105189401e-07
81001.00000  82001.00000  7.744561321557e-07
82001.00000  83001.00000  7.066912205921e-07
83001.00000  84001.00000  6.389263090285e-07
84001.00000  85001.00000  7.938175354596e-07
85001.00000  86001.00000  6.582877123324e-07
86001.00000  87001.00000  6.292456073765e-07
87001.00000  88001.00000  5.711613974648e-07
88001.00000  89001.00000  5.033964859012e-07
89001.00000  90001.00000  7.066912205921e-07
90001.00000  91001.00000  4.937157842493e-07
91001.00000  92001.00000  4.646736792934e-07
92001.00000  93001.00000  4.743543809454e-07
93001.00000  94001.00000  3.485052594701e-07
94001.00000  95001.00000  4.065894693818e-07
95001.00000  96001.00000  4.549929776415e-07
96001.00000  97001.00000  4.259508726856e-07
97001.00000  98001.00000  4.065894693818e-07
98001.00000  99001.00000  4.549929776415e-07
99001.00000  100001.00000  3.388245578181e-07
100001.00000  101001.00000  3.775473644259e-07
101001.00000  102001.00000  3.969087677298e-07
102001.00000  103001.00000  2.904210495584e-07
103001.00000  104001.00000  3.485052594701e-07
104001.00000  105001.00000  2.710596462545e-07
105001.00000  106001.00000  2.323368396467e-07
106001.00000  107001.00000  3.485052594701e-07
107001.00000  108001.00000  2.420175412987e-07
108001.00000  109001.00000  2.613789446026e-07
109001.00000  110001.00000  2.710596462545e-07
110001.00000  111001.00000  2.710596462545e-07
111001.00000  112001.00000  2.129754363428e-07
112001.00000  113001.00000  2.904210495584e-07
113001.00000  114001.00000  2.323368396467e-07
114001.00000  115001.00000  2.904210495584e-07
115001.00000  116001.00000  2.129754363428e-07
116001.00000  117001.00000  1.936140330389e-07
117001.00000  118001.00000  1.548912264311e-07
118001.00000  119001.00000  2.323368396467e-07
119001.00000  120001.00000  1.355298231273e-07
120001.00000  121001.00000  1.548912264311e-07
121001.00000  122001.00000  1.258491214753e-07
122001.00000  123001.00000  2.129754363428e-07
123001.00000  124001.00000  1.645719280831e-07
124001.00000  125001.00000  1.742526297350e-07
125001.00000  126001.00000  1.548912264311e-07
126001.00000  127001.00000  1.355298231273e-07
127001.00000  128001.00000  1.355298231273e-07
128001.00000  129001.00000  1.258491214753e-07
129001.00000  130001.00000  1.064877181714e-07
130001.00000  131001.00000  8.712631486752e-08
131001.00000  132001.00000  9.680701651946e-08
132001.00000  133001.00000  8.712631486752e-08
133001.00000  134001.00000  1.064877181714e-07
134001.00000  135001.00000  8.712631486752e-08
135001.00000  136001.00000  4.840350825973e-08
136001.00000  137001.00000  3.872280660779e-08
137001.00000  138001.00000  7.744561321557e-08
138001.00000  139001.00000  5.808420991168e-08
139001.00000  140001.00000  7.744561321557e-08
140001.00000  141001.00000  6.776491156363e-08
141001.00000  142001.00000  4.840350825973e-08
142001.00000  143001.00000  5.808420991168e-08
143001.00000  144001.00000  7.744561321557e-08
144001.00000  145001.00000  4.840350825973e-08
145001.00000  146001.00000  1.064877181714e-07
146001.00000  147001.00000  6.776491156363e-08
147001.00000  148001.00000  2.904210495584e-08
148001.00000  149001.00000  3.872280660779e-08
149001.00000  150001.00000  6.776491156363e-08
150001.00000  151001.00000  6.776491156363e-08
151001.00000  152001.00000  2.904210495584e-08
152001.00000  153001.00000  4.840350825973e-08
153001.00000  154001.00000  2.904210495584e-08
154001.00000  155001.00000  4.840350825973e-08
155001.00000  156001.00000  7.744561321557e-08
156001.00000  157001.00000  4.840350825973e-08
157001.00000  158001.00000  1.936140330389e-08
158001.00000  159001.00000  4.840350825973e-08
159001.00000  160001.00000  9.680701651946e-09
160001.00000  161001.00000  4.840350825973e-08
161001.00000  162001.00000  4.840350825973e-08
162001.00000  163001.00000  4.840350825973e-08
163001.00000  164001.00000  2.904210495584e-08
164001.00000  165001.00000  9.680701651946e-09
165001.00000  166001.00000  2.904210495584e-08
166001.00000  167001.00000  1.936140330389e-08
167001.00000  168001.00000  1.936140330389e-08
168001.00000  169001.00000  1.936140330389e-08
169001.00000  170001.00000  0.000000000000e+00
170001.00000  171001.00000  4.840350825973e-08
171001.00000  172001.00000  1.936140330389e-08
172001.00000  173001.00000  9.680701651946e-09
173001.00000  174001.00000  0.000000000000e+00
174001.00000  175001.00000  0.000000000000e+00
175001.00000  176001.00000  6.776491156363e-08
176001.00000  177001.00000  3.872280660779e-08
177001.00000  178001.00000  9.680701651946e-09
178001.00000  179001.00000  2.904210495584e-08
179001.00000  180001.00000  3.872280660779e-08
180001.00000  181001.00000  9.680701651946e-09
181001.00000  182001.00000  1.936140330389e-08
182001.00000  183001.00000  9.680701651946e-09
183001.00000  184001.00000  0.000000000000e+00
184001.00000  185001.00000  0.000000000000e+00
185001.00000  186001.00000  9.680701651946e-09
186001.00000  187001.00000  0.000000000000e+00
187001.00000  188001.00000  9.680701651946e-09
188001.00000  189001.00000  0.000000000000e+00
189001.00000  190001.00000  0.000000000000e+00
190001.00000  191001.00000  9.680701651946e-09
191001.00000  192001.00000  9.680701651946e-09
192001.00000  193001.00000  0.000000000000e+00
193001.00000  194001.00000  9.680701651946e-09
194001.00000  195001.00000  9.680701651946e-09
195001.00000  196001.00000  9.680701651946e-09
196001.00000  197001.00000  9.680701651946e-09
197001.00000  198001.00000  0.000000000000e+00
198001.00000  199001.00000  0.000000000000e+00
