10001.00000  11001.00000  1.433726175620e-04
11001.00000  12001.00000  1.375668133186e-04
12001.00000  13001.00000  1.266244096823e-04
13001.00000  14001.00000  1.179428332436e-04
14001.00000  15001.00000  1.089176110708e-04
15001.00000  16001.00000  9.728791596646e-05
16001.00000  17001.00000  8.931171761338e-05
17001.00000  18001.00000  8.068440102739e-05
18001.00000  19001.00000  7.466155737303e-05
19001.00000  20001.00000  6.677579210786e-05
20001.00000  21001.00000  6.089764139414e-05
21001.00000  22001.00000  5.547165611993e-05
22001.00000  23001.00000  5.198093892686e-05
23001.00000  24001.00000  4.756780423718e-05
24001.00000  25001.00000  4.398665395620e-05
25001.00000  26001.00000  4.098427543781e-05
26001.00000  27001.00000  3.648070766022e-05
27001.00000  28001.00000  3.593810913280e-05
28001.00000  29001.00000  3.279103767377e-05
29001.00000  30001.00000  2.931840709828e-05
30001.00000  31001.00000  2.843216283682e-05
31001.00000  32001.00000  2.577343005246e-05
32001.00000  33001.00000  2.532126461295e-05
33001.00000  34001.00000  2.360303594278e-05
34001.00000  35001.00000  2.255401212310e-05
35001.00000  36001.00000  2.063683065955e-05
36001.00000  37001.00000  1.966015331019e-05
37001.00000  38001.00000  1.819513728616e-05
38001.00000  39001.00000  1.821322390374e-05
39001.00000  40001.00000  1.689290082035e-05
40001.00000  41001.00000  1.497571935680e-05
41001.00000  42001.00000  1.531936509083e-05
42001.00000  43001.00000  1.390860891954e-05
43001.00000  44001.00000  1.342027024486e-05
44001.00000  45001.00000  1.311279774599e-05
45001.00000  46001.00000  1.191908098567e-05
46001.00000  47001.00000  1.110518319453e-05
47001.00000  48001.00000  1.164778172196e-05
48001.00000  49001.00000  9.965726286952e-06
49001.00000  50001.00000  1.023702555066e-05
50001.00000  51001.00000  9.224174966145e-06
51001.00000  52001.00000  9.296521436467e-06
52001.00000  53001.00000  8.591143350821e-06
53001.00000  54001.00000  8.609229968402e-06
54001.00000  55001.00000  8.120891293723e-06
55001.00000  56001.00000  7.849592030013e-06
56001.00000  57001.00000  7.325080120174e-06
57001.00000  58001.00000  6.782481592753e-06
58001.00000  59001.00000  7.108040709206e-06
59001.00000  60001.00000  6.113276742268e-06
60001.00000  61001.00000  5.932410566462e-06
61001.00000  62001.00000  6.022843654365e-06
62001.00000  63001.00000  6.402662623559e-06
63001.00000  64001.00000  5.624938067590e-06
64001.00000  65001.00000  5.154686010493e-06
65001.00000  66001.00000  5.407898656622e-06
66001.00000  67001.00000  5.046166305009e-06
67001.00000  68001.00000  4.774867041298e-06
68001.00000  69001.00000  4.919559981944e-06
69001.00000  70001.00000  4.358874836943e-06
70001.00000  71001.00000  4.413134689685e-06
71001.00000  72001.00000  4.087575573233e-06
72001.00000  73001.00000  4.340788219362e-06
73001.00000  74001.00000  3.816276309523e-06
74001.00000  75001.00000  3.762016456781e-06
75001.00000  76001.00000  3.544977045812e-06
76001.00000  77001.00000  3.942882632587e-06
77001.00000  78001.00000  3.544977045812e-06
78001.00000  79001.00000  3.526890428232e-06
79001.00000  80001.00000  3.273677782102e-06
80001.00000  81001.00000  3.382197487586e-06
81001.00000  82001.00000  2.984291900812e-06
82001.00000  83001.00000  3.074724988715e-06
83001.00000  84001.00000  2.495953226133e-06
84001.00000  85001.00000  3.074724988715e-06
85001.00000  86001.00000  2.893858812908e-06
86001.00000  87001.00000  2.785339107424e-06
87001.00000  88001.00000  2.767252489843e-06
88001.00000  89001.00000  2.495953226133e-06
89001.00000  90001.00000  2.622559549198e-06
90001.00000  91001.00000  2.495953226133e-06
91001.00000  92001.00000  2.405520138230e-06
92001.00000  93001.00000  2.369346903069e-06
93001.00000  94001.00000  2.188480727262e-06
94001.00000  95001.00000  2.514039843714e-06
95001.00000  96001.00000  2.152307492100e-06
96001.00000  97001.00000  2.260827197584e-06
97001.00000  98001.00000  1.862921610810e-06
98001.00000  99001.00000  2.079961021778e-06
99001.00000  100001.00000  1.808661758068e-06
100001.00000  101001.00000  1.736315287745e-06
101001.00000  102001.00000  2.043787786616e-06
102001.00000  103001.00000  1.844834993229e-06
103001.00000  104001.00000  2.043787786616e-06
104001.00000  105001.00000  1.754401905326e-06
105001.00000  106001.00000  1.826748375648e-06
106001.00000  107001.00000  1.663968817422e-06
107001.00000  108001.00000  1.826748375648e-06
108001.00000  109001.00000  1.465016024035e-06
109001.00000  110001.00000  1.229889995486e-06
110001.00000  111001.00000  1.428842788873e-06
111001.00000  112001.00000  1.573535729519e-06
112001.00000  113001.00000  1.121370290002e-06
113001.00000  114001.00000  1.465016024035e-06
114001.00000  115001.00000  1.030937202099e-06
115001.00000  116001.00000  1.266063230647e-06
116001.00000  117001.00000  1.356496318551e-06
117001.00000  118001.00000  1.229889995486e-06
118001.00000  119001.00000  1.157543525163e-06
119001.00000  120001.00000  1.193716760325e-06
120001.00000  121001.00000  9.224174966145e-07
121001.00000  122001.00000  1.085197054841e-06
122001.00000  123001.00000  1.012850584518e-06
123001.00000  124001.00000  9.585907317758e-07
124001.00000  125001.00000  1.302236465809e-06
125001.00000  126001.00000  9.766773493565e-07
126001.00000  127001.00000  1.085197054841e-06
127001.00000  128001.00000  8.681576438724e-07
128001.00000  129001.00000  8.862442614531e-07
129001.00000  130001.00000  9.766773493565e-07
130001.00000  131001.00000  8.319844087111e-07
131001.00000  132001.00000  8.681576438724e-07
132001.00000  133001.00000  8.862442614531e-07
133001.00000  134001.00000  7.415513208077e-07
134001.00000  135001.00000  9.766773493565e-07
135001.00000  136001.00000  7.415513208077e-07
136001.00000  137001.00000  8.138977911304e-07
137001.00000  138001.00000  7.958111735497e-07
138001.00000  139001.00000  7.777245559691e-07
139001.00000  140001.00000  9.224174966145e-07
140001.00000  141001.00000  7.415513208077e-07
141001.00000  142001.00000  6.692048504850e-07
142001.00000  143001.00000  4.883386746782e-07
143001.00000  144001.00000  5.968583801623e-07
144001.00000  145001.00000  7.958111735497e-07
145001.00000  146001.00000  6.330316153237e-07
146001.00000  147001.00000  7.053780856464e-07
147001.00000  148001.00000  4.702520570976e-07
148001.00000  149001.00000  6.872914680657e-07
149001.00000  150001.00000  5.787717625816e-07
150001.00000  151001.00000  6.149449977430e-07
151001.00000  152001.00000  6.149449977430e-07
152001.00000  153001.00000  5.425985274203e-07
153001.00000  154001.00000  6.330316153237e-07
154001.00000  155001.00000  5.245119098396e-07
155001.00000  156001.00000  5.787717625816e-07
156001.00000  157001.00000  6.692048504850e-07
157001.00000  158001.00000  4.521654395169e-07
158001.00000  159001.00000  5.425985274203e-07
159001.00000  160001.00000  6.330316153237e-07
160001.00000  161001.00000  4.340788219362e-07
161001.00000  162001.00000  5.606851450010e-07
162001.00000  163001.00000  5.425985274203e-07
163001.00000  164001.00000  4.702520570976e-07
164001.00000  165001.00000  4.340788219362e-07
165001.00000  166001.00000  4.883386746782e-07
166001.00000  167001.00000  3.798189691942e-07
167001.00000  168001.00000  5.968583801623e-07
168001.00000  169001.00000  3.255591164522e-07
169001.00000  170001.00000  4.159922043555e-07
170001.00000  171001.00000  5.064252922589e-07
171001.00000  172001.00000  3.979055867749e-07
172001.00000  173001.00000  3.617323516135e-07
173001.00000  174001.00000  5.606851450010e-07
174001.00000  175001.00000  4.159922043555e-07
175001.00000  176001.00000  3.255591164522e-07
176001.00000  177001.00000  4.521654395169e-07
177001.00000  178001.00000  2.170394109681e-07
178001.00000  179001.00000  4.521654395169e-07
179001.00000  180001.00000  3.617323516135e-07
180001.00000  181001.00000  3.979055867749e-07
181001.00000  182001.00000  4.702520570976e-07
182001.00000  183001.00000  4.521654395169e-07
183001.00000  184001.00000  1.808661758068e-07
184001.00000  185001.00000  3.436457340328e-07
185001.00000  186001.00000  2.170394109681e-07
186001.00000  187001.00000  2.893858812908e-07
187001.00000  188001.00000  2.712992637101e-07
188001.00000  189001.00000  2.712992637101e-07
189001.00000  190001.00000  3.074724988715e-07
190001.00000  191001.00000  2.351260285488e-07
191001.00000  192001.00000  2.170394109681e-07
192001.00000  193001.00000  2.712992637101e-07
193001.00000  194001.00000  3.798189691942e-07
194001.00000  195001.00000  3.617323516135e-07
195001.00000  196001.00000  3.436457340328e-07
196001.00000  197001.00000  3.617323516135e-07
197001.00000  198001.00000  2.351260285488e-07
198001.00000  199001.00000  2.532126461295e-07
