10001.00000  11001.00000  6.476785732653e-04
11001.00000  12001.00000  5.443189511478e-04
12001.00000  13001.00000  4.563202140474e-04
13001.00000  14001.00000  3.935533846993e-04
14001.00000  15001.00000  3.383328807029e-04
15001.00000  16001.00000  2.994925521148e-04
16001.00000  17001.00000  2.627086865966e-04
17001.00000  18001.00000  2.354739626372e-04
18001.00000  19001.00000  2.094731165198e-04
19001.00000  20001.00000  1.900171876506e-04
20001.00000  21001.00000  1.684869134241e-04
21001.00000  22001.00000  1.537697907592e-04
22001.00000  23001.00000  1.397500773094e-04
23001.00000  24001.00000  1.270178885641e-04
24001.00000  25001.00000  1.158414588369e-04
25001.00000  26001.00000  1.058273778013e-04
26001.00000  27001.00000  9.931822512812e-05
27001.00000  28001.00000  8.921473265470e-05
28001.00000  29001.00000  8.467263161355e-05
29001.00000  30001.00000  7.746606972543e-05
30001.00000  31001.00000  7.458702142769e-05
31001.00000  32001.00000  6.757716470277e-05
32001.00000  33001.00000  6.628963999819e-05
33001.00000  34001.00000  6.162236294410e-05
34001.00000  35001.00000  5.657955785117e-05
35001.00000  36001.00000  5.312827635140e-05
36001.00000  37001.00000  5.067840295519e-05
37001.00000  38001.00000  4.790664838283e-05
38001.00000  39001.00000  4.513489381048e-05
39001.00000  40001.00000  4.170149459827e-05
40001.00000  41001.00000  4.084314479522e-05
41001.00000  42001.00000  3.724880499494e-05
42001.00000  43001.00000  3.597916257792e-05
43001.00000  44001.00000  3.506716591218e-05
44001.00000  45001.00000  3.286764454186e-05
45001.00000  46001.00000  3.132976781139e-05
46001.00000  47001.00000  2.934483389183e-05
47001.00000  48001.00000  2.911236415351e-05
48001.00000  49001.00000  2.761025199817e-05
49001.00000  50001.00000  2.585778781694e-05
50001.00000  51001.00000  2.426626422378e-05
51001.00000  52001.00000  2.310391553215e-05
52001.00000  53001.00000  2.340791442073e-05
53001.00000  54001.00000  2.136933363848e-05
54001.00000  55001.00000  2.077921814888e-05
55001.00000  56001.00000  2.040369011004e-05
56001.00000  57001.00000  1.947381115674e-05
57001.00000  58001.00000  1.852604991587e-05
58001.00000  59001.00000  1.747099494962e-05
59001.00000  60001.00000  1.655899828388e-05
60001.00000  61001.00000  1.711334919835e-05
61001.00000  62001.00000  1.682723259733e-05
62001.00000  63001.00000  1.514629756635e-05
63001.00000  64001.00000  1.536088501712e-05
64001.00000  65001.00000  1.412700717523e-05
65001.00000  66001.00000  1.464559351457e-05
66001.00000  67001.00000  1.307195220898e-05
67001.00000  68001.00000  1.199901495516e-05
68001.00000  69001.00000  1.255336586963e-05
69001.00000  70001.00000  1.171289835414e-05
70001.00000  71001.00000  1.164136920389e-05
71001.00000  72001.00000  1.155195776607e-05
72001.00000  73001.00000  1.131948802775e-05
73001.00000  74001.00000  9.781611297278e-06
74001.00000  75001.00000  9.710082147024e-06
75001.00000  76001.00000  9.602788421642e-06
76001.00000  77001.00000  9.674317571897e-06
77001.00000  78001.00000  9.191495807680e-06
78001.00000  79001.00000  9.263024957934e-06
79001.00000  80001.00000  8.386792867319e-06
80001.00000  81001.00000  8.297381429501e-06
81001.00000  82001.00000  9.620670709206e-06
82001.00000  83001.00000  7.474796201576e-06
83001.00000  84001.00000  7.886088815539e-06
84001.00000  85001.00000  7.832441952848e-06
85001.00000  86001.00000  7.939735678230e-06
86001.00000  87001.00000  7.385384763759e-06
87001.00000  88001.00000  7.117150450305e-06
88001.00000  89001.00000  7.278091038377e-06
89001.00000  90001.00000  7.242326463250e-06
90001.00000  91001.00000  6.258800647253e-06
91001.00000  92001.00000  6.062095484054e-06
92001.00000  93001.00000  6.509152673143e-06
93001.00000  94001.00000  5.990566333799e-06
94001.00000  95001.00000  5.489862282019e-06
95001.00000  96001.00000  5.811743458164e-06
96001.00000  97001.00000  5.597156007401e-06
97001.00000  98001.00000  5.525626857146e-06
98001.00000  99001.00000  5.436215419328e-06
99001.00000  100001.00000  4.810335354603e-06
100001.00000  101001.00000  5.382568556638e-06
101001.00000  102001.00000  5.060687380493e-06
102001.00000  103001.00000  4.756688491912e-06
103001.00000  104001.00000  5.185863393438e-06
104001.00000  105001.00000  4.363278165514e-06
105001.00000  106001.00000  4.613630191404e-06
106001.00000  107001.00000  4.345395877950e-06
107001.00000  108001.00000  4.309631302823e-06
108001.00000  109001.00000  4.166573002314e-06
109001.00000  110001.00000  3.951985551551e-06
110001.00000  111001.00000  4.077161564496e-06
111001.00000  112001.00000  4.184455289878e-06
112001.00000  113001.00000  3.916220976424e-06
113001.00000  114001.00000  4.166573002314e-06
114001.00000  115001.00000  4.255984440132e-06
115001.00000  116001.00000  3.719515813225e-06
116001.00000  117001.00000  3.612222087843e-06
117001.00000  118001.00000  3.397634637080e-06
118001.00000  119001.00000  3.343987774389e-06
119001.00000  120001.00000  2.843283722609e-06
120001.00000  121001.00000  3.039988885809e-06
121001.00000  122001.00000  2.914812872864e-06
122001.00000  123001.00000  3.236694049008e-06
123001.00000  124001.00000  2.986342023118e-06
124001.00000  125001.00000  3.111518036063e-06
125001.00000  126001.00000  2.485637971338e-06
126001.00000  127001.00000  3.004224310681e-06
127001.00000  128001.00000  2.968459735554e-06
128001.00000  129001.00000  2.682343134537e-06
129001.00000  130001.00000  2.968459735554e-06
130001.00000  131001.00000  2.896930585300e-06
131001.00000  132001.00000  2.771754572355e-06
132001.00000  133001.00000  2.682343134537e-06
133001.00000  134001.00000  2.825401435046e-06
134001.00000  135001.00000  2.360461958393e-06
135001.00000  136001.00000  2.217403657884e-06
136001.00000  137001.00000  2.271050520575e-06
137001.00000  138001.00000  2.360461958393e-06
138001.00000  139001.00000  2.002816207121e-06
139001.00000  140001.00000  2.306815095702e-06
140001.00000  141001.00000  2.306815095702e-06
141001.00000  142001.00000  1.841875619049e-06
142001.00000  143001.00000  1.859757906612e-06
143001.00000  144001.00000  1.806111043922e-06
144001.00000  145001.00000  2.002816207121e-06
145001.00000  146001.00000  2.253168233011e-06
146001.00000  147001.00000  2.253168233011e-06
147001.00000  148001.00000  1.770346468794e-06
148001.00000  149001.00000  2.288932808138e-06
149001.00000  150001.00000  1.895522481739e-06
150001.00000  151001.00000  1.895522481739e-06
151001.00000  152001.00000  1.859757906612e-06
152001.00000  153001.00000  1.895522481739e-06
153001.00000  154001.00000  1.680935030977e-06
154001.00000  155001.00000  1.967051631994e-06
155001.00000  156001.00000  1.645170455849e-06
156001.00000  157001.00000  1.573641305595e-06
157001.00000  158001.00000  1.859757906612e-06
158001.00000  159001.00000  1.716699606104e-06
159001.00000  160001.00000  1.466347580214e-06
160001.00000  161001.00000  1.323289279705e-06
161001.00000  162001.00000  1.484229867777e-06
162001.00000  163001.00000  1.645170455849e-06
163001.00000  164001.00000  1.448465292650e-06
164001.00000  165001.00000  1.609405880722e-06
165001.00000  166001.00000  1.412700717523e-06
166001.00000  167001.00000  1.108701828942e-06
167001.00000  168001.00000  1.519994442904e-06
168001.00000  169001.00000  1.376936142396e-06
169001.00000  170001.00000  1.502112155341e-06
170001.00000  171001.00000  1.323289279705e-06
171001.00000  172001.00000  1.072937253815e-06
172001.00000  173001.00000  1.394818429959e-06
173001.00000  174001.00000  1.055054966251e-06
174001.00000  175001.00000  1.269642417014e-06
175001.00000  176001.00000  1.144466404069e-06
176001.00000  177001.00000  9.477612408697e-07
177001.00000  178001.00000  1.180230979196e-06
178001.00000  179001.00000  1.323289279705e-06
179001.00000  180001.00000  1.019290391124e-06
180001.00000  181001.00000  1.126584116506e-06
181001.00000  182001.00000  1.215995554323e-06
182001.00000  183001.00000  1.215995554323e-06
183001.00000  184001.00000  9.656435284333e-07
184001.00000  185001.00000  1.090819541378e-06
185001.00000  186001.00000  1.001408103560e-06
186001.00000  187001.00000  9.477612408697e-07
187001.00000  188001.00000  9.835258159969e-07
188001.00000  189001.00000  1.108701828942e-06
189001.00000  190001.00000  1.108701828942e-06
190001.00000  191001.00000  9.656435284333e-07
191001.00000  192001.00000  1.019290391124e-06
192001.00000  193001.00000  7.152915025432e-07
193001.00000  194001.00000  1.055054966251e-06
194001.00000  195001.00000  9.298789533062e-07
195001.00000  196001.00000  1.001408103560e-06
196001.00000  197001.00000  7.689383652339e-07
197001.00000  198001.00000  8.047029403611e-07
198001.00000  199001.00000  9.119966657426e-07
