300.00000  350.00000  5.450118480357e-05
350.00000  400.00000  8.856442530580e-05
400.00000  450.00000  5.904295020387e-05
450.00000  500.00000  6.207079380407e-05
500.00000  550.00000  4.481208528294e-04
550.00000  600.00000  5.223030210342e-05
600.00000  650.00000  1.301972748085e-04
650.00000  700.00000  5.752902840377e-05
700.00000  750.00000  7.721001180506e-05
750.00000  800.00000  5.979991110392e-05
800.00000  850.00000  2.028655212133e-04
850.00000  900.00000  5.147334120337e-05
900.00000  950.00000  5.752902840377e-05
950.00000  1000.00000  5.298726300347e-05
1000.00000  1050.00000  7.115432460466e-05
1050.00000  1100.00000  5.752902840377e-05
1100.00000  1150.00000  5.601510660367e-05
1150.00000  1200.00000  5.525814570362e-05
1200.00000  1250.00000  5.147334120337e-05
1250.00000  1300.00000  1.112732523073e-04
1300.00000  1350.00000  5.601510660367e-05
1350.00000  1400.00000  4.995941940327e-05
1400.00000  1450.00000  6.207079380407e-05
1450.00000  1500.00000  6.055687200397e-05
1500.00000  1550.00000  5.752902840377e-05
1550.00000  1600.00000  6.812648100446e-05
1600.00000  1650.00000  3.709108410243e-05
1650.00000  1700.00000  5.828598930382e-05
1700.00000  1750.00000  1.430656101094e-04
1750.00000  1800.00000  5.298726300347e-05
1800.00000  1850.00000  5.374422390352e-05
1850.00000  1900.00000  6.055687200397e-05
1900.00000  1950.00000  4.844549760317e-05
1950.00000  2000.00000  6.661255920436e-05
2000.00000  2050.00000  5.904295020387e-05
2050.00000  2100.00000  5.525814570362e-05
2100.00000  2150.00000  6.434167650421e-05
2150.00000  2200.00000  5.071638030332e-05
2200.00000  2250.00000  6.964040280456e-05
2250.00000  2300.00000  5.904295020387e-05
2300.00000  2350.00000  1.400377665092e-04
2350.00000  2400.00000  5.601510660367e-05
2400.00000  2450.00000  4.617461490302e-05
2450.00000  2500.00000  5.828598930382e-05
2500.00000  2550.00000  6.434167650421e-05
2550.00000  2600.00000  4.693157580307e-05
2600.00000  2650.00000  4.844549760317e-05
2650.00000  2700.00000  4.466069310293e-05
2700.00000  2750.00000  5.904295020387e-05
2750.00000  2800.00000  5.223030210342e-05
2800.00000  2850.00000  4.087588860268e-05
2850.00000  2900.00000  4.617461490302e-05
2900.00000  2950.00000  5.525814570362e-05
2950.00000  3000.00000  6.509863740426e-05
3000.00000  3050.00000  4.920245850322e-05
3050.00000  3100.00000  5.147334120337e-05
3100.00000  3150.00000  6.055687200397e-05
3150.00000  3200.00000  4.768853670312e-05
3200.00000  3250.00000  4.541765400298e-05
3250.00000  3300.00000  4.466069310293e-05
3300.00000  3350.00000  4.844549760317e-05
3350.00000  3400.00000  3.936196680258e-05
3400.00000  3450.00000  4.995941940327e-05
3450.00000  3500.00000  3.860500590253e-05
3500.00000  3550.00000  3.784804500248e-05
3550.00000  3600.00000  3.557716230233e-05
3600.00000  3650.00000  4.238981040278e-05
3650.00000  3700.00000  5.298726300347e-05
3700.00000  3750.00000  4.163284950273e-05
3750.00000  3800.00000  4.163284950273e-05
3800.00000  3850.00000  4.617461490302e-05
3850.00000  3900.00000  3.482020140228e-05
3900.00000  3950.00000  2.952147510193e-05
3950.00000  4000.00000  3.557716230233e-05
4000.00000  4050.00000  4.011892770263e-05
4050.00000  4100.00000  3.784804500248e-05
4100.00000  4150.00000  3.784804500248e-05
4150.00000  4200.00000  3.103539690203e-05
4200.00000  4250.00000  2.952147510193e-05
4250.00000  4300.00000  2.573667060169e-05
4300.00000  4350.00000  2.422274880159e-05
4350.00000  4400.00000  2.270882700149e-05
4400.00000  4450.00000  2.346578790154e-05
4450.00000  4500.00000  1.816706160119e-05
4500.00000  4550.00000  2.346578790154e-05
4550.00000  4600.00000  2.800755330183e-05
4600.00000  4650.00000  2.952147510193e-05
4650.00000  4700.00000  3.179235780208e-05
4700.00000  4750.00000  2.573667060169e-05
4750.00000  4800.00000  1.968098340129e-05
4800.00000  4850.00000  2.573667060169e-05
4850.00000  4900.00000  3.179235780208e-05
4900.00000  4950.00000  2.422274880159e-05
4950.00000  5000.00000  2.346578790154e-05
5000.00000  5050.00000  1.968098340129e-05
5050.00000  5100.00000  3.103539690203e-05
5100.00000  5150.00000  1.741010070114e-05
5150.00000  5200.00000  2.043794430134e-05
5200.00000  5250.00000  2.649363150174e-05
5250.00000  5300.00000  2.725059240179e-05
5300.00000  5350.00000  2.800755330183e-05
5350.00000  5400.00000  1.816706160119e-05
5400.00000  5450.00000  2.346578790154e-05
5450.00000  5500.00000  1.816706160119e-05
5500.00000  5550.00000  2.573667060169e-05
5550.00000  5600.00000  1.513921800099e-05
5600.00000  5650.00000  2.422274880159e-05
5650.00000  5700.00000  1.741010070114e-05
5700.00000  5750.00000  1.816706160119e-05
5750.00000  5800.00000  1.816706160119e-05
5800.00000  5850.00000  2.043794430134e-05
5850.00000  5900.00000  1.816706160119e-05
5900.00000  5950.00000  2.195186610144e-05
5950.00000  6000.00000  1.892402250124e-05
6000.00000  6050.00000  1.968098340129e-05
6050.00000  6100.00000  1.589617890104e-05
6100.00000  6150.00000  1.665313980109e-05
6150.00000  6200.00000  1.816706160119e-05
6200.00000  6250.00000  1.438225710094e-05
6250.00000  6300.00000  2.497970970164e-05
6300.00000  6350.00000  2.043794430134e-05
6350.00000  6400.00000  1.839414987120e-04
6400.00000  6450.00000  2.043794430134e-05
6450.00000  6500.00000  9.083530800595e-06
6500.00000  6550.00000  1.741010070114e-05
6550.00000  6600.00000  1.513921800099e-05
6600.00000  6650.00000  1.211137440079e-05
6650.00000  6700.00000  1.135441350074e-05
6700.00000  6750.00000  1.211137440079e-05
6750.00000  6800.00000  1.589617890104e-05
6800.00000  6850.00000  1.741010070114e-05
6850.00000  6900.00000  1.135441350074e-05
6900.00000  6950.00000  1.286833530084e-05
6950.00000  7000.00000  1.438225710094e-05
7000.00000  7050.00000  1.513921800099e-05
7050.00000  7100.00000  3.860500590253e-05
7100.00000  7150.00000  1.135441350074e-05
7150.00000  7200.00000  1.362529620089e-05
7200.00000  7250.00000  1.135441350074e-05
7250.00000  7300.00000  1.135441350074e-05
7300.00000  7350.00000  9.840491700645e-06
7350.00000  7400.00000  6.812648100446e-06
7400.00000  7450.00000  1.059745260069e-05
7450.00000  7500.00000  2.043794430134e-05
7500.00000  7550.00000  9.083530800595e-06
7550.00000  7600.00000  9.083530800595e-06
7600.00000  7650.00000  1.135441350074e-05
7650.00000  7700.00000  8.326569900545e-06
7700.00000  7750.00000  7.569609000496e-06
7750.00000  7800.00000  8.326569900545e-06
7800.00000  7850.00000  9.840491700645e-06
7850.00000  7900.00000  8.326569900545e-06
7900.00000  7950.00000  5.298726300347e-06
7950.00000  8000.00000  8.326569900545e-06
8000.00000  8050.00000  7.569609000496e-06
8050.00000  8100.00000  1.286833530084e-05
8100.00000  8150.00000  8.326569900545e-06
8150.00000  8200.00000  9.840491700645e-06
8200.00000  8250.00000  6.812648100446e-06
8250.00000  8300.00000  4.541765400298e-06
8300.00000  8350.00000  6.812648100446e-06
8350.00000  8400.00000  1.135441350074e-05
8400.00000  8450.00000  4.541765400298e-06
8450.00000  8500.00000  8.326569900545e-06
8500.00000  8550.00000  7.569609000496e-06
8550.00000  8600.00000  8.326569900545e-06
8600.00000  8650.00000  5.298726300347e-06
8650.00000  8700.00000  1.211137440079e-05
8700.00000  8750.00000  5.298726300347e-06
8750.00000  8800.00000  5.298726300347e-06
8800.00000  8850.00000  6.055687200397e-06
8850.00000  8900.00000  8.326569900545e-06
8900.00000  8950.00000  7.569609000496e-06
8950.00000  9000.00000  8.326569900545e-06
9000.00000  9050.00000  9.083530800595e-06
9050.00000  9100.00000  4.541765400298e-06
9100.00000  9150.00000  8.326569900545e-06
9150.00000  9200.00000  3.784804500248e-06
9200.00000  9250.00000  9.840491700645e-06
9250.00000  9300.00000  3.027843600198e-06
9300.00000  9350.00000  9.083530800595e-06
9350.00000  9400.00000  5.298726300347e-06
9400.00000  9450.00000  4.541765400298e-06
9450.00000  9500.00000  9.083530800595e-06
9500.00000  9550.00000  6.812648100446e-06
9550.00000  9600.00000  2.270882700149e-06
9600.00000  9650.00000  4.541765400298e-06
9650.00000  9700.00000  3.027843600198e-06
9700.00000  9750.00000  6.055687200397e-06
9750.00000  9800.00000  9.083530800595e-06
9800.00000  9850.00000  2.270882700149e-06
9850.00000  9900.00000  6.055687200397e-06
9900.00000  9950.00000  8.326569900545e-06
9950.00000  10000.00000  6.812648100446e-06
