300.00000  350.00000  7.562806496426e-04
350.00000  400.00000  7.069579985790e-04
400.00000  450.00000  5.627266098625e-04
450.00000  500.00000  4.850060687926e-04
500.00000  550.00000  5.933664385536e-04
550.00000  600.00000  2.346562489998e-04
600.00000  650.00000  2.712745808501e-04
650.00000  700.00000  1.935540397801e-04
700.00000  750.00000  1.943013526750e-04
750.00000  800.00000  1.748712174075e-04
800.00000  850.00000  2.496025068979e-04
850.00000  900.00000  1.659034626686e-04
900.00000  950.00000  1.360109468725e-04
950.00000  1000.00000  1.427367629266e-04
1000.00000  1050.00000  1.315270695031e-04
1050.00000  1100.00000  1.210646889744e-04
1100.00000  1150.00000  1.300324437133e-04
1150.00000  1200.00000  1.233066276591e-04
1200.00000  1250.00000  1.218120018693e-04
1250.00000  1300.00000  2.055110460985e-04
1300.00000  1350.00000  1.083603697610e-04
1350.00000  1400.00000  1.076130568661e-04
1400.00000  1450.00000  1.248012534489e-04
1450.00000  1500.00000  1.210646889744e-04
1500.00000  1550.00000  1.367582597674e-04
1550.00000  1600.00000  1.360109468725e-04
1600.00000  1650.00000  1.479679531909e-04
1650.00000  1700.00000  1.494625789808e-04
1700.00000  1750.00000  2.533390713724e-04
1750.00000  1800.00000  1.696400271432e-04
1800.00000  1850.00000  1.561883950349e-04
1850.00000  1900.00000  1.442313887164e-04
1900.00000  1950.00000  1.457260145062e-04
1950.00000  2000.00000  1.703873400381e-04
2000.00000  2050.00000  1.703873400381e-04
2050.00000  2100.00000  1.987852300444e-04
2100.00000  2150.00000  2.070056718883e-04
2150.00000  2200.00000  2.129841750476e-04
2200.00000  2250.00000  2.361508747896e-04
2250.00000  2300.00000  2.510971326877e-04
2300.00000  2350.00000  3.744037603468e-04
2350.00000  2400.00000  2.533390713724e-04
2400.00000  2450.00000  2.854735258532e-04
2450.00000  2500.00000  2.667907034806e-04
2500.00000  2550.00000  2.675380163756e-04
2550.00000  2600.00000  2.518444455826e-04
2600.00000  2650.00000  2.966832192768e-04
2650.00000  2700.00000  3.034090353309e-04
2700.00000  2750.00000  2.996724708564e-04
2750.00000  2800.00000  2.974305321717e-04
2800.00000  2850.00000  3.340488640220e-04
2850.00000  2900.00000  3.452585574455e-04
2900.00000  2950.00000  3.676779442927e-04
2950.00000  3000.00000  4.057909019328e-04
3000.00000  3050.00000  3.729091345570e-04
3050.00000  3100.00000  4.065382148277e-04
3100.00000  3150.00000  4.528716143117e-04
3150.00000  3200.00000  4.453984853627e-04
3200.00000  3250.00000  4.468931111525e-04
3250.00000  3300.00000  4.610920561556e-04
3300.00000  3350.00000  4.805221914231e-04
3350.00000  3400.00000  4.887426332671e-04
3400.00000  3450.00000  5.074254556397e-04
3450.00000  3500.00000  5.163932103785e-04
3500.00000  3550.00000  4.992050137957e-04
3550.00000  3600.00000  5.380652843307e-04
3600.00000  3650.00000  5.731889903912e-04
3650.00000  3700.00000  6.135438867160e-04
3700.00000  3750.00000  5.821567451300e-04
3750.00000  3800.00000  5.993449417128e-04
3800.00000  3850.00000  6.486675927765e-04
3850.00000  3900.00000  6.000922546077e-04
3900.00000  3950.00000  6.531514701459e-04
3950.00000  4000.00000  6.733289183083e-04
4000.00000  4050.00000  6.718342925185e-04
4050.00000  4100.00000  6.628665377796e-04
4100.00000  4150.00000  6.778127956777e-04
4150.00000  4200.00000  6.882751762064e-04
4200.00000  4250.00000  6.890224891013e-04
4250.00000  4300.00000  7.091999372637e-04
4300.00000  4350.00000  7.301246983210e-04
4350.00000  4400.00000  7.712269075407e-04
4400.00000  4450.00000  7.032214341045e-04
4450.00000  4500.00000  8.041086749165e-04
4500.00000  4550.00000  7.884151041235e-04
4550.00000  4600.00000  7.428290175344e-04
4600.00000  4650.00000  7.973828588623e-04
4650.00000  4700.00000  8.138237425502e-04
4700.00000  4750.00000  7.966355459674e-04
4750.00000  4800.00000  8.003721104419e-04
4800.00000  4850.00000  8.295173133432e-04
4850.00000  4900.00000  8.048559878114e-04
4900.00000  4950.00000  8.056033007063e-04
4950.00000  5000.00000  7.869204783337e-04
5000.00000  5050.00000  7.921516685980e-04
5050.00000  5100.00000  7.809419751744e-04
5100.00000  5150.00000  7.749634720152e-04
5150.00000  5200.00000  8.437162583464e-04
5200.00000  5250.00000  8.347485036075e-04
5250.00000  5300.00000  8.295173133432e-04
5300.00000  5350.00000  7.831839138592e-04
5350.00000  5400.00000  7.779527235948e-04
5400.00000  5450.00000  8.407270067667e-04
5450.00000  5500.00000  8.175603070247e-04
5500.00000  5550.00000  8.220441843942e-04
5550.00000  5600.00000  8.070979264961e-04
5600.00000  5650.00000  7.839312267541e-04
5650.00000  5700.00000  7.413343917445e-04
5700.00000  5750.00000  7.794473493846e-04
5750.00000  5800.00000  7.973828588623e-04
5800.00000  5850.00000  7.861731654388e-04
5850.00000  5900.00000  8.003721104419e-04
5900.00000  5950.00000  7.809419751744e-04
5950.00000  6000.00000  7.622591528019e-04
6000.00000  6050.00000  8.347485036075e-04
6050.00000  6100.00000  7.674903430662e-04
6100.00000  6150.00000  7.831839138592e-04
6150.00000  6200.00000  7.697322817509e-04
6200.00000  6250.00000  8.295173133432e-04
6250.00000  6300.00000  8.265280617636e-04
6300.00000  6350.00000  7.607645270120e-04
6350.00000  6400.00000  1.709851903540e-03
6400.00000  6450.00000  7.323666370057e-04
6450.00000  6500.00000  7.293773854261e-04
6500.00000  6550.00000  7.525440851681e-04
6550.00000  6600.00000  7.091999372637e-04
6600.00000  6650.00000  7.809419751744e-04
6650.00000  6700.00000  6.920117406809e-04
6700.00000  6750.00000  7.316193241108e-04
6750.00000  6800.00000  6.636138506746e-04
6800.00000  6850.00000  6.875278633115e-04
6850.00000  6900.00000  6.763181698879e-04
6900.00000  6950.00000  6.912644277860e-04
6950.00000  7000.00000  6.546460959357e-04
7000.00000  7050.00000  6.568880346204e-04
7050.00000  7100.00000  7.338612627955e-04
7100.00000  7150.00000  5.029415782702e-04
7150.00000  7200.00000  4.401672950983e-04
7200.00000  7250.00000  3.990650858786e-04
7250.00000  7300.00000  4.528716143117e-04
7300.00000  7350.00000  4.566081787862e-04
7350.00000  7400.00000  4.678178722098e-04
7400.00000  7450.00000  4.491350498372e-04
7450.00000  7500.00000  4.364307306238e-04
7500.00000  7550.00000  4.050435890378e-04
7550.00000  7600.00000  4.468931111525e-04
7600.00000  7650.00000  4.117694050920e-04
7650.00000  7700.00000  4.379253564136e-04
7700.00000  7750.00000  4.364307306238e-04
7750.00000  7800.00000  4.379253564136e-04
7800.00000  7850.00000  4.237264114104e-04
7850.00000  7900.00000  4.147586566716e-04
7900.00000  7950.00000  4.162532824614e-04
7950.00000  8000.00000  4.125167179869e-04
8000.00000  8050.00000  3.915919569296e-04
8050.00000  8100.00000  4.439038595728e-04
8100.00000  8150.00000  4.102747793022e-04
8150.00000  8200.00000  4.072855277226e-04
8200.00000  8250.00000  4.050435890378e-04
8250.00000  8300.00000  3.781403248213e-04
8300.00000  8350.00000  3.915919569296e-04
8350.00000  8400.00000  3.833715150856e-04
8400.00000  8450.00000  3.781403248213e-04
8450.00000  8500.00000  3.878553924551e-04
8500.00000  8550.00000  4.072855277226e-04
8550.00000  8600.00000  3.871080795602e-04
8600.00000  8650.00000  3.968231471939e-04
8650.00000  8700.00000  3.736564474519e-04
8700.00000  8750.00000  3.841188279805e-04
8750.00000  8800.00000  4.020543374582e-04
8800.00000  8850.00000  3.542263121844e-04
8850.00000  8900.00000  3.721618216621e-04
8900.00000  8950.00000  3.624467540283e-04
8950.00000  9000.00000  3.684252571876e-04
9000.00000  9050.00000  3.467531832354e-04
9050.00000  9100.00000  3.452585574455e-04
9100.00000  9150.00000  3.460058703404e-04
9150.00000  9200.00000  3.587101895538e-04
9200.00000  9250.00000  3.624467540283e-04
9250.00000  9300.00000  3.355434898118e-04
9300.00000  9350.00000  3.587101895538e-04
9350.00000  9400.00000  3.131241029647e-04
9400.00000  9450.00000  3.407746800761e-04
9450.00000  9500.00000  3.310596124424e-04
9500.00000  9550.00000  3.161133545443e-04
9550.00000  9600.00000  3.355434898118e-04
9600.00000  9650.00000  3.198499190188e-04
9650.00000  9700.00000  3.362908027067e-04
9700.00000  9750.00000  3.191026061239e-04
9750.00000  9800.00000  3.071455998055e-04
9800.00000  9850.00000  3.258284221780e-04
9850.00000  9900.00000  2.989251579615e-04
9900.00000  9950.00000  3.049036611207e-04
9950.00000  10000.00000  3.101348513851e-04
