300.00000  350.00000  5.726118358378e-01
350.00000  400.00000  4.296842700451e-01
400.00000  450.00000  3.336316337273e-01
450.00000  500.00000  2.667728648396e-01
500.00000  550.00000  2.188110734729e-01
550.00000  600.00000  1.817571938747e-01
600.00000  650.00000  1.541552276433e-01
650.00000  700.00000  1.319190787447e-01
700.00000  750.00000  1.142463078519e-01
750.00000  800.00000  9.972958202111e-02
800.00000  850.00000  8.844568453030e-02
850.00000  900.00000  7.830740796548e-02
900.00000  950.00000  6.999354534230e-02
950.00000  1000.00000  6.325788549258e-02
1000.00000  1050.00000  5.689172263756e-02
1050.00000  1100.00000  5.202517685371e-02
1100.00000  1150.00000  4.739907448007e-02
1150.00000  1200.00000  4.338976172393e-02
1200.00000  1250.00000  3.972939832473e-02
1250.00000  1300.00000  3.670781412027e-02
1300.00000  1350.00000  3.389098532360e-02
1350.00000  1400.00000  3.166859608231e-02
1400.00000  1450.00000  2.938059859415e-02
1450.00000  1500.00000  2.733592839519e-02
1500.00000  1550.00000  2.564309143216e-02
1550.00000  1600.00000  2.404506199069e-02
1600.00000  1650.00000  2.253823522206e-02
1650.00000  1700.00000  2.126031634771e-02
1700.00000  1750.00000  2.023185300539e-02
1750.00000  1800.00000  1.890346624884e-02
1800.00000  1850.00000  1.785229235952e-02
1850.00000  1900.00000  1.707256357949e-02
1900.00000  1950.00000  1.615801345700e-02
1950.00000  2000.00000  1.518650672459e-02
2000.00000  2050.00000  1.457079856172e-02
2050.00000  2100.00000  1.402033816083e-02
2100.00000  2150.00000  1.315012767771e-02
2150.00000  2200.00000  1.269771916225e-02
2200.00000  2250.00000  1.197927281060e-02
2250.00000  2300.00000  1.157589023785e-02
2300.00000  2350.00000  1.107553723430e-02
2350.00000  2400.00000  1.046415488989e-02
2400.00000  2450.00000  1.006906346922e-02
2450.00000  2500.00000  9.686228534225e-03
2500.00000  2550.00000  9.205341713806e-03
2550.00000  2600.00000  8.907941693682e-03
2600.00000  2650.00000  8.633612705422e-03
2650.00000  2700.00000  8.295838379535e-03
2700.00000  2750.00000  7.965634235979e-03
2750.00000  2800.00000  7.727353735007e-03
2800.00000  2850.00000  7.455187655984e-03
2850.00000  2900.00000  7.090737449505e-03
2900.00000  2950.00000  6.945462045735e-03
2950.00000  3000.00000  6.814245552008e-03
3000.00000  3050.00000  6.512519713409e-03
3050.00000  3100.00000  6.348138611377e-03
3100.00000  3150.00000  6.213317268921e-03
3150.00000  3200.00000  5.836971061636e-03
3200.00000  3250.00000  5.682683536044e-03
3250.00000  3300.00000  5.597609106045e-03
3300.00000  3350.00000  5.276056599438e-03
3350.00000  3400.00000  5.147723984694e-03
3400.00000  3450.00000  5.075266525246e-03
3450.00000  3500.00000  4.914850756815e-03
3500.00000  3550.00000  4.793727839528e-03
3550.00000  3600.00000  4.591856310716e-03
3600.00000  3650.00000  4.489118121946e-03
3650.00000  3700.00000  4.379530720592e-03
3700.00000  3750.00000  4.326539444278e-03
3750.00000  3800.00000  4.194601980805e-03
3800.00000  3850.00000  4.052931425764e-03
3850.00000  3900.00000  3.953077115977e-03
3900.00000  3950.00000  3.838082441529e-03
3950.00000  4000.00000  3.793742802165e-03
4000.00000  4050.00000  3.615663274964e-03
4050.00000  4100.00000  3.599801940557e-03
4100.00000  4150.00000  3.503912964372e-03
4150.00000  4200.00000  3.445153930092e-03
4200.00000  4250.00000  3.336287498483e-03
4250.00000  4300.00000  3.299878526323e-03
4300.00000  4350.00000  3.111705422681e-03
4350.00000  4400.00000  3.136578878909e-03
4400.00000  4450.00000  3.095844088274e-03
4450.00000  4500.00000  2.934707350098e-03
4500.00000  4550.00000  2.945161411411e-03
4550.00000  4600.00000  2.811421523573e-03
4600.00000  4650.00000  2.812863463065e-03
4650.00000  4700.00000  2.731393881795e-03
4700.00000  4750.00000  2.647040421541e-03
4750.00000  4800.00000  2.594409630101e-03
4800.00000  4850.00000  2.594770114974e-03
4850.00000  4900.00000  2.523394110144e-03
4900.00000  4950.00000  2.439761619636e-03
4950.00000  5000.00000  2.412364769298e-03
5000.00000  5050.00000  2.368025129934e-03
5050.00000  5100.00000  2.341709734214e-03
5100.00000  5150.00000  2.260600637816e-03
5150.00000  5200.00000  2.236448151333e-03
5200.00000  5250.00000  2.158583418792e-03
5250.00000  5300.00000  2.146326933114e-03
5300.00000  5350.00000  2.133709962563e-03
5350.00000  5400.00000  2.073508988793e-03
5400.00000  5450.00000  2.005737832692e-03
5450.00000  5500.00000  1.952386071506e-03
5500.00000  5550.00000  1.960316738709e-03
5550.00000  5600.00000  1.910569826252e-03
5600.00000  5650.00000  1.871276975108e-03
5650.00000  5700.00000  1.857218065066e-03
5700.00000  5750.00000  1.858660004558e-03
5750.00000  5800.00000  1.786202545109e-03
5800.00000  5850.00000  1.802063879516e-03
5850.00000  5900.00000  1.719152358754e-03
5900.00000  5950.00000  1.729966904940e-03
5950.00000  6000.00000  1.684545810958e-03
6000.00000  6050.00000  1.683103871466e-03
6050.00000  6100.00000  1.647415869051e-03
6100.00000  6150.00000  1.603076229687e-03
6150.00000  6200.00000  1.543596225662e-03
6200.00000  6250.00000  1.548643013883e-03
6250.00000  6300.00000  1.531339739985e-03
6300.00000  6350.00000  1.553689802103e-03
6350.00000  6400.00000  2.041786319979e-03
6400.00000  6450.00000  1.434369309180e-03
6450.00000  6500.00000  1.448428219223e-03
6500.00000  6550.00000  1.414903126045e-03
6550.00000  6600.00000  1.357225546385e-03
6600.00000  6650.00000  1.403367610113e-03
6650.00000  6700.00000  1.373447365664e-03
6700.00000  6750.00000  1.335596454012e-03
6750.00000  6800.00000  1.270709176894e-03
6800.00000  6850.00000  1.276837419733e-03
6850.00000  6900.00000  1.232858265242e-03
6900.00000  6950.00000  1.242591356810e-03
6950.00000  7000.00000  1.269627722275e-03
7000.00000  7050.00000  1.195007353590e-03
7050.00000  7100.00000  1.273953540750e-03
7100.00000  7150.00000  1.148144320116e-03
7150.00000  7200.00000  1.168331472997e-03
7200.00000  7250.00000  1.074605406049e-03
7250.00000  7300.00000  1.143818501641e-03
7300.00000  7350.00000  1.105246620243e-03
7350.00000  7400.00000  1.066314253972e-03
7400.00000  7450.00000  1.057662617023e-03
7450.00000  7500.00000  1.074244921176e-03
7500.00000  7550.00000  1.054057768294e-03
7550.00000  7600.00000  1.020532675117e-03
7600.00000  7650.00000  1.014764917151e-03
7650.00000  7700.00000  1.019811705371e-03
7700.00000  7750.00000  9.909729155409e-04
7750.00000  7800.00000  1.002147946600e-03
7800.00000  7850.00000  9.761930357529e-04
7850.00000  7900.00000  9.343767904991e-04
7900.00000  7950.00000  9.441098820668e-04
7950.00000  8000.00000  9.300509720245e-04
8000.00000  8050.00000  9.098638191434e-04
8050.00000  8100.00000  9.347372753719e-04
8100.00000  8150.00000  8.965258788469e-04
8150.00000  8200.00000  9.152710922365e-04
8200.00000  8250.00000  8.954444242283e-04
8250.00000  8300.00000  8.738153318556e-04
8300.00000  8350.00000  8.514652697372e-04
8350.00000  8400.00000  8.759782410929e-04
8400.00000  8450.00000  8.359644202034e-04
8450.00000  8500.00000  8.287547227459e-04
8500.00000  8550.00000  8.164982370681e-04
8550.00000  8600.00000  7.901828413480e-04
8600.00000  8650.00000  7.692747187211e-04
8650.00000  8700.00000  7.916247808395e-04
8700.00000  8750.00000  7.656698699923e-04
8750.00000  8800.00000  7.375520499078e-04
8800.00000  8850.00000  7.328657465604e-04
8850.00000  8900.00000  7.631464758821e-04
8900.00000  8950.00000  7.292608978316e-04
8950.00000  9000.00000  7.310633221960e-04
9000.00000  9050.00000  7.400754440180e-04
9050.00000  9100.00000  6.982591987642e-04
9100.00000  9150.00000  6.997011382557e-04
9150.00000  9200.00000  7.130390785521e-04
9200.00000  9250.00000  6.946543500354e-04
9250.00000  9300.00000  6.636526509679e-04
9300.00000  9350.00000  6.903285315608e-04
9350.00000  9400.00000  6.499542257985e-04
9400.00000  9450.00000  6.499542257985e-04
9450.00000  9500.00000  6.708623484255e-04
9500.00000  9550.00000  6.449074375783e-04
9550.00000  9600.00000  6.510356804172e-04
9600.00000  9650.00000  6.676179845696e-04
9650.00000  9700.00000  6.348138611377e-04
9700.00000  9750.00000  6.009282830872e-04
9750.00000  9800.00000  6.225573754598e-04
9800.00000  9850.00000  6.319299821547e-04
9850.00000  9900.00000  6.034516771973e-04
9900.00000  9950.00000  6.038121620702e-04
9950.00000  10000.00000  5.735314327485e-04
