10001.00000  11001.00000  3.661472504155e-04
11001.00000  12001.00000  2.986589535226e-04
12001.00000  13001.00000  2.422885633906e-04
13001.00000  14001.00000  1.958462037106e-04
14001.00000  15001.00000  1.663223977971e-04
15001.00000  16001.00000  1.418183825617e-04
16001.00000  17001.00000  1.198056708478e-04
17001.00000  18001.00000  1.047462988139e-04
18001.00000  19001.00000  9.299627026395e-05
19001.00000  20001.00000  8.024228357841e-05
20001.00000  21001.00000  6.990523314523e-05
21001.00000  22001.00000  6.362119888909e-05
22001.00000  23001.00000  5.562671743897e-05
23001.00000  24001.00000  5.194553760845e-05
24001.00000  25001.00000  4.369077071577e-05
25001.00000  26001.00000  4.183158898318e-05
26001.00000  27001.00000  3.681179830520e-05
27001.00000  28001.00000  3.435767841819e-05
28001.00000  29001.00000  3.201510943513e-05
29001.00000  30001.00000  3.052776404906e-05
30001.00000  31001.00000  2.621446242946e-05
31001.00000  32001.00000  2.405781161966e-05
32001.00000  33001.00000  2.193834444451e-05
33001.00000  34001.00000  1.985606090402e-05
34001.00000  35001.00000  2.015352998123e-05
35001.00000  36001.00000  1.855463369121e-05
36001.00000  37001.00000  1.717883920909e-05
37001.00000  38001.00000  1.531965747651e-05
38001.00000  39001.00000  1.498500476464e-05
39001.00000  40001.00000  1.312582303206e-05
40001.00000  41001.00000  1.267961941624e-05
41001.00000  42001.00000  1.197313035785e-05
42001.00000  43001.00000  1.193594672320e-05
43001.00000  44001.00000  1.056015224109e-05
44001.00000  45001.00000  1.033705043318e-05
45001.00000  46001.00000  9.630561374795e-06
46001.00000  47001.00000  8.477868700592e-06
47001.00000  48001.00000  7.436726930344e-06
48001.00000  49001.00000  8.738154143154e-06
49001.00000  50001.00000  7.659828738254e-06
50001.00000  51001.00000  6.358401525444e-06
51001.00000  52001.00000  7.139257853130e-06
52001.00000  53001.00000  6.990523314523e-06
53001.00000  54001.00000  6.469952429399e-06
54001.00000  55001.00000  5.986565178927e-06
55001.00000  56001.00000  4.685137966117e-06
56001.00000  57001.00000  6.135299717534e-06
57001.00000  58001.00000  5.056974312634e-06
58001.00000  59001.00000  4.647954331465e-06
59001.00000  60001.00000  4.276117984948e-06
60001.00000  61001.00000  4.536403427510e-06
61001.00000  62001.00000  4.871056139375e-06
62001.00000  63001.00000  3.643996195868e-06
63001.00000  64001.00000  4.015832542386e-06
64001.00000  65001.00000  3.755547099824e-06
65001.00000  66001.00000  3.792730734475e-06
66001.00000  67001.00000  3.606812561217e-06
67001.00000  68001.00000  3.569628926565e-06
68001.00000  69001.00000  2.974690772137e-06
69001.00000  70001.00000  2.974690772137e-06
70001.00000  71001.00000  3.123425310744e-06
71001.00000  72001.00000  3.086241676093e-06
72001.00000  73001.00000  3.086241676093e-06
73001.00000  74001.00000  2.565670790969e-06
74001.00000  75001.00000  2.751588964227e-06
75001.00000  76001.00000  2.751588964227e-06
76001.00000  77001.00000  2.454119887013e-06
77001.00000  78001.00000  2.565670790969e-06
78001.00000  79001.00000  2.416936252362e-06
79001.00000  80001.00000  2.082283540496e-06
80001.00000  81001.00000  2.416936252362e-06
81001.00000  82001.00000  2.677221694924e-06
82001.00000  83001.00000  1.933549001889e-06
83001.00000  84001.00000  1.933549001889e-06
84001.00000  85001.00000  1.524529020720e-06
85001.00000  86001.00000  1.747630828631e-06
86001.00000  87001.00000  1.450161751417e-06
87001.00000  88001.00000  1.598896290024e-06
88001.00000  89001.00000  2.082283540496e-06
89001.00000  90001.00000  1.264243578158e-06
90001.00000  91001.00000  1.561712655372e-06
91001.00000  92001.00000  1.412978116765e-06
92001.00000  93001.00000  1.970732636541e-06
93001.00000  94001.00000  1.189876308855e-06
94001.00000  95001.00000  1.710447193979e-06
95001.00000  96001.00000  1.561712655372e-06
96001.00000  97001.00000  1.115509039552e-06
97001.00000  98001.00000  1.264243578158e-06
98001.00000  99001.00000  1.301427212810e-06
99001.00000  100001.00000  1.412978116765e-06
100001.00000  101001.00000  1.412978116765e-06
101001.00000  102001.00000  1.189876308855e-06
102001.00000  103001.00000  1.003958135596e-06
103001.00000  104001.00000  5.949381544275e-07
104001.00000  105001.00000  1.338610847462e-06
105001.00000  106001.00000  9.295908662930e-07
106001.00000  107001.00000  8.552235969895e-07
107001.00000  108001.00000  8.180399623378e-07
108001.00000  109001.00000  6.693054237309e-07
109001.00000  110001.00000  9.295908662930e-07
110001.00000  111001.00000  6.693054237309e-07
111001.00000  112001.00000  8.924072316412e-07
112001.00000  113001.00000  9.667745009447e-07
113001.00000  114001.00000  7.064890583826e-07
114001.00000  115001.00000  1.189876308855e-06
115001.00000  116001.00000  5.577545197758e-07
116001.00000  117001.00000  8.552235969895e-07
117001.00000  118001.00000  7.808563276861e-07
118001.00000  119001.00000  8.924072316412e-07
119001.00000  120001.00000  5.949381544275e-07
120001.00000  121001.00000  7.436726930344e-07
121001.00000  122001.00000  6.321217890792e-07
122001.00000  123001.00000  5.949381544275e-07
123001.00000  124001.00000  7.808563276861e-07
124001.00000  125001.00000  8.924072316412e-07
125001.00000  126001.00000  4.462036158206e-07
126001.00000  127001.00000  6.321217890792e-07
127001.00000  128001.00000  5.205708851241e-07
128001.00000  129001.00000  4.462036158206e-07
129001.00000  130001.00000  3.718363465172e-07
130001.00000  131001.00000  5.949381544275e-07
131001.00000  132001.00000  6.321217890792e-07
132001.00000  133001.00000  2.974690772137e-07
133001.00000  134001.00000  5.577545197758e-07
134001.00000  135001.00000  6.693054237309e-07
135001.00000  136001.00000  5.577545197758e-07
136001.00000  137001.00000  5.205708851241e-07
137001.00000  138001.00000  4.462036158206e-07
138001.00000  139001.00000  5.577545197758e-07
139001.00000  140001.00000  3.346527118655e-07
140001.00000  141001.00000  2.974690772137e-07
141001.00000  142001.00000  4.833872504723e-07
142001.00000  143001.00000  5.949381544275e-07
143001.00000  144001.00000  2.974690772137e-07
144001.00000  145001.00000  2.974690772137e-07
145001.00000  146001.00000  2.974690772137e-07
146001.00000  147001.00000  2.974690772137e-07
147001.00000  148001.00000  2.974690772137e-07
148001.00000  149001.00000  3.718363465172e-07
149001.00000  150001.00000  5.205708851241e-07
150001.00000  151001.00000  1.487345386069e-07
151001.00000  152001.00000  4.462036158206e-07
152001.00000  153001.00000  3.718363465172e-07
153001.00000  154001.00000  4.090199811689e-07
154001.00000  155001.00000  3.346527118655e-07
155001.00000  156001.00000  2.602854425620e-07
156001.00000  157001.00000  4.833872504723e-07
157001.00000  158001.00000  2.602854425620e-07
158001.00000  159001.00000  2.974690772137e-07
159001.00000  160001.00000  4.090199811689e-07
160001.00000  161001.00000  3.718363465172e-07
161001.00000  162001.00000  2.602854425620e-07
162001.00000  163001.00000  2.602854425620e-07
163001.00000  164001.00000  1.115509039552e-07
164001.00000  165001.00000  3.346527118655e-07
165001.00000  166001.00000  1.859181732586e-07
166001.00000  167001.00000  2.602854425620e-07
167001.00000  168001.00000  2.974690772137e-07
168001.00000  169001.00000  2.974690772137e-07
169001.00000  170001.00000  2.974690772137e-07
170001.00000  171001.00000  1.859181732586e-07
171001.00000  172001.00000  1.115509039552e-07
172001.00000  173001.00000  2.974690772137e-07
173001.00000  174001.00000  2.231018079103e-07
174001.00000  175001.00000  1.487345386069e-07
175001.00000  176001.00000  2.602854425620e-07
176001.00000  177001.00000  2.602854425620e-07
177001.00000  178001.00000  1.487345386069e-07
178001.00000  179001.00000  2.231018079103e-07
179001.00000  180001.00000  2.974690772137e-07
180001.00000  181001.00000  7.436726930344e-08
181001.00000  182001.00000  3.718363465172e-08
182001.00000  183001.00000  1.115509039552e-07
183001.00000  184001.00000  3.346527118655e-07
184001.00000  185001.00000  1.115509039552e-07
185001.00000  186001.00000  7.436726930344e-08
186001.00000  187001.00000  2.602854425620e-07
187001.00000  188001.00000  1.487345386069e-07
188001.00000  189001.00000  2.602854425620e-07
189001.00000  190001.00000  2.602854425620e-07
190001.00000  191001.00000  3.718363465172e-08
191001.00000  192001.00000  2.602854425620e-07
192001.00000  193001.00000  1.859181732586e-07
193001.00000  194001.00000  7.436726930344e-08
194001.00000  195001.00000  3.718363465172e-08
195001.00000  196001.00000  3.718363465172e-07
196001.00000  197001.00000  3.718363465172e-08
197001.00000  198001.00000  1.115509039552e-07
198001.00000  199001.00000  7.436726930344e-08
