300.00000  350.00000  0.000000000000e+00
350.00000  400.00000  4.019730838631e-07
400.00000  450.00000  4.019730838631e-07
450.00000  500.00000  1.004932709658e-06
500.00000  550.00000  2.693219661883e-05
550.00000  600.00000  1.205919251589e-06
600.00000  650.00000  1.004932709658e-05
650.00000  700.00000  1.607892335452e-06
700.00000  750.00000  6.230582799878e-06
750.00000  800.00000  3.818744296700e-06
800.00000  850.00000  2.411838503179e-05
850.00000  900.00000  3.416771212836e-06
900.00000  950.00000  4.220717380563e-06
950.00000  1000.00000  3.617757754768e-06
1000.00000  1050.00000  5.225650090220e-06
1050.00000  1100.00000  4.421703922494e-06
1100.00000  1150.00000  5.225650090220e-06
1150.00000  1200.00000  7.235515509536e-06
1200.00000  1250.00000  1.025031363851e-05
1250.00000  1300.00000  4.019730838631e-05
1300.00000  1350.00000  1.547596372873e-05
1350.00000  1400.00000  2.773614278655e-05
1400.00000  1450.00000  4.301111997335e-05
1450.00000  1500.00000  6.994331659218e-05
1500.00000  1550.00000  1.035080690948e-04
1550.00000  1600.00000  1.427004447714e-04
1600.00000  1650.00000  1.841036724093e-04
1650.00000  1700.00000  2.618854641368e-04
1700.00000  1750.00000  3.903158644311e-04
1750.00000  1800.00000  3.943355952697e-04
1800.00000  1850.00000  4.399595402882e-04
1850.00000  1900.00000  4.445822307526e-04
1900.00000  1950.00000  5.380409727508e-04
1950.00000  2000.00000  6.242641992394e-04
2000.00000  2050.00000  7.195318201150e-04
2050.00000  2100.00000  7.872642847459e-04
2100.00000  2150.00000  8.785121747828e-04
2150.00000  2200.00000  9.345874199817e-04
2200.00000  2250.00000  1.013776117503e-03
2250.00000  2300.00000  1.071861228121e-03
2300.00000  2350.00000  1.276264541265e-03
2350.00000  2400.00000  1.175570283758e-03
2400.00000  2450.00000  1.266215214169e-03
2450.00000  2500.00000  1.193860059073e-03
2500.00000  2550.00000  1.138186786958e-03
2550.00000  2600.00000  1.201899520751e-03
2600.00000  2650.00000  1.230238623163e-03
2650.00000  2700.00000  1.186021583938e-03
2700.00000  2750.00000  1.243101761847e-03
2750.00000  2800.00000  1.232851448208e-03
2800.00000  2850.00000  1.246719519601e-03
2850.00000  2900.00000  1.257371806324e-03
2900.00000  2950.00000  1.245111627266e-03
2950.00000  3000.00000  1.275460595098e-03
3000.00000  3050.00000  1.240689923343e-03
3050.00000  3100.00000  1.221596201860e-03
3100.00000  3150.00000  1.213154767099e-03
3150.00000  3200.00000  1.217777457563e-03
3200.00000  3250.00000  1.191046247486e-03
3250.00000  3300.00000  1.177580149177e-03
3300.00000  3350.00000  1.121705890520e-03
3350.00000  3400.00000  1.128941406030e-03
3400.00000  3450.00000  1.076885891669e-03
3450.00000  3500.00000  1.059199075979e-03
3500.00000  3550.00000  1.053370466263e-03
3550.00000  3600.00000  1.056988224018e-03
3600.00000  3650.00000  9.978981806902e-04
3650.00000  3700.00000  1.049149748883e-03
3700.00000  3750.00000  9.454406932460e-04
3750.00000  3800.00000  9.442347739944e-04
3800.00000  3850.00000  9.293617698915e-04
3850.00000  3900.00000  8.919782730922e-04
3900.00000  3950.00000  8.756983631958e-04
3950.00000  4000.00000  8.483641934931e-04
4000.00000  4050.00000  8.393197991062e-04
4050.00000  4100.00000  7.804307423202e-04
4100.00000  4150.00000  7.713863479333e-04
4150.00000  4200.00000  7.627439266303e-04
4200.00000  4250.00000  7.364146896372e-04
4250.00000  4300.00000  7.221446451601e-04
4300.00000  4350.00000  7.064676948894e-04
4350.00000  4400.00000  6.889818657414e-04
4400.00000  4450.00000  6.678782788386e-04
4450.00000  4500.00000  6.477796246454e-04
4500.00000  4550.00000  6.604417767871e-04
4550.00000  4600.00000  6.126069798074e-04
4600.00000  4650.00000  6.019546930850e-04
4650.00000  4700.00000  5.744195368404e-04
4700.00000  4750.00000  5.706007925437e-04
4750.00000  4800.00000  5.599485058213e-04
4800.00000  4850.00000  5.384429458346e-04
4850.00000  4900.00000  5.095008837965e-04
4900.00000  4950.00000  5.111087761319e-04
4950.00000  5000.00000  4.966377451129e-04
5000.00000  5050.00000  4.962357720290e-04
5050.00000  5100.00000  4.779459967132e-04
5100.00000  5150.00000  4.865884180163e-04
5150.00000  5200.00000  4.477980154235e-04
5200.00000  5250.00000  4.558374771008e-04
5250.00000  5300.00000  4.132283302113e-04
5300.00000  5350.00000  4.096105724565e-04
5350.00000  5400.00000  4.274983746884e-04
5400.00000  5450.00000  4.059928147017e-04
5450.00000  5500.00000  3.838842950893e-04
5500.00000  5550.00000  3.822764027538e-04
5550.00000  5600.00000  3.633836678123e-04
5600.00000  5650.00000  3.889089586376e-04
5650.00000  5700.00000  3.499175695028e-04
5700.00000  5750.00000  3.663984659412e-04
5750.00000  5800.00000  3.418781078256e-04
5800.00000  5850.00000  3.396672558643e-04
5850.00000  5900.00000  3.260001710130e-04
5900.00000  5950.00000  3.145439381229e-04
5950.00000  6000.00000  3.111271669100e-04
6000.00000  6050.00000  3.036906648586e-04
6050.00000  6100.00000  3.018817859812e-04
6100.00000  6150.00000  2.813811587042e-04
6150.00000  6200.00000  2.870087818783e-04
6200.00000  6250.00000  2.753515624462e-04
6250.00000  6300.00000  2.679150603948e-04
6300.00000  6350.00000  2.659051949754e-04
6350.00000  6400.00000  9.191114562530e-04
6400.00000  6450.00000  2.470124600339e-04
6450.00000  6500.00000  2.365611598534e-04
6500.00000  6550.00000  2.307325501374e-04
6550.00000  6600.00000  2.214871692086e-04
6600.00000  6650.00000  2.224921019182e-04
6650.00000  6700.00000  2.200802634151e-04
6700.00000  6750.00000  2.013885150154e-04
6750.00000  6800.00000  2.033983804347e-04
6800.00000  6850.00000  1.957608918413e-04
6850.00000  6900.00000  1.953589187575e-04
6900.00000  6950.00000  2.031973938928e-04
6950.00000  7000.00000  1.824957800739e-04
7000.00000  7050.00000  1.824957800739e-04
7050.00000  7100.00000  2.540469890015e-04
7100.00000  7150.00000  1.587793681259e-04
7150.00000  7200.00000  1.549606238292e-04
7200.00000  7250.00000  1.625981124226e-04
7250.00000  7300.00000  1.545586507454e-04
7300.00000  7350.00000  1.418964986037e-04
7350.00000  7400.00000  1.555635834550e-04
7400.00000  7450.00000  1.491320141132e-04
7450.00000  7500.00000  1.720444798934e-04
7500.00000  7550.00000  1.408915658940e-04
7550.00000  7600.00000  1.422984716875e-04
7600.00000  7650.00000  1.408915658940e-04
7650.00000  7700.00000  1.398866331844e-04
7700.00000  7750.00000  1.328521042168e-04
7750.00000  7800.00000  1.215968578686e-04
7800.00000  7850.00000  1.232047502040e-04
7850.00000  7900.00000  1.310432253394e-04
7900.00000  7950.00000  1.197879789912e-04
7950.00000  8000.00000  1.272244810427e-04
8000.00000  8050.00000  1.199889655331e-04
8050.00000  8100.00000  1.115475307720e-04
8100.00000  8150.00000  1.115475307720e-04
8150.00000  8200.00000  1.139593692752e-04
8200.00000  8250.00000  1.197879789912e-04
8250.00000  8300.00000  1.159692346945e-04
8300.00000  8350.00000  1.025031363851e-04
8350.00000  8400.00000  1.123514769397e-04
8400.00000  8450.00000  1.045130018044e-04
8450.00000  8500.00000  1.133564096494e-04
8500.00000  8550.00000  1.039100421786e-04
8550.00000  8600.00000  1.123514769397e-04
8600.00000  8650.00000  9.446367470783e-05
8650.00000  8700.00000  1.043120152625e-04
8700.00000  8750.00000  9.285578237238e-05
8750.00000  8800.00000  1.019001767593e-04
8800.00000  8850.00000  9.868439208839e-05
8850.00000  8900.00000  9.084591695306e-05
8900.00000  8950.00000  9.164986312079e-05
8950.00000  9000.00000  8.843407844988e-05
9000.00000  9050.00000  9.627255358521e-05
9050.00000  9100.00000  8.541928032091e-05
9100.00000  9150.00000  8.662519957250e-05
9150.00000  9200.00000  8.682618611443e-05
9200.00000  9250.00000  7.918869752103e-05
9250.00000  9300.00000  8.662519957250e-05
9300.00000  9350.00000  8.401237452739e-05
9350.00000  9400.00000  7.959067060490e-05
9400.00000  9450.00000  7.597291285013e-05
9450.00000  9500.00000  7.717883210172e-05
9500.00000  9550.00000  7.778179172751e-05
9550.00000  9600.00000  7.617389939206e-05
9600.00000  9650.00000  7.637488593399e-05
9650.00000  9700.00000  7.918869752103e-05
9700.00000  9750.00000  7.778179172751e-05
9750.00000  9800.00000  7.215416855343e-05
9800.00000  9850.00000  6.753147808900e-05
9850.00000  9900.00000  6.813443771480e-05
9900.00000  9950.00000  6.451667996003e-05
9950.00000  10000.00000  6.150188183106e-05
