10001.00000  11001.00000  3.739893538913e-04
11001.00000  12001.00000  3.024264669102e-04
12001.00000  13001.00000  2.421044066555e-04
13001.00000  14001.00000  1.994041044704e-04
14001.00000  15001.00000  1.641976867695e-04
15001.00000  16001.00000  1.374497129419e-04
16001.00000  17001.00000  1.201989392528e-04
17001.00000  18001.00000  1.025771811834e-04
18001.00000  19001.00000  8.844267628974e-05
19001.00000  20001.00000  7.505014015694e-05
20001.00000  21001.00000  7.033863852573e-05
21001.00000  22001.00000  6.191729309042e-05
22001.00000  23001.00000  5.483149142459e-05
23001.00000  24001.00000  5.216040388564e-05
24001.00000  25001.00000  4.756019756856e-05
25001.00000  26001.00000  4.147605372983e-05
26001.00000  27001.00000  3.798880055398e-05
27001.00000  28001.00000  3.320310204669e-05
28001.00000  29001.00000  3.123688483052e-05
29001.00000  30001.00000  2.745284415034e-05
30001.00000  31001.00000  2.645118632323e-05
31001.00000  32001.00000  2.470755973530e-05
32001.00000  33001.00000  2.307522846150e-05
33001.00000  34001.00000  1.828952995421e-05
34001.00000  35001.00000  1.854921902050e-05
35001.00000  36001.00000  1.866051433462e-05
36001.00000  37001.00000  1.495067053052e-05
37001.00000  38001.00000  1.643460805216e-05
38001.00000  39001.00000  1.587813148155e-05
39001.00000  40001.00000  1.495067053052e-05
40001.00000  41001.00000  1.279896112414e-05
41001.00000  42001.00000  1.198279548724e-05
42001.00000  43001.00000  1.120372828838e-05
43001.00000  44001.00000  1.094403922209e-05
44001.00000  45001.00000  9.200412634167e-06
45001.00000  46001.00000  1.068435015581e-05
46001.00000  47001.00000  8.569739187470e-06
47001.00000  48001.00000  8.050361054896e-06
48001.00000  49001.00000  8.161656369019e-06
49001.00000  50001.00000  7.197096979953e-06
50001.00000  51001.00000  7.568081360363e-06
51001.00000  52001.00000  7.197096979953e-06
52001.00000  53001.00000  7.085801665830e-06
53001.00000  54001.00000  6.677718847379e-06
54001.00000  55001.00000  6.269636028928e-06
55001.00000  56001.00000  6.009946962641e-06
56001.00000  57001.00000  4.859895383371e-06
57001.00000  58001.00000  4.971190697494e-06
58001.00000  59001.00000  4.155025060592e-06
59001.00000  60001.00000  4.266320374715e-06
60001.00000  61001.00000  3.635646928018e-06
61001.00000  62001.00000  4.303418812756e-06
62001.00000  63001.00000  3.709843804100e-06
63001.00000  64001.00000  3.524351613895e-06
64001.00000  65001.00000  3.301760985649e-06
65001.00000  66001.00000  3.301760985649e-06
66001.00000  67001.00000  3.301760985649e-06
67001.00000  68001.00000  3.598548489977e-06
68001.00000  69001.00000  3.598548489977e-06
69001.00000  70001.00000  2.782382853075e-06
70001.00000  71001.00000  3.598548489977e-06
71001.00000  72001.00000  2.967875043280e-06
72001.00000  73001.00000  3.042071919362e-06
73001.00000  74001.00000  2.374300034624e-06
74001.00000  75001.00000  2.300103158542e-06
75001.00000  76001.00000  2.263004720501e-06
76001.00000  77001.00000  2.448496910706e-06
77001.00000  78001.00000  2.077512530296e-06
78001.00000  79001.00000  2.485595348747e-06
79001.00000  80001.00000  1.743626587927e-06
80001.00000  81001.00000  2.337201596583e-06
81001.00000  82001.00000  1.929118778132e-06
82001.00000  83001.00000  1.929118778132e-06
83001.00000  84001.00000  2.077512530296e-06
84001.00000  85001.00000  2.300103158542e-06
85001.00000  86001.00000  2.300103158542e-06
86001.00000  87001.00000  2.263004720501e-06
87001.00000  88001.00000  1.632331273804e-06
88001.00000  89001.00000  1.706528149886e-06
89001.00000  90001.00000  1.892020340091e-06
90001.00000  91001.00000  1.446839083599e-06
91001.00000  92001.00000  1.558134397722e-06
92001.00000  93001.00000  1.669429711845e-06
93001.00000  94001.00000  1.224248455353e-06
94001.00000  95001.00000  1.224248455353e-06
95001.00000  96001.00000  1.558134397722e-06
96001.00000  97001.00000  1.075854703189e-06
97001.00000  98001.00000  1.038756265148e-06
98001.00000  99001.00000  1.187150017312e-06
99001.00000  100001.00000  1.483937521640e-06
100001.00000  101001.00000  7.048703227789e-07
101001.00000  102001.00000  1.187150017312e-06
102001.00000  103001.00000  8.161656369019e-07
103001.00000  104001.00000  1.112953141230e-06
104001.00000  105001.00000  1.001657827107e-06
105001.00000  106001.00000  8.161656369019e-07
106001.00000  107001.00000  8.532640749429e-07
107001.00000  108001.00000  9.274609510249e-07
108001.00000  109001.00000  6.306734466969e-07
109001.00000  110001.00000  9.645593890659e-07
110001.00000  111001.00000  1.150051579271e-06
111001.00000  112001.00000  8.161656369019e-07
112001.00000  113001.00000  9.274609510249e-07
113001.00000  114001.00000  7.419687608199e-07
114001.00000  115001.00000  5.935750086559e-07
115001.00000  116001.00000  7.048703227789e-07
116001.00000  117001.00000  8.532640749429e-07
117001.00000  118001.00000  9.274609510249e-07
118001.00000  119001.00000  5.193781325740e-07
119001.00000  120001.00000  6.306734466969e-07
120001.00000  121001.00000  6.677718847379e-07
121001.00000  122001.00000  3.338859423690e-07
122001.00000  123001.00000  3.338859423690e-07
123001.00000  124001.00000  5.193781325740e-07
124001.00000  125001.00000  4.451812564920e-07
125001.00000  126001.00000  7.790671988609e-07
126001.00000  127001.00000  5.935750086559e-07
127001.00000  128001.00000  4.451812564920e-07
128001.00000  129001.00000  4.080828184510e-07
129001.00000  130001.00000  4.822796945330e-07
130001.00000  131001.00000  7.048703227789e-07
131001.00000  132001.00000  6.306734466969e-07
132001.00000  133001.00000  7.048703227789e-07
133001.00000  134001.00000  3.338859423690e-07
134001.00000  135001.00000  4.451812564920e-07
135001.00000  136001.00000  6.306734466969e-07
136001.00000  137001.00000  4.822796945330e-07
137001.00000  138001.00000  3.338859423690e-07
138001.00000  139001.00000  5.564765706149e-07
139001.00000  140001.00000  5.193781325740e-07
140001.00000  141001.00000  4.080828184510e-07
141001.00000  142001.00000  2.967875043280e-07
142001.00000  143001.00000  3.338859423690e-07
143001.00000  144001.00000  2.967875043280e-07
144001.00000  145001.00000  3.338859423690e-07
145001.00000  146001.00000  2.596890662870e-07
146001.00000  147001.00000  4.080828184510e-07
147001.00000  148001.00000  2.225906282460e-07
148001.00000  149001.00000  3.338859423690e-07
149001.00000  150001.00000  2.967875043280e-07
150001.00000  151001.00000  4.080828184510e-07
151001.00000  152001.00000  2.596890662870e-07
152001.00000  153001.00000  4.080828184510e-07
153001.00000  154001.00000  1.112953141230e-07
154001.00000  155001.00000  5.193781325740e-07
155001.00000  156001.00000  2.967875043280e-07
156001.00000  157001.00000  2.967875043280e-07
157001.00000  158001.00000  1.854921902050e-07
158001.00000  159001.00000  4.080828184510e-07
159001.00000  160001.00000  2.967875043280e-07
160001.00000  161001.00000  2.596890662870e-07
161001.00000  162001.00000  3.338859423690e-07
162001.00000  163001.00000  1.854921902050e-07
163001.00000  164001.00000  2.225906282460e-07
164001.00000  165001.00000  3.338859423690e-07
165001.00000  166001.00000  3.709843804100e-07
166001.00000  167001.00000  2.967875043280e-07
167001.00000  168001.00000  2.967875043280e-07
168001.00000  169001.00000  2.596890662870e-07
169001.00000  170001.00000  4.451812564920e-07
170001.00000  171001.00000  2.967875043280e-07
171001.00000  172001.00000  3.338859423690e-07
172001.00000  173001.00000  3.338859423690e-07
173001.00000  174001.00000  2.225906282460e-07
174001.00000  175001.00000  1.854921902050e-07
175001.00000  176001.00000  4.080828184510e-07
176001.00000  177001.00000  1.854921902050e-07
177001.00000  178001.00000  1.112953141230e-07
178001.00000  179001.00000  1.854921902050e-07
179001.00000  180001.00000  7.419687608199e-08
180001.00000  181001.00000  3.709843804100e-07
181001.00000  182001.00000  1.112953141230e-07
182001.00000  183001.00000  1.854921902050e-07
183001.00000  184001.00000  7.419687608199e-08
184001.00000  185001.00000  2.225906282460e-07
185001.00000  186001.00000  1.483937521640e-07
186001.00000  187001.00000  1.112953141230e-07
187001.00000  188001.00000  1.854921902050e-07
188001.00000  189001.00000  1.854921902050e-07
189001.00000  190001.00000  1.112953141230e-07
190001.00000  191001.00000  1.854921902050e-07
191001.00000  192001.00000  1.483937521640e-07
192001.00000  193001.00000  7.419687608199e-08
193001.00000  194001.00000  2.225906282460e-07
194001.00000  195001.00000  1.483937521640e-07
195001.00000  196001.00000  7.419687608199e-08
196001.00000  197001.00000  1.854921902050e-07
197001.00000  198001.00000  2.967875043280e-07
198001.00000  199001.00000  1.112953141230e-07
