10001.00000  11001.00000  4.516443389397e-04
11001.00000  12001.00000  3.678497419001e-04
12001.00000  13001.00000  2.966410413586e-04
13001.00000  14001.00000  2.458890634441e-04
14001.00000  15001.00000  2.079086147194e-04
15001.00000  16001.00000  1.776133594318e-04
16001.00000  17001.00000  1.561170937313e-04
17001.00000  18001.00000  1.281979368975e-04
18001.00000  19001.00000  1.150180157859e-04
19001.00000  20001.00000  1.026177519794e-04
20001.00000  21001.00000  9.099714547810e-05
21001.00000  22001.00000  7.889389397836e-05
22001.00000  23001.00000  7.157996592484e-05
23001.00000  24001.00000  6.701340170868e-05
24001.00000  25001.00000  5.684073020276e-05
25001.00000  26001.00000  5.104899022129e-05
26001.00000  27001.00000  4.570276869994e-05
27001.00000  28001.00000  4.373506216777e-05
28001.00000  29001.00000  4.124758409881e-05
29001.00000  30001.00000  3.779481603293e-05
30001.00000  31001.00000  3.527021142562e-05
31001.00000  32001.00000  3.014674913432e-05
32001.00000  33001.00000  2.851318144724e-05
33001.00000  34001.00000  2.695386683684e-05
34001.00000  35001.00000  2.713949952856e-05
35001.00000  36001.00000  2.231304954400e-05
36001.00000  37001.00000  2.053097570355e-05
37001.00000  38001.00000  2.242442915903e-05
38001.00000  39001.00000  1.908304070818e-05
39001.00000  40001.00000  1.644705648584e-05
40001.00000  41001.00000  1.704108109933e-05
41001.00000  42001.00000  1.666981571590e-05
42001.00000  43001.00000  1.388532534019e-05
43001.00000  44001.00000  1.395957841688e-05
44001.00000  45001.00000  1.247451688317e-05
45001.00000  46001.00000  1.147210034791e-05
46001.00000  47001.00000  1.143497380957e-05
47001.00000  48001.00000  1.128646765620e-05
48001.00000  49001.00000  1.050681035100e-05
49001.00000  50001.00000  9.207381509004e-06
50001.00000  51001.00000  9.652899969117e-06
51001.00000  52001.00000  9.170254970661e-06
52001.00000  53001.00000  7.945079205350e-06
53001.00000  54001.00000  8.093585358721e-06
54001.00000  55001.00000  7.276801515181e-06
55001.00000  56001.00000  6.831283055068e-06
56001.00000  57001.00000  7.425307668552e-06
57001.00000  58001.00000  7.202548438495e-06
58001.00000  59001.00000  6.757029978382e-06
59001.00000  60001.00000  6.460017671640e-06
60001.00000  61001.00000  5.865993058156e-06
61001.00000  62001.00000  5.346221521357e-06
62001.00000  63001.00000  5.012082676272e-06
63001.00000  64001.00000  5.123462291301e-06
64001.00000  65001.00000  4.863576522901e-06
65001.00000  66001.00000  4.306678447760e-06
66001.00000  67001.00000  4.937829599587e-06
67001.00000  68001.00000  3.935413064332e-06
68001.00000  69001.00000  4.343804986103e-06
69001.00000  70001.00000  4.677943831188e-06
70001.00000  71001.00000  3.898286525990e-06
71001.00000  72001.00000  3.044376144106e-06
72001.00000  73001.00000  3.489894604219e-06
73001.00000  74001.00000  3.118629220792e-06
74001.00000  75001.00000  3.527021142562e-06
75001.00000  76001.00000  3.044376144106e-06
76001.00000  77001.00000  3.527021142562e-06
77001.00000  78001.00000  3.155755759135e-06
78001.00000  79001.00000  3.786906910961e-06
79001.00000  80001.00000  2.784490375707e-06
80001.00000  81001.00000  2.858743452392e-06
81001.00000  82001.00000  2.858743452392e-06
82001.00000  83001.00000  2.116212685537e-06
83001.00000  84001.00000  2.301845377251e-06
84001.00000  85001.00000  2.264718838908e-06
85001.00000  86001.00000  1.930579993823e-06
86001.00000  87001.00000  2.190465762223e-06
87001.00000  88001.00000  2.450351530622e-06
88001.00000  89001.00000  2.524604607308e-06
89001.00000  90001.00000  2.079086147194e-06
90001.00000  91001.00000  2.413224992279e-06
91001.00000  92001.00000  2.338971915594e-06
92001.00000  93001.00000  1.670694225424e-06
93001.00000  94001.00000  1.856326917138e-06
94001.00000  95001.00000  1.744947302110e-06
95001.00000  96001.00000  1.596441148739e-06
96001.00000  97001.00000  2.079086147194e-06
97001.00000  98001.00000  1.596441148739e-06
98001.00000  99001.00000  1.336555380339e-06
99001.00000  100001.00000  1.707820763767e-06
100001.00000  101001.00000  1.596441148739e-06
101001.00000  102001.00000  1.225175765311e-06
102001.00000  103001.00000  1.113796150283e-06
103001.00000  104001.00000  1.188049226968e-06
104001.00000  105001.00000  9.652899969117e-07
105001.00000  106001.00000  1.410808457025e-06
106001.00000  107001.00000  1.225175765311e-06
107001.00000  108001.00000  1.076669611940e-06
108001.00000  109001.00000  1.373681918682e-06
109001.00000  110001.00000  1.336555380339e-06
110001.00000  111001.00000  1.076669611940e-06
111001.00000  112001.00000  8.539103818835e-07
112001.00000  113001.00000  1.076669611940e-06
113001.00000  114001.00000  8.910369202262e-07
114001.00000  115001.00000  5.568980751414e-07
115001.00000  116001.00000  1.262302303654e-06
116001.00000  117001.00000  1.039543073597e-06
117001.00000  118001.00000  8.910369202262e-07
118001.00000  119001.00000  8.167838435407e-07
119001.00000  120001.00000  7.054042285124e-07
120001.00000  121001.00000  7.425307668552e-07
121001.00000  122001.00000  8.167838435407e-07
122001.00000  123001.00000  9.281634585690e-07
123001.00000  124001.00000  8.167838435407e-07
124001.00000  125001.00000  6.311511518269e-07
125001.00000  126001.00000  9.652899969117e-07
126001.00000  127001.00000  7.796573051979e-07
127001.00000  128001.00000  9.281634585690e-07
128001.00000  129001.00000  5.940246134841e-07
129001.00000  130001.00000  5.197715367986e-07
130001.00000  131001.00000  5.568980751414e-07
131001.00000  132001.00000  6.311511518269e-07
132001.00000  133001.00000  7.425307668552e-07
133001.00000  134001.00000  7.054042285124e-07
134001.00000  135001.00000  8.539103818835e-07
135001.00000  136001.00000  6.682776901697e-07
136001.00000  137001.00000  5.197715367986e-07
137001.00000  138001.00000  3.712653834276e-07
138001.00000  139001.00000  5.197715367986e-07
139001.00000  140001.00000  6.311511518269e-07
140001.00000  141001.00000  6.311511518269e-07
141001.00000  142001.00000  4.083919217703e-07
142001.00000  143001.00000  5.940246134841e-07
143001.00000  144001.00000  5.940246134841e-07
144001.00000  145001.00000  2.970123067421e-07
145001.00000  146001.00000  5.568980751414e-07
146001.00000  147001.00000  4.455184601131e-07
147001.00000  148001.00000  2.970123067421e-07
148001.00000  149001.00000  4.083919217703e-07
149001.00000  150001.00000  4.826449984559e-07
150001.00000  151001.00000  2.227592300566e-07
151001.00000  152001.00000  6.311511518269e-07
152001.00000  153001.00000  3.341388450848e-07
153001.00000  154001.00000  2.227592300566e-07
154001.00000  155001.00000  4.083919217703e-07
155001.00000  156001.00000  3.712653834276e-07
156001.00000  157001.00000  4.083919217703e-07
157001.00000  158001.00000  5.568980751414e-07
158001.00000  159001.00000  3.712653834276e-07
159001.00000  160001.00000  1.856326917138e-07
160001.00000  161001.00000  2.970123067421e-07
161001.00000  162001.00000  5.940246134841e-07
162001.00000  163001.00000  4.826449984559e-07
163001.00000  164001.00000  3.712653834276e-07
164001.00000  165001.00000  4.826449984559e-07
165001.00000  166001.00000  2.598857683993e-07
166001.00000  167001.00000  4.083919217703e-07
167001.00000  168001.00000  4.455184601131e-07
168001.00000  169001.00000  2.970123067421e-07
169001.00000  170001.00000  2.227592300566e-07
170001.00000  171001.00000  2.970123067421e-07
171001.00000  172001.00000  1.856326917138e-07
172001.00000  173001.00000  2.598857683993e-07
173001.00000  174001.00000  1.485061533710e-07
174001.00000  175001.00000  1.856326917138e-07
175001.00000  176001.00000  2.598857683993e-07
176001.00000  177001.00000  3.712653834276e-07
177001.00000  178001.00000  3.341388450848e-07
178001.00000  179001.00000  1.485061533710e-07
179001.00000  180001.00000  2.227592300566e-07
180001.00000  181001.00000  2.227592300566e-07
181001.00000  182001.00000  1.856326917138e-07
182001.00000  183001.00000  1.856326917138e-07
183001.00000  184001.00000  3.341388450848e-07
184001.00000  185001.00000  3.341388450848e-07
185001.00000  186001.00000  2.970123067421e-07
186001.00000  187001.00000  2.598857683993e-07
187001.00000  188001.00000  3.341388450848e-07
188001.00000  189001.00000  2.598857683993e-07
189001.00000  190001.00000  1.485061533710e-07
190001.00000  191001.00000  2.227592300566e-07
191001.00000  192001.00000  1.856326917138e-07
192001.00000  193001.00000  2.227592300566e-07
193001.00000  194001.00000  1.856326917138e-07
194001.00000  195001.00000  1.856326917138e-07
195001.00000  196001.00000  2.227592300566e-07
196001.00000  197001.00000  3.341388450848e-07
197001.00000  198001.00000  1.856326917138e-07
198001.00000  199001.00000  1.113796150283e-07
