10001.00000  11001.00000  7.147807927396e-05
11001.00000  12001.00000  6.208488665733e-05
12001.00000  13001.00000  5.025919396069e-05
13001.00000  14001.00000  4.348561681484e-05
14001.00000  15001.00000  3.652492427821e-05
15001.00000  16001.00000  3.128569333666e-05
16001.00000  17001.00000  2.836669324066e-05
17001.00000  18001.00000  2.488634697235e-05
18001.00000  19001.00000  2.136857762588e-05
19001.00000  20001.00000  2.028330835942e-05
20001.00000  21001.00000  1.672811593480e-05
21001.00000  22001.00000  1.459500048002e-05
22001.00000  23001.00000  1.399623122956e-05
23001.00000  24001.00000  1.171342346217e-05
24001.00000  25001.00000  1.111465421171e-05
25001.00000  26001.00000  1.014165417971e-05
26001.00000  27001.00000  9.056384913245e-06
27001.00000  28001.00000  8.307923350167e-06
28001.00000  29001.00000  8.569884897244e-06
29001.00000  30001.00000  6.511615598779e-06
30001.00000  31001.00000  6.099961739086e-06
31001.00000  32001.00000  5.800577113855e-06
32001.00000  33001.00000  5.164384785239e-06
33001.00000  34001.00000  4.415923222161e-06
34001.00000  35001.00000  4.640461691084e-06
35001.00000  36001.00000  5.089538628931e-06
36001.00000  37001.00000  3.779730893544e-06
37001.00000  38001.00000  3.555192424621e-06
38001.00000  39001.00000  3.218384721236e-06
39001.00000  40001.00000  2.806730861543e-06
40001.00000  41001.00000  3.143538564928e-06
41001.00000  42001.00000  3.180961643082e-06
42001.00000  43001.00000  2.619615470773e-06
43001.00000  44001.00000  2.432500080004e-06
44001.00000  45001.00000  2.582192392619e-06
45001.00000  46001.00000  2.694461627081e-06
46001.00000  47001.00000  2.282807767388e-06
47001.00000  48001.00000  2.133115454773e-06
48001.00000  49001.00000  1.946000064003e-06
49001.00000  50001.00000  2.133115454773e-06
50001.00000  51001.00000  1.684038516926e-06
51001.00000  52001.00000  2.095692376619e-06
52001.00000  53001.00000  1.871153907695e-06
53001.00000  54001.00000  1.496923126156e-06
54001.00000  55001.00000  1.347230813541e-06
55001.00000  56001.00000  1.496923126156e-06
56001.00000  57001.00000  1.272384657233e-06
57001.00000  58001.00000  1.160115422771e-06
58001.00000  59001.00000  9.355769538476e-07
59001.00000  60001.00000  1.234961579079e-06
60001.00000  61001.00000  1.459500048002e-06
61001.00000  62001.00000  9.355769538476e-07
62001.00000  63001.00000  9.355769538476e-07
63001.00000  64001.00000  1.010423110155e-06
64001.00000  65001.00000  1.010423110155e-06
65001.00000  66001.00000  7.858846412320e-07
66001.00000  67001.00000  5.613461723086e-07
67001.00000  68001.00000  8.233077193859e-07
68001.00000  69001.00000  8.233077193859e-07
69001.00000  70001.00000  7.110384849242e-07
70001.00000  71001.00000  6.736154067703e-07
71001.00000  72001.00000  5.613461723086e-07
72001.00000  73001.00000  6.736154067703e-07
73001.00000  74001.00000  5.239230941547e-07
74001.00000  75001.00000  5.239230941547e-07
75001.00000  76001.00000  5.987692504625e-07
76001.00000  77001.00000  7.110384849242e-07
77001.00000  78001.00000  5.239230941547e-07
78001.00000  79001.00000  7.110384849242e-07
79001.00000  80001.00000  5.987692504625e-07
80001.00000  81001.00000  5.613461723086e-07
81001.00000  82001.00000  3.742307815390e-07
82001.00000  83001.00000  3.742307815390e-07
83001.00000  84001.00000  3.742307815390e-07
84001.00000  85001.00000  4.116538596930e-07
85001.00000  86001.00000  3.742307815390e-07
86001.00000  87001.00000  2.993846252312e-07
87001.00000  88001.00000  1.871153907695e-07
88001.00000  89001.00000  3.368077033851e-07
89001.00000  90001.00000  5.239230941547e-07
90001.00000  91001.00000  2.619615470773e-07
91001.00000  92001.00000  2.993846252312e-07
92001.00000  93001.00000  4.116538596930e-07
93001.00000  94001.00000  3.368077033851e-07
94001.00000  95001.00000  3.368077033851e-07
95001.00000  96001.00000  2.245384689234e-07
96001.00000  97001.00000  2.619615470773e-07
97001.00000  98001.00000  4.865000160008e-07
98001.00000  99001.00000  2.993846252312e-07
99001.00000  100001.00000  4.865000160008e-07
100001.00000  101001.00000  3.368077033851e-07
101001.00000  102001.00000  3.742307815390e-07
102001.00000  103001.00000  2.245384689234e-07
103001.00000  104001.00000  2.619615470773e-07
104001.00000  105001.00000  2.993846252312e-07
105001.00000  106001.00000  2.993846252312e-07
106001.00000  107001.00000  2.993846252312e-07
107001.00000  108001.00000  1.871153907695e-07
108001.00000  109001.00000  2.993846252312e-07
109001.00000  110001.00000  1.871153907695e-07
110001.00000  111001.00000  3.368077033851e-07
111001.00000  112001.00000  2.993846252312e-07
112001.00000  113001.00000  2.245384689234e-07
113001.00000  114001.00000  2.619615470773e-07
114001.00000  115001.00000  2.245384689234e-07
115001.00000  116001.00000  1.496923126156e-07
116001.00000  117001.00000  2.245384689234e-07
117001.00000  118001.00000  1.871153907695e-07
118001.00000  119001.00000  1.122692344617e-07
119001.00000  120001.00000  1.122692344617e-07
120001.00000  121001.00000  7.484615630781e-08
121001.00000  122001.00000  4.490769378469e-07
122001.00000  123001.00000  2.245384689234e-07
123001.00000  124001.00000  3.742307815390e-08
124001.00000  125001.00000  1.496923126156e-07
125001.00000  126001.00000  1.122692344617e-07
126001.00000  127001.00000  1.871153907695e-07
127001.00000  128001.00000  1.122692344617e-07
128001.00000  129001.00000  2.245384689234e-07
129001.00000  130001.00000  1.122692344617e-07
130001.00000  131001.00000  1.122692344617e-07
131001.00000  132001.00000  2.619615470773e-07
132001.00000  133001.00000  1.122692344617e-07
133001.00000  134001.00000  1.122692344617e-07
134001.00000  135001.00000  7.484615630781e-08
135001.00000  136001.00000  1.122692344617e-07
136001.00000  137001.00000  1.496923126156e-07
137001.00000  138001.00000  1.122692344617e-07
138001.00000  139001.00000  1.496923126156e-07
139001.00000  140001.00000  7.484615630781e-08
140001.00000  141001.00000  1.871153907695e-07
141001.00000  142001.00000  1.122692344617e-07
142001.00000  143001.00000  1.871153907695e-07
143001.00000  144001.00000  1.871153907695e-07
144001.00000  145001.00000  1.496923126156e-07
145001.00000  146001.00000  7.484615630781e-08
146001.00000  147001.00000  1.122692344617e-07
147001.00000  148001.00000  1.122692344617e-07
148001.00000  149001.00000  1.871153907695e-07
149001.00000  150001.00000  3.742307815390e-08
150001.00000  151001.00000  7.484615630781e-08
151001.00000  152001.00000  7.484615630781e-08
152001.00000  153001.00000  3.742307815390e-08
153001.00000  154001.00000  1.496923126156e-07
154001.00000  155001.00000  0.000000000000e+00
155001.00000  156001.00000  1.122692344617e-07
156001.00000  157001.00000  3.742307815390e-08
157001.00000  158001.00000  3.742307815390e-08
158001.00000  159001.00000  3.742307815390e-08
159001.00000  160001.00000  1.122692344617e-07
160001.00000  161001.00000  1.122692344617e-07
161001.00000  162001.00000  1.122692344617e-07
162001.00000  163001.00000  7.484615630781e-08
163001.00000  164001.00000  3.742307815390e-08
164001.00000  165001.00000  1.496923126156e-07
165001.00000  166001.00000  7.484615630781e-08
166001.00000  167001.00000  1.122692344617e-07
167001.00000  168001.00000  7.484615630781e-08
168001.00000  169001.00000  3.742307815390e-08
169001.00000  170001.00000  7.484615630781e-08
170001.00000  171001.00000  0.000000000000e+00
171001.00000  172001.00000  3.742307815390e-08
172001.00000  173001.00000  7.484615630781e-08
173001.00000  174001.00000  0.000000000000e+00
174001.00000  175001.00000  0.000000000000e+00
175001.00000  176001.00000  7.484615630781e-08
176001.00000  177001.00000  3.742307815390e-08
177001.00000  178001.00000  1.122692344617e-07
178001.00000  179001.00000  0.000000000000e+00
179001.00000  180001.00000  3.742307815390e-08
180001.00000  181001.00000  7.484615630781e-08
181001.00000  182001.00000  1.496923126156e-07
182001.00000  183001.00000  7.484615630781e-08
183001.00000  184001.00000  3.742307815390e-08
184001.00000  185001.00000  2.245384689234e-07
185001.00000  186001.00000  7.484615630781e-08
186001.00000  187001.00000  1.122692344617e-07
187001.00000  188001.00000  3.742307815390e-08
188001.00000  189001.00000  3.742307815390e-08
189001.00000  190001.00000  3.742307815390e-08
190001.00000  191001.00000  3.742307815390e-08
191001.00000  192001.00000  0.000000000000e+00
192001.00000  193001.00000  0.000000000000e+00
193001.00000  194001.00000  1.122692344617e-07
194001.00000  195001.00000  0.000000000000e+00
195001.00000  196001.00000  0.000000000000e+00
196001.00000  197001.00000  0.000000000000e+00
197001.00000  198001.00000  3.742307815390e-08
198001.00000  199001.00000  3.742307815390e-08
