10001.00000  11001.00000  3.312750521047e-05
11001.00000  12001.00000  3.411091776328e-05
12001.00000  13001.00000  3.735039440784e-05
13001.00000  14001.00000  4.034883856397e-05
14001.00000  15001.00000  4.222889197376e-05
15001.00000  16001.00000  4.339548921779e-05
16001.00000  17001.00000  4.559370551231e-05
17001.00000  18001.00000  4.356903260946e-05
18001.00000  19001.00000  4.467778205626e-05
19001.00000  20001.00000  4.332800012103e-05
20001.00000  21001.00000  4.312553283074e-05
21001.00000  22001.00000  4.184323999227e-05
22001.00000  23001.00000  4.022350166999e-05
23001.00000  24001.00000  3.776497028795e-05
24001.00000  25001.00000  3.673335123745e-05
25001.00000  26001.00000  3.470867833460e-05
26001.00000  27001.00000  3.370598318271e-05
27001.00000  28001.00000  2.987838726637e-05
28001.00000  29001.00000  2.927098539551e-05
29001.00000  30001.00000  2.879856171818e-05
30001.00000  31001.00000  2.596401965419e-05
31001.00000  32001.00000  2.440212912913e-05
32001.00000  33001.00000  2.213642373784e-05
33001.00000  34001.00000  2.212678243831e-05
34001.00000  35001.00000  2.092161999613e-05
35001.00000  36001.00000  1.901264268773e-05
36001.00000  37001.00000  1.821241482613e-05
37001.00000  38001.00000  1.767250205203e-05
38001.00000  39001.00000  1.699761108442e-05
39001.00000  40001.00000  1.499222078064e-05
40001.00000  41001.00000  1.432697111256e-05
41001.00000  42001.00000  1.441374280840e-05
42001.00000  43001.00000  1.427876461487e-05
43001.00000  44001.00000  1.279400448611e-05
44001.00000  45001.00000  1.259153719583e-05
45001.00000  46001.00000  1.153099424672e-05
46001.00000  47001.00000  1.107785316846e-05
47001.00000  48001.00000  1.039332090131e-05
48001.00000  49001.00000  1.012336451426e-05
49001.00000  50001.00000  9.188158459132e-06
50001.00000  51001.00000  9.082104164220e-06
51001.00000  52001.00000  8.281876302617e-06
52001.00000  53001.00000  8.233669804930e-06
53001.00000  54001.00000  7.799811325748e-06
54001.00000  55001.00000  7.443083242864e-06
55001.00000  56001.00000  6.777833574784e-06
56001.00000  57001.00000  6.797116173859e-06
57001.00000  58001.00000  6.681420579410e-06
58001.00000  59001.00000  6.488594588663e-06
59001.00000  60001.00000  6.016170911331e-06
60001.00000  61001.00000  5.726931925209e-06
61001.00000  62001.00000  5.225584349265e-06
62001.00000  63001.00000  5.042399658054e-06
63001.00000  64001.00000  4.897780164994e-06
64001.00000  65001.00000  4.955627962218e-06
65001.00000  66001.00000  4.492845584423e-06
66001.00000  67001.00000  4.492845584423e-06
67001.00000  68001.00000  4.637465077484e-06
68001.00000  69001.00000  4.396432589049e-06
69001.00000  70001.00000  3.904726312642e-06
70001.00000  71001.00000  3.875802414030e-06
71001.00000  72001.00000  3.721541621432e-06
72001.00000  73001.00000  3.663693824208e-06
73001.00000  74001.00000  3.596204727446e-06
74001.00000  75001.00000  3.104498451039e-06
75001.00000  76001.00000  2.776694266768e-06
76001.00000  77001.00000  3.335889639937e-06
77001.00000  78001.00000  3.027368054740e-06
78001.00000  79001.00000  2.882748561679e-06
79001.00000  80001.00000  2.612792174632e-06
80001.00000  81001.00000  2.660998672319e-06
81001.00000  82001.00000  2.535661778333e-06
82001.00000  83001.00000  2.593509575558e-06
83001.00000  84001.00000  2.458531382034e-06
84001.00000  85001.00000  2.207857594062e-06
85001.00000  86001.00000  2.352477087123e-06
86001.00000  87001.00000  2.236781492674e-06
87001.00000  88001.00000  1.937901207015e-06
88001.00000  89001.00000  1.986107704702e-06
89001.00000  90001.00000  2.015031603314e-06
90001.00000  91001.00000  2.063238101001e-06
91001.00000  92001.00000  1.880053409791e-06
92001.00000  93001.00000  1.648662220893e-06
93001.00000  94001.00000  1.754716515805e-06
94001.00000  95001.00000  1.532966626445e-06
95001.00000  96001.00000  1.822205612566e-06
96001.00000  97001.00000  1.320858036622e-06
97001.00000  98001.00000  1.639020921356e-06
98001.00000  99001.00000  1.378705833847e-06
99001.00000  100001.00000  1.330499336160e-06
100001.00000  101001.00000  1.349781935234e-06
101001.00000  102001.00000  1.340140635697e-06
102001.00000  103001.00000  1.272651538935e-06
103001.00000  104001.00000  1.137673345412e-06
104001.00000  105001.00000  1.050901649575e-06
105001.00000  106001.00000  1.137673345412e-06
106001.00000  107001.00000  1.195521142636e-06
107001.00000  108001.00000  1.099108147262e-06
108001.00000  109001.00000  9.834125528137e-07
109001.00000  110001.00000  1.021977750963e-06
110001.00000  111001.00000  8.677169583650e-07
111001.00000  112001.00000  6.363257694677e-07
112001.00000  113001.00000  9.834125528137e-07
113001.00000  114001.00000  7.327387648416e-07
114001.00000  115001.00000  6.748909676172e-07
115001.00000  116001.00000  8.291517602154e-07
116001.00000  117001.00000  5.688366727059e-07
117001.00000  118001.00000  8.002278616033e-07
118001.00000  119001.00000  4.531410782573e-07
119001.00000  120001.00000  5.302714745564e-07
120001.00000  121001.00000  5.784779722433e-07
121001.00000  122001.00000  5.206301750190e-07
122001.00000  123001.00000  4.917062764068e-07
123001.00000  124001.00000  3.470867833460e-07
124001.00000  125001.00000  2.603150875095e-07
125001.00000  126001.00000  3.663693824208e-07
126001.00000  127001.00000  2.410324884347e-07
127001.00000  128001.00000  2.699563870469e-07
128001.00000  129001.00000  3.085215851964e-07
129001.00000  130001.00000  3.278041842712e-07
130001.00000  131001.00000  2.795976865843e-07
131001.00000  132001.00000  3.278041842712e-07
132001.00000  133001.00000  2.313911888973e-07
133001.00000  134001.00000  2.699563870469e-07
134001.00000  135001.00000  2.121085898226e-07
135001.00000  136001.00000  9.641299537389e-08
136001.00000  137001.00000  3.085215851964e-07
137001.00000  138001.00000  1.831846912104e-07
138001.00000  139001.00000  1.831846912104e-07
139001.00000  140001.00000  1.253368939861e-07
140001.00000  141001.00000  2.410324884347e-07
141001.00000  142001.00000  2.024672902852e-07
142001.00000  143001.00000  1.639020921356e-07
143001.00000  144001.00000  1.060542949113e-07
144001.00000  145001.00000  1.349781935234e-07
145001.00000  146001.00000  1.253368939861e-07
146001.00000  147001.00000  1.735433916730e-07
147001.00000  148001.00000  1.639020921356e-07
148001.00000  149001.00000  1.253368939861e-07
149001.00000  150001.00000  1.253368939861e-07
150001.00000  151001.00000  1.928259907478e-07
151001.00000  152001.00000  6.748909676172e-08
152001.00000  153001.00000  6.748909676172e-08
153001.00000  154001.00000  6.748909676172e-08
154001.00000  155001.00000  6.748909676172e-08
155001.00000  156001.00000  1.542607925982e-07
156001.00000  157001.00000  1.542607925982e-07
157001.00000  158001.00000  1.542607925982e-07
158001.00000  159001.00000  7.713039629911e-08
159001.00000  160001.00000  1.542607925982e-07
160001.00000  161001.00000  1.156955944487e-07
161001.00000  162001.00000  7.713039629911e-08
162001.00000  163001.00000  7.713039629911e-08
163001.00000  164001.00000  5.784779722433e-08
164001.00000  165001.00000  4.820649768694e-08
165001.00000  166001.00000  6.748909676172e-08
166001.00000  167001.00000  1.060542949113e-07
167001.00000  168001.00000  6.748909676172e-08
168001.00000  169001.00000  8.677169583650e-08
169001.00000  170001.00000  9.641299537389e-08
170001.00000  171001.00000  2.892389861217e-08
171001.00000  172001.00000  4.820649768694e-08
172001.00000  173001.00000  1.060542949113e-07
173001.00000  174001.00000  7.713039629911e-08
174001.00000  175001.00000  6.748909676172e-08
175001.00000  176001.00000  4.820649768694e-08
176001.00000  177001.00000  7.713039629911e-08
177001.00000  178001.00000  6.748909676172e-08
178001.00000  179001.00000  6.748909676172e-08
179001.00000  180001.00000  6.748909676172e-08
180001.00000  181001.00000  3.856519814956e-08
181001.00000  182001.00000  8.677169583650e-08
182001.00000  183001.00000  8.677169583650e-08
183001.00000  184001.00000  3.856519814956e-08
184001.00000  185001.00000  2.892389861217e-08
185001.00000  186001.00000  2.892389861217e-08
186001.00000  187001.00000  4.820649768694e-08
187001.00000  188001.00000  2.892389861217e-08
188001.00000  189001.00000  6.748909676172e-08
189001.00000  190001.00000  9.641299537389e-08
190001.00000  191001.00000  5.784779722433e-08
191001.00000  192001.00000  1.928259907478e-08
192001.00000  193001.00000  4.820649768694e-08
193001.00000  194001.00000  0.000000000000e+00
194001.00000  195001.00000  0.000000000000e+00
195001.00000  196001.00000  1.928259907478e-08
196001.00000  197001.00000  2.892389861217e-08
197001.00000  198001.00000  2.892389861217e-08
198001.00000  199001.00000  1.928259907478e-08
