10001.00000  11001.00000  8.044663072768e-05
11001.00000  12001.00000  7.009796066174e-05
12001.00000  13001.00000  5.964280287764e-05
13001.00000  14001.00000  5.410544153273e-05
14001.00000  15001.00000  4.834542404982e-05
15001.00000  16001.00000  4.232402762231e-05
16001.00000  17001.00000  3.916811888378e-05
17001.00000  18001.00000  3.491829085857e-05
18001.00000  19001.00000  3.169461720847e-05
19001.00000  20001.00000  2.955518214339e-05
20001.00000  21001.00000  2.715436813371e-05
21001.00000  22001.00000  2.414366991995e-05
22001.00000  23001.00000  2.302070852833e-05
23001.00000  24001.00000  2.094903837481e-05
24001.00000  25001.00000  1.971958926501e-05
25001.00000  26001.00000  1.833524892879e-05
26001.00000  27001.00000  1.794802086271e-05
27001.00000  28001.00000  1.586667000754e-05
28001.00000  29001.00000  1.542135773155e-05
29001.00000  30001.00000  1.451137177627e-05
30001.00000  31001.00000  1.308830863343e-05
31001.00000  32001.00000  1.199438934676e-05
32001.00000  33001.00000  1.247842442936e-05
33001.00000  34001.00000  1.170396829720e-05
34001.00000  35001.00000  1.102631918157e-05
35001.00000  36001.00000  9.632298143687e-06
36001.00000  37001.00000  9.748466563510e-06
37001.00000  38001.00000  8.596463066928e-06
38001.00000  39001.00000  8.809438503271e-06
39001.00000  40001.00000  8.209235000851e-06
40001.00000  41001.00000  7.957536757900e-06
41001.00000  42001.00000  7.483182376955e-06
42001.00000  43001.00000  6.699045543147e-06
43001.00000  44001.00000  7.212122730700e-06
44001.00000  45001.00000  6.350540283677e-06
45001.00000  46001.00000  6.205329758898e-06
46001.00000  47001.00000  6.011715725859e-06
47001.00000  48001.00000  5.614806958129e-06
48001.00000  49001.00000  5.624487659781e-06
49001.00000  50001.00000  5.275982400311e-06
50001.00000  51001.00000  5.101729770576e-06
51001.00000  52001.00000  4.782266616062e-06
52001.00000  53001.00000  4.637056091282e-06
53001.00000  54001.00000  4.365996445028e-06
54001.00000  55001.00000  4.375677146680e-06
55001.00000  56001.00000  4.094936798773e-06
56001.00000  57001.00000  4.153021008685e-06
57001.00000  58001.00000  4.065894693818e-06
58001.00000  59001.00000  3.291438561662e-06
59001.00000  60001.00000  4.065894693818e-06
60001.00000  61001.00000  3.523775401309e-06
61001.00000  62001.00000  3.717389434347e-06
62001.00000  63001.00000  3.339842069922e-06
63001.00000  64001.00000  3.107505230275e-06
64001.00000  65001.00000  3.126866633579e-06
65001.00000  66001.00000  3.020378915407e-06
66001.00000  67001.00000  3.126866633579e-06
67001.00000  68001.00000  2.671873655937e-06
68001.00000  69001.00000  2.855806987324e-06
69001.00000  70001.00000  2.333049098119e-06
70001.00000  71001.00000  2.536343832810e-06
71001.00000  72001.00000  2.439536816291e-06
72001.00000  73001.00000  2.952614003844e-06
73001.00000  74001.00000  2.458898219594e-06
74001.00000  75001.00000  2.468578921246e-06
75001.00000  76001.00000  2.207199976644e-06
76001.00000  77001.00000  2.274964888207e-06
77001.00000  78001.00000  1.887736822130e-06
78001.00000  79001.00000  1.926459628737e-06
79001.00000  80001.00000  2.100712258472e-06
80001.00000  81001.00000  2.139435065080e-06
81001.00000  82001.00000  1.810291208914e-06
82001.00000  83001.00000  1.597315772571e-06
83001.00000  84001.00000  1.645719280831e-06
84001.00000  85001.00000  1.713484192395e-06
85001.00000  86001.00000  1.742526297350e-06
86001.00000  87001.00000  1.858694717174e-06
87001.00000  88001.00000  1.665080684135e-06
88001.00000  89001.00000  1.355298231273e-06
89001.00000  90001.00000  1.258491214753e-06
90001.00000  91001.00000  1.568273667615e-06
91001.00000  92001.00000  1.423063142836e-06
92001.00000  93001.00000  1.239129811449e-06
93001.00000  94001.00000  1.297214021361e-06
94001.00000  95001.00000  1.355298231273e-06
95001.00000  96001.00000  1.423063142836e-06
96001.00000  97001.00000  1.297214021361e-06
97001.00000  98001.00000  1.335936827969e-06
98001.00000  99001.00000  1.258491214753e-06
99001.00000  100001.00000  1.161684198234e-06
100001.00000  101001.00000  9.971122701505e-07
101001.00000  102001.00000  1.374659634576e-06
102001.00000  103001.00000  1.142322794930e-06
103001.00000  104001.00000  1.152003496582e-06
104001.00000  105001.00000  1.132642093278e-06
105001.00000  106001.00000  1.297214021361e-06
106001.00000  107001.00000  1.035835076758e-06
107001.00000  108001.00000  1.152003496582e-06
108001.00000  109001.00000  9.196666569349e-07
109001.00000  110001.00000  9.583894635427e-07
110001.00000  111001.00000  8.228596404154e-07
111001.00000  112001.00000  9.680701651946e-07
112001.00000  113001.00000  9.583894635427e-07
113001.00000  114001.00000  7.550947288518e-07
114001.00000  115001.00000  9.487087618908e-07
115001.00000  116001.00000  8.422210437193e-07
116001.00000  117001.00000  7.550947288518e-07
117001.00000  118001.00000  7.841368338077e-07
118001.00000  119001.00000  7.841368338077e-07
119001.00000  120001.00000  8.325403420674e-07
120001.00000  121001.00000  7.260526238960e-07
121001.00000  122001.00000  6.582877123324e-07
122001.00000  123001.00000  7.260526238960e-07
123001.00000  124001.00000  8.519017453713e-07
124001.00000  125001.00000  5.808420991168e-07
125001.00000  126001.00000  5.905228007687e-07
126001.00000  127001.00000  6.389263090285e-07
127001.00000  128001.00000  6.389263090285e-07
128001.00000  129001.00000  6.486070106804e-07
129001.00000  130001.00000  7.066912205921e-07
130001.00000  131001.00000  5.905228007687e-07
131001.00000  132001.00000  5.905228007687e-07
132001.00000  133001.00000  5.808420991168e-07
133001.00000  134001.00000  5.033964859012e-07
134001.00000  135001.00000  5.808420991168e-07
135001.00000  136001.00000  6.873298172882e-07
136001.00000  137001.00000  5.227578892051e-07
137001.00000  138001.00000  5.324385908571e-07
138001.00000  139001.00000  4.743543809454e-07
139001.00000  140001.00000  6.195649057246e-07
140001.00000  141001.00000  4.646736792934e-07
141001.00000  142001.00000  5.033964859012e-07
142001.00000  143001.00000  5.421192925090e-07
143001.00000  144001.00000  3.581859611220e-07
144001.00000  145001.00000  3.775473644259e-07
145001.00000  146001.00000  4.549929776415e-07
146001.00000  147001.00000  5.130771875532e-07
147001.00000  148001.00000  4.453122759895e-07
148001.00000  149001.00000  4.356315743376e-07
149001.00000  150001.00000  4.259508726856e-07
150001.00000  151001.00000  3.969087677298e-07
151001.00000  152001.00000  5.033964859012e-07
152001.00000  153001.00000  3.678666627740e-07
153001.00000  154001.00000  4.065894693818e-07
154001.00000  155001.00000  3.969087677298e-07
155001.00000  156001.00000  4.453122759895e-07
156001.00000  157001.00000  4.549929776415e-07
157001.00000  158001.00000  4.937157842493e-07
158001.00000  159001.00000  3.775473644259e-07
159001.00000  160001.00000  2.807403479064e-07
160001.00000  161001.00000  2.613789446026e-07
161001.00000  162001.00000  3.969087677298e-07
162001.00000  163001.00000  3.388245578181e-07
163001.00000  164001.00000  3.388245578181e-07
164001.00000  165001.00000  3.194631545142e-07
165001.00000  166001.00000  2.613789446026e-07
166001.00000  167001.00000  2.807403479064e-07
167001.00000  168001.00000  2.420175412987e-07
168001.00000  169001.00000  2.710596462545e-07
169001.00000  170001.00000  3.291438561662e-07
170001.00000  171001.00000  3.001017512103e-07
171001.00000  172001.00000  3.388245578181e-07
172001.00000  173001.00000  3.291438561662e-07
173001.00000  174001.00000  3.581859611220e-07
174001.00000  175001.00000  3.194631545142e-07
175001.00000  176001.00000  3.581859611220e-07
176001.00000  177001.00000  3.388245578181e-07
177001.00000  178001.00000  3.678666627740e-07
178001.00000  179001.00000  2.807403479064e-07
179001.00000  180001.00000  2.226561379948e-07
180001.00000  181001.00000  2.613789446026e-07
181001.00000  182001.00000  2.226561379948e-07
182001.00000  183001.00000  1.645719280831e-07
183001.00000  184001.00000  1.548912264311e-07
184001.00000  185001.00000  3.581859611220e-07
185001.00000  186001.00000  2.420175412987e-07
186001.00000  187001.00000  2.807403479064e-07
187001.00000  188001.00000  2.420175412987e-07
188001.00000  189001.00000  1.742526297350e-07
189001.00000  190001.00000  2.129754363428e-07
190001.00000  191001.00000  2.129754363428e-07
191001.00000  192001.00000  2.420175412987e-07
192001.00000  193001.00000  1.645719280831e-07
193001.00000  194001.00000  2.420175412987e-07
194001.00000  195001.00000  2.226561379948e-07
195001.00000  196001.00000  2.516982429506e-07
196001.00000  197001.00000  1.161684198234e-07
197001.00000  198001.00000  2.710596462545e-07
198001.00000  199001.00000  1.936140330389e-07
