10001.00000  11001.00000  4.584232935062e-04
11001.00000  12001.00000  4.061557489368e-04
12001.00000  13001.00000  3.579280680779e-04
13001.00000  14001.00000  3.230541133264e-04
14001.00000  15001.00000  2.939073161980e-04
15001.00000  16001.00000  2.675855311630e-04
16001.00000  17001.00000  2.502594331016e-04
17001.00000  18001.00000  2.316702750256e-04
18001.00000  19001.00000  2.136789010786e-04
19001.00000  20001.00000  2.002769665737e-04
20001.00000  21001.00000  1.850623963227e-04
21001.00000  22001.00000  1.723932294597e-04
22001.00000  23001.00000  1.622983910232e-04
23001.00000  24001.00000  1.526663532027e-04
24001.00000  25001.00000  1.423015477403e-04
25001.00000  26001.00000  1.335661861133e-04
26001.00000  27001.00000  1.268652188608e-04
27001.00000  28001.00000  1.170692724888e-04
28001.00000  29001.00000  1.096933876713e-04
29001.00000  30001.00000  1.040337218048e-04
30001.00000  31001.00000  9.856688952833e-05
31001.00000  32001.00000  9.253119816134e-05
32001.00000  33001.00000  8.838527597635e-05
33001.00000  34001.00000  8.257134323786e-05
34001.00000  35001.00000  7.955349755436e-05
35001.00000  36001.00000  7.550399216437e-05
36001.00000  37001.00000  7.203298754438e-05
37001.00000  38001.00000  6.786778200038e-05
38001.00000  39001.00000  6.622869648539e-05
39001.00000  40001.00000  6.081007260640e-05
40001.00000  41001.00000  5.984590465640e-05
41001.00000  42001.00000  5.751261821740e-05
42001.00000  43001.00000  5.444656413641e-05
43001.00000  44001.00000  5.161191036341e-05
44001.00000  45001.00000  4.943289079642e-05
45001.00000  46001.00000  4.830481429492e-05
46001.00000  47001.00000  4.628006159992e-05
47001.00000  48001.00000  4.242338979993e-05
48001.00000  49001.00000  4.214378109443e-05
49001.00000  50001.00000  3.932841068043e-05
50001.00000  51001.00000  3.866313479493e-05
51001.00000  52001.00000  3.732294134444e-05
52001.00000  53001.00000  3.611773140694e-05
53001.00000  54001.00000  3.421832054544e-05
54001.00000  55001.00000  3.370731153194e-05
55001.00000  56001.00000  3.171148387545e-05
56001.00000  57001.00000  3.237675976094e-05
57001.00000  58001.00000  2.973493957795e-05
58001.00000  59001.00000  2.952282262895e-05
59001.00000  60001.00000  2.785481207545e-05
60001.00000  61001.00000  2.755592001095e-05
61001.00000  62001.00000  2.625429327846e-05
62001.00000  63001.00000  2.603253464996e-05
63001.00000  64001.00000  2.513585845646e-05
64001.00000  65001.00000  2.327501431296e-05
65001.00000  66001.00000  2.336178942846e-05
66001.00000  67001.00000  2.257117170946e-05
67001.00000  68001.00000  2.211801277296e-05
68001.00000  69001.00000  2.116348650246e-05
69001.00000  70001.00000  1.967866785947e-05
70001.00000  71001.00000  2.068140252746e-05
71001.00000  72001.00000  1.876270830697e-05
72001.00000  73001.00000  1.879163334547e-05
73001.00000  74001.00000  1.768284020297e-05
74001.00000  75001.00000  1.802029898547e-05
75001.00000  76001.00000  1.711398111247e-05
76001.00000  77001.00000  1.640049682947e-05
77001.00000  78001.00000  1.665118049647e-05
78001.00000  79001.00000  1.577378766197e-05
79001.00000  80001.00000  1.544597055897e-05
80001.00000  81001.00000  1.506994505847e-05
81001.00000  82001.00000  1.513743681497e-05
82001.00000  83001.00000  1.408649374948e-05
83001.00000  84001.00000  1.347906794098e-05
84001.00000  85001.00000  1.383581008248e-05
85001.00000  86001.00000  1.357548473598e-05
86001.00000  87001.00000  1.318981755598e-05
87001.00000  88001.00000  1.259203342698e-05
88001.00000  89001.00000  1.211959113148e-05
89001.00000  90001.00000  1.167607387448e-05
90001.00000  91001.00000  1.169535723348e-05
91001.00000  92001.00000  1.136754013048e-05
92001.00000  93001.00000  1.103008134798e-05
93001.00000  94001.00000  1.070226424498e-05
94001.00000  95001.00000  1.031659706498e-05
95001.00000  96001.00000  1.059620577048e-05
96001.00000  97001.00000  9.950213243983e-06
97001.00000  98001.00000  9.930929884983e-06
98001.00000  99001.00000  9.892363166983e-06
99001.00000  100001.00000  9.506695986984e-06
100001.00000  101001.00000  9.294579037984e-06
101001.00000  102001.00000  8.725719947485e-06
102001.00000  103001.00000  8.677511549985e-06
103001.00000  104001.00000  9.188520563484e-06
104001.00000  105001.00000  8.571453075485e-06
105001.00000  106001.00000  8.147219177486e-06
106001.00000  107001.00000  8.272561010986e-06
107001.00000  108001.00000  8.205069254486e-06
108001.00000  109001.00000  7.848327112987e-06
109001.00000  110001.00000  7.568718407487e-06
110001.00000  111001.00000  7.809760394987e-06
111001.00000  112001.00000  7.501226650987e-06
112001.00000  113001.00000  7.269826342988e-06
113001.00000  114001.00000  6.903442521988e-06
114001.00000  115001.00000  7.346959778987e-06
115001.00000  116001.00000  6.700967252489e-06
116001.00000  117001.00000  6.700967252489e-06
117001.00000  118001.00000  6.614192136989e-06
118001.00000  119001.00000  6.189958238989e-06
119001.00000  120001.00000  6.324941751989e-06
120001.00000  121001.00000  6.199599918489e-06
121001.00000  122001.00000  5.881424494990e-06
122001.00000  123001.00000  5.785007699990e-06
123001.00000  124001.00000  6.344225110989e-06
124001.00000  125001.00000  5.823574417990e-06
125001.00000  126001.00000  5.891066174490e-06
126001.00000  127001.00000  5.486115635491e-06
127001.00000  128001.00000  5.621099148490e-06
128001.00000  129001.00000  5.187223570991e-06
129001.00000  130001.00000  5.273998686491e-06
130001.00000  131001.00000  5.245073647991e-06
131001.00000  132001.00000  5.119731814491e-06
132001.00000  133001.00000  4.917256544992e-06
133001.00000  134001.00000  4.464097608492e-06
134001.00000  135001.00000  4.830481429492e-06
135001.00000  136001.00000  4.599081121492e-06
136001.00000  137001.00000  4.599081121492e-06
137001.00000  138001.00000  4.685856236992e-06
138001.00000  139001.00000  4.521947685492e-06
139001.00000  140001.00000  4.165205543993e-06
140001.00000  141001.00000  4.049505389993e-06
141001.00000  142001.00000  4.329114095493e-06
142001.00000  143001.00000  4.338755774993e-06
143001.00000  144001.00000  4.145922184993e-06
144001.00000  145001.00000  3.885596838493e-06
145001.00000  146001.00000  4.136280505493e-06
146001.00000  147001.00000  3.933805235993e-06
147001.00000  148001.00000  3.779538363994e-06
148001.00000  149001.00000  3.712046607494e-06
149001.00000  150001.00000  3.808463402494e-06
150001.00000  151001.00000  3.461362940494e-06
151001.00000  152001.00000  3.490287978994e-06
152001.00000  153001.00000  3.625271491994e-06
153001.00000  154001.00000  3.471004619994e-06
154001.00000  155001.00000  3.451721260994e-06
155001.00000  156001.00000  3.258887670994e-06
156001.00000  157001.00000  3.577063094494e-06
157001.00000  158001.00000  3.114262478495e-06
158001.00000  159001.00000  3.085337439995e-06
159001.00000  160001.00000  3.201037593995e-06
160001.00000  161001.00000  3.181754234995e-06
161001.00000  162001.00000  2.853937131995e-06
162001.00000  163001.00000  3.037129042495e-06
163001.00000  164001.00000  2.911787208995e-06
164001.00000  165001.00000  2.632178503496e-06
165001.00000  166001.00000  2.911787208995e-06
166001.00000  167001.00000  2.699670259995e-06
167001.00000  168001.00000  2.805728734495e-06
168001.00000  169001.00000  2.699670259995e-06
169001.00000  170001.00000  2.506836669996e-06
170001.00000  171001.00000  2.555045067496e-06
171001.00000  172001.00000  2.555045067496e-06
172001.00000  173001.00000  2.429703233996e-06
173001.00000  174001.00000  2.477911631496e-06
174001.00000  175001.00000  2.593611785496e-06
175001.00000  176001.00000  2.179019566996e-06
176001.00000  177001.00000  2.188661246496e-06
177001.00000  178001.00000  2.246511323496e-06
178001.00000  179001.00000  2.188661246496e-06
179001.00000  180001.00000  2.314003079996e-06
180001.00000  181001.00000  2.400778195496e-06
181001.00000  182001.00000  2.294719720996e-06
182001.00000  183001.00000  2.150094528496e-06
183001.00000  184001.00000  1.880127502497e-06
184001.00000  185001.00000  1.947619258997e-06
185001.00000  186001.00000  1.928335899997e-06
186001.00000  187001.00000  2.044036053997e-06
187001.00000  188001.00000  2.063319412996e-06
188001.00000  189001.00000  2.024752694997e-06
189001.00000  190001.00000  2.024752694997e-06
190001.00000  191001.00000  1.909052540997e-06
191001.00000  192001.00000  1.899410861497e-06
192001.00000  193001.00000  1.783710707497e-06
193001.00000  194001.00000  1.745143989497e-06
194001.00000  195001.00000  1.658368873997e-06
195001.00000  196001.00000  2.072961092496e-06
196001.00000  197001.00000  1.851202463997e-06
197001.00000  198001.00000  1.725860630497e-06
198001.00000  199001.00000  1.716218950997e-06
