10001.00000  11001.00000  2.969732999034e-05
11001.00000  12001.00000  3.067434312683e-05
12001.00000  13001.00000  3.253163542590e-05
13001.00000  14001.00000  3.362472933108e-05
14001.00000  15001.00000  3.478553701800e-05
15001.00000  16001.00000  3.464043605714e-05
16001.00000  17001.00000  3.644936136925e-05
17001.00000  18001.00000  3.633328060056e-05
18001.00000  19001.00000  3.519181970842e-05
19001.00000  20001.00000  3.361505593369e-05
20001.00000  21001.00000  3.275412356589e-05
21001.00000  22001.00000  3.207698574852e-05
22001.00000  23001.00000  3.008426588598e-05
23001.00000  24001.00000  2.802383224170e-05
24001.00000  25001.00000  2.821730018952e-05
25001.00000  26001.00000  2.566352327830e-05
26001.00000  27001.00000  2.482193770528e-05
27001.00000  28001.00000  2.459944956529e-05
28001.00000  29001.00000  2.294529861143e-05
29001.00000  30001.00000  2.077845759585e-05
30001.00000  31001.00000  1.984013804892e-05
31001.00000  32001.00000  1.870835055418e-05
32001.00000  33001.00000  1.783774478899e-05
33001.00000  34001.00000  1.671563069163e-05
34001.00000  35001.00000  1.608685986122e-05
35001.00000  36001.00000  1.536135505689e-05
36001.00000  37001.00000  1.408446660128e-05
37001.00000  38001.00000  1.382328487173e-05
38001.00000  39001.00000  1.248835603177e-05
39001.00000  40001.00000  1.226586789178e-05
40001.00000  41001.00000  1.110506020486e-05
41001.00000  42001.00000  1.032151501619e-05
42001.00000  43001.00000  1.081485828313e-05
43001.00000  44001.00000  1.070845091183e-05
44001.00000  45001.00000  9.547643224908e-06
45001.00000  46001.00000  8.802791625801e-06
46001.00000  47001.00000  8.309448358861e-06
47001.00000  48001.00000  7.999899642349e-06
48001.00000  49001.00000  7.390475606717e-06
49001.00000  50001.00000  8.232061179733e-06
50001.00000  51001.00000  7.197007658897e-06
51001.00000  52001.00000  6.577910225874e-06
52001.00000  53001.00000  6.693990994565e-06
53001.00000  54001.00000  6.055546766760e-06
54001.00000  55001.00000  5.629917281556e-06
55001.00000  56001.00000  5.629917281556e-06
56001.00000  57001.00000  5.910445805895e-06
57001.00000  58001.00000  5.378408949391e-06
58001.00000  59001.00000  4.943106066796e-06
59001.00000  60001.00000  5.010819848533e-06
60001.00000  61001.00000  4.856045490277e-06
61001.00000  62001.00000  4.459436197247e-06
62001.00000  63001.00000  4.565843568548e-06
63001.00000  64001.00000  4.478782992029e-06
64001.00000  65001.00000  3.704911200749e-06
65001.00000  66001.00000  3.395362484238e-06
66001.00000  67001.00000  4.217601262472e-06
67001.00000  68001.00000  3.656544213794e-06
68001.00000  69001.00000  3.453402868584e-06
69001.00000  70001.00000  3.211567933809e-06
70001.00000  71001.00000  2.785938448605e-06
71001.00000  72001.00000  2.911692614688e-06
72001.00000  73001.00000  2.834305435560e-06
73001.00000  74001.00000  3.047120178162e-06
74001.00000  75001.00000  2.902019217297e-06
75001.00000  76001.00000  2.544103513830e-06
76001.00000  77001.00000  2.379655758184e-06
77001.00000  78001.00000  2.437696142530e-06
78001.00000  79001.00000  2.244228194710e-06
79001.00000  80001.00000  2.137820823409e-06
80001.00000  81001.00000  2.195861207755e-06
81001.00000  82001.00000  2.137820823409e-06
82001.00000  83001.00000  2.060433644281e-06
83001.00000  84001.00000  2.079780439063e-06
84001.00000  85001.00000  1.750884927769e-06
85001.00000  86001.00000  1.818598709506e-06
86001.00000  87001.00000  1.934679478198e-06
87001.00000  88001.00000  1.886312491243e-06
88001.00000  89001.00000  1.683171146032e-06
89001.00000  90001.00000  1.654150953859e-06
90001.00000  91001.00000  1.334928839957e-06
91001.00000  92001.00000  1.489703198213e-06
92001.00000  93001.00000  1.421989416476e-06
93001.00000  94001.00000  1.247868263438e-06
94001.00000  95001.00000  1.344602237348e-06
95001.00000  96001.00000  1.373622429521e-06
96001.00000  97001.00000  1.170481084310e-06
97001.00000  98001.00000  1.412316019085e-06
98001.00000  99001.00000  1.170481084310e-06
99001.00000  100001.00000  9.286461495351e-07
100001.00000  101001.00000  1.015706726054e-06
101001.00000  102001.00000  1.054400315618e-06
102001.00000  103001.00000  1.102767302573e-06
103001.00000  104001.00000  8.319121756252e-07
104001.00000  105001.00000  1.015706726054e-06
105001.00000  106001.00000  1.035053520836e-06
106001.00000  107001.00000  1.015706726054e-06
107001.00000  108001.00000  8.706057651891e-07
108001.00000  109001.00000  9.189727521441e-07
109001.00000  110001.00000  9.479929443171e-07
110001.00000  111001.00000  8.609323677982e-07
111001.00000  112001.00000  8.609323677982e-07
112001.00000  113001.00000  7.932185860612e-07
113001.00000  114001.00000  8.802791625801e-07
114001.00000  115001.00000  7.835451886702e-07
115001.00000  116001.00000  7.738717912792e-07
116001.00000  117001.00000  7.448515991063e-07
117001.00000  118001.00000  6.094240356324e-07
118001.00000  119001.00000  7.932185860612e-07
119001.00000  120001.00000  6.771378173693e-07
120001.00000  121001.00000  6.964846121513e-07
121001.00000  122001.00000  6.771378173693e-07
122001.00000  123001.00000  6.771378173693e-07
123001.00000  124001.00000  6.674644199783e-07
124001.00000  125001.00000  4.933432669405e-07
125001.00000  126001.00000  5.417102538955e-07
126001.00000  127001.00000  5.900772408504e-07
127001.00000  128001.00000  5.320368565045e-07
128001.00000  129001.00000  5.030166643315e-07
129001.00000  130001.00000  5.223634591135e-07
130001.00000  131001.00000  4.449762799856e-07
131001.00000  132001.00000  4.449762799856e-07
132001.00000  133001.00000  5.610570486774e-07
133001.00000  134001.00000  6.287708304144e-07
134001.00000  135001.00000  3.869358956396e-07
135001.00000  136001.00000  5.610570486774e-07
136001.00000  137001.00000  4.159560878126e-07
137001.00000  138001.00000  4.062826904216e-07
138001.00000  139001.00000  4.159560878126e-07
139001.00000  140001.00000  3.772624982486e-07
140001.00000  141001.00000  4.353028825946e-07
141001.00000  142001.00000  3.385689086847e-07
142001.00000  143001.00000  3.482423060757e-07
143001.00000  144001.00000  3.288955112937e-07
144001.00000  145001.00000  2.805285243387e-07
145001.00000  146001.00000  3.192221139027e-07
146001.00000  147001.00000  4.546496773766e-07
147001.00000  148001.00000  3.288955112937e-07
148001.00000  149001.00000  3.966092930306e-07
149001.00000  150001.00000  3.385689086847e-07
150001.00000  151001.00000  2.611817295567e-07
151001.00000  152001.00000  1.934679478198e-07
152001.00000  153001.00000  2.611817295567e-07
153001.00000  154001.00000  2.128147426018e-07
154001.00000  155001.00000  3.095487165117e-07
155001.00000  156001.00000  3.192221139027e-07
156001.00000  157001.00000  2.224881399928e-07
157001.00000  158001.00000  1.934679478198e-07
158001.00000  159001.00000  2.611817295567e-07
159001.00000  160001.00000  1.741211530378e-07
160001.00000  161001.00000  2.031413452108e-07
161001.00000  162001.00000  1.451009608649e-07
162001.00000  163001.00000  1.160807686919e-07
163001.00000  164001.00000  1.741211530378e-07
164001.00000  165001.00000  1.547743582558e-07
165001.00000  166001.00000  1.547743582558e-07
166001.00000  167001.00000  6.771378173693e-08
167001.00000  168001.00000  1.064073713009e-07
168001.00000  169001.00000  7.738717912792e-08
169001.00000  170001.00000  8.706057651891e-08
170001.00000  171001.00000  4.836698695495e-08
171001.00000  172001.00000  3.869358956396e-08
172001.00000  173001.00000  8.706057651891e-08
173001.00000  174001.00000  5.804038434594e-08
174001.00000  175001.00000  1.934679478198e-08
175001.00000  176001.00000  4.836698695495e-08
176001.00000  177001.00000  1.934679478198e-08
177001.00000  178001.00000  9.673397390990e-09
178001.00000  179001.00000  3.869358956396e-08
179001.00000  180001.00000  9.673397390990e-09
180001.00000  181001.00000  0.000000000000e+00
181001.00000  182001.00000  2.902019217297e-08
182001.00000  183001.00000  0.000000000000e+00
183001.00000  184001.00000  0.000000000000e+00
184001.00000  185001.00000  0.000000000000e+00
185001.00000  186001.00000  0.000000000000e+00
186001.00000  187001.00000  0.000000000000e+00
187001.00000  188001.00000  0.000000000000e+00
188001.00000  189001.00000  0.000000000000e+00
189001.00000  190001.00000  0.000000000000e+00
190001.00000  191001.00000  0.000000000000e+00
191001.00000  192001.00000  0.000000000000e+00
192001.00000  193001.00000  0.000000000000e+00
193001.00000  194001.00000  0.000000000000e+00
194001.00000  195001.00000  0.000000000000e+00
195001.00000  196001.00000  0.000000000000e+00
196001.00000  197001.00000  0.000000000000e+00
197001.00000  198001.00000  0.000000000000e+00
198001.00000  199001.00000  0.000000000000e+00
