10001.00000  11001.00000  1.977613159765e-04
11001.00000  12001.00000  1.633829985983e-04
12001.00000  13001.00000  1.410615318646e-04
13001.00000  14001.00000  1.206409199622e-04
14001.00000  15001.00000  1.017047851662e-04
15001.00000  16001.00000  8.964793452175e-05
16001.00000  17001.00000  8.039710767591e-05
17001.00000  18001.00000  6.939025303349e-05
18001.00000  19001.00000  6.274631281349e-05
19001.00000  20001.00000  5.579461514459e-05
20001.00000  21001.00000  4.799205864644e-05
21001.00000  22001.00000  4.440758953591e-05
22001.00000  23001.00000  4.167397925466e-05
23001.00000  24001.00000  3.680417021056e-05
24001.00000  25001.00000  3.392573289454e-05
25001.00000  26001.00000  3.044988406009e-05
26001.00000  27001.00000  2.784299743426e-05
27001.00000  28001.00000  2.596024598227e-05
28001.00000  29001.00000  2.367922018466e-05
29001.00000  30001.00000  2.338956611512e-05
30001.00000  31001.00000  2.034819838498e-05
31001.00000  32001.00000  1.947923617637e-05
32001.00000  33001.00000  1.794044893196e-05
33001.00000  34001.00000  1.676372927446e-05
34001.00000  35001.00000  1.714390024073e-05
35001.00000  36001.00000  1.538787244416e-05
36001.00000  37001.00000  1.404822237255e-05
37001.00000  38001.00000  1.301632974983e-05
38001.00000  39001.00000  1.245512499010e-05
39001.00000  40001.00000  1.202064388579e-05
40001.00000  41001.00000  1.062668367614e-05
41001.00000  42001.00000  9.812031605571e-06
42001.00000  43001.00000  9.395653880611e-06
43001.00000  44001.00000  9.232723466497e-06
44001.00000  45001.00000  8.237037602463e-06
45001.00000  46001.00000  8.834449120883e-06
46001.00000  47001.00000  7.874970015541e-06
47001.00000  48001.00000  7.802556498157e-06
48001.00000  49001.00000  6.897387530853e-06
49001.00000  50001.00000  6.879284151507e-06
50001.00000  51001.00000  6.481009805894e-06
51001.00000  52001.00000  5.992218563550e-06
52001.00000  53001.00000  5.231876631015e-06
53001.00000  54001.00000  5.666357735321e-06
54001.00000  55001.00000  5.286186769053e-06
55001.00000  56001.00000  5.050842837554e-06
56001.00000  57001.00000  4.779292147363e-06
57001.00000  58001.00000  4.869809044093e-06
58001.00000  59001.00000  4.996532699516e-06
59001.00000  60001.00000  4.634465112594e-06
60001.00000  61001.00000  3.837916421367e-06
61001.00000  62001.00000  3.982743456136e-06
62001.00000  63001.00000  3.783606283329e-06
63001.00000  64001.00000  3.475848834446e-06
64001.00000  65001.00000  3.475848834446e-06
65001.00000  66001.00000  3.457745455100e-06
66001.00000  67001.00000  3.765502903983e-06
67001.00000  68001.00000  3.095677868178e-06
68001.00000  69001.00000  2.842230557333e-06
69001.00000  70001.00000  3.005160971448e-06
70001.00000  71001.00000  2.570679867142e-06
71001.00000  72001.00000  2.932747454064e-06
72001.00000  73001.00000  2.371542694335e-06
73001.00000  74001.00000  2.697403522565e-06
74001.00000  75001.00000  2.498266349758e-06
75001.00000  76001.00000  2.516369729104e-06
76001.00000  77001.00000  2.154302142183e-06
77001.00000  78001.00000  2.208612280221e-06
78001.00000  79001.00000  2.335335935643e-06
79001.00000  80001.00000  2.226715659567e-06
80001.00000  81001.00000  2.136198762836e-06
81001.00000  82001.00000  1.792234555261e-06
82001.00000  83001.00000  1.991371728068e-06
83001.00000  84001.00000  2.063785245452e-06
84001.00000  85001.00000  1.719821037877e-06
85001.00000  86001.00000  1.756027796569e-06
86001.00000  87001.00000  1.882751451991e-06
87001.00000  88001.00000  1.719821037877e-06
88001.00000  89001.00000  1.339650071609e-06
89001.00000  90001.00000  1.412063588994e-06
90001.00000  91001.00000  1.502580485724e-06
91001.00000  92001.00000  1.176719657495e-06
92001.00000  93001.00000  1.484477106378e-06
93001.00000  94001.00000  1.593097382454e-06
94001.00000  95001.00000  1.140512898803e-06
95001.00000  96001.00000  1.049996002072e-06
96001.00000  97001.00000  1.176719657495e-06
97001.00000  98001.00000  1.249133174879e-06
98001.00000  99001.00000  1.267236554225e-06
99001.00000  100001.00000  1.122409519456e-06
100001.00000  101001.00000  1.068099381418e-06
101001.00000  102001.00000  1.303443312917e-06
102001.00000  103001.00000  8.870655879575e-07
103001.00000  104001.00000  1.086202760764e-06
104001.00000  105001.00000  1.158616278149e-06
105001.00000  106001.00000  7.965486912272e-07
106001.00000  107001.00000  1.049996002072e-06
107001.00000  108001.00000  7.965486912272e-07
108001.00000  109001.00000  8.870655879575e-07
109001.00000  110001.00000  7.784453118811e-07
110001.00000  111001.00000  7.060317944968e-07
111001.00000  112001.00000  9.594791053418e-07
112001.00000  113001.00000  8.870655879575e-07
113001.00000  114001.00000  1.049996002072e-06
114001.00000  115001.00000  6.336182771125e-07
115001.00000  116001.00000  7.060317944968e-07
116001.00000  117001.00000  7.603419325350e-07
117001.00000  118001.00000  8.508588292654e-07
118001.00000  119001.00000  8.327554499193e-07
119001.00000  120001.00000  4.887912423439e-07
120001.00000  121001.00000  7.422385531889e-07
121001.00000  122001.00000  5.068946216900e-07
122001.00000  123001.00000  5.974115184204e-07
123001.00000  124001.00000  4.163777249597e-07
124001.00000  125001.00000  6.155148977664e-07
125001.00000  126001.00000  6.879284151507e-07
126001.00000  127001.00000  6.698250358047e-07
127001.00000  128001.00000  7.241351738429e-07
128001.00000  129001.00000  6.155148977664e-07
129001.00000  130001.00000  4.525844836518e-07
130001.00000  131001.00000  5.793081390743e-07
131001.00000  132001.00000  5.612047597282e-07
132001.00000  133001.00000  4.344811043057e-07
133001.00000  134001.00000  7.060317944968e-07
134001.00000  135001.00000  6.155148977664e-07
135001.00000  136001.00000  4.706878629979e-07
136001.00000  137001.00000  3.801709662675e-07
137001.00000  138001.00000  3.801709662675e-07
138001.00000  139001.00000  5.249980010361e-07
139001.00000  140001.00000  4.887912423439e-07
140001.00000  141001.00000  5.793081390743e-07
141001.00000  142001.00000  2.534473108450e-07
142001.00000  143001.00000  3.620675869214e-07
143001.00000  144001.00000  4.887912423439e-07
144001.00000  145001.00000  3.801709662675e-07
145001.00000  146001.00000  5.249980010361e-07
146001.00000  147001.00000  3.439642075754e-07
147001.00000  148001.00000  2.172405521529e-07
148001.00000  149001.00000  4.525844836518e-07
149001.00000  150001.00000  2.353439314989e-07
150001.00000  151001.00000  3.258608282293e-07
151001.00000  152001.00000  4.163777249597e-07
152001.00000  153001.00000  3.077574488832e-07
153001.00000  154001.00000  3.258608282293e-07
154001.00000  155001.00000  3.258608282293e-07
155001.00000  156001.00000  3.439642075754e-07
156001.00000  157001.00000  3.620675869214e-07
157001.00000  158001.00000  3.258608282293e-07
158001.00000  159001.00000  1.810337934607e-07
159001.00000  160001.00000  2.353439314989e-07
160001.00000  161001.00000  1.991371728068e-07
161001.00000  162001.00000  3.077574488832e-07
162001.00000  163001.00000  2.534473108450e-07
163001.00000  164001.00000  2.353439314989e-07
164001.00000  165001.00000  2.172405521529e-07
165001.00000  166001.00000  1.991371728068e-07
166001.00000  167001.00000  2.534473108450e-07
167001.00000  168001.00000  1.629304141146e-07
168001.00000  169001.00000  2.172405521529e-07
169001.00000  170001.00000  1.448270347686e-07
170001.00000  171001.00000  1.991371728068e-07
171001.00000  172001.00000  2.353439314989e-07
172001.00000  173001.00000  2.715506901911e-07
173001.00000  174001.00000  1.086202760764e-07
174001.00000  175001.00000  1.991371728068e-07
175001.00000  176001.00000  2.172405521529e-07
176001.00000  177001.00000  2.715506901911e-07
177001.00000  178001.00000  3.258608282293e-07
178001.00000  179001.00000  1.810337934607e-07
179001.00000  180001.00000  9.051689673036e-08
180001.00000  181001.00000  1.810337934607e-07
181001.00000  182001.00000  1.991371728068e-07
182001.00000  183001.00000  1.448270347686e-07
183001.00000  184001.00000  1.810337934607e-07
184001.00000  185001.00000  1.810337934607e-07
185001.00000  186001.00000  1.086202760764e-07
186001.00000  187001.00000  1.810337934607e-07
187001.00000  188001.00000  1.448270347686e-07
188001.00000  189001.00000  2.172405521529e-07
189001.00000  190001.00000  1.448270347686e-07
190001.00000  191001.00000  1.629304141146e-07
191001.00000  192001.00000  1.810337934607e-07
192001.00000  193001.00000  1.267236554225e-07
193001.00000  194001.00000  1.086202760764e-07
194001.00000  195001.00000  1.991371728068e-07
195001.00000  196001.00000  2.534473108450e-07
196001.00000  197001.00000  2.353439314989e-07
197001.00000  198001.00000  1.267236554225e-07
198001.00000  199001.00000  1.810337934607e-08
