300.00000  350.00000  1.389907824891e-05
350.00000  400.00000  2.625381447016e-05
400.00000  450.00000  2.432338693559e-05
450.00000  500.00000  3.436161011535e-05
500.00000  550.00000  1.671750244938e-04
550.00000  600.00000  2.432338693559e-05
600.00000  650.00000  6.100151009243e-05
650.00000  700.00000  4.324157677438e-05
700.00000  750.00000  6.022933907860e-05
750.00000  800.00000  4.980503039192e-05
800.00000  850.00000  1.428516375582e-04
850.00000  900.00000  6.524845066848e-05
900.00000  950.00000  7.760318688973e-05
950.00000  1000.00000  8.686923905567e-05
1000.00000  1050.00000  1.104204549774e-04
1050.00000  1100.00000  1.208447636641e-04
1100.00000  1150.00000  1.351299274199e-04
1150.00000  1200.00000  1.617698273970e-04
1200.00000  1250.00000  2.023088056230e-04
1250.00000  1300.00000  2.802980780196e-04
1300.00000  1350.00000  2.057835751852e-04
1350.00000  1400.00000  2.582912041255e-04
1400.00000  1450.00000  3.517238967987e-04
1450.00000  1500.00000  3.775916257620e-04
1500.00000  1550.00000  4.331879387576e-04
1550.00000  1600.00000  4.837651401633e-04
1600.00000  1650.00000  5.277788879516e-04
1650.00000  1700.00000  6.254585212008e-04
1700.00000  1750.00000  7.883866051186e-04
1750.00000  1800.00000  7.339485486437e-04
1800.00000  1850.00000  7.849118355563e-04
1850.00000  1900.00000  7.640632181830e-04
1900.00000  1950.00000  8.026717688744e-04
1950.00000  2000.00000  8.428246615934e-04
2000.00000  2050.00000  9.563338006262e-04
2050.00000  2100.00000  9.841319571240e-04
2100.00000  2150.00000  1.029303961433e-03
2150.00000  2200.00000  1.030848303461e-03
2200.00000  2250.00000  1.059032545465e-03
2250.00000  2300.00000  1.121192312078e-03
2300.00000  2350.00000  1.204586781572e-03
2350.00000  2400.00000  1.148990468576e-03
2400.00000  2450.00000  1.189143361295e-03
2450.00000  2500.00000  1.102274122240e-03
2500.00000  2550.00000  1.077950735304e-03
2550.00000  2600.00000  1.031234388968e-03
2600.00000  2650.00000  1.028531790419e-03
2650.00000  2700.00000  1.002664061456e-03
2700.00000  2750.00000  1.055171690396e-03
2750.00000  2800.00000  1.009613600580e-03
2800.00000  2850.00000  1.016563139705e-03
2850.00000  2900.00000  9.493842615017e-04
2900.00000  2950.00000  9.598085701884e-04
2950.00000  3000.00000  9.528590310640e-04
3000.00000  3050.00000  9.323964991975e-04
3050.00000  3100.00000  8.991931456029e-04
3100.00000  3150.00000  8.783445282295e-04
3150.00000  3200.00000  8.721671601189e-04
3200.00000  3250.00000  8.335586094275e-04
3250.00000  3300.00000  8.003552558329e-04
3300.00000  3350.00000  7.856840065702e-04
3350.00000  3400.00000  7.613606196346e-04
3400.00000  3450.00000  7.331763776298e-04
3450.00000  3500.00000  7.281572660400e-04
3500.00000  3550.00000  6.887765443347e-04
3550.00000  3600.00000  6.876182878140e-04
3600.00000  3650.00000  6.632949008784e-04
3650.00000  3700.00000  6.625227298646e-04
3700.00000  3750.00000  6.185089820764e-04
3750.00000  3800.00000  6.123316139657e-04
3800.00000  3850.00000  5.883943125371e-04
3850.00000  3900.00000  5.818308589195e-04
3900.00000  3950.00000  5.571213864770e-04
3950.00000  4000.00000  5.351145125829e-04
4000.00000  4050.00000  5.370449401175e-04
4050.00000  4100.00000  4.968920473984e-04
4100.00000  4150.00000  5.057720140574e-04
4150.00000  4200.00000  4.760434300251e-04
4200.00000  4250.00000  4.478591880203e-04
4250.00000  4300.00000  4.536504706240e-04
4300.00000  4350.00000  4.219914590571e-04
4350.00000  4400.00000  4.142697489188e-04
4400.00000  4450.00000  4.142697489188e-04
4450.00000  4500.00000  3.768194547481e-04
4500.00000  4550.00000  3.737307706928e-04
4550.00000  4600.00000  3.791359677896e-04
4600.00000  4650.00000  3.474769562227e-04
4650.00000  4700.00000  3.447743576743e-04
4700.00000  4750.00000  3.316474504392e-04
4750.00000  4800.00000  3.200648852318e-04
4800.00000  4850.00000  3.223813982733e-04
4850.00000  4900.00000  3.023049519137e-04
4900.00000  4950.00000  2.949693272824e-04
4950.00000  5000.00000  2.698737693329e-04
5000.00000  5050.00000  2.918806432270e-04
5050.00000  5100.00000  2.706459403468e-04
5100.00000  5150.00000  2.571329476048e-04
5150.00000  5200.00000  2.652407432500e-04
5200.00000  5250.00000  2.571329476048e-04
5250.00000  5300.00000  2.470947244250e-04
5300.00000  5350.00000  2.339678171899e-04
5350.00000  5400.00000  2.374425867522e-04
5400.00000  5450.00000  2.440060403697e-04
5450.00000  5500.00000  2.258600215447e-04
5500.00000  5550.00000  2.081000882267e-04
5550.00000  5600.00000  2.131191998166e-04
5600.00000  5650.00000  2.192965679272e-04
5650.00000  5700.00000  2.019227201161e-04
5700.00000  5750.00000  1.999922925815e-04
5750.00000  5800.00000  1.876375563602e-04
5800.00000  5850.00000  2.077140027198e-04
5850.00000  5900.00000  1.899540694017e-04
5900.00000  5950.00000  1.911123259225e-04
5950.00000  6000.00000  1.714219650699e-04
6000.00000  6050.00000  1.845488723049e-04
6050.00000  6100.00000  1.679471955076e-04
6100.00000  6150.00000  1.729663070975e-04
6150.00000  6200.00000  1.644724259454e-04
6200.00000  6250.00000  1.509594332034e-04
6250.00000  6300.00000  1.833906157842e-04
6300.00000  6350.00000  1.637002549316e-04
6350.00000  6400.00000  7.115555892427e-04
6400.00000  6450.00000  1.486429201619e-04
6450.00000  6500.00000  1.490290056688e-04
6500.00000  6550.00000  1.490290056688e-04
6550.00000  6600.00000  1.339716708992e-04
6600.00000  6650.00000  1.335855853923e-04
6650.00000  6700.00000  1.262499607609e-04
6700.00000  6750.00000  1.443959795859e-04
6750.00000  6800.00000  1.173699941019e-04
6800.00000  6850.00000  1.220030201849e-04
6850.00000  6900.00000  1.239334477194e-04
6900.00000  6950.00000  1.308829868439e-04
6950.00000  7000.00000  1.169839085950e-04
7000.00000  7050.00000  1.038570013599e-04
7050.00000  7100.00000  1.598393998624e-04
7100.00000  7150.00000  9.304660716629e-05
7150.00000  7200.00000  8.995792311098e-05
7200.00000  7250.00000  8.571098253493e-05
7250.00000  7300.00000  9.381877818012e-05
7300.00000  7350.00000  8.185012746579e-05
7350.00000  7400.00000  8.223621297270e-05
7400.00000  7450.00000  8.339446949344e-05
7450.00000  7500.00000  9.845180426309e-05
7500.00000  7550.00000  7.297016080676e-05
7550.00000  7600.00000  7.026756225836e-05
7600.00000  7650.00000  7.181190428602e-05
7650.00000  7700.00000  8.030578543813e-05
7700.00000  7750.00000  7.914752891739e-05
7750.00000  7800.00000  7.103973327219e-05
7800.00000  7850.00000  6.602062168231e-05
7850.00000  7900.00000  7.567275935516e-05
7900.00000  7950.00000  6.833713472379e-05
7950.00000  8000.00000  6.215976661317e-05
8000.00000  8050.00000  6.910930573762e-05
8050.00000  8100.00000  6.756496370996e-05
8100.00000  8150.00000  6.177368110625e-05
8150.00000  8200.00000  6.756496370996e-05
8200.00000  8250.00000  6.872322023071e-05
8250.00000  8300.00000  5.984325357168e-05
8300.00000  8350.00000  6.563453617539e-05
8350.00000  8400.00000  5.134937241957e-05
8400.00000  8450.00000  6.293193762700e-05
8450.00000  8500.00000  5.984325357168e-05
8500.00000  8550.00000  5.443805647489e-05
8550.00000  8600.00000  5.521022748871e-05
8600.00000  8650.00000  5.559631299563e-05
8650.00000  8700.00000  5.250762894032e-05
8700.00000  8750.00000  5.134937241957e-05
8750.00000  8800.00000  5.945716806477e-05
8800.00000  8850.00000  4.594417532278e-05
8850.00000  8900.00000  4.980503039192e-05
8900.00000  8950.00000  5.636848400946e-05
8950.00000  9000.00000  5.250762894032e-05
9000.00000  9050.00000  4.941894488500e-05
9050.00000  9100.00000  4.980503039192e-05
9100.00000  9150.00000  5.057720140574e-05
9150.00000  9200.00000  5.405197096797e-05
9200.00000  9250.00000  5.289371444723e-05
9250.00000  9300.00000  4.710243184352e-05
9300.00000  9350.00000  4.517200430895e-05
9350.00000  9400.00000  4.401374778821e-05
9400.00000  9450.00000  4.787460285735e-05
9450.00000  9500.00000  4.131114923981e-05
9500.00000  9550.00000  4.246940576055e-05
9550.00000  9600.00000  4.633026082969e-05
9600.00000  9650.00000  4.555808981586e-05
9650.00000  9700.00000  4.517200430895e-05
9700.00000  9750.00000  4.941894488500e-05
9750.00000  9800.00000  4.517200430895e-05
9800.00000  9850.00000  4.246940576055e-05
9850.00000  9900.00000  4.015289271906e-05
9900.00000  9950.00000  4.285549126746e-05
9950.00000  10000.00000  3.822246518449e-05
