300.00000  350.00000  7.515337596863e-05
350.00000  400.00000  8.338446000329e-05
400.00000  450.00000  6.226994008829e-05
450.00000  500.00000  5.296523639694e-05
500.00000  550.00000  5.224948995914e-05
550.00000  600.00000  2.505112532288e-05
600.00000  650.00000  2.791411107406e-05
650.00000  700.00000  2.397750566618e-05
700.00000  750.00000  1.896728060161e-05
750.00000  800.00000  2.075664669610e-05
800.00000  850.00000  2.970347716855e-05
850.00000  900.00000  1.324130909923e-05
900.00000  950.00000  1.610429485042e-05
950.00000  1000.00000  1.288343588034e-05
1000.00000  1050.00000  1.610429485042e-05
1050.00000  1100.00000  1.538854841262e-05
1100.00000  1150.00000  1.467280197483e-05
1150.00000  1200.00000  1.324130909923e-05
1200.00000  1250.00000  1.431492875593e-05
1250.00000  1300.00000  2.111451991500e-05
1300.00000  1350.00000  8.946830472456e-06
1350.00000  1400.00000  1.860940738271e-05
1400.00000  1450.00000  1.932515382050e-05
1450.00000  1500.00000  2.361963244728e-05
1500.00000  1550.00000  2.290388600949e-05
1550.00000  1600.00000  3.650306832762e-05
1600.00000  1650.00000  4.616564523787e-05
1650.00000  1700.00000  4.795501133236e-05
1700.00000  1750.00000  9.340491013244e-05
1750.00000  1800.00000  7.801636171982e-05
1800.00000  1850.00000  9.340491013244e-05
1850.00000  1900.00000  9.054192438125e-05
1900.00000  1950.00000  9.304703691354e-05
1950.00000  2000.00000  1.206032747687e-04
2000.00000  2050.00000  1.324130909923e-04
2050.00000  2100.00000  1.596114556286e-04
2100.00000  2150.00000  1.621165681609e-04
2150.00000  2200.00000  1.753578772601e-04
2200.00000  2250.00000  1.796523558869e-04
2250.00000  2300.00000  2.122188188067e-04
2300.00000  2350.00000  2.465746478209e-04
2350.00000  2400.00000  2.419222959752e-04
2400.00000  2450.00000  2.365541976917e-04
2450.00000  2500.00000  2.243865082492e-04
2500.00000  2550.00000  2.186605367468e-04
2550.00000  2600.00000  2.118609455878e-04
2600.00000  2650.00000  2.426380424130e-04
2650.00000  2700.00000  2.433537888508e-04
2700.00000  2750.00000  2.326175922839e-04
2750.00000  2800.00000  2.293967333138e-04
2800.00000  2850.00000  2.390593102240e-04
2850.00000  2900.00000  2.426380424130e-04
2900.00000  2950.00000  2.422801691941e-04
2950.00000  3000.00000  2.369120709106e-04
3000.00000  3050.00000  2.361963244728e-04
3050.00000  3100.00000  2.261758743437e-04
3100.00000  3150.00000  2.172290438712e-04
3150.00000  3200.00000  2.168711706523e-04
3200.00000  3250.00000  2.147239313389e-04
3250.00000  3300.00000  2.007668758019e-04
3300.00000  3350.00000  2.075664669610e-04
3350.00000  3400.00000  2.075664669610e-04
3400.00000  3450.00000  2.097137062744e-04
3450.00000  3500.00000  2.043456079909e-04
3500.00000  3550.00000  1.925357917673e-04
3550.00000  3600.00000  1.803681023247e-04
3600.00000  3650.00000  1.989775097074e-04
3650.00000  3700.00000  1.993353829263e-04
3700.00000  3750.00000  1.911042988917e-04
3750.00000  3800.00000  1.925357917673e-04
3800.00000  3850.00000  1.878834399216e-04
3850.00000  3900.00000  1.939672846428e-04
3900.00000  3950.00000  1.753578772601e-04
3950.00000  4000.00000  1.821574684192e-04
4000.00000  4050.00000  1.746421308223e-04
4050.00000  4100.00000  1.610429485042e-04
4100.00000  4150.00000  1.513803715940e-04
4150.00000  4200.00000  1.474437661861e-04
4200.00000  4250.00000  1.488752590617e-04
4250.00000  4300.00000  1.463701465294e-04
4300.00000  4350.00000  1.553169770018e-04
4350.00000  4400.00000  1.560327234396e-04
4400.00000  4450.00000  1.438650339971e-04
4450.00000  4500.00000  1.481595126239e-04
4500.00000  4550.00000  1.417177946837e-04
4550.00000  4600.00000  1.263292462711e-04
4600.00000  4650.00000  1.316973445546e-04
4650.00000  4700.00000  1.499488787184e-04
4700.00000  4750.00000  1.263292462711e-04
4750.00000  4800.00000  1.256134998333e-04
4800.00000  4850.00000  1.177402890175e-04
4850.00000  4900.00000  1.263292462711e-04
4900.00000  4950.00000  1.234662605199e-04
4950.00000  5000.00000  1.120143175151e-04
5000.00000  5050.00000  1.245398801766e-04
5050.00000  5100.00000  1.248977533955e-04
5100.00000  5150.00000  1.191717818931e-04
5150.00000  5200.00000  1.198875283309e-04
5200.00000  5250.00000  1.223926408632e-04
5250.00000  5300.00000  1.177402890175e-04
5300.00000  5350.00000  1.105828246396e-04
5350.00000  5400.00000  1.198875283309e-04
5400.00000  5450.00000  1.223926408632e-04
5450.00000  5500.00000  1.202454015498e-04
5500.00000  5550.00000  1.163087961419e-04
5550.00000  5600.00000  1.052147263561e-04
5600.00000  5650.00000  9.984662807261e-05
5650.00000  5700.00000  1.044989799183e-04
5700.00000  5750.00000  1.027096138238e-04
5750.00000  5800.00000  1.009202477293e-04
5800.00000  5850.00000  9.698364232142e-05
5850.00000  5900.00000  1.066462192317e-04
5900.00000  5950.00000  1.048568531372e-04
5950.00000  6000.00000  9.948875485371e-05
6000.00000  6050.00000  9.555214944583e-05
6050.00000  6100.00000  8.696319219227e-05
6100.00000  6150.00000  1.041411066994e-04
6150.00000  6200.00000  1.037832334805e-04
6200.00000  6250.00000  1.109406978585e-04
6250.00000  6300.00000  1.238241337388e-04
6300.00000  6350.00000  1.359918231813e-04
6350.00000  6400.00000  8.012781371132e-04
6400.00000  6450.00000  9.662576910252e-05
6450.00000  6500.00000  8.588957253558e-05
6500.00000  6550.00000  9.089979760015e-05
6550.00000  6600.00000  8.660531897337e-05
6600.00000  6650.00000  8.266871356549e-05
6650.00000  6700.00000  9.018405116236e-05
6700.00000  6750.00000  8.553169931668e-05
6750.00000  6800.00000  8.445807965998e-05
6800.00000  6850.00000  8.338446000329e-05
6850.00000  6900.00000  7.980572781431e-05
6900.00000  6950.00000  8.982617794346e-05
6950.00000  7000.00000  7.944785459541e-05
7000.00000  7050.00000  8.767893863007e-05
7050.00000  7100.00000  1.417177946837e-04
7100.00000  7150.00000  4.902863098906e-05
7150.00000  7200.00000  5.224948995914e-05
7200.00000  7250.00000  5.869120789931e-05
7250.00000  7300.00000  5.940695433711e-05
7300.00000  7350.00000  4.867075777016e-05
7350.00000  7400.00000  5.582822214813e-05
7400.00000  7450.00000  5.153374352135e-05
7450.00000  7500.00000  7.586912240643e-05
7500.00000  7550.00000  4.437627914338e-05
7550.00000  7600.00000  5.189161674024e-05
7600.00000  7650.00000  5.046012386465e-05
7650.00000  7700.00000  4.401840592448e-05
7700.00000  7750.00000  5.224948995914e-05
7750.00000  7800.00000  4.616564523787e-05
7800.00000  7850.00000  4.151329339220e-05
7850.00000  7900.00000  4.902863098906e-05
7900.00000  7950.00000  4.330265948669e-05
7950.00000  8000.00000  4.043967373550e-05
8000.00000  8050.00000  4.974437742685e-05
8050.00000  8100.00000  4.902863098906e-05
8100.00000  8150.00000  4.187116661109e-05
8150.00000  8200.00000  5.153374352135e-05
8200.00000  8250.00000  4.616564523787e-05
8250.00000  8300.00000  4.688139167567e-05
8300.00000  8350.00000  4.938650420796e-05
8350.00000  8400.00000  4.867075777016e-05
8400.00000  8450.00000  4.867075777016e-05
8450.00000  8500.00000  5.368098283474e-05
8500.00000  8550.00000  4.688139167567e-05
8550.00000  8600.00000  4.258691304889e-05
8600.00000  8650.00000  3.936605407881e-05
8650.00000  8700.00000  4.688139167567e-05
8700.00000  8750.00000  4.509202558118e-05
8750.00000  8800.00000  3.793456120321e-05
8800.00000  8850.00000  3.936605407881e-05
8850.00000  8900.00000  4.330265948669e-05
8900.00000  8950.00000  4.294478626779e-05
8950.00000  9000.00000  3.829243442211e-05
9000.00000  9050.00000  3.757668798431e-05
9050.00000  9100.00000  4.008180051660e-05
9100.00000  9150.00000  3.650306832762e-05
9150.00000  9200.00000  3.471370223313e-05
9200.00000  9250.00000  3.936605407881e-05
9250.00000  9300.00000  4.043967373550e-05
9300.00000  9350.00000  4.079754695440e-05
9350.00000  9400.00000  3.900818085991e-05
9400.00000  9450.00000  3.936605407881e-05
9450.00000  9500.00000  3.578732188982e-05
9500.00000  9550.00000  3.435582901423e-05
9550.00000  9600.00000  3.829243442211e-05
9600.00000  9650.00000  3.471370223313e-05
9650.00000  9700.00000  3.507157545203e-05
9700.00000  9750.00000  3.829243442211e-05
9750.00000  9800.00000  3.364008257643e-05
9800.00000  9850.00000  3.721881476542e-05
9850.00000  9900.00000  4.043967373550e-05
9900.00000  9950.00000  3.542944867093e-05
9950.00000  10000.00000  3.328220935754e-05
