300.00000  350.00000  1.234061312619e-05
350.00000  400.00000  3.048857360588e-05
400.00000  450.00000  2.105163415644e-05
450.00000  500.00000  2.540714467156e-05
500.00000  550.00000  1.894647074079e-04
550.00000  600.00000  1.851091968928e-05
600.00000  650.00000  4.754765645678e-05
650.00000  700.00000  2.685898150994e-05
700.00000  750.00000  4.246622752247e-05
750.00000  800.00000  3.230336965385e-05
800.00000  850.00000  1.070729668302e-04
850.00000  900.00000  2.649602230035e-05
900.00000  950.00000  2.105163415644e-05
950.00000  1000.00000  2.758489992913e-05
1000.00000  1050.00000  2.322938941400e-05
1050.00000  1100.00000  2.214051178522e-05
1100.00000  1150.00000  2.395530783319e-05
1150.00000  1200.00000  2.540714467156e-05
1200.00000  1250.00000  2.322938941400e-05
1250.00000  1300.00000  7.912510769144e-05
1300.00000  1350.00000  3.157745123466e-05
1350.00000  1400.00000  3.411816570181e-05
1400.00000  1450.00000  3.375520649222e-05
1450.00000  1500.00000  4.536990119922e-05
1500.00000  1550.00000  2.903673676750e-05
1550.00000  1600.00000  3.629592095938e-05
1600.00000  1650.00000  3.665888016897e-05
1650.00000  1700.00000  3.048857360588e-05
1700.00000  1750.00000  1.070729668302e-04
1750.00000  1800.00000  3.266632886344e-05
1800.00000  1850.00000  4.210326831288e-05
1850.00000  1900.00000  3.702183937856e-05
1900.00000  1950.00000  3.520704333060e-05
1950.00000  2000.00000  4.028847226491e-05
2000.00000  2050.00000  4.028847226491e-05
2050.00000  2100.00000  4.536990119922e-05
2100.00000  2150.00000  3.847367621694e-05
2150.00000  2200.00000  4.282918673206e-05
2200.00000  2250.00000  4.210326831288e-05
2250.00000  2300.00000  4.682173803760e-05
2300.00000  2350.00000  1.194135799563e-04
2350.00000  2400.00000  3.484408412100e-05
2400.00000  2450.00000  3.992551305531e-05
2450.00000  2500.00000  4.827357487597e-05
2500.00000  2550.00000  4.391806436085e-05
2550.00000  2600.00000  3.956255384572e-05
2600.00000  2650.00000  4.500694198963e-05
2650.00000  2700.00000  4.355510515125e-05
2700.00000  2750.00000  4.791061566638e-05
2750.00000  2800.00000  4.936245250475e-05
2800.00000  2850.00000  4.936245250475e-05
2850.00000  2900.00000  5.154020776232e-05
2900.00000  2950.00000  4.827357487597e-05
2950.00000  3000.00000  7.150296428997e-05
3000.00000  3050.00000  4.682173803760e-05
3050.00000  3100.00000  4.791061566638e-05
3100.00000  3150.00000  4.573286040881e-05
3150.00000  3200.00000  5.081428934313e-05
3200.00000  3250.00000  4.936245250475e-05
3250.00000  3300.00000  5.807347353500e-05
3300.00000  3350.00000  4.500694198963e-05
3350.00000  3400.00000  4.863653408556e-05
3400.00000  3450.00000  4.645877882800e-05
3450.00000  3500.00000  5.262908539110e-05
3500.00000  3550.00000  4.899949329516e-05
3550.00000  3600.00000  4.899949329516e-05
3600.00000  3650.00000  5.226612618150e-05
3650.00000  3700.00000  8.602133267372e-05
3700.00000  3750.00000  4.246622752247e-05
3750.00000  3800.00000  5.045133013353e-05
3800.00000  3850.00000  5.553275906785e-05
3850.00000  3900.00000  5.408092222947e-05
3900.00000  3950.00000  5.117724855272e-05
3950.00000  4000.00000  5.589571827744e-05
4000.00000  4050.00000  6.025122879257e-05
4050.00000  4100.00000  4.791061566638e-05
4100.00000  4150.00000  4.428102357044e-05
4150.00000  4200.00000  5.807347353500e-05
4200.00000  4250.00000  5.662163669663e-05
4250.00000  4300.00000  4.899949329516e-05
4300.00000  4350.00000  5.843643274460e-05
4350.00000  4400.00000  5.879939195419e-05
4400.00000  4450.00000  5.807347353500e-05
4450.00000  4500.00000  5.335500381028e-05
4500.00000  4550.00000  5.879939195419e-05
4550.00000  4600.00000  6.061418800216e-05
4600.00000  4650.00000  5.408092222947e-05
4650.00000  4700.00000  5.262908539110e-05
4700.00000  4750.00000  5.480684064866e-05
4750.00000  4800.00000  6.025122879257e-05
4800.00000  4850.00000  5.516979985825e-05
4850.00000  4900.00000  5.734755511582e-05
4900.00000  4950.00000  4.682173803760e-05
4950.00000  5000.00000  5.916235116378e-05
5000.00000  5050.00000  5.480684064866e-05
5050.00000  5100.00000  6.206602484053e-05
5100.00000  5150.00000  5.335500381028e-05
5150.00000  5200.00000  6.315490246932e-05
5200.00000  5250.00000  6.460673930769e-05
5250.00000  5300.00000  6.351786167891e-05
5300.00000  5350.00000  6.170306563094e-05
5350.00000  5400.00000  7.114000508038e-05
5400.00000  5450.00000  7.005112745160e-05
5450.00000  5500.00000  5.226612618150e-05
5500.00000  5550.00000  5.299204460069e-05
5550.00000  5600.00000  5.480684064866e-05
5600.00000  5650.00000  5.625867748703e-05
5650.00000  5700.00000  6.242898405013e-05
5700.00000  5750.00000  6.388082088850e-05
5750.00000  5800.00000  5.516979985825e-05
5800.00000  5850.00000  5.589571827744e-05
5850.00000  5900.00000  6.714745377485e-05
5900.00000  5950.00000  6.460673930769e-05
5950.00000  6000.00000  5.879939195419e-05
6000.00000  6050.00000  5.698459590622e-05
6050.00000  6100.00000  5.988826958297e-05
6100.00000  6150.00000  6.605857614607e-05
6150.00000  6200.00000  6.968816824200e-05
6200.00000  6250.00000  6.605857614607e-05
6250.00000  6300.00000  1.186876615372e-04
6300.00000  6350.00000  1.012656194767e-04
6350.00000  6400.00000  8.765464911689e-04
6400.00000  6450.00000  7.005112745160e-05
6450.00000  6500.00000  6.170306563094e-05
6500.00000  6550.00000  5.589571827744e-05
6550.00000  6600.00000  5.625867748703e-05
6600.00000  6650.00000  6.025122879257e-05
6650.00000  6700.00000  5.662163669663e-05
6700.00000  6750.00000  5.843643274460e-05
6750.00000  6800.00000  5.299204460069e-05
6800.00000  6850.00000  6.424378009810e-05
6850.00000  6900.00000  5.662163669663e-05
6900.00000  6950.00000  6.025122879257e-05
6950.00000  7000.00000  6.642153535566e-05
7000.00000  7050.00000  6.351786167891e-05
7050.00000  7100.00000  1.466355206759e-04
7100.00000  7150.00000  3.702183937856e-05
7150.00000  7200.00000  3.484408412100e-05
7200.00000  7250.00000  3.411816570181e-05
7250.00000  7300.00000  3.484408412100e-05
7300.00000  7350.00000  2.613306309075e-05
7350.00000  7400.00000  4.174030910328e-05
7400.00000  7450.00000  3.339224728263e-05
7450.00000  7500.00000  6.968816824200e-05
7500.00000  7550.00000  3.448112491141e-05
7550.00000  7600.00000  3.665888016897e-05
7600.00000  7650.00000  4.319214594166e-05
7650.00000  7700.00000  3.302928807303e-05
7700.00000  7750.00000  4.137734989369e-05
7750.00000  7800.00000  3.774775779775e-05
7800.00000  7850.00000  3.375520649222e-05
7850.00000  7900.00000  3.339224728263e-05
7900.00000  7950.00000  3.702183937856e-05
7950.00000  8000.00000  3.085153281547e-05
8000.00000  8050.00000  2.867377755791e-05
8050.00000  8100.00000  3.557000254019e-05
8100.00000  8150.00000  3.702183937856e-05
8150.00000  8200.00000  3.230336965385e-05
8200.00000  8250.00000  4.101439068410e-05
8250.00000  8300.00000  3.992551305531e-05
8300.00000  8350.00000  3.339224728263e-05
8350.00000  8400.00000  3.811071700735e-05
8400.00000  8450.00000  3.593296174978e-05
8450.00000  8500.00000  3.665888016897e-05
8500.00000  8550.00000  3.702183937856e-05
8550.00000  8600.00000  3.375520649222e-05
8600.00000  8650.00000  3.048857360588e-05
8650.00000  8700.00000  3.811071700735e-05
8700.00000  8750.00000  3.339224728263e-05
8750.00000  8800.00000  3.157745123466e-05
8800.00000  8850.00000  3.484408412100e-05
8850.00000  8900.00000  3.774775779775e-05
8900.00000  8950.00000  3.448112491141e-05
8950.00000  9000.00000  3.302928807303e-05
9000.00000  9050.00000  3.339224728263e-05
9050.00000  9100.00000  3.411816570181e-05
9100.00000  9150.00000  3.919959463613e-05
9150.00000  9200.00000  4.428102357044e-05
9200.00000  9250.00000  3.448112491141e-05
9250.00000  9300.00000  2.903673676750e-05
9300.00000  9350.00000  3.375520649222e-05
9350.00000  9400.00000  3.121449202506e-05
9400.00000  9450.00000  2.758489992913e-05
9450.00000  9500.00000  2.976265518669e-05
9500.00000  9550.00000  2.939969597710e-05
9550.00000  9600.00000  2.867377755791e-05
9600.00000  9650.00000  3.375520649222e-05
9650.00000  9700.00000  3.847367621694e-05
9700.00000  9750.00000  2.939969597710e-05
9750.00000  9800.00000  3.448112491141e-05
9800.00000  9850.00000  3.702183937856e-05
9850.00000  9900.00000  3.157745123466e-05
9900.00000  9950.00000  3.085153281547e-05
9950.00000  10000.00000  3.230336965385e-05
