300.00000  350.00000  4.810844251723e-05
350.00000  400.00000  6.966102476495e-05
400.00000  450.00000  4.118082679475e-05
450.00000  500.00000  5.003278021792e-05
500.00000  550.00000  2.948085357456e-04
550.00000  600.00000  3.810188647365e-05
600.00000  650.00000  8.390112375005e-05
650.00000  700.00000  3.117427075117e-05
700.00000  750.00000  6.696695198398e-05
750.00000  800.00000  3.502294615254e-05
800.00000  850.00000  1.805028763246e-04
850.00000  900.00000  4.002622417434e-05
900.00000  950.00000  3.887162155392e-05
950.00000  1000.00000  3.964135663420e-05
1000.00000  1050.00000  4.772357497709e-05
1050.00000  1100.00000  4.233542941516e-05
1100.00000  1150.00000  4.964791267778e-05
1150.00000  1200.00000  5.157225037847e-05
1200.00000  1250.00000  5.003278021792e-05
1250.00000  1300.00000  1.485588704932e-04
1300.00000  1350.00000  4.502950219613e-05
1350.00000  1400.00000  4.810844251723e-05
1400.00000  1450.00000  5.041764775806e-05
1450.00000  1500.00000  6.696695198398e-05
1500.00000  1550.00000  5.619066086013e-05
1550.00000  1600.00000  6.850642214454e-05
1600.00000  1650.00000  6.427287920302e-05
1650.00000  1700.00000  7.350970016633e-05
1700.00000  1750.00000  2.251475109806e-04
1750.00000  1800.00000  7.004589230509e-05
1800.00000  1850.00000  7.273996508605e-05
1850.00000  1900.00000  8.851953423170e-05
1900.00000  1950.00000  7.928271326840e-05
1950.00000  2000.00000  7.851297818812e-05
2000.00000  2050.00000  7.658864048743e-05
2050.00000  2100.00000  8.236165358950e-05
2100.00000  2150.00000  8.428599129019e-05
2150.00000  2200.00000  8.313138866977e-05
2200.00000  2250.00000  8.621032899088e-05
2250.00000  2300.00000  8.582546145074e-05
2300.00000  2350.00000  2.763348938190e-04
2350.00000  2400.00000  1.012201630563e-04
2400.00000  2450.00000  1.039142358372e-04
2450.00000  2500.00000  1.000655604358e-04
2500.00000  2550.00000  9.082873947253e-05
2550.00000  2600.00000  9.121360701267e-05
2600.00000  2650.00000  9.082873947253e-05
2650.00000  2700.00000  9.236820963308e-05
2700.00000  2750.00000  8.967413685212e-05
2750.00000  2800.00000  9.737148765487e-05
2800.00000  2850.00000  9.236820963308e-05
2850.00000  2900.00000  8.890440177184e-05
2900.00000  2950.00000  9.390767979363e-05
2950.00000  3000.00000  1.477891354129e-04
3000.00000  3050.00000  9.467741487391e-05
3050.00000  3100.00000  9.121360701267e-05
3100.00000  3150.00000  9.121360701267e-05
3150.00000  3200.00000  1.081477787787e-04
3200.00000  3250.00000  8.851953423170e-05
3250.00000  3300.00000  8.774979915143e-05
3300.00000  3350.00000  9.159847455281e-05
3350.00000  3400.00000  8.274652112964e-05
3400.00000  3450.00000  9.621688503446e-05
3450.00000  3500.00000  1.081477787787e-04
3500.00000  3550.00000  9.429254733377e-05
3550.00000  3600.00000  8.736493161129e-05
3600.00000  3650.00000  8.813466669157e-05
3650.00000  3700.00000  1.316246987271e-04
3700.00000  3750.00000  9.506228241405e-05
3750.00000  3800.00000  8.582546145074e-05
3800.00000  3850.00000  1.019898981365e-04
3850.00000  3900.00000  9.660175257460e-05
3900.00000  3950.00000  9.429254733377e-05
3950.00000  4000.00000  9.121360701267e-05
4000.00000  4050.00000  9.082873947253e-05
4050.00000  4100.00000  8.736493161129e-05
4100.00000  4150.00000  8.313138866977e-05
4150.00000  4200.00000  8.467085883033e-05
4200.00000  4250.00000  8.659519653102e-05
4250.00000  4300.00000  7.581890540716e-05
4300.00000  4350.00000  7.966758080853e-05
4350.00000  4400.00000  8.813466669157e-05
4400.00000  4450.00000  9.352281225350e-05
4450.00000  4500.00000  8.351625620991e-05
4500.00000  4550.00000  8.467085883033e-05
4550.00000  4600.00000  7.120049492550e-05
4600.00000  4650.00000  7.043075984523e-05
4650.00000  4700.00000  8.082218342895e-05
4700.00000  4750.00000  7.812811064798e-05
4750.00000  4800.00000  8.390112375005e-05
4800.00000  4850.00000  7.081562738536e-05
4850.00000  4900.00000  7.235509754591e-05
4900.00000  4950.00000  7.312483262619e-05
4950.00000  5000.00000  7.581890540716e-05
5000.00000  5050.00000  8.505572637046e-05
5050.00000  5100.00000  7.350970016633e-05
5100.00000  5150.00000  8.043731588881e-05
5150.00000  5200.00000  7.966758080853e-05
5200.00000  5250.00000  7.812811064798e-05
5250.00000  5300.00000  7.197023000578e-05
5300.00000  5350.00000  7.581890540716e-05
5350.00000  5400.00000  6.889128968467e-05
5400.00000  5450.00000  7.851297818812e-05
5450.00000  5500.00000  7.658864048743e-05
5500.00000  5550.00000  7.504917032688e-05
5550.00000  5600.00000  6.350314412274e-05
5600.00000  5650.00000  7.235509754591e-05
5650.00000  5700.00000  6.311827658261e-05
5700.00000  5750.00000  6.581234936357e-05
5750.00000  5800.00000  7.043075984523e-05
5800.00000  5850.00000  6.966102476495e-05
5850.00000  5900.00000  6.042420380164e-05
5900.00000  5950.00000  7.004589230509e-05
5950.00000  6000.00000  7.812811064798e-05
6000.00000  6050.00000  5.041764775806e-05
6050.00000  6100.00000  6.850642214454e-05
6100.00000  6150.00000  6.119393888192e-05
6150.00000  6200.00000  5.811499856081e-05
6200.00000  6250.00000  6.619721690371e-05
6250.00000  6300.00000  8.197678604936e-05
6300.00000  6350.00000  7.504917032688e-05
6350.00000  6400.00000  6.281038255050e-04
6400.00000  6450.00000  5.542092577985e-05
6450.00000  6500.00000  6.812155460440e-05
6500.00000  6550.00000  5.542092577985e-05
6550.00000  6600.00000  5.619066086013e-05
6600.00000  6650.00000  5.157225037847e-05
6650.00000  6700.00000  6.157880642206e-05
6700.00000  6750.00000  5.657552840026e-05
6750.00000  6800.00000  5.696039594040e-05
6800.00000  6850.00000  5.657552840026e-05
6850.00000  6900.00000  5.580579331999e-05
6900.00000  6950.00000  6.311827658261e-05
6950.00000  7000.00000  4.772357497709e-05
7000.00000  7050.00000  5.311172053902e-05
7050.00000  7100.00000  1.054537059978e-04
7100.00000  7150.00000  4.310516449544e-05
7150.00000  7200.00000  3.925648909406e-05
7200.00000  7250.00000  4.118082679475e-05
7250.00000  7300.00000  3.694728385323e-05
7300.00000  7350.00000  3.540781369268e-05
7350.00000  7400.00000  3.463807861241e-05
7400.00000  7450.00000  4.002622417434e-05
7450.00000  7500.00000  6.196367396219e-05
7500.00000  7550.00000  3.887162155392e-05
7550.00000  7600.00000  3.271374091172e-05
7600.00000  7650.00000  3.694728385323e-05
7650.00000  7700.00000  3.617754877296e-05
7700.00000  7750.00000  3.617754877296e-05
7750.00000  7800.00000  3.733215139337e-05
7800.00000  7850.00000  3.771701893351e-05
7850.00000  7900.00000  4.002622417434e-05
7900.00000  7950.00000  3.463807861241e-05
7950.00000  8000.00000  3.232887337158e-05
8000.00000  8050.00000  3.117427075117e-05
8050.00000  8100.00000  4.156569433489e-05
8100.00000  8150.00000  3.040453567089e-05
8150.00000  8200.00000  3.771701893351e-05
8200.00000  8250.00000  3.194400583144e-05
8250.00000  8300.00000  3.155913829130e-05
8300.00000  8350.00000  2.886506551034e-05
8350.00000  8400.00000  3.694728385323e-05
8400.00000  8450.00000  3.348347599199e-05
8450.00000  8500.00000  3.694728385323e-05
8500.00000  8550.00000  3.194400583144e-05
8550.00000  8600.00000  3.309860845185e-05
8600.00000  8650.00000  3.155913829130e-05
8650.00000  8700.00000  2.886506551034e-05
8700.00000  8750.00000  3.117427075117e-05
8750.00000  8800.00000  1.924337700689e-05
8800.00000  8850.00000  2.963480059061e-05
8850.00000  8900.00000  2.501639010896e-05
8900.00000  8950.00000  2.732559534979e-05
8950.00000  9000.00000  2.732559534979e-05
9000.00000  9050.00000  2.501639010896e-05
9050.00000  9100.00000  2.578612518924e-05
9100.00000  9150.00000  2.424665502868e-05
9150.00000  9200.00000  2.463152256882e-05
9200.00000  9250.00000  2.617099272937e-05
9250.00000  9300.00000  2.924993305048e-05
9300.00000  9350.00000  3.078940321103e-05
9350.00000  9400.00000  3.194400583144e-05
9400.00000  9450.00000  2.424665502868e-05
9450.00000  9500.00000  3.001966813075e-05
9500.00000  9550.00000  2.501639010896e-05
9550.00000  9600.00000  2.924993305048e-05
9600.00000  9650.00000  2.270718486813e-05
9650.00000  9700.00000  2.424665502868e-05
9700.00000  9750.00000  2.655586026951e-05
9750.00000  9800.00000  2.501639010896e-05
9800.00000  9850.00000  2.578612518924e-05
9850.00000  9900.00000  2.232231732799e-05
9900.00000  9950.00000  2.309205240827e-05
9950.00000  10000.00000  2.232231732799e-05
