300.00000  350.00000  7.001740840564e-02
350.00000  400.00000  5.238982548088e-02
400.00000  450.00000  4.089956050414e-02
450.00000  500.00000  3.253485984261e-02
500.00000  550.00000  2.662977720599e-02
550.00000  600.00000  2.213002579980e-02
600.00000  650.00000  1.878760599513e-02
650.00000  700.00000  1.608806274785e-02
700.00000  750.00000  1.390951096903e-02
750.00000  800.00000  1.194435421973e-02
800.00000  850.00000  1.065244917617e-02
850.00000  900.00000  9.442057188923e-03
900.00000  950.00000  8.384694430054e-03
950.00000  1000.00000  7.564565424721e-03
1000.00000  1050.00000  6.812876627052e-03
1050.00000  1100.00000  6.232672844095e-03
1100.00000  1150.00000  5.663234936501e-03
1150.00000  1200.00000  5.274125441237e-03
1200.00000  1250.00000  4.746982043997e-03
1250.00000  1300.00000  4.424774774204e-03
1300.00000  1350.00000  4.054890056374e-03
1350.00000  1400.00000  3.793048587723e-03
1400.00000  1450.00000  3.492373068656e-03
1450.00000  1500.00000  3.281669507980e-03
1500.00000  1550.00000  2.983685457753e-03
1550.00000  1600.00000  2.877564686318e-03
1600.00000  1650.00000  2.687239389721e-03
1650.00000  1700.00000  2.487301704408e-03
1700.00000  1750.00000  2.428473885460e-03
1750.00000  1800.00000  2.237379597766e-03
1800.00000  1850.00000  2.145100666083e-03
1850.00000  1900.00000  2.057820176533e-03
1900.00000  1950.00000  1.911711868035e-03
1950.00000  2000.00000  1.802899627758e-03
2000.00000  2050.00000  1.725616022474e-03
2050.00000  2100.00000  1.660251779198e-03
2100.00000  2150.00000  1.532983752585e-03
2150.00000  2200.00000  1.491458233328e-03
2200.00000  2250.00000  1.442627298646e-03
2250.00000  2300.00000  1.336506527210e-03
2300.00000  2350.00000  1.313821289838e-03
2350.00000  2400.00000  1.196934643039e-03
2400.00000  2450.00000  1.181170325543e-03
2450.00000  2500.00000  1.156178114879e-03
2500.00000  2550.00000  1.122727002144e-03
2550.00000  2600.00000  1.005455859797e-03
2600.00000  2650.00000  1.021989168390e-03
2650.00000  2700.00000  1.015837239611e-03
2700.00000  2750.00000  9.397071209727e-04
2750.00000  2800.00000  9.477815274950e-04
2800.00000  2850.00000  9.012575661048e-04
2850.00000  2900.00000  8.693444355644e-04
2900.00000  2950.00000  8.185910231387e-04
2950.00000  3000.00000  7.593787086421e-04
3000.00000  3050.00000  7.778344949787e-04
3050.00000  3100.00000  7.140082338979e-04
3100.00000  3150.00000  7.186221804820e-04
3150.00000  3200.00000  6.878625365877e-04
3200.00000  3250.00000  6.644083081182e-04
3250.00000  3300.00000  6.405695841001e-04
3300.00000  3350.00000  6.198068244714e-04
3350.00000  3400.00000  6.213448066661e-04
3400.00000  3450.00000  5.736673586298e-04
3450.00000  3500.00000  5.771278185680e-04
3500.00000  3550.00000  5.717448808864e-04
3550.00000  3600.00000  5.406007414434e-04
3600.00000  3650.00000  5.179155040713e-04
3650.00000  3700.00000  5.167620174253e-04
3700.00000  3750.00000  4.990752221860e-04
3750.00000  3800.00000  4.663931005483e-04
3800.00000  3850.00000  4.825419135928e-04
3850.00000  3900.00000  4.260210679369e-04
3900.00000  3950.00000  4.440923587248e-04
3950.00000  4000.00000  4.252520768395e-04
4000.00000  4050.00000  4.179466614146e-04
4050.00000  4100.00000  4.164086792199e-04
4100.00000  4150.00000  4.087187682463e-04
4150.00000  4200.00000  3.729606822191e-04
4200.00000  4250.00000  3.829575664848e-04
4250.00000  4300.00000  3.595033380154e-04
4300.00000  4350.00000  3.545048958825e-04
4350.00000  4400.00000  3.406630561301e-04
4400.00000  4450.00000  3.591188424667e-04
4450.00000  4500.00000  3.202847920500e-04
4500.00000  4550.00000  3.372025961919e-04
4550.00000  4600.00000  2.952925813859e-04
4600.00000  4650.00000  3.091344211383e-04
4650.00000  4700.00000  2.956770769346e-04
4700.00000  4750.00000  2.968305635806e-04
4750.00000  4800.00000  2.795282638900e-04
4800.00000  4850.00000  2.629949552968e-04
4850.00000  4900.00000  2.845267060228e-04
4900.00000  4950.00000  2.729918395625e-04
4950.00000  5000.00000  2.737608306598e-04
5000.00000  5050.00000  2.591499998100e-04
5050.00000  5100.00000  2.510755932877e-04
5100.00000  5150.00000  2.529980710311e-04
5150.00000  5200.00000  2.506910977390e-04
5200.00000  5250.00000  2.333887980485e-04
5250.00000  5300.00000  2.426166912168e-04
5300.00000  5350.00000  2.368492579866e-04
5350.00000  5400.00000  2.203159493934e-04
5400.00000  5450.00000  2.353112757919e-04
5450.00000  5500.00000  2.126260384198e-04
5500.00000  5550.00000  2.141640206145e-04
5550.00000  5600.00000  2.122415428711e-04
5600.00000  5650.00000  2.230074182341e-04
5650.00000  5700.00000  1.976307120213e-04
5700.00000  5750.00000  2.091655784817e-04
5750.00000  5800.00000  2.122415428711e-04
5800.00000  5850.00000  1.760989612952e-04
5850.00000  5900.00000  1.860958455609e-04
5900.00000  5950.00000  1.876338277556e-04
5950.00000  6000.00000  1.776369434899e-04
6000.00000  6050.00000  1.657175814809e-04
6050.00000  6100.00000  1.822508900741e-04
6100.00000  6150.00000  1.703315280650e-04
6150.00000  6200.00000  1.634106081888e-04
6200.00000  6250.00000  1.626416170914e-04
6250.00000  6300.00000  1.514912461797e-04
6300.00000  6350.00000  1.668710681269e-04
6350.00000  6400.00000  1.922477743398e-04
6400.00000  6450.00000  1.657175814809e-04
6450.00000  6500.00000  1.641795992862e-04
6500.00000  6550.00000  1.441858307548e-04
6550.00000  6600.00000  1.518757417284e-04
6600.00000  6650.00000  1.338044509405e-04
6650.00000  6700.00000  1.318819731971e-04
6700.00000  6750.00000  1.445703263035e-04
6750.00000  6800.00000  1.330354598431e-04
6800.00000  6850.00000  1.341889464892e-04
6850.00000  6900.00000  1.380339019759e-04
6900.00000  6950.00000  1.357269286839e-04
6950.00000  7000.00000  1.191936200907e-04
7000.00000  7050.00000  1.191936200907e-04
7050.00000  7100.00000  1.291905043563e-04
7100.00000  7150.00000  1.111192135684e-04
7150.00000  7200.00000  1.261145399669e-04
7200.00000  7250.00000  1.184246289933e-04
7250.00000  7300.00000  1.257300444182e-04
7300.00000  7350.00000  1.068897625329e-04
7350.00000  7400.00000  1.061207714355e-04
7400.00000  7450.00000  1.191936200907e-04
7450.00000  7500.00000  1.091967358250e-04
7500.00000  7550.00000  1.061207714355e-04
7550.00000  7600.00000  1.072742580816e-04
7600.00000  7650.00000  1.049672847895e-04
7650.00000  7700.00000  1.103502224710e-04
7700.00000  7750.00000  9.881535601064e-05
7750.00000  7800.00000  9.304792278044e-05
7800.00000  7850.00000  9.650838271856e-05
7850.00000  7900.00000  1.091967358250e-04
7900.00000  7950.00000  9.996884265668e-05
7950.00000  8000.00000  9.612388716988e-05
8000.00000  8050.00000  9.497040052384e-05
8050.00000  8100.00000  9.535489607252e-05
8100.00000  8150.00000  9.958434710800e-05
8150.00000  8200.00000  9.266342723176e-05
8200.00000  8250.00000  9.189443613441e-05
8250.00000  8300.00000  7.574562308987e-05
8300.00000  8350.00000  8.728048955025e-05
8350.00000  8400.00000  8.574250735553e-05
8400.00000  8450.00000  9.804636491328e-05
8450.00000  8500.00000  8.035956967402e-05
8500.00000  8550.00000  9.074094948837e-05
8550.00000  8600.00000  7.536112754119e-05
8600.00000  8650.00000  9.189443613441e-05
8650.00000  8700.00000  8.343553406346e-05
8700.00000  8750.00000  7.382314534647e-05
8750.00000  8800.00000  8.920296729365e-05
8800.00000  8850.00000  8.151305632006e-05
8850.00000  8900.00000  7.151617205439e-05
8900.00000  8950.00000  7.920608302798e-05
8950.00000  9000.00000  7.843709193062e-05
9000.00000  9050.00000  7.497663199251e-05
9050.00000  9100.00000  7.536112754119e-05
9100.00000  9150.00000  6.882470321363e-05
9150.00000  9200.00000  7.382314534647e-05
9200.00000  9250.00000  6.959369431099e-05
9250.00000  9300.00000  7.266965870043e-05
9300.00000  9350.00000  6.651772992156e-05
9350.00000  9400.00000  6.267277443476e-05
9400.00000  9450.00000  5.652084565589e-05
9450.00000  9500.00000  7.343864979779e-05
9500.00000  9550.00000  6.690222547024e-05
9550.00000  9600.00000  7.113167650571e-05
9600.00000  9650.00000  6.421075662948e-05
9650.00000  9700.00000  6.036580114268e-05
9700.00000  9750.00000  6.382626108080e-05
9750.00000  9800.00000  6.075029669136e-05
9800.00000  9850.00000  5.921231449665e-05
9850.00000  9900.00000  6.767121656760e-05
9900.00000  9950.00000  5.805882785061e-05
9950.00000  10000.00000  5.498286346117e-05
