10001.00000  11001.00000  1.336932784681e-04
11001.00000  12001.00000  1.050555705235e-04
12001.00000  13001.00000  8.181117097169e-05
13001.00000  14001.00000  7.337937897740e-05
14001.00000  15001.00000  6.046582367082e-05
15001.00000  16001.00000  4.926141539011e-05
16001.00000  17001.00000  4.299454296191e-05
17001.00000  18001.00000  3.608199276839e-05
18001.00000  19001.00000  3.179013468120e-05
19001.00000  20001.00000  2.571316747810e-05
20001.00000  21001.00000  2.502950866776e-05
21001.00000  22001.00000  2.252275969648e-05
22001.00000  23001.00000  1.895254146466e-05
23001.00000  24001.00000  1.830686369933e-05
24001.00000  25001.00000  1.439481606234e-05
25001.00000  26001.00000  1.325538471176e-05
26001.00000  27001.00000  1.393904352210e-05
27001.00000  28001.00000  1.207797231616e-05
28001.00000  29001.00000  1.014093902017e-05
29001.00000  30001.00000  7.862076319007e-06
30001.00000  31001.00000  8.545735129355e-06
31001.00000  32001.00000  6.988512283562e-06
32001.00000  33001.00000  7.748133183949e-06
33001.00000  34001.00000  6.380815563252e-06
34001.00000  35001.00000  6.076967203097e-06
35001.00000  36001.00000  6.418796608271e-06
36001.00000  37001.00000  5.127441077613e-06
37001.00000  38001.00000  6.114948248116e-06
38001.00000  39001.00000  4.367820177226e-06
39001.00000  40001.00000  4.823592717458e-06
40001.00000  41001.00000  3.874066591974e-06
41001.00000  42001.00000  4.291858087187e-06
42001.00000  43001.00000  3.494256141781e-06
43001.00000  44001.00000  3.114445691587e-06
44001.00000  45001.00000  3.722142411897e-06
45001.00000  46001.00000  2.962521511510e-06
46001.00000  47001.00000  2.734635241394e-06
47001.00000  48001.00000  2.506748971278e-06
48001.00000  49001.00000  2.848578376452e-06
49001.00000  50001.00000  2.164919566103e-06
50001.00000  51001.00000  2.240881656142e-06
51001.00000  52001.00000  2.202900611123e-06
52001.00000  53001.00000  1.747128070890e-06
53001.00000  54001.00000  2.088957476065e-06
54001.00000  55001.00000  1.671165980852e-06
55001.00000  56001.00000  1.671165980852e-06
56001.00000  57001.00000  1.861071205948e-06
57001.00000  58001.00000  1.709147025871e-06
58001.00000  59001.00000  1.671165980852e-06
59001.00000  60001.00000  1.367317620697e-06
60001.00000  61001.00000  1.519241800774e-06
61001.00000  62001.00000  1.101450305561e-06
62001.00000  63001.00000  1.329336575677e-06
63001.00000  64001.00000  1.025488215523e-06
64001.00000  65001.00000  1.405298665716e-06
65001.00000  66001.00000  1.177412395600e-06
66001.00000  67001.00000  9.495261254839e-07
67001.00000  68001.00000  9.115450804646e-07
68001.00000  69001.00000  9.875071705033e-07
69001.00000  70001.00000  8.735640354452e-07
70001.00000  71001.00000  1.025488215523e-06
71001.00000  72001.00000  7.596209003871e-07
72001.00000  73001.00000  6.456777653291e-07
73001.00000  74001.00000  8.355829904259e-07
74001.00000  75001.00000  8.735640354452e-07
75001.00000  76001.00000  9.875071705033e-07
76001.00000  77001.00000  6.076967203097e-07
77001.00000  78001.00000  4.177914952129e-07
78001.00000  79001.00000  3.418294051742e-07
79001.00000  80001.00000  4.557725402323e-07
80001.00000  81001.00000  4.557725402323e-07
81001.00000  82001.00000  5.697156752904e-07
82001.00000  83001.00000  7.976019454065e-07
83001.00000  84001.00000  4.937535852516e-07
84001.00000  85001.00000  3.798104501936e-07
85001.00000  86001.00000  5.697156752904e-07
86001.00000  87001.00000  2.658673151355e-07
87001.00000  88001.00000  5.697156752904e-07
88001.00000  89001.00000  5.317346302710e-07
89001.00000  90001.00000  6.076967203097e-07
90001.00000  91001.00000  1.519241800774e-07
91001.00000  92001.00000  4.937535852516e-07
92001.00000  93001.00000  3.798104501936e-07
93001.00000  94001.00000  3.418294051742e-07
94001.00000  95001.00000  4.557725402323e-07
95001.00000  96001.00000  3.038483601549e-07
96001.00000  97001.00000  4.937535852516e-07
97001.00000  98001.00000  7.596209003871e-08
98001.00000  99001.00000  5.317346302710e-07
99001.00000  100001.00000  2.658673151355e-07
100001.00000  101001.00000  3.798104501936e-07
101001.00000  102001.00000  4.177914952129e-07
102001.00000  103001.00000  3.798104501936e-07
103001.00000  104001.00000  1.519241800774e-07
104001.00000  105001.00000  2.278862701161e-07
105001.00000  106001.00000  3.038483601549e-07
106001.00000  107001.00000  1.899052250968e-07
107001.00000  108001.00000  2.278862701161e-07
108001.00000  109001.00000  1.519241800774e-07
109001.00000  110001.00000  2.658673151355e-07
110001.00000  111001.00000  3.798104501936e-08
111001.00000  112001.00000  1.519241800774e-07
112001.00000  113001.00000  2.278862701161e-07
113001.00000  114001.00000  3.418294051742e-07
114001.00000  115001.00000  1.519241800774e-07
115001.00000  116001.00000  1.899052250968e-07
116001.00000  117001.00000  2.278862701161e-07
117001.00000  118001.00000  2.278862701161e-07
118001.00000  119001.00000  2.658673151355e-07
119001.00000  120001.00000  1.519241800774e-07
120001.00000  121001.00000  1.519241800774e-07
121001.00000  122001.00000  4.557725402323e-07
122001.00000  123001.00000  3.798104501936e-08
123001.00000  124001.00000  1.519241800774e-07
124001.00000  125001.00000  1.139431350581e-07
125001.00000  126001.00000  7.596209003871e-08
126001.00000  127001.00000  7.596209003871e-08
127001.00000  128001.00000  2.658673151355e-07
128001.00000  129001.00000  1.899052250968e-07
129001.00000  130001.00000  1.519241800774e-07
130001.00000  131001.00000  1.519241800774e-07
131001.00000  132001.00000  1.139431350581e-07
132001.00000  133001.00000  2.278862701161e-07
133001.00000  134001.00000  7.596209003871e-08
134001.00000  135001.00000  7.596209003871e-08
135001.00000  136001.00000  3.798104501936e-08
136001.00000  137001.00000  3.798104501936e-08
137001.00000  138001.00000  0.000000000000e+00
138001.00000  139001.00000  7.596209003871e-08
139001.00000  140001.00000  1.519241800774e-07
140001.00000  141001.00000  2.658673151355e-07
141001.00000  142001.00000  1.899052250968e-07
142001.00000  143001.00000  0.000000000000e+00
143001.00000  144001.00000  7.596209003871e-08
144001.00000  145001.00000  7.596209003871e-08
145001.00000  146001.00000  1.139431350581e-07
146001.00000  147001.00000  0.000000000000e+00
147001.00000  148001.00000  2.278862701161e-07
148001.00000  149001.00000  0.000000000000e+00
149001.00000  150001.00000  2.278862701161e-07
150001.00000  151001.00000  7.596209003871e-08
151001.00000  152001.00000  3.798104501936e-08
152001.00000  153001.00000  7.596209003871e-08
153001.00000  154001.00000  0.000000000000e+00
154001.00000  155001.00000  3.798104501936e-08
155001.00000  156001.00000  3.798104501936e-08
156001.00000  157001.00000  1.519241800774e-07
157001.00000  158001.00000  1.139431350581e-07
158001.00000  159001.00000  3.798104501936e-08
159001.00000  160001.00000  3.798104501936e-08
160001.00000  161001.00000  0.000000000000e+00
161001.00000  162001.00000  1.139431350581e-07
162001.00000  163001.00000  3.798104501936e-08
163001.00000  164001.00000  7.596209003871e-08
164001.00000  165001.00000  1.139431350581e-07
165001.00000  166001.00000  3.798104501936e-08
166001.00000  167001.00000  1.519241800774e-07
167001.00000  168001.00000  1.139431350581e-07
168001.00000  169001.00000  0.000000000000e+00
169001.00000  170001.00000  3.798104501936e-08
170001.00000  171001.00000  3.798104501936e-08
171001.00000  172001.00000  3.798104501936e-08
172001.00000  173001.00000  0.000000000000e+00
173001.00000  174001.00000  7.596209003871e-08
174001.00000  175001.00000  7.596209003871e-08
175001.00000  176001.00000  1.139431350581e-07
176001.00000  177001.00000  7.596209003871e-08
177001.00000  178001.00000  3.798104501936e-08
178001.00000  179001.00000  7.596209003871e-08
179001.00000  180001.00000  0.000000000000e+00
180001.00000  181001.00000  0.000000000000e+00
181001.00000  182001.00000  3.798104501936e-08
182001.00000  183001.00000  0.000000000000e+00
183001.00000  184001.00000  0.000000000000e+00
184001.00000  185001.00000  0.000000000000e+00
185001.00000  186001.00000  1.139431350581e-07
186001.00000  187001.00000  7.596209003871e-08
187001.00000  188001.00000  3.798104501936e-08
188001.00000  189001.00000  3.798104501936e-08
189001.00000  190001.00000  0.000000000000e+00
190001.00000  191001.00000  3.798104501936e-08
191001.00000  192001.00000  0.000000000000e+00
192001.00000  193001.00000  1.519241800774e-07
193001.00000  194001.00000  0.000000000000e+00
194001.00000  195001.00000  0.000000000000e+00
195001.00000  196001.00000  3.798104501936e-08
196001.00000  197001.00000  3.798104501936e-08
197001.00000  198001.00000  3.798104501936e-08
198001.00000  199001.00000  0.000000000000e+00
