10001.00000  11001.00000  3.228682013319e-05
11001.00000  12001.00000  3.415417293082e-05
12001.00000  13001.00000  3.464761848875e-05
13001.00000  14001.00000  3.720192490624e-05
14001.00000  15001.00000  4.267820305888e-05
15001.00000  16001.00000  4.201060024522e-05
16001.00000  17001.00000  4.146877767182e-05
17001.00000  18001.00000  4.225248532264e-05
18001.00000  19001.00000  4.220410830715e-05
19001.00000  20001.00000  4.064636840861e-05
20001.00000  21001.00000  3.886609423884e-05
21001.00000  22001.00000  3.886609423884e-05
22001.00000  23001.00000  3.631178782135e-05
23001.00000  24001.00000  3.498625759713e-05
24001.00000  25001.00000  3.286734431898e-05
25001.00000  26001.00000  3.131927982353e-05
26001.00000  27001.00000  2.969381210331e-05
27001.00000  28001.00000  2.771035446852e-05
28001.00000  29001.00000  2.619131618236e-05
29001.00000  30001.00000  2.414013072589e-05
30001.00000  31001.00000  2.299843316050e-05
31001.00000  32001.00000  2.076341504520e-05
32001.00000  33001.00000  2.050217916159e-05
33001.00000  34001.00000  1.906054410020e-05
34001.00000  35001.00000  1.831553806177e-05
35001.00000  36001.00000  1.632240502388e-05
36001.00000  37001.00000  1.617727397743e-05
37001.00000  38001.00000  1.528713689255e-05
38001.00000  39001.00000  1.417446553645e-05
39001.00000  40001.00000  1.359394135065e-05
40001.00000  41001.00000  1.225873572333e-05
41001.00000  42001.00000  1.211360467688e-05
42001.00000  43001.00000  1.124281839819e-05
43001.00000  44001.00000  1.118476597961e-05
44001.00000  45001.00000  1.053651397214e-05
45001.00000  46001.00000  9.491570437716e-06
46001.00000  47001.00000  9.597999871778e-06
47001.00000  48001.00000  8.756239802378e-06
48001.00000  49001.00000  8.736888996185e-06
49001.00000  50001.00000  8.253118841358e-06
50001.00000  51001.00000  7.856427314399e-06
51001.00000  52001.00000  6.975965632613e-06
52001.00000  53001.00000  7.024342648096e-06
53001.00000  54001.00000  6.637326524234e-06
54001.00000  55001.00000  6.066477741537e-06
55001.00000  56001.00000  5.863294276510e-06
56001.00000  57001.00000  5.669786214579e-06
57001.00000  58001.00000  5.350497912392e-06
58001.00000  59001.00000  4.886078563758e-06
59001.00000  60001.00000  4.818350742082e-06
60001.00000  61001.00000  4.798999935889e-06
61001.00000  62001.00000  4.392633005834e-06
62001.00000  63001.00000  4.392633005834e-06
63001.00000  64001.00000  4.034643091262e-06
64001.00000  65001.00000  3.773407207655e-06
65001.00000  66001.00000  3.454118905469e-06
66001.00000  67001.00000  3.502495920951e-06
67001.00000  68001.00000  3.483145114758e-06
68001.00000  69001.00000  3.608925355013e-06
69001.00000  70001.00000  3.067102781607e-06
70001.00000  71001.00000  3.047751975413e-06
71001.00000  72001.00000  2.796191494903e-06
72001.00000  73001.00000  2.844568510386e-06
73001.00000  74001.00000  3.047751975413e-06
74001.00000  75001.00000  2.515604805103e-06
75001.00000  76001.00000  2.486578595814e-06
76001.00000  77001.00000  2.080211665758e-06
77001.00000  78001.00000  2.118913278145e-06
78001.00000  79001.00000  2.109237875048e-06
79001.00000  80001.00000  2.273719727689e-06
80001.00000  81001.00000  2.012483844083e-06
81001.00000  82001.00000  1.915729813117e-06
82001.00000  83001.00000  1.780274169765e-06
83001.00000  84001.00000  1.818975782152e-06
84001.00000  85001.00000  1.596441510931e-06
85001.00000  86001.00000  1.548064495448e-06
86001.00000  87001.00000  1.731897154283e-06
87001.00000  88001.00000  1.673844735703e-06
88001.00000  89001.00000  1.402933449000e-06
89001.00000  90001.00000  1.393258045903e-06
90001.00000  91001.00000  1.354556433517e-06
91001.00000  92001.00000  1.354556433517e-06
92001.00000  93001.00000  1.112671356103e-06
93001.00000  94001.00000  1.141697565393e-06
94001.00000  95001.00000  1.141697565393e-06
95001.00000  96001.00000  1.141697565393e-06
96001.00000  97001.00000  1.073969743717e-06
97001.00000  98001.00000  1.035268131331e-06
98001.00000  99001.00000  9.772157127516e-07
99001.00000  100001.00000  1.112671356103e-06
100001.00000  101001.00000  9.868911158482e-07
101001.00000  102001.00000  8.804616817861e-07
102001.00000  103001.00000  8.224092632068e-07
103001.00000  104001.00000  9.288386972689e-07
104001.00000  105001.00000  8.127338601103e-07
105001.00000  106001.00000  7.256552322413e-07
106001.00000  107001.00000  7.643568446275e-07
107001.00000  108001.00000  7.740322477240e-07
108001.00000  109001.00000  7.450060384344e-07
109001.00000  110001.00000  4.837701548275e-07
110001.00000  111001.00000  5.224717672137e-07
111001.00000  112001.00000  5.127963641172e-07
112001.00000  113001.00000  7.159798291447e-07
113001.00000  114001.00000  4.644193486344e-07
114001.00000  115001.00000  3.870161238620e-07
115001.00000  116001.00000  5.901995888896e-07
116001.00000  117001.00000  4.257177362482e-07
117001.00000  118001.00000  4.837701548275e-07
118001.00000  119001.00000  4.934455579241e-07
119001.00000  120001.00000  3.773407207655e-07
120001.00000  121001.00000  4.160423331517e-07
121001.00000  122001.00000  3.579899145724e-07
122001.00000  123001.00000  2.999374959931e-07
123001.00000  124001.00000  3.096128990896e-07
124001.00000  125001.00000  2.322096743172e-07
125001.00000  126001.00000  2.999374959931e-07
126001.00000  127001.00000  2.612358836069e-07
127001.00000  128001.00000  2.322096743172e-07
128001.00000  129001.00000  2.709112867034e-07
129001.00000  130001.00000  2.515604805103e-07
130001.00000  131001.00000  1.935080619310e-07
131001.00000  132001.00000  2.999374959931e-07
132001.00000  133001.00000  2.612358836069e-07
133001.00000  134001.00000  1.354556433517e-07
134001.00000  135001.00000  1.161048371586e-07
135001.00000  136001.00000  2.225342712207e-07
136001.00000  137001.00000  1.741572557379e-07
137001.00000  138001.00000  1.935080619310e-07
138001.00000  139001.00000  1.935080619310e-07
139001.00000  140001.00000  1.838326588345e-07
140001.00000  141001.00000  1.838326588345e-07
141001.00000  142001.00000  1.064294340621e-07
142001.00000  143001.00000  1.741572557379e-07
143001.00000  144001.00000  1.935080619310e-07
144001.00000  145001.00000  1.257802402552e-07
145001.00000  146001.00000  8.707862786896e-08
146001.00000  147001.00000  1.838326588345e-07
147001.00000  148001.00000  8.707862786896e-08
148001.00000  149001.00000  1.257802402552e-07
149001.00000  150001.00000  1.161048371586e-07
150001.00000  151001.00000  1.548064495448e-07
151001.00000  152001.00000  1.354556433517e-07
152001.00000  153001.00000  8.707862786896e-08
153001.00000  154001.00000  1.161048371586e-07
154001.00000  155001.00000  1.548064495448e-07
155001.00000  156001.00000  6.772782167585e-08
156001.00000  157001.00000  1.161048371586e-07
157001.00000  158001.00000  4.837701548275e-08
158001.00000  159001.00000  9.675403096551e-08
159001.00000  160001.00000  1.548064495448e-07
160001.00000  161001.00000  7.740322477240e-08
161001.00000  162001.00000  1.451310464483e-07
162001.00000  163001.00000  8.707862786896e-08
163001.00000  164001.00000  1.257802402552e-07
164001.00000  165001.00000  1.741572557379e-07
165001.00000  166001.00000  1.644818526414e-07
166001.00000  167001.00000  7.740322477240e-08
167001.00000  168001.00000  6.772782167585e-08
168001.00000  169001.00000  1.161048371586e-07
169001.00000  170001.00000  4.837701548275e-08
170001.00000  171001.00000  8.707862786896e-08
171001.00000  172001.00000  1.064294340621e-07
172001.00000  173001.00000  3.870161238620e-08
173001.00000  174001.00000  4.837701548275e-08
174001.00000  175001.00000  8.707862786896e-08
175001.00000  176001.00000  8.707862786896e-08
176001.00000  177001.00000  6.772782167585e-08
177001.00000  178001.00000  6.772782167585e-08
178001.00000  179001.00000  5.805241857930e-08
179001.00000  180001.00000  6.772782167585e-08
180001.00000  181001.00000  3.870161238620e-08
181001.00000  182001.00000  8.707862786896e-08
182001.00000  183001.00000  3.870161238620e-08
183001.00000  184001.00000  2.902620928965e-08
184001.00000  185001.00000  5.805241857930e-08
185001.00000  186001.00000  8.707862786896e-08
186001.00000  187001.00000  1.935080619310e-08
187001.00000  188001.00000  9.675403096551e-08
188001.00000  189001.00000  6.772782167585e-08
189001.00000  190001.00000  4.837701548275e-08
190001.00000  191001.00000  6.772782167585e-08
191001.00000  192001.00000  2.902620928965e-08
192001.00000  193001.00000  6.772782167585e-08
193001.00000  194001.00000  1.064294340621e-07
194001.00000  195001.00000  7.740322477240e-08
195001.00000  196001.00000  1.064294340621e-07
196001.00000  197001.00000  2.902620928965e-08
197001.00000  198001.00000  8.707862786896e-08
198001.00000  199001.00000  9.675403096551e-09
