300.00000  350.00000  6.422239796262e-06
350.00000  400.00000  2.087227933785e-05
400.00000  450.00000  3.933621875210e-05
450.00000  500.00000  2.384256524362e-04
500.00000  550.00000  7.040380376652e-04
550.00000  600.00000  3.090702901951e-04
600.00000  650.00000  1.010699987937e-03
650.00000  700.00000  1.799029922928e-03
700.00000  750.00000  2.506279080491e-03
750.00000  800.00000  3.685562863080e-03
800.00000  850.00000  4.928266263656e-03
850.00000  900.00000  5.043063800014e-03
900.00000  950.00000  5.327247910999e-03
950.00000  1000.00000  5.981513590243e-03
1000.00000  1050.00000  6.529009532874e-03
1050.00000  1100.00000  6.843699282891e-03
1100.00000  1150.00000  6.740140666177e-03
1150.00000  1200.00000  6.732915646406e-03
1200.00000  1250.00000  6.572359651499e-03
1250.00000  1300.00000  6.004794209505e-03
1300.00000  1350.00000  5.446059347230e-03
1350.00000  1400.00000  5.355345210108e-03
1400.00000  1450.00000  5.097652838283e-03
1450.00000  1500.00000  4.903380084446e-03
1500.00000  1550.00000  4.506003997052e-03
1550.00000  1600.00000  4.250719965151e-03
1600.00000  1650.00000  3.812402099056e-03
1650.00000  1700.00000  3.514570728504e-03
1700.00000  1750.00000  3.254470016756e-03
1750.00000  1800.00000  2.986341505262e-03
1800.00000  1850.00000  2.568895918505e-03
1850.00000  1900.00000  2.503870740567e-03
1900.00000  1950.00000  2.339300845788e-03
1950.00000  2000.00000  2.137000292206e-03
2000.00000  2050.00000  1.930685838751e-03
2050.00000  2100.00000  1.861646760941e-03
2100.00000  2150.00000  1.704301885933e-03
2150.00000  2200.00000  1.575054310033e-03
2200.00000  2250.00000  1.454637313853e-03
2250.00000  2300.00000  1.318164718183e-03
2300.00000  2350.00000  1.339839777495e-03
2350.00000  2400.00000  1.167242082971e-03
2400.00000  2450.00000  1.108639144830e-03
2450.00000  2500.00000  1.002672188191e-03
2500.00000  2550.00000  8.870718718586e-04
2550.00000  2600.00000  8.332856135649e-04
2600.00000  2650.00000  8.268633737687e-04
2650.00000  2700.00000  7.273186569266e-04
2700.00000  2750.00000  6.791518584547e-04
2750.00000  2800.00000  6.085072206958e-04
2800.00000  2850.00000  6.044933208231e-04
2850.00000  2900.00000  5.314403431406e-04
2900.00000  2950.00000  5.466931626568e-04
2950.00000  3000.00000  4.768513048724e-04
3000.00000  3050.00000  4.431345459421e-04
3050.00000  3100.00000  4.278817264259e-04
3100.00000  3150.00000  4.318956262986e-04
3150.00000  3200.00000  3.757010280813e-04
3200.00000  3250.00000  3.676732283360e-04
3250.00000  3300.00000  3.524204088199e-04
3300.00000  3350.00000  2.954230306280e-04
3350.00000  3400.00000  3.170980899404e-04
3400.00000  3450.00000  2.721424113666e-04
3450.00000  3500.00000  2.793674311374e-04
3500.00000  3550.00000  2.665229515449e-04
3550.00000  3600.00000  2.199617130220e-04
3600.00000  3650.00000  2.279895127673e-04
3650.00000  3700.00000  2.271867327928e-04
3700.00000  3750.00000  2.014977736077e-04
3750.00000  3800.00000  1.750060344481e-04
3800.00000  3850.00000  1.806254942699e-04
3850.00000  3900.00000  1.533309751357e-04
3900.00000  3950.00000  1.517254151867e-04
3950.00000  4000.00000  1.661754547283e-04
4000.00000  4050.00000  1.509226352121e-04
4050.00000  4100.00000  1.276420159507e-04
4100.00000  4150.00000  1.316559158234e-04
4150.00000  4200.00000  1.324586957979e-04
4200.00000  4250.00000  1.196142162054e-04
4250.00000  4300.00000  1.236281160780e-04
4300.00000  4350.00000  9.472803699486e-05
4350.00000  4400.00000  1.067697366128e-04
4400.00000  4450.00000  9.633359694392e-05
4450.00000  4500.00000  9.392525702033e-05
4500.00000  4550.00000  9.231969707126e-05
4550.00000  4600.00000  1.051641766638e-04
4600.00000  4650.00000  9.312247704579e-05
4650.00000  4700.00000  8.348911735140e-05
4700.00000  4750.00000  8.188355740234e-05
4750.00000  4800.00000  6.582795791168e-05
4800.00000  4850.00000  7.064463775888e-05
4850.00000  4900.00000  6.502517793715e-05
4900.00000  4950.00000  7.064463775888e-05
4950.00000  5000.00000  6.984185778435e-05
5000.00000  5050.00000  5.539181824276e-05
5050.00000  5100.00000  6.181405803902e-05
5100.00000  5150.00000  7.225019770794e-05
5150.00000  5200.00000  6.502517793715e-05
5200.00000  5250.00000  6.663073788621e-05
5250.00000  5300.00000  4.736401849743e-05
5300.00000  5350.00000  6.261683801355e-05
5350.00000  5400.00000  5.378625829369e-05
5400.00000  5450.00000  5.298347831916e-05
5450.00000  5500.00000  5.699737819182e-05
5500.00000  5550.00000  5.378625829369e-05
5550.00000  5600.00000  4.977235842103e-05
5600.00000  5650.00000  4.415289859930e-05
5650.00000  5700.00000  5.057513839556e-05
5700.00000  5750.00000  5.860293814089e-05
5750.00000  5800.00000  4.816679847196e-05
5800.00000  5850.00000  4.174455867570e-05
5850.00000  5900.00000  4.495567857383e-05
5900.00000  5950.00000  4.816679847196e-05
5950.00000  6000.00000  4.254733865023e-05
6000.00000  6050.00000  4.415289859930e-05
6050.00000  6100.00000  4.174455867570e-05
6100.00000  6150.00000  5.218069834463e-05
6150.00000  6200.00000  3.773065880304e-05
6200.00000  6250.00000  4.094177870117e-05
6250.00000  6300.00000  3.532231887944e-05
6300.00000  6350.00000  3.291397895584e-05
6350.00000  6400.00000  1.974838737350e-04
6400.00000  6450.00000  3.211119898131e-05
6450.00000  6500.00000  4.013899872664e-05
6500.00000  6550.00000  3.933621875210e-05
6550.00000  6600.00000  2.568895918505e-05
6600.00000  6650.00000  2.488617921051e-05
6650.00000  6700.00000  3.371675893037e-05
6700.00000  6750.00000  2.729451913411e-05
6750.00000  6800.00000  3.050563903224e-05
6800.00000  6850.00000  2.488617921051e-05
6850.00000  6900.00000  2.568895918505e-05
6900.00000  6950.00000  3.050563903224e-05
6950.00000  7000.00000  2.328061926145e-05
7000.00000  7050.00000  2.488617921051e-05
7050.00000  7100.00000  4.977235842103e-05
7100.00000  7150.00000  1.445003954159e-05
7150.00000  7200.00000  2.087227933785e-05
7200.00000  7250.00000  2.247783928692e-05
7250.00000  7300.00000  2.006949936332e-05
7300.00000  7350.00000  1.846393941425e-05
7350.00000  7400.00000  1.204169961799e-05
7400.00000  7450.00000  2.006949936332e-05
7450.00000  7500.00000  2.006949936332e-05
7500.00000  7550.00000  1.284447959252e-05
7550.00000  7600.00000  8.830579719860e-06
7600.00000  7650.00000  1.685837946519e-05
7650.00000  7700.00000  2.247783928692e-05
7700.00000  7750.00000  1.445003954159e-05
7750.00000  7800.00000  1.284447959252e-05
7800.00000  7850.00000  1.685837946519e-05
7850.00000  7900.00000  1.605559949065e-05
7900.00000  7950.00000  1.123891964346e-05
7950.00000  8000.00000  1.445003954159e-05
8000.00000  8050.00000  1.204169961799e-05
8050.00000  8100.00000  1.284447959252e-05
8100.00000  8150.00000  1.846393941425e-05
8150.00000  8200.00000  2.006949936332e-05
8200.00000  8250.00000  2.087227933785e-05
8250.00000  8300.00000  1.204169961799e-05
8300.00000  8350.00000  1.525281951612e-05
8350.00000  8400.00000  1.204169961799e-05
8400.00000  8450.00000  1.284447959252e-05
8450.00000  8500.00000  1.123891964346e-05
8500.00000  8550.00000  8.027799745327e-06
8550.00000  8600.00000  8.027799745327e-06
8600.00000  8650.00000  1.525281951612e-05
8650.00000  8700.00000  1.445003954159e-05
8700.00000  8750.00000  1.605559949065e-05
8750.00000  8800.00000  9.633359694392e-06
8800.00000  8850.00000  1.364725956706e-05
8850.00000  8900.00000  1.043613966893e-05
8900.00000  8950.00000  1.043613966893e-05
8950.00000  9000.00000  1.284447959252e-05
9000.00000  9050.00000  1.445003954159e-05
9050.00000  9100.00000  1.043613966893e-05
9100.00000  9150.00000  5.619459821729e-06
9150.00000  9200.00000  8.027799745327e-06
9200.00000  9250.00000  1.123891964346e-05
9250.00000  9300.00000  1.204169961799e-05
9300.00000  9350.00000  1.123891964346e-05
9350.00000  9400.00000  1.525281951612e-05
9400.00000  9450.00000  9.633359694392e-06
9450.00000  9500.00000  7.225019770794e-06
9500.00000  9550.00000  1.364725956706e-05
9550.00000  9600.00000  8.830579719860e-06
9600.00000  9650.00000  1.043613966893e-05
9650.00000  9700.00000  1.204169961799e-05
9700.00000  9750.00000  6.422239796262e-06
9750.00000  9800.00000  7.225019770794e-06
9800.00000  9850.00000  7.225019770794e-06
9850.00000  9900.00000  6.422239796262e-06
9900.00000  9950.00000  1.123891964346e-05
9950.00000  10000.00000  1.766115943972e-05
