300.00000  350.00000  6.967319413323e-02
350.00000  400.00000  5.231890872649e-02
400.00000  450.00000  4.064429850781e-02
450.00000  500.00000  3.234758216324e-02
500.00000  550.00000  2.654449428072e-02
550.00000  600.00000  2.207933841298e-02
600.00000  650.00000  1.879871373419e-02
650.00000  700.00000  1.588140680080e-02
700.00000  750.00000  1.372303026890e-02
750.00000  800.00000  1.209444405780e-02
800.00000  850.00000  1.063502166466e-02
850.00000  900.00000  9.525460804123e-03
900.00000  950.00000  8.387449665109e-03
950.00000  1000.00000  7.662736490433e-03
1000.00000  1050.00000  6.873433494354e-03
1050.00000  1100.00000  6.277899962485e-03
1100.00000  1150.00000  5.652762762473e-03
1150.00000  1200.00000  5.233313386573e-03
1200.00000  1250.00000  4.773110909073e-03
1250.00000  1300.00000  4.491683830100e-03
1300.00000  1350.00000  4.133364106600e-03
1350.00000  1400.00000  3.821564433039e-03
1400.00000  1450.00000  3.497461936354e-03
1450.00000  1500.00000  3.302923545698e-03
1500.00000  1550.00000  3.067632053443e-03
1550.00000  1600.00000  2.873862589232e-03
1600.00000  1650.00000  2.707005550607e-03
1650.00000  1700.00000  2.495166314932e-03
1700.00000  1750.00000  2.424425081966e-03
1750.00000  1800.00000  2.264488381348e-03
1800.00000  1850.00000  2.074563549364e-03
1850.00000  1900.00000  2.005744632512e-03
1900.00000  1950.00000  1.948075149116e-03
1950.00000  2000.00000  1.799672345177e-03
2000.00000  2050.00000  1.708554561411e-03
2050.00000  2100.00000  1.598598079736e-03
2100.00000  2150.00000  1.544004302121e-03
2150.00000  2200.00000  1.494408546401e-03
2200.00000  2250.00000  1.391372402733e-03
2250.00000  2300.00000  1.412902343201e-03
2300.00000  2350.00000  1.316786537541e-03
2350.00000  2400.00000  1.266806318598e-03
2400.00000  2450.00000  1.202216497195e-03
2450.00000  2500.00000  1.124554926221e-03
2500.00000  2550.00000  1.082263971731e-03
2550.00000  2600.00000  1.044971039135e-03
2600.00000  2650.00000  1.011907201988e-03
2650.00000  2700.00000  9.938374305238e-04
2700.00000  2750.00000  9.434727483580e-04
2750.00000  2800.00000  8.984905513092e-04
2800.00000  2850.00000  9.023351835355e-04
2850.00000  2900.00000  8.465880162528e-04
2900.00000  2950.00000  8.192911274454e-04
2950.00000  3000.00000  7.516256002608e-04
3000.00000  3050.00000  7.489343577023e-04
3050.00000  3100.00000  7.470120415891e-04
3100.00000  3150.00000  7.074123296572e-04
3150.00000  3200.00000  6.812688305177e-04
3200.00000  3250.00000  6.635835222762e-04
3250.00000  3300.00000  6.274439793481e-04
3300.00000  3350.00000  6.162945458916e-04
3350.00000  3400.00000  6.074518917708e-04
3400.00000  3450.00000  5.963024583143e-04
3450.00000  3500.00000  6.001470905407e-04
3500.00000  3550.00000  5.459377761485e-04
3550.00000  3600.00000  5.386329749183e-04
3600.00000  3650.00000  5.197942770090e-04
3650.00000  3700.00000  5.155651815599e-04
3700.00000  3750.00000  5.121050125562e-04
3750.00000  3800.00000  4.763499328507e-04
3800.00000  3850.00000  4.613558671677e-04
3850.00000  3900.00000  4.367502209188e-04
3900.00000  3950.00000  4.478996543753e-04
3950.00000  4000.00000  4.552044556055e-04
4000.00000  4050.00000  4.436705589263e-04
4050.00000  4100.00000  4.436705589263e-04
4100.00000  4150.00000  3.886923180888e-04
4150.00000  4200.00000  3.990728251001e-04
4200.00000  4250.00000  3.894612445341e-04
4250.00000  4300.00000  3.710070098474e-04
4300.00000  4350.00000  3.748516420738e-04
4350.00000  4400.00000  3.583197235003e-04
4400.00000  4450.00000  3.429411945947e-04
4450.00000  4500.00000  3.367897830324e-04
4500.00000  4550.00000  3.617798925040e-04
4550.00000  4600.00000  3.560129441644e-04
4600.00000  4650.00000  3.091084310024e-04
4650.00000  4700.00000  3.194889380137e-04
4700.00000  4750.00000  3.121841367835e-04
4750.00000  4800.00000  2.783513731912e-04
4800.00000  4850.00000  2.891163434251e-04
4850.00000  4900.00000  2.787358364138e-04
4900.00000  4950.00000  2.856561744214e-04
4950.00000  5000.00000  2.798892260818e-04
5000.00000  5050.00000  2.633573075082e-04
5050.00000  5100.00000  2.733533512969e-04
5100.00000  5150.00000  2.345225658103e-04
5150.00000  5200.00000  2.468253889347e-04
5200.00000  5250.00000  2.368293451461e-04
5250.00000  5300.00000  2.468253889347e-04
5300.00000  5350.00000  2.375982715914e-04
5350.00000  5400.00000  2.314468600291e-04
5400.00000  5450.00000  2.402895141499e-04
5450.00000  5500.00000  2.229886691311e-04
5500.00000  5550.00000  2.329847129197e-04
5550.00000  5600.00000  2.079946034481e-04
5600.00000  5650.00000  2.106858460066e-04
5650.00000  5700.00000  2.149149414556e-04
5700.00000  5750.00000  2.106858460066e-04
5750.00000  5800.00000  1.849268100897e-04
5800.00000  5850.00000  2.049188976670e-04
5850.00000  5900.00000  1.987674861048e-04
5900.00000  5950.00000  1.903092952067e-04
5950.00000  6000.00000  1.860801997577e-04
6000.00000  6050.00000  1.895403687614e-04
6050.00000  6100.00000  1.922316113199e-04
6100.00000  6150.00000  1.822355675313e-04
6150.00000  6200.00000  1.795443249728e-04
6200.00000  6250.00000  1.853112733124e-04
6250.00000  6300.00000  1.768530824143e-04
6300.00000  6350.00000  1.660881121804e-04
6350.00000  6400.00000  3.129530632288e-04
6400.00000  6450.00000  1.595522373955e-04
6450.00000  6500.00000  1.422513923767e-04
6500.00000  6550.00000  1.430203188220e-04
6550.00000  6600.00000  1.580143845049e-04
6600.00000  6650.00000  1.657036489577e-04
6650.00000  6700.00000  1.499406568295e-04
6700.00000  6750.00000  1.522474361654e-04
6750.00000  6800.00000  1.491717303842e-04
6800.00000  6850.00000  1.518629729427e-04
6850.00000  6900.00000  1.410980027088e-04
6900.00000  6950.00000  1.380222969277e-04
6950.00000  7000.00000  1.368689072598e-04
7000.00000  7050.00000  1.360999808145e-04
7050.00000  7100.00000  1.399446130409e-04
7100.00000  7150.00000  1.226437680221e-04
7150.00000  7200.00000  1.349465911466e-04
7200.00000  7250.00000  1.295641060296e-04
7250.00000  7300.00000  1.214903783542e-04
7300.00000  7350.00000  1.172612829051e-04
7350.00000  7400.00000  1.311019589202e-04
7400.00000  7450.00000  1.264884002485e-04
7450.00000  7500.00000  1.195680622410e-04
7500.00000  7550.00000  1.161078932372e-04
7550.00000  7600.00000  1.111098713429e-04
7600.00000  7650.00000  1.195680622410e-04
7650.00000  7700.00000  1.111098713429e-04
7700.00000  7750.00000  1.203369886862e-04
7750.00000  7800.00000  9.765365855050e-05
7800.00000  7850.00000  9.919151144106e-05
7850.00000  7900.00000  1.030361436675e-04
7900.00000  7950.00000  9.611580565994e-05
7950.00000  8000.00000  9.534687921466e-05
8000.00000  8050.00000  1.011138275543e-04
8050.00000  8100.00000  9.573134243730e-05
8100.00000  8150.00000  9.957597466370e-05
8150.00000  8200.00000  9.227117343355e-05
8200.00000  8250.00000  9.842258499578e-05
8250.00000  8300.00000  9.534687921466e-05
8300.00000  8350.00000  7.996835030907e-05
8350.00000  8400.00000  9.150224698827e-05
8400.00000  8450.00000  8.957993087507e-05
8450.00000  8500.00000  8.611976187131e-05
8500.00000  8550.00000  8.727315153923e-05
8550.00000  8600.00000  9.380902632410e-05
8600.00000  8650.00000  9.073332054299e-05
8650.00000  8700.00000  8.150620319963e-05
8700.00000  8750.00000  8.688868831659e-05
8750.00000  8800.00000  7.497032841476e-05
8800.00000  8850.00000  7.573925486004e-05
8850.00000  8900.00000  7.996835030907e-05
8900.00000  8950.00000  8.112173997699e-05
8950.00000  9000.00000  8.881100442979e-05
9000.00000  9050.00000  7.804603419587e-05
9050.00000  9100.00000  8.304405609019e-05
9100.00000  9150.00000  6.382089495820e-05
9150.00000  9200.00000  7.266354907892e-05
9200.00000  9250.00000  8.189066642227e-05
9250.00000  9300.00000  6.497428462612e-05
9300.00000  9350.00000  6.881891685252e-05
9350.00000  9400.00000  7.497032841476e-05
9400.00000  9450.00000  7.458586519212e-05
9450.00000  9500.00000  6.843445362988e-05
9500.00000  9550.00000  6.728106396196e-05
9550.00000  9600.00000  6.497428462612e-05
9600.00000  9650.00000  6.420535818084e-05
9650.00000  9700.00000  7.074123296572e-05
9700.00000  9750.00000  6.458982140348e-05
9750.00000  9800.00000  6.151411562236e-05
9800.00000  9850.00000  6.689660073932e-05
9850.00000  9900.00000  7.689264452795e-05
9900.00000  9950.00000  6.612767429404e-05
9950.00000  10000.00000  7.497032841476e-05
