10001.00000  11001.00000  2.158146115440e-04
11001.00000  12001.00000  1.905676992408e-04
12001.00000  13001.00000  1.732774979679e-04
13001.00000  14001.00000  1.555224102079e-04
14001.00000  15001.00000  1.401453956323e-04
15001.00000  16001.00000  1.285768742016e-04
16001.00000  17001.00000  1.227300326129e-04
17001.00000  18001.00000  1.135932251151e-04
18001.00000  19001.00000  1.049391843539e-04
19001.00000  20001.00000  9.734007831364e-05
20001.00000  21001.00000  9.251241094687e-05
21001.00000  22001.00000  8.355440594409e-05
22001.00000  23001.00000  7.534737142059e-05
23001.00000  24001.00000  7.207528576089e-05
24001.00000  25001.00000  6.638936641781e-05
25001.00000  26001.00000  6.045312358163e-05
26001.00000  27001.00000  5.682343293180e-05
27001.00000  28001.00000  5.056534560451e-05
28001.00000  29001.00000  4.983225537474e-05
29001.00000  30001.00000  4.588072023380e-05
30001.00000  31001.00000  4.228679008298e-05
31001.00000  32001.00000  4.091001087098e-05
32001.00000  33001.00000  3.615386450224e-05
33001.00000  34001.00000  3.484860628826e-05
34001.00000  35001.00000  3.390095306441e-05
35001.00000  36001.00000  3.064674765422e-05
36001.00000  37001.00000  2.825079422034e-05
37001.00000  38001.00000  2.730314099650e-05
38001.00000  39001.00000  2.428137882989e-05
39001.00000  40001.00000  2.419197758236e-05
40001.00000  41001.00000  2.263639587529e-05
41001.00000  42001.00000  2.140265865934e-05
42001.00000  43001.00000  1.965039420769e-05
43001.00000  44001.00000  1.788024950655e-05
44001.00000  45001.00000  1.838089649273e-05
45001.00000  46001.00000  1.771932726099e-05
46001.00000  47001.00000  1.532337382711e-05
47001.00000  48001.00000  1.541277507464e-05
48001.00000  49001.00000  1.500152933599e-05
49001.00000  50001.00000  1.392871436560e-05
50001.00000  51001.00000  1.380355261905e-05
51001.00000  52001.00000  1.335654638139e-05
52001.00000  53001.00000  1.255193515360e-05
53001.00000  54001.00000  1.147912018320e-05
54001.00000  55001.00000  1.067450895541e-05
55001.00000  56001.00000  9.941418725640e-06
56001.00000  57001.00000  1.047782621084e-05
57001.00000  58001.00000  9.959298975146e-06
58001.00000  59001.00000  9.422891489950e-06
59001.00000  60001.00000  9.065286499819e-06
60001.00000  61001.00000  8.671921010675e-06
61001.00000  62001.00000  8.385837018570e-06
62001.00000  63001.00000  7.670627038308e-06
63001.00000  64001.00000  7.903070281893e-06
64001.00000  65001.00000  6.866015810514e-06
65001.00000  66001.00000  7.384543046204e-06
66001.00000  67001.00000  6.633572566929e-06
67001.00000  68001.00000  6.293847826304e-06
68001.00000  69001.00000  6.579931818409e-06
69001.00000  70001.00000  5.775320590614e-06
70001.00000  71001.00000  6.115045331239e-06
71001.00000  72001.00000  6.186566329265e-06
72001.00000  73001.00000  6.204446578772e-06
73001.00000  74001.00000  5.131631608379e-06
74001.00000  75001.00000  4.809787117261e-06
75001.00000  76001.00000  5.167392107392e-06
76001.00000  77001.00000  4.863427865781e-06
77001.00000  78001.00000  4.881308115287e-06
78001.00000  79001.00000  4.005175889466e-06
79001.00000  80001.00000  4.219738883545e-06
80001.00000  81001.00000  4.452182127130e-06
81001.00000  82001.00000  3.933654891440e-06
82001.00000  83001.00000  4.148217885519e-06
83001.00000  84001.00000  4.094577136999e-06
84001.00000  85001.00000  3.754852396375e-06
85001.00000  86001.00000  3.486648653776e-06
86001.00000  87001.00000  3.093283164632e-06
87001.00000  88001.00000  3.468768404270e-06
88001.00000  89001.00000  3.218444911178e-06
89001.00000  90001.00000  2.842959671541e-06
90001.00000  91001.00000  3.111163414139e-06
91001.00000  92001.00000  2.789318923021e-06
92001.00000  93001.00000  2.914480669567e-06
93001.00000  94001.00000  2.771438673515e-06
94001.00000  95001.00000  2.646276926969e-06
95001.00000  96001.00000  2.628396677462e-06
96001.00000  97001.00000  2.395953433877e-06
97001.00000  98001.00000  2.771438673515e-06
98001.00000  99001.00000  2.521115180423e-06
99001.00000  100001.00000  2.181390439799e-06
100001.00000  101001.00000  2.753558424008e-06
101001.00000  102001.00000  2.431713932890e-06
102001.00000  103001.00000  2.127749691279e-06
103001.00000  104001.00000  1.966827445720e-06
104001.00000  105001.00000  2.270791687331e-06
105001.00000  106001.00000  2.270791687331e-06
106001.00000  107001.00000  2.181390439799e-06
107001.00000  108001.00000  2.091989192266e-06
108001.00000  109001.00000  1.877426198187e-06
109001.00000  110001.00000  2.020468194240e-06
110001.00000  111001.00000  1.913186697200e-06
111001.00000  112001.00000  1.644982954602e-06
112001.00000  113001.00000  1.698623703122e-06
113001.00000  114001.00000  1.698623703122e-06
114001.00000  115001.00000  1.519821208056e-06
115001.00000  116001.00000  1.394659461511e-06
116001.00000  117001.00000  1.537701457563e-06
117001.00000  118001.00000  1.913186697200e-06
118001.00000  119001.00000  1.394659461511e-06
119001.00000  120001.00000  1.841665699174e-06
120001.00000  121001.00000  1.537701457563e-06
121001.00000  122001.00000  1.573461956576e-06
122001.00000  123001.00000  1.162216217925e-06
123001.00000  124001.00000  1.609222455589e-06
124001.00000  125001.00000  1.126455718912e-06
125001.00000  126001.00000  1.233737215952e-06
126001.00000  127001.00000  1.323138463484e-06
127001.00000  128001.00000  1.108575469406e-06
128001.00000  129001.00000  1.287377964471e-06
129001.00000  130001.00000  1.001293972367e-06
130001.00000  131001.00000  1.180096467432e-06
131001.00000  132001.00000  9.118927248339e-07
132001.00000  133001.00000  1.269497714965e-06
133001.00000  134001.00000  1.072814970393e-06
134001.00000  135001.00000  1.233737215952e-06
135001.00000  136001.00000  1.072814970393e-06
136001.00000  137001.00000  1.144335968419e-06
137001.00000  138001.00000  1.090695219899e-06
138001.00000  139001.00000  7.509704792749e-07
139001.00000  140001.00000  1.108575469406e-06
140001.00000  141001.00000  8.046112277946e-07
141001.00000  142001.00000  9.476532238469e-07
142001.00000  143001.00000  6.615692317422e-07
143001.00000  144001.00000  8.761322258208e-07
144001.00000  145001.00000  8.582519763142e-07
145001.00000  146001.00000  6.973297307553e-07
146001.00000  147001.00000  1.037054471380e-06
147001.00000  148001.00000  9.118927248339e-07
148001.00000  149001.00000  9.297729743404e-07
149001.00000  150001.00000  9.655334733535e-07
150001.00000  151001.00000  7.330902297684e-07
151001.00000  152001.00000  6.615692317422e-07
152001.00000  153001.00000  9.655334733535e-07
153001.00000  154001.00000  6.794494812488e-07
154001.00000  155001.00000  9.118927248339e-07
155001.00000  156001.00000  6.615692317422e-07
156001.00000  157001.00000  6.079284832226e-07
157001.00000  158001.00000  5.542877347029e-07
158001.00000  159001.00000  7.152099802618e-07
159001.00000  160001.00000  5.364074851964e-07
160001.00000  161001.00000  6.794494812488e-07
161001.00000  162001.00000  4.470062376637e-07
162001.00000  163001.00000  5.900482337160e-07
163001.00000  164001.00000  7.509704792749e-07
164001.00000  165001.00000  5.006469861833e-07
165001.00000  166001.00000  7.509704792749e-07
166001.00000  167001.00000  5.006469861833e-07
167001.00000  168001.00000  6.079284832226e-07
168001.00000  169001.00000  4.827667366767e-07
169001.00000  170001.00000  5.542877347029e-07
170001.00000  171001.00000  4.827667366767e-07
171001.00000  172001.00000  5.542877347029e-07
172001.00000  173001.00000  3.754852396375e-07
173001.00000  174001.00000  5.185272356898e-07
174001.00000  175001.00000  4.470062376637e-07
175001.00000  176001.00000  4.648864871702e-07
176001.00000  177001.00000  3.397247406244e-07
177001.00000  178001.00000  3.576049901309e-07
178001.00000  179001.00000  5.185272356898e-07
179001.00000  180001.00000  5.006469861833e-07
180001.00000  181001.00000  4.648864871702e-07
181001.00000  182001.00000  3.218444911178e-07
182001.00000  183001.00000  4.470062376637e-07
183001.00000  184001.00000  3.754852396375e-07
184001.00000  185001.00000  4.648864871702e-07
185001.00000  186001.00000  4.470062376637e-07
186001.00000  187001.00000  3.397247406244e-07
187001.00000  188001.00000  4.112457386506e-07
188001.00000  189001.00000  2.324432435851e-07
189001.00000  190001.00000  2.503234930916e-07
190001.00000  191001.00000  3.576049901309e-07
191001.00000  192001.00000  3.218444911178e-07
192001.00000  193001.00000  2.860839921047e-07
193001.00000  194001.00000  4.112457386506e-07
194001.00000  195001.00000  3.754852396375e-07
195001.00000  196001.00000  3.754852396375e-07
196001.00000  197001.00000  3.754852396375e-07
197001.00000  198001.00000  3.754852396375e-07
198001.00000  199001.00000  3.933654891440e-07
