10001.00000  11001.00000  3.527515169617e-04
11001.00000  12001.00000  2.901502263678e-04
12001.00000  13001.00000  2.350175549754e-04
13001.00000  14001.00000  1.907688010125e-04
14001.00000  15001.00000  1.612696317038e-04
15001.00000  16001.00000  1.376627901070e-04
16001.00000  17001.00000  1.175838389872e-04
17001.00000  18001.00000  1.004698170982e-04
18001.00000  19001.00000  8.680862418686e-05
19001.00000  20001.00000  7.431088451794e-05
20001.00000  21001.00000  6.669214231736e-05
21001.00000  22001.00000  5.989907661143e-05
22001.00000  23001.00000  5.096675816937e-05
23001.00000  24001.00000  4.605022995127e-05
24001.00000  25001.00000  4.259740097367e-05
25001.00000  26001.00000  3.993271774095e-05
26001.00000  27001.00000  3.287693678672e-05
27001.00000  28001.00000  3.208879104184e-05
28001.00000  29001.00000  2.923645406034e-05
29001.00000  30001.00000  2.739744732227e-05
30001.00000  31001.00000  2.319400334954e-05
31001.00000  32001.00000  2.146758886074e-05
32001.00000  33001.00000  2.056685086658e-05
33001.00000  34001.00000  1.955352062315e-05
34001.00000  35001.00000  1.756439088606e-05
35001.00000  36001.00000  1.550019964945e-05
36001.00000  37001.00000  1.456193090554e-05
37001.00000  38001.00000  1.351106991235e-05
38001.00000  39001.00000  1.328588541381e-05
39001.00000  40001.00000  1.193477842258e-05
40001.00000  41001.00000  1.073379443037e-05
41001.00000  42001.00000  9.833056436212e-06
42001.00000  43001.00000  1.020836393378e-05
43001.00000  44001.00000  8.557010944490e-06
44001.00000  45001.00000  9.270095189864e-06
45001.00000  46001.00000  7.768865199603e-06
46001.00000  47001.00000  7.881457448872e-06
47001.00000  48001.00000  7.356026952281e-06
48001.00000  49001.00000  6.980719454715e-06
49001.00000  50001.00000  6.492819707880e-06
50001.00000  51001.00000  6.492819707880e-06
51001.00000  52001.00000  5.667143213237e-06
52001.00000  53001.00000  5.329366465428e-06
53001.00000  54001.00000  4.541220720541e-06
54001.00000  55001.00000  4.691343719567e-06
55001.00000  56001.00000  4.728874469323e-06
56001.00000  57001.00000  4.691343719567e-06
57001.00000  58001.00000  4.278505472245e-06
58001.00000  59001.00000  4.541220720541e-06
59001.00000  60001.00000  4.203443972732e-06
60001.00000  61001.00000  3.978259474193e-06
61001.00000  62001.00000  3.377767478088e-06
62001.00000  63001.00000  3.978259474193e-06
63001.00000  64001.00000  2.777275481984e-06
64001.00000  65001.00000  3.002459980523e-06
65001.00000  66001.00000  3.039990730279e-06
66001.00000  67001.00000  3.077521480036e-06
67001.00000  68001.00000  2.852336981497e-06
68001.00000  69001.00000  2.889867731253e-06
69001.00000  70001.00000  2.477029483931e-06
70001.00000  71001.00000  1.989129737096e-06
71001.00000  72001.00000  1.876537487827e-06
72001.00000  73001.00000  2.326906484905e-06
73001.00000  74001.00000  1.876537487827e-06
74001.00000  75001.00000  2.514560233688e-06
75001.00000  76001.00000  1.688883739044e-06
76001.00000  77001.00000  1.576291489774e-06
77001.00000  78001.00000  1.651352989288e-06
78001.00000  79001.00000  1.801475988314e-06
79001.00000  80001.00000  1.726414488801e-06
80001.00000  81001.00000  1.388637740992e-06
81001.00000  82001.00000  1.763945238557e-06
82001.00000  83001.00000  1.388637740992e-06
83001.00000  84001.00000  1.688883739044e-06
84001.00000  85001.00000  7.881457448872e-07
85001.00000  86001.00000  1.538760740018e-06
86001.00000  87001.00000  1.163453242453e-06
87001.00000  88001.00000  1.200983992209e-06
88001.00000  89001.00000  1.238514741966e-06
89001.00000  90001.00000  1.200983992209e-06
90001.00000  91001.00000  1.013330243426e-06
91001.00000  92001.00000  1.163453242453e-06
92001.00000  93001.00000  1.088391742940e-06
93001.00000  94001.00000  6.755534956176e-07
94001.00000  95001.00000  9.757994936699e-07
95001.00000  96001.00000  1.125922492696e-06
96001.00000  97001.00000  1.276045491722e-06
97001.00000  98001.00000  7.881457448872e-07
98001.00000  99001.00000  8.256764946438e-07
99001.00000  100001.00000  5.254304965915e-07
100001.00000  101001.00000  8.256764946438e-07
101001.00000  102001.00000  7.130842453742e-07
102001.00000  103001.00000  8.256764946438e-07
103001.00000  104001.00000  7.130842453742e-07
104001.00000  105001.00000  6.004919961046e-07
105001.00000  106001.00000  6.380227458611e-07
106001.00000  107001.00000  8.256764946438e-07
107001.00000  108001.00000  4.503689970784e-07
108001.00000  109001.00000  7.506149951307e-07
109001.00000  110001.00000  6.755534956176e-07
110001.00000  111001.00000  4.878997468349e-07
111001.00000  112001.00000  6.380227458611e-07
112001.00000  113001.00000  8.632072444003e-07
113001.00000  114001.00000  6.380227458611e-07
114001.00000  115001.00000  6.004919961046e-07
115001.00000  116001.00000  3.002459980523e-07
116001.00000  117001.00000  4.128382473219e-07
117001.00000  118001.00000  4.128382473219e-07
118001.00000  119001.00000  1.501229990261e-07
119001.00000  120001.00000  5.629612463480e-07
120001.00000  121001.00000  3.753074975653e-07
121001.00000  122001.00000  3.002459980523e-07
122001.00000  123001.00000  4.128382473219e-07
123001.00000  124001.00000  4.128382473219e-07
124001.00000  125001.00000  3.002459980523e-07
125001.00000  126001.00000  3.753074975653e-07
126001.00000  127001.00000  3.753074975653e-07
127001.00000  128001.00000  4.503689970784e-07
128001.00000  129001.00000  3.377767478088e-07
129001.00000  130001.00000  3.377767478088e-07
130001.00000  131001.00000  2.251844985392e-07
131001.00000  132001.00000  1.876537487827e-07
132001.00000  133001.00000  3.753074975653e-07
133001.00000  134001.00000  4.878997468349e-07
134001.00000  135001.00000  4.503689970784e-07
135001.00000  136001.00000  4.503689970784e-07
136001.00000  137001.00000  1.876537487827e-07
137001.00000  138001.00000  4.503689970784e-07
138001.00000  139001.00000  2.251844985392e-07
139001.00000  140001.00000  2.627152482957e-07
140001.00000  141001.00000  3.377767478088e-07
141001.00000  142001.00000  2.251844985392e-07
142001.00000  143001.00000  3.002459980523e-07
143001.00000  144001.00000  1.876537487827e-07
144001.00000  145001.00000  2.627152482957e-07
145001.00000  146001.00000  2.251844985392e-07
146001.00000  147001.00000  2.251844985392e-07
147001.00000  148001.00000  2.627152482957e-07
148001.00000  149001.00000  1.501229990261e-07
149001.00000  150001.00000  7.506149951307e-08
150001.00000  151001.00000  1.501229990261e-07
151001.00000  152001.00000  3.753074975653e-07
152001.00000  153001.00000  1.876537487827e-07
153001.00000  154001.00000  1.125922492696e-07
154001.00000  155001.00000  1.501229990261e-07
155001.00000  156001.00000  1.876537487827e-07
156001.00000  157001.00000  1.501229990261e-07
157001.00000  158001.00000  2.251844985392e-07
158001.00000  159001.00000  1.501229990261e-07
159001.00000  160001.00000  7.506149951307e-08
160001.00000  161001.00000  1.876537487827e-07
161001.00000  162001.00000  1.501229990261e-07
162001.00000  163001.00000  1.125922492696e-07
163001.00000  164001.00000  1.876537487827e-07
164001.00000  165001.00000  1.501229990261e-07
165001.00000  166001.00000  2.251844985392e-07
166001.00000  167001.00000  2.627152482957e-07
167001.00000  168001.00000  7.506149951307e-08
168001.00000  169001.00000  1.501229990261e-07
169001.00000  170001.00000  1.125922492696e-07
170001.00000  171001.00000  1.501229990261e-07
171001.00000  172001.00000  7.506149951307e-08
172001.00000  173001.00000  1.125922492696e-07
173001.00000  174001.00000  2.251844985392e-07
174001.00000  175001.00000  1.125922492696e-07
175001.00000  176001.00000  1.125922492696e-07
176001.00000  177001.00000  3.753074975653e-08
177001.00000  178001.00000  1.501229990261e-07
178001.00000  179001.00000  7.506149951307e-08
179001.00000  180001.00000  1.876537487827e-07
180001.00000  181001.00000  0.000000000000e+00
181001.00000  182001.00000  1.125922492696e-07
182001.00000  183001.00000  1.876537487827e-07
183001.00000  184001.00000  3.753074975653e-08
184001.00000  185001.00000  1.501229990261e-07
185001.00000  186001.00000  1.125922492696e-07
186001.00000  187001.00000  1.876537487827e-07
187001.00000  188001.00000  3.753074975653e-08
188001.00000  189001.00000  7.506149951307e-08
189001.00000  190001.00000  7.506149951307e-08
190001.00000  191001.00000  1.125922492696e-07
191001.00000  192001.00000  3.753074975653e-08
192001.00000  193001.00000  1.501229990261e-07
193001.00000  194001.00000  1.125922492696e-07
194001.00000  195001.00000  1.125922492696e-07
195001.00000  196001.00000  1.501229990261e-07
196001.00000  197001.00000  7.506149951307e-08
197001.00000  198001.00000  0.000000000000e+00
198001.00000  199001.00000  3.753074975653e-08
