10001.00000  11001.00000  1.619398702064e-04
11001.00000  12001.00000  1.416597749780e-04
12001.00000  13001.00000  1.235561291386e-04
13001.00000  14001.00000  1.102466897875e-04
14001.00000  15001.00000  9.359735344767e-05
15001.00000  16001.00000  8.361778136447e-05
16001.00000  17001.00000  7.162223542325e-05
17001.00000  18001.00000  6.551413552509e-05
18001.00000  19001.00000  5.659771383468e-05
19001.00000  20001.00000  5.040937617102e-05
20001.00000  21001.00000  4.428121683149e-05
21001.00000  22001.00000  3.952712922602e-05
22001.00000  23001.00000  3.548515178931e-05
23001.00000  24001.00000  3.265677055568e-05
24001.00000  25001.00000  2.929681412566e-05
25001.00000  26001.00000  2.680944339537e-05
26001.00000  27001.00000  2.456278596157e-05
27001.00000  28001.00000  2.168425612450e-05
28001.00000  29001.00000  1.981872807679e-05
29001.00000  30001.00000  1.870542908057e-05
30001.00000  31001.00000  1.607764226067e-05
31001.00000  32001.00000  1.574666147802e-05
32001.00000  33001.00000  1.477377857141e-05
33001.00000  34001.00000  1.281798303752e-05
34001.00000  35001.00000  1.223625923769e-05
35001.00000  36001.00000  1.100260359324e-05
36001.00000  37001.00000  1.014004761419e-05
37001.00000  38001.00000  9.066867500717e-06
38001.00000  39001.00000  8.354757331966e-06
39001.00000  40001.00000  7.803122694201e-06
40001.00000  41001.00000  7.632617442528e-06
41001.00000  42001.00000  7.020804480644e-06
42001.00000  43001.00000  6.790120904851e-06
43001.00000  44001.00000  6.408991518759e-06
44001.00000  45001.00000  5.496286936275e-06
45001.00000  46001.00000  5.456168053529e-06
46001.00000  47001.00000  5.014860343317e-06
47001.00000  48001.00000  4.352898777999e-06
48001.00000  49001.00000  4.663820119285e-06
49001.00000  50001.00000  4.001858553967e-06
50001.00000  51001.00000  3.440194195515e-06
51001.00000  52001.00000  3.540491402382e-06
52001.00000  53001.00000  3.059064809423e-06
53001.00000  54001.00000  3.099183692170e-06
54001.00000  55001.00000  2.878529837064e-06
55001.00000  56001.00000  2.838410954317e-06
56001.00000  57001.00000  2.758173188824e-06
57001.00000  58001.00000  2.768202909511e-06
58001.00000  59001.00000  2.236627713119e-06
59001.00000  60001.00000  2.156389947626e-06
60001.00000  61001.00000  2.236627713119e-06
61001.00000  62001.00000  1.755201120161e-06
62001.00000  63001.00000  1.795320002907e-06
63001.00000  64001.00000  1.404160896129e-06
64001.00000  65001.00000  1.484398661622e-06
65001.00000  66001.00000  1.624814751235e-06
66001.00000  67001.00000  1.384101454755e-06
67001.00000  68001.00000  1.323923130636e-06
68001.00000  69001.00000  1.263744806516e-06
69001.00000  70001.00000  1.203566482396e-06
70001.00000  71001.00000  1.243685365143e-06
71001.00000  72001.00000  9.427937445436e-07
72001.00000  73001.00000  9.127045824837e-07
73001.00000  74001.00000  9.227343031703e-07
74001.00000  75001.00000  8.324668169906e-07
75001.00000  76001.00000  8.625559790505e-07
76001.00000  77001.00000  8.324668169906e-07
77001.00000  78001.00000  9.127045824837e-07
78001.00000  79001.00000  6.719912860045e-07
79001.00000  80001.00000  6.619615653178e-07
80001.00000  81001.00000  6.017832411980e-07
81001.00000  82001.00000  5.315751963916e-07
82001.00000  83001.00000  5.716940791381e-07
83001.00000  84001.00000  5.716940791381e-07
84001.00000  85001.00000  5.516346377649e-07
85001.00000  86001.00000  5.115157550183e-07
86001.00000  87001.00000  5.115157550183e-07
87001.00000  88001.00000  4.814265929584e-07
88001.00000  89001.00000  4.613671515852e-07
89001.00000  90001.00000  5.616643584515e-07
90001.00000  91001.00000  3.109213412857e-07
91001.00000  92001.00000  3.008916205990e-07
92001.00000  93001.00000  4.312779895253e-07
93001.00000  94001.00000  3.109213412857e-07
94001.00000  95001.00000  3.410105033456e-07
95001.00000  96001.00000  3.109213412857e-07
96001.00000  97001.00000  2.005944137327e-07
97001.00000  98001.00000  2.507430171658e-07
98001.00000  99001.00000  1.905646930460e-07
99001.00000  100001.00000  1.805349723594e-07
100001.00000  101001.00000  1.604755309861e-07
101001.00000  102001.00000  2.708024585391e-07
102001.00000  103001.00000  1.303863689262e-07
103001.00000  104001.00000  2.106241344193e-07
104001.00000  105001.00000  1.504458102995e-07
105001.00000  106001.00000  2.005944137327e-07
106001.00000  107001.00000  1.705052516728e-07
107001.00000  108001.00000  1.805349723594e-07
108001.00000  109001.00000  1.905646930460e-07
109001.00000  110001.00000  1.504458102995e-07
110001.00000  111001.00000  1.705052516728e-07
111001.00000  112001.00000  1.303863689262e-07
112001.00000  113001.00000  1.103269275530e-07
113001.00000  114001.00000  9.026748617971e-08
114001.00000  115001.00000  1.203566482396e-07
115001.00000  116001.00000  1.103269275530e-07
116001.00000  117001.00000  1.303863689262e-07
117001.00000  118001.00000  6.017832411980e-08
118001.00000  119001.00000  4.011888274654e-08
119001.00000  120001.00000  1.103269275530e-07
120001.00000  121001.00000  9.026748617971e-08
121001.00000  122001.00000  4.011888274654e-08
122001.00000  123001.00000  9.026748617971e-08
123001.00000  124001.00000  8.023776549307e-08
124001.00000  125001.00000  6.017832411980e-08
125001.00000  126001.00000  8.023776549307e-08
126001.00000  127001.00000  7.020804480644e-08
127001.00000  128001.00000  7.020804480644e-08
128001.00000  129001.00000  1.002972068663e-07
129001.00000  130001.00000  7.020804480644e-08
130001.00000  131001.00000  7.020804480644e-08
131001.00000  132001.00000  5.014860343317e-08
132001.00000  133001.00000  3.008916205990e-08
133001.00000  134001.00000  4.011888274654e-08
134001.00000  135001.00000  4.011888274654e-08
135001.00000  136001.00000  6.017832411980e-08
136001.00000  137001.00000  3.008916205990e-08
137001.00000  138001.00000  3.008916205990e-08
138001.00000  139001.00000  3.008916205990e-08
139001.00000  140001.00000  1.002972068663e-08
140001.00000  141001.00000  5.014860343317e-08
141001.00000  142001.00000  4.011888274654e-08
142001.00000  143001.00000  4.011888274654e-08
143001.00000  144001.00000  2.005944137327e-08
144001.00000  145001.00000  2.005944137327e-08
145001.00000  146001.00000  0.000000000000e+00
146001.00000  147001.00000  2.005944137327e-08
147001.00000  148001.00000  1.002972068663e-08
148001.00000  149001.00000  4.011888274654e-08
149001.00000  150001.00000  3.008916205990e-08
150001.00000  151001.00000  3.008916205990e-08
151001.00000  152001.00000  1.002972068663e-08
152001.00000  153001.00000  3.008916205990e-08
153001.00000  154001.00000  3.008916205990e-08
154001.00000  155001.00000  3.008916205990e-08
155001.00000  156001.00000  2.005944137327e-08
156001.00000  157001.00000  2.005944137327e-08
157001.00000  158001.00000  3.008916205990e-08
158001.00000  159001.00000  1.002972068663e-08
159001.00000  160001.00000  4.011888274654e-08
160001.00000  161001.00000  0.000000000000e+00
161001.00000  162001.00000  1.002972068663e-08
162001.00000  163001.00000  1.002972068663e-08
163001.00000  164001.00000  0.000000000000e+00
164001.00000  165001.00000  3.008916205990e-08
165001.00000  166001.00000  1.002972068663e-08
166001.00000  167001.00000  3.008916205990e-08
167001.00000  168001.00000  0.000000000000e+00
168001.00000  169001.00000  1.002972068663e-08
169001.00000  170001.00000  1.002972068663e-08
170001.00000  171001.00000  4.011888274654e-08
171001.00000  172001.00000  0.000000000000e+00
172001.00000  173001.00000  2.005944137327e-08
173001.00000  174001.00000  0.000000000000e+00
174001.00000  175001.00000  1.002972068663e-08
175001.00000  176001.00000  0.000000000000e+00
176001.00000  177001.00000  0.000000000000e+00
177001.00000  178001.00000  1.002972068663e-08
178001.00000  179001.00000  0.000000000000e+00
179001.00000  180001.00000  0.000000000000e+00
180001.00000  181001.00000  2.005944137327e-08
181001.00000  182001.00000  0.000000000000e+00
182001.00000  183001.00000  1.002972068663e-08
183001.00000  184001.00000  2.005944137327e-08
184001.00000  185001.00000  0.000000000000e+00
185001.00000  186001.00000  0.000000000000e+00
186001.00000  187001.00000  0.000000000000e+00
187001.00000  188001.00000  1.002972068663e-08
188001.00000  189001.00000  0.000000000000e+00
189001.00000  190001.00000  1.002972068663e-08
190001.00000  191001.00000  0.000000000000e+00
191001.00000  192001.00000  0.000000000000e+00
192001.00000  193001.00000  0.000000000000e+00
193001.00000  194001.00000  0.000000000000e+00
194001.00000  195001.00000  0.000000000000e+00
195001.00000  196001.00000  0.000000000000e+00
196001.00000  197001.00000  0.000000000000e+00
197001.00000  198001.00000  0.000000000000e+00
198001.00000  199001.00000  0.000000000000e+00
