10001.00000  11001.00000  4.695312874708e-05
11001.00000  12001.00000  5.131099613798e-05
12001.00000  13001.00000  5.650765658864e-05
13001.00000  14001.00000  5.864802508594e-05
14001.00000  15001.00000  6.289983818192e-05
15001.00000  16001.00000  6.405679412641e-05
16001.00000  17001.00000  6.796152043905e-05
17001.00000  18001.00000  6.683348839318e-05
18001.00000  19001.00000  6.637070601538e-05
19001.00000  20001.00000  6.613931482649e-05
20001.00000  21001.00000  6.508841317691e-05
21001.00000  22001.00000  6.370006604353e-05
22001.00000  23001.00000  6.092337177676e-05
23001.00000  24001.00000  5.816596010907e-05
24001.00000  25001.00000  5.658478698494e-05
25001.00000  26001.00000  5.237153908710e-05
26001.00000  27001.00000  4.883318215687e-05
27001.00000  28001.00000  4.772443271007e-05
28001.00000  29001.00000  4.230602237006e-05
29001.00000  30001.00000  4.147687060985e-05
30001.00000  31001.00000  3.967394759636e-05
31001.00000  32001.00000  3.723469881340e-05
32001.00000  33001.00000  3.543177579990e-05
33001.00000  34001.00000  3.340710289705e-05
34001.00000  35001.00000  3.158489728449e-05
35001.00000  36001.00000  2.975305037238e-05
36001.00000  37001.00000  2.783443176444e-05
37001.00000  38001.00000  2.691850830839e-05
38001.00000  39001.00000  2.652321502736e-05
39001.00000  40001.00000  2.454674862219e-05
40001.00000  41001.00000  2.242566272397e-05
41001.00000  42001.00000  2.147117406976e-05
42001.00000  43001.00000  2.050704411603e-05
43001.00000  44001.00000  1.917654477987e-05
44001.00000  45001.00000  1.798102363723e-05
45001.00000  46001.00000  1.784604544371e-05
46001.00000  47001.00000  1.643841571125e-05
47001.00000  48001.00000  1.546464445797e-05
48001.00000  49001.00000  1.508863377601e-05
49001.00000  50001.00000  1.449087320470e-05
50001.00000  51001.00000  1.318929776715e-05
51001.00000  52001.00000  1.312180867039e-05
52001.00000  53001.00000  1.258189589629e-05
53001.00000  54001.00000  1.258189589629e-05
54001.00000  55001.00000  1.147314644949e-05
55001.00000  56001.00000  1.129960305782e-05
56001.00000  57001.00000  1.042224479992e-05
57001.00000  58001.00000  9.814842929062e-06
58001.00000  59001.00000  9.323136652655e-06
59001.00000  60001.00000  9.477397445253e-06
60001.00000  61001.00000  8.426495795678e-06
61001.00000  62001.00000  8.638604385500e-06
62001.00000  63001.00000  8.310800201229e-06
63001.00000  64001.00000  7.549137537775e-06
64001.00000  65001.00000  8.069767712794e-06
65001.00000  66001.00000  7.664833132224e-06
66001.00000  67001.00000  7.202050754429e-06
67001.00000  68001.00000  6.295768597915e-06
68001.00000  69001.00000  6.237920800691e-06
69001.00000  70001.00000  6.450029390513e-06
70001.00000  71001.00000  5.929399215494e-06
71001.00000  72001.00000  5.832986220120e-06
72001.00000  73001.00000  5.543747233999e-06
73001.00000  74001.00000  5.476258137237e-06
74001.00000  75001.00000  4.994193160367e-06
75001.00000  76001.00000  4.714595473783e-06
76001.00000  77001.00000  4.859214966844e-06
77001.00000  78001.00000  4.521769483035e-06
78001.00000  79001.00000  4.396432589049e-06
79001.00000  80001.00000  4.406073888587e-06
80001.00000  81001.00000  4.174682699689e-06
81001.00000  82001.00000  3.547998229759e-06
82001.00000  83001.00000  3.779389418656e-06
83001.00000  84001.00000  3.547998229759e-06
84001.00000  85001.00000  3.200911446413e-06
85001.00000  86001.00000  3.133422349651e-06
86001.00000  87001.00000  3.258759243637e-06
87001.00000  88001.00000  3.326248340399e-06
88001.00000  89001.00000  2.795976865843e-06
89001.00000  90001.00000  2.892389861217e-06
90001.00000  91001.00000  2.526020478796e-06
91001.00000  92001.00000  2.583868276020e-06
92001.00000  93001.00000  2.641716073245e-06
93001.00000  94001.00000  2.680281271394e-06
94001.00000  95001.00000  2.497096580184e-06
95001.00000  96001.00000  2.362118386660e-06
96001.00000  97001.00000  2.371759686198e-06
97001.00000  98001.00000  2.198216294525e-06
98001.00000  99001.00000  2.150009796838e-06
99001.00000  100001.00000  2.043955501926e-06
100001.00000  101001.00000  2.053596801464e-06
101001.00000  102001.00000  2.063238101001e-06
102001.00000  103001.00000  1.928259907478e-06
103001.00000  104001.00000  1.899336008866e-06
104001.00000  105001.00000  1.706510018118e-06
105001.00000  106001.00000  1.571531824594e-06
106001.00000  107001.00000  1.561890525057e-06
107001.00000  108001.00000  1.426912331534e-06
108001.00000  109001.00000  1.417271031996e-06
109001.00000  110001.00000  1.648662220893e-06
110001.00000  111001.00000  1.571531824594e-06
111001.00000  112001.00000  1.475118829220e-06
112001.00000  113001.00000  1.504042727833e-06
113001.00000  114001.00000  1.349781935234e-06
114001.00000  115001.00000  1.156955944487e-06
115001.00000  116001.00000  1.253368939861e-06
116001.00000  117001.00000  9.930538523510e-07
117001.00000  118001.00000  1.263010239398e-06
118001.00000  119001.00000  1.128032045874e-06
119001.00000  120001.00000  1.099108147262e-06
120001.00000  121001.00000  8.966408569772e-07
121001.00000  122001.00000  1.060542949113e-06
122001.00000  123001.00000  9.641299537389e-07
123001.00000  124001.00000  8.195104606781e-07
124001.00000  125001.00000  1.050901649575e-06
125001.00000  126001.00000  1.147314644949e-06
126001.00000  127001.00000  8.966408569772e-07
127001.00000  128001.00000  9.255647555893e-07
128001.00000  129001.00000  7.134561657668e-07
129001.00000  130001.00000  8.966408569772e-07
130001.00000  131001.00000  8.291517602154e-07
131001.00000  132001.00000  6.266844699303e-07
132001.00000  133001.00000  8.291517602154e-07
133001.00000  134001.00000  5.399127740938e-07
134001.00000  135001.00000  5.206301750190e-07
135001.00000  136001.00000  6.556083685424e-07
136001.00000  137001.00000  4.724236773321e-07
137001.00000  138001.00000  5.881192717807e-07
138001.00000  139001.00000  5.495540736312e-07
139001.00000  140001.00000  5.206301750190e-07
140001.00000  141001.00000  4.434997787199e-07
141001.00000  142001.00000  4.917062764068e-07
142001.00000  143001.00000  3.760106819582e-07
143001.00000  144001.00000  4.242171796451e-07
144001.00000  145001.00000  2.795976865843e-07
145001.00000  146001.00000  4.242171796451e-07
146001.00000  147001.00000  4.242171796451e-07
147001.00000  148001.00000  4.434997787199e-07
148001.00000  149001.00000  4.627823777947e-07
149001.00000  150001.00000  2.699563870469e-07
150001.00000  151001.00000  2.699563870469e-07
151001.00000  152001.00000  2.024672902852e-07
152001.00000  153001.00000  3.760106819582e-07
153001.00000  154001.00000  3.760106819582e-07
154001.00000  155001.00000  2.410324884347e-07
155001.00000  156001.00000  2.506737879721e-07
156001.00000  157001.00000  2.603150875095e-07
157001.00000  158001.00000  2.217498893599e-07
158001.00000  159001.00000  2.506737879721e-07
159001.00000  160001.00000  2.121085898226e-07
160001.00000  161001.00000  1.639020921356e-07
161001.00000  162001.00000  1.928259907478e-07
162001.00000  163001.00000  2.217498893599e-07
163001.00000  164001.00000  2.217498893599e-07
164001.00000  165001.00000  1.542607925982e-07
165001.00000  166001.00000  1.639020921356e-07
166001.00000  167001.00000  1.542607925982e-07
167001.00000  168001.00000  1.831846912104e-07
168001.00000  169001.00000  1.735433916730e-07
169001.00000  170001.00000  1.542607925982e-07
170001.00000  171001.00000  1.349781935234e-07
171001.00000  172001.00000  1.639020921356e-07
172001.00000  173001.00000  1.542607925982e-07
173001.00000  174001.00000  1.446194930608e-07
174001.00000  175001.00000  1.542607925982e-07
175001.00000  176001.00000  1.446194930608e-07
176001.00000  177001.00000  1.349781935234e-07
177001.00000  178001.00000  1.349781935234e-07
178001.00000  179001.00000  5.784779722433e-08
179001.00000  180001.00000  1.446194930608e-07
180001.00000  181001.00000  1.349781935234e-07
181001.00000  182001.00000  5.784779722433e-08
182001.00000  183001.00000  5.784779722433e-08
183001.00000  184001.00000  4.820649768694e-08
184001.00000  185001.00000  7.713039629911e-08
185001.00000  186001.00000  5.784779722433e-08
186001.00000  187001.00000  4.820649768694e-08
187001.00000  188001.00000  6.748909676172e-08
188001.00000  189001.00000  2.892389861217e-08
189001.00000  190001.00000  5.784779722433e-08
190001.00000  191001.00000  3.856519814956e-08
191001.00000  192001.00000  1.928259907478e-08
192001.00000  193001.00000  3.856519814956e-08
193001.00000  194001.00000  0.000000000000e+00
194001.00000  195001.00000  9.641299537389e-09
195001.00000  196001.00000  9.641299537389e-09
196001.00000  197001.00000  0.000000000000e+00
197001.00000  198001.00000  0.000000000000e+00
198001.00000  199001.00000  0.000000000000e+00
