10001.00000  11001.00000  4.615460243470e-04
11001.00000  12001.00000  3.642572211422e-04
12001.00000  13001.00000  2.869424048810e-04
13001.00000  14001.00000  2.277352189306e-04
14001.00000  15001.00000  1.871518895937e-04
15001.00000  16001.00000  1.563371502929e-04
16001.00000  17001.00000  1.348144844410e-04
17001.00000  18001.00000  1.124976242773e-04
18001.00000  19001.00000  9.832125581031e-05
19001.00000  20001.00000  8.485966222400e-05
20001.00000  21001.00000  7.274819896789e-05
21001.00000  22001.00000  6.389293239047e-05
22001.00000  23001.00000  5.730111960189e-05
23001.00000  24001.00000  4.574559236409e-05
24001.00000  25001.00000  4.078187791486e-05
25001.00000  26001.00000  3.645351891513e-05
26001.00000  27001.00000  3.450774285103e-05
27001.00000  28001.00000  2.918664096146e-05
28001.00000  29001.00000  2.656579973227e-05
29001.00000  30001.00000  2.323018362239e-05
30001.00000  31001.00000  2.156237556745e-05
31001.00000  32001.00000  1.949747035657e-05
32001.00000  33001.00000  1.894153433825e-05
33001.00000  34001.00000  1.647953197144e-05
34001.00000  35001.00000  1.493085306328e-05
35001.00000  36001.00000  1.302478671477e-05
36001.00000  37001.00000  1.072162321033e-05
37001.00000  38001.00000  1.084075235711e-05
38001.00000  39001.00000  1.000684832964e-05
39001.00000  40001.00000  9.093524870986e-06
40001.00000  41001.00000  8.378749990297e-06
41001.00000  42001.00000  7.743394540796e-06
42001.00000  43001.00000  7.306587669264e-06
43001.00000  44001.00000  7.346297384858e-06
44001.00000  45001.00000  5.718199045511e-06
45001.00000  46001.00000  5.916747623480e-06
46001.00000  47001.00000  4.765165871259e-06
47001.00000  48001.00000  5.718199045511e-06
48001.00000  49001.00000  4.844585302447e-06
49001.00000  50001.00000  4.407778430915e-06
50001.00000  51001.00000  3.176777247506e-06
51001.00000  52001.00000  3.375325825475e-06
52001.00000  53001.00000  2.501712082411e-06
53001.00000  54001.00000  2.342873220036e-06
54001.00000  55001.00000  2.739970375974e-06
55001.00000  56001.00000  2.660550944786e-06
56001.00000  57001.00000  2.581131513599e-06
57001.00000  58001.00000  2.462002366817e-06
58001.00000  59001.00000  2.303163504442e-06
59001.00000  60001.00000  1.866356632910e-06
60001.00000  61001.00000  1.747227486128e-06
61001.00000  62001.00000  1.747227486128e-06
62001.00000  63001.00000  1.628098339347e-06
63001.00000  64001.00000  1.588388623753e-06
64001.00000  65001.00000  1.508969192565e-06
65001.00000  66001.00000  1.707517770534e-06
66001.00000  67001.00000  1.389840045784e-06
67001.00000  68001.00000  1.111872036627e-06
68001.00000  69001.00000  8.736137430642e-07
69001.00000  70001.00000  1.151581752221e-06
70001.00000  71001.00000  9.530331742518e-07
71001.00000  72001.00000  9.927428898456e-07
72001.00000  73001.00000  8.339040274703e-07
73001.00000  74001.00000  8.736137430642e-07
74001.00000  75001.00000  9.530331742518e-07
75001.00000  76001.00000  8.736137430642e-07
76001.00000  77001.00000  9.530331742518e-07
77001.00000  78001.00000  7.941943118765e-07
78001.00000  79001.00000  3.176777247506e-07
79001.00000  80001.00000  8.339040274703e-07
80001.00000  81001.00000  6.750651650950e-07
81001.00000  82001.00000  6.353554495012e-07
82001.00000  83001.00000  5.162263027197e-07
83001.00000  84001.00000  5.559360183136e-07
84001.00000  85001.00000  3.970971559383e-07
85001.00000  86001.00000  3.573874403444e-07
86001.00000  87001.00000  3.970971559383e-07
87001.00000  88001.00000  3.573874403444e-07
88001.00000  89001.00000  3.573874403444e-07
89001.00000  90001.00000  2.779680091568e-07
90001.00000  91001.00000  5.162263027197e-07
91001.00000  92001.00000  5.162263027197e-07
92001.00000  93001.00000  3.970971559383e-07
93001.00000  94001.00000  2.382582935630e-07
94001.00000  95001.00000  1.191291467815e-07
95001.00000  96001.00000  3.176777247506e-07
96001.00000  97001.00000  7.941943118765e-08
97001.00000  98001.00000  2.382582935630e-07
98001.00000  99001.00000  3.970971559383e-07
99001.00000  100001.00000  1.985485779691e-07
100001.00000  101001.00000  3.176777247506e-07
101001.00000  102001.00000  2.382582935630e-07
102001.00000  103001.00000  3.573874403444e-07
103001.00000  104001.00000  2.382582935630e-07
104001.00000  105001.00000  1.588388623753e-07
105001.00000  106001.00000  1.588388623753e-07
106001.00000  107001.00000  7.941943118765e-08
107001.00000  108001.00000  7.941943118765e-08
108001.00000  109001.00000  0.000000000000e+00
109001.00000  110001.00000  1.191291467815e-07
110001.00000  111001.00000  1.191291467815e-07
111001.00000  112001.00000  7.941943118765e-08
112001.00000  113001.00000  1.588388623753e-07
113001.00000  114001.00000  1.588388623753e-07
114001.00000  115001.00000  3.970971559383e-08
115001.00000  116001.00000  7.941943118765e-08
116001.00000  117001.00000  1.985485779691e-07
117001.00000  118001.00000  1.191291467815e-07
118001.00000  119001.00000  1.588388623753e-07
119001.00000  120001.00000  7.941943118765e-08
120001.00000  121001.00000  1.191291467815e-07
121001.00000  122001.00000  1.588388623753e-07
122001.00000  123001.00000  7.941943118765e-08
123001.00000  124001.00000  3.970971559383e-08
124001.00000  125001.00000  3.970971559383e-08
125001.00000  126001.00000  7.941943118765e-08
126001.00000  127001.00000  1.985485779691e-07
127001.00000  128001.00000  3.970971559383e-08
128001.00000  129001.00000  0.000000000000e+00
129001.00000  130001.00000  3.970971559383e-08
130001.00000  131001.00000  3.970971559383e-08
131001.00000  132001.00000  7.941943118765e-08
132001.00000  133001.00000  3.970971559383e-08
133001.00000  134001.00000  0.000000000000e+00
134001.00000  135001.00000  0.000000000000e+00
135001.00000  136001.00000  3.970971559383e-08
136001.00000  137001.00000  7.941943118765e-08
137001.00000  138001.00000  3.970971559383e-08
138001.00000  139001.00000  3.970971559383e-08
139001.00000  140001.00000  0.000000000000e+00
140001.00000  141001.00000  0.000000000000e+00
141001.00000  142001.00000  7.941943118765e-08
142001.00000  143001.00000  3.970971559383e-08
143001.00000  144001.00000  0.000000000000e+00
144001.00000  145001.00000  0.000000000000e+00
145001.00000  146001.00000  3.970971559383e-08
146001.00000  147001.00000  0.000000000000e+00
147001.00000  148001.00000  0.000000000000e+00
148001.00000  149001.00000  0.000000000000e+00
149001.00000  150001.00000  0.000000000000e+00
150001.00000  151001.00000  3.970971559383e-08
151001.00000  152001.00000  3.970971559383e-08
152001.00000  153001.00000  0.000000000000e+00
153001.00000  154001.00000  3.970971559383e-08
154001.00000  155001.00000  0.000000000000e+00
155001.00000  156001.00000  0.000000000000e+00
156001.00000  157001.00000  0.000000000000e+00
157001.00000  158001.00000  3.970971559383e-08
158001.00000  159001.00000  0.000000000000e+00
159001.00000  160001.00000  3.970971559383e-08
160001.00000  161001.00000  3.970971559383e-08
161001.00000  162001.00000  3.970971559383e-08
162001.00000  163001.00000  3.970971559383e-08
163001.00000  164001.00000  0.000000000000e+00
164001.00000  165001.00000  3.970971559383e-08
165001.00000  166001.00000  3.970971559383e-08
166001.00000  167001.00000  3.970971559383e-08
167001.00000  168001.00000  0.000000000000e+00
168001.00000  169001.00000  3.970971559383e-08
169001.00000  170001.00000  0.000000000000e+00
170001.00000  171001.00000  0.000000000000e+00
171001.00000  172001.00000  3.970971559383e-08
172001.00000  173001.00000  0.000000000000e+00
173001.00000  174001.00000  0.000000000000e+00
174001.00000  175001.00000  0.000000000000e+00
175001.00000  176001.00000  0.000000000000e+00
176001.00000  177001.00000  0.000000000000e+00
177001.00000  178001.00000  0.000000000000e+00
178001.00000  179001.00000  0.000000000000e+00
179001.00000  180001.00000  0.000000000000e+00
180001.00000  181001.00000  0.000000000000e+00
181001.00000  182001.00000  0.000000000000e+00
182001.00000  183001.00000  0.000000000000e+00
183001.00000  184001.00000  7.941943118765e-08
184001.00000  185001.00000  0.000000000000e+00
185001.00000  186001.00000  0.000000000000e+00
186001.00000  187001.00000  0.000000000000e+00
187001.00000  188001.00000  0.000000000000e+00
188001.00000  189001.00000  0.000000000000e+00
189001.00000  190001.00000  0.000000000000e+00
190001.00000  191001.00000  0.000000000000e+00
191001.00000  192001.00000  0.000000000000e+00
192001.00000  193001.00000  0.000000000000e+00
193001.00000  194001.00000  0.000000000000e+00
194001.00000  195001.00000  0.000000000000e+00
195001.00000  196001.00000  0.000000000000e+00
196001.00000  197001.00000  0.000000000000e+00
197001.00000  198001.00000  0.000000000000e+00
198001.00000  199001.00000  0.000000000000e+00
