10001.00000  11001.00000  4.208186203605e-05
11001.00000  12001.00000  4.560373460988e-05
12001.00000  13001.00000  4.649674503458e-05
13001.00000  14001.00000  4.827273205899e-05
14001.00000  15001.00000  4.892493068378e-05
15001.00000  16001.00000  5.024939558334e-05
16001.00000  17001.00000  4.917577630870e-05
17001.00000  18001.00000  4.837307030896e-05
18001.00000  19001.00000  4.613552733470e-05
19001.00000  20001.00000  4.325581956066e-05
20001.00000  21001.00000  4.064702506152e-05
21001.00000  22001.00000  3.833924531229e-05
22001.00000  23001.00000  3.542943606325e-05
23001.00000  24001.00000  3.202796938938e-05
24001.00000  25001.00000  2.929876899029e-05
25001.00000  26001.00000  2.787396584076e-05
26001.00000  27001.00000  2.404104469203e-05
27001.00000  28001.00000  2.365975934216e-05
28001.00000  29001.00000  2.151252079287e-05
29001.00000  30001.00000  1.866291449381e-05
30001.00000  31001.00000  1.766956581914e-05
31001.00000  32001.00000  1.704746866935e-05
32001.00000  33001.00000  1.459921537016e-05
33001.00000  34001.00000  1.340519019556e-05
34001.00000  35001.00000  1.203055617101e-05
35001.00000  36001.00000  1.147869579619e-05
36001.00000  37001.00000  1.027463679659e-05
37001.00000  38001.00000  9.913419096713e-06
38001.00000  39001.00000  9.090645446986e-06
39001.00000  40001.00000  8.107330597312e-06
40001.00000  41001.00000  7.304624597578e-06
41001.00000  42001.00000  7.615673172475e-06
42001.00000  43001.00000  6.401580347877e-06
43001.00000  44001.00000  5.940024398031e-06
44001.00000  45001.00000  5.327961073233e-06
45001.00000  46001.00000  5.177453698283e-06
46001.00000  47001.00000  5.167419873287e-06
47001.00000  48001.00000  4.495153598510e-06
48001.00000  49001.00000  4.093800598643e-06
49001.00000  50001.00000  3.903157923706e-06
50001.00000  51001.00000  3.702481423772e-06
51001.00000  52001.00000  3.210823998935e-06
52001.00000  53001.00000  2.628862149128e-06
53001.00000  54001.00000  2.719166574098e-06
54001.00000  55001.00000  2.608794499135e-06
55001.00000  56001.00000  2.518490074165e-06
56001.00000  57001.00000  2.357948874218e-06
57001.00000  58001.00000  2.237542974258e-06
58001.00000  59001.00000  2.006764999335e-06
59001.00000  60001.00000  1.836189974391e-06
60001.00000  61001.00000  1.695716424438e-06
61001.00000  62001.00000  1.454904624518e-06
62001.00000  63001.00000  1.304397249568e-06
63001.00000  64001.00000  1.454904624518e-06
64001.00000  65001.00000  1.374634024544e-06
65001.00000  66001.00000  1.414769324531e-06
66001.00000  67001.00000  1.103720749634e-06
67001.00000  68001.00000  1.033483974657e-06
68001.00000  69001.00000  9.331457246906e-07
69001.00000  70001.00000  9.532133746839e-07
70001.00000  71001.00000  8.829765997072e-07
71001.00000  72001.00000  6.321309747904e-07
72001.00000  73001.00000  7.324692247571e-07
73001.00000  74001.00000  7.324692247571e-07
74001.00000  75001.00000  6.020294998004e-07
75001.00000  76001.00000  6.923339247704e-07
76001.00000  77001.00000  5.618941998137e-07
77001.00000  78001.00000  6.521986247838e-07
78001.00000  79001.00000  6.421647997871e-07
79001.00000  80001.00000  5.518603748170e-07
80001.00000  81001.00000  4.214206498603e-07
81001.00000  82001.00000  4.615559498470e-07
82001.00000  83001.00000  4.715897748436e-07
83001.00000  84001.00000  4.314544748569e-07
84001.00000  85001.00000  3.913191748703e-07
85001.00000  86001.00000  3.010147499002e-07
86001.00000  87001.00000  3.812853498736e-07
87001.00000  88001.00000  3.110485748969e-07
88001.00000  89001.00000  3.311162248902e-07
89001.00000  90001.00000  2.408117999202e-07
90001.00000  91001.00000  2.608794499135e-07
91001.00000  92001.00000  2.307779749235e-07
92001.00000  93001.00000  2.809470999068e-07
93001.00000  94001.00000  2.307779749235e-07
94001.00000  95001.00000  2.006764999335e-07
95001.00000  96001.00000  2.107103249301e-07
96001.00000  97001.00000  1.204058999601e-07
97001.00000  98001.00000  1.605411999468e-07
98001.00000  99001.00000  1.304397249568e-07
99001.00000  100001.00000  1.505073749501e-07
100001.00000  101001.00000  1.705750249434e-07
101001.00000  102001.00000  1.605411999468e-07
102001.00000  103001.00000  1.404735499534e-07
103001.00000  104001.00000  1.404735499534e-07
104001.00000  105001.00000  1.204058999601e-07
105001.00000  106001.00000  7.023677497671e-08
106001.00000  107001.00000  9.030442497006e-08
107001.00000  108001.00000  9.030442497006e-08
108001.00000  109001.00000  9.030442497006e-08
109001.00000  110001.00000  7.023677497671e-08
110001.00000  111001.00000  5.016912498337e-08
111001.00000  112001.00000  8.027059997339e-08
112001.00000  113001.00000  4.013529998669e-08
113001.00000  114001.00000  1.103720749634e-07
114001.00000  115001.00000  4.013529998669e-08
115001.00000  116001.00000  7.023677497671e-08
116001.00000  117001.00000  6.020294998004e-08
117001.00000  118001.00000  5.016912498337e-08
118001.00000  119001.00000  6.020294998004e-08
119001.00000  120001.00000  7.023677497671e-08
120001.00000  121001.00000  2.006764999335e-08
121001.00000  122001.00000  5.016912498337e-08
122001.00000  123001.00000  6.020294998004e-08
123001.00000  124001.00000  3.010147499002e-08
124001.00000  125001.00000  8.027059997339e-08
125001.00000  126001.00000  5.016912498337e-08
126001.00000  127001.00000  7.023677497671e-08
127001.00000  128001.00000  4.013529998669e-08
128001.00000  129001.00000  4.013529998669e-08
129001.00000  130001.00000  1.003382499667e-08
130001.00000  131001.00000  4.013529998669e-08
131001.00000  132001.00000  2.006764999335e-08
132001.00000  133001.00000  2.006764999335e-08
133001.00000  134001.00000  3.010147499002e-08
134001.00000  135001.00000  3.010147499002e-08
135001.00000  136001.00000  3.010147499002e-08
136001.00000  137001.00000  2.006764999335e-08
137001.00000  138001.00000  1.003382499667e-08
138001.00000  139001.00000  3.010147499002e-08
139001.00000  140001.00000  1.003382499667e-08
140001.00000  141001.00000  0.000000000000e+00
141001.00000  142001.00000  1.003382499667e-08
142001.00000  143001.00000  1.003382499667e-08
143001.00000  144001.00000  4.013529998669e-08
144001.00000  145001.00000  1.003382499667e-08
145001.00000  146001.00000  0.000000000000e+00
146001.00000  147001.00000  1.003382499667e-08
147001.00000  148001.00000  1.003382499667e-08
148001.00000  149001.00000  1.003382499667e-08
149001.00000  150001.00000  0.000000000000e+00
150001.00000  151001.00000  0.000000000000e+00
151001.00000  152001.00000  0.000000000000e+00
152001.00000  153001.00000  4.013529998669e-08
153001.00000  154001.00000  0.000000000000e+00
154001.00000  155001.00000  2.006764999335e-08
155001.00000  156001.00000  0.000000000000e+00
156001.00000  157001.00000  1.003382499667e-08
157001.00000  158001.00000  0.000000000000e+00
158001.00000  159001.00000  0.000000000000e+00
159001.00000  160001.00000  2.006764999335e-08
160001.00000  161001.00000  1.003382499667e-08
161001.00000  162001.00000  0.000000000000e+00
162001.00000  163001.00000  0.000000000000e+00
163001.00000  164001.00000  1.003382499667e-08
164001.00000  165001.00000  0.000000000000e+00
165001.00000  166001.00000  0.000000000000e+00
166001.00000  167001.00000  0.000000000000e+00
167001.00000  168001.00000  1.003382499667e-08
168001.00000  169001.00000  0.000000000000e+00
169001.00000  170001.00000  0.000000000000e+00
170001.00000  171001.00000  1.003382499667e-08
171001.00000  172001.00000  0.000000000000e+00
172001.00000  173001.00000  0.000000000000e+00
173001.00000  174001.00000  2.006764999335e-08
174001.00000  175001.00000  0.000000000000e+00
175001.00000  176001.00000  0.000000000000e+00
176001.00000  177001.00000  0.000000000000e+00
177001.00000  178001.00000  1.003382499667e-08
178001.00000  179001.00000  1.003382499667e-08
179001.00000  180001.00000  0.000000000000e+00
180001.00000  181001.00000  0.000000000000e+00
181001.00000  182001.00000  0.000000000000e+00
182001.00000  183001.00000  0.000000000000e+00
183001.00000  184001.00000  0.000000000000e+00
184001.00000  185001.00000  0.000000000000e+00
185001.00000  186001.00000  0.000000000000e+00
186001.00000  187001.00000  0.000000000000e+00
187001.00000  188001.00000  0.000000000000e+00
188001.00000  189001.00000  0.000000000000e+00
189001.00000  190001.00000  0.000000000000e+00
190001.00000  191001.00000  0.000000000000e+00
191001.00000  192001.00000  0.000000000000e+00
192001.00000  193001.00000  0.000000000000e+00
193001.00000  194001.00000  0.000000000000e+00
194001.00000  195001.00000  0.000000000000e+00
195001.00000  196001.00000  0.000000000000e+00
196001.00000  197001.00000  0.000000000000e+00
197001.00000  198001.00000  0.000000000000e+00
198001.00000  199001.00000  0.000000000000e+00
