300.00000  350.00000  1.599204485524e+00
350.00000  400.00000  1.132440778347e+00
400.00000  450.00000  8.356799815763e-01
450.00000  500.00000  6.406179080773e-01
500.00000  550.00000  5.037876456831e-01
550.00000  600.00000  4.039499436766e-01
600.00000  650.00000  3.303652674608e-01
650.00000  700.00000  2.744263002987e-01
700.00000  750.00000  2.315129877941e-01
750.00000  800.00000  1.967512622103e-01
800.00000  850.00000  1.699707851901e-01
850.00000  900.00000  1.468376408935e-01
900.00000  950.00000  1.284739706051e-01
950.00000  1000.00000  1.127998533288e-01
1000.00000  1050.00000  9.997591514737e-02
1050.00000  1100.00000  8.920799082408e-02
1100.00000  1150.00000  8.026074447038e-02
1150.00000  1200.00000  7.231535661371e-02
1200.00000  1250.00000  6.542561831430e-02
1250.00000  1300.00000  5.974842016452e-02
1300.00000  1350.00000  5.397260507097e-02
1350.00000  1400.00000  4.936525134157e-02
1400.00000  1450.00000  4.527638366507e-02
1450.00000  1500.00000  4.188679977173e-02
1500.00000  1550.00000  3.848077972108e-02
1550.00000  1600.00000  3.554169595727e-02
1600.00000  1650.00000  3.287903847526e-02
1650.00000  1700.00000  3.070647731990e-02
1700.00000  1750.00000  2.852868647813e-02
1750.00000  1800.00000  2.702029549716e-02
1800.00000  1850.00000  2.493813320694e-02
1850.00000  1900.00000  2.348502748233e-02
1900.00000  1950.00000  2.218208846756e-02
1950.00000  2000.00000  2.060347026905e-02
2000.00000  2050.00000  1.949178835737e-02
2050.00000  2100.00000  1.818137836201e-02
2100.00000  2150.00000  1.735135241855e-02
2150.00000  2200.00000  1.647351219931e-02
2200.00000  2250.00000  1.561061394125e-02
2250.00000  2300.00000  1.472306144725e-02
2300.00000  2350.00000  1.398716985921e-02
2350.00000  2400.00000  1.337305525477e-02
2400.00000  2450.00000  1.254302931130e-02
2450.00000  2500.00000  1.208356400506e-02
2500.00000  2550.00000  1.157852571723e-02
2550.00000  2600.00000  1.090688456226e-02
2600.00000  2650.00000  1.042052372589e-02
2650.00000  2700.00000  1.000140171484e-02
2700.00000  2750.00000  9.521764761007e-03
2750.00000  2800.00000  9.152698319898e-03
2800.00000  2850.00000  8.813515801146e-03
2850.00000  2900.00000  8.295029748251e-03
2900.00000  2950.00000  7.913262640140e-03
2950.00000  3000.00000  7.924469111024e-03
3000.00000  3050.00000  7.431384392133e-03
3050.00000  3100.00000  7.143004541388e-03
3100.00000  3150.00000  6.807557512930e-03
3150.00000  3200.00000  6.554291270955e-03
3200.00000  3250.00000  6.392170992168e-03
3250.00000  3300.00000  6.066436238476e-03
3300.00000  3350.00000  5.924487607280e-03
3350.00000  3400.00000  5.569616029291e-03
3400.00000  3450.00000  5.468010693277e-03
3450.00000  3500.00000  5.264052923190e-03
3500.00000  3550.00000  5.213250255183e-03
3550.00000  3600.00000  4.964466601561e-03
3600.00000  3650.00000  4.777692086829e-03
3650.00000  3700.00000  4.597641454628e-03
3700.00000  3750.00000  4.482588353554e-03
3750.00000  3800.00000  4.516954864264e-03
3800.00000  3850.00000  4.198691091162e-03
3850.00000  3900.00000  4.074672813380e-03
3900.00000  3950.00000  3.944677751127e-03
3950.00000  4000.00000  3.815429786933e-03
4000.00000  4050.00000  3.714571548978e-03
4050.00000  4100.00000  3.625666879966e-03
4100.00000  4150.00000  3.556933858545e-03
4150.00000  4200.00000  3.363435461283e-03
4200.00000  4250.00000  3.369412245755e-03
4250.00000  4300.00000  3.157983495079e-03
4300.00000  4350.00000  3.220739732028e-03
4350.00000  4400.00000  3.042930394004e-03
4400.00000  4450.00000  2.938336665755e-03
4450.00000  4500.00000  2.948048940521e-03
4500.00000  4550.00000  2.857650075391e-03
4550.00000  4600.00000  2.809835799619e-03
4600.00000  4650.00000  2.649956815009e-03
4650.00000  4700.00000  2.587947676118e-03
4700.00000  4750.00000  2.518467556638e-03
4750.00000  4800.00000  2.369047944853e-03
4800.00000  4850.00000  2.357094375910e-03
4850.00000  4900.00000  2.372036337089e-03
4900.00000  4950.00000  2.361576964264e-03
4950.00000  5000.00000  2.295832335078e-03
5000.00000  5050.00000  2.255489039897e-03
5050.00000  5100.00000  2.156124998059e-03
5100.00000  5150.00000  2.114287506760e-03
5150.00000  5200.00000  2.071702917401e-03
5200.00000  5250.00000  1.985039542565e-03
5250.00000  5300.00000  1.957396914385e-03
5300.00000  5350.00000  1.907341344437e-03
5350.00000  5400.00000  1.877457422080e-03
5400.00000  5450.00000  1.844585107487e-03
5450.00000  5500.00000  1.800506322011e-03
5500.00000  5550.00000  1.766139811300e-03
5550.00000  5600.00000  1.713842947175e-03
5600.00000  5650.00000  1.680970632583e-03
5650.00000  5700.00000  1.597295649983e-03
5700.00000  5750.00000  1.604019532513e-03
5750.00000  5800.00000  1.583847884922e-03
5800.00000  5850.00000  1.534539413033e-03
5850.00000  5900.00000  1.539769099446e-03
5900.00000  5950.00000  1.533792314974e-03
5950.00000  6000.00000  1.469541881907e-03
6000.00000  6050.00000  1.472530274142e-03
6050.00000  6100.00000  1.421727606135e-03
6100.00000  6150.00000  1.363453957539e-03
6150.00000  6200.00000  1.361212663363e-03
6200.00000  6250.00000  1.295468034177e-03
6250.00000  6300.00000  1.311157093415e-03
6300.00000  6350.00000  1.235700189463e-03
6350.00000  6400.00000  1.682464828701e-03
6400.00000  6450.00000  1.234953091404e-03
6450.00000  6500.00000  1.208057561283e-03
6500.00000  6550.00000  1.192368502045e-03
6550.00000  6600.00000  1.174438148631e-03
6600.00000  6650.00000  1.149783912687e-03
6650.00000  6700.00000  1.109440617505e-03
6700.00000  6750.00000  1.122888382565e-03
6750.00000  6800.00000  1.059385047557e-03
6800.00000  6850.00000  1.087774773796e-03
6850.00000  6900.00000  1.072085714558e-03
6900.00000  6950.00000  1.068350224264e-03
6950.00000  7000.00000  9.607681037784e-04
7000.00000  7050.00000  9.689861824266e-04
7050.00000  7100.00000  1.005593987314e-03
7100.00000  7150.00000  9.256544950089e-04
7150.00000  7200.00000  9.077241415947e-04
7200.00000  7250.00000  8.636453561180e-04
7250.00000  7300.00000  8.972647687697e-04
7300.00000  7350.00000  8.576685716466e-04
7350.00000  7400.00000  8.270375512307e-04
7400.00000  7450.00000  8.591627677645e-04
7450.00000  7500.00000  8.868053959447e-04
7500.00000  7550.00000  8.203136687004e-04
7550.00000  7600.00000  7.650284123399e-04
7600.00000  7650.00000  7.911768444023e-04
7650.00000  7700.00000  8.016362172272e-04
7700.00000  7750.00000  8.046246094629e-04
7750.00000  7800.00000  7.971536288737e-04
7800.00000  7850.00000  7.515806472792e-04
7850.00000  7900.00000  7.276735093936e-04
7900.00000  7950.00000  7.067547637437e-04
7950.00000  8000.00000  6.873302142116e-04
8000.00000  8050.00000  7.194554307454e-04
8050.00000  8100.00000  7.172141365686e-04
8100.00000  8150.00000  6.566991937956e-04
8150.00000  8200.00000  6.948011948008e-04
8200.00000  8250.00000  6.656643705027e-04
8250.00000  8300.00000  6.596875860313e-04
8300.00000  8350.00000  6.537108015599e-04
8350.00000  8400.00000  6.387688403814e-04
8400.00000  8450.00000  6.312978597922e-04
8450.00000  8500.00000  5.999197413173e-04
8500.00000  8550.00000  6.111262122012e-04
8550.00000  8600.00000  6.118733102601e-04
8600.00000  8650.00000  5.730242111960e-04
8650.00000  8700.00000  5.595764461353e-04
8700.00000  8750.00000  6.088849180244e-04
8750.00000  8800.00000  5.319338179551e-04
8800.00000  8850.00000  5.550938577818e-04
8850.00000  8900.00000  5.625648383710e-04
8900.00000  8950.00000  5.110150723051e-04
8950.00000  9000.00000  5.252099354247e-04
9000.00000  9050.00000  5.663003286656e-04
9050.00000  9100.00000  5.304396218372e-04
9100.00000  9150.00000  4.893492285963e-04
9150.00000  9200.00000  5.140034645408e-04
9200.00000  9250.00000  5.117621703641e-04
9250.00000  9300.00000  4.848666402427e-04
9300.00000  9350.00000  4.871079344195e-04
9350.00000  9400.00000  4.998086014213e-04
9400.00000  9450.00000  4.594653062393e-04
9450.00000  9500.00000  4.639478945928e-04
9500.00000  9550.00000  4.632007965339e-04
9550.00000  9600.00000  4.691775810053e-04
9600.00000  9650.00000  4.385465605894e-04
9650.00000  9700.00000  4.475117372965e-04
9700.00000  9750.00000  4.602124042982e-04
9750.00000  9800.00000  4.325697761179e-04
9800.00000  9850.00000  4.639478945928e-04
9850.00000  9900.00000  3.952148731717e-04
9900.00000  9950.00000  4.377994625304e-04
9950.00000  10000.00000  4.146394227037e-04
