10001.00000  11001.00000  4.383207323988e-05
11001.00000  12001.00000  4.302286573391e-05
12001.00000  13001.00000  4.217512453719e-05
13001.00000  14001.00000  4.167418655730e-05
14001.00000  15001.00000  4.084571220595e-05
15001.00000  16001.00000  3.666480675846e-05
16001.00000  17001.00000  3.612533508781e-05
17001.00000  18001.00000  3.252243500172e-05
18001.00000  19001.00000  3.117375582511e-05
19001.00000  20001.00000  2.903513598791e-05
20001.00000  21001.00000  2.681944876919e-05
21001.00000  22001.00000  2.514323322112e-05
22001.00000  23001.00000  2.159813367117e-05
23001.00000  24001.00000  2.036505556684e-05
24001.00000  25001.00000  1.772549774975e-05
25001.00000  26001.00000  1.608781589244e-05
26001.00000  27001.00000  1.414186450904e-05
27001.00000  28001.00000  1.375652760144e-05
28001.00000  29001.00000  1.198397782646e-05
29001.00000  30001.00000  1.053896442295e-05
30001.00000  31001.00000  9.614155844703e-06
31001.00000  32001.00000  9.999492752307e-06
32001.00000  33001.00000  8.631546730315e-06
33001.00000  34001.00000  7.610403925166e-06
34001.00000  35001.00000  6.319525284695e-06
35001.00000  36001.00000  5.799320459430e-06
36001.00000  37001.00000  5.934188377091e-06
37001.00000  38001.00000  5.259848788786e-06
38001.00000  39001.00000  5.086447180364e-06
39001.00000  40001.00000  4.450641282819e-06
40001.00000  41001.00000  4.161638602116e-06
41001.00000  42001.00000  3.834102230653e-06
42001.00000  43001.00000  3.622166931471e-06
43001.00000  44001.00000  3.256096869248e-06
44001.00000  45001.00000  3.159762642347e-06
45001.00000  46001.00000  2.504689899422e-06
46001.00000  47001.00000  2.273487754860e-06
47001.00000  48001.00000  2.678091507843e-06
48001.00000  49001.00000  2.177153527959e-06
49001.00000  50001.00000  1.984485074157e-06
50001.00000  51001.00000  1.695482393455e-06
51001.00000  52001.00000  1.599148166554e-06
52001.00000  53001.00000  1.425746558132e-06
53001.00000  54001.00000  1.811083465736e-06
54001.00000  55001.00000  1.734016084215e-06
55001.00000  56001.00000  1.021142805149e-06
56001.00000  57001.00000  1.175277568190e-06
57001.00000  58001.00000  1.290878640471e-06
58001.00000  59001.00000  1.175277568190e-06
59001.00000  60001.00000  1.117477032050e-06
60001.00000  61001.00000  9.633422690084e-07
61001.00000  62001.00000  9.440754236282e-07
62001.00000  63001.00000  5.972722067852e-07
63001.00000  64001.00000  8.670080421075e-07
64001.00000  65001.00000  5.202048252645e-07
65001.00000  66001.00000  4.816711345042e-07
66001.00000  67001.00000  5.780053614050e-07
67001.00000  68001.00000  7.514069698265e-07
68001.00000  69001.00000  6.165390521653e-07
69001.00000  70001.00000  4.816711345042e-07
70001.00000  71001.00000  5.972722067852e-07
71001.00000  72001.00000  2.890026807025e-07
72001.00000  73001.00000  4.046037529835e-07
73001.00000  74001.00000  3.853369076033e-07
74001.00000  75001.00000  4.046037529835e-07
75001.00000  76001.00000  1.734016084215e-07
76001.00000  77001.00000  4.046037529835e-07
77001.00000  78001.00000  1.926684538017e-07
78001.00000  79001.00000  4.816711345042e-07
79001.00000  80001.00000  3.082695260827e-07
80001.00000  81001.00000  2.119352991818e-07
81001.00000  82001.00000  2.504689899422e-07
82001.00000  83001.00000  1.156010722810e-07
83001.00000  84001.00000  1.734016084215e-07
84001.00000  85001.00000  2.504689899422e-07
85001.00000  86001.00000  1.348679176612e-07
86001.00000  87001.00000  1.541347630413e-07
87001.00000  88001.00000  1.156010722810e-07
88001.00000  89001.00000  2.504689899422e-07
89001.00000  90001.00000  1.348679176612e-07
90001.00000  91001.00000  2.312021445620e-07
91001.00000  92001.00000  1.541347630413e-07
92001.00000  93001.00000  1.156010722810e-07
93001.00000  94001.00000  1.348679176612e-07
94001.00000  95001.00000  1.348679176612e-07
95001.00000  96001.00000  1.926684538017e-07
96001.00000  97001.00000  7.706738152067e-08
97001.00000  98001.00000  1.348679176612e-07
98001.00000  99001.00000  1.541347630413e-07
99001.00000  100001.00000  5.780053614050e-08
100001.00000  101001.00000  1.348679176612e-07
101001.00000  102001.00000  7.706738152067e-08
102001.00000  103001.00000  9.633422690084e-08
103001.00000  104001.00000  1.541347630413e-07
104001.00000  105001.00000  5.780053614050e-08
105001.00000  106001.00000  1.541347630413e-07
106001.00000  107001.00000  9.633422690084e-08
107001.00000  108001.00000  5.780053614050e-08
108001.00000  109001.00000  5.780053614050e-08
109001.00000  110001.00000  1.348679176612e-07
110001.00000  111001.00000  5.780053614050e-08
111001.00000  112001.00000  7.706738152067e-08
112001.00000  113001.00000  3.853369076033e-08
113001.00000  114001.00000  1.926684538017e-08
114001.00000  115001.00000  5.780053614050e-08
115001.00000  116001.00000  1.926684538017e-08
116001.00000  117001.00000  5.780053614050e-08
117001.00000  118001.00000  9.633422690084e-08
118001.00000  119001.00000  1.926684538017e-08
119001.00000  120001.00000  1.926684538017e-08
120001.00000  121001.00000  1.926684538017e-08
121001.00000  122001.00000  0.000000000000e+00
122001.00000  123001.00000  1.926684538017e-08
123001.00000  124001.00000  9.633422690084e-08
124001.00000  125001.00000  5.780053614050e-08
125001.00000  126001.00000  5.780053614050e-08
126001.00000  127001.00000  0.000000000000e+00
127001.00000  128001.00000  1.926684538017e-08
128001.00000  129001.00000  1.926684538017e-08
129001.00000  130001.00000  5.780053614050e-08
130001.00000  131001.00000  3.853369076033e-08
131001.00000  132001.00000  1.926684538017e-08
132001.00000  133001.00000  0.000000000000e+00
133001.00000  134001.00000  3.853369076033e-08
134001.00000  135001.00000  1.926684538017e-08
135001.00000  136001.00000  3.853369076033e-08
136001.00000  137001.00000  1.926684538017e-08
137001.00000  138001.00000  1.926684538017e-08
138001.00000  139001.00000  3.853369076033e-08
139001.00000  140001.00000  0.000000000000e+00
140001.00000  141001.00000  0.000000000000e+00
141001.00000  142001.00000  0.000000000000e+00
142001.00000  143001.00000  5.780053614050e-08
143001.00000  144001.00000  1.926684538017e-08
144001.00000  145001.00000  1.926684538017e-08
145001.00000  146001.00000  3.853369076033e-08
146001.00000  147001.00000  0.000000000000e+00
147001.00000  148001.00000  1.926684538017e-08
148001.00000  149001.00000  0.000000000000e+00
149001.00000  150001.00000  1.926684538017e-08
150001.00000  151001.00000  0.000000000000e+00
151001.00000  152001.00000  0.000000000000e+00
152001.00000  153001.00000  0.000000000000e+00
153001.00000  154001.00000  1.926684538017e-08
154001.00000  155001.00000  0.000000000000e+00
155001.00000  156001.00000  1.926684538017e-08
156001.00000  157001.00000  0.000000000000e+00
157001.00000  158001.00000  0.000000000000e+00
158001.00000  159001.00000  0.000000000000e+00
159001.00000  160001.00000  0.000000000000e+00
160001.00000  161001.00000  0.000000000000e+00
161001.00000  162001.00000  1.926684538017e-08
162001.00000  163001.00000  0.000000000000e+00
163001.00000  164001.00000  1.926684538017e-08
164001.00000  165001.00000  0.000000000000e+00
165001.00000  166001.00000  0.000000000000e+00
166001.00000  167001.00000  0.000000000000e+00
167001.00000  168001.00000  1.926684538017e-08
168001.00000  169001.00000  0.000000000000e+00
169001.00000  170001.00000  0.000000000000e+00
170001.00000  171001.00000  0.000000000000e+00
171001.00000  172001.00000  0.000000000000e+00
172001.00000  173001.00000  0.000000000000e+00
173001.00000  174001.00000  0.000000000000e+00
174001.00000  175001.00000  0.000000000000e+00
175001.00000  176001.00000  0.000000000000e+00
176001.00000  177001.00000  0.000000000000e+00
177001.00000  178001.00000  1.926684538017e-08
178001.00000  179001.00000  0.000000000000e+00
179001.00000  180001.00000  1.926684538017e-08
180001.00000  181001.00000  1.926684538017e-08
181001.00000  182001.00000  3.853369076033e-08
182001.00000  183001.00000  1.926684538017e-08
183001.00000  184001.00000  0.000000000000e+00
184001.00000  185001.00000  0.000000000000e+00
185001.00000  186001.00000  0.000000000000e+00
186001.00000  187001.00000  0.000000000000e+00
187001.00000  188001.00000  1.926684538017e-08
188001.00000  189001.00000  1.926684538017e-08
189001.00000  190001.00000  0.000000000000e+00
190001.00000  191001.00000  0.000000000000e+00
191001.00000  192001.00000  0.000000000000e+00
192001.00000  193001.00000  1.926684538017e-08
193001.00000  194001.00000  0.000000000000e+00
194001.00000  195001.00000  0.000000000000e+00
195001.00000  196001.00000  0.000000000000e+00
196001.00000  197001.00000  0.000000000000e+00
197001.00000  198001.00000  0.000000000000e+00
198001.00000  199001.00000  0.000000000000e+00
