300.00000  350.00000  1.374990189247e-05
350.00000  400.00000  2.507335050981e-05
400.00000  450.00000  2.588216826819e-05
450.00000  500.00000  2.426453275142e-05
500.00000  550.00000  1.617635516762e-04
550.00000  600.00000  2.022044395952e-05
600.00000  650.00000  4.529379446933e-05
650.00000  700.00000  1.860280844276e-05
700.00000  750.00000  2.669098602657e-05
750.00000  800.00000  2.022044395952e-05
800.00000  850.00000  6.794069170399e-05
850.00000  900.00000  2.183807947628e-05
900.00000  950.00000  2.102926171790e-05
950.00000  1000.00000  2.022044395952e-05
1000.00000  1050.00000  2.345571499304e-05
1050.00000  1100.00000  2.588216826819e-05
1100.00000  1150.00000  2.102926171790e-05
1150.00000  1200.00000  5.580842532828e-05
1200.00000  1250.00000  8.896995342189e-05
1250.00000  1300.00000  1.819839956357e-04
1300.00000  1350.00000  1.415431077166e-04
1350.00000  1400.00000  2.499246873397e-04
1400.00000  1450.00000  3.477916361038e-04
1450.00000  1500.00000  5.022758279545e-04
1500.00000  1550.00000  6.761716460064e-04
1550.00000  1600.00000  9.034494361114e-04
1600.00000  1650.00000  1.101609786915e-03
1650.00000  1700.00000  1.358813834080e-03
1700.00000  1750.00000  1.806090054464e-03
1750.00000  1800.00000  1.991309321134e-03
1800.00000  1850.00000  2.127190704542e-03
1850.00000  1900.00000  2.080279274556e-03
1900.00000  1950.00000  2.415938644284e-03
1950.00000  2000.00000  2.651304611972e-03
2000.00000  2050.00000  2.923067378788e-03
2050.00000  2100.00000  3.128507089417e-03
2100.00000  2150.00000  3.244168028866e-03
2150.00000  2200.00000  3.600856660311e-03
2200.00000  2250.00000  3.728649866136e-03
2250.00000  2300.00000  3.890413417812e-03
2300.00000  2350.00000  4.199381801513e-03
2350.00000  2400.00000  4.265704857701e-03
2400.00000  2450.00000  4.178352539795e-03
2450.00000  2500.00000  4.102323670508e-03
2500.00000  2550.00000  4.161367366869e-03
2550.00000  2600.00000  4.185631899621e-03
2600.00000  2650.00000  4.153279189286e-03
2650.00000  2700.00000  4.142764558427e-03
2700.00000  2750.00000  4.190484806171e-03
2750.00000  2800.00000  4.185631899621e-03
2800.00000  2850.00000  4.233352147365e-03
2850.00000  2900.00000  4.141146922910e-03
2900.00000  2950.00000  4.115264754642e-03
2950.00000  3000.00000  4.192911259446e-03
3000.00000  3050.00000  4.161367366869e-03
3050.00000  3100.00000  4.193720077205e-03
3100.00000  3150.00000  4.087764950857e-03
3150.00000  3200.00000  3.974530464683e-03
3200.00000  3250.00000  3.965633469341e-03
3250.00000  3300.00000  3.938133665556e-03
3300.00000  3350.00000  3.938133665556e-03
3350.00000  3400.00000  3.782031838189e-03
3400.00000  3450.00000  3.743208585786e-03
3450.00000  3500.00000  3.744017403545e-03
3500.00000  3550.00000  3.611371291170e-03
3550.00000  3600.00000  3.621885922029e-03
3600.00000  3650.00000  3.649385725814e-03
3650.00000  3700.00000  3.506224982581e-03
3700.00000  3750.00000  3.454460646045e-03
3750.00000  3800.00000  3.386519954341e-03
3800.00000  3850.00000  3.266814926100e-03
3850.00000  3900.00000  3.295932365402e-03
3900.00000  3950.00000  3.212624136289e-03
3950.00000  4000.00000  3.111521916491e-03
4000.00000  4050.00000  3.016890238761e-03
4050.00000  4100.00000  2.953802453607e-03
4100.00000  4150.00000  2.842994420709e-03
4150.00000  4200.00000  2.886670579661e-03
4200.00000  4250.00000  2.819538705716e-03
4250.00000  4300.00000  2.669907420415e-03
4300.00000  4350.00000  2.692554317650e-03
4350.00000  4400.00000  2.665863331623e-03
4400.00000  4450.00000  2.638363527838e-03
4450.00000  4500.00000  2.501673326672e-03
4500.00000  4550.00000  2.450717807894e-03
4550.00000  4600.00000  2.470129434095e-03
4600.00000  4650.00000  2.419982733075e-03
4650.00000  4700.00000  2.331012779654e-03
4700.00000  4750.00000  2.409468102217e-03
4750.00000  4800.00000  2.304321793627e-03
4800.00000  4850.00000  2.156308143843e-03
4850.00000  4900.00000  2.082705727831e-03
4900.00000  4950.00000  2.111823167132e-03
4950.00000  5000.00000  2.128808340058e-03
5000.00000  5050.00000  2.055205924046e-03
5050.00000  5100.00000  1.958956610798e-03
5100.00000  5150.00000  1.952486068731e-03
5150.00000  5200.00000  1.931456807013e-03
5200.00000  5250.00000  1.881310105994e-03
5250.00000  5300.00000  1.823884045149e-03
5300.00000  5350.00000  1.848957395659e-03
5350.00000  5400.00000  1.702561381392e-03
5400.00000  5450.00000  1.727634731901e-03
5450.00000  5500.00000  1.735722909485e-03
5500.00000  5550.00000  1.686385026224e-03
5550.00000  5600.00000  1.615209063487e-03
5600.00000  5650.00000  1.612782610211e-03
5650.00000  5700.00000  1.571532904534e-03
5700.00000  5750.00000  1.569106451259e-03
5750.00000  5800.00000  1.530283198857e-03
5800.00000  5850.00000  1.518150932481e-03
5850.00000  5900.00000  1.434842703368e-03
5900.00000  5950.00000  1.378225460281e-03
5950.00000  6000.00000  1.408960535099e-03
6000.00000  6050.00000  1.382269549073e-03
6050.00000  6100.00000  1.358005016321e-03
6100.00000  6150.00000  1.284402600309e-03
6150.00000  6200.00000  1.329696394778e-03
6200.00000  6250.00000  1.250432254457e-03
6250.00000  6300.00000  1.287637871342e-03
6300.00000  6350.00000  1.225358903947e-03
6350.00000  6400.00000  1.459107236119e-03
6400.00000  6450.00000  1.194623829128e-03
6450.00000  6500.00000  1.187344469303e-03
6500.00000  6550.00000  1.160653483276e-03
6550.00000  6600.00000  1.184918016028e-03
6600.00000  6650.00000  1.091095156056e-03
6650.00000  6700.00000  1.112124417774e-03
6700.00000  6750.00000  1.080580525197e-03
6750.00000  6800.00000  1.066830623304e-03
6800.00000  6850.00000  1.039330819519e-03
6850.00000  6900.00000  9.624931324732e-04
6900.00000  6950.00000  1.002934020392e-03
6950.00000  7000.00000  9.778606698824e-04
7000.00000  7050.00000  9.406550529969e-04
7050.00000  7100.00000  9.721989455738e-04
7100.00000  7150.00000  8.387440154409e-04
7150.00000  7200.00000  8.597732771588e-04
7200.00000  7250.00000  8.573468238837e-04
7250.00000  7300.00000  8.694790902594e-04
7300.00000  7350.00000  7.805091368375e-04
7350.00000  7400.00000  8.290382023404e-04
7400.00000  7450.00000  7.675680527034e-04
7450.00000  7500.00000  7.829355901126e-04
7500.00000  7550.00000  7.910237676965e-04
7550.00000  7600.00000  7.287448003011e-04
7600.00000  7650.00000  7.546269685693e-04
7650.00000  7700.00000  7.360241601266e-04
7700.00000  7750.00000  7.255095292676e-04
7750.00000  7800.00000  7.141860806503e-04
7800.00000  7850.00000  7.060979030665e-04
7850.00000  7900.00000  7.198478049589e-04
7900.00000  7950.00000  7.052890853081e-04
7950.00000  8000.00000  6.583776553220e-04
8000.00000  8050.00000  6.834510058318e-04
8050.00000  8100.00000  6.389660291209e-04
8100.00000  8150.00000  6.688922861809e-04
8150.00000  8200.00000  6.745540104896e-04
8200.00000  8250.00000  6.357307580873e-04
8250.00000  8300.00000  6.357307580873e-04
8300.00000  8350.00000  6.745540104896e-04
8350.00000  8400.00000  6.284513982619e-04
8400.00000  8450.00000  6.049956832689e-04
8450.00000  8500.00000  6.203632206781e-04
8500.00000  8550.00000  5.993339589602e-04
8550.00000  8600.00000  5.855840570677e-04
8600.00000  8650.00000  5.402902625984e-04
8650.00000  8700.00000  5.588930710412e-04
8700.00000  8750.00000  5.087463700215e-04
8750.00000  8800.00000  5.475696224238e-04
8800.00000  8850.00000  5.224962719140e-04
8850.00000  8900.00000  5.346285382897e-04
8900.00000  8950.00000  4.982317391626e-04
8950.00000  9000.00000  4.860994727869e-04
9000.00000  9050.00000  5.475696224238e-04
9050.00000  9100.00000  5.362461738065e-04
9100.00000  9150.00000  5.322020850146e-04
9150.00000  9200.00000  5.192610008805e-04
9200.00000  9250.00000  4.982317391626e-04
9250.00000  9300.00000  4.658790288274e-04
9300.00000  9350.00000  4.626437577938e-04
9350.00000  9400.00000  4.585996690019e-04
9400.00000  9450.00000  4.472762203846e-04
9450.00000  9500.00000  4.456585848678e-04
9500.00000  9550.00000  4.472762203846e-04
9550.00000  9600.00000  4.367615895256e-04
9600.00000  9650.00000  4.157323278077e-04
9650.00000  9700.00000  4.505114914181e-04
9700.00000  9750.00000  4.416144960759e-04
9750.00000  9800.00000  4.076441502239e-04
9800.00000  9850.00000  3.898501595396e-04
9850.00000  9900.00000  3.955118838482e-04
9900.00000  9950.00000  3.777178931638e-04
9950.00000  10000.00000  4.319086829754e-04
