300.00000  350.00000  7.499998292863e-06
350.00000  400.00000  5.249998805004e-06
400.00000  450.00000  5.249998805004e-06
450.00000  500.00000  5.249998805004e-06
500.00000  550.00000  4.424998992789e-05
550.00000  600.00000  5.999998634291e-06
600.00000  650.00000  1.649999624430e-05
650.00000  700.00000  2.999999317145e-06
700.00000  750.00000  1.124999743930e-05
750.00000  800.00000  3.749999146432e-06
800.00000  850.00000  3.749999146432e-05
850.00000  900.00000  2.999999317145e-06
900.00000  950.00000  2.999999317145e-06
950.00000  1000.00000  7.499998292863e-06
1000.00000  1050.00000  6.749998463577e-06
1050.00000  1100.00000  6.749998463577e-06
1100.00000  1150.00000  1.124999743930e-05
1150.00000  1200.00000  4.499998975718e-06
1200.00000  1250.00000  1.049999761001e-05
1250.00000  1300.00000  4.424998992789e-05
1300.00000  1350.00000  1.949999556144e-05
1350.00000  1400.00000  3.899999112289e-05
1400.00000  1450.00000  4.349999009861e-05
1450.00000  1500.00000  6.074998617219e-05
1500.00000  1550.00000  1.072499755879e-04
1550.00000  1600.00000  1.394999682473e-04
1600.00000  1650.00000  2.137499513466e-04
1650.00000  1700.00000  2.669999392259e-04
1700.00000  1750.00000  4.139999057661e-04
1750.00000  1800.00000  4.957498871583e-04
1800.00000  1850.00000  6.029998627462e-04
1850.00000  1900.00000  5.969998641119e-04
1900.00000  1950.00000  7.559998279206e-04
1950.00000  2000.00000  8.677498024843e-04
2000.00000  2050.00000  9.854997756823e-04
2050.00000  2100.00000  1.219499722420e-03
2100.00000  2150.00000  1.310249701763e-03
2150.00000  2200.00000  1.458749667962e-03
2200.00000  2250.00000  1.703999612139e-03
2250.00000  2300.00000  1.731749605822e-03
2300.00000  2350.00000  1.984499548292e-03
2350.00000  2400.00000  2.015999541122e-03
2400.00000  2450.00000  2.102999521319e-03
2450.00000  2500.00000  2.167499506638e-03
2500.00000  2550.00000  2.187749502028e-03
2550.00000  2600.00000  2.225249493493e-03
2600.00000  2650.00000  2.261249485298e-03
2650.00000  2700.00000  2.347499465666e-03
2700.00000  2750.00000  2.339249467544e-03
2750.00000  2800.00000  2.503499430158e-03
2800.00000  2850.00000  2.570249414964e-03
2850.00000  2900.00000  2.639249399259e-03
2900.00000  2950.00000  2.687999388162e-03
2950.00000  3000.00000  2.692499387138e-03
3000.00000  3050.00000  2.766749370237e-03
3050.00000  3100.00000  2.758499372115e-03
3100.00000  3150.00000  2.726999379285e-03
3150.00000  3200.00000  2.756249372627e-03
3200.00000  3250.00000  2.822999357434e-03
3250.00000  3300.00000  2.727749379114e-03
3300.00000  3350.00000  2.726249379456e-03
3350.00000  3400.00000  2.751749373652e-03
3400.00000  3450.00000  2.770499369384e-03
3450.00000  3500.00000  2.743499375529e-03
3500.00000  3550.00000  2.696999386114e-03
3550.00000  3600.00000  2.767499370067e-03
3600.00000  3650.00000  2.700749385260e-03
3650.00000  3700.00000  2.636999399771e-03
3700.00000  3750.00000  2.638499399429e-03
3750.00000  3800.00000  2.614499404892e-03
3800.00000  3850.00000  2.596499408989e-03
3850.00000  3900.00000  2.504999429816e-03
3900.00000  3950.00000  2.612249405404e-03
3950.00000  4000.00000  2.447249442961e-03
4000.00000  4050.00000  2.381249457984e-03
4050.00000  4100.00000  2.369999460545e-03
4100.00000  4150.00000  2.311499473861e-03
4150.00000  4200.00000  2.321999471471e-03
4200.00000  4250.00000  2.243249489395e-03
4250.00000  4300.00000  2.265749484274e-03
4300.00000  4350.00000  2.297249477104e-03
4350.00000  4400.00000  2.150249510564e-03
4400.00000  4450.00000  2.126249516027e-03
4450.00000  4500.00000  2.186999502199e-03
4500.00000  4550.00000  2.093249523538e-03
4550.00000  4600.00000  2.100749521831e-03
4600.00000  4650.00000  2.042249535147e-03
4650.00000  4700.00000  2.018249540610e-03
4700.00000  4750.00000  1.956749554608e-03
4750.00000  4800.00000  2.025749538902e-03
4800.00000  4850.00000  1.892249569289e-03
4850.00000  4900.00000  1.888499570143e-03
4900.00000  4950.00000  1.886999570484e-03
4950.00000  5000.00000  1.753499600871e-03
5000.00000  5050.00000  1.847999579362e-03
5050.00000  5100.00000  1.737749604456e-03
5100.00000  5150.00000  1.703999612139e-03
5150.00000  5200.00000  1.723499607700e-03
5200.00000  5250.00000  1.705499611797e-03
5250.00000  5300.00000  1.658999622381e-03
5300.00000  5350.00000  1.644749625625e-03
5350.00000  5400.00000  1.621499630917e-03
5400.00000  5450.00000  1.517249654646e-03
5450.00000  5500.00000  1.520999653793e-03
5500.00000  5550.00000  1.496249659426e-03
5550.00000  5600.00000  1.478999663353e-03
5600.00000  5650.00000  1.436999672913e-03
5650.00000  5700.00000  1.362749689813e-03
5700.00000  5750.00000  1.351499692374e-03
5750.00000  5800.00000  1.378499686228e-03
5800.00000  5850.00000  1.358249690838e-03
5850.00000  5900.00000  1.301999703641e-03
5900.00000  5950.00000  1.337999695447e-03
5950.00000  6000.00000  1.320749699373e-03
6000.00000  6050.00000  1.238249718152e-03
6050.00000  6100.00000  1.306499702617e-03
6100.00000  6150.00000  1.214999723444e-03
6150.00000  6200.00000  1.226999720712e-03
6200.00000  6250.00000  1.169999733687e-03
6250.00000  6300.00000  1.135499741540e-03
6300.00000  6350.00000  1.178249731809e-03
6350.00000  6400.00000  1.357499691008e-03
6400.00000  6450.00000  1.106999748027e-03
6450.00000  6500.00000  1.105499748368e-03
6500.00000  6550.00000  1.086749752636e-03
6550.00000  6600.00000  1.058249759123e-03
6600.00000  6650.00000  1.076999754855e-03
6650.00000  6700.00000  1.076999754855e-03
6700.00000  6750.00000  1.007249770732e-03
6750.00000  6800.00000  1.028249765952e-03
6800.00000  6850.00000  9.974997729508e-04
6850.00000  6900.00000  9.944997736337e-04
6900.00000  6950.00000  9.622497809744e-04
6950.00000  7000.00000  9.367497867786e-04
7000.00000  7050.00000  9.502497837058e-04
7050.00000  7100.00000  9.104997927536e-04
7100.00000  7150.00000  8.414998084593e-04
7150.00000  7200.00000  7.807498222871e-04
7200.00000  7250.00000  7.859998210921e-04
7250.00000  7300.00000  7.679998251892e-04
7300.00000  7350.00000  7.469998299692e-04
7350.00000  7400.00000  7.379998320178e-04
7400.00000  7450.00000  7.627498263842e-04
7450.00000  7500.00000  7.912498198971e-04
7500.00000  7550.00000  7.424998309935e-04
7550.00000  7600.00000  7.124998378220e-04
7600.00000  7650.00000  6.914998426020e-04
7650.00000  7700.00000  7.027498400413e-04
7700.00000  7750.00000  6.884998432849e-04
7750.00000  7800.00000  6.794998453334e-04
7800.00000  7850.00000  6.839998443091e-04
7850.00000  7900.00000  6.652498485770e-04
7900.00000  7950.00000  6.577498502841e-04
7950.00000  8000.00000  6.667498482356e-04
8000.00000  8050.00000  6.254998576248e-04
8050.00000  8100.00000  6.547498509670e-04
8100.00000  8150.00000  6.569998504548e-04
8150.00000  8200.00000  6.622498492598e-04
8200.00000  8250.00000  6.194998589905e-04
8250.00000  8300.00000  5.984998637705e-04
8300.00000  8350.00000  5.834998671848e-04
8350.00000  8400.00000  6.029998627462e-04
8400.00000  8450.00000  6.007498632584e-04
8450.00000  8500.00000  6.044998624048e-04
8500.00000  8550.00000  5.947498646241e-04
8550.00000  8600.00000  5.752498690626e-04
8600.00000  8650.00000  5.392498772569e-04
8650.00000  8700.00000  5.647498714526e-04
8700.00000  8750.00000  5.414998767447e-04
8750.00000  8800.00000  5.294998794762e-04
8800.00000  8850.00000  4.852498895483e-04
8850.00000  8900.00000  5.227498810126e-04
8900.00000  8950.00000  5.182498820369e-04
8950.00000  9000.00000  4.852498895483e-04
9000.00000  9050.00000  4.987498864754e-04
9050.00000  9100.00000  4.844998897190e-04
9100.00000  9150.00000  5.024998856219e-04
9150.00000  9200.00000  4.829998900604e-04
9200.00000  9250.00000  4.814998904018e-04
9250.00000  9300.00000  4.739998921090e-04
9300.00000  9350.00000  4.769998914261e-04
9350.00000  9400.00000  4.672498936454e-04
9400.00000  9450.00000  4.469998982547e-04
9450.00000  9500.00000  4.574998958647e-04
9500.00000  9550.00000  4.664998938161e-04
9550.00000  9600.00000  4.259999030346e-04
9600.00000  9650.00000  4.424998992789e-04
9650.00000  9700.00000  4.282499025225e-04
9700.00000  9750.00000  4.072499073025e-04
9750.00000  9800.00000  4.274999026932e-04
9800.00000  9850.00000  4.147499055953e-04
9850.00000  9900.00000  4.034999081561e-04
9900.00000  9950.00000  4.072499073025e-04
9950.00000  10000.00000  4.154999054246e-04
