300.00000  350.00000  7.157464377965e-07
350.00000  400.00000  3.220858970084e-06
400.00000  450.00000  1.789366094491e-06
450.00000  500.00000  1.789366094491e-06
500.00000  550.00000  4.580777201897e-05
550.00000  600.00000  3.578732188982e-06
600.00000  650.00000  1.503067519373e-05
650.00000  700.00000  3.578732188982e-06
700.00000  750.00000  1.145194300474e-05
750.00000  800.00000  9.662576910252e-06
800.00000  850.00000  2.934560394966e-05
850.00000  900.00000  6.441717940168e-06
900.00000  950.00000  6.441717940168e-06
950.00000  1000.00000  5.010225064575e-06
1000.00000  1050.00000  1.002045012915e-05
1050.00000  1100.00000  8.231084034659e-06
1100.00000  1150.00000  8.946830472456e-06
1150.00000  1200.00000  9.662576910252e-06
1200.00000  1250.00000  1.145194300474e-05
1250.00000  1300.00000  2.970347716855e-05
1300.00000  1350.00000  6.799591159067e-06
1350.00000  1400.00000  1.037832334805e-05
1400.00000  1450.00000  8.946830472456e-06
1450.00000  1500.00000  1.359918231813e-05
1500.00000  1550.00000  1.109406978585e-05
1550.00000  1600.00000  1.252556266144e-05
1600.00000  1650.00000  1.503067519373e-05
1650.00000  1700.00000  1.109406978585e-05
1700.00000  1750.00000  3.865030764101e-05
1750.00000  1800.00000  1.109406978585e-05
1800.00000  1850.00000  1.109406978585e-05
1850.00000  1900.00000  1.180981622364e-05
1900.00000  1950.00000  1.216768944254e-05
1950.00000  2000.00000  1.431492875593e-05
2000.00000  2050.00000  1.467280197483e-05
2050.00000  2100.00000  9.662576910252e-06
2100.00000  2150.00000  9.662576910252e-06
2150.00000  2200.00000  1.395705553703e-05
2200.00000  2250.00000  1.538854841262e-05
2250.00000  2300.00000  1.288343588034e-05
2300.00000  2350.00000  4.867075777016e-05
2350.00000  2400.00000  1.538854841262e-05
2400.00000  2450.00000  1.252556266144e-05
2450.00000  2500.00000  1.753578772601e-05
2500.00000  2550.00000  1.145194300474e-05
2550.00000  2600.00000  1.395705553703e-05
2600.00000  2650.00000  1.288343588034e-05
2650.00000  2700.00000  1.109406978585e-05
2700.00000  2750.00000  1.574642163152e-05
2750.00000  2800.00000  1.610429485042e-05
2800.00000  2850.00000  1.252556266144e-05
2850.00000  2900.00000  1.431492875593e-05
2900.00000  2950.00000  1.395705553703e-05
2950.00000  3000.00000  3.686094154652e-05
3000.00000  3050.00000  1.717791450712e-05
3050.00000  3100.00000  1.717791450712e-05
3100.00000  3150.00000  1.860940738271e-05
3150.00000  3200.00000  1.682004128822e-05
3200.00000  3250.00000  2.004090025830e-05
3250.00000  3300.00000  1.717791450712e-05
3300.00000  3350.00000  2.254601279059e-05
3350.00000  3400.00000  2.397750566618e-05
3400.00000  3450.00000  2.505112532288e-05
3450.00000  3500.00000  2.612474497957e-05
3500.00000  3550.00000  3.006135038745e-05
3550.00000  3600.00000  3.721881476542e-05
3600.00000  3650.00000  4.401840592448e-05
3650.00000  3700.00000  7.801636171982e-05
3700.00000  3750.00000  4.688139167567e-05
3750.00000  3800.00000  4.831288455126e-05
3800.00000  3850.00000  5.439672927253e-05
3850.00000  3900.00000  7.157464377965e-05
3900.00000  3950.00000  6.871165802846e-05
3950.00000  4000.00000  8.553169931668e-05
4000.00000  4050.00000  8.875255828676e-05
4050.00000  4100.00000  9.805726197812e-05
4100.00000  4150.00000  1.034253602616e-04
4150.00000  4200.00000  1.034253602616e-04
4200.00000  4250.00000  1.102249514207e-04
4250.00000  4300.00000  1.184560354553e-04
4300.00000  4350.00000  1.288343588034e-04
4350.00000  4400.00000  1.402863018081e-04
4400.00000  4450.00000  1.581799627530e-04
4450.00000  4500.00000  1.556748502207e-04
4500.00000  4550.00000  1.893149327972e-04
4550.00000  4600.00000  1.889570595783e-04
4600.00000  4650.00000  1.796523558869e-04
4650.00000  4700.00000  2.057771008665e-04
4700.00000  4750.00000  2.168711706523e-04
4750.00000  4800.00000  2.276073672193e-04
4800.00000  4850.00000  2.254601279059e-04
4850.00000  4900.00000  2.437116620697e-04
4900.00000  4950.00000  2.565950979500e-04
4950.00000  5000.00000  2.576687176067e-04
5000.00000  5050.00000  2.755623785516e-04
5050.00000  5100.00000  2.963190252477e-04
5100.00000  5150.00000  3.066973485958e-04
5150.00000  5200.00000  3.009713770934e-04
5200.00000  5250.00000  3.020449967501e-04
5250.00000  5300.00000  3.385480650777e-04
5300.00000  5350.00000  3.364008257643e-04
5350.00000  5400.00000  3.464212758935e-04
5400.00000  5450.00000  3.614519510872e-04
5450.00000  5500.00000  3.653885564951e-04
5500.00000  5550.00000  3.596625849927e-04
5550.00000  5600.00000  3.714724012164e-04
5600.00000  5650.00000  4.090490892007e-04
5650.00000  5700.00000  3.954499068826e-04
5700.00000  5750.00000  3.857873299723e-04
5750.00000  5800.00000  3.933026675692e-04
5800.00000  5850.00000  4.158486803598e-04
5850.00000  5900.00000  4.315951019913e-04
5900.00000  5950.00000  4.244376376133e-04
5950.00000  6000.00000  4.362474538370e-04
6000.00000  6050.00000  4.308793555535e-04
6050.00000  6100.00000  4.212167786432e-04
6100.00000  6150.00000  4.523517486874e-04
6150.00000  6200.00000  4.849182116071e-04
6200.00000  6250.00000  5.103272101489e-04
6250.00000  6300.00000  5.582822214813e-04
6300.00000  6350.00000  5.944274165900e-04
6350.00000  6400.00000  2.108589005748e-03
6400.00000  6450.00000  4.648773113488e-04
6450.00000  6500.00000  4.942229152985e-04
6500.00000  6550.00000  4.784764936669e-04
6550.00000  6600.00000  4.698875364134e-04
6600.00000  6650.00000  4.895705634528e-04
6650.00000  6700.00000  4.870654509205e-04
6700.00000  6750.00000  4.745398882591e-04
6750.00000  6800.00000  4.945807885174e-04
6800.00000  6850.00000  4.952965349552e-04
6850.00000  6900.00000  4.863497044827e-04
6900.00000  6950.00000  4.927914224229e-04
6950.00000  7000.00000  4.838445919504e-04
7000.00000  7050.00000  4.845603383882e-04
7050.00000  7100.00000  6.617075817428e-04
7100.00000  7150.00000  2.365541976917e-04
7150.00000  7200.00000  2.369120709106e-04
7200.00000  7250.00000  2.340490851594e-04
7250.00000  7300.00000  2.401329298807e-04
7300.00000  7350.00000  2.465746478209e-04
7350.00000  7400.00000  2.358384512539e-04
7400.00000  7450.00000  2.215235224980e-04
7450.00000  7500.00000  3.199386576950e-04
7500.00000  7550.00000  2.505112532288e-04
7550.00000  7600.00000  2.515848728855e-04
7600.00000  7650.00000  2.565950979500e-04
7650.00000  7700.00000  2.587423372634e-04
7700.00000  7750.00000  2.623210694524e-04
7750.00000  7800.00000  2.426380424130e-04
7800.00000  7850.00000  2.580265908256e-04
7850.00000  7900.00000  2.587423372634e-04
7900.00000  7950.00000  2.691206606115e-04
7950.00000  8000.00000  2.666155480792e-04
8000.00000  8050.00000  2.601738301390e-04
8050.00000  8100.00000  2.809304768351e-04
8100.00000  8150.00000  2.705521534871e-04
8150.00000  8200.00000  2.673312945170e-04
8200.00000  8250.00000  2.709100267060e-04
8250.00000  8300.00000  2.948875323721e-04
8300.00000  8350.00000  2.902351805265e-04
8350.00000  8400.00000  2.734151392383e-04
8400.00000  8450.00000  2.802147303973e-04
8450.00000  8500.00000  2.827198429296e-04
8500.00000  8550.00000  2.827198429296e-04
8550.00000  8600.00000  2.780674910839e-04
8600.00000  8650.00000  2.909509269643e-04
8650.00000  8700.00000  2.784253643028e-04
8700.00000  8750.00000  2.701942802682e-04
8750.00000  8800.00000  2.558793515122e-04
8800.00000  8850.00000  2.719836463627e-04
8850.00000  8900.00000  2.723415195816e-04
8900.00000  8950.00000  2.845092090241e-04
8950.00000  9000.00000  2.837934625863e-04
9000.00000  9050.00000  2.766359982083e-04
9050.00000  9100.00000  2.744887588949e-04
9100.00000  9150.00000  2.991820109989e-04
9150.00000  9200.00000  2.734151392383e-04
9200.00000  9250.00000  2.988241377800e-04
9250.00000  9300.00000  2.862985751186e-04
9300.00000  9350.00000  2.977505181233e-04
9350.00000  9400.00000  2.637525623280e-04
9400.00000  9450.00000  2.909509269643e-04
9450.00000  9500.00000  2.820040964918e-04
9500.00000  9550.00000  2.945296591532e-04
9550.00000  9600.00000  2.569529711689e-04
9600.00000  9650.00000  2.905930537454e-04
9650.00000  9700.00000  2.834355893674e-04
9700.00000  9750.00000  2.855828286808e-04
9750.00000  9800.00000  2.977505181233e-04
9800.00000  9850.00000  2.888036876509e-04
9850.00000  9900.00000  2.927402930588e-04
9900.00000  9950.00000  2.805726036162e-04
9950.00000  10000.00000  2.830777161485e-04
