300.00000  350.00000  1.651189622323e-05
350.00000  400.00000  2.764782623425e-05
400.00000  450.00000  1.651189622323e-05
450.00000  500.00000  1.612789863665e-05
500.00000  550.00000  1.459190829030e-04
550.00000  600.00000  1.267192035737e-05
600.00000  650.00000  4.108774176479e-05
650.00000  700.00000  1.535990346347e-05
700.00000  750.00000  2.918381658060e-05
750.00000  800.00000  1.996787450251e-05
800.00000  850.00000  6.489559213317e-05
850.00000  900.00000  1.535990346347e-05
900.00000  950.00000  1.305591794395e-05
950.00000  1000.00000  1.689589380982e-05
1000.00000  1050.00000  1.919987932934e-05
1050.00000  1100.00000  1.766388898299e-05
1100.00000  1150.00000  1.919987932934e-05
1150.00000  1200.00000  1.804788656958e-05
1200.00000  1250.00000  1.151992759760e-05
1250.00000  1300.00000  3.955175141844e-05
1300.00000  1350.00000  1.651189622323e-05
1350.00000  1400.00000  1.766388898299e-05
1400.00000  1450.00000  1.535990346347e-05
1450.00000  1500.00000  2.035187208910e-05
1500.00000  1550.00000  1.420791070371e-05
1550.00000  1600.00000  1.919987932934e-05
1600.00000  1650.00000  1.843188415617e-05
1650.00000  1700.00000  1.574390105006e-05
1700.00000  1750.00000  4.108774176479e-05
1750.00000  1800.00000  2.380785036838e-05
1800.00000  1850.00000  1.612789863665e-05
1850.00000  1900.00000  1.420791070371e-05
1900.00000  1950.00000  1.766388898299e-05
1950.00000  2000.00000  1.766388898299e-05
2000.00000  2050.00000  1.420791070371e-05
2050.00000  2100.00000  1.459190829030e-05
2100.00000  2150.00000  1.305591794395e-05
2150.00000  2200.00000  2.073586967569e-05
2200.00000  2250.00000  1.420791070371e-05
2250.00000  2300.00000  1.843188415617e-05
2300.00000  2350.00000  5.491165488192e-05
2350.00000  2400.00000  1.535990346347e-05
2400.00000  2450.00000  1.727989139641e-05
2450.00000  2500.00000  1.958387691593e-05
2500.00000  2550.00000  1.919987932934e-05
2550.00000  2600.00000  1.689589380982e-05
2600.00000  2650.00000  2.111986726228e-05
2650.00000  2700.00000  1.689589380982e-05
2700.00000  2750.00000  1.574390105006e-05
2750.00000  2800.00000  2.380785036838e-05
2800.00000  2850.00000  2.380785036838e-05
2850.00000  2900.00000  1.919987932934e-05
2900.00000  2950.00000  2.111986726228e-05
2950.00000  3000.00000  3.110380451353e-05
3000.00000  3050.00000  2.073586967569e-05
3050.00000  3100.00000  1.958387691593e-05
3100.00000  3150.00000  2.572783830132e-05
3150.00000  3200.00000  2.611183588790e-05
3200.00000  3250.00000  2.687983106108e-05
3250.00000  3300.00000  2.227186002204e-05
3300.00000  3350.00000  2.419184795497e-05
3350.00000  3400.00000  1.804788656958e-05
3400.00000  3450.00000  2.572783830132e-05
3450.00000  3500.00000  2.035187208910e-05
3500.00000  3550.00000  2.073586967569e-05
3550.00000  3600.00000  2.726382864766e-05
3600.00000  3650.00000  2.726382864766e-05
3650.00000  3700.00000  3.532777796599e-05
3700.00000  3750.00000  2.726382864766e-05
3750.00000  3800.00000  2.495984312814e-05
3800.00000  3850.00000  2.534384071473e-05
3850.00000  3900.00000  2.380785036838e-05
3900.00000  3950.00000  1.996787450251e-05
3950.00000  4000.00000  2.265585760862e-05
4000.00000  4050.00000  2.495984312814e-05
4050.00000  4100.00000  2.649583347449e-05
4100.00000  4150.00000  2.534384071473e-05
4150.00000  4200.00000  2.534384071473e-05
4200.00000  4250.00000  3.033580934036e-05
4250.00000  4300.00000  2.419184795497e-05
4300.00000  4350.00000  2.611183588790e-05
4350.00000  4400.00000  3.033580934036e-05
4400.00000  4450.00000  2.649583347449e-05
4450.00000  4500.00000  2.803182382084e-05
4500.00000  4550.00000  3.302379244647e-05
4550.00000  4600.00000  2.687983106108e-05
4600.00000  4650.00000  2.726382864766e-05
4650.00000  4700.00000  2.572783830132e-05
4700.00000  4750.00000  2.764782623425e-05
4750.00000  4800.00000  2.419184795497e-05
4800.00000  4850.00000  3.302379244647e-05
4850.00000  4900.00000  3.379178761964e-05
4900.00000  4950.00000  3.071980692695e-05
4950.00000  5000.00000  3.110380451353e-05
5000.00000  5050.00000  3.263979485988e-05
5050.00000  5100.00000  2.572783830132e-05
5100.00000  5150.00000  2.687983106108e-05
5150.00000  5200.00000  2.726382864766e-05
5200.00000  5250.00000  3.110380451353e-05
5250.00000  5300.00000  3.532777796599e-05
5300.00000  5350.00000  2.457584554156e-05
5350.00000  5400.00000  2.841582140742e-05
5400.00000  5450.00000  3.801576107210e-05
5450.00000  5500.00000  3.302379244647e-05
5500.00000  5550.00000  3.225579727329e-05
5550.00000  5600.00000  3.686376831234e-05
5600.00000  5650.00000  3.148780210012e-05
5650.00000  5700.00000  3.455978279281e-05
5700.00000  5750.00000  3.455978279281e-05
5750.00000  5800.00000  3.033580934036e-05
5800.00000  5850.00000  2.841582140742e-05
5850.00000  5900.00000  3.455978279281e-05
5900.00000  5950.00000  3.225579727329e-05
5950.00000  6000.00000  2.687983106108e-05
6000.00000  6050.00000  2.995181175377e-05
6050.00000  6100.00000  2.726382864766e-05
6100.00000  6150.00000  3.839975865868e-05
6150.00000  6200.00000  3.263979485988e-05
6200.00000  6250.00000  3.801576107210e-05
6250.00000  6300.00000  5.567965005509e-05
6300.00000  6350.00000  4.799969832335e-05
6350.00000  6400.00000  4.220133476589e-04
6400.00000  6450.00000  3.302379244647e-05
6450.00000  6500.00000  2.764782623425e-05
6500.00000  6550.00000  2.918381658060e-05
6550.00000  6600.00000  3.071980692695e-05
6600.00000  6650.00000  2.457584554156e-05
6650.00000  6700.00000  2.803182382084e-05
6700.00000  6750.00000  3.033580934036e-05
6750.00000  6800.00000  2.342385278180e-05
6800.00000  6850.00000  3.225579727329e-05
6850.00000  6900.00000  3.033580934036e-05
6900.00000  6950.00000  3.379178761964e-05
6950.00000  7000.00000  2.188786243545e-05
7000.00000  7050.00000  2.534384071473e-05
7050.00000  7100.00000  6.335960178683e-05
7100.00000  7150.00000  1.881588174275e-05
7150.00000  7200.00000  1.497590587689e-05
7200.00000  7250.00000  2.150386484886e-05
7250.00000  7300.00000  2.073586967569e-05
7300.00000  7350.00000  1.535990346347e-05
7350.00000  7400.00000  1.651189622323e-05
7400.00000  7450.00000  1.843188415617e-05
7450.00000  7500.00000  2.879981899401e-05
7500.00000  7550.00000  1.651189622323e-05
7550.00000  7600.00000  1.228792277078e-05
7600.00000  7650.00000  1.804788656958e-05
7650.00000  7700.00000  1.651189622323e-05
7700.00000  7750.00000  1.612789863665e-05
7750.00000  7800.00000  1.804788656958e-05
7800.00000  7850.00000  1.574390105006e-05
7850.00000  7900.00000  1.497590587689e-05
7900.00000  7950.00000  1.958387691593e-05
7950.00000  8000.00000  1.843188415617e-05
8000.00000  8050.00000  1.689589380982e-05
8050.00000  8100.00000  1.267192035737e-05
8100.00000  8150.00000  1.382391311713e-05
8150.00000  8200.00000  1.919987932934e-05
8200.00000  8250.00000  1.689589380982e-05
8250.00000  8300.00000  1.459190829030e-05
8300.00000  8350.00000  1.612789863665e-05
8350.00000  8400.00000  1.727989139641e-05
8400.00000  8450.00000  1.651189622323e-05
8450.00000  8500.00000  1.574390105006e-05
8500.00000  8550.00000  1.843188415617e-05
8550.00000  8600.00000  1.574390105006e-05
8600.00000  8650.00000  2.035187208910e-05
8650.00000  8700.00000  1.420791070371e-05
8700.00000  8750.00000  1.382391311713e-05
8750.00000  8800.00000  1.343991553054e-05
8800.00000  8850.00000  1.996787450251e-05
8850.00000  8900.00000  1.497590587689e-05
8900.00000  8950.00000  1.919987932934e-05
8950.00000  9000.00000  1.919987932934e-05
9000.00000  9050.00000  1.881588174275e-05
9050.00000  9100.00000  1.190392518419e-05
9100.00000  9150.00000  1.420791070371e-05
9150.00000  9200.00000  1.574390105006e-05
9200.00000  9250.00000  1.343991553054e-05
9250.00000  9300.00000  1.343991553054e-05
9300.00000  9350.00000  1.305591794395e-05
9350.00000  9400.00000  1.382391311713e-05
9400.00000  9450.00000  1.113593001102e-05
9450.00000  9500.00000  1.459190829030e-05
9500.00000  9550.00000  1.228792277078e-05
9550.00000  9600.00000  1.574390105006e-05
9600.00000  9650.00000  1.267192035737e-05
9650.00000  9700.00000  1.228792277078e-05
9700.00000  9750.00000  1.382391311713e-05
9750.00000  9800.00000  1.190392518419e-05
9800.00000  9850.00000  1.382391311713e-05
9850.00000  9900.00000  1.267192035737e-05
9900.00000  9950.00000  1.651189622323e-05
9950.00000  10000.00000  1.996787450251e-05
