300.00000  350.00000  3.675891008576e-06
350.00000  400.00000  1.218848071265e-05
400.00000  450.00000  7.545249964973e-06
450.00000  500.00000  7.738717912792e-06
500.00000  550.00000  9.499276237953e-05
550.00000  600.00000  9.092993547531e-06
600.00000  650.00000  2.921366012079e-05
650.00000  700.00000  1.025380123445e-05
700.00000  750.00000  1.934679478198e-05
750.00000  800.00000  1.431662813867e-05
800.00000  850.00000  6.132933945888e-05
850.00000  900.00000  1.257541660829e-05
900.00000  950.00000  1.296235250393e-05
950.00000  1000.00000  1.160807686919e-05
1000.00000  1050.00000  1.547743582558e-05
1050.00000  1100.00000  1.238194866047e-05
1100.00000  1150.00000  1.702517940814e-05
1150.00000  1200.00000  1.605783966904e-05
1200.00000  1250.00000  1.741211530378e-05
1250.00000  1300.00000  5.262328180699e-05
1300.00000  1350.00000  1.683171146032e-05
1350.00000  1400.00000  1.973373067762e-05
1400.00000  1450.00000  1.818598709506e-05
1450.00000  1500.00000  2.553776911221e-05
1500.00000  1550.00000  2.128147426018e-05
1550.00000  1600.00000  2.031413452108e-05
1600.00000  1650.00000  2.050760246890e-05
1650.00000  1700.00000  2.302268579056e-05
1700.00000  1750.00000  9.151033931877e-05
1750.00000  1800.00000  2.282921784274e-05
1800.00000  1850.00000  2.457042937312e-05
1850.00000  1900.00000  2.534430116440e-05
1900.00000  1950.00000  2.515083321658e-05
1950.00000  2000.00000  2.824632038169e-05
2000.00000  2050.00000  3.056793575553e-05
2050.00000  2100.00000  3.095487165117e-05
2100.00000  2150.00000  2.766591653823e-05
2150.00000  2200.00000  3.037446780771e-05
2200.00000  2250.00000  3.172874344245e-05
2250.00000  2300.00000  3.153527549463e-05
2300.00000  2350.00000  1.222717430221e-04
2350.00000  2400.00000  3.037446780771e-05
2400.00000  2450.00000  3.579157034666e-05
2450.00000  2500.00000  3.463076265975e-05
2500.00000  2550.00000  3.443729471193e-05
2550.00000  2600.00000  3.250261523373e-05
2600.00000  2650.00000  3.946746135524e-05
2650.00000  2700.00000  3.385689086847e-05
2700.00000  2750.00000  3.501769855539e-05
2750.00000  2800.00000  3.656544213794e-05
2800.00000  2850.00000  3.985439725088e-05
2850.00000  2900.00000  3.733931392922e-05
2900.00000  2950.00000  3.540463445103e-05
2950.00000  3000.00000  7.409822401499e-05
3000.00000  3050.00000  4.004786519870e-05
3050.00000  3100.00000  3.598503829448e-05
3100.00000  3150.00000  3.772624982486e-05
3150.00000  3200.00000  4.353028825946e-05
3200.00000  3250.00000  3.830665366832e-05
3250.00000  3300.00000  4.101520493780e-05
3300.00000  3350.00000  4.353028825946e-05
3350.00000  3400.00000  4.101520493780e-05
3400.00000  3450.00000  4.372375620728e-05
3450.00000  3500.00000  4.759311516367e-05
3500.00000  3550.00000  3.946746135524e-05
3550.00000  3600.00000  4.411069210292e-05
3600.00000  3650.00000  5.068860232879e-05
3650.00000  3700.00000  7.313088427589e-05
3700.00000  3750.00000  4.836698695495e-05
3750.00000  3800.00000  4.798005105931e-05
3800.00000  3850.00000  4.933432669405e-05
3850.00000  3900.00000  5.223634591135e-05
3900.00000  3950.00000  4.914085874623e-05
3950.00000  4000.00000  5.010819848533e-05
4000.00000  4050.00000  5.881425613722e-05
4050.00000  4100.00000  5.030166643315e-05
4100.00000  4150.00000  5.649264076338e-05
4150.00000  4200.00000  5.649264076338e-05
4200.00000  4250.00000  4.643230747675e-05
4250.00000  4300.00000  5.339715359827e-05
4300.00000  4350.00000  5.184941001571e-05
4350.00000  4400.00000  5.068860232879e-05
4400.00000  4450.00000  5.494489718083e-05
4450.00000  4500.00000  5.475142923301e-05
4500.00000  4550.00000  5.862078818940e-05
4550.00000  4600.00000  5.417102538955e-05
4600.00000  4650.00000  6.094240356324e-05
4650.00000  4700.00000  5.378408949391e-05
4700.00000  4750.00000  6.152280740670e-05
4750.00000  4800.00000  5.494489718083e-05
4800.00000  4850.00000  6.307055098926e-05
4850.00000  4900.00000  5.320368565045e-05
4900.00000  4950.00000  5.726651255466e-05
4950.00000  5000.00000  6.326401893708e-05
5000.00000  5050.00000  5.726651255466e-05
5050.00000  5100.00000  6.171627535452e-05
5100.00000  5150.00000  6.016853177196e-05
5150.00000  5200.00000  6.268361509362e-05
5200.00000  5250.00000  6.152280740670e-05
5250.00000  5300.00000  6.403789072836e-05
5300.00000  5350.00000  6.771378173693e-05
5350.00000  5400.00000  6.171627535452e-05
5400.00000  5450.00000  7.119620479769e-05
5450.00000  5500.00000  6.268361509362e-05
5500.00000  5550.00000  6.345748688490e-05
5550.00000  5600.00000  6.635950610219e-05
5600.00000  5650.00000  6.519869841528e-05
5650.00000  5700.00000  6.597257020655e-05
5700.00000  5750.00000  6.577910225874e-05
5750.00000  5800.00000  6.868112147603e-05
5800.00000  5850.00000  6.926152531949e-05
5850.00000  5900.00000  7.758064707574e-05
5900.00000  5950.00000  7.080926890205e-05
5950.00000  6000.00000  7.080926890205e-05
6000.00000  6050.00000  6.810071763257e-05
6050.00000  6100.00000  6.597257020655e-05
6100.00000  6150.00000  7.700024323228e-05
6150.00000  6200.00000  8.048266629304e-05
6200.00000  6250.00000  1.062139033531e-04
6250.00000  6300.00000  1.398773262737e-04
6300.00000  6350.00000  1.510984672473e-04
6350.00000  6400.00000  1.254252705716e-03
6400.00000  6450.00000  6.519869841528e-05
6450.00000  6500.00000  7.313088427589e-05
6500.00000  6550.00000  6.210321125016e-05
6550.00000  6600.00000  6.655297405001e-05
6600.00000  6650.00000  7.371128811935e-05
6650.00000  6700.00000  7.564596759755e-05
6700.00000  6750.00000  7.216354453679e-05
6750.00000  6800.00000  7.138967274551e-05
6800.00000  6850.00000  7.255048043243e-05
6850.00000  6900.00000  7.448515991063e-05
6900.00000  6950.00000  7.970879450176e-05
6950.00000  7000.00000  7.719371118010e-05
7000.00000  7050.00000  6.848765352821e-05
7050.00000  7100.00000  1.984981144631e-04
7100.00000  7150.00000  4.294988441600e-05
7150.00000  7200.00000  3.772624982486e-05
7200.00000  7250.00000  4.178907672908e-05
7250.00000  7300.00000  5.165594206789e-05
7300.00000  7350.00000  3.869358956396e-05
7350.00000  7400.00000  4.972126258969e-05
7400.00000  7450.00000  4.236948057254e-05
7450.00000  7500.00000  8.899525599711e-05
7500.00000  7550.00000  4.101520493780e-05
7550.00000  7600.00000  4.333682031164e-05
7600.00000  7650.00000  4.430416005074e-05
7650.00000  7700.00000  3.946746135524e-05
7700.00000  7750.00000  4.062826904216e-05
7750.00000  7800.00000  4.082173698998e-05
7800.00000  7850.00000  4.314335236382e-05
7850.00000  7900.00000  4.875392285059e-05
7900.00000  7950.00000  4.353028825946e-05
7950.00000  8000.00000  3.850012161614e-05
8000.00000  8050.00000  4.701271132021e-05
8050.00000  8100.00000  4.507803184202e-05
8100.00000  8150.00000  4.527149978984e-05
8150.00000  8200.00000  4.430416005074e-05
8200.00000  8250.00000  4.449762799856e-05
8250.00000  8300.00000  5.223634591135e-05
8300.00000  8350.00000  4.256294852036e-05
8350.00000  8400.00000  4.275641646818e-05
8400.00000  8450.00000  4.585190363329e-05
8450.00000  8500.00000  4.604537158111e-05
8500.00000  8550.00000  4.449762799856e-05
8550.00000  8600.00000  4.004786519870e-05
8600.00000  8650.00000  4.275641646818e-05
8650.00000  8700.00000  4.294988441600e-05
8700.00000  8750.00000  3.888705751178e-05
8750.00000  8800.00000  3.908052545960e-05
8800.00000  8850.00000  4.623883952893e-05
8850.00000  8900.00000  4.623883952893e-05
8900.00000  8950.00000  4.294988441600e-05
8950.00000  9000.00000  4.430416005074e-05
9000.00000  9050.00000  5.107553822443e-05
9050.00000  9100.00000  4.178907672908e-05
9100.00000  9150.00000  5.146247412007e-05
9150.00000  9200.00000  4.101520493780e-05
9200.00000  9250.00000  4.488456389420e-05
9250.00000  9300.00000  4.082173698998e-05
9300.00000  9350.00000  4.527149978984e-05
9350.00000  9400.00000  4.333682031164e-05
9400.00000  9450.00000  4.275641646818e-05
9450.00000  9500.00000  4.701271132021e-05
9500.00000  9550.00000  4.062826904216e-05
9550.00000  9600.00000  4.527149978984e-05
9600.00000  9650.00000  4.546496773766e-05
9650.00000  9700.00000  4.314335236382e-05
9700.00000  9750.00000  5.068860232879e-05
9750.00000  9800.00000  4.294988441600e-05
9800.00000  9850.00000  4.914085874623e-05
9850.00000  9900.00000  4.875392285059e-05
9900.00000  9950.00000  4.991473053751e-05
9950.00000  10000.00000  4.333682031164e-05
