10001.00000  11001.00000  8.387372724816e-05
11001.00000  12001.00000  7.173855832480e-05
12001.00000  13001.00000  6.284007856492e-05
13001.00000  14001.00000  5.512033336606e-05
14001.00000  15001.00000  4.990298366971e-05
15001.00000  16001.00000  4.500447201036e-05
16001.00000  17001.00000  4.063735707934e-05
17001.00000  18001.00000  3.573884541999e-05
18001.00000  19001.00000  3.277268550003e-05
19001.00000  20001.00000  3.006739306489e-05
20001.00000  21001.00000  2.710123314492e-05
21001.00000  22001.00000  2.494666095551e-05
22001.00000  23001.00000  2.364232353142e-05
23001.00000  24001.00000  2.209644213991e-05
24001.00000  25001.00000  2.071481064625e-05
25001.00000  26001.00000  1.905298815037e-05
26001.00000  27001.00000  1.814478283286e-05
27001.00000  28001.00000  1.720759223926e-05
28001.00000  29001.00000  1.606750471302e-05
29001.00000  30001.00000  1.492741718678e-05
30001.00000  31001.00000  1.384530021272e-05
31001.00000  32001.00000  1.326559469090e-05
32001.00000  33001.00000  1.190328671463e-05
33001.00000  34001.00000  1.191294847333e-05
34001.00000  35001.00000  1.107237546670e-05
35001.00000  36001.00000  1.097575787973e-05
36001.00000  37001.00000  1.065691984273e-05
37001.00000  38001.00000  1.046368466879e-05
38001.00000  39001.00000  9.120700209914e-06
39001.00000  40001.00000  8.270465444583e-06
40001.00000  41001.00000  8.569979964188e-06
41001.00000  42001.00000  7.729406957554e-06
42001.00000  43001.00000  7.265642540101e-06
43001.00000  44001.00000  7.188348470525e-06
44001.00000  45001.00000  7.603804094494e-06
45001.00000  46001.00000  7.613465853191e-06
46001.00000  47001.00000  6.454054809558e-06
47001.00000  48001.00000  6.260819635619e-06
48001.00000  49001.00000  6.483040085649e-06
49001.00000  50001.00000  6.367098981285e-06
50001.00000  51001.00000  6.193187324740e-06
51001.00000  52001.00000  5.082085074592e-06
52001.00000  53001.00000  5.410584870288e-06
53001.00000  54001.00000  5.429908387682e-06
54001.00000  55001.00000  5.072423315895e-06
55001.00000  56001.00000  5.120732109380e-06
56001.00000  57001.00000  4.975805728926e-06
57001.00000  58001.00000  4.425085483200e-06
58001.00000  59001.00000  4.222188550564e-06
59001.00000  60001.00000  4.231850309261e-06
60001.00000  61001.00000  4.560350104957e-06
61001.00000  62001.00000  3.835718202686e-06
62001.00000  63001.00000  3.913012272262e-06
63001.00000  64001.00000  3.468571372202e-06
64001.00000  65001.00000  3.739100615717e-06
65001.00000  66001.00000  3.719777098323e-06
66001.00000  67001.00000  3.516880165687e-06
67001.00000  68001.00000  3.545865441778e-06
68001.00000  69001.00000  3.275336198264e-06
69001.00000  70001.00000  2.869542332992e-06
70001.00000  71001.00000  3.333306750445e-06
71001.00000  72001.00000  3.004806954749e-06
72001.00000  73001.00000  3.082101024325e-06
73001.00000  74001.00000  2.946836402568e-06
74001.00000  75001.00000  2.850218815598e-06
75001.00000  76001.00000  2.425101432933e-06
76001.00000  77001.00000  2.608674848175e-06
77001.00000  78001.00000  2.231866258994e-06
78001.00000  79001.00000  2.318822087266e-06
79001.00000  80001.00000  2.405777915539e-06
80001.00000  81001.00000  2.541042537296e-06
81001.00000  82001.00000  2.173895706812e-06
82001.00000  83001.00000  2.318822087266e-06
83001.00000  84001.00000  2.183557465509e-06
84001.00000  85001.00000  2.038631085055e-06
85001.00000  86001.00000  2.386454398145e-06
86001.00000  87001.00000  2.164233948115e-06
87001.00000  88001.00000  2.019307567661e-06
88001.00000  89001.00000  2.057954602449e-06
89001.00000  90001.00000  2.144910430721e-06
90001.00000  91001.00000  2.125586913327e-06
91001.00000  92001.00000  1.913028221995e-06
92001.00000  93001.00000  1.748778324147e-06
93001.00000  94001.00000  1.874381187207e-06
94001.00000  95001.00000  2.019307567661e-06
95001.00000  96001.00000  1.700469530662e-06
96001.00000  97001.00000  1.671484254571e-06
97001.00000  98001.00000  1.777763600237e-06
98001.00000  99001.00000  1.594190184996e-06
99001.00000  100001.00000  1.884042945904e-06
100001.00000  101001.00000  1.439602045844e-06
101001.00000  102001.00000  1.304337424087e-06
102001.00000  103001.00000  1.439602045844e-06
103001.00000  104001.00000  1.458925563238e-06
104001.00000  105001.00000  1.381631493663e-06
105001.00000  106001.00000  1.439602045844e-06
106001.00000  107001.00000  1.265690389300e-06
107001.00000  108001.00000  1.207719837118e-06
108001.00000  109001.00000  1.362307976269e-06
109001.00000  110001.00000  1.285013906693e-06
110001.00000  111001.00000  1.207719837118e-06
111001.00000  112001.00000  9.758376283912e-07
112001.00000  113001.00000  1.275352147996e-06
113001.00000  114001.00000  1.062793456664e-06
114001.00000  115001.00000  1.188396319724e-06
115001.00000  116001.00000  1.130425767542e-06
116001.00000  117001.00000  1.091778732755e-06
117001.00000  118001.00000  1.178734561027e-06
118001.00000  119001.00000  1.120764008845e-06
119001.00000  120001.00000  9.951611457851e-07
120001.00000  121001.00000  1.227043354512e-06
121001.00000  122001.00000  1.043469939270e-06
122001.00000  123001.00000  8.212494892401e-07
123001.00000  124001.00000  9.951611457851e-07
124001.00000  125001.00000  1.169072802330e-06
125001.00000  126001.00000  1.091778732755e-06
126001.00000  127001.00000  9.854993870882e-07
127001.00000  128001.00000  7.439554196646e-07
128001.00000  129001.00000  9.854993870882e-07
129001.00000  130001.00000  9.661758696943e-07
130001.00000  131001.00000  9.371905936035e-07
131001.00000  132001.00000  8.502347653310e-07
132001.00000  133001.00000  7.536171783615e-07
133001.00000  134001.00000  7.826024544524e-07
134001.00000  135001.00000  8.502347653310e-07
135001.00000  136001.00000  6.666613500891e-07
136001.00000  137001.00000  7.922642131493e-07
137001.00000  138001.00000  8.888818001187e-07
138001.00000  139001.00000  7.053083848768e-07
139001.00000  140001.00000  7.246319022707e-07
140001.00000  141001.00000  7.729406957554e-07
141001.00000  142001.00000  8.309112479371e-07
142001.00000  143001.00000  8.115877305432e-07
143001.00000  144001.00000  6.859848674829e-07
144001.00000  145001.00000  8.115877305432e-07
145001.00000  146001.00000  6.763231087860e-07
146001.00000  147001.00000  7.246319022707e-07
147001.00000  148001.00000  7.342936609677e-07
148001.00000  149001.00000  5.507202457257e-07
149001.00000  150001.00000  5.603820044227e-07
150001.00000  151001.00000  7.536171783615e-07
151001.00000  152001.00000  7.246319022707e-07
152001.00000  153001.00000  6.569995913921e-07
153001.00000  154001.00000  6.280143153013e-07
154001.00000  155001.00000  6.280143153013e-07
155001.00000  156001.00000  6.183525566043e-07
156001.00000  157001.00000  5.893672805135e-07
157001.00000  158001.00000  5.410584870288e-07
158001.00000  159001.00000  6.956466261799e-07
159001.00000  160001.00000  7.342936609677e-07
160001.00000  161001.00000  5.797055218166e-07
161001.00000  162001.00000  5.797055218166e-07
162001.00000  163001.00000  5.700437631196e-07
163001.00000  164001.00000  5.410584870288e-07
164001.00000  165001.00000  4.154556239685e-07
165001.00000  166001.00000  5.410584870288e-07
166001.00000  167001.00000  5.120732109380e-07
167001.00000  168001.00000  4.637644174533e-07
168001.00000  169001.00000  4.057938652716e-07
169001.00000  170001.00000  4.057938652716e-07
170001.00000  171001.00000  5.507202457257e-07
171001.00000  172001.00000  5.024114522410e-07
172001.00000  173001.00000  3.768085891808e-07
173001.00000  174001.00000  4.830879348471e-07
174001.00000  175001.00000  5.313967283319e-07
175001.00000  176001.00000  4.347791413624e-07
176001.00000  177001.00000  5.507202457257e-07
177001.00000  178001.00000  4.347791413624e-07
178001.00000  179001.00000  3.188380369991e-07
179001.00000  180001.00000  3.961321065747e-07
180001.00000  181001.00000  4.927496935441e-07
181001.00000  182001.00000  2.898527609083e-07
182001.00000  183001.00000  3.864703478777e-07
183001.00000  184001.00000  4.444409000594e-07
184001.00000  185001.00000  3.961321065747e-07
185001.00000  186001.00000  3.091762783022e-07
186001.00000  187001.00000  4.347791413624e-07
187001.00000  188001.00000  5.313967283319e-07
188001.00000  189001.00000  3.574850717869e-07
189001.00000  190001.00000  3.961321065747e-07
190001.00000  191001.00000  3.091762783022e-07
191001.00000  192001.00000  4.637644174533e-07
192001.00000  193001.00000  3.768085891808e-07
193001.00000  194001.00000  3.188380369991e-07
194001.00000  195001.00000  3.961321065747e-07
195001.00000  196001.00000  4.154556239685e-07
196001.00000  197001.00000  3.574850717869e-07
197001.00000  198001.00000  2.705292435144e-07
198001.00000  199001.00000  4.541026587563e-07
