300.00000  350.00000  4.033776403658e-04
350.00000  400.00000  4.209157986425e-04
400.00000  450.00000  4.169298535796e-04
450.00000  500.00000  4.416427129696e-04
500.00000  550.00000  3.619238117116e-04
550.00000  600.00000  2.678555082271e-04
600.00000  650.00000  3.411968973845e-04
650.00000  700.00000  3.858394820890e-04
700.00000  750.00000  4.256989327180e-04
750.00000  800.00000  5.636126318945e-04
800.00000  850.00000  6.688415815551e-04
850.00000  900.00000  6.465202892028e-04
900.00000  950.00000  6.863797398319e-04
950.00000  1000.00000  8.019721466560e-04
1000.00000  1050.00000  9.135786084173e-04
1050.00000  1100.00000  9.406830348451e-04
1100.00000  1150.00000  1.022793503141e-03
1150.00000  1200.00000  1.053883874632e-03
1200.00000  1250.00000  1.015618802028e-03
1250.00000  1300.00000  1.025185070179e-03
1300.00000  1350.00000  9.733677843609e-04
1350.00000  1400.00000  9.327111447193e-04
1400.00000  1450.00000  9.414802238576e-04
1450.00000  1500.00000  9.223476875557e-04
1500.00000  1550.00000  8.968376391531e-04
1550.00000  1600.00000  9.319139557067e-04
1600.00000  1650.00000  8.681388347002e-04
1650.00000  1700.00000  8.139299818448e-04
1700.00000  1750.00000  8.777051028512e-04
1750.00000  1800.00000  7.692873971402e-04
1800.00000  1850.00000  7.541408059012e-04
1850.00000  1900.00000  7.182673003351e-04
1900.00000  1950.00000  6.967431969954e-04
1950.00000  2000.00000  6.728275266180e-04
2000.00000  2050.00000  6.911628739073e-04
2050.00000  2100.00000  6.776106606935e-04
2100.00000  2150.00000  6.345624540141e-04
2150.00000  2200.00000  6.305765089512e-04
2200.00000  2250.00000  6.473174782154e-04
2250.00000  2300.00000  6.632612584670e-04
2300.00000  2350.00000  7.557351839264e-04
2350.00000  2400.00000  6.265905638883e-04
2400.00000  2450.00000  6.146327286996e-04
2450.00000  2500.00000  5.994861374606e-04
2500.00000  2550.00000  5.468716626303e-04
2550.00000  2600.00000  4.958515658251e-04
2600.00000  2650.00000  5.500604186806e-04
2650.00000  2700.00000  5.293335043535e-04
2700.00000  2750.00000  5.189700471899e-04
2750.00000  2800.00000  4.966487548377e-04
2800.00000  2850.00000  5.181728581774e-04
2850.00000  2900.00000  4.591808712464e-04
2900.00000  2950.00000  4.567893042087e-04
2950.00000  3000.00000  4.687471393974e-04
3000.00000  3050.00000  4.352652008690e-04
3050.00000  3100.00000  4.161326645671e-04
3100.00000  3150.00000  3.985945062903e-04
3150.00000  3200.00000  4.017832623406e-04
3200.00000  3250.00000  3.874338601142e-04
3250.00000  3300.00000  3.754760249254e-04
3300.00000  3350.00000  3.730844578877e-04
3350.00000  3400.00000  3.587350556613e-04
3400.00000  3450.00000  3.252531171329e-04
3450.00000  3500.00000  3.587350556613e-04
3500.00000  3550.00000  3.220643610825e-04
3550.00000  3600.00000  2.917711786045e-04
3600.00000  3650.00000  2.790161544032e-04
3650.00000  3700.00000  3.053233918184e-04
3700.00000  3750.00000  2.471285939000e-04
3750.00000  3800.00000  2.678555082271e-04
3800.00000  3850.00000  2.670583192145e-04
3850.00000  3900.00000  2.343735696987e-04
3900.00000  3950.00000  2.351707587113e-04
3950.00000  4000.00000  2.208213564848e-04
4000.00000  4050.00000  2.271988685855e-04
4050.00000  4100.00000  1.985000641326e-04
4100.00000  4150.00000  2.256044905603e-04
4150.00000  4200.00000  1.873394179564e-04
4200.00000  4250.00000  1.849478509187e-04
4250.00000  4300.00000  1.841506619061e-04
4300.00000  4350.00000  1.833534728935e-04
4350.00000  4400.00000  1.817590948684e-04
4400.00000  4450.00000  1.562490464658e-04
4450.00000  4500.00000  1.530602904155e-04
4500.00000  4550.00000  1.498715343651e-04
4550.00000  4600.00000  1.594378025161e-04
4600.00000  4650.00000  1.610321805413e-04
4650.00000  4700.00000  1.363193211513e-04
4700.00000  4750.00000  1.666125036293e-04
4750.00000  4800.00000  1.291446200381e-04
4800.00000  4850.00000  1.371165101639e-04
4850.00000  4900.00000  1.347249431261e-04
4900.00000  4950.00000  1.139980287990e-04
4950.00000  5000.00000  1.116064617613e-04
5000.00000  5050.00000  1.187811628745e-04
5050.00000  5100.00000  1.044317606481e-04
5100.00000  5150.00000  1.044317606481e-04
5150.00000  5200.00000  1.052289496606e-04
5200.00000  5250.00000  1.028373826229e-04
5250.00000  5300.00000  9.486549249709e-05
5300.00000  5350.00000  9.247392545935e-05
5350.00000  5400.00000  8.290765730838e-05
5400.00000  5450.00000  8.928516940902e-05
5450.00000  5500.00000  7.015263310709e-05
5500.00000  5550.00000  7.653014520773e-05
5550.00000  5600.00000  8.290765730838e-05
5600.00000  5650.00000  8.131327928322e-05
5650.00000  5700.00000  7.174701113225e-05
5700.00000  5750.00000  8.051609027064e-05
5750.00000  5800.00000  7.573295619515e-05
5800.00000  5850.00000  7.334138915741e-05
5850.00000  5900.00000  7.732733422031e-05
5900.00000  5950.00000  5.181728581774e-05
5950.00000  6000.00000  5.819479791838e-05
6000.00000  6050.00000  5.102009680516e-05
6050.00000  6100.00000  5.500604186806e-05
6100.00000  6150.00000  6.218074298128e-05
6150.00000  6200.00000  5.580323088064e-05
6200.00000  6250.00000  5.022290779258e-05
6250.00000  6300.00000  5.819479791838e-05
6300.00000  6350.00000  6.138355396870e-05
6350.00000  6400.00000  2.064719542584e-04
6400.00000  6450.00000  5.341166384290e-05
6450.00000  6500.00000  5.261447483032e-05
6500.00000  6550.00000  5.500604186806e-05
6550.00000  6600.00000  4.225101766677e-05
6600.00000  6650.00000  4.543977371709e-05
6650.00000  6700.00000  3.746788359129e-05
6700.00000  6750.00000  3.746788359129e-05
6750.00000  6800.00000  3.587350556613e-05
6800.00000  6850.00000  4.543977371709e-05
6850.00000  6900.00000  3.587350556613e-05
6900.00000  6950.00000  3.906226161645e-05
6950.00000  7000.00000  3.587350556613e-05
7000.00000  7050.00000  3.985945062903e-05
7050.00000  7100.00000  5.660041989322e-05
7100.00000  7150.00000  2.630723741516e-05
7150.00000  7200.00000  3.109037149064e-05
7200.00000  7250.00000  2.869880445290e-05
7250.00000  7300.00000  3.427912754096e-05
7300.00000  7350.00000  1.913253630193e-05
7350.00000  7400.00000  3.507631655354e-05
7400.00000  7450.00000  2.232129235226e-05
7450.00000  7500.00000  3.826507260387e-05
7500.00000  7550.00000  3.667069457871e-05
7550.00000  7600.00000  2.710442642774e-05
7600.00000  7650.00000  2.869880445290e-05
7650.00000  7700.00000  1.992972531451e-05
7700.00000  7750.00000  1.913253630193e-05
7750.00000  7800.00000  2.072691432709e-05
7800.00000  7850.00000  2.630723741516e-05
7850.00000  7900.00000  2.072691432709e-05
7900.00000  7950.00000  1.594378025161e-05
7950.00000  8000.00000  2.232129235226e-05
8000.00000  8050.00000  1.514659123903e-05
8050.00000  8100.00000  1.913253630193e-05
8100.00000  8150.00000  1.674096926419e-05
8150.00000  8200.00000  2.152410333968e-05
8200.00000  8250.00000  2.311848136484e-05
8250.00000  8300.00000  2.072691432709e-05
8300.00000  8350.00000  2.072691432709e-05
8350.00000  8400.00000  1.753815827677e-05
8400.00000  8450.00000  2.949599346548e-05
8450.00000  8500.00000  1.514659123903e-05
8500.00000  8550.00000  1.514659123903e-05
8550.00000  8600.00000  1.833534728935e-05
8600.00000  8650.00000  1.833534728935e-05
8650.00000  8700.00000  9.566268150967e-06
8700.00000  8750.00000  1.195783518871e-05
8750.00000  8800.00000  1.434940222645e-05
8800.00000  8850.00000  1.355221321387e-05
8850.00000  8900.00000  1.355221321387e-05
8900.00000  8950.00000  1.275502420129e-05
8950.00000  9000.00000  9.566268150967e-06
9000.00000  9050.00000  2.072691432709e-05
9050.00000  9100.00000  1.434940222645e-05
9100.00000  9150.00000  8.769079138386e-06
9150.00000  9200.00000  1.434940222645e-05
9200.00000  9250.00000  1.674096926419e-05
9250.00000  9300.00000  1.036345716355e-05
9300.00000  9350.00000  1.434940222645e-05
9350.00000  9400.00000  1.514659123903e-05
9400.00000  9450.00000  1.355221321387e-05
9450.00000  9500.00000  1.594378025161e-05
9500.00000  9550.00000  1.594378025161e-05
9550.00000  9600.00000  1.195783518871e-05
9600.00000  9650.00000  7.971890125806e-06
9650.00000  9700.00000  1.195783518871e-05
9700.00000  9750.00000  1.116064617613e-05
9750.00000  9800.00000  1.434940222645e-05
9800.00000  9850.00000  1.195783518871e-05
9850.00000  9900.00000  2.152410333968e-05
9900.00000  9950.00000  9.566268150967e-06
9950.00000  10000.00000  8.769079138386e-06
