10001.00000  11001.00000  4.451033082145e-04
11001.00000  12001.00000  3.601406757179e-04
12001.00000  13001.00000  2.930966134775e-04
13001.00000  14001.00000  2.455145277550e-04
14001.00000  15001.00000  2.022615083759e-04
15001.00000  16001.00000  1.754212970466e-04
16001.00000  17001.00000  1.484681535519e-04
17001.00000  18001.00000  1.278768553793e-04
18001.00000  19001.00000  1.111628948881e-04
19001.00000  20001.00000  9.723459447886e-05
20001.00000  21001.00000  8.372037867634e-05
21001.00000  22001.00000  7.807377040230e-05
22001.00000  23001.00000  6.599002869587e-05
23001.00000  24001.00000  5.928938687735e-05
24001.00000  25001.00000  5.548733730617e-05
25001.00000  26001.00000  5.145942340403e-05
26001.00000  27001.00000  4.118259634528e-05
27001.00000  28001.00000  4.351652776522e-05
28001.00000  29001.00000  3.779463138086e-05
29001.00000  30001.00000  3.440666641644e-05
30001.00000  31001.00000  3.007760007302e-05
31001.00000  32001.00000  2.860948192177e-05
32001.00000  33001.00000  2.778131270824e-05
33001.00000  34001.00000  2.480743235059e-05
34001.00000  35001.00000  2.484507640575e-05
35001.00000  36001.00000  2.059129817264e-05
36001.00000  37001.00000  1.803150242175e-05
37001.00000  38001.00000  1.844558702851e-05
38001.00000  39001.00000  1.682689265662e-05
39001.00000  40001.00000  1.645045210502e-05
40001.00000  41001.00000  1.475646962281e-05
41001.00000  42001.00000  1.430474096088e-05
42001.00000  43001.00000  1.287426686480e-05
43001.00000  44001.00000  1.227196198223e-05
44001.00000  45001.00000  1.170730115483e-05
45001.00000  46001.00000  1.012625083810e-05
46001.00000  47001.00000  1.027682705874e-05
47001.00000  48001.00000  9.862742451978e-06
48001.00000  49001.00000  8.469912411050e-06
49001.00000  50001.00000  8.093471859448e-06
50001.00000  51001.00000  6.775929928840e-06
51001.00000  52001.00000  7.980539693967e-06
52001.00000  53001.00000  7.679387252686e-06
53001.00000  54001.00000  7.190014535603e-06
54001.00000  55001.00000  7.001794259802e-06
55001.00000  56001.00000  5.496032053393e-06
56001.00000  57001.00000  5.797184494674e-06
57001.00000  58001.00000  5.759540439514e-06
58001.00000  59001.00000  5.947760715315e-06
59001.00000  60001.00000  5.947760715315e-06
60001.00000  61001.00000  5.307811777591e-06
61001.00000  62001.00000  4.404354453746e-06
62001.00000  63001.00000  4.329066343426e-06
63001.00000  64001.00000  4.329066343426e-06
64001.00000  65001.00000  4.366710398586e-06
65001.00000  66001.00000  3.877337681503e-06
66001.00000  67001.00000  3.312676854100e-06
67001.00000  68001.00000  3.839693626343e-06
68001.00000  69001.00000  2.823304137017e-06
69001.00000  70001.00000  3.764405516022e-06
70001.00000  71001.00000  3.086812523138e-06
71001.00000  72001.00000  2.785660081857e-06
72001.00000  73001.00000  2.371575475094e-06
73001.00000  74001.00000  3.011524412818e-06
74001.00000  75001.00000  2.446863585415e-06
75001.00000  76001.00000  2.296287364774e-06
76001.00000  77001.00000  2.823304137017e-06
77001.00000  78001.00000  2.559795750895e-06
78001.00000  79001.00000  2.333931419934e-06
79001.00000  80001.00000  2.296287364774e-06
80001.00000  81001.00000  2.183355199293e-06
81001.00000  82001.00000  1.957490868332e-06
82001.00000  83001.00000  2.145711144133e-06
83001.00000  84001.00000  2.032778978652e-06
84001.00000  85001.00000  1.806914647691e-06
85001.00000  86001.00000  1.618694371890e-06
86001.00000  87001.00000  1.468118151249e-06
87001.00000  88001.00000  1.844558702851e-06
88001.00000  89001.00000  1.882202758011e-06
89001.00000  90001.00000  1.392830040928e-06
90001.00000  91001.00000  1.806914647691e-06
91001.00000  92001.00000  1.317541930608e-06
92001.00000  93001.00000  1.054033544486e-06
93001.00000  94001.00000  1.242253820287e-06
94001.00000  95001.00000  1.279897875448e-06
95001.00000  96001.00000  1.392830040928e-06
96001.00000  97001.00000  1.618694371890e-06
97001.00000  98001.00000  1.317541930608e-06
98001.00000  99001.00000  1.242253820287e-06
99001.00000  100001.00000  6.023048825636e-07
100001.00000  101001.00000  1.054033544486e-06
101001.00000  102001.00000  5.646608274033e-07
102001.00000  103001.00000  1.204609765127e-06
103001.00000  104001.00000  1.656338427050e-06
104001.00000  105001.00000  1.091677599646e-06
105001.00000  106001.00000  5.646608274033e-07
106001.00000  107001.00000  9.787454341658e-07
107001.00000  108001.00000  9.787454341658e-07
108001.00000  109001.00000  1.204609765127e-06
109001.00000  110001.00000  5.270167722431e-07
110001.00000  111001.00000  6.023048825636e-07
111001.00000  112001.00000  9.034573238454e-07
112001.00000  113001.00000  8.658132686851e-07
113001.00000  114001.00000  7.528811032045e-07
114001.00000  115001.00000  6.399489377238e-07
115001.00000  116001.00000  3.387964964420e-07
116001.00000  117001.00000  8.281692135249e-07
117001.00000  118001.00000  6.775929928840e-07
118001.00000  119001.00000  7.152370480442e-07
119001.00000  120001.00000  9.411013790056e-07
120001.00000  121001.00000  6.023048825636e-07
121001.00000  122001.00000  6.775929928840e-07
122001.00000  123001.00000  4.140846067625e-07
123001.00000  124001.00000  4.893727170829e-07
124001.00000  125001.00000  4.893727170829e-07
125001.00000  126001.00000  4.140846067625e-07
126001.00000  127001.00000  6.399489377238e-07
127001.00000  128001.00000  4.517286619227e-07
128001.00000  129001.00000  5.646608274033e-07
129001.00000  130001.00000  5.646608274033e-07
130001.00000  131001.00000  2.635083861216e-07
131001.00000  132001.00000  2.258643309613e-07
132001.00000  133001.00000  6.399489377238e-07
133001.00000  134001.00000  5.646608274033e-07
134001.00000  135001.00000  2.635083861216e-07
135001.00000  136001.00000  3.011524412818e-07
136001.00000  137001.00000  6.023048825636e-07
137001.00000  138001.00000  4.517286619227e-07
138001.00000  139001.00000  4.517286619227e-07
139001.00000  140001.00000  1.882202758011e-07
140001.00000  141001.00000  4.140846067625e-07
141001.00000  142001.00000  3.011524412818e-07
142001.00000  143001.00000  5.270167722431e-07
143001.00000  144001.00000  4.140846067625e-07
144001.00000  145001.00000  4.893727170829e-07
145001.00000  146001.00000  3.764405516022e-07
146001.00000  147001.00000  3.387964964420e-07
147001.00000  148001.00000  1.882202758011e-07
148001.00000  149001.00000  2.258643309613e-07
149001.00000  150001.00000  3.764405516022e-07
150001.00000  151001.00000  3.011524412818e-07
151001.00000  152001.00000  6.023048825636e-07
152001.00000  153001.00000  2.635083861216e-07
153001.00000  154001.00000  2.258643309613e-07
154001.00000  155001.00000  3.764405516022e-07
155001.00000  156001.00000  1.129321654807e-07
156001.00000  157001.00000  3.764405516022e-08
157001.00000  158001.00000  4.140846067625e-07
158001.00000  159001.00000  2.258643309613e-07
159001.00000  160001.00000  2.258643309613e-07
160001.00000  161001.00000  1.505762206409e-07
161001.00000  162001.00000  2.635083861216e-07
162001.00000  163001.00000  3.011524412818e-07
163001.00000  164001.00000  1.129321654807e-07
164001.00000  165001.00000  2.258643309613e-07
165001.00000  166001.00000  2.635083861216e-07
166001.00000  167001.00000  2.258643309613e-07
167001.00000  168001.00000  2.258643309613e-07
168001.00000  169001.00000  2.635083861216e-07
169001.00000  170001.00000  7.528811032045e-08
170001.00000  171001.00000  1.882202758011e-07
171001.00000  172001.00000  1.505762206409e-07
172001.00000  173001.00000  3.011524412818e-07
173001.00000  174001.00000  1.505762206409e-07
174001.00000  175001.00000  3.387964964420e-07
175001.00000  176001.00000  7.528811032045e-08
176001.00000  177001.00000  7.528811032045e-08
177001.00000  178001.00000  3.011524412818e-07
178001.00000  179001.00000  1.129321654807e-07
179001.00000  180001.00000  1.505762206409e-07
180001.00000  181001.00000  7.528811032045e-08
181001.00000  182001.00000  7.528811032045e-08
182001.00000  183001.00000  1.505762206409e-07
183001.00000  184001.00000  1.505762206409e-07
184001.00000  185001.00000  1.505762206409e-07
185001.00000  186001.00000  1.129321654807e-07
186001.00000  187001.00000  1.129321654807e-07
187001.00000  188001.00000  4.140846067625e-07
188001.00000  189001.00000  3.764405516022e-08
189001.00000  190001.00000  1.129321654807e-07
190001.00000  191001.00000  2.258643309613e-07
191001.00000  192001.00000  0.000000000000e+00
192001.00000  193001.00000  3.764405516022e-08
193001.00000  194001.00000  7.528811032045e-08
194001.00000  195001.00000  3.764405516022e-08
195001.00000  196001.00000  7.528811032045e-08
196001.00000  197001.00000  7.528811032045e-08
197001.00000  198001.00000  1.505762206409e-07
198001.00000  199001.00000  1.882202758011e-07
