300.00000  350.00000  1.573359814987e-01
350.00000  400.00000  1.252991000919e-01
400.00000  450.00000  1.022602507173e-01
450.00000  500.00000  8.568377159670e-02
500.00000  550.00000  7.317495675090e-02
550.00000  600.00000  6.288132688681e-02
600.00000  650.00000  5.512200901912e-02
650.00000  700.00000  4.866619484889e-02
700.00000  750.00000  4.357616717112e-02
750.00000  800.00000  3.912535765268e-02
800.00000  850.00000  3.545182970294e-02
850.00000  900.00000  3.218574307166e-02
900.00000  950.00000  2.941348380268e-02
950.00000  1000.00000  2.703902455261e-02
1000.00000  1050.00000  2.496421689216e-02
1050.00000  1100.00000  2.310884520919e-02
1100.00000  1150.00000  2.140484192895e-02
1150.00000  1200.00000  1.996385330009e-02
1200.00000  1250.00000  1.872764587341e-02
1250.00000  1300.00000  1.756972579897e-02
1300.00000  1350.00000  1.654466283215e-02
1350.00000  1400.00000  1.547158619364e-02
1400.00000  1450.00000  1.468119245756e-02
1450.00000  1500.00000  1.387190177440e-02
1500.00000  1550.00000  1.313241409988e-02
1550.00000  1600.00000  1.252944722681e-02
1600.00000  1650.00000  1.191143992646e-02
1650.00000  1700.00000  1.136998454444e-02
1700.00000  1750.00000  1.083219285625e-02
1750.00000  1800.00000  1.034453592565e-02
1800.00000  1850.00000  9.889659413472e-03
1850.00000  1900.00000  9.470455709586e-03
1900.00000  1950.00000  9.097337417489e-03
1950.00000  2000.00000  8.711685435994e-03
2000.00000  2050.00000  8.395065159186e-03
2050.00000  2100.00000  8.021175563126e-03
2100.00000  2150.00000  7.730586795069e-03
2150.00000  2200.00000  7.479913007097e-03
2200.00000  2250.00000  7.203014884383e-03
2250.00000  2300.00000  6.969309783597e-03
2300.00000  2350.00000  6.728662947144e-03
2350.00000  2400.00000  6.461598949958e-03
2400.00000  2450.00000  6.279764040683e-03
2450.00000  2500.00000  6.107570430945e-03
2500.00000  2550.00000  5.806954711369e-03
2550.00000  2600.00000  5.688173901069e-03
2600.00000  2650.00000  5.553581359527e-03
2650.00000  2700.00000  5.383894487669e-03
2700.00000  2750.00000  5.162337424299e-03
2750.00000  2800.00000  5.003255981933e-03
2800.00000  2850.00000  4.905686030614e-03
2850.00000  2900.00000  4.795775215888e-03
2900.00000  2950.00000  4.643635509188e-03
2950.00000  3000.00000  4.559756203213e-03
3000.00000  3050.00000  4.411858668309e-03
3050.00000  3100.00000  4.311974805102e-03
3100.00000  3150.00000  4.176225307615e-03
3150.00000  3200.00000  4.079619486251e-03
3200.00000  3250.00000  4.030448858610e-03
3250.00000  3300.00000  3.916488698078e-03
3300.00000  3350.00000  3.758371385665e-03
3350.00000  3400.00000  3.749501390091e-03
3400.00000  3450.00000  3.608931242835e-03
3450.00000  3500.00000  3.518110201193e-03
3500.00000  3550.00000  3.451006756413e-03
3550.00000  3600.00000  3.382746355688e-03
3600.00000  3650.00000  3.266665109258e-03
3650.00000  3700.00000  3.243911642350e-03
3700.00000  3750.00000  3.118960400345e-03
3750.00000  3800.00000  3.072103684594e-03
3800.00000  3850.00000  3.035852398333e-03
3850.00000  3900.00000  2.958143524062e-03
3900.00000  3950.00000  2.907815940476e-03
3950.00000  4000.00000  2.873107262142e-03
4000.00000  4050.00000  2.760496883545e-03
4050.00000  4100.00000  2.761268187508e-03
4100.00000  4150.00000  2.694936046691e-03
4150.00000  4200.00000  2.591581315650e-03
4200.00000  4250.00000  2.571720238603e-03
4250.00000  4300.00000  2.556486985334e-03
4300.00000  4350.00000  2.474343113275e-03
4350.00000  4400.00000  2.470100941479e-03
4400.00000  4450.00000  2.378894247855e-03
4450.00000  4500.00000  2.345921003437e-03
4500.00000  4550.00000  2.296557549806e-03
4550.00000  4600.00000  2.228104323091e-03
4600.00000  4650.00000  2.227911497100e-03
4650.00000  4700.00000  2.231382364933e-03
4700.00000  4750.00000  2.137861759421e-03
4750.00000  4800.00000  2.093897433530e-03
4800.00000  4850.00000  2.128413285874e-03
4850.00000  4900.00000  2.015031603314e-03
4900.00000  4950.00000  2.041448764047e-03
4950.00000  5000.00000  1.999605524054e-03
5000.00000  5050.00000  1.963739889775e-03
5050.00000  5100.00000  1.947735332543e-03
5100.00000  5150.00000  1.862699070624e-03
5150.00000  5200.00000  1.893165577162e-03
5200.00000  5250.00000  1.860385158735e-03
5250.00000  5300.00000  1.806393881325e-03
5300.00000  5350.00000  1.783061936445e-03
5350.00000  5400.00000  1.747581954147e-03
5400.00000  5450.00000  1.729070659035e-03
5450.00000  5500.00000  1.721936097378e-03
5500.00000  5550.00000  1.707088496090e-03
5550.00000  5600.00000  1.688384374988e-03
5600.00000  5650.00000  1.661388736283e-03
5650.00000  5700.00000  1.647698090940e-03
5700.00000  5750.00000  1.618002888365e-03
5750.00000  5800.00000  1.595635073438e-03
5800.00000  5850.00000  1.554948789390e-03
5850.00000  5900.00000  1.579437690215e-03
5900.00000  5950.00000  1.528531628658e-03
5950.00000  6000.00000  1.484374476776e-03
6000.00000  6050.00000  1.502114467925e-03
6050.00000  6100.00000  1.479746652998e-03
6100.00000  6150.00000  1.449087320470e-03
6150.00000  6200.00000  1.473383395304e-03
6200.00000  6250.00000  1.454293622220e-03
6250.00000  6300.00000  1.452558188303e-03
6300.00000  6350.00000  1.447351886553e-03
6350.00000  6400.00000  2.381786637717e-03
6400.00000  6450.00000  1.351903021133e-03
6450.00000  6500.00000  1.328763902243e-03
6500.00000  6550.00000  1.297911743723e-03
6550.00000  6600.00000  1.285378054325e-03
6600.00000  6650.00000  1.303118045473e-03
6650.00000  6700.00000  1.287499140223e-03
6700.00000  6750.00000  1.267059585204e-03
6750.00000  6800.00000  1.240835250462e-03
6800.00000  6850.00000  1.224252215258e-03
6850.00000  6900.00000  1.224059389267e-03
6900.00000  6950.00000  1.220202869452e-03
6950.00000  7000.00000  1.191278970840e-03
7000.00000  7050.00000  1.162355072228e-03
7050.00000  7100.00000  1.241992206406e-03
7100.00000  7150.00000  1.146543340986e-03
7150.00000  7200.00000  1.111256184679e-03
7200.00000  7250.00000  1.109520750763e-03
7250.00000  7300.00000  1.080018374178e-03
7300.00000  7350.00000  1.074619246437e-03
7350.00000  7400.00000  1.095251627447e-03
7400.00000  7450.00000  1.047430781742e-03
7450.00000  7500.00000  1.099686625235e-03
7500.00000  7550.00000  1.055722299344e-03
7550.00000  7600.00000  1.007322975666e-03
7600.00000  7650.00000  9.998027620272e-04
7650.00000  7700.00000  1.020049491056e-03
7700.00000  7750.00000  9.967175461753e-04
7750.00000  7800.00000  9.708788634151e-04
7800.00000  7850.00000  9.697219074706e-04
7850.00000  7900.00000  9.512106123588e-04
7900.00000  7950.00000  9.296141013950e-04
7950.00000  8000.00000  9.371343150342e-04
8000.00000  8050.00000  9.573810440627e-04
8050.00000  8100.00000  9.398338789047e-04
8100.00000  8150.00000  9.261432335616e-04
8150.00000  8200.00000  9.095601983573e-04
8200.00000  8250.00000  8.893134693287e-04
8250.00000  8300.00000  8.910489032455e-04
8300.00000  8350.00000  8.769726059209e-04
8350.00000  8400.00000  8.773582579024e-04
8400.00000  8450.00000  8.534478350497e-04
8450.00000  8500.00000  8.499769672162e-04
8500.00000  8550.00000  8.652102204853e-04
8550.00000  8600.00000  8.357078439009e-04
8600.00000  8650.00000  8.305015421507e-04
8650.00000  8700.00000  8.187391567151e-04
8700.00000  8750.00000  7.975282977328e-04
8750.00000  8800.00000  8.121830730296e-04
8800.00000  8850.00000  7.900080840936e-04
8850.00000  8900.00000  7.979139497143e-04
8900.00000  8950.00000  7.693757030836e-04
8950.00000  9000.00000  7.938646039086e-04
9000.00000  9050.00000  7.792098286118e-04
9050.00000  9100.00000  7.473935401384e-04
9100.00000  9150.00000  7.649407052964e-04
9150.00000  9200.00000  7.618554894445e-04
9200.00000  9250.00000  7.379450665917e-04
9250.00000  9300.00000  7.537567978331e-04
9300.00000  9350.00000  7.429585423512e-04
9350.00000  9400.00000  7.541424498146e-04
9400.00000  9450.00000  7.425728903697e-04
9450.00000  9500.00000  7.223261613412e-04
9500.00000  9550.00000  7.230974653042e-04
9550.00000  9600.00000  6.741196636542e-04
9600.00000  9650.00000  6.957161746180e-04
9650.00000  9700.00000  7.157700776557e-04
9700.00000  9750.00000  6.843394411639e-04
9750.00000  9800.00000  6.893529169233e-04
9800.00000  9850.00000  6.905098728678e-04
9850.00000  9900.00000  6.752766195987e-04
9900.00000  9950.00000  6.760479235617e-04
9950.00000  10000.00000  6.517518487275e-04
