300.00000  350.00000  1.932470026103e-07
350.00000  400.00000  9.662350130515e-07
400.00000  450.00000  0.000000000000e+00
450.00000  500.00000  0.000000000000e+00
500.00000  550.00000  1.758547723754e-05
550.00000  600.00000  9.662350130515e-07
600.00000  650.00000  3.864940052206e-06
650.00000  700.00000  7.729880104412e-07
700.00000  750.00000  3.091952041765e-06
750.00000  800.00000  2.125717028713e-06
800.00000  850.00000  1.468677219838e-05
850.00000  900.00000  1.159482015662e-06
900.00000  950.00000  1.932470026103e-06
950.00000  1000.00000  2.318964031324e-06
1000.00000  1050.00000  3.478446046985e-06
1050.00000  1100.00000  1.159482015662e-06
1100.00000  1150.00000  1.352729018272e-06
1150.00000  1200.00000  3.864940052206e-06
1200.00000  1250.00000  5.604163075699e-06
1250.00000  1300.00000  2.260989930541e-05
1300.00000  1350.00000  7.150139096581e-06
1350.00000  1400.00000  1.082183214618e-05
1400.00000  1450.00000  1.391378418794e-05
1450.00000  1500.00000  2.589509834978e-05
1500.00000  1550.00000  3.942238853250e-05
1550.00000  1600.00000  5.681461876743e-05
1600.00000  1650.00000  8.097049409372e-05
1650.00000  1700.00000  1.082183214618e-04
1700.00000  1750.00000  1.808791944432e-04
1750.00000  1800.00000  1.789467244171e-04
1800.00000  1850.00000  2.129581968766e-04
1850.00000  1900.00000  2.139244318896e-04
1900.00000  1950.00000  2.467764223334e-04
1950.00000  2000.00000  3.358632905367e-04
2000.00000  2050.00000  3.795371131266e-04
2050.00000  2100.00000  4.417626479671e-04
2100.00000  2150.00000  4.993502547450e-04
2150.00000  2200.00000  5.463092763793e-04
2200.00000  2250.00000  5.994522020972e-04
2250.00000  2300.00000  6.610979959298e-04
2300.00000  2350.00000  7.501848641332e-04
2350.00000  2400.00000  7.600404612663e-04
2400.00000  2450.00000  7.770461974960e-04
2450.00000  2500.00000  7.716352814229e-04
2500.00000  2550.00000  7.478659001019e-04
2550.00000  2600.00000  7.940519337257e-04
2600.00000  2650.00000  8.114441639607e-04
2650.00000  2700.00000  8.245849601382e-04
2700.00000  2750.00000  8.535720105297e-04
2750.00000  2800.00000  8.779211328586e-04
2800.00000  2850.00000  8.680655357255e-04
2850.00000  2900.00000  8.933808930674e-04
2900.00000  2950.00000  8.999512911562e-04
2950.00000  3000.00000  9.252666484981e-04
3000.00000  3050.00000  9.074879242580e-04
3050.00000  3100.00000  8.864240009734e-04
3100.00000  3150.00000  9.223679434590e-04
3150.00000  3200.00000  8.817860729108e-04
3200.00000  3250.00000  8.614951376367e-04
3250.00000  3300.00000  8.655533246915e-04
3300.00000  3350.00000  8.543449985401e-04
3350.00000  3400.00000  8.448758954122e-04
3400.00000  3450.00000  8.220727491042e-04
3450.00000  3500.00000  8.470016124409e-04
3500.00000  3550.00000  8.251647011460e-04
3550.00000  3600.00000  7.834233485822e-04
3600.00000  3650.00000  7.559822742115e-04
3650.00000  3700.00000  7.934721927179e-04
3700.00000  3750.00000  7.530835691723e-04
3750.00000  3800.00000  7.184923557051e-04
3800.00000  3850.00000  7.414887490157e-04
3850.00000  3900.00000  7.088300055746e-04
3900.00000  3950.00000  6.953027153919e-04
3950.00000  4000.00000  7.014866194754e-04
4000.00000  4050.00000  6.630304659559e-04
4050.00000  4100.00000  6.431260246871e-04
4100.00000  4150.00000  6.495031757732e-04
4150.00000  4200.00000  6.268932764678e-04
4200.00000  4250.00000  6.131727392825e-04
4250.00000  4300.00000  6.129794922799e-04
4300.00000  4350.00000  5.876641349379e-04
4350.00000  4400.00000  5.859249119144e-04
4400.00000  4450.00000  5.289170461444e-04
4450.00000  4500.00000  5.211871660400e-04
4500.00000  4550.00000  5.519134394550e-04
4550.00000  4600.00000  5.387726432775e-04
4600.00000  4650.00000  5.078531228599e-04
4650.00000  4700.00000  5.020557127816e-04
4700.00000  4750.00000  4.900743986197e-04
4750.00000  4800.00000  4.835040005310e-04
4800.00000  4850.00000  4.651455352830e-04
4850.00000  4900.00000  4.836972475336e-04
4900.00000  4950.00000  4.701699573509e-04
4950.00000  5000.00000  4.572224081760e-04
5000.00000  5050.00000  4.491060340663e-04
5050.00000  5100.00000  4.348057558732e-04
5100.00000  5150.00000  4.292015927975e-04
5150.00000  5200.00000  4.179932666461e-04
5200.00000  5250.00000  4.120026095652e-04
5250.00000  5300.00000  4.241771707296e-04
5300.00000  5350.00000  3.909386862806e-04
5350.00000  5400.00000  3.806965951423e-04
5400.00000  5450.00000  4.023402594346e-04
5450.00000  5500.00000  3.816628301553e-04
5500.00000  5550.00000  3.712274920144e-04
5550.00000  5600.00000  3.638841059152e-04
5600.00000  5650.00000  3.513230507455e-04
5650.00000  5700.00000  3.569272138212e-04
5700.00000  5750.00000  3.519027917534e-04
5750.00000  5800.00000  3.408877126046e-04
5800.00000  5850.00000  3.362497845419e-04
5850.00000  5900.00000  3.540285087821e-04
5900.00000  5950.00000  3.229157413618e-04
5950.00000  6000.00000  3.233022353670e-04
6000.00000  6050.00000  3.242684703801e-04
6050.00000  6100.00000  3.062964991373e-04
6100.00000  6150.00000  3.211765183383e-04
6150.00000  6200.00000  3.111276742026e-04
6200.00000  6250.00000  3.395349835863e-04
6250.00000  6300.00000  3.777978901031e-04
6300.00000  6350.00000  3.578934488343e-04
6350.00000  6400.00000  1.734585095430e-03
6400.00000  6450.00000  2.720917796753e-04
6450.00000  6500.00000  2.829136118215e-04
6500.00000  6550.00000  2.885177748972e-04
6550.00000  6600.00000  2.713187916649e-04
6600.00000  6650.00000  2.633956645578e-04
6650.00000  6700.00000  2.537333144273e-04
6700.00000  6750.00000  2.628159235500e-04
6750.00000  6800.00000  2.454236933151e-04
6800.00000  6850.00000  2.481291513516e-04
6850.00000  6900.00000  2.722850266779e-04
6900.00000  6950.00000  2.533468204221e-04
6950.00000  7000.00000  2.373073192054e-04
7000.00000  7050.00000  2.272584750697e-04
7050.00000  7100.00000  3.915184272885e-04
7100.00000  7150.00000  1.694776212892e-04
7150.00000  7200.00000  1.667721632527e-04
7200.00000  7250.00000  1.667721632527e-04
7250.00000  7300.00000  1.661924222449e-04
7300.00000  7350.00000  1.650329402292e-04
7350.00000  7400.00000  1.727628203336e-04
7400.00000  7450.00000  1.688978802814e-04
7450.00000  7500.00000  2.123784558687e-04
7500.00000  7550.00000  1.621342351900e-04
7550.00000  7600.00000  1.694776212892e-04
7600.00000  7650.00000  1.661924222449e-04
7650.00000  7700.00000  1.511191560413e-04
7700.00000  7750.00000  1.621342351900e-04
7750.00000  7800.00000  1.553705900987e-04
7800.00000  7850.00000  1.598152711587e-04
7850.00000  7900.00000  1.501529210282e-04
7900.00000  7950.00000  1.455149929656e-04
7950.00000  8000.00000  1.472542159890e-04
8000.00000  8050.00000  1.441622639473e-04
8050.00000  8100.00000  1.470609689864e-04
8100.00000  8150.00000  1.466744749812e-04
8150.00000  8200.00000  1.503461680308e-04
8200.00000  8250.00000  1.507326620360e-04
8250.00000  8300.00000  1.540178610804e-04
8300.00000  8350.00000  1.327606907933e-04
8350.00000  8400.00000  1.368188778481e-04
8400.00000  8450.00000  1.381716068664e-04
8450.00000  8500.00000  1.317944557802e-04
8500.00000  8550.00000  1.439690169447e-04
8550.00000  8600.00000  1.352729018272e-04
8600.00000  8650.00000  1.240645756758e-04
8650.00000  8700.00000  1.300552327567e-04
8700.00000  8750.00000  1.246443166836e-04
8750.00000  8800.00000  1.271565277176e-04
8800.00000  8850.00000  1.190401536079e-04
8850.00000  8900.00000  1.287025037385e-04
8900.00000  8950.00000  1.207793766314e-04
8950.00000  9000.00000  1.219388586471e-04
9000.00000  9050.00000  1.263835397071e-04
9050.00000  9100.00000  1.163346955714e-04
9100.00000  9150.00000  1.115035205061e-04
9150.00000  9200.00000  1.296687387515e-04
9200.00000  9250.00000  1.234848346680e-04
9250.00000  9300.00000  1.240645756758e-04
9300.00000  9350.00000  1.165279425740e-04
9350.00000  9400.00000  1.229050936602e-04
9400.00000  9450.00000  1.116967675088e-04
9450.00000  9500.00000  1.151752135557e-04
9500.00000  9550.00000  1.176874245897e-04
9550.00000  9600.00000  1.157549545636e-04
9600.00000  9650.00000  1.163346955714e-04
9650.00000  9700.00000  1.057061104278e-04
9700.00000  9750.00000  1.232915876654e-04
9750.00000  9800.00000  1.145954725479e-04
9800.00000  9850.00000  1.109237794983e-04
9850.00000  9900.00000  9.874921833386e-05
9900.00000  9950.00000  1.043533814096e-04
9950.00000  10000.00000  1.024209113835e-04
