300.00000  350.00000  0.000000000000e+00
350.00000  400.00000  3.567646907714e-07
400.00000  450.00000  0.000000000000e+00
450.00000  500.00000  0.000000000000e+00
500.00000  550.00000  4.994705670799e-06
550.00000  600.00000  0.000000000000e+00
600.00000  650.00000  1.427058763085e-06
650.00000  700.00000  0.000000000000e+00
700.00000  750.00000  3.567646907714e-07
750.00000  800.00000  0.000000000000e+00
800.00000  850.00000  2.854117526171e-06
850.00000  900.00000  7.135293815427e-07
900.00000  950.00000  0.000000000000e+00
950.00000  1000.00000  7.135293815427e-07
1000.00000  1050.00000  1.070294072314e-06
1050.00000  1100.00000  0.000000000000e+00
1100.00000  1150.00000  3.567646907714e-07
1150.00000  1200.00000  2.140588144628e-06
1200.00000  1250.00000  3.567646907714e-07
1250.00000  1300.00000  6.064999743113e-06
1300.00000  1350.00000  7.135293815427e-07
1350.00000  1400.00000  0.000000000000e+00
1400.00000  1450.00000  2.140588144628e-06
1450.00000  1500.00000  1.070294072314e-06
1500.00000  1550.00000  1.070294072314e-06
1550.00000  1600.00000  1.783823453857e-06
1600.00000  1650.00000  1.427058763085e-06
1650.00000  1700.00000  7.135293815427e-07
1700.00000  1750.00000  1.498411701240e-05
1750.00000  1800.00000  5.351470361570e-06
1800.00000  1850.00000  2.497352835399e-06
1850.00000  1900.00000  1.783823453857e-06
1900.00000  1950.00000  2.854117526171e-06
1950.00000  2000.00000  2.497352835399e-06
2000.00000  2050.00000  3.924411598485e-06
2050.00000  2100.00000  2.854117526171e-06
2100.00000  2150.00000  2.140588144628e-06
2150.00000  2200.00000  4.281176289256e-06
2200.00000  2250.00000  3.210882216942e-06
2250.00000  2300.00000  6.064999743113e-06
2300.00000  2350.00000  3.175205747865e-05
2350.00000  2400.00000  4.994705670799e-06
2400.00000  2450.00000  2.854117526171e-06
2450.00000  2500.00000  6.421764433884e-06
2500.00000  2550.00000  4.281176289256e-06
2550.00000  2600.00000  4.637940980028e-06
2600.00000  2650.00000  3.210882216942e-06
2650.00000  2700.00000  6.421764433884e-06
2700.00000  2750.00000  6.778529124656e-06
2750.00000  2800.00000  5.351470361570e-06
2800.00000  2850.00000  7.135293815427e-06
2850.00000  2900.00000  8.562352578512e-06
2900.00000  2950.00000  5.351470361570e-06
2950.00000  3000.00000  2.461676366322e-05
3000.00000  3050.00000  8.562352578512e-06
3050.00000  3100.00000  6.421764433884e-06
3100.00000  3150.00000  7.492058506198e-06
3150.00000  3200.00000  8.919117269284e-06
3200.00000  3250.00000  9.275881960055e-06
3250.00000  3300.00000  7.848823196970e-06
3300.00000  3350.00000  9.632646650826e-06
3350.00000  3400.00000  9.989411341598e-06
3400.00000  3450.00000  1.248676417700e-05
3450.00000  3500.00000  1.070294072314e-05
3500.00000  3550.00000  9.989411341598e-06
3550.00000  3600.00000  1.498411701240e-05
3600.00000  3650.00000  1.641117577548e-05
3650.00000  3700.00000  3.068176340634e-05
3700.00000  3750.00000  1.855176392011e-05
3750.00000  3800.00000  1.783823453857e-05
3800.00000  3850.00000  2.354646959091e-05
3850.00000  3900.00000  2.318970490014e-05
3900.00000  3950.00000  2.568705773554e-05
3950.00000  4000.00000  2.604382242631e-05
4000.00000  4050.00000  3.103852809711e-05
4050.00000  4100.00000  3.068176340634e-05
4100.00000  4150.00000  3.103852809711e-05
4150.00000  4200.00000  3.960088067562e-05
4200.00000  4250.00000  4.031441005716e-05
4250.00000  4300.00000  3.603323376791e-05
4300.00000  4350.00000  4.102793943871e-05
4350.00000  4400.00000  4.673617449105e-05
4400.00000  4450.00000  4.530911572796e-05
4450.00000  4500.00000  4.994705670799e-05
4500.00000  4550.00000  5.743911521419e-05
4550.00000  4600.00000  5.850940928650e-05
4600.00000  4650.00000  6.314735026653e-05
4650.00000  4700.00000  7.170970284504e-05
4700.00000  4750.00000  7.028264408196e-05
4750.00000  4800.00000  7.848823196970e-05
4800.00000  4850.00000  9.026146676515e-05
4850.00000  4900.00000  7.777470258815e-05
4900.00000  4950.00000  8.169911418664e-05
4950.00000  5000.00000  8.241264356818e-05
5000.00000  5050.00000  9.454264305441e-05
5050.00000  5100.00000  1.041752897052e-04
5100.00000  5150.00000  1.013211721791e-04
5150.00000  5200.00000  1.105970541391e-04
5200.00000  5250.00000  1.113105835207e-04
5250.00000  5300.00000  1.105970541391e-04
5300.00000  5350.00000  1.095267600668e-04
5350.00000  5400.00000  1.230838183161e-04
5400.00000  5450.00000  1.241541123884e-04
5450.00000  5500.00000  1.209432301715e-04
5500.00000  5550.00000  1.270082299146e-04
5550.00000  5600.00000  1.366408765654e-04
5600.00000  5650.00000  1.387814647101e-04
5650.00000  5700.00000  1.305758768223e-04
5700.00000  5750.00000  1.312894062039e-04
5750.00000  5800.00000  1.270082299146e-04
5800.00000  5850.00000  1.452032291439e-04
5850.00000  5900.00000  1.459167585255e-04
5900.00000  5950.00000  1.551926404855e-04
5950.00000  6000.00000  1.573332286302e-04
6000.00000  6050.00000  1.537655817225e-04
6050.00000  6100.00000  1.452032291439e-04
6100.00000  6150.00000  1.623279343010e-04
6150.00000  6200.00000  1.494844054332e-04
6200.00000  6250.00000  1.619711696102e-04
6250.00000  6300.00000  1.815932276026e-04
6300.00000  6350.00000  1.683929340441e-04
6350.00000  6400.00000  5.287252717231e-04
6400.00000  6450.00000  1.623279343010e-04
6450.00000  6500.00000  1.530520523409e-04
6500.00000  6550.00000  1.616144049194e-04
6550.00000  6600.00000  1.673226399718e-04
6600.00000  6650.00000  1.544791111040e-04
6650.00000  6700.00000  1.630414636825e-04
6700.00000  6750.00000  1.737444044056e-04
6750.00000  6800.00000  1.544791111040e-04
6800.00000  6850.00000  1.676794046625e-04
6850.00000  6900.00000  1.612576402287e-04
6900.00000  6950.00000  1.512682288871e-04
6950.00000  7000.00000  1.676794046625e-04
7000.00000  7050.00000  1.548358757948e-04
7050.00000  7100.00000  1.969341093058e-04
7100.00000  7150.00000  6.814205593733e-05
7150.00000  7200.00000  6.386087964807e-05
7200.00000  7250.00000  6.029323274036e-05
7250.00000  7300.00000  6.814205593733e-05
7300.00000  7350.00000  6.386087964807e-05
7350.00000  7400.00000  6.136352681267e-05
7400.00000  7450.00000  6.992587939118e-05
7450.00000  7500.00000  8.740734923898e-05
7500.00000  7550.00000  6.849882062810e-05
7550.00000  7600.00000  6.885558531887e-05
7600.00000  7650.00000  6.885558531887e-05
7650.00000  7700.00000  8.205587887741e-05
7700.00000  7750.00000  7.741793789738e-05
7750.00000  7800.00000  7.206646753581e-05
7800.00000  7850.00000  7.920176135124e-05
7850.00000  7900.00000  6.671499717424e-05
7900.00000  7950.00000  7.884499666047e-05
7950.00000  8000.00000  8.098558480510e-05
8000.00000  8050.00000  7.385029098967e-05
8050.00000  8100.00000  6.885558531887e-05
8100.00000  8150.00000  7.563411444353e-05
8150.00000  8200.00000  8.027205542355e-05
8200.00000  8250.00000  8.383970233127e-05
8250.00000  8300.00000  7.063940877273e-05
8300.00000  8350.00000  7.599087913430e-05
8350.00000  8400.00000  8.062882011433e-05
8400.00000  8450.00000  7.848823196970e-05
8450.00000  8500.00000  7.242323222658e-05
8500.00000  8550.00000  7.385029098967e-05
8550.00000  8600.00000  7.670440851584e-05
8600.00000  8650.00000  7.848823196970e-05
8650.00000  8700.00000  7.349352629890e-05
8700.00000  8750.00000  7.277999691736e-05
8750.00000  8800.00000  7.634764382507e-05
8800.00000  8850.00000  7.313676160813e-05
8850.00000  8900.00000  7.670440851584e-05
8900.00000  8950.00000  7.135293815427e-05
8950.00000  9000.00000  7.670440851584e-05
9000.00000  9050.00000  7.420705568044e-05
9050.00000  9100.00000  8.276940825895e-05
9100.00000  9150.00000  6.921235000964e-05
9150.00000  9200.00000  7.277999691736e-05
9200.00000  9250.00000  6.564470310193e-05
9250.00000  9300.00000  8.383970233127e-05
9300.00000  9350.00000  6.849882062810e-05
9350.00000  9400.00000  8.205587887741e-05
9400.00000  9450.00000  8.169911418664e-05
9450.00000  9500.00000  7.135293815427e-05
9500.00000  9550.00000  7.420705568044e-05
9550.00000  9600.00000  6.600146779270e-05
9600.00000  9650.00000  6.956911470041e-05
9650.00000  9700.00000  6.992587939118e-05
9700.00000  9750.00000  6.885558531887e-05
9750.00000  9800.00000  7.099617346350e-05
9800.00000  9850.00000  6.671499717424e-05
9850.00000  9900.00000  7.563411444353e-05
9900.00000  9950.00000  6.849882062810e-05
9950.00000  10000.00000  8.241264356818e-05
