300.00000  350.00000  5.028265321871e-06
350.00000  400.00000  1.226896738536e-05
400.00000  450.00000  6.033918386245e-06
450.00000  500.00000  8.849746966492e-06
500.00000  550.00000  1.061969635979e-04
550.00000  600.00000  8.648616353617e-06
600.00000  650.00000  3.117524499560e-05
650.00000  700.00000  6.033918386245e-06
700.00000  750.00000  2.131984496473e-05
750.00000  800.00000  1.347575106261e-05
800.00000  850.00000  6.235048999119e-05
850.00000  900.00000  1.669384086861e-05
900.00000  950.00000  1.428027351411e-05
950.00000  1000.00000  1.307348983686e-05
1000.00000  1050.00000  1.749836332011e-05
1050.00000  1100.00000  1.387801228836e-05
1100.00000  1150.00000  1.488366535274e-05
1150.00000  1200.00000  1.790062454586e-05
1200.00000  1250.00000  2.051532251323e-05
1250.00000  1300.00000  5.772448589507e-05
1300.00000  1350.00000  1.850401638448e-05
1350.00000  1400.00000  2.232549802911e-05
1400.00000  1450.00000  2.272775925485e-05
1450.00000  1500.00000  2.755489396385e-05
1500.00000  1550.00000  2.091758373898e-05
1550.00000  1600.00000  1.930853883598e-05
1600.00000  1650.00000  2.675037151235e-05
1650.00000  1700.00000  2.212436741623e-05
1700.00000  1750.00000  9.252008192242e-05
1750.00000  1800.00000  2.614697967373e-05
1800.00000  1850.00000  2.896280825397e-05
1850.00000  1900.00000  2.373341231923e-05
1900.00000  1950.00000  2.715263273810e-05
1950.00000  2000.00000  2.654924089948e-05
2000.00000  2050.00000  2.795715518960e-05
2050.00000  2100.00000  3.258315928572e-05
2100.00000  2150.00000  3.037072254410e-05
2150.00000  2200.00000  3.016959193122e-05
2200.00000  2250.00000  3.378994296297e-05
2250.00000  2300.00000  3.057185315697e-05
2300.00000  2350.00000  1.208794983378e-04
2350.00000  2400.00000  3.962273073634e-05
2400.00000  2450.00000  3.700803276897e-05
2450.00000  2500.00000  3.660577154322e-05
2500.00000  2550.00000  3.137637560847e-05
2550.00000  2600.00000  3.016959193122e-05
2600.00000  2650.00000  3.197976744710e-05
2650.00000  2700.00000  3.539898786597e-05
2700.00000  2750.00000  4.082951441359e-05
2750.00000  2800.00000  3.479559602734e-05
2800.00000  2850.00000  3.358881235010e-05
2850.00000  2900.00000  3.962273073634e-05
2900.00000  2950.00000  4.284082054234e-05
2950.00000  3000.00000  6.456292673282e-05
3000.00000  3050.00000  4.364534299384e-05
3050.00000  3100.00000  4.304195115521e-05
3100.00000  3150.00000  3.982386134921e-05
3150.00000  3200.00000  4.847247770283e-05
3200.00000  3250.00000  4.344421238096e-05
3250.00000  3300.00000  3.982386134921e-05
3300.00000  3350.00000  4.404760421959e-05
3350.00000  3400.00000  4.384647360671e-05
3400.00000  3450.00000  4.626004096121e-05
3450.00000  3500.00000  5.169056750883e-05
3500.00000  3550.00000  4.605891034833e-05
3550.00000  3600.00000  4.847247770283e-05
3600.00000  3650.00000  5.088604505733e-05
3650.00000  3700.00000  8.487711863317e-05
3700.00000  3750.00000  4.485212667109e-05
3750.00000  3800.00000  5.269622057320e-05
3800.00000  3850.00000  5.209282873458e-05
3850.00000  3900.00000  5.430526547620e-05
3900.00000  3950.00000  5.108717567020e-05
3950.00000  4000.00000  5.551204915345e-05
4000.00000  4050.00000  5.551204915345e-05
4050.00000  4100.00000  5.108717567020e-05
4100.00000  4150.00000  5.148943689595e-05
4150.00000  4200.00000  5.390300425045e-05
4200.00000  4250.00000  5.450639608908e-05
4250.00000  4300.00000  5.068491444446e-05
4300.00000  4350.00000  4.847247770283e-05
4350.00000  4400.00000  4.967926138008e-05
4400.00000  4450.00000  5.410413486333e-05
4450.00000  4500.00000  5.410413486333e-05
4500.00000  4550.00000  5.732222466932e-05
4550.00000  4600.00000  5.410413486333e-05
4600.00000  4650.00000  5.671883283070e-05
4650.00000  4700.00000  5.571317976633e-05
4700.00000  4750.00000  5.450639608908e-05
4750.00000  4800.00000  5.832787773370e-05
4800.00000  4850.00000  6.134483692682e-05
4850.00000  4900.00000  6.114370631395e-05
4900.00000  4950.00000  5.973579202382e-05
4950.00000  5000.00000  5.651770221783e-05
5000.00000  5050.00000  6.436179611994e-05
5050.00000  5100.00000  5.712109405645e-05
5100.00000  5150.00000  5.289735118608e-05
5150.00000  5200.00000  5.631657160495e-05
5200.00000  5250.00000  5.973579202382e-05
5250.00000  5300.00000  5.732222466932e-05
5300.00000  5350.00000  6.335614305557e-05
5350.00000  5400.00000  6.315501244269e-05
5400.00000  5450.00000  7.461945737656e-05
5450.00000  5500.00000  6.757988592594e-05
5500.00000  5550.00000  6.114370631395e-05
5550.00000  5600.00000  7.160249818344e-05
5600.00000  5650.00000  6.416066550707e-05
5650.00000  5700.00000  6.094257570107e-05
5700.00000  5750.00000  6.134483692682e-05
5750.00000  5800.00000  6.094257570107e-05
5800.00000  5850.00000  6.737875531307e-05
5850.00000  5900.00000  7.642963289243e-05
5900.00000  5950.00000  6.395953489419e-05
5950.00000  6000.00000  6.255162060407e-05
6000.00000  6050.00000  6.315501244269e-05
6050.00000  6100.00000  6.838440837744e-05
6100.00000  6150.00000  7.421719615081e-05
6150.00000  6200.00000  7.039571450619e-05
6200.00000  6250.00000  9.473251866404e-05
6250.00000  6300.00000  1.285224616270e-04
6300.00000  6350.00000  1.283213310141e-04
6350.00000  6400.00000  1.084697395234e-03
6400.00000  6450.00000  6.094257570107e-05
6450.00000  6500.00000  5.712109405645e-05
6500.00000  6550.00000  6.214935937832e-05
6550.00000  6600.00000  7.059684511906e-05
6600.00000  6650.00000  7.321154308644e-05
6650.00000  6700.00000  7.120023695769e-05
6700.00000  6750.00000  7.160249818344e-05
6750.00000  6800.00000  6.576971041007e-05
6800.00000  6850.00000  6.778101653882e-05
6850.00000  6900.00000  7.099910634481e-05
6900.00000  6950.00000  7.562511044093e-05
6950.00000  7000.00000  7.441832676368e-05
7000.00000  7050.00000  7.099910634481e-05
7050.00000  7100.00000  1.759892862655e-04
7100.00000  7150.00000  4.103064502646e-05
7150.00000  7200.00000  4.203629809084e-05
7200.00000  7250.00000  3.640464093034e-05
7250.00000  7300.00000  4.304195115521e-05
7300.00000  7350.00000  4.062838380071e-05
7350.00000  7400.00000  4.223742870371e-05
7400.00000  7450.00000  4.404760421959e-05
7450.00000  7500.00000  7.984885331130e-05
7500.00000  7550.00000  3.801368583334e-05
7550.00000  7600.00000  4.344421238096e-05
7600.00000  7650.00000  4.183516747796e-05
7650.00000  7700.00000  4.243855931659e-05
7700.00000  7750.00000  4.143290625221e-05
7750.00000  7800.00000  4.203629809084e-05
7800.00000  7850.00000  3.781255522047e-05
7850.00000  7900.00000  4.686343279983e-05
7900.00000  7950.00000  4.585777973546e-05
7950.00000  8000.00000  3.881820828484e-05
8000.00000  8050.00000  4.223742870371e-05
8050.00000  8100.00000  3.881820828484e-05
8100.00000  8150.00000  4.364534299384e-05
8150.00000  8200.00000  4.545551850971e-05
8200.00000  8250.00000  4.304195115521e-05
8250.00000  8300.00000  4.786908586421e-05
8300.00000  8350.00000  3.841594705909e-05
8350.00000  8400.00000  4.706456341271e-05
8400.00000  8450.00000  3.881820828484e-05
8450.00000  8500.00000  4.223742870371e-05
8500.00000  8550.00000  3.821481644622e-05
8550.00000  8600.00000  4.082951441359e-05
8600.00000  8650.00000  3.922046951059e-05
8650.00000  8700.00000  4.022612257496e-05
8700.00000  8750.00000  3.459446541447e-05
8750.00000  8800.00000  4.223742870371e-05
8800.00000  8850.00000  4.263968992946e-05
8850.00000  8900.00000  4.203629809084e-05
8900.00000  8950.00000  4.243855931659e-05
8950.00000  9000.00000  4.344421238096e-05
9000.00000  9050.00000  3.901933889772e-05
9050.00000  9100.00000  4.545551850971e-05
9100.00000  9150.00000  4.263968992946e-05
9150.00000  9200.00000  4.666230218696e-05
9200.00000  9250.00000  4.022612257496e-05
9250.00000  9300.00000  4.082951441359e-05
9300.00000  9350.00000  4.042725318784e-05
9350.00000  9400.00000  3.881820828484e-05
9400.00000  9450.00000  4.123177563934e-05
9450.00000  9500.00000  3.942160012347e-05
9500.00000  9550.00000  4.284082054234e-05
9550.00000  9600.00000  4.444986544534e-05
9600.00000  9650.00000  3.378994296297e-05
9650.00000  9700.00000  3.821481644622e-05
9700.00000  9750.00000  3.982386134921e-05
9750.00000  9800.00000  4.424873483246e-05
9800.00000  9850.00000  3.801368583334e-05
9850.00000  9900.00000  4.766795525133e-05
9900.00000  9950.00000  4.143290625221e-05
9950.00000  10000.00000  4.243855931659e-05
