300.00000  350.00000  1.194821098307e-05
350.00000  400.00000  1.522433334940e-05
400.00000  450.00000  2.023487343907e-05
450.00000  500.00000  1.888588187647e-05
500.00000  550.00000  1.368262870642e-05
550.00000  600.00000  1.098464558121e-05
600.00000  650.00000  1.175549790270e-05
650.00000  700.00000  1.348991562605e-05
700.00000  750.00000  9.250227857860e-06
750.00000  800.00000  7.901236295256e-06
800.00000  850.00000  1.175549790270e-05
850.00000  900.00000  8.286662456000e-06
900.00000  950.00000  7.515810134512e-06
950.00000  1000.00000  9.442940938233e-06
1000.00000  1050.00000  8.093949375628e-06
1050.00000  1100.00000  5.395966250419e-06
1100.00000  1150.00000  8.286662456000e-06
1150.00000  1200.00000  5.781392411163e-06
1200.00000  1250.00000  6.552244732651e-06
1250.00000  1300.00000  5.974105491535e-06
1300.00000  1350.00000  5.588679330791e-06
1350.00000  1400.00000  6.359531652279e-06
1400.00000  1450.00000  4.817827009302e-06
1450.00000  1500.00000  5.974105491535e-06
1500.00000  1550.00000  5.010540089674e-06
1550.00000  1600.00000  4.239687768186e-06
1600.00000  1650.00000  6.744957813023e-06
1650.00000  1700.00000  7.515810134512e-06
1700.00000  1750.00000  8.864801697116e-06
1750.00000  1800.00000  4.239687768186e-06
1800.00000  1850.00000  7.515810134512e-06
1850.00000  1900.00000  6.359531652279e-06
1900.00000  1950.00000  4.239687768186e-06
1950.00000  2000.00000  6.166818571907e-06
2000.00000  2050.00000  6.552244732651e-06
2050.00000  2100.00000  6.552244732651e-06
2100.00000  2150.00000  8.093949375628e-06
2150.00000  2200.00000  5.974105491535e-06
2200.00000  2250.00000  6.744957813023e-06
2250.00000  2300.00000  8.093949375628e-06
2300.00000  2350.00000  1.464619410828e-05
2350.00000  2400.00000  9.442940938233e-06
2400.00000  2450.00000  6.166818571907e-06
2450.00000  2500.00000  8.864801697116e-06
2500.00000  2550.00000  8.093949375628e-06
2550.00000  2600.00000  8.093949375628e-06
2600.00000  2650.00000  1.156278482233e-05
2650.00000  2700.00000  9.250227857860e-06
2700.00000  2750.00000  9.057514777488e-06
2750.00000  2800.00000  9.635654018605e-06
2800.00000  2850.00000  9.828367098977e-06
2850.00000  2900.00000  8.864801697116e-06
2900.00000  2950.00000  1.040650634009e-05
2950.00000  3000.00000  1.618789875126e-05
3000.00000  3050.00000  9.442940938233e-06
3050.00000  3100.00000  1.059921942047e-05
3100.00000  3150.00000  1.310448946530e-05
3150.00000  3200.00000  1.194821098307e-05
3200.00000  3250.00000  1.079193250084e-05
3250.00000  3300.00000  1.560975951014e-05
3300.00000  3350.00000  1.676603799237e-05
3350.00000  3400.00000  1.252635022419e-05
3400.00000  3450.00000  1.329720254567e-05
3450.00000  3500.00000  1.156278482233e-05
3500.00000  3550.00000  1.715146415312e-05
3550.00000  3600.00000  1.657332491200e-05
3600.00000  3650.00000  1.599518567088e-05
3650.00000  3700.00000  2.274014348391e-05
3700.00000  3750.00000  1.869316879609e-05
3750.00000  3800.00000  1.830774263535e-05
3800.00000  3850.00000  1.830774263535e-05
3850.00000  3900.00000  2.312556964465e-05
3900.00000  3950.00000  2.100572576056e-05
3950.00000  4000.00000  2.274014348391e-05
4000.00000  4050.00000  2.100572576056e-05
4050.00000  4100.00000  2.177657808205e-05
4100.00000  4150.00000  2.794339665395e-05
4150.00000  4200.00000  2.370370888577e-05
4200.00000  4250.00000  2.697983125209e-05
4250.00000  4300.00000  2.832882281470e-05
4300.00000  4350.00000  3.411021522586e-05
4350.00000  4400.00000  3.199037134177e-05
4400.00000  4450.00000  3.468835446698e-05
4450.00000  4500.00000  3.121951902028e-05
4500.00000  4550.00000  3.603734602958e-05
4550.00000  4600.00000  3.777176375293e-05
4600.00000  4650.00000  4.162602536037e-05
4650.00000  4700.00000  3.950618147628e-05
4700.00000  4750.00000  4.625113928930e-05
4750.00000  4800.00000  4.201145152112e-05
4800.00000  4850.00000  4.490214772670e-05
4850.00000  4900.00000  4.567300004819e-05
4900.00000  4950.00000  4.682927853042e-05
4950.00000  5000.00000  5.145439245935e-05
5000.00000  5050.00000  5.685035870977e-05
5050.00000  5100.00000  5.685035870977e-05
5100.00000  5150.00000  5.685035870977e-05
5150.00000  5200.00000  5.993376799572e-05
5200.00000  5250.00000  5.530865406679e-05
5250.00000  5300.00000  5.473051482567e-05
5300.00000  5350.00000  6.243903804056e-05
5350.00000  5400.00000  6.378802960316e-05
5400.00000  5450.00000  6.783500429098e-05
5450.00000  5500.00000  6.783500429098e-05
5500.00000  5550.00000  7.072570049656e-05
5550.00000  5600.00000  6.109004647795e-05
5600.00000  5650.00000  6.918399585358e-05
5650.00000  5700.00000  6.937670893395e-05
5700.00000  5750.00000  7.053298741619e-05
5750.00000  5800.00000  7.959050219367e-05
5800.00000  5850.00000  7.689251906846e-05
5850.00000  5900.00000  8.171034607777e-05
5900.00000  5950.00000  7.708523214884e-05
5950.00000  6000.00000  7.592895366660e-05
6000.00000  6050.00000  8.228848531888e-05
6050.00000  6100.00000  8.363747688149e-05
6100.00000  6150.00000  8.440832920298e-05
6150.00000  6200.00000  8.884073005153e-05
6200.00000  6250.00000  1.057994811243e-04
6250.00000  6300.00000  1.391388440287e-04
6300.00000  6350.00000  1.233363714381e-04
6350.00000  6400.00000  6.816261652761e-04
6400.00000  6450.00000  8.884073005153e-05
6450.00000  6500.00000  8.980429545339e-05
6500.00000  6550.00000  8.826259081042e-05
6550.00000  6600.00000  9.693467942716e-05
6600.00000  6650.00000  8.845530389079e-05
6650.00000  6700.00000  8.941886929265e-05
6700.00000  6750.00000  8.228848531888e-05
6750.00000  6800.00000  9.789824482902e-05
6800.00000  6850.00000  9.211685241786e-05
6850.00000  6900.00000  1.050286288028e-04
6900.00000  6950.00000  1.031014979991e-04
6950.00000  7000.00000  9.963266255237e-05
7000.00000  7050.00000  1.071484726869e-04
7050.00000  7100.00000  1.655405360396e-04
7100.00000  7150.00000  3.757905067256e-05
7150.00000  7200.00000  4.201145152112e-05
7200.00000  7250.00000  3.912075531553e-05
7250.00000  7300.00000  4.567300004819e-05
7300.00000  7350.00000  4.413129540521e-05
7350.00000  7400.00000  4.374586924446e-05
7400.00000  7450.00000  3.912075531553e-05
7450.00000  7500.00000  7.053298741619e-05
7500.00000  7550.00000  4.567300004819e-05
7550.00000  7600.00000  3.892804223516e-05
7600.00000  7650.00000  4.625113928930e-05
7650.00000  7700.00000  4.104788611926e-05
7700.00000  7750.00000  4.027703379777e-05
7750.00000  7800.00000  4.258959076223e-05
7800.00000  7850.00000  4.817827009302e-05
7850.00000  7900.00000  4.528757388744e-05
7900.00000  7950.00000  4.605842620893e-05
7950.00000  8000.00000  4.451672156595e-05
8000.00000  8050.00000  4.104788611926e-05
8050.00000  8100.00000  4.528757388744e-05
8100.00000  8150.00000  4.644385236967e-05
8150.00000  8200.00000  4.914183549488e-05
8200.00000  8250.00000  4.297501692298e-05
8250.00000  8300.00000  5.106896629860e-05
8300.00000  8350.00000  5.010540089674e-05
8350.00000  8400.00000  4.933454857526e-05
8400.00000  8450.00000  4.509486080707e-05
8450.00000  8500.00000  4.875640933414e-05
8500.00000  8550.00000  4.548028696781e-05
8550.00000  8600.00000  5.029811397712e-05
8600.00000  8650.00000  4.644385236967e-05
8650.00000  8700.00000  4.548028696781e-05
8700.00000  8750.00000  4.625113928930e-05
8750.00000  8800.00000  4.856369625377e-05
8800.00000  8850.00000  5.550136714716e-05
8850.00000  8900.00000  5.511594098642e-05
8900.00000  8950.00000  5.318881018270e-05
8950.00000  9000.00000  5.029811397712e-05
9000.00000  9050.00000  5.068354013786e-05
9050.00000  9100.00000  4.894912241451e-05
9100.00000  9150.00000  4.894912241451e-05
9150.00000  9200.00000  5.376694942381e-05
9200.00000  9250.00000  4.991268781637e-05
9250.00000  9300.00000  5.087625321823e-05
9300.00000  9350.00000  5.106896629860e-05
9350.00000  9400.00000  4.316773000335e-05
9400.00000  9450.00000  5.280338402195e-05
9450.00000  9500.00000  5.569408022753e-05
9500.00000  9550.00000  4.856369625377e-05
9550.00000  9600.00000  5.106896629860e-05
9600.00000  9650.00000  4.991268781637e-05
9650.00000  9700.00000  5.627221946865e-05
9700.00000  9750.00000  4.798555701265e-05
9750.00000  9800.00000  5.338152326307e-05
9800.00000  9850.00000  5.126167937898e-05
9850.00000  9900.00000  5.762121103126e-05
9900.00000  9950.00000  5.704307179014e-05
9950.00000  10000.00000  5.627221946865e-05
