300.00000  350.00000  7.554832621559e-06
350.00000  400.00000  1.295114163696e-05
400.00000  450.00000  1.151212589952e-05
450.00000  500.00000  1.331089557132e-05
500.00000  550.00000  9.677380834283e-05
550.00000  600.00000  1.331089557132e-05
600.00000  650.00000  2.770105294572e-05
650.00000  700.00000  1.439015737440e-05
700.00000  750.00000  2.086572819288e-05
750.00000  800.00000  1.762794278364e-05
800.00000  850.00000  6.655447785659e-05
850.00000  900.00000  1.942671245544e-05
900.00000  950.00000  1.762794278364e-05
950.00000  1000.00000  2.158523606160e-05
1000.00000  1050.00000  2.626203720828e-05
1050.00000  1100.00000  2.338400573340e-05
1100.00000  1150.00000  2.374375966776e-05
1150.00000  1200.00000  2.914006868316e-05
1200.00000  1250.00000  2.374375966776e-05
1250.00000  1300.00000  6.187767670991e-05
1300.00000  1350.00000  2.770105294572e-05
1350.00000  1400.00000  2.554252933956e-05
1400.00000  1450.00000  2.770105294572e-05
1450.00000  1500.00000  2.590228327392e-05
1500.00000  1550.00000  2.734129901136e-05
1550.00000  1600.00000  2.554252933956e-05
1600.00000  1650.00000  3.021933048624e-05
1650.00000  1700.00000  3.597539343600e-05
1700.00000  1750.00000  8.562143637767e-05
1750.00000  1800.00000  3.309736196112e-05
1800.00000  1850.00000  3.597539343600e-05
1850.00000  1900.00000  4.065219458267e-05
1900.00000  1950.00000  4.209121032011e-05
1950.00000  2000.00000  3.849367097652e-05
2000.00000  2050.00000  4.640825753243e-05
2050.00000  2100.00000  4.353022605755e-05
2100.00000  2150.00000  4.065219458267e-05
2150.00000  2200.00000  4.712776540115e-05
2200.00000  2250.00000  4.928628900731e-05
2250.00000  2300.00000  5.000579687603e-05
2300.00000  2350.00000  1.111639657172e-04
2350.00000  2400.00000  5.540210589143e-05
2400.00000  2450.00000  4.856678113859e-05
2450.00000  2500.00000  5.828013736631e-05
2500.00000  2550.00000  4.496924179499e-05
2550.00000  2600.00000  4.604850359807e-05
2600.00000  2650.00000  5.036555081039e-05
2650.00000  2700.00000  4.604850359807e-05
2700.00000  2750.00000  5.036555081039e-05
2750.00000  2800.00000  4.856678113859e-05
2800.00000  2850.00000  5.648136769451e-05
2850.00000  2900.00000  5.540210589143e-05
2900.00000  2950.00000  5.108505867911e-05
2950.00000  3000.00000  6.943250933147e-05
3000.00000  3050.00000  4.892653507295e-05
3050.00000  3100.00000  4.928628900731e-05
3100.00000  3150.00000  4.856678113859e-05
3150.00000  3200.00000  5.792038343195e-05
3200.00000  3250.00000  5.072530474475e-05
3250.00000  3300.00000  4.568874966371e-05
3300.00000  3350.00000  5.252407441655e-05
3350.00000  3400.00000  5.288382835091e-05
3400.00000  3450.00000  5.504235195707e-05
3450.00000  3500.00000  5.684112162887e-05
3500.00000  3550.00000  5.612161376015e-05
3550.00000  3600.00000  4.712776540115e-05
3600.00000  3650.00000  5.576185982579e-05
3650.00000  3700.00000  7.554832621559e-05
3700.00000  3750.00000  5.432284408835e-05
3750.00000  3800.00000  5.288382835091e-05
3800.00000  3850.00000  5.576185982579e-05
3850.00000  3900.00000  5.216432048219e-05
3900.00000  3950.00000  5.828013736631e-05
3950.00000  4000.00000  5.504235195707e-05
4000.00000  4050.00000  5.899964523503e-05
4050.00000  4100.00000  5.360333621963e-05
4100.00000  4150.00000  5.324358228527e-05
4150.00000  4200.00000  5.324358228527e-05
4200.00000  4250.00000  5.792038343195e-05
4250.00000  4300.00000  5.216432048219e-05
4300.00000  4350.00000  6.151792277555e-05
4350.00000  4400.00000  6.151792277555e-05
4400.00000  4450.00000  5.324358228527e-05
4450.00000  4500.00000  6.007890703811e-05
4500.00000  4550.00000  5.684112162887e-05
4550.00000  4600.00000  5.684112162887e-05
4600.00000  4650.00000  5.396309015399e-05
4650.00000  4700.00000  5.468259802271e-05
4700.00000  4750.00000  5.000579687603e-05
4750.00000  4800.00000  6.295693851299e-05
4800.00000  4850.00000  6.007890703811e-05
4850.00000  4900.00000  6.583496998787e-05
4900.00000  4950.00000  6.259718457863e-05
4950.00000  5000.00000  5.396309015399e-05
5000.00000  5050.00000  5.036555081039e-05
5050.00000  5100.00000  5.720087556323e-05
5100.00000  5150.00000  5.971915310375e-05
5150.00000  5200.00000  6.655447785659e-05
5200.00000  5250.00000  5.144481261347e-05
5250.00000  5300.00000  6.115816884119e-05
5300.00000  5350.00000  5.360333621963e-05
5350.00000  5400.00000  5.504235195707e-05
5400.00000  5450.00000  5.180456654783e-05
5450.00000  5500.00000  5.324358228527e-05
5500.00000  5550.00000  5.288382835091e-05
5550.00000  5600.00000  4.964604294167e-05
5600.00000  5650.00000  5.899964523503e-05
5650.00000  5700.00000  5.756062949759e-05
5700.00000  5750.00000  5.000579687603e-05
5750.00000  5800.00000  4.676801146679e-05
5800.00000  5850.00000  6.187767670991e-05
5850.00000  5900.00000  5.828013736631e-05
5900.00000  5950.00000  4.712776540115e-05
5950.00000  6000.00000  4.640825753243e-05
6000.00000  6050.00000  4.712776540115e-05
6050.00000  6100.00000  5.576185982579e-05
6100.00000  6150.00000  5.468259802271e-05
6150.00000  6200.00000  5.288382835091e-05
6200.00000  6250.00000  5.360333621963e-05
6250.00000  6300.00000  6.547521605351e-05
6300.00000  6350.00000  5.540210589143e-05
6350.00000  6400.00000  5.486247498989e-04
6400.00000  6450.00000  4.784727326987e-05
6450.00000  6500.00000  5.935939916939e-05
6500.00000  6550.00000  4.353022605755e-05
6550.00000  6600.00000  4.820702720423e-05
6600.00000  6650.00000  5.504235195707e-05
6650.00000  6700.00000  4.676801146679e-05
6700.00000  6750.00000  5.108505867911e-05
6750.00000  6800.00000  4.496924179499e-05
6800.00000  6850.00000  4.748751933551e-05
6850.00000  6900.00000  4.317047212319e-05
6900.00000  6950.00000  5.360333621963e-05
6950.00000  7000.00000  5.144481261347e-05
7000.00000  7050.00000  4.820702720423e-05
7050.00000  7100.00000  9.281651506487e-05
7100.00000  7150.00000  3.669490130472e-05
7150.00000  7200.00000  3.093883835496e-05
7200.00000  7250.00000  3.669490130472e-05
7250.00000  7300.00000  3.417662376420e-05
7300.00000  7350.00000  3.237785409240e-05
7350.00000  7400.00000  3.021933048624e-05
7400.00000  7450.00000  3.381686982984e-05
7450.00000  7500.00000  5.396309015399e-05
7500.00000  7550.00000  3.309736196112e-05
7550.00000  7600.00000  2.878031474880e-05
7600.00000  7650.00000  2.914006868316e-05
7650.00000  7700.00000  3.201810015804e-05
7700.00000  7750.00000  3.021933048624e-05
7750.00000  7800.00000  2.626203720828e-05
7800.00000  7850.00000  3.165834622368e-05
7850.00000  7900.00000  3.237785409240e-05
7900.00000  7950.00000  3.165834622368e-05
7950.00000  8000.00000  2.985957655188e-05
8000.00000  8050.00000  2.734129901136e-05
8050.00000  8100.00000  2.698154507700e-05
8100.00000  8150.00000  3.273760802676e-05
8150.00000  8200.00000  2.482302147084e-05
8200.00000  8250.00000  3.129859228932e-05
8250.00000  8300.00000  3.345711589548e-05
8300.00000  8350.00000  3.273760802676e-05
8350.00000  8400.00000  2.770105294572e-05
8400.00000  8450.00000  3.093883835496e-05
8450.00000  8500.00000  2.985957655188e-05
8500.00000  8550.00000  2.698154507700e-05
8550.00000  8600.00000  2.949982261752e-05
8600.00000  8650.00000  2.374375966776e-05
8650.00000  8700.00000  2.554252933956e-05
8700.00000  8750.00000  3.093883835496e-05
8750.00000  8800.00000  2.985957655188e-05
8800.00000  8850.00000  3.093883835496e-05
8850.00000  8900.00000  2.590228327392e-05
8900.00000  8950.00000  2.914006868316e-05
8950.00000  9000.00000  2.878031474880e-05
9000.00000  9050.00000  3.237785409240e-05
9050.00000  9100.00000  2.698154507700e-05
9100.00000  9150.00000  2.842056081444e-05
9150.00000  9200.00000  2.518277540520e-05
9200.00000  9250.00000  2.698154507700e-05
9250.00000  9300.00000  2.086572819288e-05
9300.00000  9350.00000  2.554252933956e-05
9350.00000  9400.00000  3.201810015804e-05
9400.00000  9450.00000  2.158523606160e-05
9450.00000  9500.00000  2.878031474880e-05
9500.00000  9550.00000  2.626203720828e-05
9550.00000  9600.00000  2.590228327392e-05
9600.00000  9650.00000  3.129859228932e-05
9650.00000  9700.00000  2.914006868316e-05
9700.00000  9750.00000  2.086572819288e-05
9750.00000  9800.00000  2.194498999596e-05
9800.00000  9850.00000  2.590228327392e-05
9850.00000  9900.00000  2.122548212724e-05
9900.00000  9950.00000  2.949982261752e-05
9950.00000  10000.00000  2.086572819288e-05
