10001.00000  11001.00000  9.306984375329e-04
11001.00000  12001.00000  8.001325506590e-04
12001.00000  13001.00000  6.957379565397e-04
13001.00000  14001.00000  6.081483931123e-04
14001.00000  15001.00000  5.379256423827e-04
15001.00000  16001.00000  4.818636725587e-04
16001.00000  17001.00000  4.322718816986e-04
17001.00000  18001.00000  3.924434746641e-04
18001.00000  19001.00000  3.531768496354e-04
19001.00000  20001.00000  3.245259673376e-04
20001.00000  21001.00000  2.958169696600e-04
21001.00000  22001.00000  2.749051187876e-04
22001.00000  23001.00000  2.554655242063e-04
23001.00000  24001.00000  2.377597051257e-04
24001.00000  25001.00000  2.140873737073e-04
25001.00000  26001.00000  2.023286951714e-04
26001.00000  27001.00000  1.913836319542e-04
27001.00000  28001.00000  1.766998126292e-04
28001.00000  29001.00000  1.662777878312e-04
29001.00000  30001.00000  1.556329874103e-04
30001.00000  31001.00000  1.491434366532e-04
31001.00000  32001.00000  1.389732451682e-04
32001.00000  33001.00000  1.302365663878e-04
33001.00000  34001.00000  1.234951823177e-04
34001.00000  35001.00000  1.151653111967e-04
35001.00000  36001.00000  1.105935679768e-04
36001.00000  37001.00000  1.035034916272e-04
37001.00000  38001.00000  1.003943188018e-04
38001.00000  39001.00000  9.613252427477e-05
39001.00000  40001.00000  9.185135795442e-05
40001.00000  41001.00000  8.572018537347e-05
41001.00000  42001.00000  8.295001893089e-05
42001.00000  43001.00000  7.769057704866e-05
43001.00000  44001.00000  7.524973109226e-05
44001.00000  45001.00000  7.229553261329e-05
45001.00000  46001.00000  6.910887261466e-05
46001.00000  47001.00000  6.696828945448e-05
47001.00000  48001.00000  6.359759741946e-05
48001.00000  49001.00000  6.250309109774e-05
49001.00000  50001.00000  5.926800161585e-05
50001.00000  51001.00000  5.677872617619e-05
51001.00000  52001.00000  5.401824563027e-05
52001.00000  53001.00000  5.176143171026e-05
53001.00000  54001.00000  5.013420107267e-05
54001.00000  55001.00000  4.819702174219e-05
55001.00000  56001.00000  4.784832946271e-05
56001.00000  57001.00000  4.490381688039e-05
57001.00000  58001.00000  4.335407341601e-05
58001.00000  59001.00000  4.276323372021e-05
59001.00000  60001.00000  4.182370174493e-05
60001.00000  61001.00000  4.050641980021e-05
61001.00000  62001.00000  3.803651615386e-05
62001.00000  63001.00000  3.737787518149e-05
63001.00000  64001.00000  3.677734958905e-05
64001.00000  65001.00000  3.469488180879e-05
65001.00000  66001.00000  3.405561262973e-05
66001.00000  67001.00000  3.087863852775e-05
67001.00000  68001.00000  3.171162563986e-05
68001.00000  69001.00000  3.129513208381e-05
69001.00000  70001.00000  2.998753603574e-05
70001.00000  71001.00000  2.809878618852e-05
71001.00000  72001.00000  2.820533105170e-05
72001.00000  73001.00000  2.628752351453e-05
73001.00000  74001.00000  2.645218375762e-05
74001.00000  75001.00000  2.552233767899e-05
75001.00000  76001.00000  2.507678643299e-05
76001.00000  77001.00000  2.376919038492e-05
77001.00000  78001.00000  2.346892758869e-05
78001.00000  79001.00000  2.376919038492e-05
79001.00000  80001.00000  2.251002382011e-05
80001.00000  81001.00000  2.189012643436e-05
81001.00000  82001.00000  2.081499190594e-05
82001.00000  83001.00000  2.056315859298e-05
83001.00000  84001.00000  2.054378679968e-05
84001.00000  85001.00000  1.997231889719e-05
85001.00000  86001.00000  1.926524844156e-05
86001.00000  87001.00000  1.902310102525e-05
87001.00000  88001.00000  1.835477415624e-05
88001.00000  89001.00000  1.742492807761e-05
89001.00000  90001.00000  1.630136406594e-05
90001.00000  91001.00000  1.723121014457e-05
91001.00000  92001.00000  1.571052437014e-05
92001.00000  93001.00000  1.584612692328e-05
93001.00000  94001.00000  1.587518461323e-05
94001.00000  95001.00000  1.534246029735e-05
95001.00000  96001.00000  1.442230011538e-05
96001.00000  97001.00000  1.439324242542e-05
97001.00000  98001.00000  1.410266552585e-05
98001.00000  99001.00000  1.416078090576e-05
99001.00000  100001.00000  1.393800528276e-05
100001.00000  101001.00000  1.329873610370e-05
101001.00000  102001.00000  1.223328747194e-05
102001.00000  103001.00000  1.266915282130e-05
103001.00000  104001.00000  1.242700540499e-05
104001.00000  105001.00000  1.171024905272e-05
105001.00000  106001.00000  1.122595422010e-05
106001.00000  107001.00000  1.197176826233e-05
107001.00000  108001.00000  1.142935804980e-05
108001.00000  109001.00000  1.063511452430e-05
109001.00000  110001.00000  1.088694783726e-05
110001.00000  111001.00000  1.076103118078e-05
111001.00000  112001.00000  1.033485172808e-05
112001.00000  113001.00000  1.045108248791e-05
113001.00000  114001.00000  9.840870998808e-06
114001.00000  115001.00000  9.104742853228e-06
115001.00000  116001.00000  8.940082610137e-06
116001.00000  117001.00000  9.104742853228e-06
117001.00000  118001.00000  9.375947959494e-06
118001.00000  119001.00000  8.707621090480e-06
119001.00000  120001.00000  8.911024920180e-06
120001.00000  121001.00000  8.852909540266e-06
121001.00000  122001.00000  8.465473674171e-06
122001.00000  123001.00000  7.923063461638e-06
123001.00000  124001.00000  7.903691668334e-06
124001.00000  125001.00000  7.409710939063e-06
125001.00000  126001.00000  7.545313492196e-06
126001.00000  127001.00000  7.777775011853e-06
127001.00000  128001.00000  7.429082732368e-06
128001.00000  129001.00000  7.293480179234e-06
129001.00000  130001.00000  6.809185346616e-06
130001.00000  131001.00000  6.818871243268e-06
131001.00000  132001.00000  7.196621212711e-06
132001.00000  133001.00000  6.731698173397e-06
133001.00000  134001.00000  6.363634100607e-06
134001.00000  135001.00000  6.392691790564e-06
135001.00000  136001.00000  6.518608447045e-06
136001.00000  137001.00000  6.034313614426e-06
137001.00000  138001.00000  6.053685407731e-06
138001.00000  139001.00000  6.121486684298e-06
139001.00000  140001.00000  5.627505955027e-06
140001.00000  141001.00000  5.685621334941e-06
141001.00000  142001.00000  5.520961091851e-06
142001.00000  143001.00000  4.901063706099e-06
143001.00000  144001.00000  5.181954709018e-06
144001.00000  145001.00000  5.414416228675e-06
145001.00000  146001.00000  4.930121396056e-06
146001.00000  147001.00000  4.891377809447e-06
147001.00000  148001.00000  4.717031669704e-06
148001.00000  149001.00000  4.881691912794e-06
149001.00000  150001.00000  4.523313736657e-06
150001.00000  151001.00000  4.891377809447e-06
151001.00000  152001.00000  4.610486806528e-06
152001.00000  153001.00000  4.532999633309e-06
153001.00000  154001.00000  4.736403463009e-06
154001.00000  155001.00000  4.784832946271e-06
155001.00000  156001.00000  4.300538113652e-06
156001.00000  157001.00000  4.106820180605e-06
157001.00000  158001.00000  4.116506077257e-06
158001.00000  159001.00000  4.077762490648e-06
159001.00000  160001.00000  4.077762490648e-06
160001.00000  161001.00000  4.048704800691e-06
161001.00000  162001.00000  4.329595803609e-06
162001.00000  163001.00000  3.864672764296e-06
163001.00000  164001.00000  3.893730454253e-06
164001.00000  165001.00000  3.651583037943e-06
165001.00000  166001.00000  3.719384314510e-06
166001.00000  167001.00000  3.661268934596e-06
167001.00000  168001.00000  3.496608691505e-06
168001.00000  169001.00000  3.496608691505e-06
169001.00000  170001.00000  3.554724071420e-06
170001.00000  171001.00000  3.341634345068e-06
171001.00000  172001.00000  3.293204861806e-06
172001.00000  173001.00000  3.351320241720e-06
173001.00000  174001.00000  3.428807414939e-06
174001.00000  175001.00000  3.118858722063e-06
175001.00000  176001.00000  3.012313858887e-06
176001.00000  177001.00000  2.963884375625e-06
177001.00000  178001.00000  3.264147171849e-06
178001.00000  179001.00000  2.973570272278e-06
179001.00000  180001.00000  2.973570272278e-06
180001.00000  181001.00000  2.934826685668e-06
181001.00000  182001.00000  3.080115135454e-06
182001.00000  183001.00000  2.508647232964e-06
183001.00000  184001.00000  2.741108752621e-06
184001.00000  185001.00000  2.634563889445e-06
185001.00000  186001.00000  2.692679269359e-06
186001.00000  187001.00000  2.770166442578e-06
187001.00000  188001.00000  2.169640850131e-06
188001.00000  189001.00000  2.595820302835e-06
189001.00000  190001.00000  2.479589543007e-06
190001.00000  191001.00000  2.489275439659e-06
191001.00000  192001.00000  2.295557506612e-06
192001.00000  193001.00000  2.363358783178e-06
193001.00000  194001.00000  2.440845956397e-06
194001.00000  195001.00000  2.189012643436e-06
195001.00000  196001.00000  2.324615196569e-06
196001.00000  197001.00000  2.256813920002e-06
197001.00000  198001.00000  2.179326746783e-06
198001.00000  199001.00000  1.946865227126e-06
