300.00000  350.00000  3.862615922020e-07
350.00000  400.00000  9.656539805050e-07
400.00000  450.00000  1.931307961010e-07
450.00000  500.00000  1.931307961010e-06
500.00000  550.00000  1.487107129978e-05
550.00000  600.00000  9.656539805050e-07
600.00000  650.00000  4.828269902525e-06
650.00000  700.00000  5.793923883030e-07
700.00000  750.00000  5.021400698626e-06
750.00000  800.00000  2.124438757111e-06
800.00000  850.00000  1.989247199840e-05
850.00000  900.00000  1.738177164909e-06
900.00000  950.00000  1.158784776606e-06
950.00000  1000.00000  2.317569553212e-06
1000.00000  1050.00000  2.510700349313e-06
1050.00000  1100.00000  2.703831145414e-06
1100.00000  1150.00000  3.669485125919e-06
1150.00000  1200.00000  4.635139106424e-06
1200.00000  1250.00000  5.407662290828e-06
1250.00000  1300.00000  2.626578826973e-05
1300.00000  1350.00000  7.338970251838e-06
1350.00000  1400.00000  1.100845537776e-05
1400.00000  1450.00000  1.718864085299e-05
1450.00000  1500.00000  2.510700349313e-05
1500.00000  1550.00000  4.480634469543e-05
1550.00000  1600.00000  5.929115440300e-05
1600.00000  1650.00000  9.868983680761e-05
1650.00000  1700.00000  1.311358105526e-04
1700.00000  1750.00000  2.180446687980e-04
1750.00000  1800.00000  2.419928875145e-04
1800.00000  1850.00000  2.844816626568e-04
1850.00000  1900.00000  2.952969872384e-04
1900.00000  1950.00000  3.777638371735e-04
1950.00000  2000.00000  4.484497085465e-04
2000.00000  2050.00000  5.415387522672e-04
2050.00000  2100.00000  6.375247579294e-04
2100.00000  2150.00000  7.358283331448e-04
2150.00000  2200.00000  8.219646682058e-04
2200.00000  2250.00000  9.297316524302e-04
2250.00000  2300.00000  1.043485691334e-03
2300.00000  2350.00000  1.160716084567e-03
2350.00000  2400.00000  1.225608032057e-03
2400.00000  2450.00000  1.359447673755e-03
2450.00000  2500.00000  1.354619403852e-03
2500.00000  2550.00000  1.331829969912e-03
2550.00000  2600.00000  1.463352042057e-03
2600.00000  2650.00000  1.532106605469e-03
2650.00000  2700.00000  1.587921405542e-03
2700.00000  2750.00000  1.681782972447e-03
2750.00000  2800.00000  1.737790903317e-03
2800.00000  2850.00000  1.825086023154e-03
2850.00000  2900.00000  1.898089464081e-03
2900.00000  2950.00000  1.941157631611e-03
2950.00000  3000.00000  2.026135181895e-03
3000.00000  3050.00000  2.047958961855e-03
3050.00000  3100.00000  2.076349188882e-03
3100.00000  3150.00000  2.075190404105e-03
3150.00000  3200.00000  2.165189355088e-03
3200.00000  3250.00000  2.113816563325e-03
3250.00000  3300.00000  2.170403886583e-03
3300.00000  3350.00000  2.139309828411e-03
3350.00000  3400.00000  2.200532290775e-03
3400.00000  3450.00000  2.247656205023e-03
3450.00000  3500.00000  2.265037976672e-03
3500.00000  3550.00000  2.295166380864e-03
3550.00000  3600.00000  2.306561097834e-03
3600.00000  3650.00000  2.289951849369e-03
3650.00000  3700.00000  2.305016051465e-03
3700.00000  3750.00000  2.277784609215e-03
3750.00000  3800.00000  2.278170870807e-03
3800.00000  3850.00000  2.321432169134e-03
3850.00000  3900.00000  2.308878667387e-03
3900.00000  3950.00000  2.292655680515e-03
3950.00000  4000.00000  2.287441149020e-03
4000.00000  4050.00000  2.283192271506e-03
4050.00000  4100.00000  2.295938904049e-03
4100.00000  4150.00000  2.214244577298e-03
4150.00000  4200.00000  2.243793589101e-03
4200.00000  4250.00000  2.216175885259e-03
4250.00000  4300.00000  2.260209706770e-03
4300.00000  4350.00000  2.225639294268e-03
4350.00000  4400.00000  2.234909572481e-03
4400.00000  4450.00000  2.194738366892e-03
4450.00000  4500.00000  2.212892661725e-03
4500.00000  4550.00000  2.212120138541e-03
4550.00000  4600.00000  2.183343649922e-03
4600.00000  4650.00000  2.125018149499e-03
4650.00000  4700.00000  2.151670199361e-03
4700.00000  4750.00000  2.115168478898e-03
4750.00000  4800.00000  2.106670723870e-03
4800.00000  4850.00000  2.117292917655e-03
4850.00000  4900.00000  2.049504008224e-03
4900.00000  4950.00000  2.119803618004e-03
4950.00000  5000.00000  2.062830033155e-03
5000.00000  5050.00000  2.035019198516e-03
5050.00000  5100.00000  1.988281545860e-03
5100.00000  5150.00000  1.996006777704e-03
5150.00000  5200.00000  1.953131740969e-03
5200.00000  5250.00000  1.960856972813e-03
5250.00000  5300.00000  1.963367673163e-03
5300.00000  5350.00000  1.953131740969e-03
5350.00000  5400.00000  1.910836096623e-03
5400.00000  5450.00000  1.934784315340e-03
5450.00000  5500.00000  1.906200957517e-03
5500.00000  5550.00000  1.891716147809e-03
5550.00000  5600.00000  1.864870967151e-03
5600.00000  5650.00000  1.842660925600e-03
5650.00000  5700.00000  1.826244807931e-03
5700.00000  5750.00000  1.804034766379e-03
5750.00000  5800.00000  1.806352335933e-03
5800.00000  5850.00000  1.795923272943e-03
5850.00000  5900.00000  1.733155764210e-03
5900.00000  5950.00000  1.739722211278e-03
5950.00000  6000.00000  1.716353384950e-03
6000.00000  6050.00000  1.739142818889e-03
6050.00000  6100.00000  1.703606752407e-03
6100.00000  6150.00000  1.693950212602e-03
6150.00000  6200.00000  1.659572930896e-03
6200.00000  6250.00000  1.667105031944e-03
6250.00000  6300.00000  1.732383241026e-03
6300.00000  6350.00000  1.735859595356e-03
6350.00000  6400.00000  2.997776217080e-03
6400.00000  6450.00000  1.596226029775e-03
6450.00000  6500.00000  1.568801456728e-03
6500.00000  6550.00000  1.552578469856e-03
6550.00000  6600.00000  1.543308191643e-03
6600.00000  6650.00000  1.531913474673e-03
6650.00000  6700.00000  1.531720343877e-03
6700.00000  6750.00000  1.488459045550e-03
6750.00000  6800.00000  1.491356007492e-03
6800.00000  6850.00000  1.490197222715e-03
6850.00000  6900.00000  1.452150455883e-03
6900.00000  6950.00000  1.460068818523e-03
6950.00000  7000.00000  1.433223637865e-03
7000.00000  7050.00000  1.411399857906e-03
7050.00000  7100.00000  1.549681507914e-03
7100.00000  7150.00000  1.274663254267e-03
7150.00000  7200.00000  1.225994293649e-03
7200.00000  7250.00000  1.239899710968e-03
7250.00000  7300.00000  1.218462192601e-03
7300.00000  7350.00000  1.181187948954e-03
7350.00000  7400.00000  1.190071965574e-03
7400.00000  7450.00000  1.203011728913e-03
7450.00000  7500.00000  1.195479627865e-03
7500.00000  7550.00000  1.148355713616e-03
7550.00000  7600.00000  1.156660337849e-03
7600.00000  7650.00000  1.125952541269e-03
7650.00000  7700.00000  1.141982397345e-03
7700.00000  7750.00000  1.111274600765e-03
7750.00000  7800.00000  1.147390059636e-03
7800.00000  7850.00000  1.121703663755e-03
7850.00000  7900.00000  1.111660862357e-03
7900.00000  7950.00000  1.093313436728e-03
7950.00000  8000.00000  1.086746989660e-03
8000.00000  8050.00000  1.090030213194e-03
8050.00000  8100.00000  1.087133251252e-03
8100.00000  8150.00000  1.090223343990e-03
8150.00000  8200.00000  1.044451345314e-03
8200.00000  8250.00000  1.056618585469e-03
8250.00000  8300.00000  1.039623075412e-03
8300.00000  8350.00000  1.001962570172e-03
8350.00000  8400.00000  9.992587390265e-04
8400.00000  8450.00000  9.967480386772e-04
8450.00000  8500.00000  1.007949624851e-03
8500.00000  8550.00000  1.017992426248e-03
8550.00000  8600.00000  9.969411694733e-04
8600.00000  8650.00000  1.000417523803e-03
8650.00000  8700.00000  1.001769439376e-03
8700.00000  8750.00000  9.737654739412e-04
8750.00000  8800.00000  9.571562254765e-04
8800.00000  8850.00000  9.679715500582e-04
8850.00000  8900.00000  9.600531874180e-04
8900.00000  8950.00000  9.488516012442e-04
8950.00000  9000.00000  9.233583361588e-04
9000.00000  9050.00000  9.283797368575e-04
9050.00000  9100.00000  9.295385216341e-04
9100.00000  9150.00000  9.399675846235e-04
9150.00000  9200.00000  9.129292731694e-04
9200.00000  9250.00000  9.285728676536e-04
9250.00000  9300.00000  8.936161935593e-04
9300.00000  9350.00000  8.999895098306e-04
9350.00000  9400.00000  9.262552981004e-04
9400.00000  9450.00000  8.816420842010e-04
9450.00000  9500.00000  8.885947928607e-04
9500.00000  9550.00000  8.773932066868e-04
9550.00000  9600.00000  8.694748440467e-04
9600.00000  9650.00000  8.590457810572e-04
9650.00000  9700.00000  8.642603125519e-04
9700.00000  9750.00000  8.882085312685e-04
9750.00000  9800.00000  8.333593851758e-04
9800.00000  9850.00000  8.370288703017e-04
9850.00000  9900.00000  8.269860689044e-04
9900.00000  9950.00000  8.360632163212e-04
9950.00000  10000.00000  7.982095802854e-04
