300.00000  350.00000  2.181009479954e-02
350.00000  400.00000  1.728985190562e-02
400.00000  450.00000  1.421179644236e-02
450.00000  500.00000  1.188724340072e-02
500.00000  550.00000  1.006290330821e-02
550.00000  600.00000  8.797034672591e-03
600.00000  650.00000  7.603892717195e-03
650.00000  700.00000  6.697606394405e-03
700.00000  750.00000  6.049432268273e-03
750.00000  800.00000  5.446205931244e-03
800.00000  850.00000  4.869215213606e-03
850.00000  900.00000  4.417229506008e-03
900.00000  950.00000  4.111275885756e-03
950.00000  1000.00000  3.723143045941e-03
1000.00000  1050.00000  3.453456311318e-03
1050.00000  1100.00000  3.212898830578e-03
1100.00000  1150.00000  2.985073341601e-03
1150.00000  1200.00000  2.793128920320e-03
1200.00000  1250.00000  2.562988523750e-03
1250.00000  1300.00000  2.422550796421e-03
1300.00000  1350.00000  2.270924349058e-03
1350.00000  1400.00000  2.183729496376e-03
1400.00000  1450.00000  2.031910140046e-03
1450.00000  1500.00000  1.917322214177e-03
1500.00000  1550.00000  1.820096095257e-03
1550.00000  1600.00000  1.708015985946e-03
1600.00000  1650.00000  1.638761667112e-03
1650.00000  1700.00000  1.551952632362e-03
1700.00000  1750.00000  1.509126841886e-03
1750.00000  1800.00000  1.398975822236e-03
1800.00000  1850.00000  1.355764213828e-03
1850.00000  1900.00000  1.334544227555e-03
1900.00000  1950.00000  1.276671537722e-03
1950.00000  2000.00000  1.197578861617e-03
2000.00000  2050.00000  1.158997068394e-03
2050.00000  2100.00000  1.143564351106e-03
2100.00000  2150.00000  1.103632195121e-03
2150.00000  2200.00000  1.033220422490e-03
2200.00000  2250.00000  1.031870059727e-03
2250.00000  2300.00000  9.840286361319e-04
2300.00000  2350.00000  9.371517573669e-04
2350.00000  2400.00000  8.943259668903e-04
2400.00000  2450.00000  8.841017916864e-04
2450.00000  2500.00000  8.368390949892e-04
2500.00000  2550.00000  8.433979998370e-04
2550.00000  2600.00000  7.816671306815e-04
2600.00000  2650.00000  7.722145913421e-04
2650.00000  2700.00000  7.407704298660e-04
2700.00000  2750.00000  7.332469801877e-04
2750.00000  2800.00000  6.904211897110e-04
2800.00000  2850.00000  6.699728393033e-04
2850.00000  2900.00000  6.672721137777e-04
2900.00000  2950.00000  6.578195744383e-04
2950.00000  3000.00000  6.367924971322e-04
3000.00000  3050.00000  6.148008749955e-04
3050.00000  3100.00000  5.895298004350e-04
3100.00000  3150.00000  5.810418059261e-04
3150.00000  3200.00000  5.615580003489e-04
3200.00000  3250.00000  5.495976444500e-04
3250.00000  3300.00000  5.362869257884e-04
3300.00000  3350.00000  5.218187533301e-04
3350.00000  3400.00000  5.223974802284e-04
3400.00000  3450.00000  5.125591229567e-04
3450.00000  3500.00000  4.934611353118e-04
3500.00000  3550.00000  4.801504166501e-04
3550.00000  3600.00000  4.724340580057e-04
3600.00000  3650.00000  4.622098828018e-04
3650.00000  3700.00000  4.662609710901e-04
3700.00000  3750.00000  4.371317172074e-04
3750.00000  3800.00000  4.504424358690e-04
3800.00000  3850.00000  4.209273640541e-04
3850.00000  3900.00000  4.193840923252e-04
3900.00000  3950.00000  4.051088288330e-04
3950.00000  4000.00000  4.153330040368e-04
4000.00000  4050.00000  4.114748247146e-04
4050.00000  4100.00000  3.757866659841e-04
4100.00000  4150.00000  3.804164811708e-04
4150.00000  4200.00000  3.869753860185e-04
4200.00000  4250.00000  3.784873915096e-04
4250.00000  4300.00000  3.667199445769e-04
4300.00000  4350.00000  3.590035859324e-04
4350.00000  4400.00000  3.559170424747e-04
4400.00000  4450.00000  3.372048727619e-04
4450.00000  4500.00000  3.451141403725e-04
4500.00000  4550.00000  3.402914162197e-04
4550.00000  4600.00000  3.314176037786e-04
4600.00000  4650.00000  3.408701431180e-04
4650.00000  4700.00000  3.078827099130e-04
4700.00000  4750.00000  3.219650644391e-04
4750.00000  4800.00000  3.101976175064e-04
4800.00000  4850.00000  3.076898009469e-04
4850.00000  4900.00000  2.922570836581e-04
4900.00000  4950.00000  3.074968919808e-04
4950.00000  5000.00000  2.912925388275e-04
5000.00000  5050.00000  2.978514436753e-04
5050.00000  5100.00000  2.893634491664e-04
5100.00000  5150.00000  2.829974532847e-04
5150.00000  5200.00000  2.783676380981e-04
5200.00000  5250.00000  2.756669125725e-04
5250.00000  5300.00000  2.666001911653e-04
5300.00000  5350.00000  2.567618338937e-04
5350.00000  5400.00000  2.519391097409e-04
5400.00000  5450.00000  2.613916490803e-04
5450.00000  5500.00000  2.523249276731e-04
5500.00000  5550.00000  2.635136477075e-04
5550.00000  5600.00000  2.538681994020e-04
5600.00000  5650.00000  2.457660228253e-04
5650.00000  5700.00000  2.247389455192e-04
5700.00000  5750.00000  2.490454752492e-04
5750.00000  5800.00000  2.345773027909e-04
5800.00000  5850.00000  2.322623951976e-04
5850.00000  5900.00000  2.421007524692e-04
5900.00000  5950.00000  2.152864061798e-04
5950.00000  6000.00000  2.228098558581e-04
6000.00000  6050.00000  2.052551399420e-04
6050.00000  6100.00000  2.091133192643e-04
6100.00000  6150.00000  2.174084048070e-04
6150.00000  6200.00000  2.156722241120e-04
6200.00000  6250.00000  2.257034903498e-04
6250.00000  6300.00000  2.322623951976e-04
6300.00000  6350.00000  2.307191234687e-04
6350.00000  6400.00000  5.258698416184e-04
6400.00000  6450.00000  2.013969606198e-04
6450.00000  6500.00000  2.096920461626e-04
6500.00000  6550.00000  1.969600543993e-04
6550.00000  6600.00000  1.971529633654e-04
6600.00000  6650.00000  1.986962350943e-04
6650.00000  6700.00000  1.965742364670e-04
6700.00000  6750.00000  1.902082405854e-04
6750.00000  6800.00000  1.811415191782e-04
6800.00000  6850.00000  1.784407936526e-04
6850.00000  6900.00000  1.990820530265e-04
6900.00000  6950.00000  1.799840653815e-04
6950.00000  7000.00000  1.857713343648e-04
7000.00000  7050.00000  1.807557012459e-04
7050.00000  7100.00000  2.066055027048e-04
7100.00000  7150.00000  1.554846266854e-04
7150.00000  7200.00000  1.630080763637e-04
7200.00000  7250.00000  1.699527991437e-04
7250.00000  7300.00000  1.612718956687e-04
7300.00000  7350.00000  1.587640791093e-04
7350.00000  7400.00000  1.599215329060e-04
7400.00000  7450.00000  1.630080763637e-04
7450.00000  7500.00000  1.639726211943e-04
7500.00000  7550.00000  1.616577136010e-04
7550.00000  7600.00000  1.448746335493e-04
7600.00000  7650.00000  1.522051742615e-04
7650.00000  7700.00000  1.489257218376e-04
7700.00000  7750.00000  1.493115397699e-04
7750.00000  7800.00000  1.516264473632e-04
7800.00000  7850.00000  1.412093631932e-04
7850.00000  7900.00000  1.487328128715e-04
7900.00000  7950.00000  1.468037232104e-04
7950.00000  8000.00000  1.444888156171e-04
8000.00000  8050.00000  1.421739080238e-04
8050.00000  8100.00000  1.423668169899e-04
8100.00000  8150.00000  1.342646404132e-04
8150.00000  8200.00000  1.406306362949e-04
8200.00000  8250.00000  1.288631893621e-04
8250.00000  8300.00000  1.288631893621e-04
8300.00000  8350.00000  1.319497328199e-04
8350.00000  8400.00000  1.213397396838e-04
8400.00000  8450.00000  1.269340997010e-04
8450.00000  8500.00000  1.365795480065e-04
8500.00000  8550.00000  1.282844624638e-04
8550.00000  8600.00000  1.342646404132e-04
8600.00000  8650.00000  1.230759203788e-04
8650.00000  8700.00000  1.267411907349e-04
8700.00000  8750.00000  1.284773714299e-04
8750.00000  8800.00000  1.309851879893e-04
8800.00000  8850.00000  1.182531962260e-04
8850.00000  8900.00000  1.230759203788e-04
8900.00000  8950.00000  1.186390141582e-04
8950.00000  9000.00000  1.188319231243e-04
9000.00000  9050.00000  1.176744693277e-04
9050.00000  9100.00000  1.128517451749e-04
9100.00000  9150.00000  1.078361120560e-04
9150.00000  9200.00000  1.180602872599e-04
9200.00000  9250.00000  1.151666527682e-04
9250.00000  9300.00000  1.099581106832e-04
9300.00000  9350.00000  1.105368375816e-04
9350.00000  9400.00000  1.167099244971e-04
9400.00000  9450.00000  1.088006568866e-04
9450.00000  9500.00000  1.051353865305e-04
9500.00000  9550.00000  1.116942913782e-04
9550.00000  9600.00000  1.099581106832e-04
9600.00000  9650.00000  1.088006568866e-04
9650.00000  9700.00000  1.041708416999e-04
9700.00000  9750.00000  1.111155644799e-04
9750.00000  9800.00000  1.026275699710e-04
9800.00000  9850.00000  1.039779327338e-04
9850.00000  9900.00000  1.084148389543e-04
9900.00000  9950.00000  1.062928403271e-04
9950.00000  10000.00000  1.033992058355e-04
