300.00000  350.00000  7.746547936525e-02
350.00000  400.00000  6.155357613104e-02
400.00000  450.00000  5.024018416064e-02
450.00000  500.00000  4.192419422070e-02
500.00000  550.00000  3.561874519165e-02
550.00000  600.00000  3.087497119016e-02
600.00000  650.00000  2.708687309447e-02
650.00000  700.00000  2.377621056183e-02
700.00000  750.00000  2.118763662412e-02
750.00000  800.00000  1.904591662048e-02
800.00000  850.00000  1.733877766031e-02
850.00000  900.00000  1.566845737189e-02
900.00000  950.00000  1.439610065014e-02
950.00000  1000.00000  1.312273795375e-02
1000.00000  1050.00000  1.213185293563e-02
1050.00000  1100.00000  1.116189218996e-02
1100.00000  1150.00000  1.036013040372e-02
1150.00000  1200.00000  9.738639272559e-03
1200.00000  1250.00000  9.132036566031e-03
1250.00000  1300.00000  8.468093305155e-03
1300.00000  1350.00000  7.915612034135e-03
1350.00000  1400.00000  7.478013066740e-03
1400.00000  1450.00000  7.064557490649e-03
1450.00000  1500.00000  6.697779137747e-03
1500.00000  1550.00000  6.331000784845e-03
1550.00000  1600.00000  6.008485316001e-03
1600.00000  1650.00000  5.676312490635e-03
1650.00000  1700.00000  5.429848704401e-03
1700.00000  1750.00000  5.164874984833e-03
1750.00000  1800.00000  4.894670197149e-03
1800.00000  1850.00000  4.719429415264e-03
1850.00000  1900.00000  4.508174741348e-03
1900.00000  1950.00000  4.301145160912e-03
1950.00000  2000.00000  4.204370400766e-03
2000.00000  2050.00000  3.965753216705e-03
2050.00000  2100.00000  3.802382935544e-03
2100.00000  2150.00000  3.714863142065e-03
2150.00000  2200.00000  3.540024750035e-03
2200.00000  2250.00000  3.447877473222e-03
2250.00000  2300.00000  3.282294047858e-03
2300.00000  2350.00000  3.208857899307e-03
2350.00000  2400.00000  3.050919881189e-03
2400.00000  2450.00000  2.946097323942e-03
2450.00000  2500.00000  2.871655200753e-03
2500.00000  2550.00000  2.761400380462e-03
2550.00000  2600.00000  2.638470279736e-03
2600.00000  2650.00000  2.652352729736e-03
2650.00000  2700.00000  2.518356907996e-03
2700.00000  2750.00000  2.462424718140e-03
2750.00000  2800.00000  2.365046373212e-03
2800.00000  2850.00000  2.321990658718e-03
2850.00000  2900.00000  2.234672060167e-03
2900.00000  2950.00000  2.159022767412e-03
2950.00000  3000.00000  2.113552713789e-03
3000.00000  3050.00000  2.058022913788e-03
3050.00000  3100.00000  1.984787960164e-03
3100.00000  3150.00000  1.909138667410e-03
3150.00000  3200.00000  1.917387659439e-03
3200.00000  3250.00000  1.841335976830e-03
3250.00000  3300.00000  1.797676677554e-03
3300.00000  3350.00000  1.762869955090e-03
3350.00000  3400.00000  1.706736570307e-03
3400.00000  3450.00000  1.685208713060e-03
3450.00000  3500.00000  1.627264573929e-03
3500.00000  3550.00000  1.562681002189e-03
3550.00000  3600.00000  1.572539553639e-03
3600.00000  3650.00000  1.527069500015e-03
3650.00000  3700.00000  1.501517744218e-03
3700.00000  3750.00000  1.461278758710e-03
3750.00000  3800.00000  1.425264866681e-03
3800.00000  3850.00000  1.370539846390e-03
3850.00000  3900.00000  1.339354632622e-03
3900.00000  3950.00000  1.339354632622e-03
3950.00000  4000.00000  1.303541935520e-03
4000.00000  4050.00000  1.269741187694e-03
4050.00000  4100.00000  1.212199438418e-03
4100.00000  4150.00000  1.196305039142e-03
4150.00000  4200.00000  1.173570012330e-03
4200.00000  4250.00000  1.183227368852e-03
4250.00000  4300.00000  1.137153730446e-03
4300.00000  4350.00000  1.138159705084e-03
4350.00000  4400.00000  1.105566126822e-03
4400.00000  4450.00000  1.079611981170e-03
4450.00000  4500.00000  1.031124003633e-03
4500.00000  4550.00000  1.049231547112e-03
4550.00000  4600.00000  1.001347154358e-03
4600.00000  4650.00000  1.019052307981e-03
4650.00000  4700.00000  9.655344572558e-04
4700.00000  4750.00000  9.484328884151e-04
4750.00000  4800.00000  9.556759058065e-04
4800.00000  4850.00000  9.299229550816e-04
4850.00000  4900.00000  9.021580550813e-04
4900.00000  4950.00000  8.910923340667e-04
4950.00000  5000.00000  8.800266130521e-04
5000.00000  5050.00000  8.422019666749e-04
5050.00000  5100.00000  8.649369934867e-04
5100.00000  5150.00000  8.297278811675e-04
5150.00000  5200.00000  8.019629811673e-04
5200.00000  5250.00000  8.236920333414e-04
5250.00000  5300.00000  7.800327340656e-04
5300.00000  5350.00000  7.689670130510e-04
5350.00000  5400.00000  7.820446833410e-04
5400.00000  5450.00000  7.375806043550e-04
5450.00000  5500.00000  7.377817992826e-04
5500.00000  5550.00000  7.562917326161e-04
5550.00000  5600.00000  7.218874000071e-04
5600.00000  5650.00000  7.214850101520e-04
5650.00000  5700.00000  7.112240688475e-04
5700.00000  5750.00000  6.715886681225e-04
5750.00000  5800.00000  6.705826934848e-04
5800.00000  5850.00000  6.740030072530e-04
5850.00000  5900.00000  6.750089818907e-04
5900.00000  5950.00000  6.667599898616e-04
5950.00000  6000.00000  6.526763449339e-04
6000.00000  6050.00000  6.287341485569e-04
6050.00000  6100.00000  6.210887413104e-04
6100.00000  6150.00000  6.222959108757e-04
6150.00000  6200.00000  5.868856036289e-04
6200.00000  6250.00000  5.975489347885e-04
6250.00000  6300.00000  5.957381804406e-04
6300.00000  6350.00000  5.742103231940e-04
6350.00000  6400.00000  6.705826934848e-04
6400.00000  6450.00000  5.816545355129e-04
6450.00000  6500.00000  5.613338478316e-04
6500.00000  6550.00000  5.554991949330e-04
6550.00000  6600.00000  5.351785072516e-04
6600.00000  6650.00000  5.295450492805e-04
6650.00000  6700.00000  5.490609572518e-04
6700.00000  6750.00000  5.275331000052e-04
6750.00000  6800.00000  5.140530398601e-04
6800.00000  6850.00000  5.052004630484e-04
6850.00000  6900.00000  5.017801492803e-04
6900.00000  6950.00000  5.104315311644e-04
6950.00000  7000.00000  4.854833601497e-04
7000.00000  7050.00000  4.760271985554e-04
7050.00000  7100.00000  4.820630463815e-04
7100.00000  7150.00000  4.645590876857e-04
7150.00000  7200.00000  4.701925456568e-04
7200.00000  7250.00000  4.470551289899e-04
7250.00000  7300.00000  4.605351891349e-04
7300.00000  7350.00000  4.442384000043e-04
7350.00000  7400.00000  4.416228659464e-04
7400.00000  7450.00000  4.277404159462e-04
7450.00000  7500.00000  4.261308565259e-04
7500.00000  7550.00000  4.180830594244e-04
7550.00000  7600.00000  4.054077789895e-04
7600.00000  7650.00000  4.198938137722e-04
7650.00000  7700.00000  4.082245079750e-04
7700.00000  7750.00000  4.100352623229e-04
7750.00000  7800.00000  3.965552021778e-04
7800.00000  7850.00000  3.921289137720e-04
7850.00000  7900.00000  3.883062101487e-04
7900.00000  7950.00000  3.985671514532e-04
7950.00000  8000.00000  3.794536333370e-04
8000.00000  8050.00000  3.919277188444e-04
8050.00000  8100.00000  3.782464637718e-04
8100.00000  8150.00000  3.685891072500e-04
8150.00000  8200.00000  3.701986666703e-04
8200.00000  8250.00000  3.549078521774e-04
8250.00000  8300.00000  3.708022514529e-04
8300.00000  8350.00000  3.677843275398e-04
8350.00000  8400.00000  3.496767840614e-04
8400.00000  8450.00000  3.273441471047e-04
8450.00000  8500.00000  3.468600550759e-04
8500.00000  8550.00000  3.448481058005e-04
8550.00000  8600.00000  3.496767840614e-04
8600.00000  8650.00000  3.315692405830e-04
8650.00000  8700.00000  3.291549014525e-04
8700.00000  8750.00000  3.357943340613e-04
8750.00000  8800.00000  3.198999347857e-04
8800.00000  8850.00000  3.134616971045e-04
8850.00000  8900.00000  3.293560963800e-04
8900.00000  8950.00000  3.253321978293e-04
8950.00000  9000.00000  3.050115101479e-04
9000.00000  9050.00000  2.959577384087e-04
9050.00000  9100.00000  3.084318239161e-04
9100.00000  9150.00000  3.108461630465e-04
9150.00000  9200.00000  3.070234594233e-04
9200.00000  9250.00000  3.074258492784e-04
9250.00000  9300.00000  2.933422043507e-04
9300.00000  9350.00000  2.871051615970e-04
9350.00000  9400.00000  2.844896275390e-04
9400.00000  9450.00000  2.792585594230e-04
9450.00000  9500.00000  2.838860427564e-04
9500.00000  9550.00000  2.740274913070e-04
9550.00000  9600.00000  2.794597543506e-04
9600.00000  9650.00000  2.716131521766e-04
9650.00000  9700.00000  2.730215166693e-04
9700.00000  9750.00000  2.627605753649e-04
9750.00000  9800.00000  2.702047876838e-04
9800.00000  9850.00000  2.677904485533e-04
9850.00000  9900.00000  2.553163630460e-04
9900.00000  9950.00000  2.645713297127e-04
9950.00000  10000.00000  2.653761094229e-04
