300.00000  350.00000  2.362091203075e-05
350.00000  400.00000  3.349522771573e-05
400.00000  450.00000  2.362091203075e-05
450.00000  500.00000  1.858694717174e-05
500.00000  550.00000  1.068749462375e-04
550.00000  600.00000  1.122961391626e-05
600.00000  650.00000  3.407606981485e-05
650.00000  700.00000  1.239129811449e-05
700.00000  750.00000  2.226561379948e-05
750.00000  800.00000  1.452105247792e-05
800.00000  850.00000  6.466708703500e-05
850.00000  900.00000  1.606996474223e-05
900.00000  950.00000  1.335936827969e-05
950.00000  1000.00000  1.490828054400e-05
1000.00000  1050.00000  1.529550861008e-05
1050.00000  1100.00000  1.548912264311e-05
1100.00000  1150.00000  1.723164894046e-05
1150.00000  1200.00000  1.742526297350e-05
1200.00000  1250.00000  1.819971910566e-05
1250.00000  1300.00000  6.156926250638e-05
1300.00000  1350.00000  1.878056120478e-05
1350.00000  1400.00000  1.994224540301e-05
1400.00000  1450.00000  1.761887700654e-05
1450.00000  1500.00000  2.265284186555e-05
1500.00000  1550.00000  2.149115766732e-05
1550.00000  1600.00000  1.974863136997e-05
1600.00000  1650.00000  1.878056120478e-05
1650.00000  1700.00000  2.420175412987e-05
1700.00000  1750.00000  8.073705177723e-05
1750.00000  1800.00000  2.342729799771e-05
1800.00000  1850.00000  2.768680672457e-05
1850.00000  1900.00000  2.265284186555e-05
1900.00000  1950.00000  2.458898219594e-05
1950.00000  2000.00000  2.478259622898e-05
2000.00000  2050.00000  2.729957865849e-05
2050.00000  2100.00000  3.059101722015e-05
2100.00000  2150.00000  2.729957865849e-05
2150.00000  2200.00000  2.962294705496e-05
2200.00000  2250.00000  2.749319269153e-05
2250.00000  2300.00000  2.962294705496e-05
2300.00000  2350.00000  9.119220956134e-05
2350.00000  2400.00000  3.059101722015e-05
2400.00000  2450.00000  3.117185931927e-05
2450.00000  2500.00000  3.562498207916e-05
2500.00000  2550.00000  3.213992948446e-05
2550.00000  2600.00000  2.923571898888e-05
2600.00000  2650.00000  3.659305224436e-05
2650.00000  2700.00000  2.942933302192e-05
2700.00000  2750.00000  3.194631545142e-05
2750.00000  2800.00000  2.962294705496e-05
2800.00000  2850.00000  2.691235059241e-05
2850.00000  2900.00000  2.826764882368e-05
2900.00000  2950.00000  2.768680672457e-05
2950.00000  3000.00000  4.975880649100e-05
3000.00000  3050.00000  3.659305224436e-05
3050.00000  3100.00000  2.749319269153e-05
3100.00000  3150.00000  2.884849092280e-05
3150.00000  3200.00000  3.775473644259e-05
3200.00000  3250.00000  3.078463125319e-05
3250.00000  3300.00000  3.388245578181e-05
3300.00000  3350.00000  3.175270141838e-05
3350.00000  3400.00000  2.788042075761e-05
3400.00000  3450.00000  3.117185931927e-05
3450.00000  3500.00000  2.981656108800e-05
3500.00000  3550.00000  3.465691191397e-05
3550.00000  3600.00000  2.865487688976e-05
3600.00000  3650.00000  3.175270141838e-05
3650.00000  3700.00000  5.227578892051e-05
3700.00000  3750.00000  3.117185931927e-05
3750.00000  3800.00000  3.001017512103e-05
3800.00000  3850.00000  3.001017512103e-05
3850.00000  3900.00000  3.213992948446e-05
3900.00000  3950.00000  2.497621026202e-05
3950.00000  4000.00000  2.981656108800e-05
4000.00000  4050.00000  2.981656108800e-05
4050.00000  4100.00000  2.652512252633e-05
4100.00000  4150.00000  2.575066639418e-05
4150.00000  4200.00000  3.175270141838e-05
4200.00000  4250.00000  2.671873655937e-05
4250.00000  4300.00000  2.633150849329e-05
4300.00000  4350.00000  3.213992948446e-05
4350.00000  4400.00000  2.729957865849e-05
4400.00000  4450.00000  2.575066639418e-05
4450.00000  4500.00000  2.749319269153e-05
4500.00000  4550.00000  2.865487688976e-05
4550.00000  4600.00000  2.555705236114e-05
4600.00000  4650.00000  3.059101722015e-05
4650.00000  4700.00000  2.807403479064e-05
4700.00000  4750.00000  2.904210495584e-05
4750.00000  4800.00000  2.788042075761e-05
4800.00000  4850.00000  2.942933302192e-05
4850.00000  4900.00000  2.788042075761e-05
4900.00000  4950.00000  2.865487688976e-05
4950.00000  5000.00000  2.942933302192e-05
5000.00000  5050.00000  2.710596462545e-05
5050.00000  5100.00000  2.536343832810e-05
5100.00000  5150.00000  2.826764882368e-05
5150.00000  5200.00000  2.497621026202e-05
5200.00000  5250.00000  2.633150849329e-05
5250.00000  5300.00000  2.362091203075e-05
5300.00000  5350.00000  2.652512252633e-05
5350.00000  5400.00000  2.536343832810e-05
5400.00000  5450.00000  3.117185931927e-05
5450.00000  5500.00000  2.439536816291e-05
5500.00000  5550.00000  2.981656108800e-05
5550.00000  5600.00000  2.342729799771e-05
5600.00000  5650.00000  2.710596462545e-05
5650.00000  5700.00000  2.575066639418e-05
5700.00000  5750.00000  2.633150849329e-05
5750.00000  5800.00000  2.652512252633e-05
5800.00000  5850.00000  2.381452606379e-05
5850.00000  5900.00000  3.523775401309e-05
5900.00000  5950.00000  2.768680672457e-05
5950.00000  6000.00000  2.671873655937e-05
6000.00000  6050.00000  2.420175412987e-05
6050.00000  6100.00000  2.207199976644e-05
6100.00000  6150.00000  3.213992948446e-05
6150.00000  6200.00000  2.749319269153e-05
6200.00000  6250.00000  3.349522771573e-05
6250.00000  6300.00000  4.898435035885e-05
6300.00000  6350.00000  4.414399953288e-05
6350.00000  6400.00000  3.907131186726e-04
6400.00000  6450.00000  2.071670153517e-05
6450.00000  6500.00000  2.846126285672e-05
6500.00000  6550.00000  2.439536816291e-05
6550.00000  6600.00000  2.245922783252e-05
6600.00000  6650.00000  2.265284186555e-05
6650.00000  6700.00000  2.420175412987e-05
6700.00000  6750.00000  2.671873655937e-05
6750.00000  6800.00000  2.865487688976e-05
6800.00000  6850.00000  2.594428042722e-05
6850.00000  6900.00000  2.633150849329e-05
6900.00000  6950.00000  2.846126285672e-05
6950.00000  7000.00000  2.555705236114e-05
7000.00000  7050.00000  2.497621026202e-05
7050.00000  7100.00000  7.124996415833e-05
7100.00000  7150.00000  1.974863136997e-05
7150.00000  7200.00000  1.819971910566e-05
7200.00000  7250.00000  1.897417523782e-05
7250.00000  7300.00000  1.761887700654e-05
7300.00000  7350.00000  1.529550861008e-05
7350.00000  7400.00000  1.742526297350e-05
7400.00000  7450.00000  1.645719280831e-05
7450.00000  7500.00000  3.233354351750e-05
7500.00000  7550.00000  1.819971910566e-05
7550.00000  7600.00000  1.723164894046e-05
7600.00000  7650.00000  1.587635070919e-05
7650.00000  7700.00000  1.626357877527e-05
7700.00000  7750.00000  1.645719280831e-05
7750.00000  7800.00000  1.800610507262e-05
7800.00000  7850.00000  1.974863136997e-05
7850.00000  7900.00000  1.897417523782e-05
7900.00000  7950.00000  1.587635070919e-05
7950.00000  8000.00000  1.723164894046e-05
8000.00000  8050.00000  1.703803490743e-05
8050.00000  8100.00000  1.684442087439e-05
8100.00000  8150.00000  1.606996474223e-05
8150.00000  8200.00000  1.878056120478e-05
8200.00000  8250.00000  1.413382441184e-05
8250.00000  8300.00000  1.936140330389e-05
8300.00000  8350.00000  1.684442087439e-05
8350.00000  8400.00000  1.684442087439e-05
8400.00000  8450.00000  1.684442087439e-05
8450.00000  8500.00000  1.684442087439e-05
8500.00000  8550.00000  1.606996474223e-05
8550.00000  8600.00000  1.626357877527e-05
8600.00000  8650.00000  1.665080684135e-05
8650.00000  8700.00000  1.568273667615e-05
8700.00000  8750.00000  1.684442087439e-05
8750.00000  8800.00000  1.471466651096e-05
8800.00000  8850.00000  1.665080684135e-05
8850.00000  8900.00000  1.394021037880e-05
8900.00000  8950.00000  1.394021037880e-05
8950.00000  9000.00000  1.626357877527e-05
9000.00000  9050.00000  1.413382441184e-05
9050.00000  9100.00000  1.665080684135e-05
9100.00000  9150.00000  1.471466651096e-05
9150.00000  9200.00000  1.529550861008e-05
9200.00000  9250.00000  1.665080684135e-05
9250.00000  9300.00000  1.471466651096e-05
9300.00000  9350.00000  1.548912264311e-05
9350.00000  9400.00000  1.452105247792e-05
9400.00000  9450.00000  1.510189457704e-05
9450.00000  9500.00000  1.355298231273e-05
9500.00000  9550.00000  1.819971910566e-05
9550.00000  9600.00000  1.471466651096e-05
9600.00000  9650.00000  1.781249103958e-05
9650.00000  9700.00000  1.665080684135e-05
9700.00000  9750.00000  1.587635070919e-05
9750.00000  9800.00000  1.645719280831e-05
9800.00000  9850.00000  1.626357877527e-05
9850.00000  9900.00000  1.761887700654e-05
9900.00000  9950.00000  1.684442087439e-05
9950.00000  10000.00000  1.723164894046e-05
