300.00000  350.00000  5.193781325740e-05
350.00000  400.00000  9.793987642823e-05
400.00000  450.00000  5.935750086559e-05
450.00000  500.00000  7.642278236445e-05
500.00000  550.00000  4.258900687106e-04
550.00000  600.00000  6.084143838723e-05
600.00000  650.00000  1.276186268610e-04
650.00000  700.00000  6.826112599543e-05
700.00000  750.00000  6.826112599543e-05
750.00000  800.00000  6.084143838723e-05
800.00000  850.00000  1.966217216173e-04
850.00000  900.00000  5.935750086559e-05
900.00000  950.00000  4.229221936674e-05
950.00000  1000.00000  4.748600069248e-05
1000.00000  1050.00000  5.267978201822e-05
1050.00000  1100.00000  5.935750086559e-05
1100.00000  1150.00000  5.490568830067e-05
1150.00000  1200.00000  5.861553210477e-05
1200.00000  1250.00000  6.677718847379e-05
1250.00000  1300.00000  1.736206900319e-04
1300.00000  1350.00000  6.751915723461e-05
1350.00000  1400.00000  1.083274390797e-04
1400.00000  1450.00000  1.417160333166e-04
1450.00000  1500.00000  1.995895966606e-04
1500.00000  1550.00000  2.648828476127e-04
1550.00000  1600.00000  3.338859423690e-04
1600.00000  1650.00000  4.429553502095e-04
1650.00000  1700.00000  5.661221645056e-04
1700.00000  1750.00000  8.458443873347e-04
1750.00000  1800.00000  8.050361054896e-04
1800.00000  1850.00000  9.081697632436e-04
1850.00000  1900.00000  8.688454189201e-04
1900.00000  1950.00000  1.065467140537e-03
1950.00000  2000.00000  1.282863987458e-03
2000.00000  2050.00000  1.426063958296e-03
2050.00000  2100.00000  1.454258771207e-03
2100.00000  2150.00000  1.650138524064e-03
2150.00000  2200.00000  1.663493961758e-03
2200.00000  2250.00000  1.814855588966e-03
2250.00000  2300.00000  1.929118778132e-03
2300.00000  2350.00000  2.052285592428e-03
2350.00000  2400.00000  2.031510467125e-03
2400.00000  2450.00000  2.058963311275e-03
2450.00000  2500.00000  2.030026529603e-03
2500.00000  2550.00000  1.892762308852e-03
2550.00000  2600.00000  1.946184059631e-03
2600.00000  2650.00000  1.922441059284e-03
2650.00000  2700.00000  1.967701153694e-03
2700.00000  2750.00000  1.973636903781e-03
2750.00000  2800.00000  1.874955058592e-03
2800.00000  2850.00000  1.955087684761e-03
2850.00000  2900.00000  1.829694964182e-03
2900.00000  2950.00000  1.861599620897e-03
2950.00000  3000.00000  1.922441059284e-03
3000.00000  3050.00000  1.778499119685e-03
3050.00000  3100.00000  1.783692901011e-03
3100.00000  3150.00000  1.722109493863e-03
3150.00000  3200.00000  1.647170649020e-03
3200.00000  3250.00000  1.609330242218e-03
3250.00000  3300.00000  1.574457710460e-03
3300.00000  3350.00000  1.489131302966e-03
3350.00000  3400.00000  1.494325084291e-03
3400.00000  3450.00000  1.419386239449e-03
3450.00000  3500.00000  1.412708520601e-03
3500.00000  3550.00000  1.408998676797e-03
3550.00000  3600.00000  1.373384176278e-03
3600.00000  3650.00000  1.279896112414e-03
3650.00000  3700.00000  1.259862955872e-03
3700.00000  3750.00000  1.172310642095e-03
3750.00000  3800.00000  1.160439141922e-03
3800.00000  3850.00000  1.124082672642e-03
3850.00000  3900.00000  1.061757296733e-03
3900.00000  3950.00000  1.078822578232e-03
3950.00000  4000.00000  9.883023894121e-04
4000.00000  4050.00000  1.009819483476e-03
4050.00000  4100.00000  9.868184518905e-04
4100.00000  4150.00000  9.052018882003e-04
4150.00000  4200.00000  8.406506060090e-04
4200.00000  4250.00000  8.198754807060e-04
4250.00000  4300.00000  7.812931051434e-04
4300.00000  4350.00000  7.998423241639e-04
4350.00000  4400.00000  7.479045109065e-04
4400.00000  4450.00000  6.996765414532e-04
4450.00000  4500.00000  6.996765414532e-04
4500.00000  4550.00000  6.603521971297e-04
4550.00000  4600.00000  6.321573842186e-04
4600.00000  4650.00000  6.588682596081e-04
4650.00000  4700.00000  6.024786337858e-04
4700.00000  4750.00000  5.958009149384e-04
4750.00000  4800.00000  6.084143838723e-04
4800.00000  4850.00000  5.505408205284e-04
4850.00000  4900.00000  5.438631016810e-04
4900.00000  4950.00000  5.037967885967e-04
4950.00000  5000.00000  4.971190697494e-04
5000.00000  5050.00000  4.919252884236e-04
5050.00000  5100.00000  4.563107879043e-04
5100.00000  5150.00000  4.607626004692e-04
5150.00000  5200.00000  4.622465379908e-04
5200.00000  5250.00000  4.422133814487e-04
5250.00000  5300.00000  4.377615688838e-04
5300.00000  5350.00000  4.206962873849e-04
5350.00000  5400.00000  4.192123498633e-04
5400.00000  5450.00000  3.732102866924e-04
5450.00000  5500.00000  3.398216924555e-04
5500.00000  5550.00000  3.450154737813e-04
5550.00000  5600.00000  3.591128802368e-04
5600.00000  5650.00000  3.056911294578e-04
5650.00000  5700.00000  3.435315362596e-04
5700.00000  5750.00000  2.915937230022e-04
5750.00000  5800.00000  3.324020048473e-04
5800.00000  5850.00000  2.685926914168e-04
5850.00000  5900.00000  2.797222228291e-04
5900.00000  5950.00000  2.774963165467e-04
5950.00000  6000.00000  2.641408788519e-04
6000.00000  6050.00000  2.559792224829e-04
6050.00000  6100.00000  2.374300034624e-04
6100.00000  6150.00000  2.522693786788e-04
6150.00000  6200.00000  2.337201596583e-04
6200.00000  6250.00000  2.671087538952e-04
6250.00000  6300.00000  2.159129093986e-04
6300.00000  6350.00000  2.248165345284e-04
6350.00000  6400.00000  4.993449760318e-04
6400.00000  6450.00000  2.114610968337e-04
6450.00000  6500.00000  2.211066907243e-04
6500.00000  6550.00000  1.877180964874e-04
6550.00000  6600.00000  2.018155029430e-04
6600.00000  6650.00000  1.869761277266e-04
6650.00000  6700.00000  1.632331273804e-04
6700.00000  6750.00000  1.617491898587e-04
6750.00000  6800.00000  1.751046275535e-04
6800.00000  6850.00000  1.602652523371e-04
6850.00000  6900.00000  1.528455647289e-04
6900.00000  6950.00000  1.647170649020e-04
6950.00000  7000.00000  1.469098146423e-04
7000.00000  7050.00000  1.454258771207e-04
7050.00000  7100.00000  1.736206900319e-04
7100.00000  7150.00000  1.476517834032e-04
7150.00000  7200.00000  1.253927205786e-04
7200.00000  7250.00000  1.224248455353e-04
7250.00000  7300.00000  1.261346893394e-04
7300.00000  7350.00000  1.157471266879e-04
7350.00000  7400.00000  1.046175952756e-04
7400.00000  7450.00000  1.046175952756e-04
7450.00000  7500.00000  1.239087830569e-04
7500.00000  7550.00000  9.126215758085e-05
7550.00000  7600.00000  1.016497202323e-04
7600.00000  7650.00000  1.120372828838e-04
7650.00000  7700.00000  9.942381394987e-05
7700.00000  7750.00000  1.061015327973e-04
7750.00000  7800.00000  9.274609510249e-05
7800.00000  7850.00000  9.497200138495e-05
7850.00000  7900.00000  9.497200138495e-05
7900.00000  7950.00000  9.274609510249e-05
7950.00000  8000.00000  1.023916889932e-04
8000.00000  8050.00000  9.645593890659e-05
8050.00000  8100.00000  8.829428253757e-05
8100.00000  8150.00000  8.829428253757e-05
8150.00000  8200.00000  8.977822005921e-05
8200.00000  8250.00000  6.751915723461e-05
8250.00000  8300.00000  7.642278236445e-05
8300.00000  8350.00000  7.048703227789e-05
8350.00000  8400.00000  6.974506351707e-05
8400.00000  8450.00000  8.087459492937e-05
8450.00000  8500.00000  6.232537590887e-05
8500.00000  8550.00000  6.974506351707e-05
8550.00000  8600.00000  6.009946962641e-05
8600.00000  8650.00000  7.271293856035e-05
8650.00000  8700.00000  7.493884484281e-05
8700.00000  8750.00000  6.084143838723e-05
8750.00000  8800.00000  6.900309475625e-05
8800.00000  8850.00000  6.677718847379e-05
8850.00000  8900.00000  4.971190697494e-05
8900.00000  8950.00000  6.084143838723e-05
8950.00000  9000.00000  6.232537590887e-05
9000.00000  9050.00000  6.158340714805e-05
9050.00000  9100.00000  6.751915723461e-05
9100.00000  9150.00000  4.674403193166e-05
9150.00000  9200.00000  3.784040680182e-05
9200.00000  9250.00000  4.526009441002e-05
9250.00000  9300.00000  4.377615688838e-05
9300.00000  9350.00000  5.564765706149e-05
9350.00000  9400.00000  5.564765706149e-05
9400.00000  9450.00000  5.045387573576e-05
9450.00000  9500.00000  4.229221936674e-05
9500.00000  9550.00000  6.232537590887e-05
9550.00000  9600.00000  4.377615688838e-05
9600.00000  9650.00000  4.155025060592e-05
9650.00000  9700.00000  5.267978201822e-05
9700.00000  9750.00000  4.896993821412e-05
9750.00000  9800.00000  4.303418812756e-05
9800.00000  9850.00000  3.413056299772e-05
9850.00000  9900.00000  3.561450051936e-05
9900.00000  9950.00000  4.229221936674e-05
9950.00000  10000.00000  3.190465671526e-05
