10001.00000  11001.00000  2.103037918912e-04
11001.00000  12001.00000  1.687743115498e-04
12001.00000  13001.00000  1.363364201480e-04
13001.00000  14001.00000  1.133268432020e-04
14001.00000  15001.00000  9.675246501170e-05
15001.00000  16001.00000  8.055222628391e-05
16001.00000  17001.00000  7.026339106418e-05
17001.00000  18001.00000  5.847799799431e-05
18001.00000  19001.00000  5.226728291622e-05
19001.00000  20001.00000  4.646812124692e-05
20001.00000  21001.00000  4.085602930888e-05
21001.00000  22001.00000  3.363513768195e-05
22001.00000  23001.00000  3.150254274549e-05
23001.00000  24001.00000  2.652648789377e-05
24001.00000  25001.00000  2.637683210876e-05
25001.00000  26001.00000  2.244836775213e-05
26001.00000  27001.00000  2.128853541827e-05
27001.00000  28001.00000  1.866955918052e-05
28001.00000  29001.00000  1.683627581410e-05
29001.00000  30001.00000  1.548937374897e-05
30001.00000  31001.00000  1.489075060892e-05
31001.00000  32001.00000  1.425471352261e-05
32001.00000  33001.00000  1.257108594119e-05
33001.00000  34001.00000  1.126159782232e-05
34001.00000  35001.00000  9.877281810939e-06
35001.00000  36001.00000  9.989523649700e-06
36001.00000  37001.00000  8.605207638318e-06
37001.00000  38001.00000  7.744686874486e-06
38001.00000  39001.00000  7.220891626936e-06
39001.00000  40001.00000  7.183477680683e-06
40001.00000  41001.00000  6.248129024344e-06
41001.00000  42001.00000  6.135887185583e-06
42001.00000  43001.00000  5.612091938033e-06
43001.00000  44001.00000  5.574677991780e-06
44001.00000  45001.00000  4.302603819159e-06
45001.00000  46001.00000  4.601915389187e-06
46001.00000  47001.00000  5.050882744230e-06
47001.00000  48001.00000  4.115534087891e-06
48001.00000  49001.00000  4.115534087891e-06
49001.00000  50001.00000  3.629152786595e-06
50001.00000  51001.00000  4.003292249131e-06
51001.00000  52001.00000  3.629152786595e-06
52001.00000  53001.00000  3.217599377806e-06
53001.00000  54001.00000  2.469320452735e-06
54001.00000  55001.00000  2.469320452735e-06
55001.00000  56001.00000  3.180185431552e-06
56001.00000  57001.00000  2.843459915270e-06
57001.00000  58001.00000  2.843459915270e-06
58001.00000  59001.00000  1.908111258931e-06
59001.00000  60001.00000  2.581562291495e-06
60001.00000  61001.00000  2.244836775213e-06
61001.00000  62001.00000  2.132594936453e-06
62001.00000  63001.00000  2.020353097692e-06
63001.00000  64001.00000  2.282250721467e-06
64001.00000  65001.00000  1.533971796396e-06
65001.00000  66001.00000  1.459143903889e-06
66001.00000  67001.00000  1.346902065128e-06
67001.00000  68001.00000  1.646213635156e-06
68001.00000  69001.00000  1.533971796396e-06
69001.00000  70001.00000  1.758455473917e-06
70001.00000  71001.00000  1.234660226367e-06
71001.00000  72001.00000  1.159832333860e-06
72001.00000  73001.00000  1.608799688903e-06
73001.00000  74001.00000  7.856928713247e-07
74001.00000  75001.00000  1.159832333860e-06
75001.00000  76001.00000  1.085004441353e-06
76001.00000  77001.00000  1.085004441353e-06
77001.00000  78001.00000  1.459143903889e-06
78001.00000  79001.00000  8.979347100854e-07
79001.00000  80001.00000  8.231068175782e-07
80001.00000  81001.00000  9.353486563389e-07
81001.00000  82001.00000  1.010176548846e-06
82001.00000  83001.00000  1.421729957635e-06
83001.00000  84001.00000  9.727626025925e-07
84001.00000  85001.00000  6.360370863105e-07
85001.00000  86001.00000  6.360370863105e-07
86001.00000  87001.00000  8.979347100854e-07
87001.00000  88001.00000  8.231068175782e-07
88001.00000  89001.00000  8.231068175782e-07
89001.00000  90001.00000  6.734510325640e-07
90001.00000  91001.00000  6.734510325640e-07
91001.00000  92001.00000  5.986231400569e-07
92001.00000  93001.00000  5.986231400569e-07
93001.00000  94001.00000  5.612091938033e-07
94001.00000  95001.00000  6.360370863105e-07
95001.00000  96001.00000  7.108649788176e-07
96001.00000  97001.00000  5.237952475498e-07
97001.00000  98001.00000  4.863813012962e-07
98001.00000  99001.00000  4.115534087891e-07
99001.00000  100001.00000  4.489673550427e-07
100001.00000  101001.00000  5.612091938033e-07
101001.00000  102001.00000  2.993115700285e-07
102001.00000  103001.00000  4.863813012962e-07
103001.00000  104001.00000  3.741394625356e-07
104001.00000  105001.00000  2.993115700285e-07
105001.00000  106001.00000  4.489673550427e-07
106001.00000  107001.00000  2.244836775213e-07
107001.00000  108001.00000  2.993115700285e-07
108001.00000  109001.00000  5.612091938033e-07
109001.00000  110001.00000  4.489673550427e-07
110001.00000  111001.00000  4.115534087891e-07
111001.00000  112001.00000  3.741394625356e-07
112001.00000  113001.00000  4.863813012962e-07
113001.00000  114001.00000  2.244836775213e-07
114001.00000  115001.00000  3.741394625356e-07
115001.00000  116001.00000  2.993115700285e-07
116001.00000  117001.00000  1.496557850142e-07
117001.00000  118001.00000  2.244836775213e-07
118001.00000  119001.00000  2.244836775213e-07
119001.00000  120001.00000  2.993115700285e-07
120001.00000  121001.00000  2.244836775213e-07
121001.00000  122001.00000  3.367255162820e-07
122001.00000  123001.00000  1.122418387607e-07
123001.00000  124001.00000  2.993115700285e-07
124001.00000  125001.00000  2.993115700285e-07
125001.00000  126001.00000  2.244836775213e-07
126001.00000  127001.00000  4.115534087891e-07
127001.00000  128001.00000  2.993115700285e-07
128001.00000  129001.00000  1.122418387607e-07
129001.00000  130001.00000  1.122418387607e-07
130001.00000  131001.00000  2.993115700285e-07
131001.00000  132001.00000  2.244836775213e-07
132001.00000  133001.00000  3.367255162820e-07
133001.00000  134001.00000  2.618976237749e-07
134001.00000  135001.00000  1.496557850142e-07
135001.00000  136001.00000  2.618976237749e-07
136001.00000  137001.00000  4.115534087891e-07
137001.00000  138001.00000  3.741394625356e-08
138001.00000  139001.00000  1.870697312678e-07
139001.00000  140001.00000  3.741394625356e-08
140001.00000  141001.00000  1.496557850142e-07
141001.00000  142001.00000  7.482789250711e-08
142001.00000  143001.00000  1.870697312678e-07
143001.00000  144001.00000  7.482789250711e-08
144001.00000  145001.00000  1.496557850142e-07
145001.00000  146001.00000  1.122418387607e-07
146001.00000  147001.00000  3.741394625356e-08
147001.00000  148001.00000  7.482789250711e-08
148001.00000  149001.00000  1.870697312678e-07
149001.00000  150001.00000  2.244836775213e-07
150001.00000  151001.00000  1.496557850142e-07
151001.00000  152001.00000  7.482789250711e-08
152001.00000  153001.00000  1.496557850142e-07
153001.00000  154001.00000  1.122418387607e-07
154001.00000  155001.00000  1.122418387607e-07
155001.00000  156001.00000  7.482789250711e-08
156001.00000  157001.00000  7.482789250711e-08
157001.00000  158001.00000  1.496557850142e-07
158001.00000  159001.00000  7.482789250711e-08
159001.00000  160001.00000  3.741394625356e-08
160001.00000  161001.00000  3.741394625356e-08
161001.00000  162001.00000  3.741394625356e-08
162001.00000  163001.00000  1.122418387607e-07
163001.00000  164001.00000  7.482789250711e-08
164001.00000  165001.00000  2.244836775213e-07
165001.00000  166001.00000  3.741394625356e-08
166001.00000  167001.00000  1.496557850142e-07
167001.00000  168001.00000  3.741394625356e-08
168001.00000  169001.00000  7.482789250711e-08
169001.00000  170001.00000  7.482789250711e-08
170001.00000  171001.00000  7.482789250711e-08
171001.00000  172001.00000  3.741394625356e-08
172001.00000  173001.00000  1.122418387607e-07
173001.00000  174001.00000  3.741394625356e-08
174001.00000  175001.00000  7.482789250711e-08
175001.00000  176001.00000  7.482789250711e-08
176001.00000  177001.00000  0.000000000000e+00
177001.00000  178001.00000  1.496557850142e-07
178001.00000  179001.00000  1.870697312678e-07
179001.00000  180001.00000  1.122418387607e-07
180001.00000  181001.00000  3.741394625356e-08
181001.00000  182001.00000  1.122418387607e-07
182001.00000  183001.00000  1.122418387607e-07
183001.00000  184001.00000  0.000000000000e+00
184001.00000  185001.00000  0.000000000000e+00
185001.00000  186001.00000  3.741394625356e-08
186001.00000  187001.00000  1.122418387607e-07
187001.00000  188001.00000  3.741394625356e-08
188001.00000  189001.00000  3.741394625356e-08
189001.00000  190001.00000  1.122418387607e-07
190001.00000  191001.00000  7.482789250711e-08
191001.00000  192001.00000  7.482789250711e-08
192001.00000  193001.00000  1.122418387607e-07
193001.00000  194001.00000  3.741394625356e-08
194001.00000  195001.00000  3.741394625356e-08
195001.00000  196001.00000  0.000000000000e+00
196001.00000  197001.00000  0.000000000000e+00
197001.00000  198001.00000  0.000000000000e+00
198001.00000  199001.00000  3.741394625356e-08
