300.00000  350.00000  1.955963985092e-01
350.00000  400.00000  1.383143072252e-01
400.00000  450.00000  1.023898576689e-01
450.00000  500.00000  7.814069245493e-02
500.00000  550.00000  6.146287027712e-02
550.00000  600.00000  4.910009084027e-02
600.00000  650.00000  3.987633312369e-02
650.00000  700.00000  3.344380549129e-02
700.00000  750.00000  2.777399300504e-02
750.00000  800.00000  2.391997638635e-02
800.00000  850.00000  2.054801515167e-02
850.00000  900.00000  1.777538787594e-02
900.00000  950.00000  1.550260997489e-02
950.00000  1000.00000  1.362534395768e-02
1000.00000  1050.00000  1.216947199260e-02
1050.00000  1100.00000  1.097727461674e-02
1100.00000  1150.00000  9.666181030409e-03
1150.00000  1200.00000  8.833098739277e-03
1200.00000  1250.00000  7.869796789046e-03
1250.00000  1300.00000  7.293109727320e-03
1300.00000  1350.00000  6.462453889463e-03
1350.00000  1400.00000  6.030545206487e-03
1400.00000  1450.00000  5.529078196291e-03
1450.00000  1500.00000  4.995258475760e-03
1500.00000  1550.00000  4.593276049845e-03
1550.00000  1600.00000  4.264896039942e-03
1600.00000  1650.00000  3.922766128147e-03
1650.00000  1700.00000  3.657473903398e-03
1700.00000  1750.00000  3.399461038475e-03
1750.00000  1800.00000  3.208580047497e-03
1800.00000  1850.00000  3.079978023914e-03
1850.00000  1900.00000  2.860788411393e-03
1900.00000  1950.00000  2.670716238174e-03
1950.00000  2000.00000  2.444247265827e-03
2000.00000  2050.00000  2.259836816916e-03
2050.00000  2100.00000  2.233954648648e-03
2100.00000  2150.00000  2.010720947335e-03
2150.00000  2200.00000  2.001823951993e-03
2200.00000  2250.00000  1.833589858249e-03
2250.00000  2300.00000  1.756752171203e-03
2300.00000  2350.00000  1.645135320547e-03
2350.00000  2400.00000  1.574768175567e-03
2400.00000  2450.00000  1.497930488521e-03
2450.00000  2500.00000  1.411386988375e-03
2500.00000  2550.00000  1.379843095798e-03
2550.00000  2600.00000  1.284402600309e-03
2600.00000  2650.00000  1.252049889974e-03
2650.00000  2700.00000  1.260946885316e-03
2700.00000  2750.00000  1.086242249505e-03
2750.00000  2800.00000  1.046610179345e-03
2800.00000  2850.00000  1.072492347613e-03
2850.00000  2900.00000  1.023154464352e-03
2900.00000  2950.00000  9.633019502316e-04
2950.00000  3000.00000  9.107287959368e-04
3000.00000  3050.00000  8.468321930247e-04
3050.00000  3100.00000  8.905083519773e-04
3100.00000  3150.00000  8.160971182063e-04
3150.00000  3200.00000  7.691856882202e-04
3200.00000  3250.00000  7.821267723543e-04
3250.00000  3300.00000  7.433035199520e-04
3300.00000  3350.00000  6.640393796307e-04
3350.00000  3400.00000  6.834510058318e-04
3400.00000  3450.00000  6.502894777382e-04
3450.00000  3500.00000  6.454365711879e-04
3500.00000  3550.00000  5.831576037926e-04
3550.00000  3600.00000  6.203632206781e-04
3600.00000  3650.00000  5.807311505174e-04
3650.00000  3700.00000  5.281579962227e-04
3700.00000  3750.00000  5.160257298470e-04
3750.00000  3800.00000  5.168345476054e-04
3800.00000  3850.00000  5.443343513903e-04
3850.00000  3900.00000  4.812465662366e-04
3900.00000  3950.00000  4.537467624516e-04
3950.00000  4000.00000  4.351439540089e-04
4000.00000  4050.00000  4.052176969488e-04
4050.00000  4100.00000  3.890413417812e-04
4100.00000  4150.00000  3.995559726401e-04
4150.00000  4200.00000  4.011736081569e-04
4200.00000  4250.00000  4.246293231499e-04
4250.00000  4300.00000  3.663944445465e-04
4300.00000  4350.00000  3.340417342113e-04
4350.00000  4400.00000  3.534533604124e-04
4400.00000  4450.00000  3.542621781708e-04
4450.00000  4500.00000  3.348505519697e-04
4500.00000  4550.00000  3.380858230032e-04
4550.00000  4600.00000  3.000713883593e-04
4600.00000  4650.00000  3.097772014599e-04
4650.00000  4700.00000  3.033066593928e-04
4700.00000  4750.00000  3.024978416344e-04
4750.00000  4800.00000  2.782333088830e-04
4800.00000  4850.00000  2.717627668160e-04
4850.00000  4900.00000  2.418365097559e-04
4900.00000  4950.00000  2.458805985478e-04
4950.00000  5000.00000  2.539687761316e-04
5000.00000  5050.00000  2.402188742391e-04
5050.00000  5100.00000  2.458805985478e-04
5100.00000  5150.00000  2.297042433802e-04
5150.00000  5200.00000  2.305130611385e-04
5200.00000  5250.00000  2.175719770044e-04
5250.00000  5300.00000  2.086749816623e-04
5300.00000  5350.00000  2.183807947628e-04
5350.00000  5400.00000  2.038220751120e-04
5400.00000  5450.00000  2.054397106287e-04
5450.00000  5500.00000  1.836016311524e-04
5500.00000  5550.00000  1.997779863201e-04
5550.00000  5600.00000  1.965427152865e-04
5600.00000  5650.00000  1.803663601189e-04
5650.00000  5700.00000  1.949250797698e-04
5700.00000  5750.00000  1.706605470184e-04
5750.00000  5800.00000  1.561018273675e-04
5800.00000  5850.00000  1.714693647767e-04
5850.00000  5900.00000  1.722781825351e-04
5900.00000  5950.00000  1.439695609918e-04
5950.00000  6000.00000  1.504401030588e-04
6000.00000  6050.00000  1.480136497837e-04
6050.00000  6100.00000  1.658076404681e-04
6100.00000  6150.00000  1.431607432334e-04
6150.00000  6200.00000  1.528665563340e-04
6200.00000  6250.00000  1.423519254750e-04
6250.00000  6300.00000  1.237491170323e-04
6300.00000  6350.00000  1.253667525490e-04
6350.00000  6400.00000  1.455871965085e-04
6400.00000  6450.00000  1.188962104820e-04
6450.00000  6500.00000  1.294108413409e-04
6500.00000  6550.00000  1.180873927236e-04
6550.00000  6600.00000  1.205138459987e-04
6600.00000  6650.00000  9.786694876408e-05
6650.00000  6700.00000  1.124256684149e-04
6700.00000  6750.00000  1.326461123745e-04
6750.00000  6800.00000  1.043374908311e-04
6800.00000  6850.00000  1.011022197976e-04
6850.00000  6900.00000  1.011022197976e-04
6900.00000  6950.00000  1.116168506566e-04
6950.00000  7000.00000  9.786694876408e-05
7000.00000  7050.00000  1.148521216901e-04
7050.00000  7100.00000  1.205138459987e-04
7100.00000  7150.00000  1.002934020392e-04
7150.00000  7200.00000  1.124256684149e-04
7200.00000  7250.00000  8.088177583808e-05
7250.00000  7300.00000  9.786694876408e-05
7300.00000  7350.00000  9.220522445541e-05
7350.00000  7400.00000  9.301404221380e-05
7400.00000  7450.00000  7.683768704618e-05
7450.00000  7500.00000  9.301404221380e-05
7500.00000  7550.00000  8.977877118027e-05
7550.00000  7600.00000  9.058758893865e-05
7600.00000  7650.00000  7.117596273751e-05
7650.00000  7700.00000  7.845532256294e-05
7700.00000  7750.00000  7.764650480456e-05
7750.00000  7800.00000  8.816113566351e-05
7800.00000  7850.00000  9.948458428084e-05
7850.00000  7900.00000  7.764650480456e-05
7900.00000  7950.00000  8.411704687161e-05
7950.00000  8000.00000  6.955832722075e-05
8000.00000  8050.00000  6.551423842885e-05
8050.00000  8100.00000  6.874950946237e-05
8100.00000  8150.00000  7.522005152942e-05
8150.00000  8200.00000  7.036714497913e-05
8200.00000  8250.00000  6.632305618723e-05
8250.00000  8300.00000  7.036714497913e-05
8300.00000  8350.00000  6.874950946237e-05
8350.00000  8400.00000  8.411704687161e-05
8400.00000  8450.00000  6.470542067047e-05
8450.00000  8500.00000  7.602886928780e-05
8500.00000  8550.00000  6.066133187856e-05
8550.00000  8600.00000  6.713187394561e-05
8600.00000  8650.00000  5.661724308666e-05
8650.00000  8700.00000  7.279359825427e-05
8700.00000  8750.00000  6.389660291209e-05
8750.00000  8800.00000  5.904369636180e-05
8800.00000  8850.00000  6.147014963694e-05
8850.00000  8900.00000  4.529379446933e-05
8900.00000  8950.00000  5.823487860342e-05
8950.00000  9000.00000  6.147014963694e-05
9000.00000  9050.00000  4.529379446933e-05
9050.00000  9100.00000  4.852906550285e-05
9100.00000  9150.00000  4.772024774447e-05
9150.00000  9200.00000  3.882325240228e-05
9200.00000  9250.00000  4.691142998609e-05
9250.00000  9300.00000  5.499960756990e-05
9300.00000  9350.00000  4.448497671095e-05
9350.00000  9400.00000  5.014670101961e-05
9400.00000  9450.00000  5.338197205313e-05
9450.00000  9500.00000  4.691142998609e-05
9500.00000  9550.00000  4.852906550285e-05
9550.00000  9600.00000  5.499960756990e-05
9600.00000  9650.00000  4.772024774447e-05
9650.00000  9700.00000  4.367615895256e-05
9700.00000  9750.00000  5.419078981152e-05
9750.00000  9800.00000  4.286734119418e-05
9800.00000  9850.00000  3.720561688552e-05
9850.00000  9900.00000  3.882325240228e-05
9900.00000  9950.00000  4.691142998609e-05
9950.00000  10000.00000  4.044088791904e-05
