10001.00000  11001.00000  3.907323411491e-04
11001.00000  12001.00000  3.224114598119e-04
12001.00000  13001.00000  2.578840963500e-04
13001.00000  14001.00000  2.183714151149e-04
14001.00000  15001.00000  1.920421474858e-04
15001.00000  16001.00000  1.645860923690e-04
16001.00000  17001.00000  1.387450993179e-04
17001.00000  18001.00000  1.208667378466e-04
18001.00000  19001.00000  1.046034384408e-04
19001.00000  20001.00000  9.235901440791e-05
20001.00000  21001.00000  8.428370407945e-05
21001.00000  22001.00000  7.632107249975e-05
22001.00000  23001.00000  6.847111966882e-05
23001.00000  24001.00000  6.065872642081e-05
24001.00000  25001.00000  5.314680983619e-05
25001.00000  26001.00000  4.939085154388e-05
26001.00000  27001.00000  4.631096574419e-05
27001.00000  28001.00000  3.883660874249e-05
28001.00000  29001.00000  3.692107001341e-05
29001.00000  30001.00000  3.538112711356e-05
30001.00000  31001.00000  3.087397716279e-05
31001.00000  32001.00000  2.959695134341e-05
32001.00000  33001.00000  2.554051638771e-05
33001.00000  34001.00000  2.385033515617e-05
34001.00000  35001.00000  2.182211767832e-05
35001.00000  36001.00000  1.960610228586e-05
36001.00000  37001.00000  1.919294687371e-05
37001.00000  38001.00000  1.780324230555e-05
38001.00000  39001.00000  1.600038232524e-05
39001.00000  40001.00000  1.506139275217e-05
40001.00000  41001.00000  1.434776067663e-05
41001.00000  42001.00000  1.434776067663e-05
42001.00000  43001.00000  1.213174528416e-05
43001.00000  44001.00000  1.111763654524e-05
44001.00000  45001.00000  1.081715988185e-05
45001.00000  46001.00000  9.765491560007e-06
46001.00000  47001.00000  8.939180735699e-06
47001.00000  48001.00000  8.300667826006e-06
48001.00000  49001.00000  8.751382821083e-06
49001.00000  50001.00000  8.225548660160e-06
50001.00000  51001.00000  7.849952830929e-06
51001.00000  52001.00000  7.511916584621e-06
52001.00000  53001.00000  6.986082423697e-06
53001.00000  54001.00000  6.122212016466e-06
54001.00000  55001.00000  6.122212016466e-06
55001.00000  56001.00000  5.971973684774e-06
56001.00000  57001.00000  5.521258689696e-06
57001.00000  58001.00000  5.295901192158e-06
58001.00000  59001.00000  4.845186197081e-06
59001.00000  60001.00000  4.619828699542e-06
60001.00000  61001.00000  4.845186197081e-06
61001.00000  62001.00000  3.755958292310e-06
62001.00000  63001.00000  3.981315789849e-06
63001.00000  64001.00000  4.093994538618e-06
64001.00000  65001.00000  3.493041211849e-06
65001.00000  66001.00000  3.417922046003e-06
66001.00000  67001.00000  2.779409136310e-06
67001.00000  68001.00000  3.230124131387e-06
68001.00000  69001.00000  3.455481628926e-06
69001.00000  70001.00000  3.530600794772e-06
70001.00000  71001.00000  3.155004965541e-06
71001.00000  72001.00000  2.516492055848e-06
72001.00000  73001.00000  2.178455809540e-06
73001.00000  74001.00000  1.877979146155e-06
74001.00000  75001.00000  2.140896226617e-06
75001.00000  76001.00000  2.441372890002e-06
76001.00000  77001.00000  2.028217477848e-06
77001.00000  78001.00000  2.291134558309e-06
78001.00000  79001.00000  1.802859980309e-06
79001.00000  80001.00000  2.065777060771e-06
80001.00000  81001.00000  1.727740814463e-06
81001.00000  82001.00000  1.690181231540e-06
82001.00000  83001.00000  1.802859980309e-06
83001.00000  84001.00000  1.314585402309e-06
84001.00000  85001.00000  1.615062065694e-06
85001.00000  86001.00000  1.690181231540e-06
86001.00000  87001.00000  1.502383316924e-06
87001.00000  88001.00000  1.164347070616e-06
88001.00000  89001.00000  1.427264151078e-06
89001.00000  90001.00000  8.638704072314e-07
90001.00000  91001.00000  1.201906653539e-06
91001.00000  92001.00000  1.464823734001e-06
92001.00000  93001.00000  9.389895730776e-07
93001.00000  94001.00000  7.511916584621e-07
94001.00000  95001.00000  1.051668321847e-06
95001.00000  96001.00000  1.464823734001e-06
96001.00000  97001.00000  1.352144985232e-06
97001.00000  98001.00000  7.511916584621e-07
98001.00000  99001.00000  8.638704072314e-07
99001.00000  100001.00000  1.089227904770e-06
100001.00000  101001.00000  1.164347070616e-06
101001.00000  102001.00000  9.014299901545e-07
102001.00000  103001.00000  7.887512413852e-07
103001.00000  104001.00000  7.887512413852e-07
104001.00000  105001.00000  8.263108243083e-07
105001.00000  106001.00000  6.760724926159e-07
106001.00000  107001.00000  3.755958292310e-07
107001.00000  108001.00000  3.755958292310e-07
108001.00000  109001.00000  9.389895730776e-07
109001.00000  110001.00000  8.638704072314e-07
110001.00000  111001.00000  7.887512413852e-07
111001.00000  112001.00000  5.633937438466e-07
112001.00000  113001.00000  4.882745780004e-07
113001.00000  114001.00000  7.511916584621e-07
114001.00000  115001.00000  6.385129096928e-07
115001.00000  116001.00000  5.258341609235e-07
116001.00000  117001.00000  6.760724926159e-07
117001.00000  118001.00000  4.131554121542e-07
118001.00000  119001.00000  8.263108243083e-07
119001.00000  120001.00000  4.882745780004e-07
120001.00000  121001.00000  5.258341609235e-07
121001.00000  122001.00000  7.136320755390e-07
122001.00000  123001.00000  7.887512413852e-07
123001.00000  124001.00000  3.004766633848e-07
124001.00000  125001.00000  5.633937438466e-07
125001.00000  126001.00000  6.009533267697e-07
126001.00000  127001.00000  4.131554121542e-07
127001.00000  128001.00000  3.755958292310e-07
128001.00000  129001.00000  3.004766633848e-07
129001.00000  130001.00000  4.131554121542e-07
130001.00000  131001.00000  5.258341609235e-07
131001.00000  132001.00000  5.633937438466e-07
132001.00000  133001.00000  2.253574975386e-07
133001.00000  134001.00000  4.507149950773e-07
134001.00000  135001.00000  2.253574975386e-07
135001.00000  136001.00000  4.507149950773e-07
136001.00000  137001.00000  4.507149950773e-07
137001.00000  138001.00000  2.253574975386e-07
138001.00000  139001.00000  2.253574975386e-07
139001.00000  140001.00000  2.253574975386e-07
140001.00000  141001.00000  2.253574975386e-07
141001.00000  142001.00000  2.629170804617e-07
142001.00000  143001.00000  3.380362463079e-07
143001.00000  144001.00000  2.629170804617e-07
144001.00000  145001.00000  3.380362463079e-07
145001.00000  146001.00000  3.380362463079e-07
146001.00000  147001.00000  7.511916584621e-08
147001.00000  148001.00000  2.629170804617e-07
148001.00000  149001.00000  3.380362463079e-07
149001.00000  150001.00000  7.511916584621e-08
150001.00000  151001.00000  2.629170804617e-07
151001.00000  152001.00000  1.502383316924e-07
152001.00000  153001.00000  4.131554121542e-07
153001.00000  154001.00000  1.877979146155e-07
154001.00000  155001.00000  1.877979146155e-07
155001.00000  156001.00000  1.126787487693e-07
156001.00000  157001.00000  1.502383316924e-07
157001.00000  158001.00000  2.629170804617e-07
158001.00000  159001.00000  1.877979146155e-07
159001.00000  160001.00000  1.877979146155e-07
160001.00000  161001.00000  7.511916584621e-08
161001.00000  162001.00000  1.502383316924e-07
162001.00000  163001.00000  7.511916584621e-08
163001.00000  164001.00000  1.502383316924e-07
164001.00000  165001.00000  1.877979146155e-07
165001.00000  166001.00000  2.629170804617e-07
166001.00000  167001.00000  3.004766633848e-07
167001.00000  168001.00000  2.253574975386e-07
168001.00000  169001.00000  1.126787487693e-07
169001.00000  170001.00000  1.877979146155e-07
170001.00000  171001.00000  2.629170804617e-07
171001.00000  172001.00000  3.755958292310e-08
172001.00000  173001.00000  1.502383316924e-07
173001.00000  174001.00000  3.755958292310e-08
174001.00000  175001.00000  7.511916584621e-08
175001.00000  176001.00000  3.755958292310e-08
176001.00000  177001.00000  3.755958292310e-08
177001.00000  178001.00000  3.755958292310e-08
178001.00000  179001.00000  3.755958292310e-08
179001.00000  180001.00000  3.755958292310e-08
180001.00000  181001.00000  1.877979146155e-07
181001.00000  182001.00000  1.502383316924e-07
182001.00000  183001.00000  3.755958292310e-08
183001.00000  184001.00000  3.755958292310e-08
184001.00000  185001.00000  7.511916584621e-08
185001.00000  186001.00000  3.755958292310e-08
186001.00000  187001.00000  1.502383316924e-07
187001.00000  188001.00000  1.502383316924e-07
188001.00000  189001.00000  2.253574975386e-07
189001.00000  190001.00000  1.877979146155e-07
190001.00000  191001.00000  1.502383316924e-07
191001.00000  192001.00000  2.253574975386e-07
192001.00000  193001.00000  1.126787487693e-07
193001.00000  194001.00000  3.755958292310e-08
194001.00000  195001.00000  3.755958292310e-08
195001.00000  196001.00000  1.126787487693e-07
196001.00000  197001.00000  1.126787487693e-07
197001.00000  198001.00000  1.502383316924e-07
198001.00000  199001.00000  1.126787487693e-07
