300.00000  350.00000  3.570259445090e-06
350.00000  400.00000  9.639700501743e-06
400.00000  450.00000  2.142155667054e-05
450.00000  500.00000  1.735146090314e-04
500.00000  550.00000  6.080151834988e-04
550.00000  600.00000  3.184671425020e-04
600.00000  650.00000  9.432625453928e-04
650.00000  700.00000  2.098598501824e-03
700.00000  750.00000  3.027580009436e-03
750.00000  800.00000  4.726666479355e-03
800.00000  850.00000  6.759215181444e-03
850.00000  900.00000  7.189431444578e-03
900.00000  950.00000  8.183391674091e-03
950.00000  1000.00000  9.945314710242e-03
1000.00000  1050.00000  1.148088329758e-02
1050.00000  1100.00000  1.287399853305e-02
1100.00000  1150.00000  1.390616053863e-02
1150.00000  1200.00000  1.479694027018e-02
1200.00000  1250.00000  1.539424467534e-02
1250.00000  1300.00000  1.608330474824e-02
1300.00000  1350.00000  1.543280347735e-02
1350.00000  1400.00000  1.573627553018e-02
1400.00000  1450.00000  1.592835548832e-02
1450.00000  1500.00000  1.586516189615e-02
1500.00000  1550.00000  1.574127389340e-02
1550.00000  1600.00000  1.555633445415e-02
1600.00000  1650.00000  1.523929541542e-02
1650.00000  1700.00000  1.481193535984e-02
1700.00000  1750.00000  1.470411352460e-02
1750.00000  1800.00000  1.437600668160e-02
1800.00000  1850.00000  1.387938359279e-02
1850.00000  1900.00000  1.314069691360e-02
1900.00000  1950.00000  1.289899034917e-02
1950.00000  2000.00000  1.269155827541e-02
2000.00000  2050.00000  1.220528893898e-02
2050.00000  2100.00000  1.184147950153e-02
2100.00000  2150.00000  1.152622559253e-02
2150.00000  2200.00000  1.117562611502e-02
2200.00000  2250.00000  1.075469252644e-02
2250.00000  2300.00000  1.060188542219e-02
2300.00000  2350.00000  1.033554406759e-02
2350.00000  2400.00000  9.981017304693e-03
2400.00000  2450.00000  9.604711959181e-03
2450.00000  2500.00000  9.257325715174e-03
2500.00000  2550.00000  9.018118332353e-03
2550.00000  2600.00000  8.638242727395e-03
2600.00000  2650.00000  8.441521431971e-03
2650.00000  2700.00000  8.095206265797e-03
2700.00000  2750.00000  7.862782375921e-03
2750.00000  2800.00000  7.728897646731e-03
2800.00000  2850.00000  7.397934596171e-03
2850.00000  2900.00000  7.279401982594e-03
2900.00000  2950.00000  7.061259130499e-03
2950.00000  3000.00000  6.850970849183e-03
3000.00000  3050.00000  6.749575480942e-03
3050.00000  3100.00000  6.559280652519e-03
3100.00000  3150.00000  6.253309418075e-03
3150.00000  3200.00000  6.208681175011e-03
3200.00000  3250.00000  5.924131497238e-03
3250.00000  3300.00000  5.783463275101e-03
3300.00000  3350.00000  5.641366949187e-03
3350.00000  3400.00000  5.441075394317e-03
3400.00000  3450.00000  5.316116313739e-03
3450.00000  3500.00000  5.171520806213e-03
3500.00000  3550.00000  5.095831305977e-03
3550.00000  3600.00000  4.901966218108e-03
3600.00000  3650.00000  4.873761168492e-03
3650.00000  3700.00000  4.715955701019e-03
3700.00000  3750.00000  4.628484344615e-03
3750.00000  3800.00000  4.479247499810e-03
3800.00000  3850.00000  4.418553089243e-03
3850.00000  3900.00000  4.289666723276e-03
3900.00000  3950.00000  4.206479678205e-03
3950.00000  4000.00000  4.125077762857e-03
4000.00000  4050.00000  3.987979800165e-03
4050.00000  4100.00000  3.841242136972e-03
4100.00000  4150.00000  3.821605710024e-03
4150.00000  4200.00000  3.741631898454e-03
4200.00000  4250.00000  3.659515931217e-03
4250.00000  4300.00000  3.550265992197e-03
4300.00000  4350.00000  3.504923697245e-03
4350.00000  4400.00000  3.423878807841e-03
4400.00000  4450.00000  3.344619048160e-03
4450.00000  4500.00000  3.324982621212e-03
4500.00000  4550.00000  3.233583979418e-03
4550.00000  4600.00000  3.113266236118e-03
4600.00000  4650.00000  3.037933761827e-03
4650.00000  4700.00000  3.047216436384e-03
4700.00000  4750.00000  2.943678912477e-03
4750.00000  4800.00000  2.895837435912e-03
4800.00000  4850.00000  2.905120110470e-03
4850.00000  4900.00000  2.799083404950e-03
4900.00000  4950.00000  2.751598954331e-03
4950.00000  5000.00000  2.756240291609e-03
5000.00000  5050.00000  2.616643147306e-03
5050.00000  5100.00000  2.564874385353e-03
5100.00000  5150.00000  2.489541911061e-03
5150.00000  5200.00000  2.516675882844e-03
5200.00000  5250.00000  2.478474106781e-03
5250.00000  5300.00000  2.410282151380e-03
5300.00000  5350.00000  2.317812431752e-03
5350.00000  5400.00000  2.306387601528e-03
5400.00000  5450.00000  2.292463589692e-03
5450.00000  5500.00000  2.269613929244e-03
5500.00000  5550.00000  2.209276544622e-03
5550.00000  5600.00000  2.216774089456e-03
5600.00000  5650.00000  2.128231655218e-03
5650.00000  5700.00000  2.090743931045e-03
5700.00000  5750.00000  2.017196586476e-03
5750.00000  5800.00000  2.027193312922e-03
5800.00000  5850.00000  1.932581437627e-03
5850.00000  5900.00000  1.921156607403e-03
5900.00000  5950.00000  1.890095350231e-03
5950.00000  6000.00000  1.840468743944e-03
6000.00000  6050.00000  1.854749781724e-03
6050.00000  6100.00000  1.824402576441e-03
6100.00000  6150.00000  1.828686887775e-03
6150.00000  6200.00000  1.794055371158e-03
6200.00000  6250.00000  1.743714712982e-03
6250.00000  6300.00000  1.802266967881e-03
6300.00000  6350.00000  1.715152637421e-03
6350.00000  6400.00000  2.499895663452e-03
6400.00000  6450.00000  1.693017028862e-03
6450.00000  6500.00000  1.630180462628e-03
6500.00000  6550.00000  1.547707469446e-03
6550.00000  6600.00000  1.558775273726e-03
6600.00000  6650.00000  1.506292459883e-03
6650.00000  6700.00000  1.535925613278e-03
6700.00000  6750.00000  1.485941981046e-03
6750.00000  6800.00000  1.459879087097e-03
6800.00000  6850.00000  1.484870903213e-03
6850.00000  6900.00000  1.482371721601e-03
6900.00000  6950.00000  1.418821103479e-03
6950.00000  7000.00000  1.410252480811e-03
7000.00000  7050.00000  1.365624237747e-03
7050.00000  7100.00000  1.451667490374e-03
7100.00000  7150.00000  1.318496813072e-03
7150.00000  7200.00000  1.286721504010e-03
7200.00000  7250.00000  1.285650426177e-03
7250.00000  7300.00000  1.241379209058e-03
7300.00000  7350.00000  1.234952742057e-03
7350.00000  7400.00000  1.228169249111e-03
7400.00000  7450.00000  1.223527911832e-03
7450.00000  7500.00000  1.214959289164e-03
7500.00000  7550.00000  1.183183980103e-03
7550.00000  7600.00000  1.131058192204e-03
7600.00000  7650.00000  1.155335956431e-03
7650.00000  7700.00000  1.112492843090e-03
7700.00000  7750.00000  1.130344140315e-03
7750.00000  7800.00000  1.096783701532e-03
7800.00000  7850.00000  1.085001845363e-03
7850.00000  7900.00000  1.069292703804e-03
7900.00000  7950.00000  1.061795158970e-03
7950.00000  8000.00000  1.051441406579e-03
8000.00000  8050.00000  1.063223262748e-03
8050.00000  8100.00000  1.032519031520e-03
8100.00000  8150.00000  1.060367055192e-03
8150.00000  8200.00000  1.029305798019e-03
8200.00000  8250.00000  1.026449590463e-03
8250.00000  8300.00000  9.579006091176e-04
8300.00000  8350.00000  9.532592718390e-04
8350.00000  8400.00000  9.953883332911e-04
8400.00000  8450.00000  9.396922859477e-04
8450.00000  8500.00000  9.393352600032e-04
8500.00000  8550.00000  8.904227056054e-04
8550.00000  8600.00000  9.129153401095e-04
8600.00000  8650.00000  9.171996514436e-04
8650.00000  8700.00000  8.879235239939e-04
8700.00000  8750.00000  9.118442622760e-04
8750.00000  8800.00000  8.761416678251e-04
8800.00000  8850.00000  8.543630852100e-04
8850.00000  8900.00000  8.757846418806e-04
8900.00000  8950.00000  8.490076960424e-04
8950.00000  9000.00000  8.365117879846e-04
9000.00000  9050.00000  8.368688139291e-04
9050.00000  9100.00000  8.050935048678e-04
9100.00000  9150.00000  8.479366182089e-04
9150.00000  9200.00000  7.618933655822e-04
9200.00000  9250.00000  7.754603514735e-04
9250.00000  9300.00000  7.986670378666e-04
9300.00000  9350.00000  7.754603514735e-04
9350.00000  9400.00000  7.593941839706e-04
9400.00000  9450.00000  7.747462995845e-04
9450.00000  9500.00000  7.354734456885e-04
9500.00000  9550.00000  7.615363396377e-04
9550.00000  9600.00000  7.572520283036e-04
9600.00000  9650.00000  7.279759008538e-04
9650.00000  9700.00000  7.072683960723e-04
9700.00000  9750.00000  7.461842240238e-04
9750.00000  9800.00000  7.201213300746e-04
9800.00000  9850.00000  7.240486154642e-04
9850.00000  9900.00000  7.297610305764e-04
9900.00000  9950.00000  7.183362003521e-04
9950.00000  10000.00000  7.054832663498e-04
