10001.00000  11001.00000  6.081194677933e-04
11001.00000  12001.00000  4.926239099566e-04
12001.00000  13001.00000  4.075975634954e-04
13001.00000  14001.00000  3.421175035771e-04
14001.00000  15001.00000  2.931559720900e-04
15001.00000  16001.00000  2.445393750712e-04
16001.00000  17001.00000  2.126137737180e-04
17001.00000  18001.00000  1.819720951083e-04
18001.00000  19001.00000  1.595130286101e-04
19001.00000  20001.00000  1.405224698219e-04
20001.00000  21001.00000  1.246938103275e-04
21001.00000  22001.00000  1.084244012345e-04
22001.00000  23001.00000  9.667746628277e-05
23001.00000  24001.00000  8.807326759873e-05
24001.00000  25001.00000  7.624968054294e-05
25001.00000  26001.00000  7.151641311542e-05
26001.00000  27001.00000  6.526926663213e-05
27001.00000  28001.00000  5.687586123434e-05
28001.00000  29001.00000  5.156770302615e-05
29001.00000  30001.00000  4.852078188860e-05
30001.00000  31001.00000  4.401747077334e-05
31001.00000  32001.00000  4.062561516739e-05
32001.00000  33001.00000  3.581569563578e-05
33001.00000  34001.00000  3.416767539786e-05
34001.00000  35001.00000  3.115908031235e-05
35001.00000  36001.00000  2.757559444617e-05
36001.00000  37001.00000  2.472030356884e-05
37001.00000  38001.00000  2.431788002237e-05
38001.00000  39001.00000  2.127095888481e-05
39001.00000  40001.00000  2.161589335321e-05
40001.00000  41001.00000  1.900972181417e-05
41001.00000  42001.00000  1.720839736807e-05
42001.00000  43001.00000  1.586698554651e-05
43001.00000  44001.00000  1.634606119707e-05
44001.00000  45001.00000  1.500464937550e-05
45001.00000  46001.00000  1.362491150189e-05
46001.00000  47001.00000  1.243680388851e-05
47001.00000  48001.00000  1.163195679557e-05
48001.00000  49001.00000  1.063547944241e-05
49001.00000  50001.00000  1.052050128627e-05
50001.00000  51001.00000  9.792306297422e-06
51001.00000  52001.00000  9.159926438685e-06
52001.00000  53001.00000  7.684373434964e-06
53001.00000  54001.00000  8.240101189612e-06
54001.00000  55001.00000  7.416091070651e-06
55001.00000  56001.00000  7.013667524181e-06
56001.00000  57001.00000  6.572917925667e-06
57001.00000  58001.00000  6.553754899645e-06
58001.00000  59001.00000  6.342961613399e-06
59001.00000  60001.00000  5.308158208192e-06
60001.00000  61001.00000  5.672255702616e-06
61001.00000  62001.00000  4.235028750940e-06
62001.00000  63001.00000  4.522474141275e-06
63001.00000  64001.00000  4.809919531611e-06
64001.00000  65001.00000  4.292517829007e-06
65001.00000  66001.00000  4.081724542761e-06
66001.00000  67001.00000  3.947583360605e-06
67001.00000  68001.00000  3.142736267666e-06
68001.00000  69001.00000  3.372692579934e-06
69001.00000  70001.00000  3.296040475845e-06
70001.00000  71001.00000  3.219388371755e-06
71001.00000  72001.00000  2.721149695174e-06
72001.00000  73001.00000  2.797801799264e-06
73001.00000  74001.00000  2.376215226772e-06
74001.00000  75001.00000  2.242074044615e-06
75001.00000  76001.00000  1.724672342012e-06
76001.00000  77001.00000  1.897139576213e-06
77001.00000  78001.00000  2.184584966548e-06
78001.00000  79001.00000  1.801324446101e-06
79001.00000  80001.00000  1.398900899632e-06
80001.00000  81001.00000  1.916302602235e-06
81001.00000  82001.00000  1.705509315989e-06
82001.00000  83001.00000  1.628857211900e-06
83001.00000  84001.00000  1.877976550191e-06
84001.00000  85001.00000  1.724672342012e-06
85001.00000  86001.00000  1.303085769520e-06
86001.00000  87001.00000  1.475553003721e-06
87001.00000  88001.00000  1.264759717475e-06
88001.00000  89001.00000  1.053966431229e-06
89001.00000  90001.00000  1.130618535319e-06
90001.00000  91001.00000  9.773143271400e-07
91001.00000  92001.00000  9.006622230506e-07
92001.00000  93001.00000  1.073129457252e-06
93001.00000  94001.00000  1.092292483274e-06
94001.00000  95001.00000  9.006622230506e-07
95001.00000  96001.00000  8.240101189612e-07
96001.00000  97001.00000  7.473580148718e-07
97001.00000  98001.00000  7.473580148718e-07
98001.00000  99001.00000  6.898689368047e-07
99001.00000  100001.00000  7.473580148718e-07
100001.00000  101001.00000  5.557277546482e-07
101001.00000  102001.00000  6.323798587376e-07
102001.00000  103001.00000  4.790756505588e-07
103001.00000  104001.00000  4.982386765812e-07
104001.00000  105001.00000  6.323798587376e-07
105001.00000  106001.00000  6.515428847600e-07
106001.00000  107001.00000  4.215865724918e-07
107001.00000  108001.00000  4.599126245365e-07
108001.00000  109001.00000  6.323798587376e-07
109001.00000  110001.00000  4.982386765812e-07
110001.00000  111001.00000  4.024235464694e-07
111001.00000  112001.00000  6.515428847600e-07
112001.00000  113001.00000  4.215865724918e-07
113001.00000  114001.00000  5.557277546482e-07
114001.00000  115001.00000  4.599126245365e-07
115001.00000  116001.00000  3.832605204471e-07
116001.00000  117001.00000  5.557277546482e-07
117001.00000  118001.00000  2.682823643129e-07
118001.00000  119001.00000  2.107932862459e-07
119001.00000  120001.00000  1.533042081788e-07
120001.00000  121001.00000  1.916302602235e-07
121001.00000  122001.00000  2.874453903353e-07
122001.00000  123001.00000  2.491193382906e-07
123001.00000  124001.00000  1.916302602235e-07
124001.00000  125001.00000  2.299563122682e-07
125001.00000  126001.00000  3.640974944247e-07
126001.00000  127001.00000  2.107932862459e-07
127001.00000  128001.00000  3.066084163576e-07
128001.00000  129001.00000  1.724672342012e-07
129001.00000  130001.00000  2.491193382906e-07
130001.00000  131001.00000  2.299563122682e-07
131001.00000  132001.00000  7.665210408941e-08
132001.00000  133001.00000  3.066084163576e-07
133001.00000  134001.00000  2.491193382906e-07
134001.00000  135001.00000  1.341411821565e-07
135001.00000  136001.00000  1.724672342012e-07
136001.00000  137001.00000  1.533042081788e-07
137001.00000  138001.00000  1.341411821565e-07
138001.00000  139001.00000  5.748907806706e-08
139001.00000  140001.00000  3.832605204471e-08
140001.00000  141001.00000  1.149781561341e-07
141001.00000  142001.00000  1.341411821565e-07
142001.00000  143001.00000  1.149781561341e-07
143001.00000  144001.00000  1.533042081788e-07
144001.00000  145001.00000  3.832605204471e-08
145001.00000  146001.00000  5.748907806706e-08
146001.00000  147001.00000  1.149781561341e-07
147001.00000  148001.00000  7.665210408941e-08
148001.00000  149001.00000  9.581513011176e-08
149001.00000  150001.00000  1.916302602235e-08
150001.00000  151001.00000  1.341411821565e-07
151001.00000  152001.00000  1.724672342012e-07
152001.00000  153001.00000  1.149781561341e-07
153001.00000  154001.00000  5.748907806706e-08
154001.00000  155001.00000  9.581513011176e-08
155001.00000  156001.00000  7.665210408941e-08
156001.00000  157001.00000  1.149781561341e-07
157001.00000  158001.00000  3.832605204471e-08
158001.00000  159001.00000  7.665210408941e-08
159001.00000  160001.00000  5.748907806706e-08
160001.00000  161001.00000  1.916302602235e-08
161001.00000  162001.00000  3.832605204471e-08
162001.00000  163001.00000  5.748907806706e-08
163001.00000  164001.00000  7.665210408941e-08
164001.00000  165001.00000  7.665210408941e-08
165001.00000  166001.00000  5.748907806706e-08
166001.00000  167001.00000  1.916302602235e-08
167001.00000  168001.00000  3.832605204471e-08
168001.00000  169001.00000  0.000000000000e+00
169001.00000  170001.00000  0.000000000000e+00
170001.00000  171001.00000  0.000000000000e+00
171001.00000  172001.00000  3.832605204471e-08
172001.00000  173001.00000  1.916302602235e-08
173001.00000  174001.00000  5.748907806706e-08
174001.00000  175001.00000  3.832605204471e-08
175001.00000  176001.00000  3.832605204471e-08
176001.00000  177001.00000  3.832605204471e-08
177001.00000  178001.00000  0.000000000000e+00
178001.00000  179001.00000  0.000000000000e+00
179001.00000  180001.00000  3.832605204471e-08
180001.00000  181001.00000  5.748907806706e-08
181001.00000  182001.00000  5.748907806706e-08
182001.00000  183001.00000  0.000000000000e+00
183001.00000  184001.00000  3.832605204471e-08
184001.00000  185001.00000  3.832605204471e-08
185001.00000  186001.00000  0.000000000000e+00
186001.00000  187001.00000  1.916302602235e-08
187001.00000  188001.00000  1.916302602235e-08
188001.00000  189001.00000  3.832605204471e-08
189001.00000  190001.00000  3.832605204471e-08
190001.00000  191001.00000  1.916302602235e-08
191001.00000  192001.00000  5.748907806706e-08
192001.00000  193001.00000  0.000000000000e+00
193001.00000  194001.00000  1.916302602235e-08
194001.00000  195001.00000  1.916302602235e-08
195001.00000  196001.00000  0.000000000000e+00
196001.00000  197001.00000  5.748907806706e-08
197001.00000  198001.00000  3.832605204471e-08
198001.00000  199001.00000  0.000000000000e+00
