300.00000  350.00000  7.069227499093e-02
350.00000  400.00000  5.620940351774e-02
400.00000  450.00000  4.594174379186e-02
450.00000  500.00000  3.844822755477e-02
500.00000  550.00000  3.270640468429e-02
550.00000  600.00000  2.823475787890e-02
600.00000  650.00000  2.463518380690e-02
650.00000  700.00000  2.181246280899e-02
700.00000  750.00000  1.936268547670e-02
750.00000  800.00000  1.748577438738e-02
800.00000  850.00000  1.589394166830e-02
850.00000  900.00000  1.437720087566e-02
900.00000  950.00000  1.317553651666e-02
950.00000  1000.00000  1.206251159661e-02
1000.00000  1050.00000  1.119198715036e-02
1050.00000  1100.00000  1.030230265071e-02
1100.00000  1150.00000  9.659182878612e-03
1150.00000  1200.00000  8.946970792750e-03
1200.00000  1250.00000  8.294174226008e-03
1250.00000  1300.00000  7.945422547007e-03
1300.00000  1350.00000  7.444164584403e-03
1350.00000  1400.00000  6.973098221090e-03
1400.00000  1450.00000  6.569382348507e-03
1450.00000  1500.00000  6.293206629342e-03
1500.00000  1550.00000  5.923553073908e-03
1550.00000  1600.00000  5.674085307964e-03
1600.00000  1650.00000  5.315269762532e-03
1650.00000  1700.00000  5.095025916415e-03
1700.00000  1750.00000  4.952002891564e-03
1750.00000  1800.00000  4.620475907031e-03
1800.00000  1850.00000  4.402554491628e-03
1850.00000  1900.00000  4.283723453389e-03
1900.00000  1950.00000  4.087478057991e-03
1950.00000  2000.00000  3.915231113313e-03
2000.00000  2050.00000  3.721888756308e-03
2050.00000  2100.00000  3.613895728072e-03
2100.00000  2150.00000  3.406425250886e-03
2150.00000  2200.00000  3.368492215878e-03
2200.00000  2250.00000  3.262434546570e-03
2250.00000  2300.00000  3.071221084388e-03
2300.00000  2350.00000  2.995548550265e-03
2350.00000  2400.00000  2.912715188105e-03
2400.00000  2450.00000  2.850977238270e-03
2450.00000  2500.00000  2.711437859491e-03
2500.00000  2550.00000  2.630539856260e-03
2550.00000  2600.00000  2.549061245351e-03
2600.00000  2650.00000  2.494677659446e-03
2650.00000  2700.00000  2.383975128709e-03
2700.00000  2750.00000  2.317205245660e-03
2750.00000  2800.00000  2.240565032072e-03
2800.00000  2850.00000  2.216566581353e-03
2850.00000  2900.00000  2.133926755086e-03
2900.00000  2950.00000  2.064447369536e-03
2950.00000  3000.00000  2.029030301136e-03
3000.00000  3050.00000  1.993613232735e-03
3050.00000  3100.00000  1.933617105937e-03
3100.00000  3150.00000  1.844009987526e-03
3150.00000  3200.00000  1.811883029305e-03
3200.00000  3250.00000  1.807431703768e-03
3250.00000  3300.00000  1.752080438399e-03
3300.00000  3350.00000  1.701567570353e-03
3350.00000  3400.00000  1.643506802484e-03
3400.00000  3450.00000  1.616024705693e-03
3450.00000  3500.00000  1.558157473716e-03
3500.00000  3550.00000  1.544416425321e-03
3550.00000  3600.00000  1.504548031384e-03
3600.00000  3650.00000  1.467389139947e-03
3650.00000  3700.00000  1.421134061545e-03
3700.00000  3750.00000  1.412618482258e-03
3750.00000  3800.00000  1.376814342072e-03
3800.00000  3850.00000  1.330365727776e-03
3850.00000  3900.00000  1.319140645988e-03
3900.00000  3950.00000  1.301915951520e-03
3950.00000  4000.00000  1.285852472410e-03
4000.00000  4050.00000  1.268047170263e-03
4050.00000  4100.00000  1.215598943288e-03
4100.00000  4150.00000  1.172827510958e-03
4150.00000  4200.00000  1.158699390776e-03
4200.00000  4250.00000  1.167795577742e-03
4250.00000  4300.00000  1.117669781482e-03
4300.00000  4350.00000  1.098316192192e-03
4350.00000  4400.00000  1.085542823261e-03
4400.00000  4450.00000  1.050899898432e-03
4450.00000  4500.00000  1.050706362540e-03
4500.00000  4550.00000  1.023030729855e-03
4550.00000  4600.00000  1.035804098786e-03
4600.00000  4650.00000  9.941938818135e-04
4650.00000  4700.00000  9.632281389500e-04
4700.00000  4750.00000  9.734855412735e-04
4750.00000  4800.00000  9.574220621630e-04
4800.00000  4850.00000  9.121346632251e-04
4850.00000  4900.00000  8.740080923243e-04
4900.00000  4950.00000  8.860073176839e-04
4950.00000  5000.00000  8.730404128598e-04
5000.00000  5050.00000  8.542674312488e-04
5050.00000  5100.00000  8.281400857076e-04
5100.00000  5150.00000  8.461389237471e-04
5150.00000  5200.00000  8.089800323108e-04
5200.00000  5250.00000  8.254305832071e-04
5250.00000  5300.00000  8.233016883852e-04
5300.00000  5350.00000  7.735629639106e-04
5350.00000  5400.00000  7.727888203390e-04
5400.00000  5450.00000  7.640797051586e-04
5450.00000  5500.00000  7.449196517618e-04
5500.00000  5550.00000  7.424036851541e-04
5550.00000  5600.00000  7.313721392590e-04
5600.00000  5650.00000  7.081478321113e-04
5650.00000  5700.00000  7.031158988960e-04
5700.00000  5750.00000  7.079542962184e-04
5750.00000  5800.00000  6.688600458531e-04
5800.00000  5850.00000  6.831817019275e-04
5850.00000  5900.00000  6.719566201395e-04
5900.00000  5950.00000  6.458292745984e-04
5950.00000  6000.00000  6.353783363819e-04
6000.00000  6050.00000  6.353783363819e-04
6050.00000  6100.00000  6.272498288802e-04
6100.00000  6150.00000  6.005418756604e-04
6150.00000  6200.00000  6.255080058441e-04
6200.00000  6250.00000  6.028643063752e-04
6250.00000  6300.00000  6.013160192320e-04
6300.00000  6350.00000  5.887361861936e-04
6350.00000  6400.00000  7.298238521158e-04
6400.00000  6450.00000  5.868008272647e-04
6450.00000  6500.00000  5.751886736908e-04
6500.00000  6550.00000  5.641571277957e-04
6550.00000  6600.00000  5.645441995815e-04
6600.00000  6650.00000  5.486742563639e-04
6650.00000  6700.00000  5.569962997585e-04
6700.00000  6750.00000  5.337719926108e-04
6750.00000  6800.00000  5.248693415375e-04
6800.00000  6850.00000  5.461582897562e-04
6850.00000  6900.00000  4.956454217100e-04
6900.00000  6950.00000  5.047416086762e-04
6950.00000  7000.00000  4.927423833166e-04
7000.00000  7050.00000  4.964195652816e-04
7050.00000  7100.00000  5.076446470697e-04
7100.00000  7150.00000  4.855815552794e-04
7150.00000  7200.00000  4.867427706368e-04
7200.00000  7250.00000  4.811302297427e-04
7250.00000  7300.00000  4.656473583110e-04
7300.00000  7350.00000  4.753241529558e-04
7350.00000  7400.00000  4.579059225951e-04
7400.00000  7450.00000  4.459066972354e-04
7450.00000  7500.00000  4.619701763459e-04
7500.00000  7550.00000  4.410682999130e-04
7550.00000  7600.00000  4.565511713448e-04
7600.00000  7650.00000  4.342945436616e-04
7650.00000  7700.00000  4.327462565184e-04
7700.00000  7750.00000  4.391329409840e-04
7750.00000  7800.00000  4.151344902648e-04
7800.00000  7850.00000  4.102960929423e-04
7850.00000  7900.00000  4.079736622276e-04
7900.00000  7950.00000  4.112637724068e-04
7950.00000  8000.00000  3.953938291892e-04
8000.00000  8050.00000  3.915231113313e-04
8050.00000  8100.00000  3.977162599040e-04
8100.00000  8150.00000  3.952002932963e-04
8150.00000  8200.00000  3.940390779389e-04
8200.00000  8250.00000  3.926843266887e-04
8250.00000  8300.00000  3.837816756154e-04
8300.00000  8350.00000  3.764273116853e-04
8350.00000  8400.00000  3.742984168634e-04
8400.00000  8450.00000  3.785562065072e-04
8450.00000  8500.00000  3.752660963279e-04
8500.00000  8550.00000  3.630733350754e-04
8550.00000  8600.00000  3.524288609660e-04
8600.00000  8650.00000  3.491387507868e-04
8650.00000  8700.00000  3.499128943584e-04
8700.00000  8750.00000  3.472033918578e-04
8750.00000  8800.00000  3.516547173944e-04
8800.00000  8850.00000  3.439132816785e-04
8850.00000  8900.00000  3.402360997135e-04
8900.00000  8950.00000  3.305593050686e-04
8950.00000  9000.00000  3.427520663212e-04
9000.00000  9050.00000  3.290110179254e-04
9050.00000  9100.00000  3.110121798860e-04
9100.00000  9150.00000  3.212695822096e-04
9150.00000  9200.00000  3.113992516718e-04
9200.00000  9250.00000  3.199148309593e-04
9250.00000  9300.00000  3.071414620280e-04
9300.00000  9350.00000  2.966905238116e-04
9350.00000  9400.00000  3.204954386380e-04
9400.00000  9450.00000  2.947551648826e-04
9450.00000  9500.00000  3.104315722073e-04
9500.00000  9550.00000  3.028836723843e-04
9550.00000  9600.00000  3.094638927428e-04
9600.00000  9650.00000  2.903038393460e-04
9650.00000  9700.00000  2.891426239886e-04
9700.00000  9750.00000  2.941745572039e-04
9750.00000  9800.00000  2.914650547034e-04
9800.00000  9850.00000  2.920456623821e-04
9850.00000  9900.00000  2.713373218420e-04
9900.00000  9950.00000  2.916585905963e-04
9950.00000  10000.00000  2.858525138093e-04
