300.00000  350.00000  7.067340686160e-02
350.00000  400.00000  5.626812562405e-02
400.00000  450.00000  4.605946504318e-02
450.00000  500.00000  3.850260571670e-02
500.00000  550.00000  3.280239439257e-02
550.00000  600.00000  2.827613741938e-02
600.00000  650.00000  2.474343488698e-02
650.00000  700.00000  2.191665346222e-02
700.00000  750.00000  1.954319455847e-02
750.00000  800.00000  1.744440032479e-02
800.00000  850.00000  1.574686039771e-02
850.00000  900.00000  1.440508767541e-02
900.00000  950.00000  1.314093336940e-02
950.00000  1000.00000  1.205156567161e-02
1000.00000  1050.00000  1.116543821594e-02
1050.00000  1100.00000  1.030098971944e-02
1100.00000  1150.00000  9.676364708639e-03
1150.00000  1200.00000  9.015350016395e-03
1200.00000  1250.00000  8.362658495970e-03
1250.00000  1300.00000  7.949790461254e-03
1300.00000  1350.00000  7.327875320351e-03
1350.00000  1400.00000  6.952171215623e-03
1400.00000  1450.00000  6.546464979914e-03
1450.00000  1500.00000  6.234442817718e-03
1500.00000  1550.00000  5.905193625476e-03
1550.00000  1600.00000  5.637690754412e-03
1600.00000  1650.00000  5.304376757327e-03
1650.00000  1700.00000  5.089135662810e-03
1700.00000  1750.00000  4.867507017826e-03
1750.00000  1800.00000  4.599036336086e-03
1800.00000  1850.00000  4.433540710356e-03
1850.00000  1900.00000  4.269787143843e-03
1900.00000  1950.00000  4.020672675639e-03
1950.00000  2000.00000  3.880146565369e-03
2000.00000  2050.00000  3.782397687014e-03
2050.00000  2100.00000  3.602965587538e-03
2100.00000  2150.00000  3.424888423009e-03
2150.00000  2200.00000  3.320364869917e-03
2200.00000  2250.00000  3.166095848037e-03
2250.00000  2300.00000  3.115576130709e-03
2300.00000  2350.00000  2.988405807779e-03
2350.00000  2400.00000  2.885624313904e-03
2400.00000  2450.00000  2.827555673297e-03
2450.00000  2500.00000  2.727290487182e-03
2500.00000  2550.00000  2.623154058360e-03
2550.00000  2600.00000  2.528502174170e-03
2600.00000  2650.00000  2.434624538522e-03
2650.00000  2700.00000  2.351779944589e-03
2700.00000  2750.00000  2.310938334029e-03
2750.00000  2800.00000  2.209318212967e-03
2800.00000  2850.00000  2.159959868450e-03
2850.00000  2900.00000  2.146410518975e-03
2900.00000  2950.00000  2.066469357073e-03
2950.00000  3000.00000  1.984399011682e-03
3000.00000  3050.00000  1.961365117574e-03
3050.00000  3100.00000  1.901554417749e-03
3100.00000  3150.00000  1.838646723758e-03
3150.00000  3200.00000  1.781545893827e-03
3200.00000  3250.00000  1.738381537643e-03
3250.00000  3300.00000  1.705282412497e-03
3300.00000  3350.00000  1.703540353278e-03
3350.00000  3400.00000  1.631148114655e-03
3400.00000  3450.00000  1.588370882741e-03
3450.00000  3500.00000  1.565917675039e-03
3500.00000  3550.00000  1.507461910161e-03
3550.00000  3600.00000  1.480169649076e-03
3600.00000  3650.00000  1.428875683206e-03
3650.00000  3700.00000  1.435650357944e-03
3700.00000  3750.00000  1.409713031806e-03
3750.00000  3800.00000  1.364032367862e-03
3800.00000  3850.00000  1.340030663078e-03
3850.00000  3900.00000  1.299382614653e-03
3900.00000  3950.00000  1.286026827313e-03
3950.00000  4000.00000  1.268025548725e-03
4000.00000  4050.00000  1.259315252634e-03
4050.00000  4100.00000  1.205311416869e-03
4100.00000  4150.00000  1.187697262551e-03
4150.00000  4200.00000  1.169695983963e-03
4200.00000  4250.00000  1.164469806309e-03
4250.00000  4300.00000  1.136596858817e-03
4300.00000  4350.00000  1.096142372528e-03
4350.00000  4400.00000  1.077366845398e-03
4400.00000  4450.00000  1.039815791139e-03
4450.00000  4500.00000  1.035750986296e-03
4500.00000  4550.00000  1.049106773636e-03
4550.00000  4600.00000  1.002071174744e-03
4600.00000  4650.00000  9.651008068908e-04
4650.00000  4700.00000  9.788437185011e-04
4700.00000  4750.00000  9.651008068908e-04
4750.00000  4800.00000  9.285175633083e-04
4800.00000  4850.00000  9.085806633665e-04
4850.00000  4900.00000  8.838047100408e-04
4900.00000  4950.00000  8.656098693172e-04
4950.00000  5000.00000  8.768364731679e-04
5000.00000  5050.00000  8.416081645329e-04
5050.00000  5100.00000  8.176064597486e-04
5100.00000  5150.00000  8.054120452211e-04
5150.00000  5200.00000  8.245746966215e-04
5200.00000  5250.00000  8.108317850111e-04
5250.00000  5300.00000  8.048313588150e-04
5300.00000  5350.00000  7.876043287682e-04
5350.00000  5400.00000  7.670867424204e-04
5400.00000  5450.00000  7.597313812768e-04
5450.00000  5500.00000  7.483112152907e-04
5500.00000  5550.00000  7.330198065975e-04
5550.00000  5600.00000  7.388266706582e-04
5600.00000  5650.00000  7.101794746254e-04
5650.00000  5700.00000  6.848228348936e-04
5700.00000  5750.00000  6.859842077057e-04
5750.00000  5800.00000  6.885005154654e-04
5800.00000  5850.00000  6.732091067722e-04
5850.00000  5900.00000  6.695314262004e-04
5900.00000  5950.00000  6.451425971454e-04
5950.00000  6000.00000  6.728219825015e-04
6000.00000  6050.00000  6.310125612643e-04
6050.00000  6100.00000  6.393357330847e-04
6100.00000  6150.00000  6.221087030379e-04
6150.00000  6200.00000  5.996554953365e-04
6200.00000  6250.00000  5.754602284168e-04
6250.00000  6300.00000  6.116563477286e-04
6300.00000  6350.00000  5.923001341929e-04
6350.00000  6400.00000  5.870739565382e-04
6400.00000  6450.00000  5.522327721740e-04
6450.00000  6500.00000  5.551362042043e-04
6500.00000  6550.00000  5.667499323257e-04
6550.00000  6600.00000  5.690726779500e-04
6600.00000  6650.00000  5.404254819172e-04
6650.00000  6700.00000  5.410061683232e-04
6700.00000  6750.00000  5.247469489532e-04
6750.00000  6800.00000  5.144881557793e-04
6800.00000  6850.00000  5.040358004700e-04
6850.00000  6900.00000  5.019066169811e-04
6900.00000  6950.00000  5.011323684397e-04
6950.00000  7000.00000  4.930027587547e-04
7000.00000  7050.00000  4.908735752657e-04
7050.00000  7100.00000  5.026808655225e-04
7100.00000  7150.00000  4.850667112050e-04
7150.00000  7200.00000  4.871958946939e-04
7200.00000  7250.00000  4.777113500614e-04
7250.00000  7300.00000  4.738401073543e-04
7300.00000  7350.00000  4.645491248572e-04
7350.00000  7400.00000  4.397731715314e-04
7400.00000  7450.00000  4.637748763157e-04
7450.00000  7500.00000  4.467414084043e-04
7500.00000  7550.00000  4.382246744486e-04
7550.00000  7600.00000  4.407409822082e-04
7600.00000  7650.00000  4.488705918932e-04
7650.00000  7700.00000  4.186748987775e-04
7700.00000  7750.00000  4.223525793493e-04
7750.00000  7800.00000  4.153843424764e-04
7800.00000  7850.00000  4.171264016947e-04
7850.00000  7900.00000  4.029963658136e-04
7900.00000  7950.00000  4.103517269572e-04
7950.00000  8000.00000  4.180942123714e-04
8000.00000  8050.00000  3.917697619629e-04
8050.00000  8100.00000  4.066740463854e-04
8100.00000  8150.00000  3.927375726397e-04
8150.00000  8200.00000  3.739620455100e-04
8200.00000  8250.00000  3.762847911343e-04
8250.00000  8300.00000  3.586706368168e-04
8300.00000  8350.00000  3.793817853000e-04
8350.00000  8400.00000  3.666066843664e-04
8400.00000  8450.00000  3.658324358250e-04
8450.00000  8500.00000  3.607998203057e-04
8500.00000  8550.00000  3.544122698389e-04
8550.00000  8600.00000  3.569285775986e-04
8600.00000  8650.00000  3.464762222893e-04
8650.00000  8700.00000  3.625418795239e-04
8700.00000  8750.00000  3.315719378668e-04
8750.00000  8800.00000  3.470569086954e-04
8800.00000  8850.00000  3.383466126043e-04
8850.00000  8900.00000  3.278942572950e-04
8900.00000  8950.00000  3.472504708307e-04
8950.00000  9000.00000  3.307976893254e-04
9000.00000  9050.00000  3.184097126625e-04
9050.00000  9100.00000  3.187968369332e-04
9100.00000  9150.00000  3.143449078200e-04
9150.00000  9200.00000  3.122157243311e-04
9200.00000  9250.00000  3.133770971432e-04
9250.00000  9300.00000  3.056346117289e-04
9300.00000  9350.00000  3.007955583450e-04
9350.00000  9400.00000  3.033118661047e-04
9400.00000  9450.00000  3.133770971432e-04
9450.00000  9500.00000  2.930530729307e-04
9500.00000  9550.00000  3.096994165714e-04
9550.00000  9600.00000  2.961500670964e-04
9600.00000  9650.00000  2.922788243893e-04
9650.00000  9700.00000  2.837620904336e-04
9700.00000  9750.00000  2.905367651711e-04
9750.00000  9800.00000  2.959565049611e-04
9800.00000  9850.00000  2.775681021022e-04
9850.00000  9900.00000  2.748582322072e-04
9900.00000  9950.00000  2.839556525689e-04
9950.00000  10000.00000  2.870526467347e-04
