10001.00000  11001.00000  2.011741588854e-04
11001.00000  12001.00000  1.817247401123e-04
12001.00000  13001.00000  1.600609662605e-04
13001.00000  14001.00000  1.379543213931e-04
14001.00000  15001.00000  1.231181423669e-04
15001.00000  16001.00000  1.069164443756e-04
16001.00000  17001.00000  9.060402863030e-05
17001.00000  18001.00000  8.565863562156e-05
18001.00000  19001.00000  7.244631698626e-05
19001.00000  20001.00000  6.506513339113e-05
20001.00000  21001.00000  5.653986633875e-05
21001.00000  22001.00000  5.281236862320e-05
22001.00000  23001.00000  4.657526848531e-05
23001.00000  24001.00000  4.498831401236e-05
24001.00000  25001.00000  3.808690735090e-05
25001.00000  26001.00000  3.317842026014e-05
26001.00000  27001.00000  3.262483149050e-05
27001.00000  28001.00000  2.801159174354e-05
28001.00000  29001.00000  2.594486033690e-05
29001.00000  30001.00000  2.288166914492e-05
30001.00000  31001.00000  2.432099994597e-05
31001.00000  32001.00000  2.088874957424e-05
32001.00000  33001.00000  1.889583000355e-05
33001.00000  34001.00000  1.819461756201e-05
34001.00000  35001.00000  1.716125185869e-05
35001.00000  36001.00000  1.505761453408e-05
36001.00000  37001.00000  1.527905004193e-05
37001.00000  38001.00000  1.328613047125e-05
38001.00000  39001.00000  1.402424883076e-05
39001.00000  40001.00000  1.225276476793e-05
40001.00000  41001.00000  1.096105763878e-05
41001.00000  42001.00000  8.857420314164e-06
42001.00000  43001.00000  1.007531560736e-05
43001.00000  44001.00000  1.018603336129e-05
44001.00000  45001.00000  9.780068263556e-06
45001.00000  46001.00000  9.078855822018e-06
46001.00000  47001.00000  7.860960528820e-06
47001.00000  48001.00000  6.716877071574e-06
48001.00000  49001.00000  7.307371759185e-06
49001.00000  50001.00000  7.012124415380e-06
50001.00000  51001.00000  6.679971153599e-06
51001.00000  52001.00000  6.274006055866e-06
52001.00000  53001.00000  6.163288301939e-06
53001.00000  54001.00000  5.904946876109e-06
54001.00000  55001.00000  5.462075860401e-06
55001.00000  56001.00000  4.613239746960e-06
56001.00000  57001.00000  5.129922598620e-06
57001.00000  58001.00000  4.945393008741e-06
58001.00000  59001.00000  4.354898321131e-06
59001.00000  60001.00000  4.723957500887e-06
60001.00000  61001.00000  4.096556895301e-06
61001.00000  62001.00000  4.391804239106e-06
62001.00000  63001.00000  3.469156289714e-06
63001.00000  64001.00000  3.247720781860e-06
64001.00000  65001.00000  2.620320176273e-06
65001.00000  66001.00000  3.100097109957e-06
66001.00000  67001.00000  2.435790586395e-06
67001.00000  68001.00000  3.432250371738e-06
68001.00000  69001.00000  2.731037930201e-06
69001.00000  70001.00000  3.063191191982e-06
70001.00000  71001.00000  2.804849766152e-06
71001.00000  72001.00000  2.251260996517e-06
72001.00000  73001.00000  2.103637324614e-06
73001.00000  74001.00000  2.177449160565e-06
74001.00000  75001.00000  2.214355078541e-06
75001.00000  76001.00000  1.992919570687e-06
76001.00000  77001.00000  2.509602422346e-06
77001.00000  78001.00000  1.845295898784e-06
78001.00000  79001.00000  1.734578144857e-06
79001.00000  80001.00000  2.177449160565e-06
80001.00000  81001.00000  1.476236719027e-06
81001.00000  82001.00000  1.845295898784e-06
82001.00000  83001.00000  1.956013652711e-06
83001.00000  84001.00000  1.845295898784e-06
84001.00000  85001.00000  1.402424883076e-06
85001.00000  86001.00000  1.217895293198e-06
86001.00000  87001.00000  1.439330801052e-06
87001.00000  88001.00000  1.623860390930e-06
88001.00000  89001.00000  1.365518965100e-06
89001.00000  90001.00000  1.217895293198e-06
90001.00000  91001.00000  1.291707129149e-06
91001.00000  92001.00000  1.328613047125e-06
92001.00000  93001.00000  1.070271621295e-06
93001.00000  94001.00000  1.180989375222e-06
94001.00000  95001.00000  1.291707129149e-06
95001.00000  96001.00000  1.254801211173e-06
96001.00000  97001.00000  1.254801211173e-06
97001.00000  98001.00000  1.107177539270e-06
98001.00000  99001.00000  1.217895293198e-06
99001.00000  100001.00000  8.119301954650e-07
100001.00000  101001.00000  8.488361134407e-07
101001.00000  102001.00000  1.328613047125e-06
102001.00000  103001.00000  8.119301954650e-07
103001.00000  104001.00000  1.107177539270e-06
104001.00000  105001.00000  8.857420314164e-07
105001.00000  106001.00000  1.033365703319e-06
106001.00000  107001.00000  1.107177539270e-06
107001.00000  108001.00000  5.166828516596e-07
108001.00000  109001.00000  8.488361134407e-07
109001.00000  110001.00000  1.107177539270e-06
110001.00000  111001.00000  7.381183595137e-07
111001.00000  112001.00000  8.119301954650e-07
112001.00000  113001.00000  6.274006055866e-07
113001.00000  114001.00000  5.166828516596e-07
114001.00000  115001.00000  6.643065235623e-07
115001.00000  116001.00000  6.274006055866e-07
116001.00000  117001.00000  5.166828516596e-07
117001.00000  118001.00000  7.381183595137e-07
118001.00000  119001.00000  5.166828516596e-07
119001.00000  120001.00000  6.643065235623e-07
120001.00000  121001.00000  5.166828516596e-07
121001.00000  122001.00000  6.643065235623e-07
122001.00000  123001.00000  4.428710157082e-07
123001.00000  124001.00000  6.643065235623e-07
124001.00000  125001.00000  8.119301954650e-07
125001.00000  126001.00000  5.904946876109e-07
126001.00000  127001.00000  4.428710157082e-07
127001.00000  128001.00000  3.690591797568e-07
128001.00000  129001.00000  5.535887696352e-07
129001.00000  130001.00000  5.904946876109e-07
130001.00000  131001.00000  5.904946876109e-07
131001.00000  132001.00000  4.428710157082e-07
132001.00000  133001.00000  3.321532617811e-07
133001.00000  134001.00000  5.166828516596e-07
134001.00000  135001.00000  2.952473438055e-07
135001.00000  136001.00000  2.952473438055e-07
136001.00000  137001.00000  4.428710157082e-07
137001.00000  138001.00000  2.214355078541e-07
138001.00000  139001.00000  5.535887696352e-07
139001.00000  140001.00000  3.321532617811e-07
140001.00000  141001.00000  4.797769336839e-07
141001.00000  142001.00000  4.797769336839e-07
142001.00000  143001.00000  5.166828516596e-07
143001.00000  144001.00000  4.428710157082e-07
144001.00000  145001.00000  5.904946876109e-07
145001.00000  146001.00000  1.845295898784e-07
146001.00000  147001.00000  3.321532617811e-07
147001.00000  148001.00000  3.690591797568e-07
148001.00000  149001.00000  1.476236719027e-07
149001.00000  150001.00000  3.690591797568e-07
150001.00000  151001.00000  1.476236719027e-07
151001.00000  152001.00000  1.845295898784e-07
152001.00000  153001.00000  4.059650977325e-07
153001.00000  154001.00000  3.321532617811e-07
154001.00000  155001.00000  1.845295898784e-07
155001.00000  156001.00000  1.476236719027e-07
156001.00000  157001.00000  2.214355078541e-07
157001.00000  158001.00000  1.476236719027e-07
158001.00000  159001.00000  2.583414258298e-07
159001.00000  160001.00000  4.059650977325e-07
160001.00000  161001.00000  2.214355078541e-07
161001.00000  162001.00000  2.583414258298e-07
162001.00000  163001.00000  1.845295898784e-07
163001.00000  164001.00000  3.690591797568e-08
164001.00000  165001.00000  2.214355078541e-07
165001.00000  166001.00000  2.214355078541e-07
166001.00000  167001.00000  2.583414258298e-07
167001.00000  168001.00000  1.845295898784e-07
168001.00000  169001.00000  2.214355078541e-07
169001.00000  170001.00000  7.381183595137e-08
170001.00000  171001.00000  2.583414258298e-07
171001.00000  172001.00000  1.845295898784e-07
172001.00000  173001.00000  1.107177539270e-07
173001.00000  174001.00000  2.583414258298e-07
174001.00000  175001.00000  1.845295898784e-07
175001.00000  176001.00000  1.845295898784e-07
176001.00000  177001.00000  2.583414258298e-07
177001.00000  178001.00000  2.214355078541e-07
178001.00000  179001.00000  4.797769336839e-07
179001.00000  180001.00000  2.214355078541e-07
180001.00000  181001.00000  1.845295898784e-07
181001.00000  182001.00000  2.583414258298e-07
182001.00000  183001.00000  1.107177539270e-07
183001.00000  184001.00000  1.107177539270e-07
184001.00000  185001.00000  1.107177539270e-07
185001.00000  186001.00000  1.476236719027e-07
186001.00000  187001.00000  3.690591797568e-08
187001.00000  188001.00000  1.107177539270e-07
188001.00000  189001.00000  3.690591797568e-08
189001.00000  190001.00000  1.107177539270e-07
190001.00000  191001.00000  1.476236719027e-07
191001.00000  192001.00000  1.845295898784e-07
192001.00000  193001.00000  1.845295898784e-07
193001.00000  194001.00000  1.845295898784e-07
194001.00000  195001.00000  1.107177539270e-07
195001.00000  196001.00000  2.583414258298e-07
196001.00000  197001.00000  0.000000000000e+00
197001.00000  198001.00000  7.381183595137e-08
198001.00000  199001.00000  1.107177539270e-07
