10001.00000  11001.00000  1.738085771683e-04
11001.00000  12001.00000  1.533250009287e-04
12001.00000  13001.00000  1.334450664251e-04
13001.00000  14001.00000  1.156577566061e-04
14001.00000  15001.00000  9.867530243495e-05
15001.00000  16001.00000  8.945970526627e-05
16001.00000  17001.00000  7.300040726632e-05
17001.00000  18001.00000  6.306044001451e-05
18001.00000  19001.00000  5.585698196563e-05
19001.00000  20001.00000  4.668162757934e-05
20001.00000  21001.00000  4.185249369182e-05
21001.00000  22001.00000  3.798918658181e-05
22001.00000  23001.00000  3.360272330065e-05
23001.00000  24001.00000  2.973941619063e-05
24001.00000  25001.00000  2.430664056717e-05
25001.00000  26001.00000  2.177134527623e-05
26001.00000  27001.00000  2.088600406352e-05
27001.00000  28001.00000  1.851167990215e-05
28001.00000  29001.00000  1.883362216132e-05
29001.00000  30001.00000  1.505080061610e-05
30001.00000  31001.00000  1.501055783370e-05
31001.00000  32001.00000  1.203259193640e-05
32001.00000  33001.00000  1.191186358921e-05
33001.00000  34001.00000  9.980210034204e-06
34001.00000  35001.00000  9.618024992640e-06
35001.00000  36001.00000  7.887585349613e-06
36001.00000  37001.00000  7.283943613673e-06
37001.00000  38001.00000  7.122972484089e-06
38001.00000  39001.00000  6.277874053774e-06
39001.00000  40001.00000  6.116902924190e-06
40001.00000  41001.00000  6.157145706586e-06
41001.00000  42001.00000  4.869376669914e-06
42001.00000  43001.00000  3.742578762827e-06
43001.00000  44001.00000  4.386463281162e-06
44001.00000  45001.00000  3.903549892411e-06
45001.00000  46001.00000  2.977965897303e-06
46001.00000  47001.00000  2.816994767719e-06
47001.00000  48001.00000  2.897480332511e-06
48001.00000  49001.00000  2.977965897303e-06
49001.00000  50001.00000  3.138937026887e-06
50001.00000  51001.00000  1.891410772611e-06
51001.00000  52001.00000  2.253595814175e-06
52001.00000  53001.00000  1.770682425423e-06
53001.00000  54001.00000  1.609711295839e-06
54001.00000  55001.00000  2.173110249383e-06
55001.00000  56001.00000  1.770682425423e-06
56001.00000  57001.00000  1.810925207819e-06
57001.00000  58001.00000  1.690196860631e-06
58001.00000  59001.00000  1.770682425423e-06
59001.00000  60001.00000  1.488982948651e-06
60001.00000  61001.00000  1.328011819067e-06
61001.00000  62001.00000  1.247526254276e-06
62001.00000  63001.00000  1.086555124692e-06
63001.00000  64001.00000  8.048556479197e-07
64001.00000  65001.00000  1.086555124692e-06
65001.00000  66001.00000  6.438845183358e-07
66001.00000  67001.00000  1.167040689484e-06
67001.00000  68001.00000  5.633989535438e-07
68001.00000  69001.00000  1.086555124692e-06
69001.00000  70001.00000  8.450984303157e-07
70001.00000  71001.00000  5.633989535438e-07
71001.00000  72001.00000  6.841273007317e-07
72001.00000  73001.00000  4.426706063558e-07
73001.00000  74001.00000  6.438845183358e-07
74001.00000  75001.00000  4.426706063558e-07
75001.00000  76001.00000  4.426706063558e-07
76001.00000  77001.00000  2.816994767719e-07
77001.00000  78001.00000  6.438845183358e-07
78001.00000  79001.00000  3.219422591679e-07
79001.00000  80001.00000  2.816994767719e-07
80001.00000  81001.00000  4.426706063558e-07
81001.00000  82001.00000  3.219422591679e-07
82001.00000  83001.00000  4.829133887518e-07
83001.00000  84001.00000  2.012139119799e-07
84001.00000  85001.00000  1.609711295839e-07
85001.00000  86001.00000  1.609711295839e-07
86001.00000  87001.00000  3.621850415639e-07
87001.00000  88001.00000  2.816994767719e-07
88001.00000  89001.00000  3.219422591679e-07
89001.00000  90001.00000  1.609711295839e-07
90001.00000  91001.00000  0.000000000000e+00
91001.00000  92001.00000  4.024278239598e-08
92001.00000  93001.00000  4.024278239598e-08
93001.00000  94001.00000  2.012139119799e-07
94001.00000  95001.00000  0.000000000000e+00
95001.00000  96001.00000  1.207283471880e-07
96001.00000  97001.00000  1.609711295839e-07
97001.00000  98001.00000  8.048556479197e-08
98001.00000  99001.00000  1.207283471880e-07
99001.00000  100001.00000  1.609711295839e-07
100001.00000  101001.00000  0.000000000000e+00
101001.00000  102001.00000  8.048556479197e-08
102001.00000  103001.00000  1.609711295839e-07
103001.00000  104001.00000  0.000000000000e+00
104001.00000  105001.00000  0.000000000000e+00
105001.00000  106001.00000  4.024278239598e-08
106001.00000  107001.00000  8.048556479197e-08
107001.00000  108001.00000  1.207283471880e-07
108001.00000  109001.00000  0.000000000000e+00
109001.00000  110001.00000  1.207283471880e-07
110001.00000  111001.00000  0.000000000000e+00
111001.00000  112001.00000  8.048556479197e-08
112001.00000  113001.00000  1.207283471880e-07
113001.00000  114001.00000  1.207283471880e-07
114001.00000  115001.00000  4.024278239598e-08
115001.00000  116001.00000  0.000000000000e+00
116001.00000  117001.00000  1.207283471880e-07
117001.00000  118001.00000  0.000000000000e+00
118001.00000  119001.00000  4.024278239598e-08
119001.00000  120001.00000  8.048556479197e-08
120001.00000  121001.00000  4.024278239598e-08
121001.00000  122001.00000  8.048556479197e-08
122001.00000  123001.00000  4.024278239598e-08
123001.00000  124001.00000  1.207283471880e-07
124001.00000  125001.00000  8.048556479197e-08
125001.00000  126001.00000  0.000000000000e+00
126001.00000  127001.00000  8.048556479197e-08
127001.00000  128001.00000  1.609711295839e-07
128001.00000  129001.00000  8.048556479197e-08
129001.00000  130001.00000  0.000000000000e+00
130001.00000  131001.00000  1.609711295839e-07
131001.00000  132001.00000  4.024278239598e-08
132001.00000  133001.00000  0.000000000000e+00
133001.00000  134001.00000  8.048556479197e-08
134001.00000  135001.00000  8.048556479197e-08
135001.00000  136001.00000  4.024278239598e-08
136001.00000  137001.00000  0.000000000000e+00
137001.00000  138001.00000  0.000000000000e+00
138001.00000  139001.00000  0.000000000000e+00
139001.00000  140001.00000  0.000000000000e+00
140001.00000  141001.00000  1.609711295839e-07
141001.00000  142001.00000  0.000000000000e+00
142001.00000  143001.00000  8.048556479197e-08
143001.00000  144001.00000  0.000000000000e+00
144001.00000  145001.00000  4.024278239598e-08
145001.00000  146001.00000  4.024278239598e-08
146001.00000  147001.00000  4.024278239598e-08
147001.00000  148001.00000  0.000000000000e+00
148001.00000  149001.00000  4.024278239598e-08
149001.00000  150001.00000  4.024278239598e-08
150001.00000  151001.00000  0.000000000000e+00
151001.00000  152001.00000  0.000000000000e+00
152001.00000  153001.00000  8.048556479197e-08
153001.00000  154001.00000  8.048556479197e-08
154001.00000  155001.00000  0.000000000000e+00
155001.00000  156001.00000  0.000000000000e+00
156001.00000  157001.00000  0.000000000000e+00
157001.00000  158001.00000  0.000000000000e+00
158001.00000  159001.00000  4.024278239598e-08
159001.00000  160001.00000  0.000000000000e+00
160001.00000  161001.00000  0.000000000000e+00
161001.00000  162001.00000  4.024278239598e-08
162001.00000  163001.00000  0.000000000000e+00
163001.00000  164001.00000  4.024278239598e-08
164001.00000  165001.00000  0.000000000000e+00
165001.00000  166001.00000  0.000000000000e+00
166001.00000  167001.00000  0.000000000000e+00
167001.00000  168001.00000  0.000000000000e+00
168001.00000  169001.00000  4.024278239598e-08
169001.00000  170001.00000  0.000000000000e+00
170001.00000  171001.00000  4.024278239598e-08
171001.00000  172001.00000  0.000000000000e+00
172001.00000  173001.00000  0.000000000000e+00
173001.00000  174001.00000  0.000000000000e+00
174001.00000  175001.00000  0.000000000000e+00
175001.00000  176001.00000  0.000000000000e+00
176001.00000  177001.00000  0.000000000000e+00
177001.00000  178001.00000  4.024278239598e-08
178001.00000  179001.00000  0.000000000000e+00
179001.00000  180001.00000  4.024278239598e-08
180001.00000  181001.00000  4.024278239598e-08
181001.00000  182001.00000  4.024278239598e-08
182001.00000  183001.00000  0.000000000000e+00
183001.00000  184001.00000  0.000000000000e+00
184001.00000  185001.00000  0.000000000000e+00
185001.00000  186001.00000  0.000000000000e+00
186001.00000  187001.00000  0.000000000000e+00
187001.00000  188001.00000  0.000000000000e+00
188001.00000  189001.00000  4.024278239598e-08
189001.00000  190001.00000  0.000000000000e+00
190001.00000  191001.00000  4.024278239598e-08
191001.00000  192001.00000  0.000000000000e+00
192001.00000  193001.00000  4.024278239598e-08
193001.00000  194001.00000  0.000000000000e+00
194001.00000  195001.00000  0.000000000000e+00
195001.00000  196001.00000  0.000000000000e+00
196001.00000  197001.00000  0.000000000000e+00
197001.00000  198001.00000  0.000000000000e+00
198001.00000  199001.00000  0.000000000000e+00
