300.00000  350.00000  2.757719832792e-05
350.00000  400.00000  3.724712501433e-05
400.00000  450.00000  2.399574399961e-05
450.00000  500.00000  2.793534376075e-05
500.00000  550.00000  1.858774796388e-04
550.00000  600.00000  1.432581731320e-05
600.00000  650.00000  5.014036059621e-05
650.00000  700.00000  3.008421635773e-05
700.00000  750.00000  3.366567068603e-05
750.00000  800.00000  2.721905289508e-05
800.00000  850.00000  1.120995204758e-04
850.00000  900.00000  2.757719832792e-05
900.00000  950.00000  2.542832573093e-05
950.00000  1000.00000  2.507018029810e-05
1000.00000  1050.00000  3.044236179056e-05
1050.00000  1100.00000  2.829348919358e-05
1100.00000  1150.00000  2.542832573093e-05
1150.00000  1200.00000  3.688897958150e-05
1200.00000  1250.00000  2.793534376075e-05
1250.00000  1300.00000  6.518246877507e-05
1300.00000  1350.00000  3.115865265622e-05
1350.00000  1400.00000  2.829348919358e-05
1400.00000  1450.00000  3.438196155169e-05
1450.00000  1500.00000  2.650276202942e-05
1500.00000  1550.00000  2.578647116376e-05
1550.00000  1600.00000  2.399574399961e-05
1600.00000  1650.00000  2.650276202942e-05
1650.00000  1700.00000  3.330752525320e-05
1700.00000  1750.00000  6.410803247658e-05
1750.00000  1800.00000  2.292130770112e-05
1800.00000  1850.00000  2.865163462641e-05
1850.00000  1900.00000  2.256316226829e-05
1900.00000  1950.00000  2.113058053697e-05
1950.00000  2000.00000  2.220501683546e-05
2000.00000  2050.00000  2.972607092490e-05
2050.00000  2100.00000  2.327945313395e-05
2100.00000  2150.00000  2.077243510414e-05
2150.00000  2200.00000  2.757719832792e-05
2200.00000  2250.00000  2.614461659659e-05
2250.00000  2300.00000  2.686090746225e-05
2300.00000  2350.00000  5.264737862602e-05
2350.00000  2400.00000  2.220501683546e-05
2400.00000  2450.00000  2.972607092490e-05
2450.00000  2500.00000  2.686090746225e-05
2500.00000  2550.00000  2.256316226829e-05
2550.00000  2600.00000  1.826541707433e-05
2600.00000  2650.00000  2.256316226829e-05
2650.00000  2700.00000  2.686090746225e-05
2700.00000  2750.00000  2.435388943244e-05
2750.00000  2800.00000  2.507018029810e-05
2800.00000  2850.00000  2.399574399961e-05
2850.00000  2900.00000  1.933985337282e-05
2900.00000  2950.00000  2.184687140263e-05
2950.00000  3000.00000  3.366567068603e-05
3000.00000  3050.00000  1.360952644754e-05
3050.00000  3100.00000  2.435388943244e-05
3100.00000  3150.00000  2.363759856678e-05
3150.00000  3200.00000  2.292130770112e-05
3200.00000  3250.00000  2.542832573093e-05
3250.00000  3300.00000  1.790727164150e-05
3300.00000  3350.00000  2.757719832792e-05
3350.00000  3400.00000  1.540025361169e-05
3400.00000  3450.00000  2.220501683546e-05
3450.00000  3500.00000  1.611654447735e-05
3500.00000  3550.00000  2.256316226829e-05
3550.00000  3600.00000  1.898170793999e-05
3600.00000  3650.00000  1.898170793999e-05
3650.00000  3700.00000  2.220501683546e-05
3700.00000  3750.00000  1.683283534301e-05
3750.00000  3800.00000  1.396767188037e-05
3800.00000  3850.00000  2.184687140263e-05
3850.00000  3900.00000  1.647468991018e-05
3900.00000  3950.00000  1.253509014905e-05
3950.00000  4000.00000  1.540025361169e-05
4000.00000  4050.00000  1.683283534301e-05
4050.00000  4100.00000  1.826541707433e-05
4100.00000  4150.00000  1.325138101471e-05
4150.00000  4200.00000  1.683283534301e-05
4200.00000  4250.00000  2.077243510414e-05
4250.00000  4300.00000  2.148872596980e-05
4300.00000  4350.00000  2.005614423848e-05
4350.00000  4400.00000  1.432581731320e-05
4400.00000  4450.00000  1.790727164150e-05
4450.00000  4500.00000  1.002807211924e-05
4500.00000  4550.00000  1.253509014905e-05
4550.00000  4600.00000  1.360952644754e-05
4600.00000  4650.00000  1.253509014905e-05
4650.00000  4700.00000  1.217694471622e-05
4700.00000  4750.00000  1.468396274603e-05
4750.00000  4800.00000  1.396767188037e-05
4800.00000  4850.00000  1.504210817886e-05
4850.00000  4900.00000  1.754912620867e-05
4900.00000  4950.00000  1.038621755207e-05
4950.00000  5000.00000  1.038621755207e-05
5000.00000  5050.00000  1.575839904452e-05
5050.00000  5100.00000  1.074436298490e-05
5100.00000  5150.00000  1.110250841773e-05
5150.00000  5200.00000  1.074436298490e-05
5200.00000  5250.00000  1.432581731320e-05
5250.00000  5300.00000  1.146065385056e-05
5300.00000  5350.00000  8.595490387922e-06
5350.00000  5400.00000  1.181879928339e-05
5400.00000  5450.00000  8.953635820752e-06
5450.00000  5500.00000  1.110250841773e-05
5500.00000  5550.00000  1.289323558188e-05
5550.00000  5600.00000  8.953635820752e-06
5600.00000  5650.00000  1.110250841773e-05
5650.00000  5700.00000  1.181879928339e-05
5700.00000  5750.00000  6.446617790941e-06
5750.00000  5800.00000  1.146065385056e-05
5800.00000  5850.00000  9.311781253582e-06
5850.00000  5900.00000  9.311781253582e-06
5900.00000  5950.00000  1.038621755207e-05
5950.00000  6000.00000  7.162908656601e-06
6000.00000  6050.00000  8.953635820752e-06
6050.00000  6100.00000  8.237344955092e-06
6100.00000  6150.00000  1.002807211924e-05
6150.00000  6200.00000  6.088472358111e-06
6200.00000  6250.00000  5.730326925281e-06
6250.00000  6300.00000  8.953635820752e-06
6300.00000  6350.00000  8.595490387922e-06
6350.00000  6400.00000  8.595490387922e-05
6400.00000  6450.00000  8.595490387922e-06
6450.00000  6500.00000  6.446617790941e-06
6500.00000  6550.00000  6.088472358111e-06
6550.00000  6600.00000  1.002807211924e-05
6600.00000  6650.00000  8.953635820752e-06
6650.00000  6700.00000  5.372181492451e-06
6700.00000  6750.00000  7.521054089431e-06
6750.00000  6800.00000  5.372181492451e-06
6800.00000  6850.00000  7.162908656601e-06
6850.00000  6900.00000  6.804763223771e-06
6900.00000  6950.00000  6.804763223771e-06
6950.00000  7000.00000  5.730326925281e-06
7000.00000  7050.00000  6.088472358111e-06
7050.00000  7100.00000  1.683283534301e-05
7100.00000  7150.00000  6.804763223771e-06
7150.00000  7200.00000  7.879199522261e-06
7200.00000  7250.00000  6.088472358111e-06
7250.00000  7300.00000  5.372181492451e-06
7300.00000  7350.00000  6.446617790941e-06
7350.00000  7400.00000  3.939599761131e-06
7400.00000  7450.00000  4.655890626791e-06
7450.00000  7500.00000  7.879199522261e-06
7500.00000  7550.00000  6.804763223771e-06
7550.00000  7600.00000  6.804763223771e-06
7600.00000  7650.00000  5.372181492451e-06
7650.00000  7700.00000  6.088472358111e-06
7700.00000  7750.00000  5.372181492451e-06
7750.00000  7800.00000  2.507018029810e-06
7800.00000  7850.00000  3.939599761131e-06
7850.00000  7900.00000  6.088472358111e-06
7900.00000  7950.00000  3.939599761131e-06
7950.00000  8000.00000  5.014036059621e-06
8000.00000  8050.00000  3.939599761131e-06
8050.00000  8100.00000  5.014036059621e-06
8100.00000  8150.00000  6.088472358111e-06
8150.00000  8200.00000  6.446617790941e-06
8200.00000  8250.00000  3.939599761131e-06
8250.00000  8300.00000  3.939599761131e-06
8300.00000  8350.00000  2.865163462641e-06
8350.00000  8400.00000  3.581454328301e-06
8400.00000  8450.00000  5.730326925281e-06
8450.00000  8500.00000  2.865163462641e-06
8500.00000  8550.00000  4.297745193961e-06
8550.00000  8600.00000  5.014036059621e-06
8600.00000  8650.00000  4.655890626791e-06
8650.00000  8700.00000  2.507018029810e-06
8700.00000  8750.00000  3.939599761131e-06
8750.00000  8800.00000  5.014036059621e-06
8800.00000  8850.00000  3.939599761131e-06
8850.00000  8900.00000  4.655890626791e-06
8900.00000  8950.00000  4.655890626791e-06
8950.00000  9000.00000  2.148872596980e-06
9000.00000  9050.00000  2.865163462641e-06
9050.00000  9100.00000  3.581454328301e-06
9100.00000  9150.00000  3.223308895471e-06
9150.00000  9200.00000  5.014036059621e-06
9200.00000  9250.00000  5.372181492451e-06
9250.00000  9300.00000  6.446617790941e-06
9300.00000  9350.00000  2.148872596980e-06
9350.00000  9400.00000  5.014036059621e-06
9400.00000  9450.00000  2.507018029810e-06
9450.00000  9500.00000  5.372181492451e-06
9500.00000  9550.00000  4.297745193961e-06
9550.00000  9600.00000  2.148872596980e-06
9600.00000  9650.00000  3.223308895471e-06
9650.00000  9700.00000  2.507018029810e-06
9700.00000  9750.00000  1.790727164150e-06
9750.00000  9800.00000  4.655890626791e-06
9800.00000  9850.00000  2.865163462641e-06
9850.00000  9900.00000  3.939599761131e-06
9900.00000  9950.00000  4.655890626791e-06
9950.00000  10000.00000  2.865163462641e-06
