10001.00000  11001.00000  2.739508141060e-04
11001.00000  12001.00000  2.241206513217e-04
12001.00000  13001.00000  1.832092821074e-04
13001.00000  14001.00000  1.529237443721e-04
14001.00000  15001.00000  1.310199545724e-04
15001.00000  16001.00000  1.116479513345e-04
16001.00000  17001.00000  9.530641989026e-05
17001.00000  18001.00000  8.211044144701e-05
18001.00000  19001.00000  7.186821399252e-05
19001.00000  20001.00000  6.400433149000e-05
20001.00000  21001.00000  5.495127651149e-05
21001.00000  22001.00000  5.006032519895e-05
22001.00000  23001.00000  4.334725476997e-05
23001.00000  24001.00000  3.949203432362e-05
24001.00000  25001.00000  3.598205749932e-05
25001.00000  26001.00000  3.107192598555e-05
26001.00000  27001.00000  2.972931189976e-05
27001.00000  28001.00000  2.593163205708e-05
28001.00000  29001.00000  2.430131495290e-05
29001.00000  30001.00000  2.221067301930e-05
30001.00000  31001.00000  1.964052605507e-05
31001.00000  32001.00000  1.758824452392e-05
32001.00000  33001.00000  1.595792741974e-05
33001.00000  34001.00000  1.542088178542e-05
34001.00000  35001.00000  1.494137675478e-05
35001.00000  36001.00000  1.235204958932e-05
36001.00000  37001.00000  1.198762576603e-05
37001.00000  38001.00000  1.041484926553e-05
38001.00000  39001.00000  1.006960564347e-05
39001.00000  40001.00000  9.264037191990e-06
40001.00000  41001.00000  8.420108338061e-06
41001.00000  42001.00000  7.480278478004e-06
42001.00000  43001.00000  7.115854654717e-06
43001.00000  44001.00000  6.713070428978e-06
44001.00000  45001.00000  6.713070428978e-06
45001.00000  46001.00000  5.849961373824e-06
46001.00000  47001.00000  5.907501977501e-06
47001.00000  48001.00000  5.466357349311e-06
48001.00000  49001.00000  4.948491916218e-06
49001.00000  50001.00000  5.025212721121e-06
50001.00000  51001.00000  4.584068092931e-06
51001.00000  52001.00000  4.411446281900e-06
52001.00000  53001.00000  3.452436220617e-06
53001.00000  54001.00000  3.931941251258e-06
54001.00000  55001.00000  3.605877830422e-06
55001.00000  56001.00000  2.953750988750e-06
56001.00000  57001.00000  3.414075818166e-06
57001.00000  58001.00000  3.068832196104e-06
58001.00000  59001.00000  2.723588574042e-06
59001.00000  60001.00000  2.646867769140e-06
60001.00000  61001.00000  2.339984549529e-06
61001.00000  62001.00000  2.167362738499e-06
62001.00000  63001.00000  1.898839921339e-06
63001.00000  64001.00000  1.764578512760e-06
64001.00000  65001.00000  1.611136902955e-06
65001.00000  66001.00000  1.937200323791e-06
66001.00000  67001.00000  1.496055695601e-06
67001.00000  68001.00000  1.572776500503e-06
68001.00000  69001.00000  1.707037909083e-06
69001.00000  70001.00000  1.361794287021e-06
70001.00000  71001.00000  1.304253683344e-06
71001.00000  72001.00000  1.265893280893e-06
72001.00000  73001.00000  9.014694576056e-07
73001.00000  74001.00000  1.131631872313e-06
74001.00000  75001.00000  1.035730866185e-06
75001.00000  76001.00000  9.398298600569e-07
76001.00000  77001.00000  1.016550664960e-06
77001.00000  78001.00000  7.863882502517e-07
78001.00000  79001.00000  8.247486527030e-07
79001.00000  80001.00000  1.074091268636e-06
80001.00000  81001.00000  9.398298600569e-07
81001.00000  82001.00000  6.904872441234e-07
82001.00000  83001.00000  8.055684514773e-07
83001.00000  84001.00000  7.288476465747e-07
84001.00000  85001.00000  7.096674453491e-07
85001.00000  86001.00000  7.096674453491e-07
86001.00000  87001.00000  7.863882502517e-07
87001.00000  88001.00000  6.329466404465e-07
88001.00000  89001.00000  7.096674453491e-07
89001.00000  90001.00000  6.521268416721e-07
90001.00000  91001.00000  4.795050306413e-07
91001.00000  92001.00000  4.027842257387e-07
92001.00000  93001.00000  3.836040245130e-07
93001.00000  94001.00000  4.603248294156e-07
94001.00000  95001.00000  3.260634208361e-07
95001.00000  96001.00000  4.603248294156e-07
96001.00000  97001.00000  3.452436220617e-07
97001.00000  98001.00000  3.644238232874e-07
98001.00000  99001.00000  3.836040245130e-07
99001.00000  100001.00000  2.877030183848e-07
100001.00000  101001.00000  3.452436220617e-07
101001.00000  102001.00000  3.068832196104e-07
102001.00000  103001.00000  2.493426159335e-07
103001.00000  104001.00000  1.918020122565e-07
104001.00000  105001.00000  3.068832196104e-07
105001.00000  106001.00000  1.726218110309e-07
106001.00000  107001.00000  1.726218110309e-07
107001.00000  108001.00000  2.493426159335e-07
108001.00000  109001.00000  2.301624147078e-07
109001.00000  110001.00000  2.493426159335e-07
110001.00000  111001.00000  1.918020122565e-07
111001.00000  112001.00000  3.260634208361e-07
112001.00000  113001.00000  7.672080490260e-08
113001.00000  114001.00000  1.918020122565e-07
114001.00000  115001.00000  2.109822134822e-07
115001.00000  116001.00000  1.726218110309e-07
116001.00000  117001.00000  2.109822134822e-07
117001.00000  118001.00000  1.342614085796e-07
118001.00000  119001.00000  9.590100612826e-08
119001.00000  120001.00000  1.726218110309e-07
120001.00000  121001.00000  1.726218110309e-07
121001.00000  122001.00000  1.534416098052e-07
122001.00000  123001.00000  5.754060367695e-08
123001.00000  124001.00000  1.342614085796e-07
124001.00000  125001.00000  1.150812073539e-07
125001.00000  126001.00000  9.590100612826e-08
126001.00000  127001.00000  1.342614085796e-07
127001.00000  128001.00000  9.590100612826e-08
128001.00000  129001.00000  1.342614085796e-07
129001.00000  130001.00000  1.150812073539e-07
130001.00000  131001.00000  3.836040245130e-08
131001.00000  132001.00000  3.836040245130e-08
132001.00000  133001.00000  5.754060367695e-08
133001.00000  134001.00000  1.918020122565e-08
134001.00000  135001.00000  5.754060367695e-08
135001.00000  136001.00000  1.342614085796e-07
136001.00000  137001.00000  3.836040245130e-08
137001.00000  138001.00000  1.918020122565e-08
138001.00000  139001.00000  5.754060367695e-08
139001.00000  140001.00000  1.918020122565e-08
140001.00000  141001.00000  9.590100612826e-08
141001.00000  142001.00000  5.754060367695e-08
142001.00000  143001.00000  3.836040245130e-08
143001.00000  144001.00000  7.672080490260e-08
144001.00000  145001.00000  5.754060367695e-08
145001.00000  146001.00000  5.754060367695e-08
146001.00000  147001.00000  7.672080490260e-08
147001.00000  148001.00000  3.836040245130e-08
148001.00000  149001.00000  1.918020122565e-08
149001.00000  150001.00000  3.836040245130e-08
150001.00000  151001.00000  3.836040245130e-08
151001.00000  152001.00000  1.918020122565e-08
152001.00000  153001.00000  1.918020122565e-08
153001.00000  154001.00000  3.836040245130e-08
154001.00000  155001.00000  1.918020122565e-08
155001.00000  156001.00000  1.918020122565e-08
156001.00000  157001.00000  1.918020122565e-08
157001.00000  158001.00000  0.000000000000e+00
158001.00000  159001.00000  1.918020122565e-08
159001.00000  160001.00000  0.000000000000e+00
160001.00000  161001.00000  5.754060367695e-08
161001.00000  162001.00000  0.000000000000e+00
162001.00000  163001.00000  3.836040245130e-08
163001.00000  164001.00000  0.000000000000e+00
164001.00000  165001.00000  1.918020122565e-08
165001.00000  166001.00000  1.918020122565e-08
166001.00000  167001.00000  0.000000000000e+00
167001.00000  168001.00000  0.000000000000e+00
168001.00000  169001.00000  0.000000000000e+00
169001.00000  170001.00000  1.918020122565e-08
170001.00000  171001.00000  0.000000000000e+00
171001.00000  172001.00000  1.918020122565e-08
172001.00000  173001.00000  3.836040245130e-08
173001.00000  174001.00000  0.000000000000e+00
174001.00000  175001.00000  3.836040245130e-08
175001.00000  176001.00000  1.918020122565e-08
176001.00000  177001.00000  0.000000000000e+00
177001.00000  178001.00000  0.000000000000e+00
178001.00000  179001.00000  0.000000000000e+00
179001.00000  180001.00000  3.836040245130e-08
180001.00000  181001.00000  1.918020122565e-08
181001.00000  182001.00000  1.918020122565e-08
182001.00000  183001.00000  1.918020122565e-08
183001.00000  184001.00000  1.918020122565e-08
184001.00000  185001.00000  0.000000000000e+00
185001.00000  186001.00000  1.918020122565e-08
186001.00000  187001.00000  1.918020122565e-08
187001.00000  188001.00000  0.000000000000e+00
188001.00000  189001.00000  1.918020122565e-08
189001.00000  190001.00000  0.000000000000e+00
190001.00000  191001.00000  3.836040245130e-08
191001.00000  192001.00000  0.000000000000e+00
192001.00000  193001.00000  0.000000000000e+00
193001.00000  194001.00000  1.918020122565e-08
194001.00000  195001.00000  0.000000000000e+00
195001.00000  196001.00000  0.000000000000e+00
196001.00000  197001.00000  0.000000000000e+00
197001.00000  198001.00000  0.000000000000e+00
198001.00000  199001.00000  0.000000000000e+00
