300.00000  350.00000  2.899631441361e-06
350.00000  400.00000  9.472129375113e-06
400.00000  450.00000  4.832719068935e-06
450.00000  500.00000  7.152424222024e-06
500.00000  550.00000  7.809674015399e-05
550.00000  600.00000  5.799262882722e-06
600.00000  650.00000  2.397028658192e-05
650.00000  700.00000  1.063198195166e-05
700.00000  750.00000  1.952418503850e-05
750.00000  800.00000  1.005205566339e-05
800.00000  850.00000  5.142013089347e-05
850.00000  900.00000  1.314499586750e-05
900.00000  950.00000  1.391823091853e-05
950.00000  1000.00000  1.198514329096e-05
1000.00000  1050.00000  1.720447988541e-05
1050.00000  1100.00000  1.585131854611e-05
1100.00000  1150.00000  1.623793607162e-05
1150.00000  1200.00000  1.894425875023e-05
1200.00000  1250.00000  2.010411132677e-05
1250.00000  1300.00000  6.495174428649e-05
1300.00000  1350.00000  2.087734637780e-05
1350.00000  1400.00000  2.686991802328e-05
1400.00000  1450.00000  2.358366905640e-05
1450.00000  1500.00000  2.725653554880e-05
1500.00000  1550.00000  2.628999173501e-05
1550.00000  1600.00000  2.261712524262e-05
1600.00000  1650.00000  2.996285822740e-05
1650.00000  1700.00000  2.822307936258e-05
1700.00000  1750.00000  9.839416024352e-05
1750.00000  1800.00000  3.208925461773e-05
1800.00000  1850.00000  3.634204739839e-05
1850.00000  1900.00000  3.402234224530e-05
1900.00000  1950.00000  3.904837007700e-05
1950.00000  2000.00000  3.653535616115e-05
2000.00000  2050.00000  3.808182626321e-05
2050.00000  2100.00000  4.291454533215e-05
2100.00000  2150.00000  4.040153141630e-05
2150.00000  2200.00000  4.465432419696e-05
2200.00000  2250.00000  4.948704326590e-05
2250.00000  2300.00000  5.142013089347e-05
2300.00000  2350.00000  1.198514329096e-04
2350.00000  2400.00000  5.084020460520e-05
2400.00000  2450.00000  4.987366079141e-05
2450.00000  2500.00000  5.412645357208e-05
2500.00000  2550.00000  4.678072058729e-05
2550.00000  2600.00000  5.238667470726e-05
2600.00000  2650.00000  5.509299738586e-05
2650.00000  2700.00000  5.200005718174e-05
2700.00000  2750.00000  6.321196542167e-05
2750.00000  2800.00000  6.282534789616e-05
2800.00000  2850.00000  6.301865665892e-05
2850.00000  2900.00000  6.456512676098e-05
2900.00000  2950.00000  6.591828810028e-05
2950.00000  3000.00000  9.742761642974e-05
3000.00000  3050.00000  7.210416850851e-05
3050.00000  3100.00000  7.481049118712e-05
3100.00000  3150.00000  7.867666644227e-05
3150.00000  3200.00000  8.524916437602e-05
3200.00000  3250.00000  7.693688757745e-05
3250.00000  3300.00000  8.118968035811e-05
3300.00000  3350.00000  8.795548705462e-05
3350.00000  3400.00000  8.988857468220e-05
3400.00000  3450.00000  9.104842725874e-05
3450.00000  3500.00000  1.012937916849e-04
3500.00000  3550.00000  1.041934231262e-04
3550.00000  3600.00000  1.040001143635e-04
3600.00000  3650.00000  1.084462159069e-04
3650.00000  3700.00000  1.484611297977e-04
3700.00000  3750.00000  1.223644468254e-04
3750.00000  3800.00000  1.215912117744e-04
3800.00000  3850.00000  1.225577555882e-04
3850.00000  3900.00000  1.297101798102e-04
3900.00000  3950.00000  1.285503272337e-04
3950.00000  4000.00000  1.368626040322e-04
4000.00000  4050.00000  1.444016457798e-04
4050.00000  4100.00000  1.467213509329e-04
4100.00000  4150.00000  1.422752493895e-04
4150.00000  4200.00000  1.476878947467e-04
4200.00000  4250.00000  1.561934803080e-04
4250.00000  4300.00000  1.612195081397e-04
4300.00000  4350.00000  1.697250937010e-04
4350.00000  4400.00000  1.660522272086e-04
4400.00000  4450.00000  1.772641354485e-04
4450.00000  4500.00000  1.762975916348e-04
4500.00000  4550.00000  1.929221452319e-04
4550.00000  4600.00000  1.962083941988e-04
4600.00000  4650.00000  1.857697210099e-04
4650.00000  4700.00000  1.859630297726e-04
4700.00000  4750.00000  1.977548643008e-04
4750.00000  4800.00000  1.981414818263e-04
4800.00000  4850.00000  2.089667725408e-04
4850.00000  4900.00000  2.126396390332e-04
4900.00000  4950.00000  2.062604498622e-04
4950.00000  5000.00000  2.253980173751e-04
5000.00000  5050.00000  2.203719895434e-04
5050.00000  5100.00000  2.342902204620e-04
5100.00000  5150.00000  2.348701467503e-04
5150.00000  5200.00000  2.248180910869e-04
5200.00000  5250.00000  2.329370591227e-04
5250.00000  5300.00000  2.431824235488e-04
5300.00000  5350.00000  2.397028658192e-04
5350.00000  5400.00000  2.613534472480e-04
5400.00000  5450.00000  2.524612441612e-04
5450.00000  5500.00000  2.530411704495e-04
5500.00000  5550.00000  2.371898519033e-04
5550.00000  5600.00000  2.379630869544e-04
5600.00000  5650.00000  2.522679353984e-04
5650.00000  5700.00000  2.600002859087e-04
5700.00000  5750.00000  2.458887462274e-04
5750.00000  5800.00000  2.632865348756e-04
5800.00000  5850.00000  2.617400647735e-04
5850.00000  5900.00000  2.663794750797e-04
5900.00000  5950.00000  2.468552900412e-04
5950.00000  6000.00000  2.574872719929e-04
6000.00000  6050.00000  2.534277879750e-04
6050.00000  6100.00000  2.603869034342e-04
6100.00000  6150.00000  2.690857977583e-04
6150.00000  6200.00000  2.511080828219e-04
6200.00000  6250.00000  2.704389590976e-04
6250.00000  6300.00000  2.930560843402e-04
6300.00000  6350.00000  2.930560843402e-04
6350.00000  6400.00000  1.248774607413e-03
6400.00000  6450.00000  2.669594013680e-04
6450.00000  6500.00000  2.491749951943e-04
6500.00000  6550.00000  2.410560271585e-04
6550.00000  6600.00000  2.532344792122e-04
6600.00000  6650.00000  2.601935946715e-04
6650.00000  6700.00000  2.551675668398e-04
6700.00000  6750.00000  2.453088199392e-04
6750.00000  6800.00000  2.427958060233e-04
6800.00000  6850.00000  2.507214652964e-04
6850.00000  6900.00000  2.433757323116e-04
6900.00000  6950.00000  2.526545529239e-04
6950.00000  7000.00000  2.398961745819e-04
7000.00000  7050.00000  2.426024972606e-04
7050.00000  7100.00000  3.458293765730e-04
7100.00000  7150.00000  1.380224566088e-04
7150.00000  7200.00000  1.268105483689e-04
7200.00000  7250.00000  1.341562813536e-04
7250.00000  7300.00000  1.324165024888e-04
7300.00000  7350.00000  1.304834148613e-04
7350.00000  7400.00000  1.357027514557e-04
7400.00000  7450.00000  1.403421617619e-04
7450.00000  7500.00000  1.714648725658e-04
7500.00000  7550.00000  1.376358390833e-04
7550.00000  7600.00000  1.331897375399e-04
7600.00000  7650.00000  1.351228251674e-04
7650.00000  7700.00000  1.418886318639e-04
7700.00000  7750.00000  1.438217194915e-04
7750.00000  7800.00000  1.422752493895e-04
7800.00000  7850.00000  1.329964287771e-04
7850.00000  7900.00000  1.347362076419e-04
7900.00000  7950.00000  1.387956916598e-04
7950.00000  8000.00000  1.328031200143e-04
8000.00000  8050.00000  1.386023828971e-04
8050.00000  8100.00000  1.293235622847e-04
8100.00000  8150.00000  1.322231937261e-04
8150.00000  8200.00000  1.362826777440e-04
8200.00000  8250.00000  1.372492215578e-04
8250.00000  8300.00000  1.376358390833e-04
8300.00000  8350.00000  1.355094426929e-04
8350.00000  8400.00000  1.262306220806e-04
8400.00000  8450.00000  1.215912117744e-04
8450.00000  8500.00000  1.241042256903e-04
8500.00000  8550.00000  1.328031200143e-04
8550.00000  8600.00000  1.169518014682e-04
8600.00000  8650.00000  1.310633411495e-04
8650.00000  8700.00000  1.295168710475e-04
8700.00000  8750.00000  1.329964287771e-04
8750.00000  8800.00000  1.194648153841e-04
8800.00000  8850.00000  1.306767236240e-04
8850.00000  8900.00000  1.161785664172e-04
8900.00000  8950.00000  1.266172396061e-04
8950.00000  9000.00000  1.246841519785e-04
9000.00000  9050.00000  1.237176081647e-04
9050.00000  9100.00000  1.239109169275e-04
9100.00000  9150.00000  1.271971658944e-04
9150.00000  9200.00000  1.252640782668e-04
9200.00000  9250.00000  1.266172396061e-04
9250.00000  9300.00000  1.183049628075e-04
9300.00000  9350.00000  1.233309906392e-04
9350.00000  9400.00000  1.200447416724e-04
9400.00000  9450.00000  1.154053313662e-04
9450.00000  9500.00000  1.227510643510e-04
9500.00000  9550.00000  1.167584927055e-04
9550.00000  9600.00000  1.142454787896e-04
9600.00000  9650.00000  1.233309906392e-04
9650.00000  9700.00000  1.239109169275e-04
9700.00000  9750.00000  1.155986401289e-04
9750.00000  9800.00000  1.206246679606e-04
9800.00000  9850.00000  1.204313591979e-04
9850.00000  9900.00000  1.103793035345e-04
9900.00000  9950.00000  1.148254050779e-04
9950.00000  10000.00000  1.190781978586e-04
