300.00000  350.00000  1.338068948184e-05
350.00000  400.00000  1.916693358210e-05
400.00000  450.00000  1.880529332583e-05
450.00000  500.00000  2.097513486343e-05
500.00000  550.00000  1.265740896931e-04
550.00000  600.00000  9.764286919181e-06
600.00000  650.00000  3.869550742046e-05
650.00000  700.00000  1.627381153197e-05
700.00000  750.00000  2.459153742608e-05
750.00000  800.00000  1.989021409463e-05
800.00000  850.00000  6.292540459028e-05
850.00000  900.00000  1.735873230077e-05
900.00000  950.00000  2.133677511969e-05
950.00000  1000.00000  2.386825691355e-05
1000.00000  1050.00000  1.772037255703e-05
1050.00000  1100.00000  1.989021409463e-05
1100.00000  1150.00000  1.808201281330e-05
1150.00000  1200.00000  2.133677511969e-05
1200.00000  1250.00000  2.169841537596e-05
1250.00000  1300.00000  5.822408125882e-05
1300.00000  1350.00000  2.097513486343e-05
1350.00000  1400.00000  2.603809845115e-05
1400.00000  1450.00000  2.603809845115e-05
1450.00000  1500.00000  2.676137896368e-05
1500.00000  1550.00000  2.422989716982e-05
1550.00000  1600.00000  2.495317768235e-05
1600.00000  1650.00000  2.459153742608e-05
1650.00000  1700.00000  2.097513486343e-05
1700.00000  1750.00000  7.811429535345e-05
1750.00000  1800.00000  3.218598280767e-05
1800.00000  1850.00000  2.965450101381e-05
1850.00000  1900.00000  2.278333614475e-05
1900.00000  1950.00000  2.133677511969e-05
1950.00000  2000.00000  2.929286075754e-05
2000.00000  2050.00000  3.146270229514e-05
2050.00000  2100.00000  3.001614127007e-05
2100.00000  2150.00000  2.820793998874e-05
2150.00000  2200.00000  3.363254383273e-05
2200.00000  2250.00000  3.110106203887e-05
2250.00000  2300.00000  3.507910485780e-05
2300.00000  2350.00000  9.945107047314e-05
2350.00000  2400.00000  3.905714767672e-05
2400.00000  2450.00000  4.665159305831e-05
2450.00000  2500.00000  4.918307485217e-05
2500.00000  2550.00000  5.026799562097e-05
2550.00000  2600.00000  5.171455664603e-05
2600.00000  2650.00000  5.894736177135e-05
2650.00000  2700.00000  6.835000843426e-05
2700.00000  2750.00000  8.317725894117e-05
2750.00000  2800.00000  7.847593560971e-05
2800.00000  2850.00000  9.764286919181e-05
2850.00000  2900.00000  1.095769976486e-04
2900.00000  2950.00000  1.186180040552e-04
2950.00000  3000.00000  1.649079568573e-04
3000.00000  3050.00000  1.421246207125e-04
3050.00000  3100.00000  1.569518712194e-04
3100.00000  3150.00000  1.772037255703e-04
3150.00000  3200.00000  1.920309760772e-04
3200.00000  3250.00000  2.025185435089e-04
3250.00000  3300.00000  2.028801837652e-04
3300.00000  3350.00000  2.253018796537e-04
3350.00000  3400.00000  2.383209288793e-04
3400.00000  3450.00000  2.574878624614e-04
3450.00000  3500.00000  2.795479180936e-04
3500.00000  3550.00000  2.795479180936e-04
3550.00000  3600.00000  2.802711986061e-04
3600.00000  3650.00000  3.475362862716e-04
3650.00000  3700.00000  3.985275624051e-04
3700.00000  3750.00000  3.811688301043e-04
3750.00000  3800.00000  3.934645988174e-04
3800.00000  3850.00000  4.039521662491e-04
3850.00000  3900.00000  4.227574595749e-04
3900.00000  3950.00000  4.325217464941e-04
3950.00000  4000.00000  4.592831254578e-04
4000.00000  4050.00000  4.712172539145e-04
4050.00000  4100.00000  4.469873567447e-04
4100.00000  4150.00000  4.827897421150e-04
4150.00000  4200.00000  5.124442431289e-04
4200.00000  4250.00000  5.062963587723e-04
4250.00000  4300.00000  5.200386885104e-04
4300.00000  4350.00000  5.381207013237e-04
4350.00000  4400.00000  5.533095920869e-04
4400.00000  4450.00000  5.648820802874e-04
4450.00000  4500.00000  5.851339346383e-04
4500.00000  4550.00000  5.786244100255e-04
4550.00000  4600.00000  5.930900202762e-04
4600.00000  4650.00000  5.956215020700e-04
4650.00000  4700.00000  5.959831423263e-04
4700.00000  4750.00000  5.995995448889e-04
4750.00000  4800.00000  5.988762643764e-04
4800.00000  4850.00000  6.343170094905e-04
4850.00000  4900.00000  6.495059002536e-04
4900.00000  4950.00000  6.498675405099e-04
4950.00000  5000.00000  6.610783884542e-04
5000.00000  5050.00000  6.509524612787e-04
5050.00000  5100.00000  6.379334120531e-04
5100.00000  5150.00000  6.560154248664e-04
5150.00000  5200.00000  6.567387053790e-04
5200.00000  5250.00000  6.408265341033e-04
5250.00000  5300.00000  6.636098702480e-04
5300.00000  5350.00000  6.936260115181e-04
5350.00000  5400.00000  6.621633092230e-04
5400.00000  5450.00000  6.892863284429e-04
5450.00000  5500.00000  6.885630479304e-04
5500.00000  5550.00000  6.556537846102e-04
5550.00000  5600.00000  7.023053776685e-04
5600.00000  5650.00000  6.842233648552e-04
5650.00000  5700.00000  7.008588166434e-04
5700.00000  5750.00000  6.661413520419e-04
5750.00000  5800.00000  6.704810351171e-04
5800.00000  5850.00000  6.733741571672e-04
5850.00000  5900.00000  6.686728338357e-04
5900.00000  5950.00000  6.842233648552e-04
5950.00000  6000.00000  6.965191335682e-04
6000.00000  6050.00000  6.979656945933e-04
6050.00000  6100.00000  6.675879130669e-04
6100.00000  6150.00000  6.520373820475e-04
6150.00000  6200.00000  6.726508766547e-04
6200.00000  6250.00000  7.196641099692e-04
6250.00000  6300.00000  7.547432148270e-04
6300.00000  6350.00000  7.749950691779e-04
6350.00000  6400.00000  2.204197361941e-03
6400.00000  6450.00000  6.368484912843e-04
6450.00000  6500.00000  6.415498146158e-04
6500.00000  6550.00000  6.538455833288e-04
6550.00000  6600.00000  6.274458446214e-04
6600.00000  6650.00000  6.628865897355e-04
6650.00000  6700.00000  6.578236261478e-04
6700.00000  6750.00000  5.967064228388e-04
6750.00000  6800.00000  6.379334120531e-04
6800.00000  6850.00000  6.274458446214e-04
6850.00000  6900.00000  6.245527225713e-04
6900.00000  6950.00000  6.209363200086e-04
6950.00000  7000.00000  6.451662171785e-04
7000.00000  7050.00000  6.285307653902e-04
7050.00000  7100.00000  7.753567094342e-04
7100.00000  7150.00000  4.289053439314e-04
7150.00000  7200.00000  4.115466116307e-04
7200.00000  7250.00000  4.129931726557e-04
7250.00000  7300.00000  4.191410570122e-04
7300.00000  7350.00000  4.129931726557e-04
7350.00000  7400.00000  4.068452882992e-04
7400.00000  7450.00000  3.873167144608e-04
7450.00000  7500.00000  4.430093139258e-04
7500.00000  7550.00000  4.010590441989e-04
7550.00000  7600.00000  4.039521662491e-04
7600.00000  7650.00000  3.891249157422e-04
7650.00000  7700.00000  4.010590441989e-04
7700.00000  7750.00000  4.104616908619e-04
7750.00000  7800.00000  3.833386716419e-04
7800.00000  7850.00000  4.079302090680e-04
7850.00000  7900.00000  3.840619521544e-04
7900.00000  7950.00000  3.833386716419e-04
7950.00000  8000.00000  3.902098365110e-04
8000.00000  8050.00000  3.775524275417e-04
8050.00000  8100.00000  3.775524275417e-04
8100.00000  8150.00000  3.739360249790e-04
8150.00000  8200.00000  3.884016352296e-04
8200.00000  8250.00000  3.938262390736e-04
8250.00000  8300.00000  3.873167144608e-04
8300.00000  8350.00000  3.771907872854e-04
8350.00000  8400.00000  3.822537508731e-04
8400.00000  8450.00000  3.996124831739e-04
8450.00000  8500.00000  3.612786160097e-04
8500.00000  8550.00000  3.800839093355e-04
8550.00000  8600.00000  3.605553354972e-04
8600.00000  8650.00000  3.732127444665e-04
8650.00000  8700.00000  3.750209457478e-04
8700.00000  8750.00000  3.627251770347e-04
8750.00000  8800.00000  3.587471342158e-04
8800.00000  8850.00000  3.612786160097e-04
8850.00000  8900.00000  3.652566588286e-04
8900.00000  8950.00000  3.645333783161e-04
8950.00000  9000.00000  3.630868172910e-04
9000.00000  9050.00000  3.605553354972e-04
9050.00000  9100.00000  3.384952798649e-04
9100.00000  9150.00000  3.652566588286e-04
9150.00000  9200.00000  3.413884019151e-04
9200.00000  9250.00000  3.366870785836e-04
9250.00000  9300.00000  3.569389329345e-04
9300.00000  9350.00000  3.565772926782e-04
9350.00000  9400.00000  3.348788773023e-04
9400.00000  9450.00000  3.489828472966e-04
9450.00000  9500.00000  3.276460721770e-04
9500.00000  9550.00000  3.497061278092e-04
9550.00000  9600.00000  3.261995111519e-04
9600.00000  9650.00000  3.276460721770e-04
9650.00000  9700.00000  3.330706760209e-04
9700.00000  9750.00000  3.442815239652e-04
9750.00000  9800.00000  3.348788773023e-04
9800.00000  9850.00000  3.178817852578e-04
9850.00000  9900.00000  3.149886632076e-04
9900.00000  9950.00000  3.345172370460e-04
9950.00000  10000.00000  3.142653826951e-04
