300.00000  350.00000  9.394110998867e-01
350.00000  400.00000  6.636309570838e-01
400.00000  450.00000  4.916003061064e-01
450.00000  500.00000  3.761432892039e-01
500.00000  550.00000  2.959104972527e-01
550.00000  600.00000  2.376696593721e-01
600.00000  650.00000  1.941999355820e-01
650.00000  700.00000  1.616957681080e-01
700.00000  750.00000  1.356905050100e-01
750.00000  800.00000  1.159170375341e-01
800.00000  850.00000  1.000886179596e-01
850.00000  900.00000  8.661594920060e-02
900.00000  950.00000  7.544783541274e-02
950.00000  1000.00000  6.600405702502e-02
1000.00000  1050.00000  5.895386985971e-02
1050.00000  1100.00000  5.275323692554e-02
1100.00000  1150.00000  4.701930234192e-02
1150.00000  1200.00000  4.257490946461e-02
1200.00000  1250.00000  3.805928758626e-02
1250.00000  1300.00000  3.501202188557e-02
1300.00000  1350.00000  3.156483502280e-02
1350.00000  1400.00000  2.938789867856e-02
1400.00000  1450.00000  2.677691060923e-02
1450.00000  1500.00000  2.465636389081e-02
1500.00000  1550.00000  2.286525130219e-02
1550.00000  1600.00000  2.088938849212e-02
1600.00000  1650.00000  1.967923744323e-02
1650.00000  1700.00000  1.795935385565e-02
1700.00000  1750.00000  1.691614577793e-02
1750.00000  1800.00000  1.602058948362e-02
1800.00000  1850.00000  1.479708299703e-02
1850.00000  1900.00000  1.390375260900e-02
1900.00000  1950.00000  1.298148543931e-02
1950.00000  2000.00000  1.228255086661e-02
2000.00000  2050.00000  1.160364945046e-02
2050.00000  2100.00000  1.083200193921e-02
2100.00000  2150.00000  1.013603524156e-02
2150.00000  2200.00000  9.576590795903e-03
2200.00000  2250.00000  9.164798133648e-03
2250.00000  2300.00000  8.845751566495e-03
2300.00000  2350.00000  8.200238744582e-03
2350.00000  2400.00000  7.837416020541e-03
2400.00000  2450.00000  7.533950797366e-03
2450.00000  2500.00000  7.184483511019e-03
2500.00000  2550.00000  6.725204848072e-03
2550.00000  2600.00000  6.532292970259e-03
2600.00000  2650.00000  6.082659901202e-03
2650.00000  2700.00000  6.009204993881e-03
2700.00000  2750.00000  5.702771895662e-03
2750.00000  2800.00000  5.480923236177e-03
2800.00000  2850.00000  5.195265263261e-03
2850.00000  2900.00000  4.983062197667e-03
2900.00000  2950.00000  4.804247726309e-03
2950.00000  3000.00000  4.633594911320e-03
3000.00000  3050.00000  4.371679938751e-03
3050.00000  3100.00000  4.308612594081e-03
3100.00000  3150.00000  4.031116277535e-03
3150.00000  3200.00000  3.925756713498e-03
3200.00000  3250.00000  3.729134991881e-03
3250.00000  3300.00000  3.672745366059e-03
3300.00000  3350.00000  3.545126739198e-03
3350.00000  3400.00000  3.341827298733e-03
3400.00000  3450.00000  3.361860455275e-03
3450.00000  3500.00000  3.168206608701e-03
3500.00000  3550.00000  3.004973481321e-03
3550.00000  3600.00000  2.945615980455e-03
3600.00000  3650.00000  2.841740353940e-03
3650.00000  3700.00000  2.768285446619e-03
3700.00000  3750.00000  2.688894789211e-03
3750.00000  3800.00000  2.567211912437e-03
3800.00000  3850.00000  2.431431629207e-03
3850.00000  3900.00000  2.393591222405e-03
3900.00000  3950.00000  2.389139409840e-03
3950.00000  4000.00000  2.242229595198e-03
4000.00000  4050.00000  2.260036845458e-03
4050.00000  4100.00000  2.195485563266e-03
4100.00000  4150.00000  1.992928091562e-03
4150.00000  4200.00000  2.057479373754e-03
4200.00000  4250.00000  2.017413060669e-03
4250.00000  4300.00000  1.927634840610e-03
4300.00000  4350.00000  1.885342621243e-03
4350.00000  4400.00000  1.825985120378e-03
4400.00000  4450.00000  1.799274244988e-03
4450.00000  4500.00000  1.682785149540e-03
4500.00000  4550.00000  1.657558211672e-03
4550.00000  4600.00000  1.562586210287e-03
4600.00000  4650.00000  1.625653554956e-03
4650.00000  4700.00000  1.524003834724e-03
4700.00000  4750.00000  1.506938553225e-03
4750.00000  4800.00000  1.480969646597e-03
4800.00000  4850.00000  1.407514739275e-03
4850.00000  4900.00000  1.420870176970e-03
4900.00000  4950.00000  1.394159301581e-03
4950.00000  5000.00000  1.337027706998e-03
5000.00000  5050.00000  1.302155175239e-03
5050.00000  5100.00000  1.271734456045e-03
5100.00000  5150.00000  1.248733424460e-03
5150.00000  5200.00000  1.201989392528e-03
5200.00000  5250.00000  1.199763486246e-03
5250.00000  5300.00000  1.132244329011e-03
5300.00000  5350.00000  1.122598735121e-03
5350.00000  5400.00000  1.172310642095e-03
5400.00000  5450.00000  1.081048484515e-03
5450.00000  5500.00000  1.031336577540e-03
5500.00000  5550.00000  1.061015327973e-03
5550.00000  5600.00000  1.000915858346e-03
5600.00000  5650.00000  9.816246705648e-04
5650.00000  5700.00000  9.868184518905e-04
5700.00000  5750.00000  9.623334827834e-04
5750.00000  5800.00000  9.215252009384e-04
5800.00000  5850.00000  9.111376382869e-04
5850.00000  5900.00000  9.089117320044e-04
5900.00000  5950.00000  8.962982630705e-04
5950.00000  6000.00000  8.324889496400e-04
6000.00000  6050.00000  8.480702936172e-04
6050.00000  6100.00000  8.087459492937e-04
6100.00000  6150.00000  7.953905115990e-04
6150.00000  6200.00000  8.072620117721e-04
6200.00000  6250.00000  7.679376674486e-04
6250.00000  6300.00000  7.330651356901e-04
6300.00000  6350.00000  7.471625421457e-04
6350.00000  6400.00000  8.191335119452e-04
6400.00000  6450.00000  7.360330107334e-04
6450.00000  6500.00000  7.108060728655e-04
6500.00000  6550.00000  6.321573842186e-04
6550.00000  6600.00000  6.499646344783e-04
6600.00000  6650.00000  6.892889788017e-04
6650.00000  6700.00000  6.284475404145e-04
6700.00000  6750.00000  6.210278528063e-04
6750.00000  6800.00000  5.995107587425e-04
6800.00000  6850.00000  6.113822589156e-04
6850.00000  6900.00000  6.351252592619e-04
6900.00000  6950.00000  6.024786337858e-04
6950.00000  7000.00000  5.572185393758e-04
7000.00000  7050.00000  6.069304463507e-04
7050.00000  7100.00000  5.572185393758e-04
7100.00000  7150.00000  5.490568830067e-04
7150.00000  7200.00000  5.557346018541e-04
7200.00000  7250.00000  5.661221645056e-04
7250.00000  7300.00000  5.349594765512e-04
7300.00000  7350.00000  5.572185393758e-04
7350.00000  7400.00000  4.956351322277e-04
7400.00000  7450.00000  5.245719138997e-04
7450.00000  7500.00000  5.282817577038e-04
7500.00000  7550.00000  4.659563817949e-04
7550.00000  7600.00000  4.681822880774e-04
7600.00000  7650.00000  4.288579437539e-04
7650.00000  7700.00000  4.615045692300e-04
7700.00000  7750.00000  4.741180381639e-04
7750.00000  7800.00000  4.385035376446e-04
7800.00000  7850.00000  4.236641624282e-04
7850.00000  7900.00000  4.585366941867e-04
7900.00000  7950.00000  4.503750378177e-04
7950.00000  8000.00000  4.140185685375e-04
8000.00000  8050.00000  4.333097563188e-04
8050.00000  8100.00000  3.843398181047e-04
8100.00000  8150.00000  3.887916306696e-04
8150.00000  8200.00000  3.865657243872e-04
8200.00000  8250.00000  3.962113182778e-04
8250.00000  8300.00000  3.976952557995e-04
8300.00000  8350.00000  3.620807552801e-04
8350.00000  8400.00000  4.095667559726e-04
8400.00000  8450.00000  3.635646928018e-04
8450.00000  8500.00000  3.680165053667e-04
8500.00000  8550.00000  3.813719430614e-04
8550.00000  8600.00000  3.613387865193e-04
8600.00000  8650.00000  3.672745366059e-04
8650.00000  8700.00000  3.435315362596e-04
8700.00000  8750.00000  3.272082235216e-04
8750.00000  8800.00000  3.249823172391e-04
8800.00000  8850.00000  3.153367233485e-04
8850.00000  8900.00000  3.086590045011e-04
8900.00000  8950.00000  3.494672863462e-04
8950.00000  9000.00000  3.390797236947e-04
9000.00000  9050.00000  3.101429420227e-04
9050.00000  9100.00000  3.071750669795e-04
9100.00000  9150.00000  3.042071919362e-04
9150.00000  9200.00000  2.982714418496e-04
9200.00000  9250.00000  2.938196292847e-04
9250.00000  9300.00000  2.863999416765e-04
9300.00000  9350.00000  3.071750669795e-04
9350.00000  9400.00000  3.086590045011e-04
9400.00000  9450.00000  2.886258479590e-04
9450.00000  9500.00000  2.760123790250e-04
9500.00000  9550.00000  2.685926914168e-04
9550.00000  9600.00000  2.619149725694e-04
9600.00000  9650.00000  2.752704102642e-04
9650.00000  9700.00000  2.678507226560e-04
9700.00000  9750.00000  2.745284415034e-04
9750.00000  9800.00000  2.611730038086e-04
9800.00000  9850.00000  2.619149725694e-04
9850.00000  9900.00000  2.448496910706e-04
9900.00000  9950.00000  2.493015036355e-04
9950.00000  10000.00000  2.248165345284e-04
