300.00000  350.00000  3.091464750566e-06
350.00000  400.00000  4.637197125850e-06
400.00000  450.00000  2.511815109835e-06
450.00000  500.00000  2.898248203656e-06
500.00000  550.00000  3.400611225623e-05
550.00000  600.00000  2.705031656746e-06
600.00000  650.00000  9.854043892431e-06
650.00000  700.00000  4.250764032029e-06
700.00000  750.00000  7.728661876416e-06
750.00000  800.00000  4.250764032029e-06
800.00000  850.00000  1.835557195649e-05
850.00000  900.00000  3.091464750566e-06
900.00000  950.00000  4.830413672760e-06
950.00000  1000.00000  5.023630219670e-06
1000.00000  1050.00000  4.057547485118e-06
1050.00000  1100.00000  4.443980578939e-06
1100.00000  1150.00000  4.830413672760e-06
1150.00000  1200.00000  4.443980578939e-06
1200.00000  1250.00000  3.864330938208e-06
1250.00000  1300.00000  1.275229209609e-05
1300.00000  1350.00000  4.637197125850e-06
1350.00000  1400.00000  4.443980578939e-06
1400.00000  1450.00000  2.898248203656e-06
1450.00000  1500.00000  3.477897844387e-06
1500.00000  1550.00000  2.898248203656e-06
1550.00000  1600.00000  3.864330938208e-06
1600.00000  1650.00000  3.091464750566e-06
1650.00000  1700.00000  3.671114391298e-06
1700.00000  1750.00000  1.429802447137e-05
1750.00000  1800.00000  3.864330938208e-06
1800.00000  1850.00000  4.057547485118e-06
1850.00000  1900.00000  4.637197125850e-06
1900.00000  1950.00000  3.864330938208e-06
1950.00000  2000.00000  2.511815109835e-06
2000.00000  2050.00000  3.477897844387e-06
2050.00000  2100.00000  2.898248203656e-06
2100.00000  2150.00000  3.284681297477e-06
2150.00000  2200.00000  2.898248203656e-06
2200.00000  2250.00000  3.864330938208e-06
2250.00000  2300.00000  3.477897844387e-06
2300.00000  2350.00000  2.318598562925e-05
2350.00000  2400.00000  4.057547485118e-06
2400.00000  2450.00000  3.477897844387e-06
2450.00000  2500.00000  4.250764032029e-06
2500.00000  2550.00000  3.477897844387e-06
2550.00000  2600.00000  2.705031656746e-06
2600.00000  2650.00000  3.477897844387e-06
2650.00000  2700.00000  3.284681297477e-06
2700.00000  2750.00000  4.057547485118e-06
2750.00000  2800.00000  2.705031656746e-06
2800.00000  2850.00000  2.511815109835e-06
2850.00000  2900.00000  4.443980578939e-06
2900.00000  2950.00000  4.830413672760e-06
2950.00000  3000.00000  1.680983958121e-05
3000.00000  3050.00000  5.603279860402e-06
3050.00000  3100.00000  8.308311517147e-06
3100.00000  3150.00000  7.342228782595e-06
3150.00000  3200.00000  8.501528064058e-06
3200.00000  3250.00000  7.921878423327e-06
3250.00000  3300.00000  1.024047698625e-05
3300.00000  3350.00000  1.004726043934e-05
3350.00000  3400.00000  1.236585900227e-05
3400.00000  3450.00000  1.371837483064e-05
3450.00000  3500.00000  1.661662303429e-05
3500.00000  3550.00000  2.608423383290e-05
3550.00000  3600.00000  2.608423383290e-05
3600.00000  3650.00000  2.859604894274e-05
3650.00000  3700.00000  5.487349932255e-05
3700.00000  3750.00000  3.767722664753e-05
3750.00000  3800.00000  3.960939211663e-05
3800.00000  3850.00000  4.598553816468e-05
3850.00000  3900.00000  5.448706622873e-05
3900.00000  3950.00000  5.893104680767e-05
3950.00000  4000.00000  6.395467702734e-05
4000.00000  4050.00000  7.110368926303e-05
4050.00000  4100.00000  7.728661876416e-05
4100.00000  4150.00000  8.288989862456e-05
4150.00000  4200.00000  8.617457992204e-05
4200.00000  4250.00000  8.887961157879e-05
4250.00000  4300.00000  1.132248964895e-04
4300.00000  4350.00000  1.190213928968e-04
4350.00000  4400.00000  1.219196411005e-04
4400.00000  4450.00000  1.310008188053e-04
4450.00000  4500.00000  1.416277288853e-04
4500.00000  4550.00000  1.541868044345e-04
4550.00000  4600.00000  1.667458799837e-04
4600.00000  4650.00000  1.721559432972e-04
4650.00000  4700.00000  1.711898605626e-04
4700.00000  4750.00000  1.918640310820e-04
4750.00000  4800.00000  1.941826296450e-04
4800.00000  4850.00000  2.140839339767e-04
4850.00000  4900.00000  2.022977246152e-04
4900.00000  4950.00000  2.260633598852e-04
4950.00000  5000.00000  2.318598562925e-04
5000.00000  5050.00000  2.279955253543e-04
5050.00000  5100.00000  2.494425620613e-04
5100.00000  5150.00000  2.563983577501e-04
5150.00000  5200.00000  2.762996620819e-04
5200.00000  5250.00000  2.674117009240e-04
5250.00000  5300.00000  2.894383872718e-04
5300.00000  5350.00000  2.933027182100e-04
5350.00000  5400.00000  3.019974628210e-04
5400.00000  5450.00000  3.222852002466e-04
5450.00000  5500.00000  3.103057743381e-04
5500.00000  5550.00000  3.174547865738e-04
5550.00000  5600.00000  3.215123340589e-04
5600.00000  5650.00000  3.350374923426e-04
5650.00000  5700.00000  3.445051031412e-04
5700.00000  5750.00000  3.671114391298e-04
5750.00000  5800.00000  3.570641786904e-04
5800.00000  5850.00000  3.547455801275e-04
5850.00000  5900.00000  3.914567240405e-04
5900.00000  5950.00000  3.758061837407e-04
5950.00000  6000.00000  3.796705146789e-04
6000.00000  6050.00000  3.906838578528e-04
6050.00000  6100.00000  3.777383492098e-04
6100.00000  6150.00000  3.877856096492e-04
6150.00000  6200.00000  3.951278384318e-04
6200.00000  6250.00000  4.596621650998e-04
6250.00000  6300.00000  5.481553435848e-04
6300.00000  6350.00000  5.226507593926e-04
6350.00000  6400.00000  2.569007207721e-03
6400.00000  6450.00000  3.939685391503e-04
6450.00000  6500.00000  3.866263103677e-04
6500.00000  6550.00000  3.754197506469e-04
6550.00000  6600.00000  3.959007046194e-04
6600.00000  6650.00000  3.846941448986e-04
6650.00000  6700.00000  4.121308945599e-04
6700.00000  6750.00000  4.088462132624e-04
6750.00000  6800.00000  3.912635074936e-04
6800.00000  6850.00000  4.125173276537e-04
6850.00000  6900.00000  4.071072643402e-04
6900.00000  6950.00000  4.268153521251e-04
6950.00000  7000.00000  3.968667873540e-04
7000.00000  7050.00000  3.897177751183e-04
7050.00000  7100.00000  6.354892227883e-04
7100.00000  7150.00000  2.065484886472e-04
7150.00000  7200.00000  1.767931404230e-04
7200.00000  7250.00000  1.872268339562e-04
7250.00000  7300.00000  1.937961965511e-04
7300.00000  7350.00000  1.955351454733e-04
7350.00000  7400.00000  1.926368972697e-04
7400.00000  7450.00000  2.061620555534e-04
7450.00000  7500.00000  2.670252678302e-04
7500.00000  7550.00000  1.903182987067e-04
7550.00000  7600.00000  1.978537440363e-04
7600.00000  7650.00000  2.032638073497e-04
7650.00000  7700.00000  1.937961965511e-04
7700.00000  7750.00000  2.030705908028e-04
7750.00000  7800.00000  2.125382016014e-04
7800.00000  7850.00000  2.001723425992e-04
7850.00000  7900.00000  2.136975008829e-04
7900.00000  7950.00000  2.179482649149e-04
7950.00000  8000.00000  2.175618318211e-04
8000.00000  8050.00000  2.063552721003e-04
8050.00000  8100.00000  2.119585519607e-04
8100.00000  8150.00000  2.191075641964e-04
8150.00000  8200.00000  2.274158757135e-04
8200.00000  8250.00000  2.106060361323e-04
8250.00000  8300.00000  2.198804303840e-04
8300.00000  8350.00000  2.040366735374e-04
8350.00000  8400.00000  2.117653354138e-04
8400.00000  8450.00000  2.125382016014e-04
8450.00000  8500.00000  2.088670872101e-04
8500.00000  8550.00000  2.050027562719e-04
8550.00000  8600.00000  2.123449850545e-04
8600.00000  8650.00000  2.208465131186e-04
8650.00000  8700.00000  2.102196030385e-04
8700.00000  8750.00000  2.138907174298e-04
8750.00000  8800.00000  2.115721188669e-04
8800.00000  8850.00000  2.227786785877e-04
8850.00000  8900.00000  2.113789023200e-04
8900.00000  8950.00000  2.206532965717e-04
8950.00000  9000.00000  2.162093159927e-04
9000.00000  9050.00000  2.162093159927e-04
9050.00000  9100.00000  2.080942210225e-04
9100.00000  9150.00000  2.158228828989e-04
9150.00000  9200.00000  2.136975008829e-04
9200.00000  9250.00000  2.135042843360e-04
9250.00000  9300.00000  2.071281382880e-04
9300.00000  9350.00000  2.225854620408e-04
9350.00000  9400.00000  2.109924692262e-04
9400.00000  9450.00000  2.053891893658e-04
9450.00000  9500.00000  2.080942210225e-04
9500.00000  9550.00000  2.109924692262e-04
9550.00000  9600.00000  2.094467368509e-04
9600.00000  9650.00000  2.107992526792e-04
9650.00000  9700.00000  1.945690627388e-04
9700.00000  9750.00000  2.061620555534e-04
9750.00000  9800.00000  2.150500167113e-04
9800.00000  9850.00000  2.102196030385e-04
9850.00000  9900.00000  2.022977246152e-04
9900.00000  9950.00000  2.125382016014e-04
9950.00000  10000.00000  1.961147951141e-04
