10001.00000  11001.00000  2.463882032313e-05
11001.00000  12001.00000  3.029841062991e-05
12001.00000  13001.00000  3.487232464338e-05
13001.00000  14001.00000  4.116522612126e-05
14001.00000  15001.00000  4.597034897497e-05
15001.00000  16001.00000  5.025273879857e-05
16001.00000  17001.00000  5.262514255062e-05
17001.00000  18001.00000  5.368066116911e-05
18001.00000  19001.00000  5.149925602422e-05
19001.00000  20001.00000  4.990089925908e-05
20001.00000  21001.00000  4.847343598454e-05
21001.00000  22001.00000  4.532698524560e-05
22001.00000  23001.00000  4.263289962888e-05
23001.00000  24001.00000  4.019012796893e-05
24001.00000  25001.00000  3.622942001001e-05
25001.00000  26001.00000  3.443001207944e-05
26001.00000  27001.00000  3.105235250026e-05
27001.00000  28001.00000  2.889105247192e-05
28001.00000  29001.00000  2.635780778753e-05
29001.00000  30001.00000  2.312088402415e-05
30001.00000  31001.00000  2.175373609924e-05
31001.00000  32001.00000  1.965275142053e-05
32001.00000  33001.00000  1.773271279070e-05
33001.00000  34001.00000  1.607404067592e-05
34001.00000  35001.00000  1.516931043150e-05
35001.00000  36001.00000  1.387253041449e-05
36001.00000  37001.00000  1.234454155724e-05
37001.00000  38001.00000  1.136944340492e-05
38001.00000  39001.00000  1.014303129581e-05
39001.00000  40001.00000  9.238301051388e-06
40001.00000  41001.00000  8.434096389679e-06
41001.00000  42001.00000  8.243097782523e-06
42001.00000  43001.00000  7.227789397114e-06
43001.00000  44001.00000  6.544215434661e-06
44001.00000  45001.00000  6.071745195907e-06
45001.00000  46001.00000  5.729958214680e-06
46001.00000  47001.00000  5.629432631967e-06
47001.00000  48001.00000  4.905648436428e-06
48001.00000  49001.00000  4.513598663845e-06
49001.00000  50001.00000  4.121548891261e-06
50001.00000  51001.00000  4.021023308548e-06
51001.00000  52001.00000  3.840077259663e-06
52001.00000  53001.00000  3.166555855481e-06
53001.00000  54001.00000  3.066030272768e-06
54001.00000  55001.00000  2.905189340426e-06
55001.00000  56001.00000  2.633770267099e-06
56001.00000  57001.00000  2.382456310315e-06
57001.00000  58001.00000  2.352298635500e-06
58001.00000  59001.00000  2.151247470073e-06
59001.00000  60001.00000  1.970301421188e-06
60001.00000  61001.00000  1.789355372304e-06
61001.00000  62001.00000  1.648619556505e-06
62001.00000  63001.00000  1.859723280203e-06
63001.00000  64001.00000  1.889880955017e-06
64001.00000  65001.00000  1.326937691821e-06
65001.00000  66001.00000  1.387253041449e-06
66001.00000  67001.00000  1.085676293308e-06
67001.00000  68001.00000  1.316885133549e-06
68001.00000  69001.00000  1.276674900464e-06
69001.00000  70001.00000  1.085676293308e-06
70001.00000  71001.00000  1.095728851579e-06
71001.00000  72001.00000  9.047302444232e-07
72001.00000  73001.00000  9.047302444232e-07
73001.00000  74001.00000  7.539418703527e-07
74001.00000  75001.00000  7.237841955386e-07
75001.00000  76001.00000  5.629432631967e-07
76001.00000  77001.00000  7.137316372672e-07
77001.00000  78001.00000  5.227330301112e-07
78001.00000  79001.00000  5.830483797394e-07
79001.00000  80001.00000  4.322600056689e-07
80001.00000  81001.00000  5.729958214680e-07
81001.00000  82001.00000  5.026279135685e-07
82001.00000  83001.00000  4.624176804830e-07
83001.00000  84001.00000  4.322600056689e-07
84001.00000  85001.00000  4.423125639402e-07
85001.00000  86001.00000  4.121548891261e-07
86001.00000  87001.00000  3.216818646838e-07
87001.00000  88001.00000  3.216818646838e-07
88001.00000  89001.00000  3.417869812266e-07
89001.00000  90001.00000  3.417869812266e-07
90001.00000  91001.00000  3.216818646838e-07
91001.00000  92001.00000  2.915241898697e-07
92001.00000  93001.00000  2.513139567842e-07
93001.00000  94001.00000  2.111037236988e-07
94001.00000  95001.00000  1.809460488846e-07
95001.00000  96001.00000  1.809460488846e-07
96001.00000  97001.00000  2.312088402415e-07
97001.00000  98001.00000  1.306832575278e-07
98001.00000  99001.00000  1.507883740705e-07
99001.00000  100001.00000  1.608409323419e-07
100001.00000  101001.00000  1.507883740705e-07
101001.00000  102001.00000  1.608409323419e-07
102001.00000  103001.00000  1.005255827137e-07
103001.00000  104001.00000  2.010511654274e-07
104001.00000  105001.00000  1.608409323419e-07
105001.00000  106001.00000  9.047302444232e-08
106001.00000  107001.00000  1.809460488846e-07
107001.00000  108001.00000  1.005255827137e-07
108001.00000  109001.00000  1.407358157992e-07
109001.00000  110001.00000  1.407358157992e-07
110001.00000  111001.00000  9.047302444232e-08
111001.00000  112001.00000  1.306832575278e-07
112001.00000  113001.00000  1.407358157992e-07
113001.00000  114001.00000  1.407358157992e-07
114001.00000  115001.00000  3.015767481411e-08
115001.00000  116001.00000  3.015767481411e-08
116001.00000  117001.00000  7.036790789958e-08
117001.00000  118001.00000  6.031534962822e-08
118001.00000  119001.00000  6.031534962822e-08
119001.00000  120001.00000  4.021023308548e-08
120001.00000  121001.00000  9.047302444232e-08
121001.00000  122001.00000  7.036790789958e-08
122001.00000  123001.00000  2.010511654274e-08
123001.00000  124001.00000  6.031534962822e-08
124001.00000  125001.00000  8.042046617095e-08
125001.00000  126001.00000  6.031534962822e-08
126001.00000  127001.00000  4.021023308548e-08
127001.00000  128001.00000  6.031534962822e-08
128001.00000  129001.00000  1.105781409851e-07
129001.00000  130001.00000  7.036790789958e-08
130001.00000  131001.00000  5.026279135685e-08
131001.00000  132001.00000  3.015767481411e-08
132001.00000  133001.00000  0.000000000000e+00
133001.00000  134001.00000  1.005255827137e-08
134001.00000  135001.00000  3.015767481411e-08
135001.00000  136001.00000  3.015767481411e-08
136001.00000  137001.00000  4.021023308548e-08
137001.00000  138001.00000  4.021023308548e-08
138001.00000  139001.00000  2.010511654274e-08
139001.00000  140001.00000  4.021023308548e-08
140001.00000  141001.00000  2.010511654274e-08
141001.00000  142001.00000  4.021023308548e-08
142001.00000  143001.00000  3.015767481411e-08
143001.00000  144001.00000  3.015767481411e-08
144001.00000  145001.00000  3.015767481411e-08
145001.00000  146001.00000  0.000000000000e+00
146001.00000  147001.00000  1.005255827137e-08
147001.00000  148001.00000  1.005255827137e-08
148001.00000  149001.00000  0.000000000000e+00
149001.00000  150001.00000  1.005255827137e-08
150001.00000  151001.00000  2.010511654274e-08
151001.00000  152001.00000  2.010511654274e-08
152001.00000  153001.00000  2.010511654274e-08
153001.00000  154001.00000  0.000000000000e+00
154001.00000  155001.00000  0.000000000000e+00
155001.00000  156001.00000  0.000000000000e+00
156001.00000  157001.00000  4.021023308548e-08
157001.00000  158001.00000  2.010511654274e-08
158001.00000  159001.00000  0.000000000000e+00
159001.00000  160001.00000  0.000000000000e+00
160001.00000  161001.00000  2.010511654274e-08
161001.00000  162001.00000  2.010511654274e-08
162001.00000  163001.00000  0.000000000000e+00
163001.00000  164001.00000  0.000000000000e+00
164001.00000  165001.00000  0.000000000000e+00
165001.00000  166001.00000  1.005255827137e-08
166001.00000  167001.00000  0.000000000000e+00
167001.00000  168001.00000  0.000000000000e+00
168001.00000  169001.00000  0.000000000000e+00
169001.00000  170001.00000  0.000000000000e+00
170001.00000  171001.00000  0.000000000000e+00
171001.00000  172001.00000  0.000000000000e+00
172001.00000  173001.00000  0.000000000000e+00
173001.00000  174001.00000  0.000000000000e+00
174001.00000  175001.00000  0.000000000000e+00
175001.00000  176001.00000  0.000000000000e+00
176001.00000  177001.00000  0.000000000000e+00
177001.00000  178001.00000  0.000000000000e+00
178001.00000  179001.00000  0.000000000000e+00
179001.00000  180001.00000  0.000000000000e+00
180001.00000  181001.00000  0.000000000000e+00
181001.00000  182001.00000  1.005255827137e-08
182001.00000  183001.00000  0.000000000000e+00
183001.00000  184001.00000  1.005255827137e-08
184001.00000  185001.00000  0.000000000000e+00
185001.00000  186001.00000  1.005255827137e-08
186001.00000  187001.00000  0.000000000000e+00
187001.00000  188001.00000  1.005255827137e-08
188001.00000  189001.00000  0.000000000000e+00
189001.00000  190001.00000  1.005255827137e-08
190001.00000  191001.00000  0.000000000000e+00
191001.00000  192001.00000  0.000000000000e+00
192001.00000  193001.00000  0.000000000000e+00
193001.00000  194001.00000  0.000000000000e+00
194001.00000  195001.00000  0.000000000000e+00
195001.00000  196001.00000  0.000000000000e+00
196001.00000  197001.00000  0.000000000000e+00
197001.00000  198001.00000  0.000000000000e+00
198001.00000  199001.00000  0.000000000000e+00
