300.00000  350.00000  5.327845017890e-05
350.00000  400.00000  1.154366420543e-04
400.00000  450.00000  6.780893659133e-05
450.00000  500.00000  7.507417979754e-05
500.00000  550.00000  4.811205501004e-04
550.00000  600.00000  4.924220395323e-05
600.00000  650.00000  1.404613686535e-04
650.00000  700.00000  5.892919489485e-05
700.00000  750.00000  9.444816168078e-05
750.00000  800.00000  7.103793357187e-05
800.00000  850.00000  2.034268097740e-04
850.00000  900.00000  5.973644413998e-05
900.00000  950.00000  5.004945319836e-05
950.00000  1000.00000  4.359145923728e-05
1000.00000  1050.00000  5.085670244350e-05
1050.00000  1100.00000  6.215819187539e-05
1100.00000  1150.00000  6.538718885593e-05
1150.00000  1200.00000  5.247120093377e-05
1200.00000  1250.00000  6.619443810106e-05
1250.00000  1300.00000  1.348106239375e-04
1300.00000  1350.00000  5.731469640458e-05
1350.00000  1400.00000  4.924220395323e-05
1400.00000  1450.00000  6.780893659133e-05
1450.00000  1500.00000  7.426693055241e-05
1500.00000  1550.00000  6.054369338512e-05
1550.00000  1600.00000  6.538718885593e-05
1600.00000  1650.00000  6.054369338512e-05
1650.00000  1700.00000  5.247120093377e-05
1700.00000  1750.00000  1.654860952527e-04
1750.00000  1800.00000  5.650744715944e-05
1800.00000  1850.00000  5.892919489485e-05
1850.00000  1900.00000  5.650744715944e-05
1900.00000  1950.00000  5.004945319836e-05
1950.00000  2000.00000  6.215819187539e-05
2000.00000  2050.00000  5.247120093377e-05
2050.00000  2100.00000  5.570019791431e-05
2100.00000  2150.00000  5.327845017890e-05
2150.00000  2200.00000  5.650744715944e-05
2200.00000  2250.00000  5.731469640458e-05
2250.00000  2300.00000  5.247120093377e-05
2300.00000  2350.00000  1.404613686535e-04
2350.00000  2400.00000  5.731469640458e-05
2400.00000  2450.00000  5.408569942404e-05
2450.00000  2500.00000  6.457993961079e-05
2500.00000  2550.00000  5.247120093377e-05
2550.00000  2600.00000  6.215819187539e-05
2600.00000  2650.00000  5.731469640458e-05
2650.00000  2700.00000  5.489294866917e-05
2700.00000  2750.00000  5.247120093377e-05
2750.00000  2800.00000  5.812194564971e-05
2800.00000  2850.00000  5.489294866917e-05
2850.00000  2900.00000  5.085670244350e-05
2900.00000  2950.00000  4.843495470809e-05
2950.00000  3000.00000  7.991767526835e-05
3000.00000  3050.00000  5.731469640458e-05
3050.00000  3100.00000  4.278420999215e-05
3100.00000  3150.00000  5.247120093377e-05
3150.00000  3200.00000  5.570019791431e-05
3200.00000  3250.00000  5.004945319836e-05
3250.00000  3300.00000  5.247120093377e-05
3300.00000  3350.00000  5.489294866917e-05
3350.00000  3400.00000  5.570019791431e-05
3400.00000  3450.00000  5.489294866917e-05
3450.00000  3500.00000  4.924220395323e-05
3500.00000  3550.00000  5.327845017890e-05
3550.00000  3600.00000  5.489294866917e-05
3600.00000  3650.00000  4.762770546296e-05
3650.00000  3700.00000  7.507417979754e-05
3700.00000  3750.00000  6.296544112052e-05
3750.00000  3800.00000  5.892919489485e-05
3800.00000  3850.00000  7.184518281700e-05
3850.00000  3900.00000  6.054369338512e-05
3900.00000  3950.00000  7.668867828781e-05
3950.00000  4000.00000  9.606266017105e-05
4000.00000  4050.00000  7.426693055241e-05
4050.00000  4100.00000  7.507417979754e-05
4100.00000  4150.00000  9.848440790646e-05
4150.00000  4200.00000  7.830317677808e-05
4200.00000  4250.00000  9.364091243565e-05
4250.00000  4300.00000  9.929165715159e-05
4300.00000  4350.00000  1.114003958286e-04
4350.00000  4400.00000  1.000989063967e-04
4400.00000  4450.00000  1.146293928092e-04
4450.00000  4500.00000  1.315816269570e-04
4500.00000  4550.00000  1.348106239375e-04
4550.00000  4600.00000  1.218946360154e-04
4600.00000  4650.00000  1.396541194083e-04
4650.00000  4700.00000  1.331961254473e-04
4700.00000  4750.00000  1.574136028013e-04
4750.00000  4800.00000  1.840528278908e-04
4800.00000  4850.00000  1.751730861943e-04
4850.00000  4900.00000  1.614498490270e-04
4900.00000  4950.00000  1.566063535562e-04
4950.00000  5000.00000  1.767875846845e-04
5000.00000  5050.00000  1.913180710970e-04
5050.00000  5100.00000  2.098848037351e-04
5100.00000  5150.00000  1.832455786456e-04
5150.00000  5200.00000  1.872818248713e-04
5200.00000  5250.00000  2.244152901475e-04
5250.00000  5300.00000  2.163427976961e-04
5300.00000  5350.00000  2.155355484510e-04
5350.00000  5400.00000  2.179572961864e-04
5400.00000  5450.00000  2.300660348634e-04
5450.00000  5500.00000  2.219935424121e-04
5500.00000  5550.00000  2.074630559997e-04
5550.00000  5600.00000  2.405602750502e-04
5600.00000  5650.00000  2.494400167467e-04
5650.00000  5700.00000  2.341022810891e-04
5700.00000  5750.00000  2.454037705210e-04
5750.00000  5800.00000  2.332950318440e-04
5800.00000  5850.00000  2.284515363732e-04
5850.00000  5900.00000  2.494400167467e-04
5900.00000  5950.00000  2.373312780697e-04
5950.00000  6000.00000  2.486327675015e-04
6000.00000  6050.00000  2.720429956105e-04
6050.00000  6100.00000  2.381385273148e-04
6100.00000  6150.00000  2.502472659918e-04
6150.00000  6200.00000  2.736574941007e-04
6200.00000  6250.00000  2.631632539140e-04
6250.00000  6300.00000  2.704284971202e-04
6300.00000  6350.00000  2.768864910813e-04
6350.00000  6400.00000  8.742509324811e-04
6400.00000  6450.00000  2.454037705210e-04
6450.00000  6500.00000  2.671995001396e-04
6500.00000  6550.00000  2.550907614626e-04
6550.00000  6600.00000  2.276442871280e-04
6600.00000  6650.00000  2.445965212759e-04
6650.00000  6700.00000  2.445965212759e-04
6700.00000  6750.00000  2.486327675015e-04
6750.00000  6800.00000  2.494400167467e-04
6800.00000  6850.00000  2.332950318440e-04
6850.00000  6900.00000  2.454037705210e-04
6900.00000  6950.00000  2.462110197661e-04
6950.00000  7000.00000  2.486327675015e-04
7000.00000  7050.00000  2.567052599529e-04
7050.00000  7100.00000  2.680067493848e-04
7100.00000  7150.00000  1.089786480932e-04
7150.00000  7200.00000  1.025206541321e-04
7200.00000  7250.00000  1.097858973383e-04
7250.00000  7300.00000  1.081713988481e-04
7300.00000  7350.00000  1.097858973383e-04
7350.00000  7400.00000  1.210873867702e-04
7400.00000  7450.00000  1.000989063967e-04
7450.00000  7500.00000  1.154366420543e-04
7500.00000  7550.00000  1.009061556419e-04
7550.00000  7600.00000  1.000989063967e-04
7600.00000  7650.00000  1.259308822410e-04
7650.00000  7700.00000  1.218946360154e-04
7700.00000  7750.00000  1.081713988481e-04
7750.00000  7800.00000  1.186656390348e-04
7800.00000  7850.00000  9.283366319051e-05
7850.00000  7900.00000  1.218946360154e-04
7900.00000  7950.00000  1.404613686535e-04
7950.00000  8000.00000  1.057496511127e-04
8000.00000  8050.00000  1.065569003578e-04
8050.00000  8100.00000  1.089786480932e-04
8100.00000  8150.00000  9.848440790646e-05
8150.00000  8200.00000  1.049424018675e-04
8200.00000  8250.00000  1.009061556419e-04
8250.00000  8300.00000  1.049424018675e-04
8300.00000  8350.00000  9.283366319051e-05
8350.00000  8400.00000  8.879741696484e-05
8400.00000  8450.00000  1.178583897897e-04
8450.00000  8500.00000  1.009061556419e-04
8500.00000  8550.00000  1.081713988481e-04
8550.00000  8600.00000  1.146293928092e-04
8600.00000  8650.00000  8.153217375862e-05
8650.00000  8700.00000  8.556841998430e-05
8700.00000  8750.00000  9.767715866132e-05
8750.00000  8800.00000  1.122076450737e-04
8800.00000  8850.00000  9.444816168078e-05
8850.00000  8900.00000  8.476117073916e-05
8900.00000  8950.00000  8.395392149403e-05
8950.00000  9000.00000  1.089786480932e-04
9000.00000  9050.00000  8.879741696484e-05
9050.00000  9100.00000  1.025206541321e-04
9100.00000  9150.00000  9.364091243565e-05
9150.00000  9200.00000  1.057496511127e-04
9200.00000  9250.00000  9.364091243565e-05
9250.00000  9300.00000  9.686990941619e-05
9300.00000  9350.00000  7.911042602322e-05
9350.00000  9400.00000  1.009061556419e-04
9400.00000  9450.00000  9.686990941619e-05
9450.00000  9500.00000  7.830317677808e-05
9500.00000  9550.00000  9.848440790646e-05
9550.00000  9600.00000  8.718291847457e-05
9600.00000  9650.00000  8.233942300376e-05
9650.00000  9700.00000  7.991767526835e-05
9700.00000  9750.00000  1.000989063967e-04
9750.00000  9800.00000  8.395392149403e-05
9800.00000  9850.00000  9.121916470024e-05
9850.00000  9900.00000  8.960466620997e-05
9900.00000  9950.00000  7.426693055241e-05
9950.00000  10000.00000  8.395392149403e-05
