300.00000  350.00000  9.668184425746e-05
350.00000  400.00000  8.841536686741e-05
400.00000  450.00000  6.433475881816e-05
450.00000  500.00000  4.744239197764e-05
500.00000  550.00000  2.131313518389e-04
550.00000  600.00000  3.162826131842e-05
600.00000  650.00000  7.367947238951e-05
650.00000  700.00000  3.486296986235e-05
700.00000  750.00000  4.025415076890e-05
750.00000  800.00000  3.414414574148e-05
800.00000  850.00000  9.344713571353e-05
850.00000  900.00000  2.587766835144e-05
900.00000  950.00000  2.479943217013e-05
950.00000  1000.00000  2.264295980751e-05
1000.00000  1050.00000  2.839355277449e-05
1050.00000  1100.00000  2.623708041187e-05
1100.00000  1150.00000  2.551825629100e-05
1150.00000  1200.00000  2.587766835144e-05
1200.00000  1250.00000  2.372119598882e-05
1250.00000  1300.00000  5.750592966986e-05
1300.00000  1350.00000  1.940825126358e-05
1350.00000  1400.00000  2.300237186794e-05
1400.00000  1450.00000  2.623708041187e-05
1450.00000  1500.00000  2.803414071406e-05
1500.00000  1550.00000  1.833001508227e-05
1550.00000  1600.00000  1.868942714271e-05
1600.00000  1650.00000  2.264295980751e-05
1650.00000  1700.00000  1.581413065921e-05
1700.00000  1750.00000  4.888004021938e-05
1750.00000  1800.00000  2.084589950532e-05
1800.00000  1850.00000  1.797060302183e-05
1850.00000  1900.00000  1.833001508227e-05
1900.00000  1950.00000  2.048648744489e-05
1950.00000  2000.00000  1.617354271965e-05
2000.00000  2050.00000  1.653295478009e-05
2050.00000  2100.00000  1.797060302183e-05
2100.00000  2150.00000  1.545471859878e-05
2150.00000  2200.00000  1.976766332401e-05
2200.00000  2250.00000  1.617354271965e-05
2250.00000  2300.00000  1.545471859878e-05
2300.00000  2350.00000  3.989473870847e-05
2350.00000  2400.00000  1.329824623616e-05
2400.00000  2450.00000  1.689236684052e-05
2450.00000  2500.00000  1.725177890096e-05
2500.00000  2550.00000  1.222001005485e-05
2550.00000  2600.00000  1.257942211528e-05
2600.00000  2650.00000  1.617354271965e-05
2650.00000  2700.00000  1.329824623616e-05
2700.00000  2750.00000  1.617354271965e-05
2750.00000  2800.00000  1.186059799441e-05
2800.00000  2850.00000  1.581413065921e-05
2850.00000  2900.00000  1.653295478009e-05
2900.00000  2950.00000  1.653295478009e-05
2950.00000  3000.00000  2.300237186794e-05
3000.00000  3050.00000  1.150118593397e-05
3050.00000  3100.00000  1.078236181310e-05
3100.00000  3150.00000  1.581413065921e-05
3150.00000  3200.00000  1.473589447790e-05
3200.00000  3250.00000  1.293883417572e-05
3250.00000  3300.00000  1.078236181310e-05
3300.00000  3350.00000  1.042294975266e-05
3350.00000  3400.00000  1.509530653834e-05
3400.00000  3450.00000  1.653295478009e-05
3450.00000  3500.00000  1.293883417572e-05
3500.00000  3550.00000  1.329824623616e-05
3550.00000  3600.00000  1.042294975266e-05
3600.00000  3650.00000  1.617354271965e-05
3650.00000  3700.00000  1.976766332401e-05
3700.00000  3750.00000  1.509530653834e-05
3750.00000  3800.00000  1.042294975266e-05
3800.00000  3850.00000  1.797060302183e-05
3850.00000  3900.00000  1.617354271965e-05
3900.00000  3950.00000  1.365765829659e-05
3950.00000  4000.00000  1.976766332401e-05
4000.00000  4050.00000  1.617354271965e-05
4050.00000  4100.00000  1.257942211528e-05
4100.00000  4150.00000  1.545471859878e-05
4150.00000  4200.00000  1.797060302183e-05
4200.00000  4250.00000  1.473589447790e-05
4250.00000  4300.00000  1.868942714271e-05
4300.00000  4350.00000  1.473589447790e-05
4350.00000  4400.00000  1.581413065921e-05
4400.00000  4450.00000  1.222001005485e-05
4450.00000  4500.00000  1.761119096140e-05
4500.00000  4550.00000  1.833001508227e-05
4550.00000  4600.00000  1.976766332401e-05
4600.00000  4650.00000  2.228354774707e-05
4650.00000  4700.00000  1.904883920314e-05
4700.00000  4750.00000  1.617354271965e-05
4750.00000  4800.00000  1.868942714271e-05
4800.00000  4850.00000  1.581413065921e-05
4850.00000  4900.00000  1.797060302183e-05
4900.00000  4950.00000  1.976766332401e-05
4950.00000  5000.00000  1.761119096140e-05
5000.00000  5050.00000  1.940825126358e-05
5050.00000  5100.00000  1.868942714271e-05
5100.00000  5150.00000  2.048648744489e-05
5150.00000  5200.00000  1.797060302183e-05
5200.00000  5250.00000  1.725177890096e-05
5250.00000  5300.00000  1.473589447790e-05
5300.00000  5350.00000  2.156472362620e-05
5350.00000  5400.00000  1.725177890096e-05
5400.00000  5450.00000  2.228354774707e-05
5450.00000  5500.00000  1.976766332401e-05
5500.00000  5550.00000  2.048648744489e-05
5550.00000  5600.00000  1.868942714271e-05
5600.00000  5650.00000  1.725177890096e-05
5650.00000  5700.00000  1.473589447790e-05
5700.00000  5750.00000  1.653295478009e-05
5750.00000  5800.00000  1.437648241747e-05
5800.00000  5850.00000  2.156472362620e-05
5850.00000  5900.00000  1.868942714271e-05
5900.00000  5950.00000  1.617354271965e-05
5950.00000  6000.00000  2.012707538445e-05
6000.00000  6050.00000  1.725177890096e-05
6050.00000  6100.00000  1.868942714271e-05
6100.00000  6150.00000  2.156472362620e-05
6150.00000  6200.00000  2.336178392838e-05
6200.00000  6250.00000  2.444002010969e-05
6250.00000  6300.00000  3.522238192279e-05
6300.00000  6350.00000  2.659649247231e-05
6350.00000  6400.00000  2.451190252178e-04
6400.00000  6450.00000  1.940825126358e-05
6450.00000  6500.00000  1.797060302183e-05
6500.00000  6550.00000  1.833001508227e-05
6550.00000  6600.00000  1.509530653834e-05
6600.00000  6650.00000  1.797060302183e-05
6650.00000  6700.00000  1.976766332401e-05
6700.00000  6750.00000  2.120531156576e-05
6750.00000  6800.00000  1.509530653834e-05
6800.00000  6850.00000  2.264295980751e-05
6850.00000  6900.00000  1.797060302183e-05
6900.00000  6950.00000  1.689236684052e-05
6950.00000  7000.00000  2.084589950532e-05
7000.00000  7050.00000  1.545471859878e-05
7050.00000  7100.00000  3.917591458759e-05
7100.00000  7150.00000  1.545471859878e-05
7150.00000  7200.00000  9.344713571353e-06
7200.00000  7250.00000  1.114177387354e-05
7250.00000  7300.00000  1.114177387354e-05
7300.00000  7350.00000  1.365765829659e-05
7350.00000  7400.00000  1.293883417572e-05
7400.00000  7450.00000  1.042294975266e-05
7450.00000  7500.00000  1.761119096140e-05
7500.00000  7550.00000  1.006353769223e-05
7550.00000  7600.00000  9.704125631789e-06
7600.00000  7650.00000  8.985301510916e-06
7650.00000  7700.00000  7.907065329606e-06
7700.00000  7750.00000  1.186059799441e-05
7750.00000  7800.00000  1.509530653834e-05
7800.00000  7850.00000  1.150118593397e-05
7850.00000  7900.00000  1.078236181310e-05
7900.00000  7950.00000  1.186059799441e-05
7950.00000  8000.00000  1.293883417572e-05
8000.00000  8050.00000  8.266477390043e-06
8050.00000  8100.00000  1.006353769223e-05
8100.00000  8150.00000  6.828829148296e-06
8150.00000  8200.00000  8.266477390043e-06
8200.00000  8250.00000  9.344713571353e-06
8250.00000  8300.00000  6.469417087859e-06
8300.00000  8350.00000  1.222001005485e-05
8350.00000  8400.00000  9.344713571353e-06
8400.00000  8450.00000  7.547653269169e-06
8450.00000  8500.00000  1.329824623616e-05
8500.00000  8550.00000  7.907065329606e-06
8550.00000  8600.00000  6.110005027423e-06
8600.00000  8650.00000  1.257942211528e-05
8650.00000  8700.00000  7.907065329606e-06
8700.00000  8750.00000  8.625889450479e-06
8750.00000  8800.00000  9.344713571353e-06
8800.00000  8850.00000  1.042294975266e-05
8850.00000  8900.00000  1.222001005485e-05
8900.00000  8950.00000  1.150118593397e-05
8950.00000  9000.00000  8.985301510916e-06
9000.00000  9050.00000  1.078236181310e-05
9050.00000  9100.00000  1.329824623616e-05
9100.00000  9150.00000  8.266477390043e-06
9150.00000  9200.00000  9.704125631789e-06
9200.00000  9250.00000  9.704125631789e-06
9250.00000  9300.00000  9.344713571353e-06
9300.00000  9350.00000  9.344713571353e-06
9350.00000  9400.00000  7.547653269169e-06
9400.00000  9450.00000  7.907065329606e-06
9450.00000  9500.00000  1.222001005485e-05
9500.00000  9550.00000  1.042294975266e-05
9550.00000  9600.00000  1.078236181310e-05
9600.00000  9650.00000  1.042294975266e-05
9650.00000  9700.00000  7.907065329606e-06
9700.00000  9750.00000  1.114177387354e-05
9750.00000  9800.00000  6.469417087859e-06
9800.00000  9850.00000  1.222001005485e-05
9850.00000  9900.00000  8.985301510916e-06
9900.00000  9950.00000  7.188241208733e-06
9950.00000  10000.00000  1.006353769223e-05
