10001.00000  11001.00000  8.425339207471e-04
11001.00000  12001.00000  7.174733668045e-04
12001.00000  13001.00000  6.120620138405e-04
13001.00000  14001.00000  5.267540036341e-04
14001.00000  15001.00000  4.611860227622e-04
15001.00000  16001.00000  4.058311859017e-04
16001.00000  17001.00000  3.594986323873e-04
17001.00000  18001.00000  3.204525314186e-04
18001.00000  19001.00000  2.855643507392e-04
19001.00000  20001.00000  2.561258714097e-04
20001.00000  21001.00000  2.330151008700e-04
21001.00000  22001.00000  2.090162308510e-04
22001.00000  23001.00000  1.883477338792e-04
23001.00000  24001.00000  1.704343637010e-04
24001.00000  25001.00000  1.597368017918e-04
25001.00000  26001.00000  1.448409514351e-04
26001.00000  27001.00000  1.307221881229e-04
27001.00000  28001.00000  1.201457306881e-04
28001.00000  29001.00000  1.117895219514e-04
29001.00000  30001.00000  1.036654301241e-04
30001.00000  31001.00000  9.519820895260e-05
31001.00000  32001.00000  8.846681858141e-05
32001.00000  33001.00000  8.270426400578e-05
33001.00000  34001.00000  7.732520693256e-05
34001.00000  35001.00000  7.227918716405e-05
35001.00000  36001.00000  6.530558784398e-05
36001.00000  37001.00000  6.143024466177e-05
37001.00000  38001.00000  5.735306068882e-05
38001.00000  39001.00000  5.335661303216e-05
39001.00000  40001.00000  5.062167031763e-05
40001.00000  41001.00000  4.619126496089e-05
41001.00000  42001.00000  4.363797895802e-05
42001.00000  43001.00000  4.018650143637e-05
43001.00000  44001.00000  3.936904623387e-05
44001.00000  45001.00000  3.660382740073e-05
45001.00000  46001.00000  3.531204633999e-05
46001.00000  47001.00000  3.144679519732e-05
47001.00000  48001.00000  2.924673057825e-05
48001.00000  49001.00000  2.871185248279e-05
49001.00000  50001.00000  2.744025550112e-05
50001.00000  51001.00000  2.599709384733e-05
51001.00000  52001.00000  2.447319587724e-05
52001.00000  53001.00000  2.230340737679e-05
53001.00000  54001.00000  2.158687256966e-05
54001.00000  55001.00000  2.063822085318e-05
55001.00000  56001.00000  1.875100945976e-05
56001.00000  57001.00000  1.851889255041e-05
57001.00000  58001.00000  1.718674333152e-05
58001.00000  59001.00000  1.634910404995e-05
59001.00000  60001.00000  1.518851950320e-05
60001.00000  61001.00000  1.563256924283e-05
61001.00000  62001.00000  1.342241258422e-05
62001.00000  63001.00000  1.291781060737e-05
63001.00000  64001.00000  1.258477330265e-05
64001.00000  65001.00000  1.172694994200e-05
65001.00000  66001.00000  1.178750217923e-05
66001.00000  67001.00000  1.095995493719e-05
67001.00000  68001.00000  1.044526092080e-05
68001.00000  69001.00000  1.005167137886e-05
69001.00000  70001.00000  9.880106706731e-06
70001.00000  71001.00000  9.234216176362e-06
71001.00000  72001.00000  8.467221171550e-06
72001.00000  73001.00000  8.063539590069e-06
73001.00000  74001.00000  7.760778403959e-06
74001.00000  75001.00000  7.417649059701e-06
75001.00000  76001.00000  7.145163992202e-06
76001.00000  77001.00000  6.590101817666e-06
77001.00000  78001.00000  7.074519715443e-06
78001.00000  79001.00000  6.327708789704e-06
79001.00000  80001.00000  5.661634180262e-06
80001.00000  81001.00000  5.712094377947e-06
81001.00000  82001.00000  5.338688915077e-06
82001.00000  83001.00000  5.227676480170e-06
83001.00000  84001.00000  4.702890424246e-06
84001.00000  85001.00000  4.743258582394e-06
85001.00000  86001.00000  4.319392921839e-06
86001.00000  87001.00000  4.036815814803e-06
87001.00000  88001.00000  4.218472526469e-06
88001.00000  89001.00000  4.379945159061e-06
89001.00000  90001.00000  3.744146668230e-06
90001.00000  91001.00000  3.582674035638e-06
91001.00000  92001.00000  3.582674035638e-06
92001.00000  93001.00000  2.946875544806e-06
93001.00000  94001.00000  3.209268572769e-06
94001.00000  95001.00000  3.078072058787e-06
95001.00000  96001.00000  2.634022319159e-06
96001.00000  97001.00000  2.785402912214e-06
97001.00000  98001.00000  2.896415347121e-06
98001.00000  99001.00000  2.664298437770e-06
99001.00000  100001.00000  2.371629291197e-06
100001.00000  101001.00000  2.321169093512e-06
101001.00000  102001.00000  2.300985014438e-06
102001.00000  103001.00000  2.351445212123e-06
103001.00000  104001.00000  2.290892974901e-06
104001.00000  105001.00000  1.867027314346e-06
105001.00000  106001.00000  2.159696460920e-06
106001.00000  107001.00000  1.786290998050e-06
107001.00000  108001.00000  1.594542246847e-06
108001.00000  109001.00000  1.766106918976e-06
109001.00000  110001.00000  1.574358167773e-06
110001.00000  111001.00000  1.735830800365e-06
111001.00000  112001.00000  1.533990009625e-06
112001.00000  113001.00000  1.665186523606e-06
113001.00000  114001.00000  1.493621851477e-06
114001.00000  115001.00000  1.160584546756e-06
115001.00000  116001.00000  1.180768625830e-06
116001.00000  117001.00000  1.241320863052e-06
117001.00000  118001.00000  1.372517377033e-06
118001.00000  119001.00000  1.231228823515e-06
119001.00000  120001.00000  1.019295993238e-06
120001.00000  121001.00000  1.190860665367e-06
121001.00000  122001.00000  9.486517164788e-07
122001.00000  123001.00000  9.789278350898e-07
123001.00000  124001.00000  9.890198746268e-07
124001.00000  125001.00000  9.183755978677e-07
125001.00000  126001.00000  8.477313211087e-07
126001.00000  127001.00000  7.770870443496e-07
127001.00000  128001.00000  9.587437560158e-07
128001.00000  129001.00000  8.679154001827e-07
129001.00000  130001.00000  8.780074397197e-07
130001.00000  131001.00000  7.266268466646e-07
131001.00000  132001.00000  7.064427675906e-07
132001.00000  133001.00000  8.275472420347e-07
133001.00000  134001.00000  6.761666489795e-07
134001.00000  135001.00000  7.064427675906e-07
135001.00000  136001.00000  5.853382931465e-07
136001.00000  137001.00000  6.357984908315e-07
137001.00000  138001.00000  5.550621745354e-07
138001.00000  139001.00000  6.055223722205e-07
139001.00000  140001.00000  4.339577000913e-07
140001.00000  141001.00000  4.541417791654e-07
141001.00000  142001.00000  4.541417791654e-07
142001.00000  143001.00000  5.348780954614e-07
143001.00000  144001.00000  4.440497396284e-07
144001.00000  145001.00000  4.844178977764e-07
145001.00000  146001.00000  5.853382931465e-07
146001.00000  147001.00000  3.633134233323e-07
147001.00000  148001.00000  3.330373047213e-07
148001.00000  149001.00000  3.935895419433e-07
149001.00000  150001.00000  4.036815814803e-07
150001.00000  151001.00000  4.137736210173e-07
151001.00000  152001.00000  3.935895419433e-07
152001.00000  153001.00000  4.137736210173e-07
153001.00000  154001.00000  3.834975024063e-07
154001.00000  155001.00000  4.339577000913e-07
155001.00000  156001.00000  3.734054628693e-07
156001.00000  157001.00000  1.614726325921e-07
157001.00000  158001.00000  3.532213837953e-07
158001.00000  159001.00000  2.926691465732e-07
159001.00000  160001.00000  3.734054628693e-07
160001.00000  161001.00000  2.018407907402e-07
161001.00000  162001.00000  2.220248698142e-07
162001.00000  163001.00000  2.321169093512e-07
163001.00000  164001.00000  1.917487512032e-07
164001.00000  165001.00000  1.715646721291e-07
165001.00000  166001.00000  1.614726325921e-07
166001.00000  167001.00000  1.412885535181e-07
167001.00000  168001.00000  1.614726325921e-07
168001.00000  169001.00000  1.211044744441e-07
169001.00000  170001.00000  2.321169093512e-07
170001.00000  171001.00000  1.412885535181e-07
171001.00000  172001.00000  1.917487512032e-07
172001.00000  173001.00000  1.110124349071e-07
173001.00000  174001.00000  2.321169093512e-07
174001.00000  175001.00000  1.917487512032e-07
175001.00000  176001.00000  1.311965139811e-07
176001.00000  177001.00000  1.614726325921e-07
177001.00000  178001.00000  1.412885535181e-07
178001.00000  179001.00000  1.412885535181e-07
179001.00000  180001.00000  1.715646721291e-07
180001.00000  181001.00000  1.412885535181e-07
181001.00000  182001.00000  1.211044744441e-07
182001.00000  183001.00000  1.513805930551e-07
183001.00000  184001.00000  1.412885535181e-07
184001.00000  185001.00000  1.412885535181e-07
185001.00000  186001.00000  7.064427675906e-08
186001.00000  187001.00000  1.110124349071e-07
187001.00000  188001.00000  1.110124349071e-07
188001.00000  189001.00000  8.073631629606e-08
189001.00000  190001.00000  8.073631629606e-08
190001.00000  191001.00000  1.211044744441e-07
191001.00000  192001.00000  9.082835583307e-08
192001.00000  193001.00000  9.082835583307e-08
193001.00000  194001.00000  1.009203953701e-07
194001.00000  195001.00000  5.046019768504e-08
195001.00000  196001.00000  6.055223722205e-08
196001.00000  197001.00000  1.211044744441e-07
197001.00000  198001.00000  9.082835583307e-08
198001.00000  199001.00000  6.055223722205e-08
