300.00000  350.00000  7.004609224704e-02
350.00000  400.00000  5.229972761493e-02
400.00000  450.00000  4.074217434601e-02
450.00000  500.00000  3.236330419237e-02
500.00000  550.00000  2.656086060736e-02
550.00000  600.00000  2.212032495757e-02
600.00000  650.00000  1.861299833376e-02
650.00000  700.00000  1.588610383559e-02
700.00000  750.00000  1.391616692674e-02
750.00000  800.00000  1.218174503805e-02
800.00000  850.00000  1.074787417999e-02
850.00000  900.00000  9.401744211799e-03
900.00000  950.00000  8.368864613564e-03
950.00000  1000.00000  7.614600823497e-03
1000.00000  1050.00000  6.924603386972e-03
1050.00000  1100.00000  6.238069406625e-03
1100.00000  1150.00000  5.749337256939e-03
1150.00000  1200.00000  5.162473848851e-03
1200.00000  1250.00000  4.751477048957e-03
1250.00000  1300.00000  4.442074963644e-03
1300.00000  1350.00000  4.090341747256e-03
1350.00000  1400.00000  3.762852724120e-03
1400.00000  1450.00000  3.469613434308e-03
1450.00000  1500.00000  3.273735745969e-03
1500.00000  1550.00000  3.074009772987e-03
1550.00000  1600.00000  2.860429975290e-03
1600.00000  1650.00000  2.689566137132e-03
1650.00000  1700.00000  2.534480266011e-03
1700.00000  1750.00000  2.380548880283e-03
1750.00000  1800.00000  2.261636884808e-03
1800.00000  1850.00000  2.123868294581e-03
1850.00000  1900.00000  1.994181102106e-03
1900.00000  1950.00000  1.926066463921e-03
1950.00000  2000.00000  1.808693782303e-03
2000.00000  2050.00000  1.739424658726e-03
2050.00000  2100.00000  1.627439575609e-03
2100.00000  2150.00000  1.588956729177e-03
2150.00000  2200.00000  1.516608977885e-03
2200.00000  2250.00000  1.374992103015e-03
2250.00000  2300.00000  1.372298303765e-03
2300.00000  2350.00000  1.335354771190e-03
2350.00000  2400.00000  1.276860844613e-03
2400.00000  2450.00000  1.192968239392e-03
2450.00000  2500.00000  1.127932228922e-03
2500.00000  2550.00000  1.125238429671e-03
2550.00000  2600.00000  1.084446612453e-03
2600.00000  2650.00000  1.034418912092e-03
2650.00000  2700.00000  9.486021645485e-04
2700.00000  2750.00000  9.309000551898e-04
2750.00000  2800.00000  9.185855443315e-04
2800.00000  2850.00000  8.639399023981e-04
2850.00000  2900.00000  8.458529645751e-04
2900.00000  2950.00000  8.050611473572e-04
2950.00000  3000.00000  7.981342349994e-04
3000.00000  3050.00000  7.419492792087e-04
3050.00000  3100.00000  7.215533705998e-04
3100.00000  3150.00000  7.392554799585e-04
3150.00000  3200.00000  6.892277795969e-04
3200.00000  3250.00000  6.507449331649e-04
3250.00000  3300.00000  6.468966485217e-04
3300.00000  3350.00000  6.091834590183e-04
3350.00000  3400.00000  5.953296343028e-04
3400.00000  3450.00000  6.011020612676e-04
3450.00000  3500.00000  5.764730395512e-04
3500.00000  3550.00000  5.476109047272e-04
3550.00000  3600.00000  5.210577406891e-04
3600.00000  3650.00000  5.222122260821e-04
3650.00000  3700.00000  5.326025946187e-04
3700.00000  3750.00000  4.856535219717e-04
3750.00000  3800.00000  4.641031279698e-04
3800.00000  3850.00000  4.710300403275e-04
3850.00000  3900.00000  4.648727848984e-04
3900.00000  3950.00000  4.548672448261e-04
3950.00000  4000.00000  4.348561646814e-04
4000.00000  4050.00000  4.163843983941e-04
4050.00000  4100.00000  4.210023399659e-04
4100.00000  4150.00000  4.048395444645e-04
4150.00000  4200.00000  4.129209422152e-04
4200.00000  4250.00000  3.802105227480e-04
4250.00000  4300.00000  3.852132927842e-04
4300.00000  4350.00000  3.621235849250e-04
4350.00000  4400.00000  3.702049826757e-04
4400.00000  4450.00000  3.575056433532e-04
4450.00000  4500.00000  3.328766216367e-04
4500.00000  4550.00000  3.382642201372e-04
4550.00000  4600.00000  3.401883624588e-04
4600.00000  4650.00000  3.247952238860e-04
4650.00000  4700.00000  3.086324283845e-04
4700.00000  4750.00000  3.182531399925e-04
4750.00000  4800.00000  2.940089467404e-04
4800.00000  4850.00000  3.147896838137e-04
4850.00000  4900.00000  3.028600014197e-04
4900.00000  4950.00000  2.890061767042e-04
4950.00000  5000.00000  2.947786036690e-04
5000.00000  5050.00000  2.893910051685e-04
5050.00000  5100.00000  2.701495819525e-04
5100.00000  5150.00000  2.670709542380e-04
5150.00000  5200.00000  2.624530126661e-04
5200.00000  5250.00000  2.605288703445e-04
5250.00000  5300.00000  2.405177901999e-04
5300.00000  5350.00000  2.578350710943e-04
5350.00000  5400.00000  2.320515639849e-04
5400.00000  5450.00000  2.501385018079e-04
5450.00000  5500.00000  2.305122501276e-04
5500.00000  5550.00000  2.312819070562e-04
5550.00000  5600.00000  2.339757063065e-04
5600.00000  5650.00000  2.274336224130e-04
5650.00000  5700.00000  2.274336224130e-04
5700.00000  5750.00000  2.178129108050e-04
5750.00000  5800.00000  2.012652868393e-04
5800.00000  5850.00000  2.212763669839e-04
5850.00000  5900.00000  1.974170021961e-04
5900.00000  5950.00000  2.112708269116e-04
5950.00000  6000.00000  2.028046006966e-04
6000.00000  6050.00000  1.885659475167e-04
6050.00000  6100.00000  2.016501153036e-04
6100.00000  6150.00000  1.851024913379e-04
6150.00000  6200.00000  1.854873198022e-04
6200.00000  6250.00000  1.897204329097e-04
6250.00000  6300.00000  1.997259729820e-04
6300.00000  6350.00000  1.851024913379e-04
6350.00000  6400.00000  3.732836103903e-04
6400.00000  6450.00000  1.727879804796e-04
6450.00000  6500.00000  1.793300643731e-04
6500.00000  6550.00000  1.685548673721e-04
6550.00000  6600.00000  1.758666081942e-04
6600.00000  6650.00000  1.685548673721e-04
6650.00000  6700.00000  1.704790096937e-04
6700.00000  6750.00000  1.508527580134e-04
6750.00000  6800.00000  1.674003819791e-04
6800.00000  6850.00000  1.600886411571e-04
6850.00000  6900.00000  1.554706995852e-04
6900.00000  6950.00000  1.481589587631e-04
6950.00000  7000.00000  1.539313857279e-04
7000.00000  7050.00000  1.431561887270e-04
7050.00000  7100.00000  1.539313857279e-04
7100.00000  7150.00000  1.300720209401e-04
7150.00000  7200.00000  1.246844224396e-04
7200.00000  7250.00000  1.192968239392e-04
7250.00000  7300.00000  1.343051340476e-04
7300.00000  7350.00000  1.185271670105e-04
7350.00000  7400.00000  1.266085647612e-04
7400.00000  7450.00000  1.189119954748e-04
7450.00000  7500.00000  1.500831010847e-04
7500.00000  7550.00000  1.285327070828e-04
7550.00000  7600.00000  1.146788823673e-04
7600.00000  7650.00000  1.081367984739e-04
7650.00000  7700.00000  1.116002546528e-04
7700.00000  7750.00000  1.096761123312e-04
7750.00000  7800.00000  1.177575100819e-04
7800.00000  7850.00000  1.146788823673e-04
7850.00000  7900.00000  1.142940539030e-04
7900.00000  7950.00000  9.967057225885e-05
7950.00000  8000.00000  1.035188569020e-04
8000.00000  8050.00000  1.119850831171e-04
8050.00000  8100.00000  1.039036853664e-04
8100.00000  8150.00000  1.035188569020e-04
8150.00000  8200.00000  1.054429992236e-04
8200.00000  8250.00000  9.158917450813e-05
8250.00000  8300.00000  1.085216269382e-04
8300.00000  8350.00000  9.890091533021e-05
8350.00000  8400.00000  1.000554007232e-04
8400.00000  8450.00000  9.736160147293e-05
8450.00000  8500.00000  9.274365990109e-05
8500.00000  8550.00000  9.081951757949e-05
8550.00000  8600.00000  9.004986065085e-05
8600.00000  8650.00000  1.000554007232e-04
8650.00000  8700.00000  9.235883143677e-05
8700.00000  8750.00000  9.004986065085e-05
8750.00000  8800.00000  9.351331682973e-05
8800.00000  8850.00000  8.735606140061e-05
8850.00000  8900.00000  8.427743368605e-05
8900.00000  8950.00000  9.582228761565e-05
8950.00000  9000.00000  7.388706514941e-05
9000.00000  9050.00000  8.543191907901e-05
9050.00000  9100.00000  9.043468911517e-05
9100.00000  9150.00000  7.888983518557e-05
9150.00000  9200.00000  8.312294829309e-05
9200.00000  9250.00000  8.235329136445e-05
9250.00000  9300.00000  8.620157600765e-05
9300.00000  9350.00000  7.350223668509e-05
9350.00000  9400.00000  6.118772582686e-05
9400.00000  9450.00000  7.465672207805e-05
9450.00000  9500.00000  7.504155054237e-05
9500.00000  9550.00000  8.042914904285e-05
9550.00000  9600.00000  7.696569286397e-05
9600.00000  9650.00000  6.272703968414e-05
9650.00000  9700.00000  6.619049586302e-05
9700.00000  9750.00000  6.465118200574e-05
9750.00000  9800.00000  8.004432057853e-05
9800.00000  9850.00000  6.542083893438e-05
9850.00000  9900.00000  6.619049586302e-05
9900.00000  9950.00000  6.580566739870e-05
9950.00000  10000.00000  6.965395204190e-05
