10001.00000  11001.00000  3.679223831025e-04
11001.00000  12001.00000  2.949987766653e-04
12001.00000  13001.00000  2.406858822877e-04
13001.00000  14001.00000  1.925638982481e-04
14001.00000  15001.00000  1.625588726828e-04
15001.00000  16001.00000  1.384788901406e-04
16001.00000  17001.00000  1.176652774700e-04
17001.00000  18001.00000  1.014473712467e-04
18001.00000  19001.00000  8.728044145448e-05
19001.00000  20001.00000  7.922845991038e-05
20001.00000  21001.00000  6.916348298025e-05
21001.00000  22001.00000  6.073169098595e-05
22001.00000  23001.00000  5.514847736811e-05
23001.00000  24001.00000  4.686860955389e-05
24001.00000  25001.00000  4.432387953759e-05
25001.00000  26001.00000  3.969019204523e-05
26001.00000  27001.00000  3.676565157874e-05
27001.00000  28001.00000  3.065070333062e-05
28001.00000  29001.00000  2.867568898961e-05
29001.00000  30001.00000  2.540931911795e-05
30001.00000  31001.00000  2.332036164189e-05
31001.00000  32001.00000  2.332036164189e-05
32001.00000  33001.00000  2.031985908536e-05
33001.00000  34001.00000  2.012995386026e-05
34001.00000  35001.00000  1.754724279894e-05
35001.00000  36001.00000  1.739531861887e-05
36001.00000  37001.00000  1.428087292728e-05
37001.00000  38001.00000  1.390106247708e-05
38001.00000  39001.00000  1.496453173763e-05
39001.00000  40001.00000  1.302749844164e-05
40001.00000  41001.00000  1.249576381137e-05
41001.00000  42001.00000  1.074863574048e-05
42001.00000  43001.00000  1.010295797515e-05
43001.00000  44001.00000  9.191412894684e-06
44001.00000  45001.00000  8.811602444491e-06
45001.00000  46001.00000  8.089962589123e-06
46001.00000  47001.00000  7.862076319007e-06
47001.00000  48001.00000  7.026493328581e-06
48001.00000  49001.00000  7.178417508658e-06
49001.00000  50001.00000  7.368322733755e-06
50001.00000  51001.00000  6.836588103484e-06
51001.00000  52001.00000  5.697156752904e-06
52001.00000  53001.00000  6.001005113058e-06
53001.00000  54001.00000  6.304853473213e-06
54001.00000  55001.00000  5.013497942555e-06
55001.00000  56001.00000  4.633687492362e-06
56001.00000  57001.00000  4.633687492362e-06
57001.00000  58001.00000  4.785611672439e-06
58001.00000  59001.00000  4.899554807497e-06
59001.00000  60001.00000  3.950028682013e-06
60001.00000  61001.00000  4.063971817071e-06
61001.00000  62001.00000  3.570218231820e-06
62001.00000  63001.00000  3.988009727032e-06
63001.00000  64001.00000  3.950028682013e-06
64001.00000  65001.00000  2.848578376452e-06
65001.00000  66001.00000  3.076464646568e-06
66001.00000  67001.00000  3.418294051742e-06
67001.00000  68001.00000  3.114445691587e-06
68001.00000  69001.00000  2.772616286413e-06
69001.00000  70001.00000  2.354824791200e-06
70001.00000  71001.00000  2.886559421471e-06
71001.00000  72001.00000  2.582711061316e-06
72001.00000  73001.00000  2.392805836219e-06
73001.00000  74001.00000  2.126938521084e-06
74001.00000  75001.00000  2.012995386026e-06
75001.00000  76001.00000  1.823090160929e-06
76001.00000  77001.00000  1.975014341007e-06
77001.00000  78001.00000  1.405298665716e-06
78001.00000  79001.00000  1.937033295987e-06
79001.00000  80001.00000  1.633184935832e-06
80001.00000  81001.00000  2.012995386026e-06
81001.00000  82001.00000  1.633184935832e-06
82001.00000  83001.00000  1.367317620697e-06
83001.00000  84001.00000  1.405298665716e-06
84001.00000  85001.00000  1.443279710736e-06
85001.00000  86001.00000  1.291355530658e-06
86001.00000  87001.00000  1.101450305561e-06
87001.00000  88001.00000  1.291355530658e-06
88001.00000  89001.00000  1.405298665716e-06
89001.00000  90001.00000  1.747128070890e-06
90001.00000  91001.00000  9.875071705033e-07
91001.00000  92001.00000  1.025488215523e-06
92001.00000  93001.00000  9.115450804646e-07
93001.00000  94001.00000  1.101450305561e-06
94001.00000  95001.00000  7.976019454065e-07
95001.00000  96001.00000  7.596209003871e-07
96001.00000  97001.00000  7.976019454065e-07
97001.00000  98001.00000  8.735640354452e-07
98001.00000  99001.00000  9.495261254839e-07
99001.00000  100001.00000  1.139431350581e-06
100001.00000  101001.00000  6.836588103484e-07
101001.00000  102001.00000  8.355829904259e-07
102001.00000  103001.00000  5.697156752904e-07
103001.00000  104001.00000  6.836588103484e-07
104001.00000  105001.00000  3.418294051742e-07
105001.00000  106001.00000  9.115450804646e-07
106001.00000  107001.00000  6.836588103484e-07
107001.00000  108001.00000  5.697156752904e-07
108001.00000  109001.00000  5.317346302710e-07
109001.00000  110001.00000  7.976019454065e-07
110001.00000  111001.00000  4.937535852516e-07
111001.00000  112001.00000  7.216398553678e-07
112001.00000  113001.00000  5.317346302710e-07
113001.00000  114001.00000  7.596209003871e-07
114001.00000  115001.00000  5.697156752904e-07
115001.00000  116001.00000  4.937535852516e-07
116001.00000  117001.00000  5.317346302710e-07
117001.00000  118001.00000  7.596209003871e-07
118001.00000  119001.00000  5.317346302710e-07
119001.00000  120001.00000  6.076967203097e-07
120001.00000  121001.00000  7.216398553678e-07
121001.00000  122001.00000  4.557725402323e-07
122001.00000  123001.00000  3.798104501936e-07
123001.00000  124001.00000  2.658673151355e-07
124001.00000  125001.00000  2.658673151355e-07
125001.00000  126001.00000  3.418294051742e-07
126001.00000  127001.00000  3.418294051742e-07
127001.00000  128001.00000  2.658673151355e-07
128001.00000  129001.00000  2.658673151355e-07
129001.00000  130001.00000  6.456777653291e-07
130001.00000  131001.00000  4.557725402323e-07
131001.00000  132001.00000  4.557725402323e-07
132001.00000  133001.00000  4.937535852516e-07
133001.00000  134001.00000  3.038483601549e-07
134001.00000  135001.00000  1.899052250968e-07
135001.00000  136001.00000  1.519241800774e-07
136001.00000  137001.00000  2.658673151355e-07
137001.00000  138001.00000  2.658673151355e-07
138001.00000  139001.00000  2.278862701161e-07
139001.00000  140001.00000  1.139431350581e-07
140001.00000  141001.00000  1.139431350581e-07
141001.00000  142001.00000  1.139431350581e-07
142001.00000  143001.00000  3.418294051742e-07
143001.00000  144001.00000  3.038483601549e-07
144001.00000  145001.00000  3.038483601549e-07
145001.00000  146001.00000  1.519241800774e-07
146001.00000  147001.00000  1.899052250968e-07
147001.00000  148001.00000  1.899052250968e-07
148001.00000  149001.00000  3.038483601549e-07
149001.00000  150001.00000  1.899052250968e-07
150001.00000  151001.00000  2.278862701161e-07
151001.00000  152001.00000  1.519241800774e-07
152001.00000  153001.00000  3.038483601549e-07
153001.00000  154001.00000  2.278862701161e-07
154001.00000  155001.00000  1.139431350581e-07
155001.00000  156001.00000  1.139431350581e-07
156001.00000  157001.00000  1.519241800774e-07
157001.00000  158001.00000  7.596209003871e-08
158001.00000  159001.00000  1.139431350581e-07
159001.00000  160001.00000  3.038483601549e-07
160001.00000  161001.00000  1.139431350581e-07
161001.00000  162001.00000  7.596209003871e-08
162001.00000  163001.00000  1.139431350581e-07
163001.00000  164001.00000  1.139431350581e-07
164001.00000  165001.00000  2.278862701161e-07
165001.00000  166001.00000  2.278862701161e-07
166001.00000  167001.00000  3.418294051742e-07
167001.00000  168001.00000  1.519241800774e-07
168001.00000  169001.00000  1.519241800774e-07
169001.00000  170001.00000  3.798104501936e-08
170001.00000  171001.00000  1.519241800774e-07
171001.00000  172001.00000  7.596209003871e-08
172001.00000  173001.00000  1.139431350581e-07
173001.00000  174001.00000  2.278862701161e-07
174001.00000  175001.00000  1.139431350581e-07
175001.00000  176001.00000  3.798104501936e-08
176001.00000  177001.00000  1.139431350581e-07
177001.00000  178001.00000  3.798104501936e-08
178001.00000  179001.00000  7.596209003871e-08
179001.00000  180001.00000  1.519241800774e-07
180001.00000  181001.00000  1.519241800774e-07
181001.00000  182001.00000  7.596209003871e-08
182001.00000  183001.00000  1.519241800774e-07
183001.00000  184001.00000  1.899052250968e-07
184001.00000  185001.00000  1.139431350581e-07
185001.00000  186001.00000  1.139431350581e-07
186001.00000  187001.00000  3.798104501936e-08
187001.00000  188001.00000  1.139431350581e-07
188001.00000  189001.00000  0.000000000000e+00
189001.00000  190001.00000  0.000000000000e+00
190001.00000  191001.00000  1.139431350581e-07
191001.00000  192001.00000  1.899052250968e-07
192001.00000  193001.00000  7.596209003871e-08
193001.00000  194001.00000  1.519241800774e-07
194001.00000  195001.00000  3.798104501936e-08
195001.00000  196001.00000  1.519241800774e-07
196001.00000  197001.00000  7.596209003871e-08
197001.00000  198001.00000  0.000000000000e+00
198001.00000  199001.00000  1.139431350581e-07
