300.00000  350.00000  6.174384188858e-01
350.00000  400.00000  4.628172784381e-01
400.00000  450.00000  3.596815315073e-01
450.00000  500.00000  2.870332689565e-01
500.00000  550.00000  2.342449589303e-01
550.00000  600.00000  1.950519350309e-01
600.00000  650.00000  1.651797167803e-01
650.00000  700.00000  1.415245437099e-01
700.00000  750.00000  1.226558744478e-01
750.00000  800.00000  1.070894508883e-01
800.00000  850.00000  9.438944364946e-02
850.00000  900.00000  8.397715969685e-02
900.00000  950.00000  7.518628295591e-02
950.00000  1000.00000  6.745602596998e-02
1000.00000  1050.00000  6.083286704728e-02
1050.00000  1100.00000  5.493507450876e-02
1100.00000  1150.00000  5.011542633326e-02
1150.00000  1200.00000  4.598914308381e-02
1200.00000  1250.00000  4.229716533749e-02
1250.00000  1300.00000  3.920254814283e-02
1300.00000  1350.00000  3.623517484120e-02
1350.00000  1400.00000  3.342933270915e-02
1400.00000  1450.00000  3.109932178185e-02
1450.00000  1500.00000  2.905503815923e-02
1500.00000  1550.00000  2.717685734308e-02
1550.00000  1600.00000  2.550478115604e-02
1600.00000  1650.00000  2.383841951509e-02
1650.00000  1700.00000  2.242616469044e-02
1700.00000  1750.00000  2.107524599387e-02
1750.00000  1800.00000  1.980433094262e-02
1800.00000  1850.00000  1.886943120167e-02
1850.00000  1900.00000  1.780462077953e-02
1900.00000  1950.00000  1.688038819130e-02
1950.00000  2000.00000  1.593825002530e-02
2000.00000  2050.00000  1.516259563551e-02
2050.00000  2100.00000  1.454923435477e-02
2100.00000  2150.00000  1.379262845196e-02
2150.00000  2200.00000  1.321926899388e-02
2200.00000  2250.00000  1.252133243096e-02
2250.00000  2300.00000  1.203140534585e-02
2300.00000  2350.00000  1.143594964288e-02
2350.00000  2400.00000  1.095554680126e-02
2400.00000  2450.00000  1.051324093360e-02
2450.00000  2500.00000  1.018103532068e-02
2500.00000  2550.00000  9.636248593077e-03
2550.00000  2600.00000  9.320043709221e-03
2600.00000  2650.00000  8.928025847188e-03
2650.00000  2700.00000  8.624392964738e-03
2700.00000  2750.00000  8.236946739580e-03
2750.00000  2800.00000  7.961124648120e-03
2800.00000  2850.00000  7.624728368066e-03
2850.00000  2900.00000  7.455958773429e-03
2900.00000  2950.00000  7.188137046501e-03
2950.00000  3000.00000  6.893647437801e-03
3000.00000  3050.00000  6.659732017695e-03
3050.00000  3100.00000  6.506201212642e-03
3100.00000  3150.00000  6.258189912172e-03
3150.00000  3200.00000  6.037227463213e-03
3200.00000  3250.00000  5.824265378784e-03
3250.00000  3300.00000  5.589968988939e-03
3300.00000  3350.00000  5.417389696907e-03
3350.00000  3400.00000  5.331290535761e-03
3400.00000  3450.00000  5.161378031905e-03
3450.00000  3500.00000  5.003656559717e-03
3500.00000  3550.00000  4.904223457685e-03
3550.00000  3600.00000  4.789551566070e-03
3600.00000  3650.00000  4.620401001694e-03
3650.00000  3700.00000  4.499252624506e-03
3700.00000  3750.00000  4.368580003828e-03
3750.00000  3800.00000  4.213144350077e-03
3800.00000  3850.00000  4.095424700545e-03
3850.00000  3900.00000  3.979609899711e-03
3900.00000  3950.00000  3.873700312106e-03
3950.00000  4000.00000  3.822650367002e-03
4000.00000  4050.00000  3.643975559136e-03
4050.00000  4100.00000  3.600545008823e-03
4100.00000  4150.00000  3.532732395177e-03
4150.00000  4200.00000  3.359010193926e-03
4200.00000  4250.00000  3.333485221374e-03
4250.00000  4300.00000  3.290435640801e-03
4300.00000  4350.00000  3.298055035592e-03
4350.00000  4400.00000  3.160524959602e-03
4400.00000  4450.00000  3.095760103872e-03
4450.00000  4500.00000  2.930800206632e-03
4500.00000  4550.00000  2.942229298819e-03
4550.00000  4600.00000  2.855749167933e-03
4600.00000  4650.00000  2.743744064495e-03
4650.00000  4700.00000  2.689265391735e-03
4700.00000  4750.00000  2.622595687307e-03
4750.00000  4800.00000  2.571545742203e-03
4800.00000  4850.00000  2.480493974442e-03
4850.00000  4900.00000  2.496494703504e-03
4900.00000  4950.00000  2.456492880848e-03
4950.00000  5000.00000  2.352488141941e-03
5000.00000  5050.00000  2.414586209493e-03
5050.00000  5100.00000  2.299152378399e-03
5100.00000  5150.00000  2.192099881575e-03
5150.00000  5200.00000  2.241244977982e-03
5200.00000  5250.00000  2.170003636679e-03
5250.00000  5300.00000  2.085428354491e-03
5300.00000  5350.00000  2.104857811210e-03
5350.00000  5400.00000  2.035140348866e-03
5400.00000  5450.00000  2.011520225012e-03
5450.00000  5500.00000  1.980661676105e-03
5500.00000  5550.00000  1.965041916782e-03
5550.00000  5600.00000  1.900277061053e-03
5600.00000  5650.00000  1.828654750011e-03
5650.00000  5700.00000  1.790176806313e-03
5700.00000  5750.00000  1.770366379854e-03
5750.00000  5800.00000  1.749032074437e-03
5800.00000  5850.00000  1.693410492458e-03
5850.00000  5900.00000  1.661409034333e-03
5900.00000  5950.00000  1.672076187041e-03
5950.00000  6000.00000  1.662932913291e-03
6000.00000  6050.00000  1.617978484020e-03
6050.00000  6100.00000  1.585596056155e-03
6100.00000  6150.00000  1.526164776780e-03
6150.00000  6200.00000  1.544070354540e-03
6200.00000  6250.00000  1.509783077978e-03
6250.00000  6300.00000  1.458733132873e-03
6300.00000  6350.00000  1.470162225061e-03
6350.00000  6400.00000  1.981042645845e-03
6400.00000  6450.00000  1.404635429852e-03
6450.00000  6500.00000  1.372253001987e-03
6500.00000  6550.00000  1.320822087143e-03
6550.00000  6600.00000  1.321203056883e-03
6600.00000  6650.00000  1.273200869695e-03
6650.00000  6700.00000  1.276248627612e-03
6700.00000  6750.00000  1.258343049851e-03
6750.00000  6800.00000  1.248818806362e-03
6800.00000  6850.00000  1.238913593132e-03
6850.00000  6900.00000  1.199673709955e-03
6900.00000  6950.00000  1.197387891517e-03
6950.00000  7000.00000  1.171862918965e-03
7000.00000  7050.00000  1.155481220163e-03
7050.00000  7100.00000  1.227865470684e-03
7100.00000  7150.00000  1.090335394694e-03
7150.00000  7200.00000  1.105193214538e-03
7200.00000  7250.00000  1.094526061829e-03
7250.00000  7300.00000  1.062524603704e-03
7300.00000  7350.00000  1.040047389069e-03
7350.00000  7400.00000  1.062524603704e-03
7400.00000  7450.00000  1.011093688860e-03
7450.00000  7500.00000  1.029761206100e-03
7500.00000  7550.00000  1.012998537558e-03
7550.00000  7600.00000  9.630915016723e-04
7600.00000  7650.00000  9.703299267245e-04
7650.00000  7700.00000  9.406142870368e-04
7700.00000  7750.00000  9.642344108911e-04
7750.00000  7800.00000  9.036602222970e-04
7800.00000  7850.00000  9.505195002660e-04
7850.00000  7900.00000  8.880404629740e-04
7900.00000  7950.00000  8.811830076614e-04
7950.00000  8000.00000  8.720397339114e-04
8000.00000  8050.00000  8.609916114634e-04
8050.00000  8100.00000  8.423240942237e-04
8100.00000  8150.00000  8.625154904217e-04
8150.00000  8200.00000  8.065129387027e-04
8200.00000  8250.00000  8.282282138590e-04
8250.00000  8300.00000  7.927980280776e-04
8300.00000  8350.00000  7.859405727650e-04
8350.00000  8400.00000  7.588917212545e-04
8400.00000  8450.00000  7.840357240671e-04
8450.00000  8500.00000  7.261283236501e-04
8500.00000  8550.00000  7.573678422961e-04
8550.00000  8600.00000  7.649872370878e-04
8600.00000  8650.00000  7.832737845879e-04
8650.00000  8700.00000  7.387003250564e-04
8700.00000  8750.00000  7.101275945875e-04
8750.00000  8800.00000  7.200328078167e-04
8800.00000  8850.00000  6.967936537020e-04
8850.00000  8900.00000  6.880313496915e-04
8900.00000  8950.00000  6.644112258372e-04
8950.00000  9000.00000  6.807929246394e-04
9000.00000  9050.00000  6.922220168270e-04
9050.00000  9100.00000  6.506963152122e-04
9100.00000  9150.00000  6.659351047956e-04
9150.00000  9200.00000  6.301239492745e-04
9200.00000  9250.00000  6.472675875559e-04
9250.00000  9300.00000  6.289810400558e-04
9300.00000  9350.00000  6.354575256287e-04
9350.00000  9400.00000  5.985034608889e-04
9400.00000  9450.00000  6.381243138058e-04
9450.00000  9500.00000  5.703117001596e-04
9500.00000  9550.00000  6.007892793264e-04
9550.00000  9600.00000  5.783120646909e-04
9600.00000  9650.00000  5.859314594826e-04
9650.00000  9700.00000  5.322147262010e-04
9700.00000  9750.00000  5.805978831284e-04
9750.00000  9800.00000  5.802169133888e-04
9800.00000  9850.00000  5.882172779201e-04
9850.00000  9900.00000  5.585016382325e-04
9900.00000  9950.00000  5.466915763053e-04
9950.00000  10000.00000  5.181188458364e-04
