10001.00000  11001.00000  9.409313421598e-04
11001.00000  12001.00000  8.093525090095e-04
12001.00000  13001.00000  7.135895730716e-04
13001.00000  14001.00000  6.255393471659e-04
14001.00000  15001.00000  5.572818633804e-04
15001.00000  16001.00000  5.030325891911e-04
16001.00000  17001.00000  4.556669087055e-04
17001.00000  18001.00000  4.123021965492e-04
18001.00000  19001.00000  3.783277088571e-04
19001.00000  20001.00000  3.466188297370e-04
20001.00000  21001.00000  3.182939021435e-04
21001.00000  22001.00000  2.977588116827e-04
22001.00000  23001.00000  2.746978086862e-04
23001.00000  24001.00000  2.542302044381e-04
24001.00000  25001.00000  2.352762195339e-04
25001.00000  26001.00000  2.234468505219e-04
26001.00000  27001.00000  2.051580868579e-04
27001.00000  28001.00000  1.956328899681e-04
28001.00000  29001.00000  1.828779957523e-04
29001.00000  30001.00000  1.738444841270e-04
30001.00000  31001.00000  1.643096463496e-04
31001.00000  32001.00000  1.544566592834e-04
32001.00000  33001.00000  1.458473467099e-04
33001.00000  34001.00000  1.393879520579e-04
34001.00000  35001.00000  1.333720382327e-04
35001.00000  36001.00000  1.254375877871e-04
36001.00000  37001.00000  1.180912314813e-04
37001.00000  38001.00000  1.143409262281e-04
38001.00000  39001.00000  1.095012006829e-04
39001.00000  40001.00000  1.033117508820e-04
40001.00000  41001.00000  9.889622438856e-05
41001.00000  42001.00000  9.483741073409e-05
42001.00000  43001.00000  9.122207790647e-05
43001.00000  44001.00000  8.722110957724e-05
44001.00000  45001.00000  8.296947817196e-05
45001.00000  46001.00000  7.813939351426e-05
46001.00000  47001.00000  7.606660269309e-05
47001.00000  48001.00000  7.452406068664e-05
48001.00000  49001.00000  7.207527525140e-05
49001.00000  50001.00000  6.792969360907e-05
50001.00000  51001.00000  6.574121213741e-05
51001.00000  52001.00000  6.191377978391e-05
52001.00000  53001.00000  6.147029895705e-05
53001.00000  54001.00000  6.140281274427e-05
54001.00000  55001.00000  5.872264600806e-05
55001.00000  56001.00000  5.528084915617e-05
56001.00000  57001.00000  5.471203679129e-05
57001.00000  58001.00000  5.210899715541e-05
58001.00000  59001.00000  4.917816734315e-05
59001.00000  60001.00000  4.876360917892e-05
60001.00000  61001.00000  4.737532137311e-05
61001.00000  62001.00000  4.655584593219e-05
62001.00000  63001.00000  4.377927032058e-05
63001.00000  64001.00000  4.311404908029e-05
64001.00000  65001.00000  4.197642435054e-05
65001.00000  66001.00000  4.222708742658e-05
66001.00000  67001.00000  3.929625761433e-05
67001.00000  68001.00000  3.919020785138e-05
68001.00000  69001.00000  3.646183667748e-05
69001.00000  70001.00000  3.764766584493e-05
70001.00000  71001.00000  3.478432224546e-05
71001.00000  72001.00000  3.374310639111e-05
72001.00000  73001.00000  3.336711177703e-05
73001.00000  74001.00000  3.289470828756e-05
74001.00000  75001.00000  3.206559195909e-05
75001.00000  76001.00000  3.108222142998e-05
76001.00000  77001.00000  2.949147498583e-05
77001.00000  78001.00000  3.019525977627e-05
78001.00000  79001.00000  2.906727593405e-05
79001.00000  80001.00000  2.841169558131e-05
80001.00000  81001.00000  2.725478907647e-05
81001.00000  82001.00000  2.731263440172e-05
82001.00000  83001.00000  2.499882139204e-05
83001.00000  84001.00000  2.570260618248e-05
84001.00000  85001.00000  2.451677701502e-05
85001.00000  86001.00000  2.518199825531e-05
86001.00000  87001.00000  2.413114151341e-05
87001.00000  88001.00000  2.298387589611e-05
88001.00000  89001.00000  2.308992565906e-05
89001.00000  90001.00000  2.227045021813e-05
90001.00000  91001.00000  2.179804672865e-05
91001.00000  92001.00000  2.143169300212e-05
92001.00000  93001.00000  2.032299093499e-05
93001.00000  94001.00000  1.994699632091e-05
94001.00000  95001.00000  1.955171993176e-05
95001.00000  96001.00000  1.921428886785e-05
96001.00000  97001.00000  1.875152626591e-05
97001.00000  98001.00000  1.833696810168e-05
98001.00000  99001.00000  1.769102863648e-05
99001.00000  100001.00000  1.841409520200e-05
100001.00000  101001.00000  1.758497887354e-05
101001.00000  102001.00000  1.737287934765e-05
102001.00000  103001.00000  1.736323846011e-05
103001.00000  104001.00000  1.657268568180e-05
104001.00000  105001.00000  1.584961911628e-05
105001.00000  106001.00000  1.547362450221e-05
106001.00000  107001.00000  1.519403876354e-05
107001.00000  108001.00000  1.494337568749e-05
108001.00000  109001.00000  1.464450817374e-05
109001.00000  110001.00000  1.455774018588e-05
110001.00000  111001.00000  1.465414906128e-05
111001.00000  112001.00000  1.381539184527e-05
112001.00000  113001.00000  1.306340261713e-05
113001.00000  114001.00000  1.363221498201e-05
114001.00000  115001.00000  1.281273954108e-05
115001.00000  116001.00000  1.307304350467e-05
116001.00000  117001.00000  1.301519817943e-05
117001.00000  118001.00000  1.256207646503e-05
118001.00000  119001.00000  1.252351291487e-05
119001.00000  120001.00000  1.215715918834e-05
120001.00000  121001.00000  1.222464540112e-05
121001.00000  122001.00000  1.205110942540e-05
122001.00000  123001.00000  1.161726948608e-05
123001.00000  124001.00000  1.117378865923e-05
124001.00000  125001.00000  1.100989357104e-05
125001.00000  126001.00000  1.124127487201e-05
126001.00000  127001.00000  1.111594333398e-05
127001.00000  128001.00000  1.108702067136e-05
128001.00000  129001.00000  1.063389895697e-05
129001.00000  130001.00000  1.008436836717e-05
130001.00000  131001.00000  1.016149546749e-05
131001.00000  132001.00000  9.891550616364e-06
132001.00000  133001.00000  1.032539055568e-05
133001.00000  134001.00000  9.640887540316e-06
134001.00000  135001.00000  9.428788014429e-06
135001.00000  136001.00000  8.705721448905e-06
136001.00000  137001.00000  9.043152512816e-06
137001.00000  138001.00000  8.763566774147e-06
138001.00000  139001.00000  8.696080561365e-06
139001.00000  140001.00000  8.493621923018e-06
140001.00000  141001.00000  9.120279613139e-06
141001.00000  142001.00000  8.522544585639e-06
142001.00000  143001.00000  8.300804172212e-06
143001.00000  144001.00000  7.654864707011e-06
144001.00000  145001.00000  7.934450445680e-06
145001.00000  146001.00000  8.040500208624e-06
146001.00000  147001.00000  7.307792755560e-06
147001.00000  148001.00000  7.490969618826e-06
148001.00000  149001.00000  7.500610506366e-06
149001.00000  150001.00000  7.298151868019e-06
150001.00000  151001.00000  7.259588317858e-06
151001.00000  152001.00000  7.182461217535e-06
152001.00000  153001.00000  7.654864707011e-06
153001.00000  154001.00000  7.404201630963e-06
154001.00000  155001.00000  6.796825715923e-06
155001.00000  156001.00000  6.931798141487e-06
156001.00000  157001.00000  6.931798141487e-06
157001.00000  158001.00000  6.873952816245e-06
158001.00000  159001.00000  6.478676427092e-06
159001.00000  160001.00000  6.700416840520e-06
160001.00000  161001.00000  6.266576901205e-06
161001.00000  162001.00000  6.170168025802e-06
162001.00000  163001.00000  6.343704001528e-06
163001.00000  164001.00000  6.006272937617e-06
164001.00000  165001.00000  6.131604475641e-06
165001.00000  166001.00000  6.035195600238e-06
166001.00000  167001.00000  5.360333472416e-06
167001.00000  168001.00000  5.408537910117e-06
168001.00000  169001.00000  5.562792110762e-06
169001.00000  170001.00000  5.331410809795e-06
170001.00000  171001.00000  5.823096074351e-06
171001.00000  172001.00000  5.263924597013e-06
172001.00000  173001.00000  5.244642821932e-06
173001.00000  174001.00000  5.572432998303e-06
174001.00000  175001.00000  5.186797496690e-06
175001.00000  176001.00000  5.022902408505e-06
176001.00000  177001.00000  4.936134420642e-06
177001.00000  178001.00000  4.965057083263e-06
178001.00000  179001.00000  4.762598444916e-06
179001.00000  180001.00000  5.167515721609e-06
180001.00000  181001.00000  4.868648207860e-06
181001.00000  182001.00000  4.772239332456e-06
182001.00000  183001.00000  4.791521107537e-06
183001.00000  184001.00000  4.675830457053e-06
184001.00000  185001.00000  4.714394007215e-06
185001.00000  186001.00000  4.454090043626e-06
186001.00000  187001.00000  4.222708742658e-06
187001.00000  188001.00000  4.251631405279e-06
188001.00000  189001.00000  4.463730931166e-06
189001.00000  190001.00000  4.357681168223e-06
190001.00000  191001.00000  3.914200341368e-06
191001.00000  192001.00000  4.396244718384e-06
192001.00000  193001.00000  4.241990517739e-06
193001.00000  194001.00000  4.434808268545e-06
194001.00000  195001.00000  4.164863417417e-06
195001.00000  196001.00000  4.078095429554e-06
196001.00000  197001.00000  4.107018092175e-06
197001.00000  198001.00000  4.097377204634e-06
198001.00000  199001.00000  3.894918566288e-06
