300.00000  350.00000  1.774739197715e-01
350.00000  400.00000  1.256710144504e-01
400.00000  450.00000  9.262813423196e-02
450.00000  500.00000  7.119754254890e-02
500.00000  550.00000  5.605072425928e-02
550.00000  600.00000  4.473829923100e-02
600.00000  650.00000  3.674070198149e-02
650.00000  700.00000  3.034113970908e-02
700.00000  750.00000  2.570958455020e-02
750.00000  800.00000  2.206223486258e-02
800.00000  850.00000  1.901832337115e-02
850.00000  900.00000  1.637447730129e-02
900.00000  950.00000  1.420046687495e-02
950.00000  1000.00000  1.260688531627e-02
1000.00000  1050.00000  1.113428829140e-02
1050.00000  1100.00000  9.899206915700e-03
1100.00000  1150.00000  8.946175373392e-03
1150.00000  1200.00000  8.106706000845e-03
1200.00000  1250.00000  7.230867044519e-03
1250.00000  1300.00000  6.673447505365e-03
1300.00000  1350.00000  5.916366373625e-03
1350.00000  1400.00000  5.569741973113e-03
1400.00000  1450.00000  5.068732400638e-03
1450.00000  1500.00000  4.708005508456e-03
1500.00000  1550.00000  4.274539448715e-03
1550.00000  1600.00000  3.987293960496e-03
1600.00000  1650.00000  3.752005020534e-03
1650.00000  1700.00000  3.437296785379e-03
1700.00000  1750.00000  3.192358772169e-03
1750.00000  1800.00000  3.070632001968e-03
1800.00000  1850.00000  2.730687729089e-03
1850.00000  1900.00000  2.647557251878e-03
1900.00000  1950.00000  2.447153422888e-03
1950.00000  2000.00000  2.220029083366e-03
2000.00000  2050.00000  2.263078794779e-03
2050.00000  2100.00000  2.118342696064e-03
2100.00000  2150.00000  1.900867429790e-03
2150.00000  2200.00000  1.860786663992e-03
2200.00000  2250.00000  1.773202768359e-03
2250.00000  2300.00000  1.673000853864e-03
2300.00000  2350.00000  1.642569161314e-03
2350.00000  2400.00000  1.525295809535e-03
2400.00000  2450.00000  1.393177729682e-03
2450.00000  2500.00000  1.344190127040e-03
2500.00000  2550.00000  1.328603162563e-03
2550.00000  2600.00000  1.241019266930e-03
2600.00000  2650.00000  1.194258373499e-03
2650.00000  2700.00000  1.112612369096e-03
2700.00000  2750.00000  1.064367002858e-03
2750.00000  2800.00000  1.047295565573e-03
2800.00000  2850.00000  9.960812537204e-04
2850.00000  2900.00000  9.656495611701e-04
2900.00000  2950.00000  8.891992115924e-04
2950.00000  3000.00000  8.721277743081e-04
3000.00000  3050.00000  8.253668808771e-04
3050.00000  3100.00000  8.320470085101e-04
3100.00000  3150.00000  7.771215146388e-04
3150.00000  3200.00000  7.652457321801e-04
3200.00000  3250.00000  6.828574913731e-04
3250.00000  3300.00000  7.288761484005e-04
3300.00000  3350.00000  6.605903992631e-04
3350.00000  3400.00000  6.613326356668e-04
3400.00000  3450.00000  6.479723804008e-04
3450.00000  3500.00000  5.900779409148e-04
3500.00000  3550.00000  6.078916146028e-04
3550.00000  3600.00000  6.153139786395e-04
3600.00000  3650.00000  5.336679742362e-04
3650.00000  3700.00000  4.898760264199e-04
3700.00000  3750.00000  5.047207544932e-04
3750.00000  3800.00000  4.624132794842e-04
3800.00000  3850.00000  4.416306601815e-04
3850.00000  3900.00000  4.750312983465e-04
3900.00000  3950.00000  4.401461873742e-04
3950.00000  4000.00000  4.505374970255e-04
4000.00000  4050.00000  4.416306601815e-04
4050.00000  4100.00000  4.201058044752e-04
4100.00000  4150.00000  4.000654215762e-04
4150.00000  4200.00000  4.104567312276e-04
4200.00000  4250.00000  3.822517478882e-04
4250.00000  4300.00000  3.963542395579e-04
4300.00000  4350.00000  3.956120031542e-04
4350.00000  4400.00000  3.421709820902e-04
4400.00000  4450.00000  3.406865092829e-04
4450.00000  4500.00000  3.340063816499e-04
4500.00000  4550.00000  3.139659987509e-04
4550.00000  4600.00000  3.102548167326e-04
4600.00000  4650.00000  3.006057434849e-04
4650.00000  4700.00000  2.968945614666e-04
4700.00000  4750.00000  2.946678522556e-04
4750.00000  4800.00000  2.887299610263e-04
4800.00000  4850.00000  2.738852329529e-04
4850.00000  4900.00000  2.887299610263e-04
4900.00000  4950.00000  2.753697057603e-04
4950.00000  5000.00000  2.531026136503e-04
5000.00000  5050.00000  2.545870864576e-04
5050.00000  5100.00000  2.390001219806e-04
5100.00000  5150.00000  2.553293228613e-04
5150.00000  5200.00000  2.367734127696e-04
5200.00000  5250.00000  2.390001219806e-04
5250.00000  5300.00000  2.197019754853e-04
5300.00000  5350.00000  2.145063206596e-04
5350.00000  5400.00000  2.278665759256e-04
5400.00000  5450.00000  2.004038289899e-04
5450.00000  5500.00000  2.063417202193e-04
5500.00000  5550.00000  2.137640842559e-04
5550.00000  5600.00000  1.981771197789e-04
5600.00000  5650.00000  1.833323917056e-04
5650.00000  5700.00000  1.729410820543e-04
5700.00000  5750.00000  1.759100276690e-04
5750.00000  5800.00000  1.773945004763e-04
5800.00000  5850.00000  1.937237013569e-04
5850.00000  5900.00000  1.811056824946e-04
5900.00000  5950.00000  1.588385903846e-04
5950.00000  6000.00000  1.848168645129e-04
6000.00000  6050.00000  1.566118811736e-04
6050.00000  6100.00000  1.425093895040e-04
6100.00000  6150.00000  1.662609544213e-04
6150.00000  6200.00000  1.358292618710e-04
6200.00000  6250.00000  1.336025526600e-04
6250.00000  6300.00000  1.425093895040e-04
6300.00000  6350.00000  1.573541175773e-04
6350.00000  6400.00000  1.677454272286e-04
6400.00000  6450.00000  1.365714982746e-04
6450.00000  6500.00000  1.336025526600e-04
6500.00000  6550.00000  1.343447890636e-04
6550.00000  6600.00000  1.514162263480e-04
6600.00000  6650.00000  1.395404438893e-04
6650.00000  6700.00000  1.180155881830e-04
6700.00000  6750.00000  1.172733517793e-04
6750.00000  6800.00000  1.232112430086e-04
6800.00000  6850.00000  1.269224250270e-04
6850.00000  6900.00000  1.053975693206e-04
6900.00000  6950.00000  1.172733517793e-04
6950.00000  7000.00000  1.068820421280e-04
7000.00000  7050.00000  1.039130965133e-04
7050.00000  7100.00000  9.797520528397e-05
7100.00000  7150.00000  1.068820421280e-04
7150.00000  7200.00000  1.076242785316e-04
7200.00000  7250.00000  1.016863873023e-04
7250.00000  7300.00000  1.031708601096e-04
7300.00000  7350.00000  9.352178686197e-05
7350.00000  7400.00000  9.649073247664e-05
7400.00000  7450.00000  9.574849607297e-05
7450.00000  7500.00000  8.313047721064e-05
7500.00000  7550.00000  1.002019144950e-04
7550.00000  7600.00000  7.941929519231e-05
7600.00000  7650.00000  8.238824080698e-05
7650.00000  7700.00000  7.941929519231e-05
7700.00000  7750.00000  9.352178686197e-05
7750.00000  7800.00000  7.570811317398e-05
7800.00000  7850.00000  9.129507765097e-05
7850.00000  7900.00000  8.758389563264e-05
7900.00000  7950.00000  8.832613203631e-05
7950.00000  8000.00000  8.535718642164e-05
8000.00000  8050.00000  8.164600440331e-05
8050.00000  8100.00000  7.867705878864e-05
8100.00000  8150.00000  7.422364036665e-05
8150.00000  8200.00000  6.902798554098e-05
8200.00000  8250.00000  7.719258598131e-05
8250.00000  8300.00000  8.981060484364e-05
8300.00000  8350.00000  8.535718642164e-05
8350.00000  8400.00000  8.313047721064e-05
8400.00000  8450.00000  6.977022194465e-05
8450.00000  8500.00000  6.531680352265e-05
8500.00000  8550.00000  6.457456711898e-05
8550.00000  8600.00000  6.605903992631e-05
8600.00000  8650.00000  6.234785790798e-05
8650.00000  8700.00000  6.828574913731e-05
8700.00000  8750.00000  6.605903992631e-05
8750.00000  8800.00000  6.160562150432e-05
8800.00000  8850.00000  5.715220308232e-05
8850.00000  8900.00000  6.457456711898e-05
8900.00000  8950.00000  4.824536623832e-05
8950.00000  9000.00000  6.977022194465e-05
9000.00000  9050.00000  6.680127632998e-05
9050.00000  9100.00000  6.086338510065e-05
9100.00000  9150.00000  6.086338510065e-05
9150.00000  9200.00000  5.195654825665e-05
9200.00000  9250.00000  5.344102106398e-05
9250.00000  9300.00000  5.937891229332e-05
9300.00000  9350.00000  4.824536623832e-05
9350.00000  9400.00000  5.566773027498e-05
9400.00000  9450.00000  5.269878466032e-05
9450.00000  9500.00000  6.160562150432e-05
9500.00000  9550.00000  5.121431185299e-05
9550.00000  9600.00000  4.230747500899e-05
9600.00000  9650.00000  4.453418421999e-05
9650.00000  9700.00000  5.640996667865e-05
9700.00000  9750.00000  4.453418421999e-05
9750.00000  9800.00000  5.047207544932e-05
9800.00000  9850.00000  5.269878466032e-05
9850.00000  9900.00000  4.379194781632e-05
9900.00000  9950.00000  6.160562150432e-05
9950.00000  10000.00000  5.047207544932e-05
