300.00000  350.00000  1.540459860974e-05
350.00000  400.00000  3.439166201243e-05
400.00000  450.00000  2.256952819566e-05
450.00000  500.00000  2.471900707144e-05
500.00000  550.00000  1.988267960094e-04
550.00000  600.00000  2.077829579918e-05
600.00000  650.00000  5.230398597724e-05
650.00000  700.00000  2.185303523707e-05
700.00000  750.00000  3.976535920187e-05
750.00000  800.00000  2.615199298862e-05
800.00000  850.00000  1.067574508303e-04
850.00000  900.00000  2.973445778158e-05
900.00000  950.00000  2.292777467495e-05
950.00000  1000.00000  3.045095074017e-05
1000.00000  1050.00000  2.794322538510e-05
1050.00000  1100.00000  2.256952819566e-05
1100.00000  1150.00000  2.328602115425e-05
1150.00000  1200.00000  2.865971834369e-05
1200.00000  1250.00000  3.152569017806e-05
1250.00000  1300.00000  7.809773248656e-05
1300.00000  1350.00000  3.152569017806e-05
1350.00000  1400.00000  2.794322538510e-05
1400.00000  1450.00000  3.080919721947e-05
1450.00000  1500.00000  3.869061976399e-05
1500.00000  1550.00000  3.009270426088e-05
1550.00000  1600.00000  3.116744369877e-05
1600.00000  1650.00000  3.654114088821e-05
1650.00000  1700.00000  3.510815497102e-05
1700.00000  1750.00000  1.089069297060e-04
1750.00000  1800.00000  3.904886624328e-05
1800.00000  1850.00000  3.618289440891e-05
1850.00000  1900.00000  3.439166201243e-05
1900.00000  1950.00000  3.510815497102e-05
1950.00000  2000.00000  3.797412680539e-05
2000.00000  2050.00000  4.406431695343e-05
2050.00000  2100.00000  4.048185216047e-05
2100.00000  2150.00000  3.833237328469e-05
2150.00000  2200.00000  3.654114088821e-05
2200.00000  2250.00000  3.725763384680e-05
2250.00000  2300.00000  4.549730287061e-05
2300.00000  2350.00000  1.278939931087e-04
2350.00000  2400.00000  4.943801414287e-05
2400.00000  2450.00000  4.155659159836e-05
2450.00000  2500.00000  4.621379582921e-05
2500.00000  2550.00000  4.155659159836e-05
2550.00000  2600.00000  4.263133103624e-05
2600.00000  2650.00000  4.800502822569e-05
2650.00000  2700.00000  3.904886624328e-05
2700.00000  2750.00000  4.155659159836e-05
2750.00000  2800.00000  4.621379582921e-05
2800.00000  2850.00000  4.872152118428e-05
2850.00000  2900.00000  5.087100006006e-05
2900.00000  2950.00000  5.230398597724e-05
2950.00000  3000.00000  7.129104937994e-05
3000.00000  3050.00000  4.836327470498e-05
3050.00000  3100.00000  5.015450710146e-05
3100.00000  3150.00000  4.513905639132e-05
3150.00000  3200.00000  4.979626062217e-05
3200.00000  3250.00000  4.513905639132e-05
3250.00000  3300.00000  5.015450710146e-05
3300.00000  3350.00000  4.621379582921e-05
3350.00000  3400.00000  4.406431695343e-05
3400.00000  3450.00000  4.549730287061e-05
3450.00000  3500.00000  4.800502822569e-05
3500.00000  3550.00000  5.696119020809e-05
3550.00000  3600.00000  5.409521837372e-05
3600.00000  3650.00000  5.337872541513e-05
3650.00000  3700.00000  7.236578881783e-05
3700.00000  3750.00000  4.872152118428e-05
3750.00000  3800.00000  5.087100006006e-05
3800.00000  3850.00000  4.800502822569e-05
3850.00000  3900.00000  5.696119020809e-05
3900.00000  3950.00000  5.875242260457e-05
3950.00000  4000.00000  4.764678174639e-05
4000.00000  4050.00000  5.302047893583e-05
4050.00000  4100.00000  5.337872541513e-05
4100.00000  4150.00000  4.907976766358e-05
4150.00000  4200.00000  5.875242260457e-05
4200.00000  4250.00000  5.516995781161e-05
4250.00000  4300.00000  5.445346485302e-05
4300.00000  4350.00000  5.409521837372e-05
4350.00000  4400.00000  5.302047893583e-05
4400.00000  4450.00000  5.875242260457e-05
4450.00000  4500.00000  6.520085923190e-05
4500.00000  4550.00000  6.197664091824e-05
4550.00000  4600.00000  5.445346485302e-05
4600.00000  4650.00000  5.731943668739e-05
4650.00000  4700.00000  5.624469724950e-05
4700.00000  4750.00000  4.943801414287e-05
4750.00000  4800.00000  6.233488739753e-05
4800.00000  4850.00000  5.660294372879e-05
4850.00000  4900.00000  6.412611979401e-05
4900.00000  4950.00000  4.943801414287e-05
4950.00000  5000.00000  5.158749301865e-05
5000.00000  5050.00000  6.627559866979e-05
5050.00000  5100.00000  5.875242260457e-05
5100.00000  5150.00000  5.803592964598e-05
5150.00000  5200.00000  6.161839443894e-05
5200.00000  5250.00000  6.126014795964e-05
5250.00000  5300.00000  5.875242260457e-05
5300.00000  5350.00000  5.445346485302e-05
5350.00000  5400.00000  6.161839443894e-05
5400.00000  5450.00000  7.129104937994e-05
5450.00000  5500.00000  5.767768316668e-05
5500.00000  5550.00000  5.266223245654e-05
5550.00000  5600.00000  5.982716204246e-05
5600.00000  5650.00000  5.266223245654e-05
5650.00000  5700.00000  5.803592964598e-05
5700.00000  5750.00000  5.731943668739e-05
5750.00000  5800.00000  6.699209162838e-05
5800.00000  5850.00000  5.624469724950e-05
5850.00000  5900.00000  6.878332402486e-05
5900.00000  5950.00000  6.806683106627e-05
5950.00000  6000.00000  5.516995781161e-05
6000.00000  6050.00000  5.767768316668e-05
6050.00000  6100.00000  5.696119020809e-05
6100.00000  6150.00000  7.021630994205e-05
6150.00000  6200.00000  6.412611979401e-05
6200.00000  6250.00000  9.099460574123e-05
6250.00000  6300.00000  1.046079719545e-04
6300.00000  6350.00000  9.314408461700e-05
6350.00000  6400.00000  7.852762826172e-04
6400.00000  6450.00000  5.660294372879e-05
6450.00000  6500.00000  5.624469724950e-05
6500.00000  6550.00000  5.481171133231e-05
6550.00000  6600.00000  5.767768316668e-05
6600.00000  6650.00000  5.194573949794e-05
6650.00000  6700.00000  5.015450710146e-05
6700.00000  6750.00000  5.839417612528e-05
6750.00000  6800.00000  5.266223245654e-05
6800.00000  6850.00000  6.018540852176e-05
6850.00000  6900.00000  5.839417612528e-05
6900.00000  6950.00000  5.302047893583e-05
6950.00000  7000.00000  5.588645077020e-05
7000.00000  7050.00000  4.513905639132e-05
7050.00000  7100.00000  1.347006762154e-04
7100.00000  7150.00000  2.686848594721e-05
7150.00000  7200.00000  3.582464792962e-05
7200.00000  7250.00000  3.152569017806e-05
7250.00000  7300.00000  3.510815497102e-05
7300.00000  7350.00000  3.833237328469e-05
7350.00000  7400.00000  3.224218313666e-05
7400.00000  7450.00000  3.654114088821e-05
7450.00000  7500.00000  5.302047893583e-05
7500.00000  7550.00000  3.439166201243e-05
7550.00000  7600.00000  3.045095074017e-05
7600.00000  7650.00000  3.725763384680e-05
7650.00000  7700.00000  3.188393665736e-05
7700.00000  7750.00000  2.937621130229e-05
7750.00000  7800.00000  2.973445778158e-05
7800.00000  7850.00000  3.260042961595e-05
7850.00000  7900.00000  3.761588032610e-05
7900.00000  7950.00000  3.582464792962e-05
7950.00000  8000.00000  3.618289440891e-05
8000.00000  8050.00000  3.260042961595e-05
8050.00000  8100.00000  3.367516905384e-05
8100.00000  8150.00000  3.869061976399e-05
8150.00000  8200.00000  3.116744369877e-05
8200.00000  8250.00000  2.865971834369e-05
8250.00000  8300.00000  3.474990849173e-05
8300.00000  8350.00000  3.403341553314e-05
8350.00000  8400.00000  3.546640145032e-05
8400.00000  8450.00000  3.295867609525e-05
8450.00000  8500.00000  3.116744369877e-05
8500.00000  8550.00000  3.009270426088e-05
8550.00000  8600.00000  3.474990849173e-05
8600.00000  8650.00000  3.439166201243e-05
8650.00000  8700.00000  3.080919721947e-05
8700.00000  8750.00000  3.833237328469e-05
8750.00000  8800.00000  2.794322538510e-05
8800.00000  8850.00000  2.973445778158e-05
8850.00000  8900.00000  3.618289440891e-05
8900.00000  8950.00000  3.295867609525e-05
8950.00000  9000.00000  3.582464792962e-05
9000.00000  9050.00000  3.152569017806e-05
9050.00000  9100.00000  2.865971834369e-05
9100.00000  9150.00000  1.934530988199e-05
9150.00000  9200.00000  2.579374650932e-05
9200.00000  9250.00000  3.116744369877e-05
9250.00000  9300.00000  3.439166201243e-05
9300.00000  9350.00000  2.794322538510e-05
9350.00000  9400.00000  3.045095074017e-05
9400.00000  9450.00000  2.830147186440e-05
9450.00000  9500.00000  2.651023946792e-05
9500.00000  9550.00000  2.651023946792e-05
9550.00000  9600.00000  2.686848594721e-05
9600.00000  9650.00000  3.403341553314e-05
9650.00000  9700.00000  2.543550003003e-05
9700.00000  9750.00000  2.436076059214e-05
9750.00000  9800.00000  2.364426763355e-05
9800.00000  9850.00000  2.364426763355e-05
9850.00000  9900.00000  2.292777467495e-05
9900.00000  9950.00000  3.080919721947e-05
9950.00000  10000.00000  2.973445778158e-05
