300.00000  350.00000  2.412824851300e-06
350.00000  400.00000  6.635268341076e-06
400.00000  450.00000  4.624580964992e-06
450.00000  500.00000  6.836337078684e-06
500.00000  550.00000  5.006611566448e-05
550.00000  600.00000  2.211756113692e-06
600.00000  650.00000  1.447694910780e-05
650.00000  700.00000  9.450230667593e-06
700.00000  750.00000  1.407481163259e-05
750.00000  800.00000  7.841680766726e-06
800.00000  850.00000  3.780092267037e-05
850.00000  900.00000  1.065664309324e-05
900.00000  950.00000  9.852368142810e-06
950.00000  1000.00000  1.306946794454e-05
1000.00000  1050.00000  1.206412425650e-05
1050.00000  1100.00000  1.186305551889e-05
1100.00000  1150.00000  1.347160541976e-05
1150.00000  1200.00000  1.548229279584e-05
1200.00000  1250.00000  1.487908658302e-05
1250.00000  1300.00000  4.302870984819e-05
1300.00000  1350.00000  1.568336153345e-05
1350.00000  1400.00000  1.970473628562e-05
1400.00000  1450.00000  1.467801784541e-05
1450.00000  1500.00000  2.191649239931e-05
1500.00000  1550.00000  1.829725512236e-05
1550.00000  1600.00000  1.990580502323e-05
1600.00000  1650.00000  1.950366754801e-05
1650.00000  1700.00000  1.849832385997e-05
1700.00000  1750.00000  6.977085195010e-05
1750.00000  1800.00000  2.533466093865e-05
1800.00000  1850.00000  2.231862987453e-05
1850.00000  1900.00000  2.191649239931e-05
1900.00000  1950.00000  2.613893588909e-05
1950.00000  2000.00000  2.734534831474e-05
2000.00000  2050.00000  2.935603569082e-05
2050.00000  2100.00000  3.076351685408e-05
2100.00000  2150.00000  2.895389821560e-05
2150.00000  2200.00000  2.332397356257e-05
2200.00000  2250.00000  2.392717977539e-05
2250.00000  2300.00000  2.975817316604e-05
2300.00000  2350.00000  8.987772571094e-05
2350.00000  2400.00000  3.116565432930e-05
2400.00000  2450.00000  3.136672306690e-05
2450.00000  2500.00000  3.458382286864e-05
2500.00000  2550.00000  3.398061665581e-05
2550.00000  2600.00000  3.619237276950e-05
2600.00000  2650.00000  3.076351685408e-05
2650.00000  2700.00000  3.518702908146e-05
2700.00000  2750.00000  3.096458559169e-05
2750.00000  2800.00000  3.317634170538e-05
2800.00000  2850.00000  3.719771645755e-05
2850.00000  2900.00000  3.317634170538e-05
2900.00000  2950.00000  3.679557898233e-05
2950.00000  3000.00000  5.911420885686e-05
3000.00000  3050.00000  3.438275413103e-05
3050.00000  3100.00000  3.880626635841e-05
3100.00000  3150.00000  3.780092267037e-05
3150.00000  3200.00000  4.001267878406e-05
3200.00000  3250.00000  4.483832848666e-05
3250.00000  3300.00000  3.800199140798e-05
3300.00000  3350.00000  3.961054130885e-05
3350.00000  3400.00000  4.483832848666e-05
3400.00000  3450.00000  3.820306014559e-05
3450.00000  3500.00000  4.202336616015e-05
3500.00000  3550.00000  3.920840383363e-05
3550.00000  3600.00000  4.162122868493e-05
3600.00000  3650.00000  3.659451024472e-05
3650.00000  3700.00000  6.494520224750e-05
3700.00000  3750.00000  4.624580964992e-05
3750.00000  3800.00000  4.584367217471e-05
3800.00000  3850.00000  4.785435955079e-05
3850.00000  3900.00000  4.946290945166e-05
3900.00000  3950.00000  5.006611566448e-05
3950.00000  4000.00000  4.946290945166e-05
4000.00000  4050.00000  5.509283410469e-05
4050.00000  4100.00000  5.509283410469e-05
4100.00000  4150.00000  4.584367217471e-05
4150.00000  4200.00000  5.066932187731e-05
4200.00000  4250.00000  5.428855915426e-05
4250.00000  4300.00000  5.629924653034e-05
4300.00000  4350.00000  5.006611566448e-05
4350.00000  4400.00000  5.650031526795e-05
4400.00000  4450.00000  5.207680304057e-05
4450.00000  4500.00000  5.247894051578e-05
4500.00000  4550.00000  5.187573430296e-05
4550.00000  4600.00000  5.529390284230e-05
4600.00000  4650.00000  5.609817779273e-05
4650.00000  4700.00000  5.629924653034e-05
4700.00000  4750.00000  5.589710905512e-05
4750.00000  4800.00000  5.750565895599e-05
4800.00000  4850.00000  6.092382749533e-05
4850.00000  4900.00000  5.690245274317e-05
4900.00000  4950.00000  5.670138400556e-05
4950.00000  5000.00000  6.132596497055e-05
5000.00000  5050.00000  5.710352148077e-05
5050.00000  5100.00000  6.112489623294e-05
5100.00000  5150.00000  5.871207138164e-05
5150.00000  5200.00000  6.494520224750e-05
5200.00000  5250.00000  5.871207138164e-05
5250.00000  5300.00000  6.011955254490e-05
5300.00000  5350.00000  6.152703370816e-05
5350.00000  5400.00000  6.112489623294e-05
5400.00000  5450.00000  6.554840846033e-05
5450.00000  5500.00000  6.554840846033e-05
5500.00000  5550.00000  5.871207138164e-05
5550.00000  5600.00000  6.072275875772e-05
5600.00000  5650.00000  6.092382749533e-05
5650.00000  5700.00000  5.851100264403e-05
5700.00000  5750.00000  6.353772108424e-05
5750.00000  5800.00000  6.353772108424e-05
5800.00000  5850.00000  6.956978321249e-05
5850.00000  5900.00000  7.580291407835e-05
5900.00000  5950.00000  6.755909583641e-05
5950.00000  6000.00000  6.011955254490e-05
6000.00000  6050.00000  7.037405816293e-05
6050.00000  6100.00000  6.233130865859e-05
6100.00000  6150.00000  5.991848380729e-05
6150.00000  6200.00000  6.896657699967e-05
6200.00000  6250.00000  7.660718902879e-05
6250.00000  6300.00000  9.852368142810e-05
6300.00000  6350.00000  8.766596959725e-05
6350.00000  6400.00000  8.229743430310e-04
6400.00000  6450.00000  6.675482088598e-05
6450.00000  6500.00000  6.172810244577e-05
6500.00000  6550.00000  6.213023992098e-05
6550.00000  6600.00000  7.057512690053e-05
6600.00000  6650.00000  6.273344613381e-05
6650.00000  6700.00000  6.132596497055e-05
6700.00000  6750.00000  7.178153932618e-05
6750.00000  6800.00000  6.273344613381e-05
6800.00000  6850.00000  6.132596497055e-05
6850.00000  6900.00000  6.675482088598e-05
6900.00000  6950.00000  6.273344613381e-05
6950.00000  7000.00000  6.032062128251e-05
7000.00000  7050.00000  6.776016457402e-05
7050.00000  7100.00000  1.457748347661e-04
7100.00000  7150.00000  4.182229742254e-05
7150.00000  7200.00000  4.242550363536e-05
7200.00000  7250.00000  4.182229742254e-05
7250.00000  7300.00000  4.001267878406e-05
7300.00000  7350.00000  3.940947257124e-05
7350.00000  7400.00000  4.423512227384e-05
7400.00000  7450.00000  3.619237276950e-05
7450.00000  7500.00000  7.318902048944e-05
7500.00000  7550.00000  3.739878519516e-05
7550.00000  7600.00000  4.041481625928e-05
7600.00000  7650.00000  4.383298479862e-05
7650.00000  7700.00000  4.081695373450e-05
7700.00000  7750.00000  4.463725974906e-05
7750.00000  7800.00000  3.800199140798e-05
7800.00000  7850.00000  4.101802247211e-05
7850.00000  7900.00000  4.202336616015e-05
7900.00000  7950.00000  4.101802247211e-05
7950.00000  8000.00000  3.840412888320e-05
8000.00000  8050.00000  3.739878519516e-05
8050.00000  8100.00000  3.880626635841e-05
8100.00000  8150.00000  4.805542828840e-05
8150.00000  8200.00000  4.503939722427e-05
8200.00000  8250.00000  4.061588499689e-05
8250.00000  8300.00000  4.021374752167e-05
8300.00000  8350.00000  3.498596034385e-05
8350.00000  8400.00000  3.880626635841e-05
8400.00000  8450.00000  4.021374752167e-05
8450.00000  8500.00000  3.820306014559e-05
8500.00000  8550.00000  3.659451024472e-05
8550.00000  8600.00000  4.242550363536e-05
8600.00000  8650.00000  4.222443489776e-05
8650.00000  8700.00000  4.021374752167e-05
8700.00000  8750.00000  3.418168539342e-05
8750.00000  8800.00000  3.860519762081e-05
8800.00000  8850.00000  3.579023529429e-05
8850.00000  8900.00000  3.458382286864e-05
8900.00000  8950.00000  4.041481625928e-05
8950.00000  9000.00000  3.860519762081e-05
9000.00000  9050.00000  3.940947257124e-05
9050.00000  9100.00000  3.800199140798e-05
9100.00000  9150.00000  4.383298479862e-05
9150.00000  9200.00000  4.343084732341e-05
9200.00000  9250.00000  4.242550363536e-05
9250.00000  9300.00000  4.041481625928e-05
9300.00000  9350.00000  4.121909120971e-05
9350.00000  9400.00000  3.900733509602e-05
9400.00000  9450.00000  4.202336616015e-05
9450.00000  9500.00000  3.920840383363e-05
9500.00000  9550.00000  3.759985393276e-05
9550.00000  9600.00000  3.277420423016e-05
9600.00000  9650.00000  3.639344150711e-05
9650.00000  9700.00000  4.202336616015e-05
9700.00000  9750.00000  3.940947257124e-05
9750.00000  9800.00000  3.498596034385e-05
9800.00000  9850.00000  3.538809781907e-05
9850.00000  9900.00000  3.438275413103e-05
9900.00000  9950.00000  3.538809781907e-05
9950.00000  10000.00000  3.739878519516e-05
