300.00000  350.00000  6.049987230930e-06
350.00000  400.00000  2.722494253918e-05
400.00000  450.00000  2.722494253918e-05
450.00000  500.00000  2.004058270246e-04
500.00000  550.00000  6.518861241327e-04
550.00000  600.00000  3.221618200470e-04
600.00000  650.00000  9.392605176019e-04
650.00000  700.00000  1.705340150718e-03
700.00000  750.00000  2.340588809966e-03
750.00000  800.00000  3.389505346129e-03
800.00000  850.00000  4.573034098179e-03
850.00000  900.00000  4.688740103971e-03
900.00000  950.00000  5.035858121345e-03
950.00000  1000.00000  5.705137958767e-03
1000.00000  1050.00000  6.255686796782e-03
1050.00000  1100.00000  6.547598680674e-03
1100.00000  1150.00000  6.552136171097e-03
1150.00000  1200.00000  6.383492777035e-03
1200.00000  1250.00000  6.132418306951e-03
1250.00000  1300.00000  5.936549970350e-03
1300.00000  1350.00000  5.235507699966e-03
1350.00000  1400.00000  5.139464152675e-03
1400.00000  1450.00000  4.964770771382e-03
1450.00000  1500.00000  4.531440435967e-03
1500.00000  1550.00000  4.141972507975e-03
1550.00000  1600.00000  4.008116540491e-03
1600.00000  1650.00000  3.650411045462e-03
1650.00000  1700.00000  3.456055205669e-03
1700.00000  1750.00000  3.225399442490e-03
1750.00000  1800.00000  2.825344036844e-03
1800.00000  1850.00000  2.556875853472e-03
1850.00000  1900.00000  2.447219834911e-03
1900.00000  1950.00000  2.258913982348e-03
1950.00000  2000.00000  2.072120626594e-03
2000.00000  2050.00000  1.935239665494e-03
2050.00000  2100.00000  1.796089959182e-03
2100.00000  2150.00000  1.693240176257e-03
2150.00000  2200.00000  1.579802915677e-03
2200.00000  2250.00000  1.512496807732e-03
2250.00000  2300.00000  1.417209508845e-03
2300.00000  2350.00000  1.379397088652e-03
2350.00000  2400.00000  1.194872478109e-03
2400.00000  2450.00000  1.078410223913e-03
2450.00000  2500.00000  1.035304064893e-03
2500.00000  2550.00000  9.354792755825e-04
2550.00000  2600.00000  8.855668809274e-04
2600.00000  2650.00000  8.711981612539e-04
2650.00000  2700.00000  7.925483272518e-04
2700.00000  2750.00000  7.449046778083e-04
2750.00000  2800.00000  7.237297225000e-04
2800.00000  2850.00000  6.125612071317e-04
2850.00000  2900.00000  6.208799395742e-04
2900.00000  2950.00000  5.755050353422e-04
2950.00000  3000.00000  5.641613092842e-04
3000.00000  3050.00000  5.588675704572e-04
3050.00000  3100.00000  4.537490423197e-04
3100.00000  3150.00000  4.401365710502e-04
3150.00000  3200.00000  4.053491444723e-04
3200.00000  3250.00000  4.015679024530e-04
3250.00000  3300.00000  4.136678769148e-04
3300.00000  3350.00000  3.819054439525e-04
3350.00000  3400.00000  3.168680812200e-04
3400.00000  3450.00000  3.138430876045e-04
3450.00000  3500.00000  3.214055716432e-04
3500.00000  3550.00000  2.949368775078e-04
3550.00000  3600.00000  2.941806291040e-04
3600.00000  3650.00000  3.024993615465e-04
3650.00000  3700.00000  3.002306163349e-04
3700.00000  3750.00000  2.412432408333e-04
3750.00000  3800.00000  2.321682599869e-04
3800.00000  3850.00000  2.132620498903e-04
3850.00000  3900.00000  2.041870690439e-04
3900.00000  3950.00000  1.943558397936e-04
3950.00000  4000.00000  1.913308461782e-04
4000.00000  4050.00000  1.860371073511e-04
4050.00000  4100.00000  1.618371584274e-04
4100.00000  4150.00000  1.663746488506e-04
4150.00000  4200.00000  1.693996424660e-04
4200.00000  4250.00000  1.701558908699e-04
4250.00000  4300.00000  1.361247126959e-04
4300.00000  4350.00000  1.451996935423e-04
4350.00000  4400.00000  1.315872222727e-04
4400.00000  4450.00000  1.330997190805e-04
4450.00000  4500.00000  1.240247382341e-04
4500.00000  4550.00000  1.255372350418e-04
4550.00000  4600.00000  1.194872478109e-04
4600.00000  4650.00000  1.353684642921e-04
4650.00000  4700.00000  1.066310249451e-04
4700.00000  4750.00000  1.036060313297e-04
4750.00000  4800.00000  9.755604409875e-05
4800.00000  4850.00000  8.696856644462e-05
4850.00000  4900.00000  1.005810377142e-04
4900.00000  4950.00000  1.013372861181e-04
4950.00000  5000.00000  9.831229250261e-05
5000.00000  5050.00000  8.394357282915e-05
5050.00000  5100.00000  9.377480207941e-05
5100.00000  5150.00000  7.940608240596e-05
5150.00000  5200.00000  9.377480207941e-05
5200.00000  5250.00000  7.033110155956e-05
5250.00000  5300.00000  7.335609517503e-05
5300.00000  5350.00000  8.469982123302e-05
5350.00000  5400.00000  6.654985954023e-05
5400.00000  5450.00000  6.428111432863e-05
5450.00000  5500.00000  6.806235634796e-05
5500.00000  5550.00000  6.881860475183e-05
5550.00000  5600.00000  7.411234357889e-05
5600.00000  5650.00000  7.033110155956e-05
5650.00000  5700.00000  7.789358559822e-05
5700.00000  5750.00000  5.142489146290e-05
5750.00000  5800.00000  6.579361113636e-05
5800.00000  5850.00000  4.839989784744e-05
5850.00000  5900.00000  4.839989784744e-05
5900.00000  5950.00000  5.747487869383e-05
5950.00000  6000.00000  4.386240742424e-05
6000.00000  6050.00000  3.932491700104e-05
6050.00000  6100.00000  4.008116540491e-05
6100.00000  6150.00000  5.444988507837e-05
6150.00000  6200.00000  5.520613348224e-05
6200.00000  6250.00000  4.991239465517e-05
6250.00000  6300.00000  4.839989784744e-05
6300.00000  6350.00000  4.159366221264e-05
6350.00000  6400.00000  2.140182982941e-04
6400.00000  6450.00000  4.083741380878e-05
6450.00000  6500.00000  3.327492977011e-05
6500.00000  6550.00000  3.932491700104e-05
6550.00000  6600.00000  3.478742657785e-05
6600.00000  6650.00000  3.100618455852e-05
6650.00000  6700.00000  4.234991061651e-05
6700.00000  6750.00000  3.403117817398e-05
6750.00000  6800.00000  2.873743934692e-05
6800.00000  6850.00000  2.798119094305e-05
6850.00000  6900.00000  3.100618455852e-05
6900.00000  6950.00000  2.949368775078e-05
6950.00000  7000.00000  3.705617178945e-05
7000.00000  7050.00000  2.798119094305e-05
7050.00000  7100.00000  4.839989784744e-05
7100.00000  7150.00000  3.024993615465e-05
7150.00000  7200.00000  2.646869413532e-05
7200.00000  7250.00000  2.646869413532e-05
7250.00000  7300.00000  2.646869413532e-05
7300.00000  7350.00000  2.949368775078e-05
7350.00000  7400.00000  2.268745211599e-05
7400.00000  7450.00000  2.495619732759e-05
7450.00000  7500.00000  2.646869413532e-05
7500.00000  7550.00000  1.436871967346e-05
7550.00000  7600.00000  2.041870690439e-05
7600.00000  7650.00000  2.193120371212e-05
7650.00000  7700.00000  2.344370051985e-05
7700.00000  7750.00000  2.873743934692e-05
7750.00000  7800.00000  2.041870690439e-05
7800.00000  7850.00000  1.663746488506e-05
7850.00000  7900.00000  2.193120371212e-05
7900.00000  7950.00000  1.436871967346e-05
7950.00000  8000.00000  1.512496807732e-05
8000.00000  8050.00000  1.588121648119e-05
8050.00000  8100.00000  1.663746488506e-05
8100.00000  8150.00000  9.074980846395e-06
8150.00000  8200.00000  1.588121648119e-05
8200.00000  8250.00000  1.966245850052e-05
8250.00000  8300.00000  1.814996169279e-05
8300.00000  8350.00000  1.285622286573e-05
8350.00000  8400.00000  1.209997446186e-05
8400.00000  8450.00000  2.117495530825e-05
8450.00000  8500.00000  1.890621009666e-05
8500.00000  8550.00000  1.512496807732e-05
8550.00000  8600.00000  9.831229250261e-06
8600.00000  8650.00000  1.890621009666e-05
8650.00000  8700.00000  1.512496807732e-05
8700.00000  8750.00000  9.074980846395e-06
8750.00000  8800.00000  1.588121648119e-05
8800.00000  8850.00000  1.663746488506e-05
8850.00000  8900.00000  1.814996169279e-05
8900.00000  8950.00000  1.512496807732e-05
8950.00000  9000.00000  1.058747765413e-05
9000.00000  9050.00000  1.361247126959e-05
9050.00000  9100.00000  1.209997446186e-05
9100.00000  9150.00000  1.814996169279e-05
9150.00000  9200.00000  8.318732442529e-06
9200.00000  9250.00000  1.966245850052e-05
9250.00000  9300.00000  1.058747765413e-05
9300.00000  9350.00000  1.134372605799e-05
9350.00000  9400.00000  7.562484038662e-06
9400.00000  9450.00000  1.285622286573e-05
9450.00000  9500.00000  1.134372605799e-05
9500.00000  9550.00000  1.436871967346e-05
9550.00000  9600.00000  9.831229250261e-06
9600.00000  9650.00000  6.806235634796e-06
9650.00000  9700.00000  9.831229250261e-06
9700.00000  9750.00000  2.041870690439e-05
9750.00000  9800.00000  1.285622286573e-05
9800.00000  9850.00000  7.562484038662e-06
9850.00000  9900.00000  6.806235634796e-06
9900.00000  9950.00000  7.562484038662e-06
9950.00000  10000.00000  6.049987230930e-06
