300.00000  350.00000  8.485920470026e-05
350.00000  400.00000  7.434246565621e-05
400.00000  450.00000  7.543040417801e-05
450.00000  500.00000  5.874868017711e-05
500.00000  550.00000  5.983661869890e-05
550.00000  600.00000  2.973698626249e-05
600.00000  650.00000  3.046227861035e-05
650.00000  700.00000  2.792375539282e-05
700.00000  750.00000  2.067083191417e-05
750.00000  800.00000  2.320935513170e-05
800.00000  850.00000  2.683581687102e-05
850.00000  900.00000  1.668172400091e-05
900.00000  950.00000  1.559378547911e-05
950.00000  1000.00000  1.305526226158e-05
1000.00000  1050.00000  1.124203139192e-05
1050.00000  1100.00000  1.087938521798e-05
1100.00000  1150.00000  1.414320078338e-05
1150.00000  1200.00000  9.428800522252e-06
1200.00000  1250.00000  1.196732373978e-05
1250.00000  1300.00000  2.030818574023e-05
1300.00000  1350.00000  1.051673904405e-05
1350.00000  1400.00000  1.631907782697e-05
1400.00000  1450.00000  1.668172400091e-05
1450.00000  1500.00000  2.574787834923e-05
1500.00000  1550.00000  2.828640156675e-05
1550.00000  1600.00000  3.118757095822e-05
1600.00000  1650.00000  4.750664878519e-05
1650.00000  1700.00000  5.947397252497e-05
1700.00000  1750.00000  7.760628122161e-05
1750.00000  1800.00000  7.543040417801e-05
1800.00000  1850.00000  7.470511183015e-05
1850.00000  1900.00000  8.776037409173e-05
1900.00000  1950.00000  1.095191445277e-04
1950.00000  2000.00000  1.312779149637e-04
2000.00000  2050.00000  1.229370529632e-04
2050.00000  2100.00000  1.570257933129e-04
2100.00000  2150.00000  1.708063479223e-04
2150.00000  2200.00000  1.787845637488e-04
2200.00000  2250.00000  1.874880719232e-04
2250.00000  2300.00000  2.164997658379e-04
2300.00000  2350.00000  2.299176742734e-04
2350.00000  2400.00000  2.204888737511e-04
2400.00000  2450.00000  2.389838286217e-04
2450.00000  2500.00000  2.291923819255e-04
2500.00000  2550.00000  2.030818574023e-04
2550.00000  2600.00000  2.186756428814e-04
2600.00000  2650.00000  2.331814898388e-04
2650.00000  2700.00000  2.320935513170e-04
2700.00000  2750.00000  2.114227194028e-04
2750.00000  2800.00000  2.252032740122e-04
2800.00000  2850.00000  2.183129967075e-04
2850.00000  2900.00000  2.223021046208e-04
2900.00000  2950.00000  2.186756428814e-04
2950.00000  3000.00000  2.313682589691e-04
3000.00000  3050.00000  2.179503505336e-04
3050.00000  3100.00000  2.230273969686e-04
3100.00000  3150.00000  2.110600732289e-04
3150.00000  3200.00000  2.281044434037e-04
3200.00000  3250.00000  2.226647507947e-04
3250.00000  3300.00000  1.922024721844e-04
3300.00000  3350.00000  2.099721347071e-04
3350.00000  3400.00000  1.758833943574e-04
3400.00000  3450.00000  1.983674571412e-04
3450.00000  3500.00000  1.936530568801e-04
3500.00000  3550.00000  1.885760104450e-04
3550.00000  3600.00000  1.831363178360e-04
3600.00000  3650.00000  1.751581020095e-04
3650.00000  3700.00000  1.900265951408e-04
3700.00000  3750.00000  1.704437017484e-04
3750.00000  3800.00000  1.776966252270e-04
3800.00000  3850.00000  1.508608083560e-04
3850.00000  3900.00000  1.519487468778e-04
3900.00000  3950.00000  1.541246239214e-04
3950.00000  4000.00000  1.450584695731e-04
4000.00000  4050.00000  1.512234545300e-04
4050.00000  4100.00000  1.396187769641e-04
4100.00000  4150.00000  1.475969927906e-04
4150.00000  4200.00000  1.269261608765e-04
4200.00000  4250.00000  1.247502838329e-04
4250.00000  4300.00000  1.243876376589e-04
4300.00000  4350.00000  1.225744067893e-04
4350.00000  4400.00000  1.291020379201e-04
4400.00000  4450.00000  1.073432674841e-04
4450.00000  4500.00000  1.203985297457e-04
4500.00000  4550.00000  1.258382223547e-04
4550.00000  4600.00000  1.178600065281e-04
4600.00000  4650.00000  1.058926827884e-04
4650.00000  4700.00000  9.972769783151e-05
4700.00000  4750.00000  9.755182078791e-05
4750.00000  4800.00000  1.019035748751e-04
4800.00000  4850.00000  1.033541595708e-04
4850.00000  4900.00000  9.573858991825e-05
4900.00000  4950.00000  9.465065139645e-05
4950.00000  5000.00000  9.465065139645e-05
5000.00000  5050.00000  9.610123609218e-05
5050.00000  5100.00000  8.087009678700e-05
5100.00000  5150.00000  7.651834269981e-05
5150.00000  5200.00000  8.522185087420e-05
5200.00000  5250.00000  8.050745061307e-05
5250.00000  5300.00000  8.449655852633e-05
5300.00000  5350.00000  8.195803530880e-05
5350.00000  5400.00000  7.216658861262e-05
5400.00000  5450.00000  7.941951209127e-05
5450.00000  5500.00000  7.434246565621e-05
5500.00000  5550.00000  7.216658861262e-05
5550.00000  5600.00000  7.651834269981e-05
5600.00000  5650.00000  7.434246565621e-05
5650.00000  5700.00000  6.999071156902e-05
5700.00000  5750.00000  6.781483452542e-05
5750.00000  5800.00000  7.724363504768e-05
5800.00000  5850.00000  7.651834269981e-05
5850.00000  5900.00000  7.397981948228e-05
5900.00000  5950.00000  6.817748069936e-05
5950.00000  6000.00000  6.672689600363e-05
6000.00000  6050.00000  6.636424982969e-05
6050.00000  6100.00000  6.346308043823e-05
6100.00000  6150.00000  7.506775800408e-05
6150.00000  6200.00000  6.382572661216e-05
6200.00000  6250.00000  7.651834269981e-05
6250.00000  6300.00000  9.174948200499e-05
6300.00000  6350.00000  8.413391235240e-05
6350.00000  6400.00000  4.609232870685e-04
6400.00000  6450.00000  5.584751078564e-05
6450.00000  6500.00000  5.149575669845e-05
6500.00000  6550.00000  5.403427991598e-05
6550.00000  6600.00000  5.403427991598e-05
6600.00000  6650.00000  5.439692608991e-05
6650.00000  6700.00000  4.786929495912e-05
6700.00000  6750.00000  5.512221843778e-05
6750.00000  6800.00000  5.512221843778e-05
6800.00000  6850.00000  5.149575669845e-05
6850.00000  6900.00000  5.330898756811e-05
6900.00000  6950.00000  5.802338782924e-05
6950.00000  7000.00000  5.874868017711e-05
7000.00000  7050.00000  5.475957226385e-05
7050.00000  7100.00000  8.123274296094e-05
7100.00000  7150.00000  3.191286330608e-05
7150.00000  7200.00000  2.357200130563e-05
7200.00000  7250.00000  3.191286330608e-05
7250.00000  7300.00000  3.263815565395e-05
7300.00000  7350.00000  3.009963243642e-05
7350.00000  7400.00000  2.792375539282e-05
7400.00000  7450.00000  3.408874034968e-05
7450.00000  7500.00000  4.895723348092e-05
7500.00000  7550.00000  3.009963243642e-05
7550.00000  7600.00000  3.372609417575e-05
7600.00000  7650.00000  2.538523217529e-05
7650.00000  7700.00000  3.336344800181e-05
7700.00000  7750.00000  2.792375539282e-05
7750.00000  7800.00000  2.828640156675e-05
7800.00000  7850.00000  3.155021713215e-05
7850.00000  7900.00000  3.046227861035e-05
7900.00000  7950.00000  3.263815565395e-05
7950.00000  8000.00000  2.393464747956e-05
8000.00000  8050.00000  3.046227861035e-05
8050.00000  8100.00000  3.336344800181e-05
8100.00000  8150.00000  3.082492478428e-05
8150.00000  8200.00000  2.502258600136e-05
8200.00000  8250.00000  2.792375539282e-05
8250.00000  8300.00000  3.046227861035e-05
8300.00000  8350.00000  2.973698626249e-05
8350.00000  8400.00000  2.212141660990e-05
8400.00000  8450.00000  2.973698626249e-05
8450.00000  8500.00000  2.611052452316e-05
8500.00000  8550.00000  2.864904774069e-05
8550.00000  8600.00000  2.647317069709e-05
8600.00000  8650.00000  2.067083191417e-05
8650.00000  8700.00000  2.465993982743e-05
8700.00000  8750.00000  3.046227861035e-05
8750.00000  8800.00000  2.828640156675e-05
8800.00000  8850.00000  2.683581687102e-05
8850.00000  8900.00000  2.103347808810e-05
8900.00000  8950.00000  2.139612426203e-05
8950.00000  9000.00000  2.973698626249e-05
9000.00000  9050.00000  3.118757095822e-05
9050.00000  9100.00000  2.574787834923e-05
9100.00000  9150.00000  2.719846304496e-05
9150.00000  9200.00000  2.611052452316e-05
9200.00000  9250.00000  2.502258600136e-05
9250.00000  9300.00000  2.719846304496e-05
9300.00000  9350.00000  2.284670895776e-05
9350.00000  9400.00000  2.502258600136e-05
9400.00000  9450.00000  1.849495487057e-05
9450.00000  9500.00000  2.465993982743e-05
9500.00000  9550.00000  2.502258600136e-05
9550.00000  9600.00000  2.212141660990e-05
9600.00000  9650.00000  2.465993982743e-05
9650.00000  9700.00000  2.864904774069e-05
9700.00000  9750.00000  2.030818574023e-05
9750.00000  9800.00000  2.864904774069e-05
9800.00000  9850.00000  2.429729365349e-05
9850.00000  9900.00000  2.465993982743e-05
9900.00000  9950.00000  2.465993982743e-05
9950.00000  10000.00000  2.320935513170e-05
