10001.00000  11001.00000  6.335064958186e-05
11001.00000  12001.00000  5.099610739055e-05
12001.00000  13001.00000  4.423607487077e-05
13001.00000  14001.00000  3.848018511256e-05
14001.00000  15001.00000  3.159463474759e-05
15001.00000  16001.00000  2.885117327405e-05
16001.00000  17001.00000  2.641254085312e-05
17001.00000  18001.00000  2.284424782544e-05
18001.00000  19001.00000  2.040561540452e-05
19001.00000  20001.00000  1.721387591242e-05
20001.00000  21001.00000  1.620973315086e-05
21001.00000  22001.00000  1.420144762775e-05
22001.00000  23001.00000  1.386075633365e-05
23001.00000  24001.00000  1.174488408608e-05
24001.00000  25001.00000  1.108143261862e-05
25001.00000  26001.00000  1.081246580749e-05
26001.00000  27001.00000  8.983491491795e-06
27001.00000  28001.00000  8.391764507305e-06
28001.00000  29001.00000  7.997279850979e-06
29001.00000  30001.00000  7.692450798363e-06
30001.00000  31001.00000  7.387621745748e-06
31001.00000  32001.00000  6.491065708642e-06
32001.00000  33001.00000  6.957274847937e-06
33001.00000  34001.00000  5.809683120442e-06
34001.00000  35001.00000  5.038644928532e-06
35001.00000  36001.00000  4.841402600369e-06
36001.00000  37001.00000  4.393124581816e-06
37001.00000  38001.00000  4.554504668495e-06
38001.00000  39001.00000  3.855190959553e-06
39001.00000  40001.00000  4.177951132911e-06
40001.00000  41001.00000  4.070364408458e-06
41001.00000  42001.00000  3.424844061742e-06
42001.00000  43001.00000  3.460706303226e-06
43001.00000  44001.00000  3.353119578774e-06
44001.00000  45001.00000  2.815185956511e-06
45001.00000  46001.00000  2.922772680963e-06
46001.00000  47001.00000  2.420701300184e-06
47001.00000  48001.00000  2.743461473542e-06
48001.00000  49001.00000  2.510356903895e-06
49001.00000  50001.00000  2.384839058700e-06
50001.00000  51001.00000  2.080010006084e-06
51001.00000  52001.00000  2.384839058700e-06
52001.00000  53001.00000  2.205527851279e-06
53001.00000  54001.00000  2.151734489053e-06
54001.00000  55001.00000  1.936561040147e-06
55001.00000  56001.00000  1.990354402374e-06
56001.00000  57001.00000  1.900698798663e-06
57001.00000  58001.00000  1.685525349758e-06
58001.00000  59001.00000  1.649663108274e-06
59001.00000  60001.00000  1.775180953468e-06
60001.00000  61001.00000  1.524145263079e-06
61001.00000  62001.00000  1.721387591242e-06
62001.00000  63001.00000  1.524145263079e-06
63001.00000  64001.00000  1.685525349758e-06
64001.00000  65001.00000  1.577938625305e-06
65001.00000  66001.00000  1.237247331205e-06
66001.00000  67001.00000  1.111729486011e-06
67001.00000  68001.00000  1.452420780111e-06
68001.00000  69001.00000  1.093798365268e-06
69001.00000  70001.00000  1.237247331205e-06
70001.00000  71001.00000  1.129660606753e-06
71001.00000  72001.00000  8.965560371053e-07
72001.00000  73001.00000  1.165522848237e-06
73001.00000  74001.00000  1.147591727495e-06
74001.00000  75001.00000  9.862116408158e-07
75001.00000  76001.00000  8.427626748790e-07
76001.00000  77001.00000  9.503493993316e-07
77001.00000  78001.00000  1.022073882300e-06
78001.00000  79001.00000  9.862116408158e-07
79001.00000  80001.00000  7.710381919105e-07
80001.00000  81001.00000  7.351759504263e-07
81001.00000  82001.00000  5.379336222632e-07
82001.00000  83001.00000  8.427626748790e-07
83001.00000  84001.00000  5.737958637474e-07
84001.00000  85001.00000  5.917269844895e-07
85001.00000  86001.00000  4.124157770684e-07
86001.00000  87001.00000  6.096581052316e-07
87001.00000  88001.00000  6.813825882000e-07
88001.00000  89001.00000  7.531070711684e-07
89001.00000  90001.00000  6.096581052316e-07
90001.00000  91001.00000  7.710381919105e-07
91001.00000  92001.00000  6.275892259737e-07
92001.00000  93001.00000  5.737958637474e-07
93001.00000  94001.00000  5.200025015211e-07
94001.00000  95001.00000  5.737958637474e-07
95001.00000  96001.00000  4.662091392947e-07
96001.00000  97001.00000  3.944846563263e-07
97001.00000  98001.00000  5.558647430053e-07
98001.00000  99001.00000  6.275892259737e-07
99001.00000  100001.00000  4.841402600369e-07
100001.00000  101001.00000  4.124157770684e-07
101001.00000  102001.00000  3.048290526158e-07
102001.00000  103001.00000  4.841402600369e-07
103001.00000  104001.00000  3.765535355842e-07
104001.00000  105001.00000  5.020713807790e-07
105001.00000  106001.00000  4.662091392947e-07
106001.00000  107001.00000  4.303468978105e-07
107001.00000  108001.00000  6.096581052316e-07
108001.00000  109001.00000  3.406912941000e-07
109001.00000  110001.00000  4.124157770684e-07
110001.00000  111001.00000  3.586224148421e-07
111001.00000  112001.00000  2.689668111316e-07
112001.00000  113001.00000  2.689668111316e-07
113001.00000  114001.00000  4.482780185526e-07
114001.00000  115001.00000  4.662091392947e-07
115001.00000  116001.00000  3.944846563263e-07
116001.00000  117001.00000  3.227601733579e-07
117001.00000  118001.00000  3.586224148421e-07
118001.00000  119001.00000  3.227601733579e-07
119001.00000  120001.00000  1.972423281632e-07
120001.00000  121001.00000  1.972423281632e-07
121001.00000  122001.00000  2.331045696474e-07
122001.00000  123001.00000  3.227601733579e-07
123001.00000  124001.00000  2.689668111316e-07
124001.00000  125001.00000  2.689668111316e-07
125001.00000  126001.00000  1.613800866790e-07
126001.00000  127001.00000  2.151734489053e-07
127001.00000  128001.00000  1.613800866790e-07
128001.00000  129001.00000  1.972423281632e-07
129001.00000  130001.00000  1.972423281632e-07
130001.00000  131001.00000  2.868979318737e-07
131001.00000  132001.00000  2.331045696474e-07
132001.00000  133001.00000  2.868979318737e-07
133001.00000  134001.00000  1.613800866790e-07
134001.00000  135001.00000  2.151734489053e-07
135001.00000  136001.00000  2.510356903895e-07
136001.00000  137001.00000  2.331045696474e-07
137001.00000  138001.00000  1.793112074211e-07
138001.00000  139001.00000  2.151734489053e-07
139001.00000  140001.00000  1.255178451947e-07
140001.00000  141001.00000  1.613800866790e-07
141001.00000  142001.00000  2.331045696474e-07
142001.00000  143001.00000  1.972423281632e-07
143001.00000  144001.00000  1.972423281632e-07
144001.00000  145001.00000  1.434489659368e-07
145001.00000  146001.00000  1.793112074211e-07
146001.00000  147001.00000  8.965560371053e-08
147001.00000  148001.00000  1.434489659368e-07
148001.00000  149001.00000  1.255178451947e-07
149001.00000  150001.00000  5.379336222632e-08
150001.00000  151001.00000  1.434489659368e-07
151001.00000  152001.00000  1.793112074211e-07
152001.00000  153001.00000  1.613800866790e-07
153001.00000  154001.00000  1.434489659368e-07
154001.00000  155001.00000  1.255178451947e-07
155001.00000  156001.00000  1.613800866790e-07
156001.00000  157001.00000  1.434489659368e-07
157001.00000  158001.00000  1.255178451947e-07
158001.00000  159001.00000  1.972423281632e-07
159001.00000  160001.00000  1.255178451947e-07
160001.00000  161001.00000  1.613800866790e-07
161001.00000  162001.00000  8.965560371053e-08
162001.00000  163001.00000  1.075867244526e-07
163001.00000  164001.00000  1.255178451947e-07
164001.00000  165001.00000  8.965560371053e-08
165001.00000  166001.00000  1.972423281632e-07
166001.00000  167001.00000  1.793112074211e-07
167001.00000  168001.00000  1.255178451947e-07
168001.00000  169001.00000  1.075867244526e-07
169001.00000  170001.00000  8.965560371053e-08
170001.00000  171001.00000  8.965560371053e-08
171001.00000  172001.00000  1.075867244526e-07
172001.00000  173001.00000  1.075867244526e-07
173001.00000  174001.00000  3.586224148421e-08
174001.00000  175001.00000  1.075867244526e-07
175001.00000  176001.00000  1.075867244526e-07
176001.00000  177001.00000  1.613800866790e-07
177001.00000  178001.00000  1.075867244526e-07
178001.00000  179001.00000  7.172448296842e-08
179001.00000  180001.00000  8.965560371053e-08
180001.00000  181001.00000  1.255178451947e-07
181001.00000  182001.00000  8.965560371053e-08
182001.00000  183001.00000  1.613800866790e-07
183001.00000  184001.00000  1.793112074211e-08
184001.00000  185001.00000  1.434489659368e-07
185001.00000  186001.00000  3.586224148421e-08
186001.00000  187001.00000  1.255178451947e-07
187001.00000  188001.00000  1.255178451947e-07
188001.00000  189001.00000  7.172448296842e-08
189001.00000  190001.00000  3.586224148421e-08
190001.00000  191001.00000  8.965560371053e-08
191001.00000  192001.00000  1.613800866790e-07
192001.00000  193001.00000  7.172448296842e-08
193001.00000  194001.00000  5.379336222632e-08
194001.00000  195001.00000  7.172448296842e-08
195001.00000  196001.00000  1.075867244526e-07
196001.00000  197001.00000  8.965560371053e-08
197001.00000  198001.00000  3.586224148421e-08
198001.00000  199001.00000  3.586224148421e-08
