300.00000  350.00000  2.161858734339e-05
350.00000  400.00000  4.431810405395e-05
400.00000  450.00000  2.954540270263e-05
450.00000  500.00000  2.738354396829e-05
500.00000  550.00000  2.298776454181e-04
550.00000  600.00000  2.630261460113e-05
600.00000  650.00000  6.053204456149e-05
650.00000  700.00000  3.639128869471e-05
700.00000  750.00000  5.404646835848e-05
750.00000  800.00000  3.350881038226e-05
800.00000  850.00000  1.203434695449e-04
850.00000  900.00000  3.278819080414e-05
900.00000  950.00000  3.098664185886e-05
950.00000  1000.00000  3.242788101509e-05
1000.00000  1050.00000  3.783252785093e-05
1050.00000  1100.00000  3.098664185886e-05
1100.00000  1150.00000  3.999438658527e-05
1150.00000  1200.00000  3.242788101509e-05
1200.00000  1250.00000  3.783252785093e-05
1250.00000  1300.00000  1.012470507249e-04
1300.00000  1350.00000  3.639128869471e-05
1350.00000  1400.00000  3.639128869471e-05
1400.00000  1450.00000  3.819283763999e-05
1450.00000  1500.00000  4.395779426489e-05
1500.00000  1550.00000  4.431810405395e-05
1550.00000  1600.00000  5.044337046791e-05
1600.00000  1650.00000  5.152429983508e-05
1650.00000  1700.00000  4.792120194452e-05
1700.00000  1750.00000  1.225053282792e-04
1750.00000  1800.00000  4.900213131169e-05
1800.00000  1850.00000  4.071500616339e-05
1850.00000  1900.00000  5.728925645999e-05
1900.00000  1950.00000  4.720058236640e-05
1950.00000  2000.00000  4.756089215546e-05
2000.00000  2050.00000  5.440677814753e-05
2050.00000  2100.00000  6.377483266300e-05
2100.00000  2150.00000  5.620832709282e-05
2150.00000  2200.00000  5.332584878036e-05
2200.00000  2250.00000  5.476708793659e-05
2250.00000  2300.00000  6.521607181923e-05
2300.00000  2350.00000  1.398001981539e-04
2350.00000  2400.00000  6.089235435055e-05
2400.00000  2450.00000  6.953978928791e-05
2450.00000  2500.00000  6.953978928791e-05
2500.00000  2550.00000  6.089235435055e-05
2550.00000  2600.00000  5.800987603810e-05
2600.00000  2650.00000  6.485576203017e-05
2650.00000  2700.00000  7.314288717847e-05
2700.00000  2750.00000  6.773824034262e-05
2750.00000  2800.00000  6.485576203017e-05
2800.00000  2850.00000  7.170164802225e-05
2850.00000  2900.00000  7.170164802225e-05
2900.00000  2950.00000  6.557638160829e-05
2950.00000  3000.00000  9.584240388903e-05
3000.00000  3050.00000  7.170164802225e-05
3050.00000  3100.00000  7.998877317055e-05
3100.00000  3150.00000  7.890784380338e-05
3150.00000  3200.00000  8.287125148300e-05
3200.00000  3250.00000  8.791558852979e-05
3250.00000  3300.00000  9.692333325620e-05
3300.00000  3350.00000  1.005264311468e-04
3350.00000  3400.00000  8.899651789696e-05
3400.00000  3450.00000  9.187899620941e-05
3450.00000  3500.00000  9.692333325620e-05
3500.00000  3550.00000  9.584240388903e-05
3550.00000  3600.00000  1.030485996702e-04
3600.00000  3650.00000  1.023279800920e-04
3650.00000  3700.00000  1.376383394196e-04
3700.00000  3750.00000  1.070120073498e-04
3750.00000  3800.00000  1.152991324981e-04
3800.00000  3850.00000  1.232259478573e-04
3850.00000  3900.00000  1.261084261698e-04
3900.00000  3950.00000  1.243068772245e-04
3950.00000  4000.00000  1.167403716543e-04
4000.00000  4050.00000  1.315130730056e-04
4050.00000  4100.00000  1.268290457479e-04
4100.00000  4150.00000  1.315130730056e-04
4150.00000  4200.00000  1.304321436385e-04
4200.00000  4250.00000  1.351161708962e-04
4250.00000  4300.00000  1.408811275211e-04
4300.00000  4350.00000  1.477270135132e-04
4350.00000  4400.00000  1.480873233022e-04
4400.00000  4450.00000  1.379986492086e-04
4450.00000  4500.00000  1.398001981539e-04
4500.00000  4550.00000  1.545728995052e-04
4550.00000  4600.00000  1.545728995052e-04
4600.00000  4650.00000  1.653821931769e-04
4650.00000  4700.00000  1.578156876068e-04
4700.00000  4750.00000  1.844786119969e-04
4750.00000  4800.00000  1.639409540207e-04
4800.00000  4850.00000  1.787136553720e-04
4850.00000  4900.00000  1.761914868486e-04
4900.00000  4950.00000  1.751105574815e-04
4950.00000  5000.00000  1.725883889581e-04
5000.00000  5050.00000  1.895229490437e-04
5050.00000  5100.00000  1.978100741920e-04
5100.00000  5150.00000  1.679043617003e-04
5150.00000  5200.00000  1.870007805203e-04
5200.00000  5250.00000  1.844786119969e-04
5250.00000  5300.00000  1.996116231373e-04
5300.00000  5350.00000  1.808755141064e-04
5350.00000  5400.00000  1.725883889581e-04
5400.00000  5450.00000  2.010528622935e-04
5450.00000  5500.00000  1.960085252467e-04
5500.00000  5550.00000  1.963688350358e-04
5550.00000  5600.00000  1.967291448249e-04
5600.00000  5650.00000  1.996116231373e-04
5650.00000  5700.00000  2.042956503950e-04
5700.00000  5750.00000  2.125827755433e-04
5750.00000  5800.00000  1.906038784109e-04
5800.00000  5850.00000  1.949275958796e-04
5850.00000  5900.00000  1.963688350358e-04
5900.00000  5950.00000  1.967291448249e-04
5950.00000  6000.00000  2.032147210279e-04
6000.00000  6050.00000  2.064575091294e-04
6050.00000  6100.00000  1.855595413641e-04
6100.00000  6150.00000  2.003322427154e-04
6150.00000  6200.00000  2.003322427154e-04
6200.00000  6250.00000  2.057368895513e-04
6250.00000  6300.00000  2.078987482856e-04
6300.00000  6350.00000  1.992513133483e-04
6350.00000  6400.00000  5.321775584365e-04
6400.00000  6450.00000  2.017734818716e-04
6450.00000  6500.00000  1.927657371452e-04
6500.00000  6550.00000  1.794342749501e-04
6550.00000  6600.00000  1.815961336845e-04
6600.00000  6650.00000  1.643012638098e-04
6650.00000  6700.00000  1.801548945283e-04
6700.00000  6750.00000  1.787136553720e-04
6750.00000  6800.00000  1.657425029660e-04
6800.00000  6850.00000  1.621394050754e-04
6850.00000  6900.00000  1.733090085362e-04
6900.00000  6950.00000  1.801548945283e-04
6950.00000  7000.00000  1.599775463411e-04
7000.00000  7050.00000  1.851992315750e-04
7050.00000  7100.00000  1.916848077781e-04
7100.00000  7150.00000  1.034089094592e-04
7150.00000  7200.00000  8.935682768602e-05
7200.00000  7250.00000  8.971713747507e-05
7250.00000  7300.00000  8.791558852979e-05
7300.00000  7350.00000  9.079806684224e-05
7350.00000  7400.00000  9.151868642035e-05
7400.00000  7450.00000  8.143001232677e-05
7450.00000  7500.00000  1.030485996702e-04
7500.00000  7550.00000  8.719496895168e-05
7550.00000  7600.00000  8.611403958451e-05
7600.00000  7650.00000  8.935682768602e-05
7650.00000  7700.00000  8.503311021734e-05
7700.00000  7750.00000  9.692333325620e-05
7750.00000  7800.00000  8.359187106111e-05
7800.00000  7850.00000  8.791558852979e-05
7850.00000  7900.00000  9.043775705318e-05
7900.00000  7950.00000  8.899651789696e-05
7950.00000  8000.00000  8.251094169394e-05
8000.00000  8050.00000  8.467280042828e-05
8050.00000  8100.00000  8.395218085017e-05
8100.00000  8150.00000  8.791558852979e-05
8150.00000  8200.00000  8.683465916262e-05
8200.00000  8250.00000  8.827589831885e-05
8250.00000  8300.00000  8.395218085017e-05
8300.00000  8350.00000  8.539342000639e-05
8350.00000  8400.00000  7.926815359243e-05
8400.00000  8450.00000  7.926815359243e-05
8450.00000  8500.00000  6.269390329583e-05
8500.00000  8550.00000  7.314288717847e-05
8550.00000  8600.00000  8.575372979545e-05
8600.00000  8650.00000  8.106970253772e-05
8650.00000  8700.00000  7.098102844413e-05
8700.00000  8750.00000  8.755527874073e-05
8750.00000  8800.00000  7.566505570187e-05
8800.00000  8850.00000  7.710629485809e-05
8850.00000  8900.00000  7.962846338149e-05
8900.00000  8950.00000  7.818722422526e-05
8950.00000  9000.00000  7.998877317055e-05
9000.00000  9050.00000  7.242226760036e-05
9050.00000  9100.00000  7.026040886602e-05
9100.00000  9150.00000  6.809855013168e-05
9150.00000  9200.00000  7.710629485809e-05
9200.00000  9250.00000  7.098102844413e-05
9250.00000  9300.00000  7.638567527998e-05
9300.00000  9350.00000  7.890784380338e-05
9350.00000  9400.00000  7.314288717847e-05
9400.00000  9450.00000  7.386350675659e-05
9450.00000  9500.00000  7.278257738942e-05
9500.00000  9550.00000  7.782691443621e-05
9550.00000  9600.00000  7.134133823319e-05
9600.00000  9650.00000  6.197328371772e-05
9650.00000  9700.00000  6.773824034262e-05
9700.00000  9750.00000  6.557638160829e-05
9750.00000  9800.00000  6.701762076451e-05
9800.00000  9850.00000  6.341452287395e-05
9850.00000  9900.00000  5.584801730376e-05
9900.00000  9950.00000  6.269390329583e-05
9950.00000  10000.00000  5.692894667093e-05
