300.00000  350.00000  0.000000000000e+00
350.00000  400.00000  0.000000000000e+00
400.00000  450.00000  0.000000000000e+00
450.00000  500.00000  0.000000000000e+00
500.00000  550.00000  2.501721864355e-06
550.00000  600.00000  0.000000000000e+00
600.00000  650.00000  7.147776755301e-07
650.00000  700.00000  0.000000000000e+00
700.00000  750.00000  0.000000000000e+00
750.00000  800.00000  1.429555351060e-06
800.00000  850.00000  5.360832566476e-06
850.00000  900.00000  0.000000000000e+00
900.00000  950.00000  7.147776755301e-07
950.00000  1000.00000  3.573888377651e-07
1000.00000  1050.00000  7.147776755301e-07
1050.00000  1100.00000  1.786944188825e-06
1100.00000  1150.00000  1.429555351060e-06
1150.00000  1200.00000  3.573888377651e-07
1200.00000  1250.00000  7.147776755301e-07
1250.00000  1300.00000  1.786944188825e-05
1300.00000  1350.00000  1.786944188825e-06
1350.00000  1400.00000  2.144333026590e-06
1400.00000  1450.00000  2.859110702120e-06
1450.00000  1500.00000  1.786944188825e-06
1500.00000  1550.00000  4.288666053181e-06
1550.00000  1600.00000  3.573888377651e-06
1600.00000  1650.00000  4.646054890946e-06
1650.00000  1700.00000  5.360832566476e-06
1700.00000  1750.00000  3.430932842545e-05
1750.00000  1800.00000  6.432999079771e-06
1800.00000  1850.00000  6.075610242006e-06
1850.00000  1900.00000  7.147776755301e-06
1900.00000  1950.00000  7.862554430831e-06
1950.00000  2000.00000  6.075610242006e-06
2000.00000  2050.00000  5.360832566476e-06
2050.00000  2100.00000  8.577332106361e-06
2100.00000  2150.00000  7.505165593066e-06
2150.00000  2200.00000  8.934720944126e-06
2200.00000  2250.00000  7.147776755301e-06
2250.00000  2300.00000  1.036427629519e-05
2300.00000  2350.00000  5.539526985358e-05
2350.00000  2400.00000  1.107905397072e-05
2400.00000  2450.00000  1.286599815954e-05
2450.00000  2500.00000  7.505165593066e-06
2500.00000  2550.00000  1.143644280848e-05
2550.00000  2600.00000  1.143644280848e-05
2600.00000  2650.00000  1.179383164625e-05
2650.00000  2700.00000  1.215122048401e-05
2700.00000  2750.00000  1.036427629519e-05
2750.00000  2800.00000  1.143644280848e-05
2800.00000  2850.00000  1.643988653719e-05
2850.00000  2900.00000  1.465294234837e-05
2900.00000  2950.00000  1.751205305049e-05
2950.00000  3000.00000  3.645366145204e-05
3000.00000  3050.00000  1.572510886166e-05
3050.00000  3100.00000  1.465294234837e-05
3100.00000  3150.00000  1.608249769943e-05
3150.00000  3200.00000  1.894160840155e-05
3200.00000  3250.00000  1.286599815954e-05
3250.00000  3300.00000  1.679727537496e-05
3300.00000  3350.00000  1.822683072602e-05
3350.00000  3400.00000  2.072855259037e-05
3400.00000  3450.00000  2.108594142814e-05
3450.00000  3500.00000  2.716155167014e-05
3500.00000  3550.00000  2.930588469673e-05
3550.00000  3600.00000  2.144333026590e-05
3600.00000  3650.00000  3.824060564086e-05
3650.00000  3700.00000  6.504476847324e-05
3700.00000  3750.00000  3.538149493874e-05
3750.00000  3800.00000  4.360143820734e-05
3800.00000  3850.00000  4.717532658499e-05
3850.00000  3900.00000  6.039871358230e-05
3900.00000  3950.00000  5.789699171794e-05
3950.00000  4000.00000  6.218565777112e-05
4000.00000  4050.00000  6.933343452642e-05
4050.00000  4100.00000  7.469426709290e-05
4100.00000  4150.00000  6.718910149983e-05
4150.00000  4200.00000  7.397948941737e-05
4200.00000  4250.00000  8.112726617267e-05
4250.00000  4300.00000  8.541593222585e-05
4300.00000  4350.00000  1.043575406274e-04
4350.00000  4400.00000  1.050723183029e-04
4400.00000  4450.00000  1.175809276247e-04
4450.00000  4500.00000  1.315190922975e-04
4500.00000  4550.00000  1.418833685927e-04
4550.00000  4600.00000  1.293747592710e-04
4600.00000  4650.00000  1.450998681326e-04
4650.00000  4700.00000  1.590380328055e-04
4700.00000  4750.00000  1.643988653719e-04
4750.00000  4800.00000  1.669005872363e-04
4800.00000  4850.00000  1.833404737735e-04
4850.00000  4900.00000  1.987081937974e-04
4900.00000  4950.00000  1.979934161218e-04
4950.00000  5000.00000  1.904882505288e-04
5000.00000  5050.00000  2.069281370660e-04
5050.00000  5100.00000  2.215810794143e-04
5100.00000  5150.00000  2.301584115207e-04
5150.00000  5200.00000  2.369487994382e-04
5200.00000  5250.00000  2.390931324648e-04
5250.00000  5300.00000  2.365914106005e-04
5300.00000  5350.00000  2.587495185419e-04
5350.00000  5400.00000  2.601790738930e-04
5400.00000  5450.00000  3.098561223423e-04
5450.00000  5500.00000  2.655399064594e-04
5500.00000  5550.00000  2.705433501882e-04
5550.00000  5600.00000  2.776911269435e-04
5600.00000  5650.00000  2.823371818344e-04
5650.00000  5700.00000  3.105709000178e-04
5700.00000  5750.00000  2.841241260232e-04
5750.00000  5800.00000  2.980622906961e-04
5800.00000  5850.00000  2.977049018583e-04
5850.00000  5900.00000  3.220073428263e-04
5900.00000  5950.00000  3.052100674514e-04
5950.00000  6000.00000  3.191482321242e-04
6000.00000  6050.00000  3.137873995577e-04
6050.00000  6100.00000  3.463097837943e-04
6100.00000  6150.00000  3.488115056587e-04
6150.00000  6200.00000  3.434506730922e-04
6200.00000  6250.00000  3.731139466267e-04
6250.00000  6300.00000  4.327978825335e-04
6300.00000  6350.00000  4.578151011770e-04
6350.00000  6400.00000  2.019961711048e-03
6400.00000  6450.00000  3.423785065789e-04
6450.00000  6500.00000  3.255812312040e-04
6500.00000  6550.00000  3.523853940363e-04
6550.00000  6600.00000  3.366602851747e-04
6600.00000  6650.00000  2.984196795338e-04
6650.00000  6700.00000  3.291551195816e-04
6700.00000  6750.00000  3.395193958768e-04
6750.00000  6800.00000  3.581036154406e-04
6800.00000  6850.00000  3.295125084194e-04
6850.00000  6900.00000  3.520280051986e-04
6900.00000  6950.00000  3.355881186614e-04
6950.00000  7000.00000  3.545297270629e-04
7000.00000  7050.00000  3.466671726321e-04
7050.00000  7100.00000  4.989148175200e-04
7100.00000  7150.00000  1.661858095608e-04
7150.00000  7200.00000  1.436703127816e-04
7200.00000  7250.00000  1.476015899970e-04
7250.00000  7300.00000  1.501033118613e-04
7300.00000  7350.00000  1.440277016193e-04
7350.00000  7400.00000  1.611823658320e-04
7400.00000  7450.00000  1.701170867762e-04
7450.00000  7500.00000  1.947769165820e-04
7500.00000  7550.00000  1.450998681326e-04
7550.00000  7600.00000  1.511754783746e-04
7600.00000  7650.00000  1.565363109411e-04
7650.00000  7700.00000  1.676153649118e-04
7700.00000  7750.00000  1.704744756139e-04
7750.00000  7800.00000  1.640414765342e-04
7800.00000  7850.00000  1.497459230236e-04
7850.00000  7900.00000  1.686875314251e-04
7900.00000  7950.00000  1.576084774544e-04
7950.00000  8000.00000  1.711892532895e-04
8000.00000  8050.00000  1.518902560502e-04
8050.00000  8100.00000  1.636840876964e-04
8100.00000  8150.00000  1.604675881565e-04
8150.00000  8200.00000  1.719040309650e-04
8200.00000  8250.00000  1.704744756139e-04
8250.00000  8300.00000  1.683301425873e-04
8300.00000  8350.00000  1.690449202629e-04
8350.00000  8400.00000  1.794091965581e-04
8400.00000  8450.00000  1.651136430475e-04
8450.00000  8500.00000  1.715466421272e-04
8500.00000  8550.00000  1.726188086405e-04
8550.00000  8600.00000  1.551067555900e-04
8600.00000  8650.00000  1.561789221033e-04
8650.00000  8700.00000  1.643988653719e-04
8700.00000  8750.00000  1.726188086405e-04
8750.00000  8800.00000  1.640414765342e-04
8800.00000  8850.00000  1.683301425873e-04
8850.00000  8900.00000  1.601101993187e-04
8900.00000  8950.00000  1.790518077203e-04
8950.00000  9000.00000  1.615397546698e-04
9000.00000  9050.00000  1.683301425873e-04
9050.00000  9100.00000  1.654710318852e-04
9100.00000  9150.00000  1.565363109411e-04
9150.00000  9200.00000  1.654710318852e-04
9200.00000  9250.00000  1.672579760740e-04
9250.00000  9300.00000  1.801239742336e-04
9300.00000  9350.00000  1.361651471885e-04
9350.00000  9400.00000  1.676153649118e-04
9400.00000  9450.00000  1.601101993187e-04
9450.00000  9500.00000  1.711892532895e-04
9500.00000  9550.00000  1.679727537496e-04
9550.00000  9600.00000  1.526050337257e-04
9600.00000  9650.00000  1.618971435076e-04
9650.00000  9700.00000  1.643988653719e-04
9700.00000  9750.00000  1.636840876964e-04
9750.00000  9800.00000  1.529624225634e-04
9800.00000  9850.00000  1.601101993187e-04
9850.00000  9900.00000  1.626119211831e-04
9900.00000  9950.00000  1.479589788347e-04
9950.00000  10000.00000  1.504607006991e-04
