300.00000  350.00000  4.619323071372e-06
350.00000  400.00000  1.154830767843e-05
400.00000  450.00000  2.040201023189e-05
450.00000  500.00000  1.905470766941e-04
500.00000  550.00000  6.724964504739e-04
550.00000  600.00000  3.476040611207e-04
600.00000  650.00000  1.069758234612e-03
650.00000  700.00000  2.368172961257e-03
700.00000  750.00000  3.433696816386e-03
750.00000  800.00000  5.218680239882e-03
800.00000  850.00000  7.421327457748e-03
850.00000  900.00000  7.950239949420e-03
900.00000  950.00000  8.943394409765e-03
950.00000  1000.00000  1.083731686903e-02
1000.00000  1050.00000  1.251259136958e-02
1050.00000  1100.00000  1.389530874228e-02
1100.00000  1150.00000  1.514637540744e-02
1150.00000  1200.00000  1.610488494475e-02
1200.00000  1250.00000  1.675890410294e-02
1250.00000  1300.00000  1.728627682025e-02
1300.00000  1350.00000  1.667421651330e-02
1350.00000  1400.00000  1.690941704635e-02
1400.00000  1450.00000  1.702105068724e-02
1450.00000  1500.00000  1.689902356944e-02
1500.00000  1550.00000  1.690133323097e-02
1550.00000  1600.00000  1.670963132351e-02
1600.00000  1650.00000  1.627233540609e-02
1650.00000  1700.00000  1.611604830884e-02
1700.00000  1750.00000  1.565334611452e-02
1750.00000  1800.00000  1.532306451492e-02
1800.00000  1850.00000  1.480993471041e-02
1850.00000  1900.00000  1.415129622915e-02
1900.00000  1950.00000  1.396883296783e-02
1950.00000  2000.00000  1.348649865046e-02
2000.00000  2050.00000  1.301070837411e-02
2050.00000  2100.00000  1.280014423077e-02
2100.00000  2150.00000  1.228855420062e-02
2150.00000  2200.00000  1.193671576001e-02
2200.00000  2250.00000  1.157140429379e-02
2250.00000  2300.00000  1.131233725820e-02
2300.00000  2350.00000  1.083808675621e-02
2350.00000  2400.00000  1.042658205927e-02
2400.00000  2450.00000  1.022564150566e-02
2450.00000  2500.00000  9.767943578005e-03
2500.00000  2550.00000  9.380690327189e-03
2550.00000  2600.00000  9.170511127441e-03
2600.00000  2650.00000  8.789032030464e-03
2650.00000  2700.00000  8.630820215269e-03
2700.00000  2750.00000  8.337493200237e-03
2750.00000  2800.00000  8.066492913383e-03
2800.00000  2850.00000  7.743140298387e-03
2850.00000  2900.00000  7.556827601175e-03
2900.00000  2950.00000  7.401310391106e-03
2950.00000  3000.00000  7.116067191448e-03
3000.00000  3050.00000  6.828129386666e-03
3050.00000  3100.00000  6.687240032989e-03
3100.00000  3150.00000  6.531337879331e-03
3150.00000  3200.00000  6.345025182119e-03
3200.00000  3250.00000  6.122527787514e-03
3250.00000  3300.00000  6.011279090212e-03
3300.00000  3350.00000  5.833820095553e-03
3350.00000  3400.00000  5.729115439269e-03
3400.00000  3450.00000  5.573598229200e-03
3450.00000  3500.00000  5.307217265417e-03
3500.00000  3550.00000  5.207131932204e-03
3550.00000  3600.00000  5.133222763062e-03
3600.00000  3650.00000  4.996182845278e-03
3650.00000  3700.00000  4.896482455654e-03
3700.00000  3750.00000  4.739425471228e-03
3750.00000  3800.00000  4.661666866193e-03
3800.00000  3850.00000  4.413763194696e-03
3850.00000  3900.00000  4.422231953660e-03
3900.00000  3950.00000  4.317912240965e-03
3950.00000  4000.00000  4.241308466698e-03
4000.00000  4050.00000  4.049606559236e-03
4050.00000  4100.00000  3.897553841470e-03
4100.00000  4150.00000  3.903712938899e-03
4150.00000  4200.00000  3.693533739151e-03
4200.00000  4250.00000  3.616160077706e-03
4250.00000  4300.00000  3.586134477742e-03
4300.00000  4350.00000  3.527238108582e-03
4350.00000  4400.00000  3.422148508708e-03
4400.00000  4450.00000  3.326682498566e-03
4450.00000  4500.00000  3.258162539674e-03
4500.00000  4550.00000  3.223132673050e-03
4550.00000  4600.00000  3.190412467961e-03
4600.00000  4650.00000  3.108034539855e-03
4650.00000  4700.00000  2.986392365642e-03
4700.00000  4750.00000  2.914022970857e-03
4750.00000  4800.00000  2.901319832411e-03
4800.00000  4850.00000  2.839343914537e-03
4850.00000  4900.00000  2.755041268484e-03
4900.00000  4950.00000  2.661499976289e-03
4950.00000  5000.00000  2.674203114735e-03
5000.00000  5050.00000  2.617231463521e-03
5050.00000  5100.00000  2.569498458451e-03
5100.00000  5150.00000  2.475187279077e-03
5150.00000  5200.00000  2.416290909917e-03
5200.00000  5250.00000  2.399738335578e-03
5250.00000  5300.00000  2.335067812579e-03
5300.00000  5350.00000  2.337762417703e-03
5350.00000  5400.00000  2.293493904936e-03
5400.00000  5450.00000  2.228053494758e-03
5450.00000  5500.00000  2.224973946044e-03
5500.00000  5550.00000  2.137976694867e-03
5550.00000  5600.00000  2.087549084671e-03
5600.00000  5650.00000  2.050594500100e-03
5650.00000  5700.00000  2.054828879582e-03
5700.00000  5750.00000  1.978610048904e-03
5750.00000  5800.00000  1.952048941244e-03
5800.00000  5850.00000  1.970141289940e-03
5850.00000  5900.00000  1.895462233620e-03
5900.00000  5950.00000  1.891612797727e-03
5950.00000  6000.00000  1.833101372156e-03
6000.00000  6050.00000  1.792297351692e-03
6050.00000  6100.00000  1.777669495300e-03
6100.00000  6150.00000  1.711074254354e-03
6150.00000  6200.00000  1.682973372337e-03
6200.00000  6250.00000  1.694521680015e-03
6250.00000  6300.00000  1.643709126230e-03
6300.00000  6350.00000  1.605984654480e-03
6350.00000  6400.00000  1.791527464514e-03
6400.00000  6450.00000  1.588662192963e-03
6450.00000  6500.00000  1.567490295552e-03
6500.00000  6550.00000  1.515137967410e-03
6550.00000  6600.00000  1.503589659732e-03
6600.00000  6650.00000  1.487806972571e-03
6650.00000  6700.00000  1.470869454643e-03
6700.00000  6750.00000  1.457396429018e-03
6750.00000  6800.00000  1.400039834215e-03
6800.00000  6850.00000  1.396575341911e-03
6850.00000  6900.00000  1.344992900948e-03
6900.00000  6950.00000  1.330365044555e-03
6950.00000  7000.00000  1.355001434269e-03
7000.00000  7050.00000  1.283786870252e-03
7050.00000  7100.00000  1.294180347163e-03
7100.00000  7150.00000  1.253761270288e-03
7150.00000  7200.00000  1.230279711342e-03
7200.00000  7250.00000  1.215651854949e-03
7250.00000  7300.00000  1.189860634468e-03
7300.00000  7350.00000  1.184471424218e-03
7350.00000  7400.00000  1.155600655022e-03
7400.00000  7450.00000  1.160989865271e-03
7450.00000  7500.00000  1.141742685807e-03
7500.00000  7550.00000  1.110947198665e-03
7550.00000  7600.00000  1.111717085844e-03
7600.00000  7650.00000  1.065523855130e-03
7650.00000  7700.00000  1.040502521827e-03
7700.00000  7750.00000  1.028954214148e-03
7750.00000  7800.00000  1.015481188523e-03
7800.00000  7850.00000  1.011246809041e-03
7850.00000  7900.00000  9.950791782914e-04
7900.00000  7950.00000  9.931544603450e-04
7950.00000  8000.00000  9.877652500950e-04
8000.00000  8050.00000  9.700578449881e-04
8050.00000  8100.00000  9.419569629706e-04
8100.00000  8150.00000  9.500407783455e-04
8150.00000  8200.00000  9.535052706490e-04
8200.00000  8250.00000  9.419569629706e-04
8250.00000  8300.00000  8.611188092216e-04
8300.00000  8350.00000  9.257893322208e-04
8350.00000  8400.00000  8.657381322930e-04
8400.00000  8450.00000  8.557295989717e-04
8450.00000  8500.00000  8.672779066501e-04
8500.00000  8550.00000  8.769014963821e-04
8550.00000  8600.00000  8.534199374360e-04
8600.00000  8650.00000  7.949085118653e-04
8650.00000  8700.00000  8.199298451685e-04
8700.00000  8750.00000  8.172352400436e-04
8750.00000  8800.00000  7.567990965264e-04
8800.00000  8850.00000  7.402465221874e-04
8850.00000  8900.00000  7.845150349547e-04
8900.00000  8950.00000  7.752763888119e-04
8950.00000  9000.00000  7.337024811696e-04
9000.00000  9050.00000  7.641130247228e-04
9050.00000  9100.00000  7.375519170624e-04
9100.00000  9150.00000  7.340874247589e-04
9150.00000  9200.00000  7.082962042770e-04
9200.00000  9250.00000  7.564141529372e-04
9250.00000  9300.00000  7.240788914376e-04
9300.00000  9350.00000  6.925135171165e-04
9350.00000  9400.00000  6.878941940451e-04
9400.00000  9450.00000  6.674921838132e-04
9450.00000  9500.00000  6.940532914736e-04
9500.00000  9550.00000  6.782706043131e-04
9550.00000  9600.00000  6.594083684383e-04
9600.00000  9650.00000  6.686470145811e-04
9650.00000  9700.00000  6.417009633314e-04
9700.00000  9750.00000  6.228387274566e-04
9750.00000  9800.00000  6.320773735994e-04
9800.00000  9850.00000  6.463202864028e-04
9850.00000  9900.00000  6.147549120817e-04
9900.00000  9950.00000  5.993571685105e-04
9950.00000  10000.00000  5.897335787785e-04
