10001.00000  11001.00000  5.805048440665e-04
11001.00000  12001.00000  4.990755109100e-04
12001.00000  13001.00000  4.372407466813e-04
13001.00000  14001.00000  3.814015524804e-04
14001.00000  15001.00000  3.365752227732e-04
15001.00000  16001.00000  3.023258922104e-04
16001.00000  17001.00000  2.709629588500e-04
17001.00000  18001.00000  2.454890506543e-04
18001.00000  19001.00000  2.238216998430e-04
19001.00000  20001.00000  2.041399578453e-04
20001.00000  21001.00000  1.896982859367e-04
21001.00000  22001.00000  1.726704796218e-04
22001.00000  23001.00000  1.587615320290e-04
23001.00000  24001.00000  1.471675137361e-04
24001.00000  25001.00000  1.373557004273e-04
25001.00000  26001.00000  1.268658743527e-04
26001.00000  27001.00000  1.196498813467e-04
27001.00000  28001.00000  1.110100615328e-04
28001.00000  29001.00000  1.026608186185e-04
29001.00000  30001.00000  9.833122281486e-05
30001.00000  31001.00000  9.260685789331e-05
31001.00000  32001.00000  8.689217886841e-05
32001.00000  33001.00000  8.172959595270e-05
33001.00000  34001.00000  7.696413479973e-05
34001.00000  35001.00000  7.338035303835e-05
35001.00000  36001.00000  6.945756489414e-05
36001.00000  37001.00000  6.524419985036e-05
37001.00000  38001.00000  6.272586672075e-05
38001.00000  39001.00000  5.976198234512e-05
39001.00000  40001.00000  5.612008520383e-05
40001.00000  41001.00000  5.344677772778e-05
41001.00000  42001.00000  5.191640605670e-05
42001.00000  43001.00000  4.866194478151e-05
43001.00000  44001.00000  4.740277821670e-05
44001.00000  45001.00000  4.465198356742e-05
45001.00000  46001.00000  4.365433621223e-05
46001.00000  47001.00000  4.298600934322e-05
47001.00000  48001.00000  4.002212496759e-05
48001.00000  49001.00000  3.807525974047e-05
49001.00000  50001.00000  3.700012521205e-05
50001.00000  51001.00000  3.579907402716e-05
51001.00000  52001.00000  3.460770873892e-05
52001.00000  53001.00000  3.196345895282e-05
53001.00000  54001.00000  3.120795901394e-05
54001.00000  55001.00000  3.062680521479e-05
55001.00000  56001.00000  2.990036296587e-05
56001.00000  57001.00000  2.907706175041e-05
57001.00000  58001.00000  2.719799779985e-05
58001.00000  59001.00000  2.604537609822e-05
59001.00000  60001.00000  2.567731202543e-05
60001.00000  61001.00000  2.500898515642e-05
61001.00000  62001.00000  2.333332503556e-05
62001.00000  63001.00000  2.251002382011e-05
63001.00000  64001.00000  2.154143415487e-05
64001.00000  65001.00000  2.225819050715e-05
65001.00000  66001.00000  2.135740211848e-05
66001.00000  67001.00000  2.002074838045e-05
67001.00000  68001.00000  1.875189591899e-05
68001.00000  69001.00000  1.912964588843e-05
69001.00000  70001.00000  1.829665877633e-05
70001.00000  71001.00000  1.816105622319e-05
71001.00000  72001.00000  1.719246655796e-05
72001.00000  73001.00000  1.632073585924e-05
73001.00000  74001.00000  1.665005634542e-05
74001.00000  75001.00000  1.646602430903e-05
75001.00000  76001.00000  1.613670382285e-05
76001.00000  77001.00000  1.493565263795e-05
77001.00000  78001.00000  1.482910777478e-05
78001.00000  79001.00000  1.335685148362e-05
79001.00000  80001.00000  1.449978728860e-05
80001.00000  81001.00000  1.280475537443e-05
81001.00000  82001.00000  1.334716558697e-05
82001.00000  83001.00000  1.242700540499e-05
83001.00000  84001.00000  1.216548619538e-05
84001.00000  85001.00000  1.240763361169e-05
85001.00000  86001.00000  1.236889002508e-05
86001.00000  87001.00000  1.092569142387e-05
87001.00000  88001.00000  1.096443501048e-05
88001.00000  89001.00000  1.130344139332e-05
89001.00000  90001.00000  1.057699914439e-05
90001.00000  91001.00000  1.057699914439e-05
91001.00000  92001.00000  9.821499205503e-06
92001.00000  93001.00000  1.006364662181e-05
93001.00000  94001.00000  9.017569783356e-06
94001.00000  95001.00000  9.385633856146e-06
95001.00000  96001.00000  9.317832579580e-06
96001.00000  97001.00000  9.075685163270e-06
97001.00000  98001.00000  8.610762123957e-06
98001.00000  99001.00000  8.417044190909e-06
99001.00000  100001.00000  8.242698051167e-06
100001.00000  101001.00000  8.358928810995e-06
101001.00000  102001.00000  7.797146805158e-06
102001.00000  103001.00000  7.613114768763e-06
103001.00000  104001.00000  7.671230148677e-06
104001.00000  105001.00000  7.777775011853e-06
105001.00000  106001.00000  7.709973735286e-06
106001.00000  107001.00000  7.380653249106e-06
107001.00000  108001.00000  6.634839206873e-06
108001.00000  109001.00000  6.266775134083e-06
109001.00000  110001.00000  6.722012276745e-06
110001.00000  111001.00000  6.499236653740e-06
111001.00000  112001.00000  6.809185346616e-06
112001.00000  113001.00000  6.228031547474e-06
113001.00000  114001.00000  6.441121273826e-06
114001.00000  115001.00000  5.995570027817e-06
115001.00000  116001.00000  6.228031547474e-06
116001.00000  117001.00000  5.792166198117e-06
117001.00000  118001.00000  5.501589298546e-06
118001.00000  119001.00000  5.162582915713e-06
119001.00000  120001.00000  5.375672642065e-06
120001.00000  121001.00000  5.443473918632e-06
121001.00000  122001.00000  5.240070088932e-06
122001.00000  123001.00000  5.259441882237e-06
123001.00000  124001.00000  4.978550879318e-06
124001.00000  125001.00000  4.988236775970e-06
125001.00000  126001.00000  4.997922672623e-06
126001.00000  127001.00000  4.600800909876e-06
127001.00000  128001.00000  4.300538113652e-06
128001.00000  129001.00000  4.600800909876e-06
129001.00000  130001.00000  4.474884253395e-06
130001.00000  131001.00000  4.097134283952e-06
131001.00000  132001.00000  4.378025286871e-06
132001.00000  133001.00000  4.387711183523e-06
133001.00000  134001.00000  3.961531730819e-06
134001.00000  135001.00000  4.019647110733e-06
135001.00000  136001.00000  3.922788144210e-06
136001.00000  137001.00000  3.506294588158e-06
137001.00000  138001.00000  3.758127901119e-06
138001.00000  139001.00000  3.612839451334e-06
139001.00000  140001.00000  3.680640727901e-06
140001.00000  141001.00000  3.477236898201e-06
141001.00000  142001.00000  3.835615074338e-06
142001.00000  143001.00000  3.438493311591e-06
143001.00000  144001.00000  3.302890758458e-06
144001.00000  145001.00000  3.477236898201e-06
145001.00000  146001.00000  3.399749724982e-06
146001.00000  147001.00000  3.070429238801e-06
147001.00000  148001.00000  3.293204861806e-06
148001.00000  149001.00000  3.041371548844e-06
149001.00000  150001.00000  3.254461275196e-06
150001.00000  151001.00000  3.031685652192e-06
151001.00000  152001.00000  2.818595925840e-06
152001.00000  153001.00000  2.886397202406e-06
153001.00000  154001.00000  2.905768995711e-06
154001.00000  155001.00000  2.644249786097e-06
155001.00000  156001.00000  2.615192096140e-06
156001.00000  157001.00000  2.586134406183e-06
157001.00000  158001.00000  2.750794649273e-06
158001.00000  159001.00000  2.741108752621e-06
159001.00000  160001.00000  2.373044679831e-06
160001.00000  161001.00000  2.450531853050e-06
161001.00000  162001.00000  2.169640850131e-06
162001.00000  163001.00000  2.227756230045e-06
163001.00000  164001.00000  2.566762612878e-06
164001.00000  165001.00000  2.082467780259e-06
165001.00000  166001.00000  2.237442126697e-06
166001.00000  167001.00000  2.218070333393e-06
167001.00000  168001.00000  2.092153676912e-06
168001.00000  169001.00000  2.179326746783e-06
169001.00000  170001.00000  1.782204984036e-06
170001.00000  171001.00000  1.946865227126e-06
171001.00000  172001.00000  1.811262673993e-06
172001.00000  173001.00000  2.266499816655e-06
173001.00000  174001.00000  2.276185713307e-06
174001.00000  175001.00000  1.675660120860e-06
175001.00000  176001.00000  1.859692157255e-06
176001.00000  177001.00000  1.820948570646e-06
177001.00000  178001.00000  2.043724193650e-06
178001.00000  179001.00000  1.733775500774e-06
179001.00000  180001.00000  1.588487050989e-06
180001.00000  181001.00000  1.598172947641e-06
181001.00000  182001.00000  1.443198601203e-06
182001.00000  183001.00000  1.559429361032e-06
183001.00000  184001.00000  1.540057567727e-06
184001.00000  185001.00000  1.665974224208e-06
185001.00000  186001.00000  1.850006260603e-06
186001.00000  187001.00000  1.607858844293e-06
187001.00000  188001.00000  1.443198601203e-06
188001.00000  189001.00000  1.433512704551e-06
189001.00000  190001.00000  1.598172947641e-06
190001.00000  191001.00000  1.646602430903e-06
191001.00000  192001.00000  1.646602430903e-06
192001.00000  193001.00000  1.540057567727e-06
193001.00000  194001.00000  1.443198601203e-06
194001.00000  195001.00000  1.443198601203e-06
195001.00000  196001.00000  1.297910151418e-06
196001.00000  197001.00000  1.472256291160e-06
197001.00000  198001.00000  1.375397324637e-06
198001.00000  199001.00000  1.278538358113e-06
