10001.00000  11001.00000  3.723374305779e-04
11001.00000  12001.00000  3.010399999858e-04
12001.00000  13001.00000  2.497235254206e-04
13001.00000  14001.00000  2.112409726111e-04
14001.00000  15001.00000  1.771388601614e-04
15001.00000  16001.00000  1.508562180030e-04
16001.00000  17001.00000  1.280894556070e-04
17001.00000  18001.00000  1.143909732539e-04
18001.00000  19001.00000  9.631205054112e-05
19001.00000  20001.00000  8.716692066728e-05
20001.00000  21001.00000  7.738777968873e-05
21001.00000  22001.00000  6.693620269006e-05
22001.00000  23001.00000  6.151828961354e-05
23001.00000  24001.00000  5.483235432762e-05
24001.00000  25001.00000  4.876121768868e-05
25001.00000  26001.00000  4.376597868196e-05
26001.00000  27001.00000  3.921262620276e-05
27001.00000  28001.00000  3.477454846986e-05
28001.00000  29001.00000  3.389077541483e-05
29001.00000  30001.00000  2.904923606985e-05
30001.00000  31001.00000  2.724326504435e-05
31001.00000  32001.00000  2.464958325239e-05
32001.00000  33001.00000  2.315101155038e-05
33001.00000  34001.00000  2.119134086313e-05
34001.00000  35001.00000  1.913560788728e-05
35001.00000  36001.00000  1.692617524970e-05
36001.00000  37001.00000  1.663798838392e-05
37001.00000  38001.00000  1.502414193560e-05
38001.00000  39001.00000  1.408273150741e-05
39001.00000  40001.00000  1.300683387519e-05
40001.00000  41001.00000  1.269943455170e-05
41001.00000  42001.00000  1.133535005371e-05
42001.00000  43001.00000  1.047078945640e-05
43001.00000  44001.00000  9.875203267133e-06
44001.00000  45001.00000  9.087492500688e-06
45001.00000  46001.00000  8.530331226862e-06
46001.00000  47001.00000  7.435221136927e-06
47001.00000  48001.00000  6.916484778536e-06
48001.00000  49001.00000  6.609085455046e-06
49001.00000  50001.00000  6.666722828200e-06
50001.00000  51001.00000  5.590825195984e-06
51001.00000  52001.00000  5.648462569138e-06
52001.00000  53001.00000  5.379488161084e-06
53001.00000  54001.00000  5.283425872493e-06
54001.00000  55001.00000  4.322802986585e-06
55001.00000  56001.00000  4.265165613431e-06
56001.00000  57001.00000  4.438077732894e-06
57001.00000  58001.00000  4.169103324840e-06
58001.00000  59001.00000  3.784854170477e-06
59001.00000  60001.00000  3.650366966450e-06
60001.00000  61001.00000  3.246905354368e-06
61001.00000  62001.00000  2.670531622824e-06
62001.00000  63001.00000  2.766593911415e-06
63001.00000  64001.00000  2.958718488596e-06
64001.00000  65001.00000  2.920293573160e-06
65001.00000  66001.00000  2.497619503360e-06
66001.00000  67001.00000  2.901081115442e-06
67001.00000  68001.00000  2.055732975843e-06
68001.00000  69001.00000  2.113370348997e-06
69001.00000  70001.00000  2.113370348997e-06
70001.00000  71001.00000  1.652271363761e-06
71001.00000  72001.00000  1.556209075171e-06
72001.00000  73001.00000  1.498571702016e-06
73001.00000  74001.00000  1.709908736916e-06
74001.00000  75001.00000  1.940458229534e-06
75001.00000  76001.00000  1.421721871144e-06
76001.00000  77001.00000  1.210384836244e-06
77001.00000  78001.00000  1.344872040271e-06
78001.00000  79001.00000  1.152747463089e-06
79001.00000  80001.00000  1.191172378526e-06
80001.00000  81001.00000  1.325659582553e-06
81001.00000  82001.00000  9.606228859078e-07
82001.00000  83001.00000  9.798353436260e-07
83001.00000  84001.00000  8.645605973170e-07
84001.00000  85001.00000  9.798353436260e-07
85001.00000  86001.00000  9.221979704715e-07
86001.00000  87001.00000  7.877107664444e-07
87001.00000  88001.00000  7.877107664444e-07
88001.00000  89001.00000  7.684983087263e-07
89001.00000  90001.00000  6.724360201355e-07
90001.00000  91001.00000  8.069232241626e-07
91001.00000  92001.00000  7.492858510081e-07
92001.00000  93001.00000  4.995239006721e-07
93001.00000  94001.00000  6.916484778536e-07
94001.00000  95001.00000  4.803114429539e-07
95001.00000  96001.00000  4.995239006721e-07
96001.00000  97001.00000  4.226740697994e-07
97001.00000  98001.00000  5.955861892629e-07
98001.00000  99001.00000  3.842491543631e-07
99001.00000  100001.00000  5.379488161084e-07
100001.00000  101001.00000  5.763737315447e-07
101001.00000  102001.00000  3.842491543631e-07
102001.00000  103001.00000  4.034616120813e-07
103001.00000  104001.00000  4.610989852358e-07
104001.00000  105001.00000  4.034616120813e-07
105001.00000  106001.00000  4.034616120813e-07
106001.00000  107001.00000  1.921245771816e-07
107001.00000  108001.00000  2.689744080542e-07
108001.00000  109001.00000  2.689744080542e-07
109001.00000  110001.00000  2.689744080542e-07
110001.00000  111001.00000  3.842491543631e-07
111001.00000  112001.00000  3.650366966450e-07
112001.00000  113001.00000  3.266117812087e-07
113001.00000  114001.00000  2.113370348997e-07
114001.00000  115001.00000  1.536996617453e-07
115001.00000  116001.00000  2.881868657723e-07
116001.00000  117001.00000  3.650366966450e-07
117001.00000  118001.00000  1.921245771816e-07
118001.00000  119001.00000  2.113370348997e-07
119001.00000  120001.00000  2.113370348997e-07
120001.00000  121001.00000  3.073993234905e-07
121001.00000  122001.00000  1.536996617453e-07
122001.00000  123001.00000  1.729121194634e-07
123001.00000  124001.00000  1.729121194634e-07
124001.00000  125001.00000  1.344872040271e-07
125001.00000  126001.00000  1.729121194634e-07
126001.00000  127001.00000  1.921245771816e-07
127001.00000  128001.00000  1.729121194634e-07
128001.00000  129001.00000  1.152747463089e-07
129001.00000  130001.00000  7.684983087263e-08
130001.00000  131001.00000  9.606228859078e-08
131001.00000  132001.00000  1.152747463089e-07
132001.00000  133001.00000  1.536996617453e-07
133001.00000  134001.00000  7.684983087263e-08
134001.00000  135001.00000  9.606228859078e-08
135001.00000  136001.00000  1.536996617453e-07
136001.00000  137001.00000  3.842491543631e-08
137001.00000  138001.00000  1.344872040271e-07
138001.00000  139001.00000  1.152747463089e-07
139001.00000  140001.00000  7.684983087263e-08
140001.00000  141001.00000  1.536996617453e-07
141001.00000  142001.00000  9.606228859078e-08
142001.00000  143001.00000  1.152747463089e-07
143001.00000  144001.00000  7.684983087263e-08
144001.00000  145001.00000  3.842491543631e-08
145001.00000  146001.00000  5.763737315447e-08
146001.00000  147001.00000  3.842491543631e-08
147001.00000  148001.00000  5.763737315447e-08
148001.00000  149001.00000  3.842491543631e-08
149001.00000  150001.00000  9.606228859078e-08
150001.00000  151001.00000  3.842491543631e-08
151001.00000  152001.00000  3.842491543631e-08
152001.00000  153001.00000  7.684983087263e-08
153001.00000  154001.00000  3.842491543631e-08
154001.00000  155001.00000  9.606228859078e-08
155001.00000  156001.00000  5.763737315447e-08
156001.00000  157001.00000  3.842491543631e-08
157001.00000  158001.00000  1.921245771816e-08
158001.00000  159001.00000  5.763737315447e-08
159001.00000  160001.00000  0.000000000000e+00
160001.00000  161001.00000  7.684983087263e-08
161001.00000  162001.00000  0.000000000000e+00
162001.00000  163001.00000  0.000000000000e+00
163001.00000  164001.00000  3.842491543631e-08
164001.00000  165001.00000  0.000000000000e+00
165001.00000  166001.00000  1.921245771816e-08
166001.00000  167001.00000  1.921245771816e-08
167001.00000  168001.00000  3.842491543631e-08
168001.00000  169001.00000  0.000000000000e+00
169001.00000  170001.00000  5.763737315447e-08
170001.00000  171001.00000  1.921245771816e-08
171001.00000  172001.00000  3.842491543631e-08
172001.00000  173001.00000  0.000000000000e+00
173001.00000  174001.00000  1.921245771816e-08
174001.00000  175001.00000  0.000000000000e+00
175001.00000  176001.00000  1.921245771816e-08
176001.00000  177001.00000  0.000000000000e+00
177001.00000  178001.00000  3.842491543631e-08
178001.00000  179001.00000  1.921245771816e-08
179001.00000  180001.00000  0.000000000000e+00
180001.00000  181001.00000  0.000000000000e+00
181001.00000  182001.00000  1.921245771816e-08
182001.00000  183001.00000  1.921245771816e-08
183001.00000  184001.00000  0.000000000000e+00
184001.00000  185001.00000  0.000000000000e+00
185001.00000  186001.00000  5.763737315447e-08
186001.00000  187001.00000  0.000000000000e+00
187001.00000  188001.00000  0.000000000000e+00
188001.00000  189001.00000  0.000000000000e+00
189001.00000  190001.00000  1.921245771816e-08
190001.00000  191001.00000  0.000000000000e+00
191001.00000  192001.00000  0.000000000000e+00
192001.00000  193001.00000  0.000000000000e+00
193001.00000  194001.00000  0.000000000000e+00
194001.00000  195001.00000  0.000000000000e+00
195001.00000  196001.00000  0.000000000000e+00
196001.00000  197001.00000  1.921245771816e-08
197001.00000  198001.00000  1.921245771816e-08
198001.00000  199001.00000  1.921245771816e-08
