300.00000  350.00000  4.598680907407e-01
350.00000  400.00000  3.443124409536e-01
400.00000  450.00000  2.675847948795e-01
450.00000  500.00000  2.139633907588e-01
500.00000  550.00000  1.754426843574e-01
550.00000  600.00000  1.458023311453e-01
600.00000  650.00000  1.236161840666e-01
650.00000  700.00000  1.059503624720e-01
700.00000  750.00000  9.182295261241e-02
750.00000  800.00000  8.024952485429e-02
800.00000  850.00000  7.088827832816e-02
850.00000  900.00000  6.291184647089e-02
900.00000  950.00000  5.622929803119e-02
950.00000  1000.00000  5.095744192871e-02
1000.00000  1050.00000  4.566294286641e-02
1050.00000  1100.00000  4.146932294524e-02
1100.00000  1150.00000  3.800818480323e-02
1150.00000  1200.00000  3.517781482730e-02
1200.00000  1250.00000  3.200995692661e-02
1250.00000  1300.00000  2.949011897089e-02
1300.00000  1350.00000  2.753419853799e-02
1350.00000  1400.00000  2.546721977842e-02
1400.00000  1450.00000  2.351884699879e-02
1450.00000  1500.00000  2.215523764150e-02
1500.00000  1550.00000  2.065181699269e-02
1550.00000  1600.00000  1.929611470072e-02
1600.00000  1650.00000  1.823045794153e-02
1650.00000  1700.00000  1.708752758934e-02
1700.00000  1750.00000  1.619295097091e-02
1750.00000  1800.00000  1.519845779968e-02
1800.00000  1850.00000  1.446238189991e-02
1850.00000  1900.00000  1.362782709558e-02
1900.00000  1950.00000  1.296938420086e-02
1950.00000  2000.00000  1.228686069809e-02
2000.00000  2050.00000  1.166040547675e-02
2050.00000  2100.00000  1.115219682329e-02
2100.00000  2150.00000  1.054946279794e-02
2150.00000  2200.00000  1.015950071236e-02
2200.00000  2250.00000  9.632962043823e-03
2250.00000  2300.00000  9.283972933139e-03
2300.00000  2350.00000  8.838301978197e-03
2350.00000  2400.00000  8.492188163997e-03
2400.00000  2450.00000  8.059815455292e-03
2450.00000  2500.00000  7.781271108453e-03
2500.00000  2550.00000  7.502367349554e-03
2550.00000  2600.00000  7.142236464997e-03
2600.00000  2650.00000  7.036209907168e-03
2650.00000  2700.00000  6.628636630633e-03
2700.00000  2750.00000  6.507514766266e-03
2750.00000  2800.00000  6.205608635499e-03
2800.00000  2850.00000  6.018354952011e-03
2850.00000  2900.00000  5.749874142865e-03
2900.00000  2950.00000  5.645285233278e-03
2950.00000  3000.00000  5.358833821110e-03
3000.00000  3050.00000  5.153609534601e-03
3050.00000  3100.00000  5.021705308421e-03
3100.00000  3150.00000  4.838405157598e-03
3150.00000  3200.00000  4.735613308313e-03
3200.00000  3250.00000  4.557704338397e-03
3250.00000  3300.00000  4.473961328315e-03
3300.00000  3350.00000  4.325883559415e-03
3350.00000  3400.00000  4.134676343263e-03
3400.00000  3450.00000  4.037635086945e-03
3450.00000  3500.00000  3.989473870847e-03
3500.00000  3550.00000  3.831332564255e-03
3550.00000  3600.00000  3.758012503925e-03
3600.00000  3650.00000  3.614966503872e-03
3650.00000  3700.00000  3.528348197306e-03
3700.00000  3750.00000  3.448918131950e-03
3750.00000  3800.00000  3.349720403269e-03
3800.00000  3850.00000  3.271727986155e-03
3850.00000  3900.00000  3.199126749946e-03
3900.00000  3950.00000  2.993902463437e-03
3950.00000  4000.00000  3.002168940827e-03
4000.00000  4050.00000  2.984557749866e-03
4050.00000  4100.00000  2.896861207119e-03
4100.00000  4150.00000  2.788318764867e-03
4150.00000  4200.00000  2.813118197038e-03
4200.00000  4250.00000  2.697746925637e-03
4250.00000  4300.00000  2.627302161792e-03
4300.00000  4350.00000  2.505461473304e-03
4350.00000  4400.00000  2.529901493413e-03
4400.00000  4450.00000  2.437532593881e-03
4450.00000  4500.00000  2.392246674266e-03
4500.00000  4550.00000  2.334381332536e-03
4550.00000  4600.00000  2.321442498360e-03
4600.00000  4650.00000  2.230151835009e-03
4650.00000  4700.00000  2.172286493279e-03
4700.00000  4750.00000  2.137064111356e-03
4750.00000  4800.00000  2.114061739488e-03
4800.00000  4850.00000  2.073448176659e-03
4850.00000  4900.00000  2.021333427896e-03
4900.00000  4950.00000  1.953763960534e-03
4950.00000  5000.00000  1.930402176605e-03
5000.00000  5050.00000  1.950888664050e-03
5050.00000  5100.00000  1.892663910259e-03
5100.00000  5150.00000  1.813233844903e-03
5150.00000  5200.00000  1.753212030810e-03
5200.00000  5250.00000  1.727334362458e-03
5250.00000  5300.00000  1.737397900151e-03
5300.00000  5350.00000  1.679891970481e-03
5350.00000  5400.00000  1.627058397597e-03
5400.00000  5450.00000  1.641794292075e-03
5450.00000  5500.00000  1.585366598586e-03
5500.00000  5550.00000  1.559129518174e-03
5550.00000  5600.00000  1.545471859878e-03
5600.00000  5650.00000  1.436570005565e-03
5650.00000  5700.00000  1.492278874933e-03
5700.00000  5750.00000  1.445914719137e-03
5750.00000  5800.00000  1.439804714109e-03
5800.00000  5850.00000  1.396315854796e-03
5850.00000  5900.00000  1.413208221637e-03
5900.00000  5950.00000  1.343841693973e-03
5950.00000  6000.00000  1.312932256775e-03
6000.00000  6050.00000  1.343841693973e-03
6050.00000  6100.00000  1.285616940182e-03
6100.00000  6150.00000  1.282022819577e-03
6150.00000  6200.00000  1.269802809523e-03
6200.00000  6250.00000  1.230986306995e-03
6250.00000  6300.00000  1.257582799468e-03
6300.00000  6350.00000  1.177793322051e-03
6350.00000  6400.00000  1.350670523121e-03
6400.00000  6450.00000  1.160182131089e-03
6450.00000  6500.00000  1.129632105952e-03
6500.00000  6550.00000  1.110223854689e-03
6550.00000  6600.00000  1.092253251667e-03
6600.00000  6650.00000  1.044810859689e-03
6650.00000  6700.00000  1.053796161200e-03
6700.00000  6750.00000  1.043732623508e-03
6750.00000  6800.00000  1.048045568233e-03
6800.00000  6850.00000  1.016776718975e-03
6850.00000  6900.00000  1.008869653646e-03
6900.00000  6950.00000  9.998843521347e-04
6950.00000  7000.00000  9.772413923272e-04
7000.00000  7050.00000  9.660996184537e-04
7050.00000  7100.00000  9.531607842780e-04
7100.00000  7150.00000  9.226107591408e-04
7150.00000  7200.00000  9.254860556243e-04
7200.00000  7250.00000  9.147036938112e-04
7250.00000  7300.00000  8.625889450479e-04
7300.00000  7350.00000  8.884666133994e-04
7350.00000  7400.00000  8.571977641414e-04
7400.00000  7450.00000  8.672613018336e-04
7450.00000  7500.00000  8.561195279601e-04
7500.00000  7550.00000  8.180218495538e-04
7550.00000  7600.00000  8.043641912572e-04
7600.00000  7650.00000  8.241318545812e-04
7650.00000  7700.00000  8.410242214217e-04
7700.00000  7750.00000  8.191000857351e-04
7750.00000  7800.00000  7.885500605980e-04
7800.00000  7850.00000  7.666259249113e-04
7850.00000  7900.00000  7.695012213948e-04
7900.00000  7950.00000  7.626723922465e-04
7950.00000  8000.00000  7.393106083182e-04
8000.00000  8050.00000  7.558435630982e-04
8050.00000  8100.00000  7.130735279063e-04
8100.00000  8150.00000  7.213400052963e-04
8150.00000  8200.00000  6.972593972471e-04
8200.00000  8250.00000  7.152300002689e-04
8250.00000  8300.00000  7.022911660932e-04
8300.00000  8350.00000  6.933058645823e-04
8350.00000  8400.00000  6.828829148296e-04
8400.00000  8450.00000  6.537705379342e-04
8450.00000  8500.00000  6.408317037585e-04
8500.00000  8550.00000  6.584428947199e-04
8550.00000  8600.00000  6.455040605442e-04
8600.00000  8650.00000  6.577240705990e-04
8650.00000  8700.00000  6.322058143080e-04
8700.00000  8750.00000  6.365187590333e-04
8750.00000  8800.00000  6.153134474675e-04
8800.00000  8850.00000  5.872793067535e-04
8850.00000  8900.00000  5.725434122756e-04
8900.00000  8950.00000  6.092034424401e-04
8950.00000  9000.00000  5.844040102700e-04
9000.00000  9050.00000  5.890763670556e-04
9050.00000  9100.00000  5.761375328799e-04
9100.00000  9150.00000  5.570886936768e-04
9150.00000  9200.00000  5.427122112593e-04
9200.00000  9250.00000  5.671522313690e-04
9250.00000  9300.00000  5.315704373858e-04
9300.00000  9350.00000  5.103651258200e-04
9350.00000  9400.00000  5.635581107646e-04
9400.00000  9450.00000  5.509786886494e-04
9450.00000  9500.00000  5.157563067266e-04
9500.00000  9550.00000  5.218663117540e-04
9550.00000  9600.00000  5.042551207926e-04
9600.00000  9650.00000  5.319298494462e-04
9650.00000  9700.00000  5.189910152705e-04
9700.00000  9750.00000  4.560939046941e-04
9750.00000  9800.00000  5.118027740618e-04
9800.00000  9850.00000  4.571721408754e-04
9850.00000  9900.00000  4.880815780730e-04
9900.00000  9950.00000  4.769398041994e-04
9950.00000  10000.00000  4.636415579633e-04
