300.00000  350.00000  2.022352469057e-05
350.00000  400.00000  4.225272122851e-05
400.00000  450.00000  2.275146527689e-05
450.00000  500.00000  2.852961518848e-05
500.00000  550.00000  2.105413374036e-04
550.00000  600.00000  2.816848081900e-05
600.00000  650.00000  7.042120204751e-05
650.00000  700.00000  2.094579342952e-05
700.00000  750.00000  4.766973677062e-05
750.00000  800.00000  3.972478064219e-05
800.00000  850.00000  1.166464013402e-04
850.00000  900.00000  3.358549636112e-05
900.00000  950.00000  2.889074955795e-05
950.00000  1000.00000  3.755797442534e-05
1000.00000  1050.00000  3.864137753376e-05
1050.00000  1100.00000  2.419600275479e-05
1100.00000  1150.00000  3.539116820849e-05
1150.00000  1200.00000  3.647457131692e-05
1200.00000  1250.00000  3.575230257797e-05
1250.00000  1300.00000  1.112293857981e-04
1300.00000  1350.00000  5.200334920432e-05
1350.00000  1400.00000  6.825439583066e-05
1400.00000  1450.00000  1.007564890834e-04
1450.00000  1500.00000  1.552877788740e-04
1500.00000  1550.00000  2.011518437972e-04
1550.00000  1600.00000  2.852961518848e-04
1600.00000  1650.00000  3.856915065987e-04
1650.00000  1700.00000  5.055881172642e-04
1700.00000  1750.00000  7.392420543141e-04
1750.00000  1800.00000  7.926899409963e-04
1800.00000  1850.00000  8.963355050355e-04
1850.00000  1900.00000  9.223371796377e-04
1900.00000  1950.00000  1.131433979563e-03
1950.00000  2000.00000  1.351364810573e-03
2000.00000  2050.00000  1.519653426748e-03
2050.00000  2100.00000  1.732722704738e-03
2100.00000  2150.00000  1.935319086013e-03
2150.00000  2200.00000  2.133220720485e-03
2200.00000  2250.00000  2.257089809215e-03
2250.00000  2300.00000  2.546719573534e-03
2300.00000  2350.00000  2.821903963073e-03
2350.00000  2400.00000  2.841405219025e-03
2400.00000  2450.00000  3.020527866284e-03
2450.00000  2500.00000  2.998137535377e-03
2500.00000  2550.00000  2.984414429337e-03
2550.00000  2600.00000  3.111894861761e-03
2600.00000  2650.00000  3.159564598532e-03
2650.00000  2700.00000  3.257793147029e-03
2700.00000  2750.00000  3.412719791533e-03
2750.00000  2800.00000  3.513115146247e-03
2800.00000  2850.00000  3.590036766945e-03
2850.00000  2900.00000  3.647095997322e-03
2900.00000  2950.00000  3.753991770687e-03
2950.00000  3000.00000  3.731601439779e-03
3000.00000  3050.00000  3.805633985521e-03
3050.00000  3100.00000  3.830552257015e-03
3100.00000  3150.00000  3.844636497425e-03
3150.00000  3200.00000  3.846803303641e-03
3200.00000  3250.00000  3.772048489160e-03
3250.00000  3300.00000  3.838497213144e-03
3300.00000  3350.00000  3.815745747867e-03
3350.00000  3400.00000  3.818995957192e-03
3400.00000  3450.00000  3.780715714028e-03
3450.00000  3500.00000  3.859804140943e-03
3500.00000  3550.00000  3.769881682943e-03
3550.00000  3600.00000  3.812856672911e-03
3600.00000  3650.00000  3.747130217667e-03
3650.00000  3700.00000  3.752186098839e-03
3700.00000  3750.00000  3.715350393153e-03
3750.00000  3800.00000  3.667680656382e-03
3800.00000  3850.00000  3.672014268816e-03
3850.00000  3900.00000  3.631928353804e-03
3900.00000  3950.00000  3.590036766945e-03
3950.00000  4000.00000  3.626872472632e-03
4000.00000  4050.00000  3.521782371114e-03
4050.00000  4100.00000  3.488919143492e-03
4100.00000  4150.00000  3.496864099621e-03
4150.00000  4200.00000  3.375884085847e-03
4200.00000  4250.00000  3.382745638867e-03
4250.00000  4300.00000  3.255265206442e-03
4300.00000  4350.00000  3.307268555647e-03
4350.00000  4400.00000  3.182677198178e-03
4400.00000  4450.00000  3.220957441342e-03
4450.00000  4500.00000  3.120562086628e-03
4500.00000  4550.00000  3.147286029970e-03
4550.00000  4600.00000  3.067114199946e-03
4600.00000  4650.00000  2.999582072854e-03
4650.00000  4700.00000  3.011138372678e-03
4700.00000  4750.00000  2.966357710863e-03
4750.00000  4800.00000  2.937466961305e-03
4800.00000  4850.00000  2.870295968583e-03
4850.00000  4900.00000  2.803124975860e-03
4900.00000  4950.00000  2.863434415563e-03
4950.00000  5000.00000  2.792652079146e-03
5000.00000  5050.00000  2.721869742729e-03
5050.00000  5100.00000  2.672033199741e-03
5100.00000  5150.00000  2.621835522384e-03
5150.00000  5200.00000  2.667338452938e-03
5200.00000  5250.00000  2.629419344143e-03
5250.00000  5300.00000  2.595111579043e-03
5300.00000  5350.00000  2.552136589076e-03
5350.00000  5400.00000  2.549608648489e-03
5400.00000  5450.00000  2.473048162161e-03
5450.00000  5500.00000  2.389987257182e-03
5500.00000  5550.00000  2.421405947326e-03
5550.00000  5600.00000  2.343400923519e-03
5600.00000  5650.00000  2.310176561528e-03
5650.00000  5700.00000  2.266118168452e-03
5700.00000  5750.00000  2.226754522179e-03
5750.00000  5800.00000  2.222782044115e-03
5800.00000  5850.00000  2.180890457256e-03
5850.00000  5900.00000  2.142249079722e-03
5900.00000  5950.00000  2.130331645530e-03
5950.00000  6000.00000  2.086273252454e-03
6000.00000  6050.00000  2.081217371281e-03
6050.00000  6100.00000  2.066771996502e-03
6100.00000  6150.00000  2.027769484599e-03
6150.00000  6200.00000  1.966015507419e-03
6200.00000  6250.00000  1.984072225892e-03
6250.00000  6300.00000  1.927374129885e-03
6300.00000  6350.00000  1.872842840094e-03
6350.00000  6400.00000  2.318482652026e-03
6400.00000  6450.00000  1.859480868424e-03
6450.00000  6500.00000  1.853341584143e-03
6500.00000  6550.00000  1.827701043910e-03
6550.00000  6600.00000  1.830951253235e-03
6600.00000  6650.00000  1.782198113356e-03
6650.00000  6700.00000  1.710332373831e-03
6700.00000  6750.00000  1.707804433245e-03
6750.00000  6800.00000  1.698414939638e-03
6800.00000  6850.00000  1.688664311662e-03
6850.00000  6900.00000  1.672052130667e-03
6900.00000  6950.00000  1.632327350024e-03
6950.00000  7000.00000  1.595852778707e-03
7000.00000  7050.00000  1.538071279592e-03
7050.00000  7100.00000  1.667718518233e-03
7100.00000  7150.00000  1.413118787753e-03
7150.00000  7200.00000  1.377366485175e-03
7200.00000  7250.00000  1.362559976027e-03
7250.00000  7300.00000  1.423591684468e-03
7300.00000  7350.00000  1.338002838903e-03
7350.00000  7400.00000  1.351725944943e-03
7400.00000  7450.00000  1.325724270341e-03
7450.00000  7500.00000  1.360032035441e-03
7500.00000  7550.00000  1.332946957730e-03
7550.00000  7600.00000  1.367254722830e-03
7600.00000  7650.00000  1.256025337032e-03
7650.00000  7700.00000  1.251330590229e-03
7700.00000  7750.00000  1.284193817851e-03
7750.00000  7800.00000  1.233273871755e-03
7800.00000  7850.00000  1.280221339787e-03
7850.00000  7900.00000  1.236885215450e-03
7900.00000  7950.00000  1.159963594752e-03
7950.00000  8000.00000  1.175492372639e-03
8000.00000  8050.00000  1.192465688005e-03
8050.00000  8100.00000  1.159963594752e-03
8100.00000  8150.00000  1.180187119442e-03
8150.00000  8200.00000  1.138295532583e-03
8200.00000  8250.00000  1.127100367130e-03
8250.00000  8300.00000  1.131072845194e-03
8300.00000  8350.00000  1.086292183379e-03
8350.00000  8400.00000  1.096765080094e-03
8400.00000  8450.00000  1.096765080094e-03
8450.00000  8500.00000  1.061735046255e-03
8500.00000  8550.00000  1.059207105668e-03
8550.00000  8600.00000  1.075819286664e-03
8600.00000  8650.00000  1.042956059042e-03
8650.00000  8700.00000  1.019843459396e-03
8700.00000  8750.00000  1.014065309484e-03
8750.00000  8800.00000  9.667567070830e-04
8800.00000  8850.00000  9.934806504241e-04
8850.00000  8900.00000  1.015148712593e-03
8900.00000  8950.00000  9.541170041514e-04
8950.00000  9000.00000  9.458109136535e-04
9000.00000  9050.00000  9.432829730672e-04
9050.00000  9100.00000  9.324489419829e-04
9100.00000  9150.00000  9.403938981114e-04
9150.00000  9200.00000  9.342546138303e-04
9200.00000  9250.00000  9.288375982882e-04
9250.00000  9300.00000  9.060861330113e-04
9300.00000  9350.00000  8.811678615176e-04
9350.00000  9400.00000  9.024747893166e-04
9400.00000  9450.00000  9.226983140071e-04
9450.00000  9500.00000  8.815289958870e-04
9500.00000  9550.00000  8.652779492607e-04
9550.00000  9600.00000  8.631111430439e-04
9600.00000  9650.00000  8.381928715501e-04
9650.00000  9700.00000  8.111077938395e-04
9700.00000  9750.00000  8.194138843374e-04
9750.00000  9800.00000  8.093021219922e-04
9800.00000  9850.00000  7.991903596469e-04
9850.00000  9900.00000  8.038851064500e-04
9900.00000  9950.00000  7.890785973016e-04
9950.00000  10000.00000  7.887174629321e-04
