300.00000  350.00000  1.746578898820e-05
350.00000  400.00000  2.530757179923e-05
400.00000  450.00000  1.960445702757e-05
450.00000  500.00000  1.639645496851e-05
500.00000  550.00000  1.343796418072e-04
550.00000  600.00000  1.604001029528e-05
600.00000  650.00000  3.849602470868e-05
650.00000  700.00000  1.889156768111e-05
700.00000  750.00000  3.635735666931e-05
750.00000  800.00000  2.388179310631e-05
800.00000  850.00000  9.338850438588e-05
850.00000  900.00000  3.920891405514e-05
900.00000  950.00000  4.312980546065e-05
950.00000  1000.00000  6.701159856697e-05
1000.00000  1050.00000  1.186960761851e-04
1050.00000  1100.00000  1.732321111891e-04
1100.00000  1150.00000  2.598481667836e-04
1150.00000  1200.00000  3.667815687522e-04
1200.00000  1250.00000  4.658731879097e-04
1250.00000  1300.00000  6.562146434138e-04
1300.00000  1350.00000  6.191443973980e-04
1350.00000  1400.00000  7.606529326697e-04
1400.00000  1450.00000  9.185579229100e-04
1450.00000  1500.00000  1.010164203930e-03
1500.00000  1550.00000  1.126365167402e-03
1550.00000  1600.00000  1.212268333650e-03
1600.00000  1650.00000  1.287121715028e-03
1650.00000  1700.00000  1.353063979576e-03
1700.00000  1750.00000  1.505978744391e-03
1750.00000  1800.00000  1.435402699091e-03
1800.00000  1850.00000  1.378371551375e-03
1850.00000  1900.00000  1.326687073757e-03
1900.00000  1950.00000  1.367321766505e-03
1950.00000  2000.00000  1.373024881276e-03
2000.00000  2050.00000  1.432194697032e-03
2050.00000  2100.00000  1.342727084052e-03
2100.00000  2150.00000  1.369103989871e-03
2150.00000  2200.00000  1.312429286828e-03
2200.00000  2250.00000  1.295676387186e-03
2250.00000  2300.00000  1.304587504016e-03
2300.00000  2350.00000  1.410095127292e-03
2350.00000  2400.00000  1.211911888977e-03
2400.00000  2450.00000  1.162366079398e-03
2450.00000  2500.00000  1.145613179757e-03
2500.00000  2550.00000  1.016580208048e-03
2550.00000  2600.00000  1.019788210107e-03
2600.00000  2650.00000  1.001253087099e-03
2650.00000  2700.00000  9.463606074218e-04
2700.00000  2750.00000  8.800618982013e-04
2750.00000  2800.00000  8.982405765359e-04
2800.00000  2850.00000  8.390707607800e-04
2850.00000  2900.00000  8.208920824453e-04
2900.00000  2950.00000  8.052085168233e-04
2950.00000  3000.00000  7.873862831619e-04
3000.00000  3050.00000  7.139586804768e-04
3050.00000  3100.00000  6.886511086776e-04
3100.00000  3150.00000  6.530066413547e-04
3150.00000  3200.00000  6.626306475319e-04
3200.00000  3250.00000  6.173621740318e-04
3250.00000  3300.00000  6.127283932799e-04
3300.00000  3350.00000  5.820741513822e-04
3350.00000  3400.00000  5.567665795830e-04
3400.00000  3450.00000  5.314590077838e-04
3450.00000  3500.00000  5.000918765396e-04
3500.00000  3550.00000  4.933194277483e-04
3550.00000  3600.00000  4.787051961459e-04
3600.00000  3650.00000  4.473380649018e-04
3650.00000  3700.00000  4.680118559491e-04
3700.00000  3750.00000  4.284464972207e-04
3750.00000  3800.00000  4.109807082325e-04
3800.00000  3850.00000  3.731975728703e-04
3850.00000  3900.00000  3.810393556813e-04
3900.00000  3950.00000  3.546624498624e-04
3950.00000  4000.00000  3.514544478033e-04
4000.00000  4050.00000  3.289984333899e-04
4050.00000  4100.00000  3.350579928348e-04
4100.00000  4150.00000  3.307806567561e-04
4150.00000  4200.00000  3.072553083230e-04
4200.00000  4250.00000  2.937104107403e-04
4250.00000  4300.00000  2.979877468191e-04
4300.00000  4350.00000  2.594917221104e-04
4350.00000  4400.00000  2.502241606064e-04
4400.00000  4450.00000  2.455903798545e-04
4450.00000  4500.00000  2.459468245277e-04
4500.00000  4550.00000  2.448774905080e-04
4550.00000  4600.00000  2.348970396576e-04
4600.00000  4650.00000  2.224214760946e-04
4650.00000  4700.00000  2.063814657993e-04
4700.00000  4750.00000  2.099459125316e-04
4750.00000  4800.00000  2.013912403741e-04
4800.00000  4850.00000  1.864205640985e-04
4850.00000  4900.00000  1.885592321379e-04
4900.00000  4950.00000  1.796481153072e-04
4950.00000  5000.00000  1.636081050119e-04
5000.00000  5050.00000  1.750143345552e-04
5050.00000  5100.00000  1.646774390316e-04
5100.00000  5150.00000  1.550534328544e-04
5150.00000  5200.00000  1.497067627560e-04
5200.00000  5250.00000  1.497067627560e-04
5250.00000  5300.00000  1.432907586379e-04
5300.00000  5350.00000  1.532712094883e-04
5350.00000  5400.00000  1.400827565788e-04
5400.00000  5450.00000  1.443600926576e-04
5450.00000  5500.00000  1.265378589961e-04
5500.00000  5550.00000  1.162009634725e-04
5550.00000  5600.00000  1.144187401064e-04
5600.00000  5650.00000  1.226169675906e-04
5650.00000  5700.00000  1.183396315119e-04
5700.00000  5750.00000  1.069334019686e-04
5750.00000  5800.00000  1.115671827205e-04
5800.00000  5850.00000  1.076462913150e-04
5850.00000  5900.00000  1.144187401064e-04
5900.00000  5950.00000  9.624006177171e-05
5950.00000  6000.00000  9.196272569296e-05
6000.00000  6050.00000  1.019431765434e-04
6050.00000  6100.00000  8.804183428745e-05
6100.00000  6150.00000  8.697250026777e-05
6150.00000  6200.00000  8.162583016934e-05
6200.00000  6250.00000  8.732894494099e-05
6250.00000  6300.00000  8.768538961422e-05
6300.00000  6350.00000  8.126938549611e-05
6350.00000  6400.00000  3.863860257797e-04
6400.00000  6450.00000  7.663560474414e-05
6450.00000  6500.00000  7.271471333862e-05
6500.00000  6550.00000  7.307115801185e-05
6550.00000  6600.00000  7.592271539768e-05
6600.00000  6650.00000  6.594226454728e-05
6650.00000  6700.00000  7.093248997248e-05
6700.00000  6750.00000  7.021960062602e-05
6750.00000  6800.00000  6.487293052760e-05
6800.00000  6850.00000  5.738759238980e-05
6850.00000  6900.00000  6.344715183468e-05
6900.00000  6950.00000  6.416004118114e-05
6950.00000  7000.00000  5.667470304334e-05
7000.00000  7050.00000  5.916981575594e-05
7050.00000  7100.00000  9.160628101974e-05
7100.00000  7150.00000  5.417959033074e-05
7150.00000  7200.00000  4.740714153940e-05
7200.00000  7250.00000  4.740714153940e-05
7250.00000  7300.00000  5.417959033074e-05
7300.00000  7350.00000  5.738759238980e-05
7350.00000  7400.00000  5.346670098428e-05
7400.00000  7450.00000  4.598136284648e-05
7450.00000  7500.00000  5.453603500397e-05
7500.00000  7550.00000  4.562491817325e-05
7550.00000  7600.00000  4.241691611420e-05
7600.00000  7650.00000  3.778313536223e-05
7650.00000  7700.00000  5.453603500397e-05
7700.00000  7750.00000  4.063469274805e-05
7750.00000  7800.00000  4.312980546065e-05
7800.00000  7850.00000  4.099113742128e-05
7850.00000  7900.00000  3.671380134254e-05
7900.00000  7950.00000  3.849602470868e-05
7950.00000  8000.00000  4.206047144097e-05
8000.00000  8050.00000  3.778313536223e-05
8050.00000  8100.00000  3.101068657088e-05
8100.00000  8150.00000  3.742669068900e-05
8150.00000  8200.00000  3.992180340160e-05
8200.00000  8250.00000  3.778313536223e-05
8250.00000  8300.00000  3.493157797640e-05
8300.00000  8350.00000  3.849602470868e-05
8350.00000  8400.00000  3.421868862994e-05
8400.00000  8450.00000  3.600091199608e-05
8450.00000  8500.00000  3.065424189765e-05
8500.00000  8550.00000  2.352534843308e-05
8550.00000  8600.00000  3.813958003545e-05
8600.00000  8650.00000  3.101068657088e-05
8650.00000  8700.00000  2.994135255120e-05
8700.00000  8750.00000  2.602046114568e-05
8750.00000  8800.00000  2.994135255120e-05
8800.00000  8850.00000  2.530757179923e-05
8850.00000  8900.00000  2.744623983860e-05
8900.00000  8950.00000  3.172357591734e-05
8950.00000  9000.00000  2.245601441340e-05
9000.00000  9050.00000  3.314935461025e-05
9050.00000  9100.00000  2.637690581891e-05
9100.00000  9150.00000  2.602046114568e-05
9150.00000  9200.00000  2.673335049214e-05
9200.00000  9250.00000  2.708979516537e-05
9250.00000  9300.00000  2.780268451183e-05
9300.00000  9350.00000  2.459468245277e-05
9350.00000  9400.00000  2.352534843308e-05
9400.00000  9450.00000  2.352534843308e-05
9450.00000  9500.00000  2.031734637403e-05
9500.00000  9550.00000  2.602046114568e-05
9550.00000  9600.00000  2.637690581891e-05
9600.00000  9650.00000  2.316890375986e-05
9650.00000  9700.00000  2.138668039371e-05
9700.00000  9750.00000  2.673335049214e-05
9750.00000  9800.00000  2.744623983860e-05
9800.00000  9850.00000  2.388179310631e-05
9850.00000  9900.00000  1.853512300788e-05
9900.00000  9950.00000  2.103023572048e-05
9950.00000  10000.00000  2.566401647246e-05
