10001.00000  11001.00000  1.457080810744e-04
11001.00000  12001.00000  1.292101256832e-04
12001.00000  13001.00000  1.108870168756e-04
13001.00000  14001.00000  9.329754816677e-05
14001.00000  15001.00000  8.370654590030e-05
15001.00000  16001.00000  7.155675011870e-05
16001.00000  17001.00000  6.268149429003e-05
17001.00000  18001.00000  5.819018539285e-05
18001.00000  19001.00000  4.990542037536e-05
19001.00000  20001.00000  4.235429545661e-05
20001.00000  21001.00000  4.018916248227e-05
21001.00000  22001.00000  3.600204582116e-05
22001.00000  23001.00000  3.204754675234e-05
23001.00000  24001.00000  2.821830331013e-05
24001.00000  25001.00000  2.753834419422e-05
25001.00000  26001.00000  2.394171834429e-05
26001.00000  27001.00000  2.268916207815e-05
27001.00000  28001.00000  2.009458124114e-05
28001.00000  29001.00000  1.726738281184e-05
29001.00000  30001.00000  1.631901878176e-05
30001.00000  31001.00000  1.547801671735e-05
31001.00000  32001.00000  1.426124777309e-05
32001.00000  33001.00000  1.401073651987e-05
33001.00000  34001.00000  1.256134998333e-05
34001.00000  35001.00000  1.182770988459e-05
35001.00000  36001.00000  1.105828246396e-05
36001.00000  37001.00000  9.626789588363e-06
37001.00000  38001.00000  9.465746639858e-06
38001.00000  39001.00000  8.588957253558e-06
39001.00000  40001.00000  8.195296712770e-06
40001.00000  41001.00000  7.676380545367e-06
41001.00000  42001.00000  7.801636171982e-06
42001.00000  43001.00000  6.692229193397e-06
43001.00000  44001.00000  7.050102412295e-06
44001.00000  45001.00000  6.799591159067e-06
45001.00000  46001.00000  5.976482755601e-06
46001.00000  47001.00000  5.618609536702e-06
47001.00000  48001.00000  4.938650420796e-06
48001.00000  49001.00000  5.618609536702e-06
49001.00000  50001.00000  5.224948995914e-06
50001.00000  51001.00000  4.348159609614e-06
51001.00000  52001.00000  4.634458184732e-06
52001.00000  53001.00000  3.936605407881e-06
53001.00000  54001.00000  3.811349781266e-06
54001.00000  55001.00000  3.918711746936e-06
55001.00000  56001.00000  3.686094154652e-06
56001.00000  57001.00000  3.453476562368e-06
57001.00000  58001.00000  3.274539952919e-06
58001.00000  59001.00000  2.970347716855e-06
59001.00000  60001.00000  2.773517446461e-06
60001.00000  61001.00000  2.773517446461e-06
61001.00000  62001.00000  2.773517446461e-06
62001.00000  63001.00000  2.773517446461e-06
63001.00000  64001.00000  2.719836463627e-06
64001.00000  65001.00000  2.290388600949e-06
65001.00000  66001.00000  2.540899854177e-06
66001.00000  67001.00000  2.200920296224e-06
67001.00000  68001.00000  1.753578772601e-06
68001.00000  69001.00000  2.075664669610e-06
69001.00000  70001.00000  2.004090025830e-06
70001.00000  71001.00000  1.753578772601e-06
71001.00000  72001.00000  1.950409042995e-06
72001.00000  73001.00000  1.860940738271e-06
73001.00000  74001.00000  2.111451991500e-06
74001.00000  75001.00000  1.664110467877e-06
75001.00000  76001.00000  1.377811892758e-06
76001.00000  77001.00000  1.628323145987e-06
77001.00000  78001.00000  1.771472433546e-06
78001.00000  79001.00000  1.270449927089e-06
79001.00000  80001.00000  1.520961180318e-06
80001.00000  81001.00000  1.449386536538e-06
81001.00000  82001.00000  1.055725995750e-06
82001.00000  83001.00000  1.288343588034e-06
83001.00000  84001.00000  1.127300639529e-06
84001.00000  85001.00000  1.127300639529e-06
85001.00000  86001.00000  1.198875283309e-06
86001.00000  87001.00000  1.073619656695e-06
87001.00000  88001.00000  6.799591159067e-07
88001.00000  89001.00000  1.019938673860e-06
89001.00000  90001.00000  1.037832334805e-06
90001.00000  91001.00000  8.946830472456e-07
91001.00000  92001.00000  9.483640300803e-07
92001.00000  93001.00000  8.946830472456e-07
93001.00000  94001.00000  9.483640300803e-07
94001.00000  95001.00000  7.336400987414e-07
95001.00000  96001.00000  9.125767081905e-07
96001.00000  97001.00000  8.231084034659e-07
97001.00000  98001.00000  6.083844721270e-07
98001.00000  99001.00000  5.904908111821e-07
99001.00000  100001.00000  6.799591159067e-07
100001.00000  101001.00000  6.083844721270e-07
101001.00000  102001.00000  5.010225064575e-07
102001.00000  103001.00000  7.157464377965e-07
103001.00000  104001.00000  7.515337596863e-07
104001.00000  105001.00000  7.515337596863e-07
105001.00000  106001.00000  5.725971502372e-07
106001.00000  107001.00000  5.904908111821e-07
107001.00000  108001.00000  5.368098283474e-07
108001.00000  109001.00000  5.189161674024e-07
109001.00000  110001.00000  6.978527768516e-07
110001.00000  111001.00000  6.262781330719e-07
111001.00000  112001.00000  5.010225064575e-07
112001.00000  113001.00000  4.115542017330e-07
113001.00000  114001.00000  4.473415236228e-07
114001.00000  115001.00000  4.473415236228e-07
115001.00000  116001.00000  4.294478626779e-07
116001.00000  117001.00000  4.115542017330e-07
117001.00000  118001.00000  5.368098283474e-07
118001.00000  119001.00000  4.115542017330e-07
119001.00000  120001.00000  2.684049141737e-07
120001.00000  121001.00000  2.505112532288e-07
121001.00000  122001.00000  4.652351845677e-07
122001.00000  123001.00000  3.578732188982e-07
123001.00000  124001.00000  4.294478626779e-07
124001.00000  125001.00000  4.115542017330e-07
125001.00000  126001.00000  3.399795579533e-07
126001.00000  127001.00000  2.326175922839e-07
127001.00000  128001.00000  3.936605407881e-07
128001.00000  129001.00000  3.936605407881e-07
129001.00000  130001.00000  3.936605407881e-07
130001.00000  131001.00000  3.936605407881e-07
131001.00000  132001.00000  2.326175922839e-07
132001.00000  133001.00000  3.220858970084e-07
133001.00000  134001.00000  2.505112532288e-07
134001.00000  135001.00000  2.862985751186e-07
135001.00000  136001.00000  1.968302703940e-07
136001.00000  137001.00000  3.041922360635e-07
137001.00000  138001.00000  2.505112532288e-07
138001.00000  139001.00000  1.252556266144e-07
139001.00000  140001.00000  2.505112532288e-07
140001.00000  141001.00000  7.157464377965e-08
141001.00000  142001.00000  8.946830472456e-08
142001.00000  143001.00000  1.610429485042e-07
143001.00000  144001.00000  1.789366094491e-07
144001.00000  145001.00000  2.326175922839e-07
145001.00000  146001.00000  1.968302703940e-07
146001.00000  147001.00000  1.610429485042e-07
147001.00000  148001.00000  2.326175922839e-07
148001.00000  149001.00000  1.431492875593e-07
149001.00000  150001.00000  1.789366094491e-07
150001.00000  151001.00000  1.610429485042e-07
151001.00000  152001.00000  1.252556266144e-07
152001.00000  153001.00000  1.789366094491e-07
153001.00000  154001.00000  1.431492875593e-07
154001.00000  155001.00000  1.789366094491e-07
155001.00000  156001.00000  7.157464377965e-08
156001.00000  157001.00000  1.252556266144e-07
157001.00000  158001.00000  1.431492875593e-07
158001.00000  159001.00000  1.073619656695e-07
159001.00000  160001.00000  1.968302703940e-07
160001.00000  161001.00000  1.968302703940e-07
161001.00000  162001.00000  1.073619656695e-07
162001.00000  163001.00000  8.946830472456e-08
163001.00000  164001.00000  1.789366094491e-07
164001.00000  165001.00000  1.610429485042e-07
165001.00000  166001.00000  1.610429485042e-07
166001.00000  167001.00000  5.368098283474e-08
167001.00000  168001.00000  1.252556266144e-07
168001.00000  169001.00000  7.157464377965e-08
169001.00000  170001.00000  8.946830472456e-08
170001.00000  171001.00000  1.431492875593e-07
171001.00000  172001.00000  1.073619656695e-07
172001.00000  173001.00000  3.578732188982e-08
173001.00000  174001.00000  1.073619656695e-07
174001.00000  175001.00000  1.252556266144e-07
175001.00000  176001.00000  5.368098283474e-08
176001.00000  177001.00000  5.368098283474e-08
177001.00000  178001.00000  3.578732188982e-08
178001.00000  179001.00000  7.157464377965e-08
179001.00000  180001.00000  7.157464377965e-08
180001.00000  181001.00000  3.578732188982e-08
181001.00000  182001.00000  7.157464377965e-08
182001.00000  183001.00000  5.368098283474e-08
183001.00000  184001.00000  7.157464377965e-08
184001.00000  185001.00000  3.578732188982e-08
185001.00000  186001.00000  3.578732188982e-08
186001.00000  187001.00000  7.157464377965e-08
187001.00000  188001.00000  0.000000000000e+00
188001.00000  189001.00000  1.789366094491e-08
189001.00000  190001.00000  8.946830472456e-08
190001.00000  191001.00000  1.073619656695e-07
191001.00000  192001.00000  3.578732188982e-08
192001.00000  193001.00000  0.000000000000e+00
193001.00000  194001.00000  0.000000000000e+00
194001.00000  195001.00000  1.789366094491e-08
195001.00000  196001.00000  0.000000000000e+00
196001.00000  197001.00000  1.789366094491e-08
197001.00000  198001.00000  0.000000000000e+00
198001.00000  199001.00000  0.000000000000e+00
