10001.00000  11001.00000  1.465591469499e-04
11001.00000  12001.00000  1.192703848472e-04
12001.00000  13001.00000  9.235906067123e-05
13001.00000  14001.00000  8.099817907660e-05
14001.00000  15001.00000  6.888242162852e-05
15001.00000  16001.00000  5.744605244855e-05
16001.00000  17001.00000  5.114283907213e-05
17001.00000  18001.00000  4.110299022107e-05
18001.00000  19001.00000  3.868738748999e-05
19001.00000  20001.00000  3.230868652823e-05
20001.00000  21001.00000  2.928918311437e-05
21001.00000  22001.00000  2.657163004191e-05
22001.00000  23001.00000  2.355212662805e-05
23001.00000  24001.00000  2.117426768964e-05
24001.00000  25001.00000  1.815476427579e-05
25001.00000  26001.00000  1.853220220252e-05
26001.00000  27001.00000  1.502202948392e-05
27001.00000  28001.00000  1.407843466709e-05
28001.00000  29001.00000  1.343679019165e-05
29001.00000  30001.00000  1.094569987522e-05
30001.00000  31001.00000  1.026631160710e-05
31001.00000  32001.00000  9.473691960964e-06
32001.00000  33001.00000  9.435948168290e-06
33001.00000  34001.00000  9.247229204925e-06
34001.00000  35001.00000  6.982601644535e-06
35001.00000  36001.00000  7.020345437208e-06
36001.00000  37001.00000  7.095833022554e-06
37001.00000  38001.00000  6.265469583745e-06
38001.00000  39001.00000  6.605163717803e-06
39001.00000  40001.00000  6.039006827706e-06
40001.00000  41001.00000  5.472849937608e-06
41001.00000  42001.00000  4.868949254838e-06
42001.00000  43001.00000  5.661568900974e-06
43001.00000  44001.00000  4.265048572067e-06
44001.00000  45001.00000  3.812123059989e-06
45001.00000  46001.00000  3.849866852662e-06
46001.00000  47001.00000  4.453767535433e-06
47001.00000  48001.00000  2.755296865141e-06
48001.00000  49001.00000  2.981759621180e-06
49001.00000  50001.00000  3.321453755238e-06
50001.00000  51001.00000  2.830784450487e-06
51001.00000  52001.00000  2.793040657814e-06
52001.00000  53001.00000  2.340115145736e-06
53001.00000  54001.00000  2.906272035833e-06
54001.00000  55001.00000  2.340115145736e-06
55001.00000  56001.00000  2.000421011678e-06
56001.00000  57001.00000  1.962677219004e-06
57001.00000  58001.00000  2.302371353063e-06
58001.00000  59001.00000  1.962677219004e-06
59001.00000  60001.00000  2.075908597024e-06
60001.00000  61001.00000  2.226883767717e-06
61001.00000  62001.00000  1.396520328907e-06
62001.00000  63001.00000  1.358776536234e-06
63001.00000  64001.00000  1.736214462965e-06
64001.00000  65001.00000  1.396520328907e-06
65001.00000  66001.00000  1.585239292273e-06
66001.00000  67001.00000  1.472007914253e-06
67001.00000  68001.00000  1.170057572868e-06
68001.00000  69001.00000  1.547495499600e-06
69001.00000  70001.00000  1.321032743561e-06
70001.00000  71001.00000  9.435948168290e-07
71001.00000  72001.00000  1.094569987522e-06
72001.00000  73001.00000  1.207801365541e-06
73001.00000  74001.00000  1.358776536234e-06
74001.00000  75001.00000  1.170057572868e-06
75001.00000  76001.00000  8.303634388096e-07
76001.00000  77001.00000  7.926196461364e-07
77001.00000  78001.00000  9.435948168290e-07
78001.00000  79001.00000  9.435948168290e-07
79001.00000  80001.00000  8.681072314827e-07
80001.00000  81001.00000  8.681072314827e-07
81001.00000  82001.00000  9.058510241559e-07
82001.00000  83001.00000  6.039006827706e-07
83001.00000  84001.00000  6.793882681169e-07
84001.00000  85001.00000  1.019082402175e-06
85001.00000  86001.00000  7.926196461364e-07
86001.00000  87001.00000  3.774379267316e-07
87001.00000  88001.00000  7.926196461364e-07
88001.00000  89001.00000  5.661568900974e-07
89001.00000  90001.00000  3.396941340585e-07
90001.00000  91001.00000  6.039006827706e-07
91001.00000  92001.00000  4.151817194048e-07
92001.00000  93001.00000  4.906693047511e-07
93001.00000  94001.00000  7.171320607901e-07
94001.00000  95001.00000  4.529255120779e-07
95001.00000  96001.00000  4.151817194048e-07
96001.00000  97001.00000  5.661568900974e-07
97001.00000  98001.00000  5.661568900974e-07
98001.00000  99001.00000  3.774379267316e-07
99001.00000  100001.00000  3.396941340585e-07
100001.00000  101001.00000  4.529255120779e-07
101001.00000  102001.00000  5.661568900974e-07
102001.00000  103001.00000  4.151817194048e-07
103001.00000  104001.00000  4.151817194048e-07
104001.00000  105001.00000  4.151817194048e-07
105001.00000  106001.00000  4.906693047511e-07
106001.00000  107001.00000  4.529255120779e-07
107001.00000  108001.00000  4.529255120779e-07
108001.00000  109001.00000  3.774379267316e-07
109001.00000  110001.00000  5.284130974243e-07
110001.00000  111001.00000  3.019503413853e-07
111001.00000  112001.00000  3.396941340585e-07
112001.00000  113001.00000  3.019503413853e-07
113001.00000  114001.00000  2.642065487121e-07
114001.00000  115001.00000  3.019503413853e-07
115001.00000  116001.00000  3.774379267316e-07
116001.00000  117001.00000  3.396941340585e-07
117001.00000  118001.00000  2.264627560390e-07
118001.00000  119001.00000  2.264627560390e-07
119001.00000  120001.00000  3.019503413853e-07
120001.00000  121001.00000  1.509751706926e-07
121001.00000  122001.00000  2.642065487121e-07
122001.00000  123001.00000  1.509751706926e-07
123001.00000  124001.00000  1.887189633658e-07
124001.00000  125001.00000  3.019503413853e-07
125001.00000  126001.00000  7.548758534632e-08
126001.00000  127001.00000  1.887189633658e-07
127001.00000  128001.00000  2.264627560390e-07
128001.00000  129001.00000  3.019503413853e-07
129001.00000  130001.00000  1.509751706926e-07
130001.00000  131001.00000  1.887189633658e-07
131001.00000  132001.00000  2.264627560390e-07
132001.00000  133001.00000  1.887189633658e-07
133001.00000  134001.00000  1.887189633658e-07
134001.00000  135001.00000  3.774379267316e-08
135001.00000  136001.00000  7.548758534632e-08
136001.00000  137001.00000  1.132313780195e-07
137001.00000  138001.00000  2.264627560390e-07
138001.00000  139001.00000  1.132313780195e-07
139001.00000  140001.00000  1.509751706926e-07
140001.00000  141001.00000  2.642065487121e-07
141001.00000  142001.00000  2.264627560390e-07
142001.00000  143001.00000  7.548758534632e-08
143001.00000  144001.00000  1.132313780195e-07
144001.00000  145001.00000  7.548758534632e-08
145001.00000  146001.00000  2.642065487121e-07
146001.00000  147001.00000  2.642065487121e-07
147001.00000  148001.00000  1.132313780195e-07
148001.00000  149001.00000  2.642065487121e-07
149001.00000  150001.00000  1.509751706926e-07
150001.00000  151001.00000  1.132313780195e-07
151001.00000  152001.00000  7.548758534632e-08
152001.00000  153001.00000  1.132313780195e-07
153001.00000  154001.00000  1.132313780195e-07
154001.00000  155001.00000  7.548758534632e-08
155001.00000  156001.00000  1.132313780195e-07
156001.00000  157001.00000  1.132313780195e-07
157001.00000  158001.00000  7.548758534632e-08
158001.00000  159001.00000  3.774379267316e-08
159001.00000  160001.00000  3.774379267316e-08
160001.00000  161001.00000  1.887189633658e-07
161001.00000  162001.00000  7.548758534632e-08
162001.00000  163001.00000  7.548758534632e-08
163001.00000  164001.00000  7.548758534632e-08
164001.00000  165001.00000  1.132313780195e-07
165001.00000  166001.00000  1.509751706926e-07
166001.00000  167001.00000  1.132313780195e-07
167001.00000  168001.00000  7.548758534632e-08
168001.00000  169001.00000  3.774379267316e-08
169001.00000  170001.00000  3.774379267316e-08
170001.00000  171001.00000  3.774379267316e-08
171001.00000  172001.00000  3.774379267316e-08
172001.00000  173001.00000  1.132313780195e-07
173001.00000  174001.00000  7.548758534632e-08
174001.00000  175001.00000  1.509751706926e-07
175001.00000  176001.00000  7.548758534632e-08
176001.00000  177001.00000  7.548758534632e-08
177001.00000  178001.00000  3.774379267316e-08
178001.00000  179001.00000  3.774379267316e-08
179001.00000  180001.00000  3.774379267316e-08
180001.00000  181001.00000  3.774379267316e-08
181001.00000  182001.00000  7.548758534632e-08
182001.00000  183001.00000  1.132313780195e-07
183001.00000  184001.00000  7.548758534632e-08
184001.00000  185001.00000  0.000000000000e+00
185001.00000  186001.00000  3.774379267316e-08
186001.00000  187001.00000  0.000000000000e+00
187001.00000  188001.00000  1.132313780195e-07
188001.00000  189001.00000  3.774379267316e-08
189001.00000  190001.00000  7.548758534632e-08
190001.00000  191001.00000  0.000000000000e+00
191001.00000  192001.00000  3.774379267316e-08
192001.00000  193001.00000  7.548758534632e-08
193001.00000  194001.00000  3.774379267316e-08
194001.00000  195001.00000  0.000000000000e+00
195001.00000  196001.00000  3.774379267316e-08
196001.00000  197001.00000  0.000000000000e+00
197001.00000  198001.00000  3.774379267316e-08
198001.00000  199001.00000  7.548758534632e-08
