300.00000  350.00000  1.606748931000e-05
350.00000  400.00000  2.400444186072e-05
400.00000  450.00000  3.445798912265e-05
450.00000  500.00000  4.917038897277e-05
500.00000  550.00000  4.994472580699e-05
550.00000  600.00000  4.278211009048e-05
600.00000  650.00000  5.459074681229e-05
650.00000  700.00000  6.620579932554e-05
700.00000  750.00000  8.711289384940e-05
750.00000  800.00000  1.138275146299e-04
800.00000  850.00000  1.533186931749e-04
850.00000  900.00000  1.633850720198e-04
900.00000  950.00000  1.833242455008e-04
950.00000  1000.00000  2.189437398748e-04
1000.00000  1050.00000  2.504979658692e-04
1050.00000  1100.00000  2.932800759596e-04
1100.00000  1150.00000  3.132192494407e-04
1150.00000  1200.00000  3.407082070554e-04
1200.00000  1250.00000  3.426440491410e-04
1250.00000  1300.00000  3.741982751353e-04
1300.00000  1350.00000  3.451606438522e-04
1350.00000  1400.00000  3.670356594188e-04
1400.00000  1450.00000  3.705201751728e-04
1450.00000  1500.00000  3.569692805740e-04
1500.00000  1550.00000  3.532911806114e-04
1550.00000  1600.00000  3.515489227345e-04
1600.00000  1650.00000  3.534847648200e-04
1650.00000  1700.00000  3.379980281357e-04
1700.00000  1750.00000  3.366429386758e-04
1750.00000  1800.00000  3.062502179328e-04
1800.00000  1850.00000  2.764382498154e-04
1850.00000  1900.00000  2.648231973022e-04
1900.00000  1950.00000  2.563054921258e-04
1950.00000  2000.00000  2.568862447514e-04
2000.00000  2050.00000  2.541760658317e-04
2050.00000  2100.00000  2.377214081046e-04
2100.00000  2150.00000  2.282357818854e-04
2150.00000  2200.00000  2.104260346984e-04
2200.00000  2250.00000  2.123618767840e-04
2250.00000  2300.00000  2.034570031905e-04
2300.00000  2350.00000  2.363663186447e-04
2350.00000  2400.00000  1.821627402495e-04
2400.00000  2450.00000  1.862280086292e-04
2450.00000  2500.00000  1.645465772711e-04
2500.00000  2550.00000  1.691925982764e-04
2550.00000  2600.00000  1.637722404369e-04
2600.00000  2650.00000  1.461560774584e-04
2650.00000  2700.00000  1.527379405493e-04
2700.00000  2750.00000  1.409293038275e-04
2750.00000  2800.00000  1.308629249827e-04
2800.00000  2850.00000  1.320244302340e-04
2850.00000  2900.00000  1.262169039774e-04
2900.00000  2950.00000  1.186671198437e-04
2950.00000  3000.00000  1.277655776458e-04
3000.00000  3050.00000  1.149890198812e-04
3050.00000  3100.00000  1.109237515016e-04
3100.00000  3150.00000  1.080199883733e-04
3150.00000  3200.00000  9.543701481723e-05
3200.00000  3250.00000  9.543701481723e-05
3250.00000  3300.00000  9.582418323434e-05
3300.00000  3350.00000  8.130536759277e-05
3350.00000  3400.00000  8.885515172639e-05
3400.00000  3450.00000  8.091819917566e-05
3450.00000  3500.00000  8.711289384940e-05
3500.00000  3550.00000  8.924232014349e-05
3550.00000  3600.00000  7.569142554470e-05
3600.00000  3650.00000  7.782085183880e-05
3650.00000  3700.00000  8.691930964084e-05
3700.00000  3750.00000  7.065823612229e-05
3750.00000  3800.00000  7.143257295651e-05
3800.00000  3850.00000  7.065823612229e-05
3850.00000  3900.00000  6.291486778012e-05
3900.00000  3950.00000  6.388278882289e-05
3950.00000  4000.00000  6.523787828277e-05
4000.00000  4050.00000  7.278766241639e-05
4050.00000  4100.00000  6.272128357157e-05
4100.00000  4150.00000  6.310845198868e-05
4150.00000  4200.00000  6.252769936301e-05
4200.00000  4250.00000  6.388278882289e-05
4250.00000  4300.00000  5.962393623470e-05
4300.00000  4350.00000  5.962393623470e-05
4350.00000  4400.00000  5.613942048072e-05
4400.00000  4450.00000  5.826884677482e-05
4450.00000  4500.00000  5.768809414916e-05
4500.00000  4550.00000  5.749450994060e-05
4550.00000  4600.00000  5.613942048072e-05
4600.00000  4650.00000  6.368920461434e-05
4650.00000  4700.00000  5.420357839518e-05
4700.00000  4750.00000  5.691375731494e-05
4750.00000  4800.00000  5.304207314386e-05
4800.00000  4850.00000  5.613942048072e-05
4850.00000  4900.00000  6.581863090843e-05
4900.00000  4950.00000  6.252769936301e-05
4950.00000  5000.00000  6.388278882289e-05
5000.00000  5050.00000  5.633300468928e-05
5050.00000  5100.00000  6.581863090843e-05
5100.00000  5150.00000  6.059185727747e-05
5150.00000  5200.00000  6.388278882289e-05
5200.00000  5250.00000  6.620579932554e-05
5250.00000  5300.00000  6.407637303145e-05
5300.00000  5350.00000  6.252769936301e-05
5350.00000  5400.00000  6.988389928807e-05
5400.00000  5450.00000  7.007748349663e-05
5450.00000  5500.00000  6.117260990313e-05
5500.00000  5550.00000  6.910956245386e-05
5550.00000  5600.00000  6.194694673735e-05
5600.00000  5650.00000  7.298124662494e-05
5650.00000  5700.00000  6.407637303145e-05
5700.00000  5750.00000  5.710734152349e-05
5750.00000  5800.00000  6.020468886036e-05
5800.00000  5850.00000  6.620579932554e-05
5850.00000  5900.00000  7.433633608482e-05
5900.00000  5950.00000  7.220690979072e-05
5950.00000  6000.00000  6.465712565711e-05
6000.00000  6050.00000  6.330203619723e-05
6050.00000  6100.00000  6.485070986566e-05
6100.00000  6150.00000  6.581863090843e-05
6150.00000  6200.00000  6.155977832024e-05
6200.00000  6250.00000  6.194694673735e-05
6250.00000  6300.00000  7.317483083349e-05
6300.00000  6350.00000  7.162615716506e-05
6350.00000  6400.00000  3.300610755849e-04
6400.00000  6450.00000  7.375558345916e-05
6450.00000  6500.00000  6.504429407422e-05
6500.00000  6550.00000  5.962393623470e-05
6550.00000  6600.00000  6.368920461434e-05
6600.00000  6650.00000  6.310845198868e-05
6650.00000  6700.00000  6.794805720253e-05
6700.00000  6750.00000  7.259407820783e-05
6750.00000  6800.00000  5.865601519193e-05
6800.00000  6850.00000  6.969031507952e-05
6850.00000  6900.00000  6.543146249133e-05
6900.00000  6950.00000  6.833522561964e-05
6950.00000  7000.00000  6.736730457687e-05
7000.00000  7050.00000  6.426995724000e-05
7050.00000  7100.00000  9.524343060868e-05
7100.00000  7150.00000  4.181418904771e-05
7150.00000  7200.00000  3.658741541675e-05
7200.00000  7250.00000  3.736175225096e-05
7250.00000  7300.00000  3.484515753976e-05
7300.00000  7350.00000  3.716816804241e-05
7350.00000  7400.00000  3.736175225096e-05
7400.00000  7450.00000  3.136064178578e-05
7450.00000  7500.00000  4.103985221349e-05
7500.00000  7550.00000  3.736175225096e-05
7550.00000  7600.00000  3.465157333121e-05
7600.00000  7650.00000  3.194139441145e-05
7650.00000  7700.00000  3.542591016542e-05
7700.00000  7750.00000  3.774892066807e-05
7750.00000  7800.00000  3.426440491410e-05
7800.00000  7850.00000  3.349006807988e-05
7850.00000  7900.00000  3.794250487663e-05
7900.00000  7950.00000  3.349006807988e-05
7950.00000  8000.00000  3.620024699964e-05
8000.00000  8050.00000  3.407082070554e-05
8050.00000  8100.00000  3.658741541675e-05
8100.00000  8150.00000  3.174781020289e-05
8150.00000  8200.00000  3.716816804241e-05
8200.00000  8250.00000  3.058630495157e-05
8250.00000  8300.00000  4.103985221349e-05
8300.00000  8350.00000  3.716816804241e-05
8350.00000  8400.00000  3.290931545422e-05
8400.00000  8450.00000  3.349006807988e-05
8450.00000  8500.00000  3.794250487663e-05
8500.00000  8550.00000  3.271573124566e-05
8550.00000  8600.00000  3.755533645952e-05
8600.00000  8650.00000  3.407082070554e-05
8650.00000  8700.00000  3.426440491410e-05
8700.00000  8750.00000  3.445798912265e-05
8750.00000  8800.00000  2.961838390880e-05
8800.00000  8850.00000  3.232856282855e-05
8850.00000  8900.00000  3.039272074301e-05
8900.00000  8950.00000  3.194139441145e-05
8950.00000  9000.00000  3.465157333121e-05
9000.00000  9050.00000  3.174781020289e-05
9050.00000  9100.00000  3.774892066807e-05
9100.00000  9150.00000  3.561949437398e-05
9150.00000  9200.00000  3.484515753976e-05
9200.00000  9250.00000  3.600666279108e-05
9250.00000  9300.00000  3.387723649699e-05
9300.00000  9350.00000  3.116705757723e-05
9350.00000  9400.00000  3.116705757723e-05
9400.00000  9450.00000  3.465157333121e-05
9450.00000  9500.00000  3.116705757723e-05
9500.00000  9550.00000  3.058630495157e-05
9550.00000  9600.00000  3.116705757723e-05
9600.00000  9650.00000  3.116705757723e-05
9650.00000  9700.00000  3.349006807988e-05
9700.00000  9750.00000  2.923121549169e-05
9750.00000  9800.00000  3.232856282855e-05
9800.00000  9850.00000  2.942479970024e-05
9850.00000  9900.00000  3.329648387133e-05
9900.00000  9950.00000  3.368365228843e-05
9950.00000  10000.00000  2.690820498904e-05
