10001.00000  11001.00000  6.675556641090e-04
11001.00000  12001.00000  5.604975446871e-04
12001.00000  13001.00000  4.755222823146e-04
13001.00000  14001.00000  4.039716832412e-04
14001.00000  15001.00000  3.571460292069e-04
15001.00000  16001.00000  3.098205206881e-04
16001.00000  17001.00000  2.742772964478e-04
17001.00000  18001.00000  2.469995231484e-04
18001.00000  19001.00000  2.167226229417e-04
19001.00000  20001.00000  1.957287345909e-04
20001.00000  21001.00000  1.746634384565e-04
21001.00000  22001.00000  1.599355831083e-04
22001.00000  23001.00000  1.431190500926e-04
23001.00000  24001.00000  1.330327006723e-04
24001.00000  25001.00000  1.207505619092e-04
25001.00000  26001.00000  1.133241524246e-04
26001.00000  27001.00000  1.024701693316e-04
27001.00000  28001.00000  9.459746120002e-05
28001.00000  29001.00000  8.875987489837e-05
29001.00000  30001.00000  8.135131735959e-05
30001.00000  31001.00000  7.803085542655e-05
31001.00000  32001.00000  7.049733426663e-05
32001.00000  33001.00000  6.355292732064e-05
33001.00000  34001.00000  6.141069381545e-05
34001.00000  35001.00000  5.789386047776e-05
35001.00000  36001.00000  5.553740362205e-05
36001.00000  37001.00000  5.221694168901e-05
37001.00000  38001.00000  5.043174710135e-05
38001.00000  39001.00000  4.650431900850e-05
39001.00000  40001.00000  4.634365149561e-05
40001.00000  41001.00000  4.080954827387e-05
41001.00000  42001.00000  3.968487568365e-05
42001.00000  43001.00000  3.773901358310e-05
43001.00000  44001.00000  3.447210748768e-05
44001.00000  45001.00000  3.461492305470e-05
45001.00000  46001.00000  3.165150003918e-05
46001.00000  47001.00000  3.120520139227e-05
47001.00000  48001.00000  2.917007956234e-05
48001.00000  49001.00000  2.736703302880e-05
49001.00000  50001.00000  2.608169292569e-05
50001.00000  51001.00000  2.545687482001e-05
51001.00000  52001.00000  2.531405925300e-05
52001.00000  53001.00000  2.343960493595e-05
53001.00000  54001.00000  2.279693488440e-05
54001.00000  55001.00000  2.211856094109e-05
55001.00000  56001.00000  2.015484689466e-05
56001.00000  57001.00000  1.977995603125e-05
57001.00000  58001.00000  1.833394841525e-05
58001.00000  59001.00000  1.913728597970e-05
59001.00000  60001.00000  1.786979782246e-05
60001.00000  61001.00000  1.742349917555e-05
61001.00000  62001.00000  1.745920306730e-05
62001.00000  63001.00000  1.674512523224e-05
63001.00000  64001.00000  1.508489426571e-05
64001.00000  65001.00000  1.388881389198e-05
65001.00000  66001.00000  1.524556177860e-05
66001.00000  67001.00000  1.374599832497e-05
67001.00000  68001.00000  1.315688411104e-05
68001.00000  69001.00000  1.372814637909e-05
69001.00000  70001.00000  1.321043994867e-05
70001.00000  71001.00000  1.142524536101e-05
71001.00000  72001.00000  1.285340103114e-05
72001.00000  73001.00000  1.094324282235e-05
73001.00000  74001.00000  1.101465060585e-05
74001.00000  75001.00000  1.092539087647e-05
75001.00000  76001.00000  1.105035449761e-05
76001.00000  77001.00000  1.046124028368e-05
77001.00000  78001.00000  9.622198827479e-06
78001.00000  79001.00000  9.889978015627e-06
79001.00000  80001.00000  9.336567693453e-06
80001.00000  81001.00000  8.997380721798e-06
81001.00000  82001.00000  8.301154832611e-06
82001.00000  83001.00000  8.568934020760e-06
83001.00000  84001.00000  8.515378183130e-06
84001.00000  85001.00000  7.872708131573e-06
85001.00000  86001.00000  7.783448402190e-06
86001.00000  87001.00000  7.694188672808e-06
87001.00000  88001.00000  7.337149755276e-06
88001.00000  89001.00000  7.140778350633e-06
89001.00000  90001.00000  7.372853647029e-06
90001.00000  91001.00000  6.712331649595e-06
91001.00000  92001.00000  6.658775811966e-06
92001.00000  93001.00000  6.515960244953e-06
93001.00000  94001.00000  6.248181056804e-06
94001.00000  95001.00000  6.105365489792e-06
95001.00000  96001.00000  5.516251275864e-06
96001.00000  97001.00000  6.033957706285e-06
97001.00000  98001.00000  5.409139600605e-06
98001.00000  99001.00000  5.891142139273e-06
99001.00000  100001.00000  5.569807113494e-06
100001.00000  101001.00000  5.284175979469e-06
101001.00000  102001.00000  5.480547384111e-06
102001.00000  103001.00000  5.319879871222e-06
103001.00000  104001.00000  5.141360412456e-06
104001.00000  105001.00000  4.980692899567e-06
105001.00000  106001.00000  4.409430631516e-06
106001.00000  107001.00000  5.069952628950e-06
107001.00000  108001.00000  4.427282577393e-06
108001.00000  109001.00000  4.802173440801e-06
109001.00000  110001.00000  4.927137061937e-06
110001.00000  111001.00000  4.570098144405e-06
111001.00000  112001.00000  4.338022848010e-06
112001.00000  113001.00000  4.016687822231e-06
113001.00000  114001.00000  3.856020309342e-06
114001.00000  115001.00000  3.963131984602e-06
115001.00000  116001.00000  3.606093067070e-06
116001.00000  117001.00000  3.463277500057e-06
117001.00000  118001.00000  3.748908634083e-06
118001.00000  119001.00000  3.552537229440e-06
119001.00000  120001.00000  3.338313878921e-06
120001.00000  121001.00000  3.159794420155e-06
121001.00000  122001.00000  3.141942474279e-06
122001.00000  123001.00000  3.427573608304e-06
123001.00000  124001.00000  3.249054149538e-06
124001.00000  125001.00000  3.141942474279e-06
125001.00000  126001.00000  2.981274961389e-06
126001.00000  127001.00000  3.016978853143e-06
127001.00000  128001.00000  3.106238582526e-06
128001.00000  129001.00000  2.963423015513e-06
129001.00000  130001.00000  2.749199664994e-06
130001.00000  131001.00000  3.016978853143e-06
131001.00000  132001.00000  2.784903556747e-06
132001.00000  133001.00000  2.606384097981e-06
133001.00000  134001.00000  2.713495773241e-06
134001.00000  135001.00000  2.410012693339e-06
135001.00000  136001.00000  2.802755502624e-06
136001.00000  137001.00000  2.338604909832e-06
137001.00000  138001.00000  2.231493234573e-06
138001.00000  139001.00000  1.838750425288e-06
139001.00000  140001.00000  2.177937396943e-06
140001.00000  141001.00000  2.267197126326e-06
141001.00000  142001.00000  2.374308801586e-06
142001.00000  143001.00000  2.106529613437e-06
143001.00000  144001.00000  2.356456855709e-06
144001.00000  145001.00000  2.070825721684e-06
145001.00000  146001.00000  1.892306262918e-06
146001.00000  147001.00000  1.856602371165e-06
147001.00000  148001.00000  2.338604909832e-06
148001.00000  149001.00000  2.052973775807e-06
149001.00000  150001.00000  1.945862100548e-06
150001.00000  151001.00000  1.446007616003e-06
151001.00000  152001.00000  2.177937396943e-06
152001.00000  153001.00000  1.678082912399e-06
153001.00000  154001.00000  1.695934858275e-06
154001.00000  155001.00000  1.803046533535e-06
155001.00000  156001.00000  1.588823183016e-06
156001.00000  157001.00000  1.553119291263e-06
157001.00000  158001.00000  1.856602371165e-06
158001.00000  159001.00000  1.767342641782e-06
159001.00000  160001.00000  1.499563453633e-06
160001.00000  161001.00000  1.499563453633e-06
161001.00000  162001.00000  1.570971237139e-06
162001.00000  163001.00000  1.553119291263e-06
163001.00000  164001.00000  1.303192048991e-06
164001.00000  165001.00000  1.588823183016e-06
165001.00000  166001.00000  1.481711507756e-06
166001.00000  167001.00000  1.660230966522e-06
167001.00000  168001.00000  1.517415399510e-06
168001.00000  169001.00000  1.463859561880e-06
169001.00000  170001.00000  1.517415399510e-06
170001.00000  171001.00000  1.338895940744e-06
171001.00000  172001.00000  1.517415399510e-06
172001.00000  173001.00000  1.463859561880e-06
173001.00000  174001.00000  1.071116752595e-06
174001.00000  175001.00000  1.160376481978e-06
175001.00000  176001.00000  1.071116752595e-06
176001.00000  177001.00000  1.410303724250e-06
177001.00000  178001.00000  1.321043994867e-06
178001.00000  179001.00000  1.106820644348e-06
179001.00000  180001.00000  1.213932319608e-06
180001.00000  181001.00000  1.249636211361e-06
181001.00000  182001.00000  1.213932319608e-06
182001.00000  183001.00000  1.124672590225e-06
183001.00000  184001.00000  1.321043994867e-06
184001.00000  185001.00000  9.997089690887e-07
185001.00000  186001.00000  9.997089690887e-07
186001.00000  187001.00000  1.374599832497e-06
187001.00000  188001.00000  1.088968698472e-06
188001.00000  189001.00000  8.211895103228e-07
189001.00000  190001.00000  1.160376481978e-06
190001.00000  191001.00000  9.104492397058e-07
191001.00000  192001.00000  9.104492397058e-07
192001.00000  193001.00000  1.088968698472e-06
193001.00000  194001.00000  1.106820644348e-06
194001.00000  195001.00000  9.640050773355e-07
195001.00000  196001.00000  7.497817268165e-07
196001.00000  197001.00000  8.568934020760e-07
197001.00000  198001.00000  9.640050773355e-07
198001.00000  199001.00000  8.568934020760e-07
