300.00000  350.00000  1.309843410452e+00
350.00000  400.00000  9.257198899307e-01
400.00000  450.00000  6.853947346596e-01
450.00000  500.00000  5.229782899549e-01
500.00000  550.00000  4.121705050752e-01
550.00000  600.00000  3.302635091976e-01
600.00000  650.00000  2.705244227826e-01
650.00000  700.00000  2.242420204660e-01
700.00000  750.00000  1.886817080194e-01
750.00000  800.00000  1.610650288070e-01
800.00000  850.00000  1.390007253758e-01
850.00000  900.00000  1.204431457934e-01
900.00000  950.00000  1.050111408641e-01
950.00000  1000.00000  9.227062400412e-02
1000.00000  1050.00000  8.209227673649e-02
1050.00000  1100.00000  7.334021395854e-02
1100.00000  1150.00000  6.551909296576e-02
1150.00000  1200.00000  5.906602533557e-02
1200.00000  1250.00000  5.342138724911e-02
1250.00000  1300.00000  4.894590919503e-02
1300.00000  1350.00000  4.422843165171e-02
1350.00000  1400.00000  4.057423936423e-02
1400.00000  1450.00000  3.701382187883e-02
1450.00000  1500.00000  3.419377158081e-02
1500.00000  1550.00000  3.165655818584e-02
1550.00000  1600.00000  2.934924430565e-02
1600.00000  1650.00000  2.688236201223e-02
1650.00000  1700.00000  2.506131585572e-02
1700.00000  1750.00000  2.352310660226e-02
1750.00000  1800.00000  2.165895428673e-02
1800.00000  1850.00000  2.083615602332e-02
1850.00000  1900.00000  1.909149095560e-02
1900.00000  1950.00000  1.794048088492e-02
1950.00000  2000.00000  1.659133373242e-02
2000.00000  2050.00000  1.603700365239e-02
2050.00000  2100.00000  1.502363079121e-02
2100.00000  2150.00000  1.413201392305e-02
2150.00000  2200.00000  1.355424014249e-02
2200.00000  2250.00000  1.284639163648e-02
2250.00000  2300.00000  1.218467428309e-02
2300.00000  2350.00000  1.159253178287e-02
2350.00000  2400.00000  1.084308961463e-02
2400.00000  2450.00000  1.051109656534e-02
2450.00000  2500.00000  9.758629403490e-03
2500.00000  2550.00000  9.350255265402e-03
2550.00000  2600.00000  8.990281025162e-03
2600.00000  2650.00000  8.442000932359e-03
2650.00000  2700.00000  8.170507755371e-03
2700.00000  2750.00000  7.987495641635e-03
2750.00000  2800.00000  7.549627815797e-03
2800.00000  2850.00000  7.173016110671e-03
2850.00000  2900.00000  6.831191832124e-03
2900.00000  2950.00000  6.533229961001e-03
2950.00000  3000.00000  6.336605375995e-03
3000.00000  3050.00000  6.155862007471e-03
3050.00000  3100.00000  5.791350276808e-03
3100.00000  3150.00000  5.596994437014e-03
3150.00000  3200.00000  5.404907342432e-03
3200.00000  3250.00000  5.208282757427e-03
3250.00000  3300.00000  5.016951911249e-03
3300.00000  3350.00000  4.827889810282e-03
3350.00000  3400.00000  4.780246160839e-03
3400.00000  3450.00000  4.543540410428e-03
3450.00000  3500.00000  4.387753239232e-03
3500.00000  3550.00000  4.224403583997e-03
3550.00000  3600.00000  4.070885158012e-03
3600.00000  3650.00000  3.819810687928e-03
3650.00000  3700.00000  3.795610739005e-03
3700.00000  3750.00000  3.633017332173e-03
3750.00000  3800.00000  3.487061390227e-03
3800.00000  3850.00000  3.406899059417e-03
3850.00000  3900.00000  3.352449174339e-03
3900.00000  3950.00000  3.262455614279e-03
3950.00000  4000.00000  3.211786971220e-03
4000.00000  4050.00000  3.093055971813e-03
4050.00000  4100.00000  2.861643960230e-03
4100.00000  4150.00000  2.816269055998e-03
4150.00000  4200.00000  2.815512807594e-03
4200.00000  4250.00000  2.682413088514e-03
4250.00000  4300.00000  2.571244573145e-03
4300.00000  4350.00000  2.536457146567e-03
4350.00000  4400.00000  2.598469515684e-03
4400.00000  4450.00000  2.459319809373e-03
4450.00000  4500.00000  2.389744956217e-03
4500.00000  4550.00000  2.240007772252e-03
4550.00000  4600.00000  2.226395300982e-03
4600.00000  4650.00000  2.160601689846e-03
4650.00000  4700.00000  2.126570511672e-03
4700.00000  4750.00000  2.048676926074e-03
4750.00000  4800.00000  2.104639307960e-03
4800.00000  4850.00000  1.932970920282e-03
4850.00000  4900.00000  1.884571022435e-03
4900.00000  4950.00000  1.845246105434e-03
4950.00000  5000.00000  1.849027347453e-03
5000.00000  5050.00000  1.787014978336e-03
5050.00000  5100.00000  1.757521290585e-03
5100.00000  5150.00000  1.706852647526e-03
5150.00000  5200.00000  1.632740303947e-03
5200.00000  5250.00000  1.647865272025e-03
5250.00000  5300.00000  1.622909074697e-03
5300.00000  5350.00000  1.535940508252e-03
5350.00000  5400.00000  1.455021929039e-03
5400.00000  5450.00000  1.461828164673e-03
5450.00000  5500.00000  1.417965757249e-03
5500.00000  5550.00000  1.424015744480e-03
5550.00000  5600.00000  1.351415897709e-03
5600.00000  5650.00000  1.339315923247e-03
5650.00000  5700.00000  1.328728445593e-03
5700.00000  5750.00000  1.298478509438e-03
5750.00000  5800.00000  1.220584923840e-03
5800.00000  5850.00000  1.275034808918e-03
5850.00000  5900.00000  1.234953643514e-03
5900.00000  5950.00000  1.168403783973e-03
5950.00000  6000.00000  1.150253822281e-03
6000.00000  6050.00000  1.157816306319e-03
6050.00000  6100.00000  1.093535191991e-03
6100.00000  6150.00000  1.076141478702e-03
6150.00000  6200.00000  1.084460211144e-03
6200.00000  6250.00000  1.054210274990e-03
6250.00000  6300.00000  1.014129109585e-03
6300.00000  6350.00000  1.016397854796e-03
6350.00000  6400.00000  1.168403783973e-03
6400.00000  6450.00000  1.011860364373e-03
6450.00000  6500.00000  9.982478931034e-04
6500.00000  6550.00000  8.916168681583e-04
6550.00000  6600.00000  9.301855367555e-04
6600.00000  6650.00000  9.180855622936e-04
6650.00000  6700.00000  8.749794032732e-04
6700.00000  6750.00000  8.636356772153e-04
6750.00000  6800.00000  8.908606197544e-04
6800.00000  6850.00000  8.311169958490e-04
6850.00000  6900.00000  8.583419383882e-04
6900.00000  6950.00000  8.114545373485e-04
6950.00000  7000.00000  8.273357538297e-04
7000.00000  7050.00000  8.061607985214e-04
7050.00000  7100.00000  7.774233591745e-04
7100.00000  7150.00000  8.447294671186e-04
7150.00000  7200.00000  7.403671873851e-04
7200.00000  7250.00000  7.290234613271e-04
7250.00000  7300.00000  7.539796586546e-04
7300.00000  7350.00000  7.123859964420e-04
7350.00000  7400.00000  6.889422959222e-04
7400.00000  7450.00000  6.798673150758e-04
7450.00000  7500.00000  6.881860475183e-04
7500.00000  7550.00000  6.723048310371e-04
7550.00000  7600.00000  6.496173789211e-04
7600.00000  7650.00000  6.617173533830e-04
7650.00000  7700.00000  6.465923853056e-04
7700.00000  7750.00000  5.800425257654e-04
7750.00000  7800.00000  6.246611815935e-04
7800.00000  7850.00000  6.042424746891e-04
7850.00000  7900.00000  5.883612582079e-04
7900.00000  7950.00000  6.004612326698e-04
7950.00000  8000.00000  5.528175832262e-04
8000.00000  8050.00000  5.482800928030e-04
8050.00000  8100.00000  5.361801183412e-04
8100.00000  8150.00000  5.414738571682e-04
8150.00000  8200.00000  5.240801438793e-04
8200.00000  8250.00000  5.165176598406e-04
8250.00000  8300.00000  5.029051885711e-04
8300.00000  8350.00000  5.490363412069e-04
8350.00000  8400.00000  4.983676981479e-04
8400.00000  8450.00000  4.862677236860e-04
8450.00000  8500.00000  5.059301821865e-04
8500.00000  8550.00000  4.522365455120e-04
8550.00000  8600.00000  4.681177619932e-04
8600.00000  8650.00000  5.089551758020e-04
8650.00000  8700.00000  4.461865582811e-04
8700.00000  8750.00000  4.446740614734e-04
8750.00000  8800.00000  4.529927939159e-04
8800.00000  8850.00000  4.877802204937e-04
8850.00000  8900.00000  4.378678258386e-04
8900.00000  8950.00000  4.484553034927e-04
8950.00000  9000.00000  4.340865838192e-04
9000.00000  9050.00000  4.522365455120e-04
9050.00000  9100.00000  3.977866604336e-04
9100.00000  9150.00000  4.174491189342e-04
9150.00000  9200.00000  3.932491700104e-04
9200.00000  9250.00000  3.902241763950e-04
9250.00000  9300.00000  3.728304631061e-04
9300.00000  9350.00000  4.136678769148e-04
9350.00000  9400.00000  4.166928705303e-04
9400.00000  9450.00000  3.871991827795e-04
9450.00000  9500.00000  3.849304375679e-04
9500.00000  9550.00000  3.743429599138e-04
9550.00000  9600.00000  3.871991827795e-04
9600.00000  9650.00000  3.456055205669e-04
9650.00000  9700.00000  3.629992338558e-04
9700.00000  9750.00000  3.735867115099e-04
9750.00000  9800.00000  3.236743168548e-04
9800.00000  9850.00000  3.372867881243e-04
9850.00000  9900.00000  3.660242274713e-04
9900.00000  9950.00000  3.418242785475e-04
9950.00000  10000.00000  3.093055971813e-04
