10001.00000  11001.00000  6.226061673062e-05
11001.00000  12001.00000  4.960323860407e-05
12001.00000  13001.00000  4.216725401478e-05
13001.00000  14001.00000  3.939451399844e-05
14001.00000  15001.00000  3.471326462020e-05
15001.00000  16001.00000  3.026607771087e-05
16001.00000  17001.00000  2.769139055283e-05
17001.00000  18001.00000  2.333422767001e-05
18001.00000  19001.00000  2.084956453848e-05
19001.00000  20001.00000  1.886903595538e-05
20001.00000  21001.00000  1.733862750480e-05
21001.00000  22001.00000  1.791478127443e-05
22001.00000  23001.00000  1.479994995737e-05
23001.00000  24001.00000  1.402574332943e-05
24001.00000  25001.00000  1.344958955980e-05
25001.00000  26001.00000  1.199120033042e-05
26001.00000  27001.00000  1.136103214489e-05
27001.00000  28001.00000  9.632570835999e-06
28001.00000  29001.00000  8.966393039864e-06
29001.00000  30001.00000  8.678316155049e-06
30001.00000  31001.00000  7.508003810489e-06
31001.00000  32001.00000  7.508003810489e-06
32001.00000  33001.00000  7.526008615790e-06
33001.00000  34001.00000  6.733797182549e-06
34001.00000  35001.00000  6.211657828822e-06
35001.00000  36001.00000  5.095359900164e-06
36001.00000  37001.00000  5.401441590280e-06
37001.00000  38001.00000  5.473460811483e-06
38001.00000  39001.00000  4.339158077525e-06
39001.00000  40001.00000  3.943052360904e-06
40001.00000  41001.00000  4.357162882826e-06
41001.00000  42001.00000  3.889037945001e-06
42001.00000  43001.00000  3.744999502594e-06
43001.00000  44001.00000  3.384903396575e-06
44001.00000  45001.00000  3.384903396575e-06
45001.00000  46001.00000  2.916778458751e-06
46001.00000  47001.00000  2.736730405742e-06
47001.00000  48001.00000  2.952788069353e-06
48001.00000  49001.00000  2.646706379237e-06
49001.00000  50001.00000  2.232595857316e-06
50001.00000  51001.00000  2.736730405742e-06
51001.00000  52001.00000  2.484663131529e-06
52001.00000  53001.00000  2.250600662617e-06
53001.00000  54001.00000  2.016538193704e-06
54001.00000  55001.00000  1.710456503589e-06
55001.00000  56001.00000  1.728461308890e-06
56001.00000  57001.00000  1.908509361899e-06
57001.00000  58001.00000  1.674446892987e-06
58001.00000  59001.00000  1.836490140695e-06
59001.00000  60001.00000  1.620432477084e-06
60001.00000  61001.00000  1.638437282385e-06
61001.00000  62001.00000  1.512403645278e-06
62001.00000  63001.00000  1.836490140695e-06
63001.00000  64001.00000  1.224326760463e-06
64001.00000  65001.00000  1.458389229376e-06
65001.00000  66001.00000  1.134302733959e-06
66001.00000  67001.00000  1.404374813473e-06
67001.00000  68001.00000  9.902642915513e-07
68001.00000  69001.00000  1.278341176366e-06
69001.00000  70001.00000  1.098293123357e-06
70001.00000  71001.00000  1.206321955162e-06
71001.00000  72001.00000  1.026273902153e-06
72001.00000  73001.00000  8.102162385420e-07
73001.00000  74001.00000  1.062283512755e-06
74001.00000  75001.00000  7.562018226392e-07
75001.00000  76001.00000  9.002402650466e-07
76001.00000  77001.00000  7.562018226392e-07
77001.00000  78001.00000  8.642306544448e-07
78001.00000  79001.00000  8.642306544448e-07
79001.00000  80001.00000  5.041345484261e-07
80001.00000  81001.00000  7.562018226392e-07
81001.00000  82001.00000  7.562018226392e-07
82001.00000  83001.00000  5.761537696298e-07
83001.00000  84001.00000  7.021874067364e-07
84001.00000  85001.00000  6.661777961345e-07
85001.00000  86001.00000  6.121633802317e-07
86001.00000  87001.00000  4.861297431252e-07
87001.00000  88001.00000  3.781009113196e-07
88001.00000  89001.00000  5.041345484261e-07
89001.00000  90001.00000  5.401441590280e-07
90001.00000  91001.00000  5.401441590280e-07
91001.00000  92001.00000  5.401441590280e-07
92001.00000  93001.00000  3.060816901159e-07
93001.00000  94001.00000  3.961057166205e-07
94001.00000  95001.00000  4.141105219214e-07
95001.00000  96001.00000  5.581489643289e-07
96001.00000  97001.00000  4.861297431252e-07
97001.00000  98001.00000  3.240864954168e-07
98001.00000  99001.00000  5.041345484261e-07
99001.00000  100001.00000  2.700720795140e-07
100001.00000  101001.00000  3.600961060187e-07
101001.00000  102001.00000  3.060816901159e-07
102001.00000  103001.00000  4.501201325233e-07
103001.00000  104001.00000  3.961057166205e-07
104001.00000  105001.00000  4.501201325233e-07
105001.00000  106001.00000  2.160576636112e-07
106001.00000  107001.00000  2.340624689121e-07
107001.00000  108001.00000  1.980528583103e-07
108001.00000  109001.00000  3.060816901159e-07
109001.00000  110001.00000  2.700720795140e-07
110001.00000  111001.00000  3.240864954168e-07
111001.00000  112001.00000  3.060816901159e-07
112001.00000  113001.00000  2.340624689121e-07
113001.00000  114001.00000  2.160576636112e-07
114001.00000  115001.00000  1.980528583103e-07
115001.00000  116001.00000  2.160576636112e-07
116001.00000  117001.00000  1.980528583103e-07
117001.00000  118001.00000  1.980528583103e-07
118001.00000  119001.00000  2.520672742131e-07
119001.00000  120001.00000  2.520672742131e-07
120001.00000  121001.00000  2.160576636112e-07
121001.00000  122001.00000  2.520672742131e-07
122001.00000  123001.00000  1.980528583103e-07
123001.00000  124001.00000  3.060816901159e-07
124001.00000  125001.00000  2.340624689121e-07
125001.00000  126001.00000  1.080288318056e-07
126001.00000  127001.00000  1.260336371065e-07
127001.00000  128001.00000  1.980528583103e-07
128001.00000  129001.00000  1.260336371065e-07
129001.00000  130001.00000  2.700720795140e-07
130001.00000  131001.00000  2.160576636112e-07
131001.00000  132001.00000  1.260336371065e-07
132001.00000  133001.00000  1.620432477084e-07
133001.00000  134001.00000  2.340624689121e-07
134001.00000  135001.00000  1.800480530093e-07
135001.00000  136001.00000  1.080288318056e-07
136001.00000  137001.00000  7.201922120373e-08
137001.00000  138001.00000  2.160576636112e-07
138001.00000  139001.00000  1.800480530093e-07
139001.00000  140001.00000  1.980528583103e-07
140001.00000  141001.00000  2.340624689121e-07
141001.00000  142001.00000  7.201922120373e-08
142001.00000  143001.00000  1.800480530093e-07
143001.00000  144001.00000  1.980528583103e-07
144001.00000  145001.00000  1.440384424075e-07
145001.00000  146001.00000  7.201922120373e-08
146001.00000  147001.00000  1.080288318056e-07
147001.00000  148001.00000  1.080288318056e-07
148001.00000  149001.00000  7.201922120373e-08
149001.00000  150001.00000  9.002402650466e-08
150001.00000  151001.00000  9.002402650466e-08
151001.00000  152001.00000  1.080288318056e-07
152001.00000  153001.00000  1.440384424075e-07
153001.00000  154001.00000  9.002402650466e-08
154001.00000  155001.00000  1.440384424075e-07
155001.00000  156001.00000  1.080288318056e-07
156001.00000  157001.00000  7.201922120373e-08
157001.00000  158001.00000  1.080288318056e-07
158001.00000  159001.00000  5.401441590280e-08
159001.00000  160001.00000  3.600961060187e-08
160001.00000  161001.00000  1.440384424075e-07
161001.00000  162001.00000  1.080288318056e-07
162001.00000  163001.00000  1.260336371065e-07
163001.00000  164001.00000  7.201922120373e-08
164001.00000  165001.00000  1.260336371065e-07
165001.00000  166001.00000  1.440384424075e-07
166001.00000  167001.00000  7.201922120373e-08
167001.00000  168001.00000  7.201922120373e-08
168001.00000  169001.00000  3.600961060187e-08
169001.00000  170001.00000  1.800480530093e-08
170001.00000  171001.00000  5.401441590280e-08
171001.00000  172001.00000  7.201922120373e-08
172001.00000  173001.00000  1.800480530093e-08
173001.00000  174001.00000  7.201922120373e-08
174001.00000  175001.00000  7.201922120373e-08
175001.00000  176001.00000  9.002402650466e-08
176001.00000  177001.00000  5.401441590280e-08
177001.00000  178001.00000  5.401441590280e-08
178001.00000  179001.00000  5.401441590280e-08
179001.00000  180001.00000  1.800480530093e-08
180001.00000  181001.00000  1.800480530093e-08
181001.00000  182001.00000  0.000000000000e+00
182001.00000  183001.00000  3.600961060187e-08
183001.00000  184001.00000  1.800480530093e-08
184001.00000  185001.00000  1.800480530093e-08
185001.00000  186001.00000  7.201922120373e-08
186001.00000  187001.00000  9.002402650466e-08
187001.00000  188001.00000  3.600961060187e-08
188001.00000  189001.00000  5.401441590280e-08
189001.00000  190001.00000  5.401441590280e-08
190001.00000  191001.00000  5.401441590280e-08
191001.00000  192001.00000  9.002402650466e-08
192001.00000  193001.00000  1.800480530093e-08
193001.00000  194001.00000  1.800480530093e-08
194001.00000  195001.00000  5.401441590280e-08
195001.00000  196001.00000  9.002402650466e-08
196001.00000  197001.00000  1.800480530093e-08
197001.00000  198001.00000  7.201922120373e-08
198001.00000  199001.00000  7.201922120373e-08
