300.00000  350.00000  5.673414589682e-01
350.00000  400.00000  4.018213372419e-01
400.00000  450.00000  2.967891719534e-01
450.00000  500.00000  2.271638848030e-01
500.00000  550.00000  1.787885147036e-01
550.00000  600.00000  1.430052756368e-01
600.00000  650.00000  1.171016965305e-01
650.00000  700.00000  9.744704503327e-02
700.00000  750.00000  8.194127170267e-02
750.00000  800.00000  7.012264774649e-02
800.00000  850.00000  5.991042428283e-02
850.00000  900.00000  5.168764320359e-02
900.00000  950.00000  4.531474661018e-02
950.00000  1000.00000  4.011769954547e-02
1000.00000  1050.00000  3.574463794596e-02
1050.00000  1100.00000  3.182217019994e-02
1100.00000  1150.00000  2.833396506395e-02
1150.00000  1200.00000  2.540918782714e-02
1200.00000  1250.00000  2.322970915524e-02
1250.00000  1300.00000  2.120240797916e-02
1300.00000  1350.00000  1.937924734626e-02
1350.00000  1400.00000  1.765852814958e-02
1400.00000  1450.00000  1.613378387435e-02
1450.00000  1500.00000  1.483396536123e-02
1500.00000  1550.00000  1.377540385370e-02
1550.00000  1600.00000  1.283116105034e-02
1600.00000  1650.00000  1.175478364085e-02
1650.00000  1700.00000  1.094712941911e-02
1700.00000  1750.00000  1.036365863024e-02
1750.00000  1800.00000  9.486225459200e-03
1800.00000  1850.00000  8.852276281475e-03
1850.00000  1900.00000  8.403909415730e-03
1900.00000  1950.00000  7.797426420177e-03
1950.00000  2000.00000  7.371329431869e-03
2000.00000  2050.00000  6.893269396207e-03
2050.00000  2100.00000  6.568129185617e-03
2100.00000  2150.00000  6.253381584498e-03
2150.00000  2200.00000  5.712223562763e-03
2200.00000  2250.00000  5.502886714849e-03
2250.00000  2300.00000  5.216347625151e-03
2300.00000  2350.00000  4.976575278072e-03
2350.00000  2400.00000  4.715275382803e-03
2400.00000  2450.00000  4.475503035724e-03
2450.00000  2500.00000  4.249834944356e-03
2500.00000  2550.00000  4.016001231260e-03
2550.00000  2600.00000  3.908363490311e-03
2600.00000  2650.00000  3.704965276381e-03
2650.00000  2700.00000  3.544622158829e-03
2700.00000  2750.00000  3.463708270806e-03
2750.00000  2800.00000  3.216512631248e-03
2800.00000  2850.00000  3.070273769407e-03
2850.00000  2900.00000  2.961151369962e-03
2900.00000  2950.00000  2.770372753246e-03
2950.00000  3000.00000  2.807489215643e-03
3000.00000  3050.00000  2.637495817868e-03
3050.00000  3100.00000  2.539508357143e-03
3100.00000  3150.00000  2.468987078590e-03
3150.00000  3200.00000  2.368772630120e-03
3200.00000  3250.00000  2.240349670230e-03
3250.00000  3300.00000  2.169086062429e-03
3300.00000  3350.00000  2.077037235687e-03
3350.00000  3400.00000  2.019135554349e-03
3400.00000  3450.00000  1.974595799474e-03
3450.00000  3500.00000  1.898878216186e-03
3500.00000  3550.00000  1.874381351004e-03
3550.00000  3600.00000  1.788271158245e-03
3600.00000  3650.00000  1.639805308661e-03
3650.00000  3700.00000  1.607885151000e-03
3700.00000  3750.00000  1.564087725373e-03
3750.00000  3800.00000  1.517320982753e-03
3800.00000  3850.00000  1.492824117572e-03
3850.00000  3900.00000  1.492824117572e-03
3900.00000  3950.00000  1.388898022863e-03
3950.00000  4000.00000  1.364401157681e-03
4000.00000  4050.00000  1.365143486929e-03
4050.00000  4100.00000  1.282744940410e-03
4100.00000  4150.00000  1.293137549881e-03
4150.00000  4200.00000  1.200346393891e-03
4200.00000  4250.00000  1.143929371048e-03
4250.00000  4300.00000  1.125371139850e-03
4300.00000  4350.00000  1.123144152107e-03
4350.00000  4400.00000  1.022187374389e-03
4400.00000  4450.00000  1.045199581075e-03
4450.00000  4500.00000  9.657703515471e-04
4500.00000  4550.00000  1.009567777174e-03
4550.00000  4600.00000  9.672550100429e-04
4600.00000  4650.00000  9.509237665886e-04
4650.00000  4700.00000  9.286538891509e-04
4700.00000  4750.00000  8.863411220194e-04
4750.00000  4800.00000  8.766908417964e-04
4800.00000  4850.00000  9.145496334404e-04
4850.00000  4900.00000  8.848564635235e-04
4900.00000  4950.00000  8.009732585083e-04
4950.00000  5000.00000  8.358627331606e-04
5000.00000  5050.00000  7.846420150540e-04
5050.00000  5100.00000  7.000164807908e-04
5100.00000  5150.00000  7.126360780055e-04
5150.00000  5200.00000  7.118937487576e-04
5200.00000  5250.00000  7.111514195097e-04
5250.00000  5300.00000  7.096667610138e-04
5300.00000  5350.00000  7.126360780055e-04
5350.00000  5400.00000  6.450841164446e-04
5400.00000  5450.00000  6.435994579487e-04
5450.00000  5500.00000  6.257835559986e-04
5500.00000  5550.00000  6.421147994529e-04
5550.00000  5600.00000  5.946057275858e-04
5600.00000  5650.00000  6.079676540485e-04
5650.00000  5700.00000  5.901517520983e-04
5700.00000  5750.00000  5.782744841316e-04
5750.00000  5800.00000  5.560046066939e-04
5800.00000  5850.00000  5.485813142147e-04
5850.00000  5900.00000  5.367040462479e-04
5900.00000  5950.00000  5.107225225706e-04
5950.00000  6000.00000  4.966182668601e-04
6000.00000  6050.00000  4.906796328767e-04
6050.00000  6100.00000  4.706367431828e-04
6100.00000  6150.00000  4.943912791163e-04
6150.00000  6200.00000  4.513361827368e-04
6200.00000  6250.00000  4.194160250762e-04
6250.00000  6300.00000  4.543054997285e-04
6300.00000  6350.00000  4.565324874723e-04
6350.00000  6400.00000  4.387165855221e-04
6400.00000  6450.00000  4.105080741011e-04
6450.00000  6500.00000  4.231276713158e-04
6500.00000  6550.00000  4.157043788365e-04
6550.00000  6600.00000  3.956614891426e-04
6600.00000  6650.00000  3.763609286967e-04
6650.00000  6700.00000  3.808149041842e-04
6700.00000  6750.00000  3.748762702008e-04
6750.00000  6800.00000  3.674529777216e-04
6800.00000  6850.00000  3.785879164404e-04
6850.00000  6900.00000  3.563180390028e-04
6900.00000  6950.00000  3.548333805069e-04
6950.00000  7000.00000  3.503794050194e-04
7000.00000  7050.00000  3.162322596149e-04
7050.00000  7100.00000  3.399867955485e-04
7100.00000  7150.00000  3.251402105900e-04
7150.00000  7200.00000  3.429561125402e-04
7200.00000  7250.00000  3.310788445734e-04
7250.00000  7300.00000  3.281095275817e-04
7300.00000  7350.00000  3.199439058546e-04
7350.00000  7400.00000  2.932200529294e-04
7400.00000  7450.00000  2.932200529294e-04
7450.00000  7500.00000  2.880237481939e-04
7500.00000  7550.00000  2.687231877479e-04
7550.00000  7600.00000  3.043549916482e-04
7600.00000  7650.00000  2.768888094751e-04
7650.00000  7700.00000  3.058396501440e-04
7700.00000  7750.00000  2.724348339875e-04
7750.00000  7800.00000  2.598152367728e-04
7800.00000  7850.00000  2.687231877479e-04
7850.00000  7900.00000  2.590729075249e-04
7900.00000  7950.00000  2.731771632354e-04
7950.00000  8000.00000  2.397723470789e-04
8000.00000  8050.00000  2.538766027895e-04
8050.00000  8100.00000  2.382876885831e-04
8100.00000  8150.00000  2.130484941537e-04
8150.00000  8200.00000  2.739194924834e-04
8200.00000  8250.00000  2.278950791122e-04
8250.00000  8300.00000  2.382876885831e-04
8300.00000  8350.00000  2.219564451288e-04
8350.00000  8400.00000  2.115638356579e-04
8400.00000  8450.00000  2.219564451288e-04
8450.00000  8500.00000  2.382876885831e-04
8500.00000  8550.00000  2.115638356579e-04
8550.00000  8600.00000  2.197294573850e-04
8600.00000  8650.00000  2.301220668559e-04
8650.00000  8700.00000  2.004288969390e-04
8700.00000  8750.00000  2.078521894183e-04
8750.00000  8800.00000  2.137908234017e-04
8800.00000  8850.00000  1.922632752119e-04
8850.00000  8900.00000  2.152754818975e-04
8900.00000  8950.00000  2.189871281371e-04
8950.00000  9000.00000  1.826129949889e-04
9000.00000  9050.00000  1.603431175512e-04
9050.00000  9100.00000  1.900362874681e-04
9100.00000  9150.00000  1.796436779972e-04
9150.00000  9200.00000  1.922632752119e-04
9200.00000  9250.00000  1.915209459640e-04
9250.00000  9300.00000  1.796436779972e-04
9300.00000  9350.00000  1.633124345429e-04
9350.00000  9400.00000  1.737050440138e-04
9400.00000  9450.00000  1.803860072451e-04
9450.00000  9500.00000  1.469811910886e-04
9500.00000  9550.00000  1.751897025097e-04
9550.00000  9600.00000  1.506928373282e-04
9600.00000  9650.00000  1.662817515346e-04
9650.00000  9700.00000  1.477235203366e-04
9700.00000  9750.00000  1.521774958241e-04
9750.00000  9800.00000  1.492081788324e-04
9800.00000  9850.00000  1.573738005596e-04
9850.00000  9900.00000  1.403002278573e-04
9900.00000  9950.00000  1.484658495845e-04
9950.00000  10000.00000  1.536621543199e-04
