300.00000  350.00000  7.892504333280e-06
350.00000  400.00000  1.076250590902e-05
400.00000  450.00000  9.686255318116e-06
450.00000  500.00000  1.148000630295e-05
500.00000  550.00000  1.029613065296e-04
550.00000  600.00000  7.533754136313e-06
600.00000  650.00000  3.372251851492e-05
650.00000  700.00000  1.255625689385e-05
700.00000  750.00000  2.331876280287e-05
750.00000  800.00000  1.327375728779e-05
800.00000  850.00000  6.242253427231e-05
850.00000  900.00000  1.578500866656e-05
900.00000  950.00000  1.757875965140e-05
950.00000  1000.00000  1.901376043927e-05
1000.00000  1050.00000  2.296001260591e-05
1050.00000  1100.00000  2.618876437861e-05
1100.00000  1150.00000  4.125627265124e-05
1150.00000  1200.00000  7.139128919649e-05
1200.00000  1250.00000  1.094188100750e-04
1250.00000  1300.00000  2.256538738924e-04
1300.00000  1350.00000  1.739938455291e-04
1350.00000  1400.00000  2.511251378771e-04
1400.00000  1450.00000  3.508576926340e-04
1450.00000  1500.00000  4.620702536938e-04
1500.00000  1550.00000  5.804578186930e-04
1550.00000  1600.00000  7.053028872377e-04
1600.00000  1650.00000  7.949904364795e-04
1650.00000  1700.00000  8.957992418273e-04
1700.00000  1750.00000  1.141184376553e-03
1750.00000  1800.00000  1.112484360796e-03
1800.00000  1850.00000  1.117506863553e-03
1850.00000  1900.00000  1.111408110205e-03
1900.00000  1950.00000  1.211858165355e-03
1950.00000  2000.00000  1.306926967552e-03
2000.00000  2050.00000  1.351770742173e-03
2050.00000  2100.00000  1.393027014824e-03
2100.00000  2150.00000  1.437512039248e-03
2150.00000  2200.00000  1.454732048702e-03
2200.00000  2250.00000  1.432130786293e-03
2250.00000  2300.00000  1.459395801263e-03
2300.00000  2350.00000  1.650968406443e-03
2350.00000  2400.00000  1.432848286687e-03
2400.00000  2450.00000  1.466212055005e-03
2450.00000  2500.00000  1.356434494733e-03
2500.00000  2550.00000  1.319841974643e-03
2550.00000  2600.00000  1.290065708294e-03
2600.00000  2650.00000  1.268181946279e-03
2650.00000  2700.00000  1.258495690961e-03
2700.00000  2750.00000  1.194996906098e-03
2750.00000  2800.00000  1.157686885613e-03
2800.00000  2850.00000  1.156969385219e-03
2850.00000  2900.00000  1.114995612174e-03
2900.00000  2950.00000  1.090959348977e-03
2950.00000  3000.00000  1.093111850159e-03
3000.00000  3050.00000  1.016339308008e-03
3050.00000  3100.00000  9.772355365388e-04
3100.00000  3150.00000  9.488942709784e-04
3150.00000  3200.00000  9.575042757056e-04
3200.00000  3250.00000  9.284455097513e-04
3250.00000  3300.00000  8.757092307971e-04
3300.00000  3350.00000  8.401929612973e-04
3350.00000  3400.00000  8.082641937673e-04
3400.00000  3450.00000  7.885329329341e-04
3450.00000  3500.00000  7.566041654040e-04
3500.00000  3550.00000  7.627029187524e-04
3550.00000  3600.00000  7.225228966921e-04
3600.00000  3650.00000  6.719391189197e-04
3650.00000  3700.00000  6.934641307377e-04
3700.00000  3750.00000  6.263778439049e-04
3750.00000  3800.00000  6.181265893746e-04
3800.00000  3850.00000  6.087990842535e-04
3850.00000  3900.00000  5.686190621931e-04
3900.00000  3950.00000  5.546278045114e-04
3950.00000  4000.00000  5.327440424964e-04
4000.00000  4050.00000  4.947165216179e-04
4050.00000  4100.00000  5.108602804814e-04
4100.00000  4150.00000  4.864652670876e-04
4150.00000  4200.00000  4.706802584211e-04
4200.00000  4250.00000  4.541777493606e-04
4250.00000  4300.00000  4.441327438455e-04
4300.00000  4350.00000  4.190202300578e-04
4350.00000  4400.00000  4.129214767093e-04
4400.00000  4450.00000  4.007239700124e-04
4450.00000  4500.00000  3.784814578005e-04
4500.00000  4550.00000  3.698714530733e-04
4550.00000  4600.00000  3.479876910583e-04
4600.00000  4650.00000  3.217989266796e-04
4650.00000  4700.00000  3.200051756948e-04
4700.00000  4750.00000  3.372251851492e-04
4750.00000  4800.00000  3.078076689979e-04
4800.00000  4850.00000  3.067314184070e-04
4850.00000  4900.00000  2.905876595435e-04
4900.00000  4950.00000  2.798251536345e-04
4950.00000  5000.00000  2.920226603314e-04
5000.00000  5050.00000  2.658338959527e-04
5050.00000  5100.00000  2.658338959527e-04
5100.00000  5150.00000  2.468201355135e-04
5150.00000  5200.00000  2.475376359074e-04
5200.00000  5250.00000  2.500488872862e-04
5250.00000  5300.00000  2.396451315741e-04
5300.00000  5350.00000  2.335463782257e-04
5350.00000  5400.00000  2.324701276348e-04
5400.00000  5450.00000  2.206313711349e-04
5450.00000  5500.00000  2.048463624683e-04
5500.00000  5550.00000  1.965951079381e-04
5550.00000  5600.00000  1.861913522260e-04
5600.00000  5650.00000  1.912138549836e-04
5650.00000  5700.00000  1.836801008472e-04
5700.00000  5750.00000  1.736350953322e-04
5750.00000  5800.00000  1.729175949382e-04
5800.00000  5850.00000  1.592850874535e-04
5850.00000  5900.00000  1.711238439534e-04
5900.00000  5950.00000  1.556975854838e-04
5950.00000  6000.00000  1.607200882413e-04
6000.00000  6050.00000  1.510338329232e-04
6050.00000  6100.00000  1.499575823323e-04
6100.00000  6150.00000  1.467288305596e-04
6150.00000  6200.00000  1.341725736658e-04
6200.00000  6250.00000  1.420650779990e-04
6250.00000  6300.00000  1.366838250445e-04
6300.00000  6350.00000  1.330963230749e-04
6350.00000  6400.00000  5.040440267390e-04
6400.00000  6450.00000  1.162350638174e-04
6450.00000  6500.00000  1.140825626356e-04
6500.00000  6550.00000  1.140825626356e-04
6550.00000  6600.00000  1.165938140144e-04
6600.00000  6650.00000  1.155175634235e-04
6650.00000  6700.00000  1.076250590902e-04
6700.00000  6750.00000  1.104950606659e-04
6750.00000  6800.00000  9.901505436297e-05
6800.00000  6850.00000  9.937380455993e-05
6850.00000  6900.00000  9.148130022665e-05
6900.00000  6950.00000  8.179504490854e-05
6950.00000  7000.00000  8.789379825698e-05
7000.00000  7050.00000  8.861129865092e-05
7050.00000  7100.00000  1.334550732718e-04
7100.00000  7150.00000  7.641379195403e-05
7150.00000  7200.00000  7.067378880255e-05
7200.00000  7250.00000  6.888003781772e-05
7250.00000  7300.00000  7.533754136313e-05
7300.00000  7350.00000  7.641379195403e-05
7350.00000  7400.00000  7.426129077223e-05
7400.00000  7450.00000  6.959753821165e-05
7450.00000  7500.00000  8.645879746911e-05
7500.00000  7550.00000  7.462004096919e-05
7550.00000  7600.00000  7.533754136313e-05
7600.00000  7650.00000  6.493378565108e-05
7650.00000  7700.00000  6.314003466624e-05
7700.00000  7750.00000  6.349878486321e-05
7750.00000  7800.00000  5.775878171173e-05
7800.00000  7850.00000  6.672753663591e-05
7850.00000  7900.00000  6.457503545411e-05
7900.00000  7950.00000  5.668253112083e-05
7950.00000  8000.00000  6.493378565108e-05
8000.00000  8050.00000  5.022502757542e-05
8050.00000  8100.00000  5.704128131780e-05
8100.00000  8150.00000  4.843127659058e-05
8150.00000  8200.00000  5.488878013599e-05
8200.00000  8250.00000  5.560628052993e-05
8250.00000  8300.00000  5.453002993903e-05
8300.00000  8350.00000  5.560628052993e-05
8350.00000  8400.00000  5.309502915116e-05
8400.00000  8450.00000  5.560628052993e-05
8450.00000  8500.00000  4.950752718148e-05
8500.00000  8550.00000  5.058377777239e-05
8550.00000  8600.00000  4.663752560575e-05
8600.00000  8650.00000  5.381252954509e-05
8650.00000  8700.00000  4.520252481788e-05
8700.00000  8750.00000  4.340877383304e-05
8750.00000  8800.00000  4.125627265124e-05
8800.00000  8850.00000  4.161502284820e-05
8850.00000  8900.00000  4.269127343911e-05
8900.00000  8950.00000  4.161502284820e-05
8950.00000  9000.00000  4.699627580271e-05
9000.00000  9050.00000  3.982127186337e-05
9050.00000  9100.00000  4.340877383304e-05
9100.00000  9150.00000  4.018002206033e-05
9150.00000  9200.00000  4.197377304517e-05
9200.00000  9250.00000  3.515751930279e-05
9250.00000  9300.00000  3.049376674222e-05
9300.00000  9350.00000  3.910377146943e-05
9350.00000  9400.00000  3.157001733312e-05
9400.00000  9450.00000  3.766877068156e-05
9450.00000  9500.00000  3.336376831796e-05
9500.00000  9550.00000  3.264626792402e-05
9550.00000  9600.00000  3.264626792402e-05
9600.00000  9650.00000  2.726501496951e-05
9650.00000  9700.00000  3.049376674222e-05
9700.00000  9750.00000  3.300501812099e-05
9750.00000  9800.00000  3.121126713615e-05
9800.00000  9850.00000  3.479876910583e-05
9850.00000  9900.00000  2.870001575738e-05
9900.00000  9950.00000  3.157001733312e-05
9950.00000  10000.00000  2.905876595435e-05
