300.00000  350.00000  4.652909888511e-01
350.00000  400.00000  3.486820764565e-01
400.00000  450.00000  2.717911146557e-01
450.00000  500.00000  2.173104126642e-01
500.00000  550.00000  1.781011598849e-01
550.00000  600.00000  1.480760237405e-01
600.00000  650.00000  1.246693978628e-01
650.00000  700.00000  1.070596790817e-01
700.00000  750.00000  9.291875003007e-02
750.00000  800.00000  8.106206633176e-02
800.00000  850.00000  7.166620377838e-02
850.00000  900.00000  6.370361453957e-02
900.00000  950.00000  5.678706464112e-02
950.00000  1000.00000  5.118123648114e-02
1000.00000  1050.00000  4.649672061367e-02
1050.00000  1100.00000  4.222554438156e-02
1100.00000  1150.00000  3.845690212719e-02
1150.00000  1200.00000  3.541595517824e-02
1200.00000  1250.00000  3.230648086868e-02
1250.00000  1300.00000  3.001280847104e-02
1300.00000  1350.00000  2.766511185789e-02
1350.00000  1400.00000  2.555272877400e-02
1400.00000  1450.00000  2.397007306490e-02
1450.00000  1500.00000  2.224238590480e-02
1500.00000  1550.00000  2.085951101946e-02
1550.00000  1600.00000  1.962674368592e-02
1600.00000  1650.00000  1.840485371120e-02
1650.00000  1700.00000  1.720580619001e-02
1700.00000  1750.00000  1.651690679774e-02
1750.00000  1800.00000  1.553721934620e-02
1800.00000  1850.00000  1.460285422310e-02
1850.00000  1900.00000  1.388676143376e-02
1900.00000  1950.00000  1.306914662871e-02
1950.00000  2000.00000  1.241251673429e-02
2000.00000  2050.00000  1.179468275301e-02
2050.00000  2100.00000  1.122289625742e-02
2100.00000  2150.00000  1.071528617890e-02
2150.00000  2200.00000  1.027620346098e-02
2200.00000  2250.00000  9.754090237361e-03
2250.00000  2300.00000  9.417617271029e-03
2300.00000  2350.00000  9.030383296845e-03
2350.00000  2400.00000  8.513708752638e-03
2400.00000  2450.00000  8.303413148681e-03
2450.00000  2500.00000  7.921617853909e-03
2500.00000  2550.00000  7.615238913661e-03
2550.00000  2600.00000  7.353819723223e-03
2600.00000  2650.00000  7.127933238283e-03
2650.00000  2700.00000  6.679060897421e-03
2700.00000  2750.00000  6.432144852085e-03
2750.00000  2800.00000  6.355278183052e-03
2800.00000  2850.00000  6.042372827508e-03
2850.00000  2900.00000  5.885738860422e-03
2900.00000  2950.00000  5.687045772545e-03
2950.00000  3000.00000  5.455358029564e-03
3000.00000  3050.00000  5.297273747968e-03
3050.00000  3100.00000  5.163482234416e-03
3100.00000  3150.00000  4.958625309871e-03
3150.00000  3200.00000  4.882846376721e-03
3200.00000  3250.00000  4.665299200213e-03
3250.00000  3300.00000  4.534045737053e-03
3300.00000  3350.00000  4.442675922920e-03
3350.00000  3400.00000  4.311422459760e-03
3400.00000  3450.00000  4.203011450133e-03
3450.00000  3500.00000  4.040213646380e-03
3500.00000  3550.00000  3.922738171066e-03
3550.00000  3600.00000  3.783870556728e-03
3600.00000  3650.00000  3.657330615726e-03
3650.00000  3700.00000  3.603306400227e-03
3700.00000  3750.00000  3.542393190804e-03
3750.00000  3800.00000  3.488368975305e-03
3800.00000  3850.00000  3.316506705864e-03
3850.00000  3900.00000  3.253418024676e-03
3900.00000  3950.00000  3.167124311328e-03
3950.00000  4000.00000  3.067777767389e-03
4000.00000  4050.00000  3.014841287773e-03
4050.00000  4100.00000  2.928910153052e-03
4100.00000  4150.00000  2.897728391086e-03
4150.00000  4200.00000  2.825937822838e-03
4200.00000  4250.00000  2.790042538714e-03
4250.00000  4300.00000  2.616729954763e-03
4300.00000  4350.00000  2.630145363981e-03
4350.00000  4400.00000  2.512669888667e-03
4400.00000  4450.00000  2.455019886892e-03
4450.00000  4500.00000  2.444142528067e-03
4500.00000  4550.00000  2.379966110997e-03
4550.00000  4600.00000  2.316877429810e-03
4600.00000  4650.00000  2.287508560981e-03
4650.00000  4700.00000  2.199401954495e-03
4700.00000  4750.00000  2.201940004888e-03
4750.00000  4800.00000  2.112745662520e-03
4800.00000  4850.00000  2.079388428788e-03
4850.00000  4900.00000  2.073224592121e-03
4900.00000  4950.00000  2.036241572114e-03
4950.00000  5000.00000  1.953211066414e-03
5000.00000  5050.00000  1.931818927391e-03
5050.00000  5100.00000  1.915140310525e-03
5100.00000  5150.00000  1.833922697962e-03
5150.00000  5200.00000  1.810717665801e-03
5200.00000  5250.00000  1.804191250506e-03
5250.00000  5300.00000  1.773009488540e-03
5300.00000  5350.00000  1.687803511074e-03
5350.00000  5400.00000  1.708470492842e-03
5400.00000  5450.00000  1.659884956756e-03
5450.00000  5500.00000  1.579392501448e-03
5500.00000  5550.00000  1.613474892434e-03
5550.00000  5600.00000  1.602597533609e-03
5600.00000  5650.00000  1.587006652625e-03
5650.00000  5700.00000  1.489110423197e-03
5700.00000  5750.00000  1.495274259865e-03
5750.00000  5800.00000  1.460104132996e-03
5800.00000  5850.00000  1.427834635147e-03
5850.00000  5900.00000  1.408980546516e-03
5900.00000  5950.00000  1.367646582980e-03
5950.00000  6000.00000  1.364020796705e-03
6000.00000  6050.00000  1.328850669836e-03
6050.00000  6100.00000  1.303107587283e-03
6100.00000  6150.00000  1.277001926102e-03
6150.00000  6200.00000  1.303107587283e-03
6200.00000  6250.00000  1.303107587283e-03
6250.00000  6300.00000  1.233855069428e-03
6300.00000  6350.00000  1.184906954713e-03
6350.00000  6400.00000  1.733488418141e-03
6400.00000  6450.00000  1.196509470794e-03
6450.00000  6500.00000  1.175117331770e-03
6500.00000  6550.00000  1.178380539418e-03
6550.00000  6600.00000  1.130157581959e-03
6600.00000  6650.00000  1.154087771375e-03
6650.00000  6700.00000  1.121818273526e-03
6700.00000  6750.00000  1.113478965093e-03
6750.00000  6800.00000  1.072507580184e-03
6800.00000  6850.00000  1.043138711356e-03
6850.00000  6900.00000  1.021383993705e-03
6900.00000  6950.00000  1.001079590564e-03
6950.00000  7000.00000  9.938280180138e-04
7000.00000  7050.00000  9.985415401715e-04
7050.00000  7100.00000  1.037700031943e-03
7100.00000  7150.00000  9.619210987926e-04
7150.00000  7200.00000  9.481431109471e-04
7200.00000  7250.00000  9.405289597693e-04
7250.00000  7300.00000  9.278387078064e-04
7300.00000  7350.00000  8.509720387736e-04
7350.00000  7400.00000  8.781654358371e-04
7400.00000  7450.00000  8.941188954476e-04
7450.00000  7500.00000  8.926685809376e-04
7500.00000  7550.00000  8.440830448508e-04
7550.00000  7600.00000  8.353811577905e-04
7600.00000  7650.00000  8.346560005355e-04
7650.00000  7700.00000  8.092754966095e-04
7700.00000  7750.00000  8.031116599418e-04
7750.00000  7800.00000  8.096380752371e-04
7800.00000  7850.00000  7.820820995461e-04
7850.00000  7900.00000  7.867956217037e-04
7900.00000  7950.00000  7.766434201334e-04
7950.00000  8000.00000  7.643157467979e-04
8000.00000  8050.00000  7.588770673852e-04
8050.00000  8100.00000  7.559764383651e-04
8100.00000  8150.00000  6.968761220804e-04
8150.00000  8200.00000  7.066657450233e-04
8200.00000  8250.00000  6.823729769799e-04
8250.00000  8300.00000  7.070283236508e-04
8300.00000  8350.00000  6.838232914900e-04
8350.00000  8400.00000  6.733085112921e-04
8400.00000  8450.00000  6.588053661916e-04
8450.00000  8500.00000  6.791097693323e-04
8500.00000  8550.00000  6.631563097217e-04
8550.00000  8600.00000  6.566298944265e-04
8600.00000  8650.00000  6.366880699132e-04
8650.00000  8700.00000  6.356003340307e-04
8700.00000  8750.00000  6.439396424635e-04
8750.00000  8800.00000  5.986173140244e-04
8800.00000  8850.00000  6.265358683429e-04
8850.00000  8900.00000  6.200094530476e-04
8900.00000  8950.00000  6.268984469704e-04
8950.00000  9000.00000  6.007927857894e-04
9000.00000  9050.00000  5.830264330413e-04
9050.00000  9100.00000  5.957166850042e-04
9100.00000  9150.00000  6.007927857894e-04
9150.00000  9200.00000  5.634471871556e-04
9200.00000  9250.00000  5.619968726455e-04
9250.00000  9300.00000  5.746871246085e-04
9300.00000  9350.00000  5.445930985249e-04
9350.00000  9400.00000  5.471311489175e-04
9400.00000  9450.00000  5.420550481323e-04
9450.00000  9500.00000  5.322654251894e-04
9500.00000  9550.00000  5.395169977397e-04
9550.00000  9600.00000  5.268267457767e-04
9600.00000  9650.00000  5.188500159714e-04
9650.00000  9700.00000  5.043468708709e-04
9700.00000  9750.00000  5.137739151863e-04
9750.00000  9800.00000  5.061597640085e-04
9800.00000  9850.00000  4.978204555757e-04
9850.00000  9900.00000  4.800541028275e-04
9900.00000  9950.00000  4.880308326328e-04
9950.00000  10000.00000  4.905688830254e-04
