300.00000  350.00000  7.508110904381e-07
350.00000  400.00000  4.504866542628e-06
400.00000  450.00000  8.258921994819e-06
450.00000  500.00000  9.009733085257e-06
500.00000  550.00000  8.934651976213e-05
550.00000  600.00000  6.757299813943e-06
600.00000  650.00000  2.402595489402e-05
650.00000  700.00000  1.201297744701e-05
700.00000  750.00000  2.027189944183e-05
750.00000  800.00000  1.426541071832e-05
800.00000  850.00000  5.105515414979e-05
850.00000  900.00000  1.651784398964e-05
900.00000  950.00000  1.426541071832e-05
950.00000  1000.00000  1.051135526613e-05
1000.00000  1050.00000  1.351459962789e-05
1050.00000  1100.00000  1.126216635657e-05
1100.00000  1150.00000  1.651784398964e-05
1150.00000  1200.00000  1.576703289920e-05
1200.00000  1250.00000  1.501622180876e-05
1250.00000  1300.00000  4.880272087847e-05
1300.00000  1350.00000  2.027189944183e-05
1350.00000  1400.00000  1.651784398964e-05
1400.00000  1450.00000  1.201297744701e-05
1450.00000  1500.00000  1.726865508008e-05
1500.00000  1550.00000  1.576703289920e-05
1550.00000  1600.00000  1.576703289920e-05
1600.00000  1650.00000  1.726865508008e-05
1650.00000  1700.00000  2.102271053227e-05
1700.00000  1750.00000  5.480920960198e-05
1750.00000  1800.00000  1.801946617051e-05
1800.00000  1850.00000  1.952108835139e-05
1850.00000  1900.00000  2.177352162270e-05
1900.00000  1950.00000  2.027189944183e-05
1950.00000  2000.00000  1.276378853745e-05
2000.00000  2050.00000  1.651784398964e-05
2050.00000  2100.00000  1.651784398964e-05
2100.00000  2150.00000  2.177352162270e-05
2150.00000  2200.00000  2.102271053227e-05
2200.00000  2250.00000  2.252433271314e-05
2250.00000  2300.00000  1.651784398964e-05
2300.00000  2350.00000  6.907462032030e-05
2350.00000  2400.00000  1.726865508008e-05
2400.00000  2450.00000  2.552757707489e-05
2450.00000  2500.00000  2.702919925577e-05
2500.00000  2550.00000  2.252433271314e-05
2550.00000  2600.00000  2.102271053227e-05
2600.00000  2650.00000  2.327514380358e-05
2650.00000  2700.00000  2.102271053227e-05
2700.00000  2750.00000  2.027189944183e-05
2750.00000  2800.00000  3.303568797927e-05
2800.00000  2850.00000  2.402595489402e-05
2850.00000  2900.00000  2.177352162270e-05
2900.00000  2950.00000  2.252433271314e-05
2950.00000  3000.00000  5.631083178285e-05
3000.00000  3050.00000  3.003244361752e-05
3050.00000  3100.00000  2.928163252708e-05
3100.00000  3150.00000  2.627838816533e-05
3150.00000  3200.00000  3.754055452190e-05
3200.00000  3250.00000  3.378649906971e-05
3250.00000  3300.00000  3.153406579840e-05
3300.00000  3350.00000  4.429785433585e-05
3350.00000  3400.00000  3.904217670278e-05
3400.00000  3450.00000  4.429785433585e-05
3450.00000  3500.00000  4.730109869760e-05
3500.00000  3550.00000  5.480920960198e-05
3550.00000  3600.00000  6.757299813943e-05
3600.00000  3650.00000  8.334003103863e-05
3650.00000  3700.00000  1.133724746561e-04
3700.00000  3750.00000  1.013594972091e-04
3750.00000  3800.00000  9.009733085257e-05
3800.00000  3850.00000  1.028611193900e-04
3850.00000  3900.00000  1.118708524753e-04
3900.00000  3950.00000  1.223822077414e-04
3950.00000  4000.00000  1.141232857466e-04
4000.00000  4050.00000  1.261362631936e-04
4050.00000  4100.00000  1.426541071832e-04
4100.00000  4150.00000  1.636768177155e-04
4150.00000  4200.00000  1.479097848163e-04
4200.00000  4250.00000  1.719357397103e-04
4250.00000  4300.00000  2.004665611470e-04
4300.00000  4350.00000  2.012173722374e-04
4350.00000  4400.00000  2.079746720513e-04
4400.00000  4450.00000  2.192368384079e-04
4450.00000  4500.00000  2.109779164131e-04
4500.00000  4550.00000  2.320006269454e-04
4550.00000  4600.00000  2.342530602167e-04
4600.00000  4650.00000  2.417611711211e-04
4650.00000  4700.00000  2.717936147386e-04
4700.00000  4750.00000  2.560265818394e-04
4750.00000  4800.00000  2.995736250848e-04
4800.00000  4850.00000  2.695411814673e-04
4850.00000  4900.00000  2.830557810951e-04
4900.00000  4950.00000  3.093341692605e-04
4950.00000  5000.00000  3.303568797927e-04
5000.00000  5050.00000  3.318585019736e-04
5050.00000  5100.00000  3.348617463354e-04
5100.00000  5150.00000  3.273536354310e-04
5150.00000  5200.00000  3.663958121338e-04
5200.00000  5250.00000  3.543828346868e-04
5250.00000  5300.00000  3.821628450330e-04
5300.00000  5350.00000  4.121952886505e-04
5350.00000  5400.00000  3.791596006712e-04
5400.00000  5450.00000  3.799104117617e-04
5450.00000  5500.00000  3.844152783043e-04
5500.00000  5550.00000  4.016839333844e-04
5550.00000  5600.00000  4.287131326401e-04
5600.00000  5650.00000  3.986806890226e-04
5650.00000  5700.00000  4.362212435445e-04
5700.00000  5750.00000  4.061887999270e-04
5750.00000  5800.00000  4.534898986246e-04
5800.00000  5850.00000  4.309655659114e-04
5850.00000  5900.00000  4.242082660975e-04
5900.00000  5950.00000  4.106936664696e-04
5950.00000  6000.00000  4.354704324541e-04
6000.00000  6050.00000  4.204542106453e-04
6050.00000  6100.00000  4.369720546350e-04
6100.00000  6150.00000  4.279623215497e-04
6150.00000  6200.00000  4.384736768158e-04
6200.00000  6250.00000  5.165580302214e-04
6250.00000  6300.00000  5.368299296632e-04
6300.00000  6350.00000  5.263185743971e-04
6350.00000  6400.00000  1.747137407449e-03
6400.00000  6450.00000  4.414769211776e-04
6450.00000  6500.00000  4.549915208055e-04
6500.00000  6550.00000  4.294639437306e-04
6550.00000  6600.00000  4.159493441027e-04
6600.00000  6650.00000  4.519882764437e-04
6650.00000  6700.00000  4.324671880923e-04
6700.00000  6750.00000  4.407261100871e-04
6750.00000  6800.00000  4.489850320820e-04
6800.00000  6850.00000  4.099428553792e-04
6850.00000  6900.00000  4.527390875342e-04
6900.00000  6950.00000  4.737617980664e-04
6950.00000  7000.00000  4.302147548210e-04
7000.00000  7050.00000  4.309655659114e-04
7050.00000  7100.00000  5.375807407537e-04
7100.00000  7150.00000  2.335022491262e-04
7150.00000  7200.00000  2.380071156689e-04
7200.00000  7250.00000  2.094762942322e-04
7250.00000  7300.00000  2.289973825836e-04
7300.00000  7350.00000  2.380071156689e-04
7350.00000  7400.00000  2.087254831418e-04
7400.00000  7450.00000  1.967125056948e-04
7450.00000  7500.00000  2.665379371055e-04
7500.00000  7550.00000  2.274957604027e-04
7550.00000  7600.00000  2.327514380358e-04
7600.00000  7650.00000  2.237417049505e-04
7650.00000  7700.00000  2.207384605888e-04
7700.00000  7750.00000  2.237417049505e-04
7750.00000  7800.00000  2.357546823976e-04
7800.00000  7850.00000  2.372563045784e-04
7850.00000  7900.00000  2.327514380358e-04
7900.00000  7950.00000  2.380071156689e-04
7950.00000  8000.00000  2.297481936740e-04
8000.00000  8050.00000  2.560265818394e-04
8050.00000  8100.00000  2.440136043924e-04
8100.00000  8150.00000  2.365054934880e-04
8150.00000  8200.00000  2.289973825836e-04
8200.00000  8250.00000  2.124795385940e-04
8250.00000  8300.00000  2.372563045784e-04
8300.00000  8350.00000  2.169844051366e-04
8350.00000  8400.00000  2.184860273175e-04
8400.00000  8450.00000  2.064730498705e-04
8450.00000  8500.00000  2.064730498705e-04
8500.00000  8550.00000  2.432627933019e-04
8550.00000  8600.00000  2.342530602167e-04
8600.00000  8650.00000  2.327514380358e-04
8650.00000  8700.00000  2.199876494984e-04
8700.00000  8750.00000  2.297481936740e-04
8750.00000  8800.00000  2.139811607748e-04
8800.00000  8850.00000  2.282465714932e-04
8850.00000  8900.00000  2.297481936740e-04
8900.00000  8950.00000  2.027189944183e-04
8950.00000  9000.00000  2.282465714932e-04
9000.00000  9050.00000  2.402595489402e-04
9050.00000  9100.00000  2.297481936740e-04
9100.00000  9150.00000  2.244925160410e-04
9150.00000  9200.00000  2.117287275035e-04
9200.00000  9250.00000  2.049714276896e-04
9250.00000  9300.00000  2.320006269454e-04
9300.00000  9350.00000  2.147319718653e-04
9350.00000  9400.00000  2.477676598446e-04
9400.00000  9450.00000  2.320006269454e-04
9450.00000  9500.00000  2.049714276896e-04
9500.00000  9550.00000  2.004665611470e-04
9550.00000  9600.00000  2.192368384079e-04
9600.00000  9650.00000  2.162335940462e-04
9650.00000  9700.00000  2.162335940462e-04
9700.00000  9750.00000  2.395087378497e-04
9750.00000  9800.00000  2.057222387800e-04
9800.00000  9850.00000  2.034698055087e-04
9850.00000  9900.00000  2.042206165992e-04
9900.00000  9950.00000  2.124795385940e-04
9950.00000  10000.00000  2.237417049505e-04
