300.00000  350.00000  6.355972644971e-02
350.00000  400.00000  4.785027156755e-02
400.00000  450.00000  3.688359812168e-02
450.00000  500.00000  2.963332876082e-02
500.00000  550.00000  2.416828178104e-02
550.00000  600.00000  2.025427674545e-02
600.00000  650.00000  1.699870246352e-02
650.00000  700.00000  1.465761533943e-02
700.00000  750.00000  1.276444761148e-02
750.00000  800.00000  1.103803930643e-02
800.00000  850.00000  9.793978149338e-03
850.00000  900.00000  8.762580084252e-03
900.00000  950.00000  7.758437322694e-03
950.00000  1000.00000  6.921053984038e-03
1000.00000  1050.00000  6.411810154962e-03
1050.00000  1100.00000  5.803227916975e-03
1100.00000  1150.00000  5.232659654961e-03
1150.00000  1200.00000  4.832437039997e-03
1200.00000  1250.00000  4.436876516427e-03
1250.00000  1300.00000  4.097619711986e-03
1300.00000  1350.00000  3.813949381846e-03
1350.00000  1400.00000  3.513423798208e-03
1400.00000  1450.00000  3.255215659522e-03
1450.00000  1500.00000  3.111408071170e-03
1500.00000  1550.00000  2.863599982514e-03
1550.00000  1600.00000  2.671736990574e-03
1600.00000  1650.00000  2.483818845196e-03
1650.00000  1700.00000  2.307735239509e-03
1700.00000  1750.00000  2.249997030719e-03
1750.00000  1800.00000  2.103679085464e-03
1800.00000  1850.00000  1.993940626522e-03
1850.00000  1900.00000  1.875236607209e-03
1900.00000  1950.00000  1.771953351735e-03
1950.00000  2000.00000  1.676918411802e-03
2000.00000  2050.00000  1.679070146291e-03
2050.00000  2100.00000  1.525221130324e-03
2100.00000  2150.00000  1.472503635342e-03
2150.00000  2200.00000  1.389303235098e-03
2200.00000  2250.00000  1.324033955597e-03
2250.00000  2300.00000  1.265578501978e-03
2300.00000  2350.00000  1.229716260494e-03
2350.00000  2400.00000  1.175205653438e-03
2400.00000  2450.00000  1.109936373936e-03
2450.00000  2500.00000  1.076584489356e-03
2500.00000  2550.00000  1.062598215177e-03
2550.00000  2600.00000  9.736598562963e-04
2600.00000  2650.00000  9.381562372270e-04
2650.00000  2700.00000  9.403079717160e-04
2700.00000  2750.00000  8.811352732671e-04
2750.00000  2800.00000  8.571075714726e-04
2800.00000  2850.00000  8.216039524033e-04
2850.00000  2900.00000  8.126383920322e-04
2900.00000  2950.00000  7.480863573606e-04
2950.00000  3000.00000  7.584864073911e-04
3000.00000  3050.00000  7.115068710468e-04
3050.00000  3100.00000  7.118654934616e-04
3100.00000  3150.00000  7.021826882609e-04
3150.00000  3200.00000  6.448031018861e-04
3200.00000  3250.00000  6.283064708034e-04
3250.00000  3300.00000  5.773820878958e-04
3300.00000  3350.00000  5.902924948301e-04
3350.00000  3400.00000  5.816855568739e-04
3400.00000  3450.00000  5.529957636865e-04
3450.00000  3500.00000  5.443888257303e-04
3500.00000  3550.00000  5.684165275247e-04
3550.00000  3600.00000  5.540716309311e-04
3600.00000  3650.00000  5.081679618313e-04
3650.00000  3700.00000  4.931058204079e-04
3700.00000  3750.00000  4.532987323604e-04
3750.00000  3800.00000  4.708712306877e-04
3800.00000  3850.00000  4.615470479018e-04
3850.00000  3900.00000  4.450504168191e-04
3900.00000  3950.00000  4.518642427011e-04
3950.00000  4000.00000  4.378779685222e-04
4000.00000  4050.00000  4.350089892035e-04
4050.00000  4100.00000  4.102640425794e-04
4100.00000  4150.00000  3.862363407850e-04
4150.00000  4200.00000  3.729673114358e-04
4200.00000  4250.00000  3.790638924881e-04
4250.00000  4300.00000  3.586224148421e-04
4300.00000  4350.00000  3.736845562655e-04
4350.00000  4400.00000  3.543189458640e-04
4400.00000  4450.00000  3.406912941000e-04
4450.00000  4500.00000  3.374636923664e-04
4500.00000  4550.00000  3.206084388688e-04
4550.00000  4600.00000  3.277808871657e-04
4600.00000  4650.00000  3.166635923056e-04
4650.00000  4700.00000  2.944290025854e-04
4700.00000  4750.00000  3.005255836377e-04
4750.00000  4800.00000  2.915600232666e-04
4800.00000  4850.00000  2.894082887776e-04
4850.00000  4900.00000  2.800841059917e-04
4900.00000  4950.00000  2.646633421535e-04
4950.00000  5000.00000  2.696840559613e-04
5000.00000  5050.00000  2.840289525550e-04
5050.00000  5100.00000  2.625116076644e-04
5100.00000  5150.00000  2.693254335464e-04
5150.00000  5200.00000  2.614357404199e-04
5200.00000  5250.00000  2.678909438871e-04
5250.00000  5300.00000  2.460149765817e-04
5300.00000  5350.00000  2.435046196778e-04
5350.00000  5400.00000  2.481667110707e-04
5400.00000  5450.00000  2.463735989965e-04
5450.00000  5500.00000  2.345390593067e-04
5500.00000  5550.00000  2.162493161498e-04
5550.00000  5600.00000  2.162493161498e-04
5600.00000  5650.00000  2.148148264904e-04
5650.00000  5700.00000  2.166079385646e-04
5700.00000  5750.00000  2.058492661194e-04
5750.00000  5800.00000  2.194769178834e-04
5800.00000  5850.00000  2.209114075427e-04
5850.00000  5900.00000  2.026216643858e-04
5900.00000  5950.00000  1.889940126218e-04
5950.00000  6000.00000  1.925802367702e-04
6000.00000  6050.00000  1.990354402374e-04
6050.00000  6100.00000  1.968837057483e-04
6100.00000  6150.00000  1.778767177617e-04
6150.00000  6200.00000  1.646076884125e-04
6200.00000  6250.00000  1.789525850062e-04
6250.00000  6300.00000  1.836146763992e-04
6300.00000  6350.00000  1.674766677313e-04
6350.00000  6400.00000  3.231187957727e-04
6400.00000  6450.00000  1.782353401765e-04
6450.00000  6500.00000  1.531317711376e-04
6500.00000  6550.00000  1.664008004867e-04
6550.00000  6600.00000  1.570766177008e-04
6600.00000  6650.00000  1.653249332422e-04
6650.00000  6700.00000  1.538490159673e-04
6700.00000  6750.00000  1.488283021595e-04
6750.00000  6800.00000  1.531317711376e-04
6800.00000  6850.00000  1.638904435828e-04
6850.00000  6900.00000  1.484696797446e-04
6900.00000  6950.00000  1.420144762775e-04
6950.00000  7000.00000  1.459593228407e-04
7000.00000  7050.00000  1.470351900853e-04
7050.00000  7100.00000  1.671180453164e-04
7100.00000  7150.00000  1.269523348541e-04
7150.00000  7200.00000  1.355592728103e-04
7200.00000  7250.00000  1.291040693432e-04
7250.00000  7300.00000  1.359178952252e-04
7300.00000  7350.00000  1.298213141728e-04
7350.00000  7400.00000  1.208557538018e-04
7400.00000  7450.00000  1.187040193127e-04
7450.00000  7500.00000  1.412972314478e-04
7500.00000  7550.00000  1.158350399940e-04
7550.00000  7600.00000  1.240833555354e-04
7600.00000  7650.00000  1.104557037714e-04
7650.00000  7700.00000  1.108143261862e-04
7700.00000  7750.00000  1.104557037714e-04
7750.00000  7800.00000  1.165522848237e-04
7800.00000  7850.00000  1.090212141120e-04
7850.00000  7900.00000  1.100970813565e-04
7900.00000  7950.00000  1.118901934307e-04
7950.00000  8000.00000  1.025660106448e-04
8000.00000  8050.00000  1.122488158456e-04
8050.00000  8100.00000  9.826254166674e-05
8100.00000  8150.00000  1.065108572081e-04
8150.00000  8200.00000  1.047177451339e-04
8200.00000  8250.00000  1.014901434003e-04
8250.00000  8300.00000  9.611080717769e-05
8300.00000  8350.00000  9.611080717769e-05
8350.00000  8400.00000  1.040005003042e-04
8400.00000  8450.00000  9.001422612537e-05
8450.00000  8500.00000  9.826254166674e-05
8500.00000  8550.00000  8.499351231758e-05
8550.00000  8600.00000  9.216596061442e-05
8600.00000  8650.00000  8.893835888084e-05
8650.00000  8700.00000  9.395907268863e-05
8700.00000  8750.00000  9.682805200737e-05
8750.00000  8800.00000  9.826254166674e-05
8800.00000  8850.00000  8.857973646600e-05
8850.00000  8900.00000  8.929698129569e-05
8900.00000  8950.00000  8.535213473242e-05
8950.00000  9000.00000  7.638657436137e-05
9000.00000  9050.00000  8.069004333948e-05
9050.00000  9100.00000  8.140728816916e-05
9100.00000  9150.00000  7.602795194653e-05
9150.00000  9200.00000  7.746244160590e-05
9200.00000  9250.00000  8.033142092463e-05
9250.00000  9300.00000  8.212453299884e-05
9300.00000  9350.00000  8.965560371053e-05
9350.00000  9400.00000  7.853830885042e-05
9400.00000  9450.00000  7.531070711684e-05
9450.00000  9500.00000  8.212453299884e-05
9500.00000  9550.00000  7.244172779811e-05
9550.00000  9600.00000  7.602795194653e-05
9600.00000  9650.00000  8.033142092463e-05
9650.00000  9700.00000  6.957274847937e-05
9700.00000  9750.00000  7.961417609495e-05
9750.00000  9800.00000  7.100723813874e-05
9800.00000  9850.00000  6.993137089421e-05
9850.00000  9900.00000  7.280035021295e-05
9900.00000  9950.00000  7.459346228716e-05
9950.00000  10000.00000  7.208310538326e-05
