10001.00000  11001.00000  2.564968987465e-04
11001.00000  12001.00000  2.169615868739e-04
12001.00000  13001.00000  1.877525123596e-04
13001.00000  14001.00000  1.627764913292e-04
14001.00000  15001.00000  1.423653308252e-04
15001.00000  16001.00000  1.265190308478e-04
16001.00000  17001.00000  1.121005066297e-04
17001.00000  18001.00000  9.844614408573e-05
18001.00000  19001.00000  8.686306186872e-05
19001.00000  20001.00000  7.806514785840e-05
20001.00000  21001.00000  7.204234729591e-05
21001.00000  22001.00000  6.474259235706e-05
22001.00000  23001.00000  5.846842282285e-05
23001.00000  24001.00000  5.413482175034e-05
24001.00000  25001.00000  4.891640189736e-05
25001.00000  26001.00000  4.424093902331e-05
26001.00000  27001.00000  4.175741358268e-05
27001.00000  28001.00000  3.792655045362e-05
28001.00000  29001.00000  3.409568732455e-05
29001.00000  30001.00000  3.127030008238e-05
30001.00000  31001.00000  2.968164818109e-05
31001.00000  32001.00000  2.735899888237e-05
32001.00000  33001.00000  2.486541868287e-05
33001.00000  34001.00000  2.234167420677e-05
34001.00000  35001.00000  2.061225568131e-05
35001.00000  36001.00000  2.078318658209e-05
36001.00000  37001.00000  1.886272763812e-05
37001.00000  38001.00000  1.790752554557e-05
38001.00000  39001.00000  1.725396621909e-05
39001.00000  40001.00000  1.486093360828e-05
40001.00000  41001.00000  1.467994794864e-05
41001.00000  42001.00000  1.309129604735e-05
42001.00000  43001.00000  1.257850334504e-05
43001.00000  44001.00000  1.166352028796e-05
44001.00000  45001.00000  1.185456070647e-05
45001.00000  46001.00000  1.055749681238e-05
46001.00000  47001.00000  9.833554173817e-06
47001.00000  48001.00000  9.099556776385e-06
48001.00000  49001.00000  8.476161726511e-06
49001.00000  50001.00000  8.184573719312e-06
50001.00000  51001.00000  7.500850116225e-06
51001.00000  52001.00000  7.420412045273e-06
52001.00000  53001.00000  6.776907477661e-06
53001.00000  54001.00000  6.555702782545e-06
54001.00000  55001.00000  5.952417250409e-06
55001.00000  56001.00000  5.811650626244e-06
56001.00000  57001.00000  5.268693647321e-06
57001.00000  58001.00000  5.248584129583e-06
58001.00000  59001.00000  4.755900945006e-06
59001.00000  60001.00000  4.956996122384e-06
60001.00000  61001.00000  4.343655831379e-06
61001.00000  62001.00000  4.062122583049e-06
62001.00000  63001.00000  4.042013065311e-06
63001.00000  64001.00000  3.951520235491e-06
64001.00000  65001.00000  3.609658433947e-06
65001.00000  66001.00000  3.378398979962e-06
66001.00000  67001.00000  3.730315540374e-06
67001.00000  68001.00000  3.066701455025e-06
68001.00000  69001.00000  3.056646696156e-06
69001.00000  70001.00000  2.795222965564e-06
70001.00000  71001.00000  3.036537178418e-06
71001.00000  72001.00000  2.875661036515e-06
72001.00000  73001.00000  2.433251646282e-06
73001.00000  74001.00000  2.222101710034e-06
74001.00000  75001.00000  2.161773156821e-06
75001.00000  76001.00000  2.121554121345e-06
76001.00000  77001.00000  2.061225568131e-06
77001.00000  78001.00000  1.759582802063e-06
78001.00000  79001.00000  1.719363766588e-06
79001.00000  80001.00000  1.659035213374e-06
80001.00000  81001.00000  1.739473284326e-06
81001.00000  82001.00000  1.608761419029e-06
82001.00000  83001.00000  1.749528043194e-06
83001.00000  84001.00000  1.347337688437e-06
84001.00000  85001.00000  1.508213830340e-06
85001.00000  86001.00000  1.347337688437e-06
86001.00000  87001.00000  1.548432865816e-06
87001.00000  88001.00000  1.136187752190e-06
88001.00000  89001.00000  1.196516305403e-06
89001.00000  90001.00000  1.176406787665e-06
90001.00000  91001.00000  1.005475886893e-06
91001.00000  92001.00000  1.106023475583e-06
92001.00000  93001.00000  9.652568514176e-07
93001.00000  94001.00000  8.948735393351e-07
94001.00000  95001.00000  9.753116102866e-07
95001.00000  96001.00000  9.853663691555e-07
96001.00000  97001.00000  7.943259506458e-07
97001.00000  98001.00000  7.440521563011e-07
98001.00000  99001.00000  7.541069151700e-07
99001.00000  100001.00000  8.848187804662e-07
100001.00000  101001.00000  7.641616740390e-07
101001.00000  102001.00000  6.435045676118e-07
102001.00000  103001.00000  6.636140853496e-07
103001.00000  104001.00000  6.535593264807e-07
104001.00000  105001.00000  4.926831845778e-07
105001.00000  106001.00000  5.932307732671e-07
106001.00000  107001.00000  5.228474611846e-07
107001.00000  108001.00000  4.826284257088e-07
108001.00000  109001.00000  5.329022200535e-07
109001.00000  110001.00000  5.127927023156e-07
110001.00000  111001.00000  4.122451136263e-07
111001.00000  112001.00000  4.323546313642e-07
112001.00000  113001.00000  4.625189079710e-07
113001.00000  114001.00000  4.021903547574e-07
114001.00000  115001.00000  4.122451136263e-07
115001.00000  116001.00000  4.524641491020e-07
116001.00000  117001.00000  3.921355958884e-07
117001.00000  118001.00000  3.720260781506e-07
118001.00000  119001.00000  3.318070426748e-07
119001.00000  120001.00000  3.820808370195e-07
120001.00000  121001.00000  2.915880071991e-07
121001.00000  122001.00000  2.513689717233e-07
122001.00000  123001.00000  3.016427660680e-07
123001.00000  124001.00000  2.714784894612e-07
124001.00000  125001.00000  2.312594539855e-07
125001.00000  126001.00000  2.815332483301e-07
126001.00000  127001.00000  3.116975249369e-07
127001.00000  128001.00000  1.608761419029e-07
128001.00000  129001.00000  2.010951773787e-07
129001.00000  130001.00000  2.714784894612e-07
130001.00000  131001.00000  2.714784894612e-07
131001.00000  132001.00000  2.915880071991e-07
132001.00000  133001.00000  2.111499362476e-07
133001.00000  134001.00000  2.614237305923e-07
134001.00000  135001.00000  2.312594539855e-07
135001.00000  136001.00000  1.106023475583e-07
136001.00000  137001.00000  2.010951773787e-07
137001.00000  138001.00000  2.312594539855e-07
138001.00000  139001.00000  1.508213830340e-07
139001.00000  140001.00000  1.307118652961e-07
140001.00000  141001.00000  1.407666241651e-07
141001.00000  142001.00000  1.508213830340e-07
142001.00000  143001.00000  1.709309007719e-07
143001.00000  144001.00000  1.709309007719e-07
144001.00000  145001.00000  1.307118652961e-07
145001.00000  146001.00000  1.106023475583e-07
146001.00000  147001.00000  9.049282982040e-08
147001.00000  148001.00000  1.307118652961e-07
148001.00000  149001.00000  1.508213830340e-07
149001.00000  150001.00000  5.027379434467e-08
150001.00000  151001.00000  9.049282982040e-08
151001.00000  152001.00000  1.005475886893e-07
152001.00000  153001.00000  1.005475886893e-07
153001.00000  154001.00000  9.049282982040e-08
154001.00000  155001.00000  9.049282982040e-08
155001.00000  156001.00000  5.027379434467e-08
156001.00000  157001.00000  8.043807095147e-08
157001.00000  158001.00000  1.206571064272e-07
158001.00000  159001.00000  8.043807095147e-08
159001.00000  160001.00000  1.508213830340e-07
160001.00000  161001.00000  9.049282982040e-08
161001.00000  162001.00000  9.049282982040e-08
162001.00000  163001.00000  5.027379434467e-08
163001.00000  164001.00000  5.027379434467e-08
164001.00000  165001.00000  5.027379434467e-08
165001.00000  166001.00000  6.032855321360e-08
166001.00000  167001.00000  3.016427660680e-08
167001.00000  168001.00000  6.032855321360e-08
168001.00000  169001.00000  7.038331208254e-08
169001.00000  170001.00000  3.016427660680e-08
170001.00000  171001.00000  4.021903547574e-08
171001.00000  172001.00000  7.038331208254e-08
172001.00000  173001.00000  0.000000000000e+00
173001.00000  174001.00000  7.038331208254e-08
174001.00000  175001.00000  6.032855321360e-08
175001.00000  176001.00000  9.049282982040e-08
176001.00000  177001.00000  2.010951773787e-08
177001.00000  178001.00000  3.016427660680e-08
178001.00000  179001.00000  3.016427660680e-08
179001.00000  180001.00000  3.016427660680e-08
180001.00000  181001.00000  6.032855321360e-08
181001.00000  182001.00000  2.010951773787e-08
182001.00000  183001.00000  3.016427660680e-08
183001.00000  184001.00000  3.016427660680e-08
184001.00000  185001.00000  1.005475886893e-08
185001.00000  186001.00000  0.000000000000e+00
186001.00000  187001.00000  4.021903547574e-08
187001.00000  188001.00000  2.010951773787e-08
188001.00000  189001.00000  3.016427660680e-08
189001.00000  190001.00000  1.005475886893e-08
190001.00000  191001.00000  6.032855321360e-08
191001.00000  192001.00000  4.021903547574e-08
192001.00000  193001.00000  1.005475886893e-08
193001.00000  194001.00000  2.010951773787e-08
194001.00000  195001.00000  0.000000000000e+00
195001.00000  196001.00000  1.005475886893e-08
196001.00000  197001.00000  3.016427660680e-08
197001.00000  198001.00000  1.005475886893e-08
198001.00000  199001.00000  4.021903547574e-08
