300.00000  350.00000  1.787530107295e-06
350.00000  400.00000  1.144019268669e-05
400.00000  450.00000  9.295156557934e-06
450.00000  500.00000  9.402408364371e-05
500.00000  550.00000  2.917249135105e-04
550.00000  600.00000  1.415723844978e-04
600.00000  650.00000  4.082718765062e-04
650.00000  700.00000  7.954508977463e-04
700.00000  750.00000  1.152241907162e-03
750.00000  800.00000  1.749634469020e-03
800.00000  850.00000  2.427823391728e-03
850.00000  900.00000  2.421030777320e-03
900.00000  950.00000  2.702745522230e-03
950.00000  1000.00000  3.095644639813e-03
1000.00000  1050.00000  3.401669794182e-03
1050.00000  1100.00000  3.555754889431e-03
1100.00000  1150.00000  3.676591924684e-03
1150.00000  1200.00000  3.694109719736e-03
1200.00000  1250.00000  3.666224250062e-03
1250.00000  1300.00000  3.517501745135e-03
1300.00000  1350.00000  3.239004554418e-03
1350.00000  1400.00000  3.235071988182e-03
1400.00000  1450.00000  3.061681567775e-03
1450.00000  1500.00000  2.942989568650e-03
1500.00000  1550.00000  2.799987160067e-03
1550.00000  1600.00000  2.592991173642e-03
1600.00000  1650.00000  2.482164306990e-03
1650.00000  1700.00000  2.335944344213e-03
1700.00000  1750.00000  2.195444477780e-03
1750.00000  1800.00000  1.930890021900e-03
1800.00000  1850.00000  1.729971637840e-03
1850.00000  1900.00000  1.665263047956e-03
1900.00000  1950.00000  1.591259301514e-03
1950.00000  2000.00000  1.495805193784e-03
2000.00000  2050.00000  1.404641158312e-03
2050.00000  2100.00000  1.313834628862e-03
2100.00000  2150.00000  1.207297834467e-03
2150.00000  2200.00000  1.140086702433e-03
2200.00000  2250.00000  1.091108377493e-03
2250.00000  2300.00000  1.011384534707e-03
2300.00000  2350.00000  9.327332099865e-04
2350.00000  2400.00000  8.909050054758e-04
2400.00000  2450.00000  7.961659097892e-04
2450.00000  2500.00000  7.571977534501e-04
2500.00000  2550.00000  6.942766936734e-04
2550.00000  2600.00000  6.663912239996e-04
2600.00000  2650.00000  6.456558747549e-04
2650.00000  2700.00000  5.759422005704e-04
2700.00000  2750.00000  5.216012853087e-04
2750.00000  2800.00000  5.316114539095e-04
2800.00000  2850.00000  4.765555266048e-04
2850.00000  2900.00000  4.726229603688e-04
2900.00000  2950.00000  4.111319246778e-04
2950.00000  3000.00000  4.154219969353e-04
3000.00000  3050.00000  3.861065031757e-04
3050.00000  3100.00000  3.871790212401e-04
3100.00000  3150.00000  3.424907685577e-04
3150.00000  3200.00000  3.271180096350e-04
3200.00000  3250.00000  2.920824195320e-04
3250.00000  3300.00000  2.935124436178e-04
3300.00000  3350.00000  2.749221305020e-04
3350.00000  3400.00000  2.624094197509e-04
3400.00000  3450.00000  2.334514320127e-04
3450.00000  3500.00000  2.334514320127e-04
3500.00000  3550.00000  2.413165644848e-04
3550.00000  3600.00000  1.898356973947e-04
3600.00000  3650.00000  1.941257696522e-04
3650.00000  3700.00000  2.059234683604e-04
3700.00000  3750.00000  1.712453842789e-04
3750.00000  3800.00000  1.823280709441e-04
3800.00000  3850.00000  1.748204444934e-04
3850.00000  3900.00000  1.665978059999e-04
3900.00000  3950.00000  1.412148784763e-04
3950.00000  4000.00000  1.422873965407e-04
4000.00000  4050.00000  1.404998664334e-04
4050.00000  4100.00000  1.287021677252e-04
4100.00000  4150.00000  1.372823122403e-04
4150.00000  4200.00000  1.165469629956e-04
4200.00000  4250.00000  1.154744449313e-04
4250.00000  4300.00000  1.104693606308e-04
4300.00000  4350.00000  1.129719027810e-04
4350.00000  4400.00000  1.022467221373e-04
4400.00000  4450.00000  9.187904751496e-05
4450.00000  4500.00000  8.866149332183e-05
4500.00000  4550.00000  9.044902342912e-05
4550.00000  4600.00000  8.115386687119e-05
4600.00000  4650.00000  9.116403547204e-05
4650.00000  4700.00000  7.614878257076e-05
4700.00000  4750.00000  8.365640902140e-05
4750.00000  4800.00000  8.365640902140e-05
4800.00000  4850.00000  6.971367418450e-05
4850.00000  4900.00000  7.507626450639e-05
4900.00000  4950.00000  7.257372235617e-05
4950.00000  5000.00000  6.899866214158e-05
5000.00000  5050.00000  6.363607181970e-05
5050.00000  5100.00000  6.506609590554e-05
5100.00000  5150.00000  5.791597547636e-05
5150.00000  5200.00000  6.399357784116e-05
5200.00000  5250.00000  6.077602364803e-05
5250.00000  5300.00000  5.684345741198e-05
5300.00000  5350.00000  6.327856579824e-05
5350.00000  5400.00000  5.577093934760e-05
5400.00000  5450.00000  5.755846945490e-05
5450.00000  5500.00000  5.720096343344e-05
5500.00000  5550.00000  5.005084300426e-05
5550.00000  5600.00000  4.325822859654e-05
5600.00000  5650.00000  5.684345741198e-05
5650.00000  5700.00000  4.683328881113e-05
5700.00000  5750.00000  4.325822859654e-05
5750.00000  5800.00000  4.504575870383e-05
5800.00000  5850.00000  4.933583096134e-05
5850.00000  5900.00000  4.254321655362e-05
5900.00000  5950.00000  3.539309612444e-05
5950.00000  6000.00000  3.825314429611e-05
6000.00000  6050.00000  3.968316838195e-05
6050.00000  6100.00000  3.539309612444e-05
6100.00000  6150.00000  4.611827676821e-05
6150.00000  6200.00000  4.075568644632e-05
6200.00000  6250.00000  5.005084300426e-05
6250.00000  6300.00000  5.469842128323e-05
6300.00000  6350.00000  5.684345741198e-05
6350.00000  6400.00000  2.538292752359e-04
6400.00000  6450.00000  4.397324063946e-05
6450.00000  6500.00000  3.539309612444e-05
6500.00000  6550.00000  3.074551784547e-05
6550.00000  6600.00000  3.003050580256e-05
6600.00000  6650.00000  2.860048171672e-05
6650.00000  6700.00000  3.181803590985e-05
6700.00000  6750.00000  2.574043354505e-05
6750.00000  6800.00000  2.788546967380e-05
6800.00000  6850.00000  3.038801182401e-05
6850.00000  6900.00000  3.503559010298e-05
6900.00000  6950.00000  2.359539741629e-05
6950.00000  7000.00000  2.681295160942e-05
7000.00000  7050.00000  2.466791548067e-05
7050.00000  7100.00000  4.647578278967e-05
7100.00000  7150.00000  1.966283118024e-05
7150.00000  7200.00000  2.538292752359e-05
7200.00000  7250.00000  2.431040945921e-05
7250.00000  7300.00000  1.716028903003e-05
7300.00000  7350.00000  2.002033720170e-05
7350.00000  7400.00000  1.787530107295e-05
7400.00000  7450.00000  2.180786730900e-05
7450.00000  7500.00000  2.431040945921e-05
7500.00000  7550.00000  1.751779505149e-05
7550.00000  7600.00000  1.894781913733e-05
7600.00000  7650.00000  1.966283118024e-05
7650.00000  7700.00000  1.894781913733e-05
7700.00000  7750.00000  1.751779505149e-05
7750.00000  7800.00000  1.608777096565e-05
7800.00000  7850.00000  1.608777096565e-05
7850.00000  7900.00000  1.859031311587e-05
7900.00000  7950.00000  1.430024085836e-05
7950.00000  8000.00000  1.322772279398e-05
8000.00000  8050.00000  1.501525290128e-05
8050.00000  8100.00000  1.787530107295e-05
8100.00000  8150.00000  1.358522881544e-05
8150.00000  8200.00000  1.859031311587e-05
8200.00000  8250.00000  1.537275892274e-05
8250.00000  8300.00000  1.251271075106e-05
8300.00000  8350.00000  1.215520472961e-05
8350.00000  8400.00000  2.145036128754e-05
8400.00000  8450.00000  1.108268666523e-05
8450.00000  8500.00000  1.179769870815e-05
8500.00000  8550.00000  1.644527698711e-05
8550.00000  8600.00000  1.322772279398e-05
8600.00000  8650.00000  1.287021677252e-05
8650.00000  8700.00000  1.787530107295e-05
8700.00000  8750.00000  1.573026494420e-05
8750.00000  8800.00000  1.680278300857e-05
8800.00000  8850.00000  1.573026494420e-05
8850.00000  8900.00000  1.573026494420e-05
8900.00000  8950.00000  1.001016860085e-05
8950.00000  9000.00000  1.036767462231e-05
9000.00000  9050.00000  1.501525290128e-05
9050.00000  9100.00000  1.358522881544e-05
9100.00000  9150.00000  1.501525290128e-05
9150.00000  9200.00000  1.144019268669e-05
9200.00000  9250.00000  9.295156557934e-06
9250.00000  9300.00000  1.036767462231e-05
9300.00000  9350.00000  1.465774687982e-05
9350.00000  9400.00000  1.108268666523e-05
9400.00000  9450.00000  9.652662579393e-06
9450.00000  9500.00000  1.036767462231e-05
9500.00000  9550.00000  1.358522881544e-05
9550.00000  9600.00000  9.652662579393e-06
9600.00000  9650.00000  8.937650536475e-06
9650.00000  9700.00000  1.322772279398e-05
9700.00000  9750.00000  1.001016860085e-05
9750.00000  9800.00000  1.322772279398e-05
9800.00000  9850.00000  1.215520472961e-05
9850.00000  9900.00000  1.108268666523e-05
9900.00000  9950.00000  1.036767462231e-05
9950.00000  10000.00000  1.179769870815e-05
