10001.00000  11001.00000  1.473900381044e-04
11001.00000  12001.00000  1.320134436543e-04
12001.00000  13001.00000  1.129259510013e-04
13001.00000  14001.00000  9.659397625498e-05
14001.00000  15001.00000  8.257502748877e-05
15001.00000  16001.00000  7.403694463188e-05
16001.00000  17001.00000  6.352776137457e-05
17001.00000  18001.00000  5.602551189136e-05
18001.00000  19001.00000  4.862382875511e-05
19001.00000  20001.00000  4.362568131120e-05
20001.00000  21001.00000  3.725983154864e-05
21001.00000  22001.00000  3.412216152349e-05
22001.00000  23001.00000  2.945588302455e-05
23001.00000  24001.00000  2.680093146481e-05
24001.00000  25001.00000  2.373365788254e-05
25001.00000  26001.00000  2.222516267814e-05
26001.00000  27001.00000  1.874556707333e-05
27001.00000  28001.00000  1.789075312417e-05
28001.00000  29001.00000  1.590959608906e-05
29001.00000  30001.00000  1.437093098057e-05
30001.00000  31001.00000  1.312390827827e-05
31001.00000  32001.00000  1.209813153928e-05
32001.00000  33001.00000  1.067008941245e-05
33001.00000  34001.00000  1.032816383278e-05
34001.00000  35001.00000  8.880008436559e-06
35001.00000  36001.00000  8.930291610039e-06
36001.00000  37001.00000  8.015137852704e-06
37001.00000  38001.00000  7.331286693377e-06
38001.00000  39001.00000  6.546869187089e-06
39001.00000  40001.00000  6.426189570738e-06
40001.00000  41001.00000  5.360186292963e-06
41001.00000  42001.00000  5.350129658267e-06
42001.00000  43001.00000  4.746731576507e-06
43001.00000  44001.00000  4.646165229547e-06
44001.00000  45001.00000  3.871804357956e-06
45001.00000  46001.00000  4.153390129444e-06
46001.00000  47001.00000  3.509765508900e-06
47001.00000  48001.00000  3.097443486365e-06
48001.00000  49001.00000  3.318689449677e-06
49001.00000  50001.00000  2.976763870013e-06
50001.00000  51001.00000  2.695178098525e-06
51001.00000  52001.00000  2.524215308693e-06
52001.00000  53001.00000  2.453818865822e-06
53001.00000  54001.00000  2.252686171902e-06
54001.00000  55001.00000  2.272799441294e-06
55001.00000  56001.00000  2.162176459638e-06
56001.00000  57001.00000  1.679457994230e-06
57001.00000  58001.00000  1.619118186054e-06
58001.00000  59001.00000  1.619118186054e-06
59001.00000  60001.00000  1.438098761527e-06
60001.00000  61001.00000  1.347589049263e-06
61001.00000  62001.00000  1.438098761527e-06
62001.00000  63001.00000  1.247022702303e-06
63001.00000  64001.00000  9.754935655110e-07
64001.00000  65001.00000  1.096173181863e-06
65001.00000  66001.00000  1.146456355343e-06
66001.00000  67001.00000  8.648705838551e-07
67001.00000  68001.00000  7.441909675033e-07
68001.00000  69001.00000  8.347006797672e-07
69001.00000  70001.00000  7.140210634153e-07
70001.00000  71001.00000  8.447573144632e-07
71001.00000  72001.00000  7.441909675033e-07
72001.00000  73001.00000  7.140210634153e-07
73001.00000  74001.00000  4.827184654075e-07
74001.00000  75001.00000  6.637378899353e-07
75001.00000  76001.00000  6.033980817594e-07
76001.00000  77001.00000  4.525485613195e-07
77001.00000  78001.00000  5.631715429754e-07
78001.00000  79001.00000  4.927751001035e-07
79001.00000  80001.00000  4.626051960155e-07
80001.00000  81001.00000  5.531149082794e-07
81001.00000  82001.00000  4.022653878396e-07
82001.00000  83001.00000  3.720954837516e-07
83001.00000  84001.00000  4.424919266236e-07
84001.00000  85001.00000  3.016990408797e-07
85001.00000  86001.00000  3.117556755757e-07
86001.00000  87001.00000  3.519822143596e-07
87001.00000  88001.00000  3.016990408797e-07
88001.00000  89001.00000  3.218123102717e-07
89001.00000  90001.00000  2.514158673997e-07
90001.00000  91001.00000  3.318689449677e-07
91001.00000  92001.00000  2.111893286158e-07
92001.00000  93001.00000  2.313025980078e-07
93001.00000  94001.00000  1.709627898318e-07
94001.00000  95001.00000  2.011326939198e-07
95001.00000  96001.00000  2.111893286158e-07
96001.00000  97001.00000  1.307362510479e-07
97001.00000  98001.00000  1.609061551358e-07
98001.00000  99001.00000  2.111893286158e-07
99001.00000  100001.00000  1.106229816559e-07
100001.00000  101001.00000  1.005663469599e-07
101001.00000  102001.00000  1.709627898318e-07
102001.00000  103001.00000  1.206796163519e-07
103001.00000  104001.00000  1.407928857439e-07
104001.00000  105001.00000  1.005663469599e-07
105001.00000  106001.00000  1.206796163519e-07
106001.00000  107001.00000  6.033980817594e-08
107001.00000  108001.00000  1.407928857439e-07
108001.00000  109001.00000  1.206796163519e-07
109001.00000  110001.00000  8.045307756792e-08
110001.00000  111001.00000  1.307362510479e-07
111001.00000  112001.00000  7.039644287193e-08
112001.00000  113001.00000  1.106229816559e-07
113001.00000  114001.00000  4.022653878396e-08
114001.00000  115001.00000  6.033980817594e-08
115001.00000  116001.00000  8.045307756792e-08
116001.00000  117001.00000  5.028317347995e-08
117001.00000  118001.00000  8.045307756792e-08
118001.00000  119001.00000  1.206796163519e-07
119001.00000  120001.00000  7.039644287193e-08
120001.00000  121001.00000  6.033980817594e-08
121001.00000  122001.00000  8.045307756792e-08
122001.00000  123001.00000  2.011326939198e-08
123001.00000  124001.00000  6.033980817594e-08
124001.00000  125001.00000  5.028317347995e-08
125001.00000  126001.00000  3.016990408797e-08
126001.00000  127001.00000  6.033980817594e-08
127001.00000  128001.00000  4.022653878396e-08
128001.00000  129001.00000  4.022653878396e-08
129001.00000  130001.00000  3.016990408797e-08
130001.00000  131001.00000  4.022653878396e-08
131001.00000  132001.00000  3.016990408797e-08
132001.00000  133001.00000  3.016990408797e-08
133001.00000  134001.00000  4.022653878396e-08
134001.00000  135001.00000  6.033980817594e-08
135001.00000  136001.00000  4.022653878396e-08
136001.00000  137001.00000  5.028317347995e-08
137001.00000  138001.00000  1.005663469599e-08
138001.00000  139001.00000  2.011326939198e-08
139001.00000  140001.00000  1.005663469599e-08
140001.00000  141001.00000  3.016990408797e-08
141001.00000  142001.00000  3.016990408797e-08
142001.00000  143001.00000  2.011326939198e-08
143001.00000  144001.00000  1.005663469599e-08
144001.00000  145001.00000  2.011326939198e-08
145001.00000  146001.00000  3.016990408797e-08
146001.00000  147001.00000  3.016990408797e-08
147001.00000  148001.00000  3.016990408797e-08
148001.00000  149001.00000  5.028317347995e-08
149001.00000  150001.00000  0.000000000000e+00
150001.00000  151001.00000  1.005663469599e-08
151001.00000  152001.00000  2.011326939198e-08
152001.00000  153001.00000  0.000000000000e+00
153001.00000  154001.00000  2.011326939198e-08
154001.00000  155001.00000  1.005663469599e-08
155001.00000  156001.00000  1.005663469599e-08
156001.00000  157001.00000  0.000000000000e+00
157001.00000  158001.00000  3.016990408797e-08
158001.00000  159001.00000  0.000000000000e+00
159001.00000  160001.00000  2.011326939198e-08
160001.00000  161001.00000  2.011326939198e-08
161001.00000  162001.00000  1.005663469599e-08
162001.00000  163001.00000  0.000000000000e+00
163001.00000  164001.00000  0.000000000000e+00
164001.00000  165001.00000  1.005663469599e-08
165001.00000  166001.00000  1.005663469599e-08
166001.00000  167001.00000  1.005663469599e-08
167001.00000  168001.00000  1.005663469599e-08
168001.00000  169001.00000  1.005663469599e-08
169001.00000  170001.00000  0.000000000000e+00
170001.00000  171001.00000  0.000000000000e+00
171001.00000  172001.00000  0.000000000000e+00
172001.00000  173001.00000  0.000000000000e+00
173001.00000  174001.00000  1.005663469599e-08
174001.00000  175001.00000  1.005663469599e-08
175001.00000  176001.00000  1.005663469599e-08
176001.00000  177001.00000  0.000000000000e+00
177001.00000  178001.00000  1.005663469599e-08
178001.00000  179001.00000  1.005663469599e-08
179001.00000  180001.00000  1.005663469599e-08
180001.00000  181001.00000  0.000000000000e+00
181001.00000  182001.00000  1.005663469599e-08
182001.00000  183001.00000  1.005663469599e-08
183001.00000  184001.00000  0.000000000000e+00
184001.00000  185001.00000  0.000000000000e+00
185001.00000  186001.00000  0.000000000000e+00
186001.00000  187001.00000  2.011326939198e-08
187001.00000  188001.00000  0.000000000000e+00
188001.00000  189001.00000  0.000000000000e+00
189001.00000  190001.00000  0.000000000000e+00
190001.00000  191001.00000  0.000000000000e+00
191001.00000  192001.00000  0.000000000000e+00
192001.00000  193001.00000  0.000000000000e+00
193001.00000  194001.00000  0.000000000000e+00
194001.00000  195001.00000  0.000000000000e+00
195001.00000  196001.00000  0.000000000000e+00
196001.00000  197001.00000  0.000000000000e+00
197001.00000  198001.00000  0.000000000000e+00
198001.00000  199001.00000  0.000000000000e+00
