10001.00000  11001.00000  4.756148164243e-04
11001.00000  12001.00000  3.728074224397e-04
12001.00000  13001.00000  3.046442714632e-04
13001.00000  14001.00000  2.424695105195e-04
14001.00000  15001.00000  2.042483097066e-04
15001.00000  16001.00000  1.649419643912e-04
16001.00000  17001.00000  1.420735487629e-04
17001.00000  18001.00000  1.214156126768e-04
18001.00000  19001.00000  1.058216842695e-04
19001.00000  20001.00000  8.737422772573e-05
20001.00000  21001.00000  7.736678397978e-05
21001.00000  22001.00000  6.325990544632e-05
22001.00000  23001.00000  5.666865735662e-05
23001.00000  24001.00000  5.051950517537e-05
24001.00000  25001.00000  4.392825708566e-05
25001.00000  26001.00000  3.986901283529e-05
26001.00000  27001.00000  3.637243610478e-05
27001.00000  28001.00000  3.235338239154e-05
28001.00000  29001.00000  2.544061000478e-05
29001.00000  30001.00000  2.612384913603e-05
30001.00000  31001.00000  2.182346166287e-05
31001.00000  32001.00000  2.206460488566e-05
32001.00000  33001.00000  1.864840922941e-05
33001.00000  34001.00000  1.635754861287e-05
34001.00000  35001.00000  1.418725960772e-05
35001.00000  36001.00000  1.282078134522e-05
36001.00000  37001.00000  1.290116241948e-05
37001.00000  38001.00000  1.113277878566e-05
38001.00000  39001.00000  8.922299243382e-06
39001.00000  40001.00000  9.565347837500e-06
40001.00000  41001.00000  1.101220717426e-05
41001.00000  42001.00000  8.359631723529e-06
42001.00000  43001.00000  7.636202055147e-06
43001.00000  44001.00000  7.475439906617e-06
44001.00000  45001.00000  6.470676478309e-06
45001.00000  46001.00000  6.309914329779e-06
46001.00000  47001.00000  4.943436067279e-06
47001.00000  48001.00000  5.023817141544e-06
48001.00000  49001.00000  4.019053713235e-06
49001.00000  50001.00000  4.420959084559e-06
50001.00000  51001.00000  3.818101027573e-06
51001.00000  52001.00000  3.496576730515e-06
52001.00000  53001.00000  3.617148341912e-06
53001.00000  54001.00000  3.255433507721e-06
54001.00000  55001.00000  3.175052433456e-06
55001.00000  56001.00000  2.572194376471e-06
56001.00000  57001.00000  2.612384913603e-06
57001.00000  58001.00000  2.572194376471e-06
58001.00000  59001.00000  2.250670079412e-06
59001.00000  60001.00000  2.451622765073e-06
60001.00000  61001.00000  1.326287725368e-06
61001.00000  62001.00000  2.250670079412e-06
62001.00000  63001.00000  1.768383633823e-06
63001.00000  64001.00000  1.848764708088e-06
64001.00000  65001.00000  1.446859336765e-06
65001.00000  66001.00000  1.607621485294e-06
66001.00000  67001.00000  1.125335039706e-06
67001.00000  68001.00000  1.607621485294e-06
68001.00000  69001.00000  1.406668799632e-06
69001.00000  70001.00000  1.406668799632e-06
70001.00000  71001.00000  1.205716113971e-06
71001.00000  72001.00000  8.440012797794e-07
72001.00000  73001.00000  1.085144502574e-06
73001.00000  74001.00000  1.165525576838e-06
74001.00000  75001.00000  8.038107426470e-07
75001.00000  76001.00000  6.430485941176e-07
76001.00000  77001.00000  7.636202055147e-07
77001.00000  78001.00000  7.636202055147e-07
78001.00000  79001.00000  8.440012797794e-07
79001.00000  80001.00000  5.224769827206e-07
80001.00000  81001.00000  5.224769827206e-07
81001.00000  82001.00000  8.038107426470e-07
82001.00000  83001.00000  5.224769827206e-07
83001.00000  84001.00000  6.430485941176e-07
84001.00000  85001.00000  6.028580569853e-07
85001.00000  86001.00000  6.028580569853e-07
86001.00000  87001.00000  2.813337599265e-07
87001.00000  88001.00000  3.215242970588e-07
88001.00000  89001.00000  2.009526856618e-07
89001.00000  90001.00000  4.019053713235e-07
90001.00000  91001.00000  4.420959084559e-07
91001.00000  92001.00000  2.813337599265e-07
92001.00000  93001.00000  3.617148341912e-07
93001.00000  94001.00000  2.813337599265e-07
94001.00000  95001.00000  2.411432227941e-07
95001.00000  96001.00000  2.411432227941e-07
96001.00000  97001.00000  2.009526856618e-07
97001.00000  98001.00000  5.224769827206e-07
98001.00000  99001.00000  4.822864455882e-07
99001.00000  100001.00000  2.009526856618e-07
100001.00000  101001.00000  2.411432227941e-07
101001.00000  102001.00000  1.607621485294e-07
102001.00000  103001.00000  1.205716113971e-07
103001.00000  104001.00000  1.607621485294e-07
104001.00000  105001.00000  3.215242970588e-07
105001.00000  106001.00000  1.205716113971e-07
106001.00000  107001.00000  1.607621485294e-07
107001.00000  108001.00000  1.607621485294e-07
108001.00000  109001.00000  1.205716113971e-07
109001.00000  110001.00000  1.205716113971e-07
110001.00000  111001.00000  2.009526856618e-07
111001.00000  112001.00000  8.038107426470e-08
112001.00000  113001.00000  0.000000000000e+00
113001.00000  114001.00000  1.205716113971e-07
114001.00000  115001.00000  8.038107426470e-08
115001.00000  116001.00000  4.019053713235e-08
116001.00000  117001.00000  0.000000000000e+00
117001.00000  118001.00000  1.205716113971e-07
118001.00000  119001.00000  1.205716113971e-07
119001.00000  120001.00000  8.038107426470e-08
120001.00000  121001.00000  0.000000000000e+00
121001.00000  122001.00000  1.607621485294e-07
122001.00000  123001.00000  0.000000000000e+00
123001.00000  124001.00000  3.215242970588e-07
124001.00000  125001.00000  4.019053713235e-08
125001.00000  126001.00000  4.019053713235e-08
126001.00000  127001.00000  1.205716113971e-07
127001.00000  128001.00000  0.000000000000e+00
128001.00000  129001.00000  1.205716113971e-07
129001.00000  130001.00000  8.038107426470e-08
130001.00000  131001.00000  1.607621485294e-07
131001.00000  132001.00000  8.038107426470e-08
132001.00000  133001.00000  0.000000000000e+00
133001.00000  134001.00000  8.038107426470e-08
134001.00000  135001.00000  0.000000000000e+00
135001.00000  136001.00000  0.000000000000e+00
136001.00000  137001.00000  8.038107426470e-08
137001.00000  138001.00000  4.019053713235e-08
138001.00000  139001.00000  1.205716113971e-07
139001.00000  140001.00000  0.000000000000e+00
140001.00000  141001.00000  8.038107426470e-08
141001.00000  142001.00000  4.019053713235e-08
142001.00000  143001.00000  8.038107426470e-08
143001.00000  144001.00000  4.019053713235e-08
144001.00000  145001.00000  0.000000000000e+00
145001.00000  146001.00000  4.019053713235e-08
146001.00000  147001.00000  4.019053713235e-08
147001.00000  148001.00000  8.038107426470e-08
148001.00000  149001.00000  4.019053713235e-08
149001.00000  150001.00000  4.019053713235e-08
150001.00000  151001.00000  8.038107426470e-08
151001.00000  152001.00000  0.000000000000e+00
152001.00000  153001.00000  4.019053713235e-08
153001.00000  154001.00000  0.000000000000e+00
154001.00000  155001.00000  4.019053713235e-08
155001.00000  156001.00000  8.038107426470e-08
156001.00000  157001.00000  0.000000000000e+00
157001.00000  158001.00000  0.000000000000e+00
158001.00000  159001.00000  0.000000000000e+00
159001.00000  160001.00000  0.000000000000e+00
160001.00000  161001.00000  0.000000000000e+00
161001.00000  162001.00000  0.000000000000e+00
162001.00000  163001.00000  4.019053713235e-08
163001.00000  164001.00000  0.000000000000e+00
164001.00000  165001.00000  0.000000000000e+00
165001.00000  166001.00000  0.000000000000e+00
166001.00000  167001.00000  8.038107426470e-08
167001.00000  168001.00000  4.019053713235e-08
168001.00000  169001.00000  0.000000000000e+00
169001.00000  170001.00000  0.000000000000e+00
170001.00000  171001.00000  0.000000000000e+00
171001.00000  172001.00000  4.019053713235e-08
172001.00000  173001.00000  4.019053713235e-08
173001.00000  174001.00000  0.000000000000e+00
174001.00000  175001.00000  0.000000000000e+00
175001.00000  176001.00000  0.000000000000e+00
176001.00000  177001.00000  4.019053713235e-08
177001.00000  178001.00000  0.000000000000e+00
178001.00000  179001.00000  8.038107426470e-08
179001.00000  180001.00000  0.000000000000e+00
180001.00000  181001.00000  8.038107426470e-08
181001.00000  182001.00000  0.000000000000e+00
182001.00000  183001.00000  0.000000000000e+00
183001.00000  184001.00000  0.000000000000e+00
184001.00000  185001.00000  0.000000000000e+00
185001.00000  186001.00000  0.000000000000e+00
186001.00000  187001.00000  0.000000000000e+00
187001.00000  188001.00000  0.000000000000e+00
188001.00000  189001.00000  0.000000000000e+00
189001.00000  190001.00000  0.000000000000e+00
190001.00000  191001.00000  0.000000000000e+00
191001.00000  192001.00000  0.000000000000e+00
192001.00000  193001.00000  0.000000000000e+00
193001.00000  194001.00000  4.019053713235e-08
194001.00000  195001.00000  0.000000000000e+00
195001.00000  196001.00000  0.000000000000e+00
196001.00000  197001.00000  0.000000000000e+00
197001.00000  198001.00000  0.000000000000e+00
198001.00000  199001.00000  0.000000000000e+00
