300.00000  350.00000  5.721041177109e-01
350.00000  400.00000  4.283561207636e-01
400.00000  450.00000  3.335097742774e-01
450.00000  500.00000  2.661482077315e-01
500.00000  550.00000  2.182173364220e-01
550.00000  600.00000  1.819462495491e-01
600.00000  650.00000  1.534766576970e-01
650.00000  700.00000  1.317978423198e-01
700.00000  750.00000  1.142191116102e-01
750.00000  800.00000  9.967577486782e-02
800.00000  850.00000  8.788753670372e-02
850.00000  900.00000  7.806028681855e-02
900.00000  950.00000  6.984392583700e-02
950.00000  1000.00000  6.301788755451e-02
1000.00000  1050.00000  5.687153860392e-02
1050.00000  1100.00000  5.168697344591e-02
1100.00000  1150.00000  4.722779404393e-02
1150.00000  1200.00000  4.333999985056e-02
1200.00000  1250.00000  3.970407571137e-02
1250.00000  1300.00000  3.657620945289e-02
1300.00000  1350.00000  3.390314854937e-02
1350.00000  1400.00000  3.167841634228e-02
1400.00000  1450.00000  2.941446436961e-02
1450.00000  1500.00000  2.761863088334e-02
1500.00000  1550.00000  2.566016130495e-02
1550.00000  1600.00000  2.396903379835e-02
1600.00000  1650.00000  2.258950553020e-02
1650.00000  1700.00000  2.138196852762e-02
1700.00000  1750.00000  2.003014596542e-02
1750.00000  1800.00000  1.886614650077e-02
1800.00000  1850.00000  1.778346508219e-02
1850.00000  1900.00000  1.679937279909e-02
1900.00000  1950.00000  1.600634194280e-02
1950.00000  2000.00000  1.517625020711e-02
2000.00000  2050.00000  1.455017321531e-02
2050.00000  2100.00000  1.396835339017e-02
2100.00000  2150.00000  1.307673339839e-02
2150.00000  2200.00000  1.255572220061e-02
2200.00000  2250.00000  1.202715490120e-02
2250.00000  2300.00000  1.154032606792e-02
2300.00000  2350.00000  1.107148795279e-02
2350.00000  2400.00000  1.050729903144e-02
2400.00000  2450.00000  1.017770907484e-02
2450.00000  2500.00000  9.667852122314e-03
2500.00000  2550.00000  9.263780592545e-03
2550.00000  2600.00000  8.837040757901e-03
2600.00000  2650.00000  8.523282633271e-03
2650.00000  2700.00000  8.335099721367e-03
2700.00000  2750.00000  7.981762016796e-03
2750.00000  2800.00000  7.641737443660e-03
2800.00000  2850.00000  7.479101351536e-03
2850.00000  2900.00000  7.145553436936e-03
2900.00000  2950.00000  6.956650896305e-03
2950.00000  3000.00000  6.720252859744e-03
3000.00000  3050.00000  6.387064759507e-03
3050.00000  3100.00000  6.224068853020e-03
3100.00000  3150.00000  6.090937538670e-03
3150.00000  3200.00000  5.850581544115e-03
3200.00000  3250.00000  5.713852086134e-03
3250.00000  3300.00000  5.455865187787e-03
3300.00000  3350.00000  5.362313453379e-03
3350.00000  3400.00000  5.193200702719e-03
3400.00000  3450.00000  5.056831059102e-03
3450.00000  3500.00000  4.935933433098e-03
3500.00000  3550.00000  4.827269495439e-03
3550.00000  3600.00000  4.650600643154e-03
3600.00000  3650.00000  4.557408723109e-03
3650.00000  3700.00000  4.384338014455e-03
3700.00000  3750.00000  4.198673803092e-03
3750.00000  3800.00000  4.073458404731e-03
3800.00000  3850.00000  3.992140358669e-03
3850.00000  3900.00000  3.955079479269e-03
3900.00000  3950.00000  3.831663152723e-03
3950.00000  4000.00000  3.775891926442e-03
4000.00000  4050.00000  3.701770167642e-03
4050.00000  4100.00000  3.498115238123e-03
4100.00000  4150.00000  3.469330089075e-03
4150.00000  4200.00000  3.311371583671e-03
4200.00000  4250.00000  3.282226620259e-03
4250.00000  4300.00000  3.148375677184e-03
4300.00000  4350.00000  3.138660689380e-03
4350.00000  4400.00000  3.012725662292e-03
4400.00000  4450.00000  3.055183757139e-03
4450.00000  4500.00000  2.885351377753e-03
4500.00000  4550.00000  2.892187850652e-03
4550.00000  4600.00000  2.802953888601e-03
4600.00000  4650.00000  2.793598715160e-03
4650.00000  4700.00000  2.720196585087e-03
4700.00000  4750.00000  2.642476682656e-03
4750.00000  4800.00000  2.556121235510e-03
4800.00000  4850.00000  2.546046433343e-03
4850.00000  4900.00000  2.455373213840e-03
4900.00000  4950.00000  2.383770155582e-03
4950.00000  5000.00000  2.412195490267e-03
5000.00000  5050.00000  2.333036330384e-03
5050.00000  5100.00000  2.290218421174e-03
5100.00000  5150.00000  2.226171464541e-03
5150.00000  5200.00000  2.213218147469e-03
5200.00000  5250.00000  2.084404605477e-03
5250.00000  5300.00000  2.152049705741e-03
5300.00000  5350.00000  2.085843862930e-03
5350.00000  5400.00000  2.037988552636e-03
5400.00000  5450.00000  1.993011757248e-03
5450.00000  5500.00000  1.973941596003e-03
5500.00000  5550.00000  1.886866520132e-03
5550.00000  5600.00000  1.879310418506e-03
5600.00000  5650.00000  1.818861605504e-03
5650.00000  5700.00000  1.851244898184e-03
5700.00000  5750.00000  1.821380306046e-03
5750.00000  5800.00000  1.755534277598e-03
5800.00000  5850.00000  1.729267829091e-03
5850.00000  5900.00000  1.711636925299e-03
5900.00000  5950.00000  1.658744213922e-03
5950.00000  6000.00000  1.619524448343e-03
6000.00000  6050.00000  1.567711180056e-03
6050.00000  6100.00000  1.586061712574e-03
6100.00000  6150.00000  1.579585054038e-03
6150.00000  6200.00000  1.566271922603e-03
6200.00000  6250.00000  1.510500696322e-03
6250.00000  6300.00000  1.464444457844e-03
6300.00000  6350.00000  1.484234247815e-03
6350.00000  6400.00000  1.658744213922e-03
6400.00000  6450.00000  1.454009841314e-03
6450.00000  6500.00000  1.378808639425e-03
6500.00000  6550.00000  1.412991003920e-03
6550.00000  6600.00000  1.371252537800e-03
6600.00000  6650.00000  1.330953329132e-03
6650.00000  6700.00000  1.357939406365e-03
6700.00000  6750.00000  1.254312869790e-03
6750.00000  6800.00000  1.256831570332e-03
6800.00000  6850.00000  1.234882894182e-03
6850.00000  6900.00000  1.229845493099e-03
6900.00000  6950.00000  1.190265913157e-03
6950.00000  7000.00000  1.217251990390e-03
7000.00000  7050.00000  1.144209674679e-03
7050.00000  7100.00000  1.194223871151e-03
7100.00000  7150.00000  1.173354638091e-03
7150.00000  7200.00000  1.104989909101e-03
7200.00000  7250.00000  1.119742297988e-03
7250.00000  7300.00000  1.068288844064e-03
7300.00000  7350.00000  1.054615898266e-03
7350.00000  7400.00000  1.031947593390e-03
7400.00000  7450.00000  1.057854227534e-03
7450.00000  7500.00000  1.020073719407e-03
7500.00000  7550.00000  1.027270006670e-03
7550.00000  7600.00000  1.027989635396e-03
7600.00000  7650.00000  1.044900910462e-03
7650.00000  7700.00000  9.840922830968e-04
7700.00000  7750.00000  9.635828643997e-04
7750.00000  7800.00000  9.265219849997e-04
7800.00000  7850.00000  9.725782234774e-04
7850.00000  7900.00000  9.484706611493e-04
7900.00000  7950.00000  9.329986435357e-04
7950.00000  8000.00000  8.873022194211e-04
8000.00000  8050.00000  8.739890879862e-04
8050.00000  8100.00000  8.577974416464e-04
8100.00000  8150.00000  8.322506218658e-04
8150.00000  8200.00000  8.444843102114e-04
8200.00000  8250.00000  8.434048671221e-04
8250.00000  8300.00000  8.448441245745e-04
8300.00000  8350.00000  8.174982329784e-04
8350.00000  8400.00000  8.099421313532e-04
8400.00000  8450.00000  8.106617600794e-04
8450.00000  8500.00000  8.081430595376e-04
8500.00000  8550.00000  7.948299281027e-04
8550.00000  8600.00000  8.049047302697e-04
8600.00000  8650.00000  7.707223657745e-04
8650.00000  8700.00000  7.746803237687e-04
8700.00000  8750.00000  7.692831083221e-04
8750.00000  8800.00000  7.361801869163e-04
8800.00000  8850.00000  7.462549890833e-04
8850.00000  8900.00000  7.412175879998e-04
8900.00000  8950.00000  7.300633427435e-04
8950.00000  9000.00000  7.264651991124e-04
9000.00000  9050.00000  6.861659904445e-04
9050.00000  9100.00000  7.023576367843e-04
9100.00000  9150.00000  6.922828346173e-04
9150.00000  9200.00000  6.994791218794e-04
9200.00000  9250.00000  6.660163861105e-04
9250.00000  9300.00000  6.706939728309e-04
9300.00000  9350.00000  6.681752722891e-04
9350.00000  9400.00000  6.764510026406e-04
9400.00000  9450.00000  6.422686381455e-04
9450.00000  9500.00000  6.473060392290e-04
9500.00000  9550.00000  6.307545785260e-04
9550.00000  9600.00000  6.379508657882e-04
9600.00000  9650.00000  6.267966205319e-04
9650.00000  9700.00000  5.998105432989e-04
9700.00000  9750.00000  5.929740703998e-04
9750.00000  9800.00000  6.041283156561e-04
9800.00000  9850.00000  6.019694294775e-04
9850.00000  9900.00000  5.825394538697e-04
9900.00000  9950.00000  5.591515202678e-04
9950.00000  10000.00000  5.713852086134e-04
