10001.00000  11001.00000  3.381945302637e-04
11001.00000  12001.00000  2.727951259953e-04
12001.00000  13001.00000  2.257730287284e-04
13001.00000  14001.00000  1.899484403835e-04
14001.00000  15001.00000  1.582159649336e-04
15001.00000  16001.00000  1.376809984057e-04
16001.00000  17001.00000  1.177412482988e-04
17001.00000  18001.00000  9.966154950791e-05
18001.00000  19001.00000  8.954287034921e-05
19001.00000  20001.00000  7.745253679562e-05
20001.00000  21001.00000  7.057034692665e-05
21001.00000  22001.00000  5.948444108367e-05
22001.00000  23001.00000  5.286265839893e-05
23001.00000  24001.00000  4.862174139860e-05
24001.00000  25001.00000  4.281838129287e-05
25001.00000  26001.00000  3.898667558204e-05
26001.00000  27001.00000  3.552698013440e-05
27001.00000  28001.00000  3.351812471319e-05
28001.00000  29001.00000  3.024443439714e-05
29001.00000  30001.00000  2.775196563378e-05
30001.00000  31001.00000  2.488748660724e-05
31001.00000  32001.00000  2.317623939658e-05
32001.00000  33001.00000  2.131618808064e-05
33001.00000  34001.00000  1.990254908053e-05
34001.00000  35001.00000  1.860051315937e-05
35001.00000  36001.00000  1.629404952761e-05
36001.00000  37001.00000  1.521521976437e-05
37001.00000  38001.00000  1.595924029074e-05
38001.00000  39001.00000  1.435959615903e-05
39001.00000  40001.00000  1.212753457991e-05
40001.00000  41001.00000  1.156951918513e-05
41001.00000  42001.00000  1.145791610617e-05
42001.00000  43001.00000  1.130911200090e-05
43001.00000  44001.00000  1.108590584299e-05
44001.00000  45001.00000  1.004427710606e-05
45001.00000  46001.00000  8.742241184904e-06
46001.00000  47001.00000  8.593437079629e-06
47001.00000  48001.00000  7.886617579573e-06
48001.00000  49001.00000  7.551808342705e-06
49001.00000  50001.00000  6.398576526824e-06
50001.00000  51001.00000  8.333029895398e-06
51001.00000  52001.00000  6.844988842649e-06
52001.00000  53001.00000  6.249772421549e-06
53001.00000  54001.00000  5.133741631986e-06
54001.00000  55001.00000  5.728958053086e-06
55001.00000  56001.00000  5.282545737261e-06
56001.00000  57001.00000  5.431349842536e-06
57001.00000  58001.00000  4.836133421436e-06
58001.00000  59001.00000  4.389721105612e-06
59001.00000  60001.00000  4.464123158249e-06
60001.00000  61001.00000  4.203715974018e-06
61001.00000  62001.00000  4.426922131930e-06
62001.00000  63001.00000  3.980509816105e-06
63001.00000  64001.00000  3.757303658193e-06
64001.00000  65001.00000  3.385293395006e-06
65001.00000  66001.00000  4.389721105612e-06
66001.00000  67001.00000  3.794504684512e-06
67001.00000  68001.00000  3.794504684512e-06
68001.00000  69001.00000  3.199288263412e-06
69001.00000  70001.00000  3.199288263412e-06
70001.00000  71001.00000  3.682901605555e-06
71001.00000  72001.00000  2.790076973906e-06
72001.00000  73001.00000  2.715674921268e-06
73001.00000  74001.00000  2.976082105499e-06
74001.00000  75001.00000  2.715674921268e-06
75001.00000  76001.00000  2.529669789674e-06
76001.00000  77001.00000  2.455267737037e-06
77001.00000  78001.00000  2.083257473850e-06
78001.00000  79001.00000  2.269262605443e-06
79001.00000  80001.00000  2.046056447531e-06
80001.00000  81001.00000  2.046056447531e-06
81001.00000  82001.00000  2.046056447531e-06
82001.00000  83001.00000  1.971654394893e-06
83001.00000  84001.00000  2.194860552806e-06
84001.00000  85001.00000  1.525242079068e-06
85001.00000  86001.00000  1.450840026431e-06
86001.00000  87001.00000  1.971654394893e-06
87001.00000  88001.00000  1.711247210662e-06
88001.00000  89001.00000  1.116030789562e-06
89001.00000  90001.00000  1.562443105387e-06
90001.00000  91001.00000  1.413639000112e-06
91001.00000  92001.00000  1.116030789562e-06
92001.00000  93001.00000  1.376437973793e-06
93001.00000  94001.00000  1.078829763244e-06
94001.00000  95001.00000  1.339236947475e-06
95001.00000  96001.00000  9.672266842873e-07
96001.00000  97001.00000  8.184225790123e-07
97001.00000  98001.00000  7.440205263748e-07
98001.00000  99001.00000  1.004427710606e-06
99001.00000  100001.00000  1.264834894837e-06
100001.00000  101001.00000  8.556236053311e-07
101001.00000  102001.00000  1.488041052750e-06
102001.00000  103001.00000  1.302035921156e-06
103001.00000  104001.00000  8.556236053311e-07
104001.00000  105001.00000  1.264834894837e-06
105001.00000  106001.00000  8.184225790123e-07
106001.00000  107001.00000  1.116030789562e-06
107001.00000  108001.00000  5.580153947811e-07
108001.00000  109001.00000  7.440205263748e-07
109001.00000  110001.00000  8.184225790123e-07
110001.00000  111001.00000  8.928246316498e-07
111001.00000  112001.00000  5.952164210999e-07
112001.00000  113001.00000  7.068195000561e-07
113001.00000  114001.00000  5.952164210999e-07
114001.00000  115001.00000  8.928246316498e-07
115001.00000  116001.00000  6.696184737374e-07
116001.00000  117001.00000  6.324174474186e-07
117001.00000  118001.00000  4.464123158249e-07
118001.00000  119001.00000  6.324174474186e-07
119001.00000  120001.00000  5.208143684624e-07
120001.00000  121001.00000  4.836133421436e-07
121001.00000  122001.00000  7.440205263748e-07
122001.00000  123001.00000  6.696184737374e-07
123001.00000  124001.00000  6.324174474186e-07
124001.00000  125001.00000  5.580153947811e-07
125001.00000  126001.00000  5.580153947811e-07
126001.00000  127001.00000  3.720102631874e-07
127001.00000  128001.00000  5.208143684624e-07
128001.00000  129001.00000  4.092112895062e-07
129001.00000  130001.00000  5.952164210999e-07
130001.00000  131001.00000  5.208143684624e-07
131001.00000  132001.00000  2.232061579125e-07
132001.00000  133001.00000  5.952164210999e-07
133001.00000  134001.00000  5.580153947811e-07
134001.00000  135001.00000  6.324174474186e-07
135001.00000  136001.00000  5.580153947811e-07
136001.00000  137001.00000  5.208143684624e-07
137001.00000  138001.00000  1.488041052750e-07
138001.00000  139001.00000  5.208143684624e-07
139001.00000  140001.00000  2.976082105499e-07
140001.00000  141001.00000  4.464123158249e-07
141001.00000  142001.00000  5.580153947811e-07
142001.00000  143001.00000  4.464123158249e-07
143001.00000  144001.00000  5.208143684624e-07
144001.00000  145001.00000  3.720102631874e-07
145001.00000  146001.00000  5.580153947811e-07
146001.00000  147001.00000  2.976082105499e-07
147001.00000  148001.00000  3.348092368687e-07
148001.00000  149001.00000  2.232061579125e-07
149001.00000  150001.00000  3.348092368687e-07
150001.00000  151001.00000  3.720102631874e-07
151001.00000  152001.00000  5.952164210999e-07
152001.00000  153001.00000  4.092112895062e-07
153001.00000  154001.00000  2.604071842312e-07
154001.00000  155001.00000  3.720102631874e-07
155001.00000  156001.00000  3.720102631874e-07
156001.00000  157001.00000  1.488041052750e-07
157001.00000  158001.00000  3.348092368687e-07
158001.00000  159001.00000  1.488041052750e-07
159001.00000  160001.00000  3.348092368687e-07
160001.00000  161001.00000  2.604071842312e-07
161001.00000  162001.00000  2.976082105499e-07
162001.00000  163001.00000  3.348092368687e-07
163001.00000  164001.00000  2.232061579125e-07
164001.00000  165001.00000  1.488041052750e-07
165001.00000  166001.00000  1.860051315937e-07
166001.00000  167001.00000  1.860051315937e-07
167001.00000  168001.00000  1.116030789562e-07
168001.00000  169001.00000  2.232061579125e-07
169001.00000  170001.00000  2.604071842312e-07
170001.00000  171001.00000  2.604071842312e-07
171001.00000  172001.00000  2.976082105499e-07
172001.00000  173001.00000  2.232061579125e-07
173001.00000  174001.00000  2.232061579125e-07
174001.00000  175001.00000  1.860051315937e-07
175001.00000  176001.00000  2.232061579125e-07
176001.00000  177001.00000  7.440205263748e-08
177001.00000  178001.00000  2.232061579125e-07
178001.00000  179001.00000  7.440205263748e-08
179001.00000  180001.00000  1.488041052750e-07
180001.00000  181001.00000  1.488041052750e-07
181001.00000  182001.00000  7.440205263748e-08
182001.00000  183001.00000  1.116030789562e-07
183001.00000  184001.00000  2.604071842312e-07
184001.00000  185001.00000  7.440205263748e-08
185001.00000  186001.00000  3.720102631874e-08
186001.00000  187001.00000  1.860051315937e-07
187001.00000  188001.00000  2.604071842312e-07
188001.00000  189001.00000  1.116030789562e-07
189001.00000  190001.00000  1.488041052750e-07
190001.00000  191001.00000  7.440205263748e-08
191001.00000  192001.00000  3.720102631874e-08
192001.00000  193001.00000  1.860051315937e-07
193001.00000  194001.00000  7.440205263748e-08
194001.00000  195001.00000  2.604071842312e-07
195001.00000  196001.00000  1.860051315937e-07
196001.00000  197001.00000  1.116030789562e-07
197001.00000  198001.00000  2.604071842312e-07
198001.00000  199001.00000  7.440205263748e-08
