10001.00000  11001.00000  5.243334432442e-04
11001.00000  12001.00000  4.383817382813e-04
12001.00000  13001.00000  3.777588450000e-04
13001.00000  14001.00000  3.239063260551e-04
14001.00000  15001.00000  2.824728369579e-04
15001.00000  16001.00000  2.457165147471e-04
16001.00000  17001.00000  2.178037436294e-04
17001.00000  18001.00000  1.921945022416e-04
18001.00000  19001.00000  1.705813841678e-04
19001.00000  20001.00000  1.537355711000e-04
20001.00000  21001.00000  1.371501570452e-04
21001.00000  22001.00000  1.249314341304e-04
22001.00000  23001.00000  1.126125577491e-04
23001.00000  24001.00000  1.029377328838e-04
24001.00000  25001.00000  9.492545556259e-05
25001.00000  26001.00000  8.443938761851e-05
26001.00000  27001.00000  7.899103904011e-05
27001.00000  28001.00000  7.344253699520e-05
28001.00000  29001.00000  6.631161017936e-05
29001.00000  30001.00000  6.127389081367e-05
30001.00000  31001.00000  5.729779819304e-05
31001.00000  32001.00000  5.217995605414e-05
32001.00000  33001.00000  4.942573572498e-05
33001.00000  34001.00000  4.578014954385e-05
34001.00000  35001.00000  4.250513118882e-05
35001.00000  36001.00000  3.934028164696e-05
36001.00000  37001.00000  3.640578507808e-05
37001.00000  38001.00000  3.458299198751e-05
38001.00000  39001.00000  3.241967711080e-05
39001.00000  40001.00000  2.963541074169e-05
40001.00000  41001.00000  2.799289389085e-05
41001.00000  42001.00000  2.687117506588e-05
42001.00000  43001.00000  2.493821316215e-05
43001.00000  44001.00000  2.359615671085e-05
44001.00000  45001.00000  2.193360916671e-05
45001.00000  46001.00000  2.058153736876e-05
46001.00000  47001.00000  1.873871358489e-05
47001.00000  48001.00000  1.782731703961e-05
48001.00000  49001.00000  1.714627346731e-05
49001.00000  50001.00000  1.628495365528e-05
50001.00000  51001.00000  1.556384869638e-05
51001.00000  52001.00000  1.482271304417e-05
52001.00000  53001.00000  1.351070263283e-05
53001.00000  54001.00000  1.362087144599e-05
54001.00000  55001.00000  1.247912192773e-05
55001.00000  56001.00000  1.165786350231e-05
56001.00000  57001.00000  1.094677389005e-05
57001.00000  58001.00000  1.052612933069e-05
58001.00000  59001.00000  9.644778825362e-06
59001.00000  60001.00000  9.474517932287e-06
60001.00000  61001.00000  8.933689213108e-06
61001.00000  62001.00000  8.543090693700e-06
62001.00000  63001.00000  7.862047121401e-06
63001.00000  64001.00000  7.912123854658e-06
64001.00000  65001.00000  6.930619882814e-06
65001.00000  66001.00000  6.850497109603e-06
66001.00000  67001.00000  6.730312949785e-06
67001.00000  68001.00000  6.139407497349e-06
68001.00000  69001.00000  6.109361457394e-06
69001.00000  70001.00000  6.019223337531e-06
70001.00000  71001.00000  5.889023831062e-06
71001.00000  72001.00000  5.268072338671e-06
72001.00000  73001.00000  4.867458472612e-06
73001.00000  74001.00000  4.406752526645e-06
74001.00000  75001.00000  4.506905993160e-06
75001.00000  76001.00000  4.627090152977e-06
76001.00000  77001.00000  4.056215393844e-06
77001.00000  78001.00000  4.096276780450e-06
78001.00000  79001.00000  4.056215393844e-06
79001.00000  80001.00000  3.375171821544e-06
80001.00000  81001.00000  3.475325288059e-06
81001.00000  82001.00000  3.054680728697e-06
82001.00000  83001.00000  3.254987661726e-06
83001.00000  84001.00000  2.994588648788e-06
84001.00000  85001.00000  2.904450528925e-06
85001.00000  86001.00000  2.714158942547e-06
86001.00000  87001.00000  2.634036169336e-06
87001.00000  88001.00000  2.624020822684e-06
88001.00000  89001.00000  2.473790622912e-06
89001.00000  90001.00000  2.223406956625e-06
90001.00000  91001.00000  2.253452996580e-06
91001.00000  92001.00000  1.922946557081e-06
92001.00000  93001.00000  2.203376263323e-06
93001.00000  94001.00000  2.333575769792e-06
94001.00000  95001.00000  2.063161410202e-06
95001.00000  96001.00000  1.912931210430e-06
96001.00000  97001.00000  1.712624277401e-06
97001.00000  98001.00000  1.782731703961e-06
98001.00000  99001.00000  1.492286651068e-06
99001.00000  100001.00000  1.532348037674e-06
100001.00000  101001.00000  1.682578237446e-06
101001.00000  102001.00000  1.552378730977e-06
102001.00000  103001.00000  1.522332691023e-06
103001.00000  104001.00000  1.312010411342e-06
104001.00000  105001.00000  1.251918331433e-06
105001.00000  106001.00000  1.071642091707e-06
106001.00000  107001.00000  1.131734171616e-06
107001.00000  108001.00000  9.614732785407e-07
108001.00000  109001.00000  1.191826251524e-06
109001.00000  110001.00000  1.071642091707e-06
110001.00000  111001.00000  1.101688131661e-06
111001.00000  112001.00000  1.071642091707e-06
112001.00000  113001.00000  8.212584254202e-07
113001.00000  114001.00000  9.013811986319e-07
114001.00000  115001.00000  9.214118919349e-07
115001.00000  116001.00000  6.509975323453e-07
116001.00000  117001.00000  7.912123854658e-07
117001.00000  118001.00000  7.110896122541e-07
118001.00000  119001.00000  7.211049589055e-07
119001.00000  120001.00000  6.710282256482e-07
120001.00000  121001.00000  6.610128789968e-07
121001.00000  122001.00000  6.309668390424e-07
122001.00000  123001.00000  6.309668390424e-07
123001.00000  124001.00000  5.909054524365e-07
124001.00000  125001.00000  4.807366392704e-07
125001.00000  126001.00000  5.408287191792e-07
126001.00000  127001.00000  5.408287191792e-07
127001.00000  128001.00000  5.808901057850e-07
128001.00000  129001.00000  4.506905993160e-07
129001.00000  130001.00000  4.406752526645e-07
130001.00000  131001.00000  5.007673325733e-07
131001.00000  132001.00000  3.705678261042e-07
132001.00000  133001.00000  3.505371328013e-07
133001.00000  134001.00000  5.207980258762e-07
134001.00000  135001.00000  2.904450528925e-07
135001.00000  136001.00000  3.405217861498e-07
136001.00000  137001.00000  3.605524794528e-07
137001.00000  138001.00000  3.805831727557e-07
138001.00000  139001.00000  4.106292127101e-07
139001.00000  140001.00000  3.805831727557e-07
140001.00000  141001.00000  2.904450528925e-07
141001.00000  142001.00000  3.805831727557e-07
142001.00000  143001.00000  2.704143595896e-07
143001.00000  144001.00000  3.104757461954e-07
144001.00000  145001.00000  2.704143595896e-07
145001.00000  146001.00000  2.103222796808e-07
146001.00000  147001.00000  3.305064394984e-07
147001.00000  148001.00000  3.305064394984e-07
148001.00000  149001.00000  2.103222796808e-07
149001.00000  150001.00000  1.802762397264e-07
150001.00000  151001.00000  2.003069330293e-07
151001.00000  152001.00000  2.503836662866e-07
152001.00000  153001.00000  1.802762397264e-07
153001.00000  154001.00000  1.602455464235e-07
154001.00000  155001.00000  1.602455464235e-07
155001.00000  156001.00000  2.503836662866e-07
156001.00000  157001.00000  2.103222796808e-07
157001.00000  158001.00000  9.013811986319e-08
158001.00000  159001.00000  1.001534665147e-07
159001.00000  160001.00000  1.802762397264e-07
160001.00000  161001.00000  1.502301997720e-07
161001.00000  162001.00000  1.402148531205e-07
162001.00000  163001.00000  7.010742656026e-08
163001.00000  164001.00000  1.101688131661e-07
164001.00000  165001.00000  1.001534665147e-07
165001.00000  166001.00000  1.201841598176e-07
166001.00000  167001.00000  1.101688131661e-07
167001.00000  168001.00000  1.502301997720e-07
168001.00000  169001.00000  6.009207990880e-08
169001.00000  170001.00000  6.009207990880e-08
170001.00000  171001.00000  9.013811986319e-08
171001.00000  172001.00000  7.010742656026e-08
172001.00000  173001.00000  7.010742656026e-08
173001.00000  174001.00000  1.301995064691e-07
174001.00000  175001.00000  8.012277321173e-08
175001.00000  176001.00000  1.001534665147e-07
176001.00000  177001.00000  8.012277321173e-08
177001.00000  178001.00000  8.012277321173e-08
178001.00000  179001.00000  8.012277321173e-08
179001.00000  180001.00000  1.101688131661e-07
180001.00000  181001.00000  3.004603995440e-08
181001.00000  182001.00000  6.009207990880e-08
182001.00000  183001.00000  9.013811986319e-08
183001.00000  184001.00000  7.010742656026e-08
184001.00000  185001.00000  1.001534665147e-07
185001.00000  186001.00000  7.010742656026e-08
186001.00000  187001.00000  7.010742656026e-08
187001.00000  188001.00000  3.004603995440e-08
188001.00000  189001.00000  8.012277321173e-08
189001.00000  190001.00000  8.012277321173e-08
190001.00000  191001.00000  6.009207990880e-08
191001.00000  192001.00000  8.012277321173e-08
192001.00000  193001.00000  3.004603995440e-08
193001.00000  194001.00000  6.009207990880e-08
194001.00000  195001.00000  6.009207990880e-08
195001.00000  196001.00000  6.009207990880e-08
196001.00000  197001.00000  3.004603995440e-08
197001.00000  198001.00000  5.007673325733e-08
198001.00000  199001.00000  3.004603995440e-08
