300.00000  350.00000  5.800219567459e-07
350.00000  400.00000  7.733626089946e-07
400.00000  450.00000  3.866813044973e-07
450.00000  500.00000  1.933406522486e-07
500.00000  550.00000  3.673472392724e-06
550.00000  600.00000  1.933406522486e-07
600.00000  650.00000  1.160043913492e-06
650.00000  700.00000  3.866813044973e-07
700.00000  750.00000  9.667032612432e-07
750.00000  800.00000  7.733626089946e-07
800.00000  850.00000  3.480131740475e-06
850.00000  900.00000  3.866813044973e-07
900.00000  950.00000  1.933406522486e-07
950.00000  1000.00000  3.866813044973e-07
1000.00000  1050.00000  3.866813044973e-07
1050.00000  1100.00000  1.933406522486e-07
1100.00000  1150.00000  1.933406522486e-07
1150.00000  1200.00000  5.800219567459e-07
1200.00000  1250.00000  5.800219567459e-07
1250.00000  1300.00000  7.540285437697e-06
1300.00000  1350.00000  0.000000000000e+00
1350.00000  1400.00000  7.733626089946e-07
1400.00000  1450.00000  5.800219567459e-07
1450.00000  1500.00000  2.706769131481e-06
1500.00000  1550.00000  1.160043913492e-06
1550.00000  1600.00000  3.866813044973e-07
1600.00000  1650.00000  1.353384565740e-06
1650.00000  1700.00000  2.126747174735e-06
1700.00000  1750.00000  1.991408718161e-05
1750.00000  1800.00000  1.740065870238e-06
1800.00000  1850.00000  1.933406522486e-06
1850.00000  1900.00000  9.667032612432e-07
1900.00000  1950.00000  1.740065870238e-06
1950.00000  2000.00000  1.933406522486e-06
2000.00000  2050.00000  3.093450435978e-06
2050.00000  2100.00000  2.706769131481e-06
2100.00000  2150.00000  2.900109783730e-06
2150.00000  2200.00000  3.673472392724e-06
2200.00000  2250.00000  2.900109783730e-06
2250.00000  2300.00000  4.446835001719e-06
2300.00000  2350.00000  2.648766935806e-05
2350.00000  2400.00000  2.706769131481e-06
2400.00000  2450.00000  4.640175653967e-06
2450.00000  2500.00000  6.766922828702e-06
2500.00000  2550.00000  3.480131740475e-06
2550.00000  2600.00000  3.673472392724e-06
2600.00000  2650.00000  5.993560219708e-06
2650.00000  2700.00000  4.060153697221e-06
2700.00000  2750.00000  3.093450435978e-06
2750.00000  2800.00000  5.220197610713e-06
2800.00000  2850.00000  5.606878915210e-06
2850.00000  2900.00000  5.220197610713e-06
2900.00000  2950.00000  7.733626089946e-06
2950.00000  3000.00000  1.933406522486e-05
3000.00000  3050.00000  5.220197610713e-06
3050.00000  3100.00000  8.506988698940e-06
3100.00000  3150.00000  9.087010655686e-06
3150.00000  3200.00000  6.573582176454e-06
3200.00000  3250.00000  7.540285437697e-06
3250.00000  3300.00000  9.473691960183e-06
3300.00000  3350.00000  1.063373587368e-05
3350.00000  3400.00000  6.186900871956e-06
3400.00000  3450.00000  1.024705456918e-05
3450.00000  3500.00000  1.411386761415e-05
3500.00000  3550.00000  1.140709848267e-05
3550.00000  3600.00000  1.430720826640e-05
3600.00000  3650.00000  1.450054891865e-05
3650.00000  3700.00000  3.228788892552e-05
3700.00000  3750.00000  1.643395544113e-05
3750.00000  3800.00000  1.682063674563e-05
3800.00000  3850.00000  2.300753761759e-05
3850.00000  3900.00000  2.281419696534e-05
3900.00000  3950.00000  2.030076848611e-05
3950.00000  4000.00000  2.822773522830e-05
4000.00000  4050.00000  2.803439457605e-05
4050.00000  4100.00000  2.803439457605e-05
4100.00000  4150.00000  2.977446044629e-05
4150.00000  4200.00000  3.460797675251e-05
4200.00000  4250.00000  3.402795479576e-05
4250.00000  4300.00000  4.620841588742e-05
4300.00000  4350.00000  3.905481175422e-05
4350.00000  4400.00000  4.775514110541e-05
4400.00000  4450.00000  5.761551437009e-05
4450.00000  4500.00000  5.529542654311e-05
4500.00000  4550.00000  5.587544849986e-05
4550.00000  4600.00000  6.148232741507e-05
4600.00000  4650.00000  6.882927220052e-05
4650.00000  4700.00000  7.366278850673e-05
4700.00000  4750.00000  7.598287633371e-05
4750.00000  4800.00000  8.120307394443e-05
4800.00000  4850.00000  8.468320568490e-05
4850.00000  4900.00000  9.725034808106e-05
4900.00000  4950.00000  9.203015047035e-05
4950.00000  5000.00000  1.049839741710e-04
5000.00000  5050.00000  1.073040619980e-04
5050.00000  5100.00000  1.233513361346e-04
5100.00000  5150.00000  1.235446767869e-04
5150.00000  5200.00000  1.235446767869e-04
5200.00000  5250.00000  1.299249183111e-04
5250.00000  5300.00000  1.442321265775e-04
5300.00000  5350.00000  1.444254672297e-04
5350.00000  5400.00000  1.450054891865e-04
5400.00000  5450.00000  1.604727413664e-04
5450.00000  5500.00000  1.569926096259e-04
5500.00000  5550.00000  1.709131365878e-04
5550.00000  5600.00000  1.720731805013e-04
5600.00000  5650.00000  1.852203448542e-04
5650.00000  5700.00000  1.842536415930e-04
5700.00000  5750.00000  1.875404326812e-04
5750.00000  5800.00000  1.827069163750e-04
5800.00000  5850.00000  1.981741685549e-04
5850.00000  5900.00000  2.051344320358e-04
5900.00000  5950.00000  2.113213329078e-04
5950.00000  6000.00000  2.165415305185e-04
6000.00000  6050.00000  2.206016842157e-04
6050.00000  6100.00000  2.072611792105e-04
6100.00000  6150.00000  2.312354200894e-04
6150.00000  6200.00000  2.538562764025e-04
6200.00000  6250.00000  2.320087826984e-04
6250.00000  6300.00000  2.654567155374e-04
6300.00000  6350.00000  2.625566057536e-04
6350.00000  6400.00000  8.847268246898e-04
6400.00000  6450.00000  2.523095511845e-04
6450.00000  6500.00000  2.476693755305e-04
6500.00000  6550.00000  2.617832431447e-04
6550.00000  6600.00000  2.631366277104e-04
6600.00000  6650.00000  2.536629357502e-04
6650.00000  6700.00000  2.581097707519e-04
6700.00000  6750.00000  2.751237481498e-04
6750.00000  6800.00000  2.687435066256e-04
6800.00000  6850.00000  2.849841214145e-04
6850.00000  6900.00000  2.784105392380e-04
6900.00000  6950.00000  2.815039896740e-04
6950.00000  7000.00000  2.853708027190e-04
7000.00000  7050.00000  2.867241872847e-04
7050.00000  7100.00000  3.716007336219e-04
7100.00000  7150.00000  1.390119289668e-04
7150.00000  7200.00000  1.109775343907e-04
7200.00000  7250.00000  1.171644352627e-04
7250.00000  7300.00000  1.229646548301e-04
7300.00000  7350.00000  1.190978417852e-04
7350.00000  7400.00000  1.235446767869e-04
7400.00000  7450.00000  1.245113800481e-04
7450.00000  7500.00000  1.556392250602e-04
7500.00000  7550.00000  1.274114898319e-04
7550.00000  7600.00000  1.417186980983e-04
7600.00000  7650.00000  1.436521046207e-04
7650.00000  7700.00000  1.413320167938e-04
7700.00000  7750.00000  1.515790713629e-04
7750.00000  7800.00000  1.498390054927e-04
7800.00000  7850.00000  1.461655331000e-04
7850.00000  7900.00000  1.612461039754e-04
7900.00000  7950.00000  1.546725217989e-04
7950.00000  8000.00000  1.598927194096e-04
8000.00000  8050.00000  1.461655331000e-04
8050.00000  8100.00000  1.618261259321e-04
8100.00000  8150.00000  1.575726315826e-04
8150.00000  8200.00000  1.662729609338e-04
8200.00000  8250.00000  1.591193568006e-04
8250.00000  8300.00000  1.550592031034e-04
8300.00000  8350.00000  1.654995983248e-04
8350.00000  8400.00000  1.585393348439e-04
8400.00000  8450.00000  1.711064772400e-04
8450.00000  8500.00000  1.718798398490e-04
8500.00000  8550.00000  1.585393348439e-04
8550.00000  8600.00000  1.649195763681e-04
8600.00000  8650.00000  1.759399935463e-04
8650.00000  8700.00000  1.622128072366e-04
8700.00000  8750.00000  1.693664113698e-04
8750.00000  8800.00000  1.757466528940e-04
8800.00000  8850.00000  1.825135757227e-04
8850.00000  8900.00000  1.701397739788e-04
8900.00000  8950.00000  1.815468724615e-04
8950.00000  9000.00000  1.796134659390e-04
9000.00000  9050.00000  1.784534220255e-04
9050.00000  9100.00000  1.916005863784e-04
9100.00000  9150.00000  1.861870481154e-04
9150.00000  9200.00000  1.792267846345e-04
9200.00000  9250.00000  1.819335537660e-04
9250.00000  9300.00000  1.823202350705e-04
9300.00000  9350.00000  1.935339929009e-04
9350.00000  9400.00000  1.829002570272e-04
9400.00000  9450.00000  1.954673994234e-04
9450.00000  9500.00000  1.892804985514e-04
9500.00000  9550.00000  1.885071359424e-04
9550.00000  9600.00000  1.929539709441e-04
9600.00000  9650.00000  1.933406522486e-04
9650.00000  9700.00000  1.894738392037e-04
9700.00000  9750.00000  1.991408718161e-04
9750.00000  9800.00000  1.939206742054e-04
9800.00000  9850.00000  1.885071359424e-04
9850.00000  9900.00000  1.939206742054e-04
9900.00000  9950.00000  2.041677287746e-04
9950.00000  10000.00000  2.051344320358e-04
