10001.00000  11001.00000  5.947608722066e-04
11001.00000  12001.00000  4.913887876251e-04
12001.00000  13001.00000  4.141948772848e-04
13001.00000  14001.00000  3.544832770779e-04
14001.00000  15001.00000  2.978514620758e-04
15001.00000  16001.00000  2.618179751791e-04
16001.00000  17001.00000  2.311650541991e-04
17001.00000  18001.00000  2.054035567797e-04
18001.00000  19001.00000  1.831747541542e-04
19001.00000  20001.00000  1.621235164599e-04
20001.00000  21001.00000  1.430469645734e-04
21001.00000  22001.00000  1.306553582197e-04
22001.00000  23001.00000  1.177383767429e-04
23001.00000  24001.00000  1.092780256214e-04
24001.00000  25001.00000  9.826326441817e-05
25001.00000  26001.00000  9.177759910444e-05
26001.00000  27001.00000  8.300926946240e-05
27001.00000  28001.00000  7.752000524435e-05
28001.00000  29001.00000  6.954879647887e-05
29001.00000  30001.00000  6.713931746566e-05
30001.00000  31001.00000  5.876954826190e-05
31001.00000  32001.00000  5.710284097457e-05
32001.00000  33001.00000  5.291795637269e-05
33001.00000  34001.00000  5.034542990747e-05
34001.00000  35001.00000  4.585256678510e-05
35001.00000  36001.00000  4.541777357971e-05
36001.00000  37001.00000  4.003720766301e-05
37001.00000  38001.00000  3.922197040290e-05
38001.00000  39001.00000  3.601537051315e-05
39001.00000  40001.00000  3.481968919833e-05
40001.00000  41001.00000  3.304428360965e-05
41001.00000  42001.00000  3.114206333607e-05
42001.00000  43001.00000  2.808039451478e-05
43001.00000  44001.00000  2.661296744659e-05
44001.00000  45001.00000  2.601512678918e-05
45001.00000  46001.00000  2.456581610454e-05
46001.00000  47001.00000  2.378681161155e-05
47001.00000  48001.00000  2.248243199538e-05
48001.00000  49001.00000  2.088819024229e-05
49001.00000  50001.00000  2.027223320132e-05
50001.00000  51001.00000  1.971062531102e-05
51001.00000  52001.00000  1.911278465361e-05
52001.00000  53001.00000  1.769970673609e-05
53001.00000  54001.00000  1.704751692801e-05
54001.00000  55001.00000  1.567067177760e-05
55001.00000  56001.00000  1.498224920240e-05
56001.00000  57001.00000  1.568878816116e-05
57001.00000  58001.00000  1.496413281884e-05
58001.00000  59001.00000  1.293509786036e-05
59001.00000  60001.00000  1.244595550429e-05
60001.00000  61001.00000  1.318872723017e-05
61001.00000  62001.00000  1.230102443583e-05
62001.00000  63001.00000  1.164883462774e-05
63001.00000  64001.00000  1.152201994284e-05
64001.00000  65001.00000  1.112345950456e-05
65001.00000  66001.00000  1.092417928543e-05
66001.00000  67001.00000  1.023575671023e-05
67001.00000  68001.00000  9.311821148772e-06
68001.00000  69001.00000  1.000024372397e-05
69001.00000  70001.00000  9.293704765214e-06
70001.00000  71001.00000  8.605282190013e-06
71001.00000  72001.00000  8.242954518855e-06
72001.00000  73001.00000  8.478467505108e-06
73001.00000  74001.00000  7.916859614812e-06
74001.00000  75001.00000  7.717579395675e-06
75001.00000  76001.00000  7.590764710770e-06
76001.00000  77001.00000  6.920458519127e-06
77001.00000  78001.00000  7.083505971148e-06
78001.00000  79001.00000  6.340734245273e-06
79001.00000  80001.00000  6.938574902684e-06
80001.00000  81001.00000  6.358850628831e-06
81001.00000  82001.00000  6.286385094599e-06
82001.00000  83001.00000  5.652311670072e-06
83001.00000  84001.00000  5.543613368724e-06
84001.00000  85001.00000  5.724777204304e-06
85001.00000  86001.00000  5.145052930450e-06
86001.00000  87001.00000  5.289983998913e-06
87001.00000  88001.00000  4.855190793523e-06
88001.00000  89001.00000  4.583445040154e-06
89001.00000  90001.00000  4.565328656597e-06
90001.00000  91001.00000  4.076186300533e-06
91001.00000  92001.00000  4.800841642850e-06
92001.00000  93001.00000  3.858789697838e-06
93001.00000  94001.00000  4.058069916975e-06
94001.00000  95001.00000  3.750091396490e-06
95001.00000  96001.00000  4.130535451206e-06
96001.00000  97001.00000  3.713858629374e-06
97001.00000  98001.00000  3.750091396490e-06
98001.00000  99001.00000  3.514578410237e-06
99001.00000  100001.00000  3.605160328027e-06
100001.00000  101001.00000  3.297181807542e-06
101001.00000  102001.00000  3.134134355521e-06
102001.00000  103001.00000  3.134134355521e-06
103001.00000  104001.00000  2.699341150131e-06
104001.00000  105001.00000  3.116017971963e-06
105001.00000  106001.00000  3.170367122637e-06
106001.00000  107001.00000  3.224716273310e-06
107001.00000  108001.00000  2.626875615899e-06
108001.00000  109001.00000  2.934854136384e-06
109001.00000  110001.00000  2.753690300804e-06
110001.00000  111001.00000  2.463828163878e-06
111001.00000  112001.00000  2.427595396762e-06
112001.00000  113001.00000  2.518177314551e-06
113001.00000  114001.00000  2.391362629646e-06
114001.00000  115001.00000  2.065267725603e-06
115001.00000  116001.00000  2.192082410509e-06
116001.00000  117001.00000  2.137733259835e-06
117001.00000  118001.00000  2.192082410509e-06
118001.00000  119001.00000  1.956569424256e-06
119001.00000  120001.00000  2.137733259835e-06
120001.00000  121001.00000  2.119616876277e-06
121001.00000  122001.00000  1.974685807814e-06
122001.00000  123001.00000  1.974685807814e-06
123001.00000  124001.00000  2.010918574929e-06
124001.00000  125001.00000  2.047151342045e-06
125001.00000  126001.00000  1.865987506466e-06
126001.00000  127001.00000  1.974685807814e-06
127001.00000  128001.00000  1.829754739350e-06
128001.00000  129001.00000  1.539892602423e-06
129001.00000  130001.00000  1.811638355792e-06
130001.00000  131001.00000  1.612358136655e-06
131001.00000  132001.00000  1.884103890024e-06
132001.00000  133001.00000  1.485543451750e-06
133001.00000  134001.00000  1.576125369539e-06
134001.00000  135001.00000  1.576125369539e-06
135001.00000  136001.00000  1.394961533960e-06
136001.00000  137001.00000  1.449310684634e-06
137001.00000  138001.00000  1.250030465497e-06
138001.00000  139001.00000  1.630474520213e-06
139001.00000  140001.00000  1.268146849055e-06
140001.00000  141001.00000  1.177564931265e-06
141001.00000  142001.00000  1.358728766844e-06
142001.00000  143001.00000  1.304379616170e-06
143001.00000  144001.00000  1.286263232613e-06
144001.00000  145001.00000  1.612358136655e-06
145001.00000  146001.00000  1.014517479244e-06
146001.00000  147001.00000  1.177564931265e-06
147001.00000  148001.00000  9.058191778961e-07
148001.00000  149001.00000  1.195681314823e-06
149001.00000  150001.00000  1.141332164149e-06
150001.00000  151001.00000  1.014517479244e-06
151001.00000  152001.00000  1.068866629917e-06
152001.00000  153001.00000  8.877027943382e-07
153001.00000  154001.00000  8.152372601065e-07
154001.00000  155001.00000  9.782847121278e-07
155001.00000  156001.00000  1.014517479244e-06
156001.00000  157001.00000  9.420519450120e-07
157001.00000  158001.00000  9.420519450120e-07
158001.00000  159001.00000  9.420519450120e-07
159001.00000  160001.00000  9.239355614541e-07
160001.00000  161001.00000  8.877027943382e-07
161001.00000  162001.00000  9.420519450120e-07
162001.00000  163001.00000  7.246553423169e-07
163001.00000  164001.00000  7.790044929907e-07
164001.00000  165001.00000  1.032633862802e-06
165001.00000  166001.00000  8.514700272224e-07
166001.00000  167001.00000  8.333536436645e-07
167001.00000  168001.00000  8.695864107803e-07
168001.00000  169001.00000  6.884225752011e-07
169001.00000  170001.00000  7.065389587590e-07
170001.00000  171001.00000  7.790044929907e-07
171001.00000  172001.00000  6.884225752011e-07
172001.00000  173001.00000  7.971208765486e-07
173001.00000  174001.00000  8.514700272224e-07
174001.00000  175001.00000  6.521898080852e-07
175001.00000  176001.00000  6.340734245273e-07
176001.00000  177001.00000  7.065389587590e-07
177001.00000  178001.00000  4.891423560639e-07
178001.00000  179001.00000  6.521898080852e-07
179001.00000  180001.00000  4.529095889481e-07
180001.00000  181001.00000  5.797242738535e-07
181001.00000  182001.00000  3.985604382743e-07
182001.00000  183001.00000  8.514700272224e-07
183001.00000  184001.00000  6.703061916431e-07
184001.00000  185001.00000  4.347932053901e-07
185001.00000  186001.00000  7.065389587590e-07
186001.00000  187001.00000  3.623276711585e-07
187001.00000  188001.00000  6.159570409694e-07
188001.00000  189001.00000  5.978406574115e-07
189001.00000  190001.00000  3.985604382743e-07
190001.00000  191001.00000  3.985604382743e-07
191001.00000  192001.00000  6.340734245273e-07
192001.00000  193001.00000  4.166768218322e-07
193001.00000  194001.00000  6.340734245273e-07
194001.00000  195001.00000  4.891423560639e-07
195001.00000  196001.00000  5.978406574115e-07
196001.00000  197001.00000  3.623276711585e-07
197001.00000  198001.00000  5.253751231798e-07
198001.00000  199001.00000  2.717457533688e-07
