10001.00000  11001.00000  3.862886330829e-04
11001.00000  12001.00000  3.221353663232e-04
12001.00000  13001.00000  2.763231088270e-04
13001.00000  14001.00000  2.379599988911e-04
14001.00000  15001.00000  2.072070991655e-04
15001.00000  16001.00000  1.826450450476e-04
16001.00000  17001.00000  1.579823267734e-04
17001.00000  18001.00000  1.422686519873e-04
18001.00000  19001.00000  1.276522165040e-04
19001.00000  20001.00000  1.132169765019e-04
20001.00000  21001.00000  1.018016611864e-04
21001.00000  22001.00000  9.211776935795e-05
22001.00000  23001.00000  8.412503535399e-05
23001.00000  24001.00000  7.802478748699e-05
24001.00000  25001.00000  7.137088676077e-05
25001.00000  26001.00000  6.471698603456e-05
26001.00000  27001.00000  5.775102642406e-05
27001.00000  28001.00000  5.364392885023e-05
28001.00000  29001.00000  4.954689769203e-05
29001.00000  30001.00000  4.546999936508e-05
30001.00000  31001.00000  4.291312979706e-05
31001.00000  32001.00000  3.903755978255e-05
32001.00000  33001.00000  3.530291958675e-05
33001.00000  34001.00000  3.249438962818e-05
34001.00000  35001.00000  3.113542351919e-05
35001.00000  36001.00000  3.006838346325e-05
36001.00000  37001.00000  2.708872443910e-05
37001.00000  38001.00000  2.620287986436e-05
38001.00000  39001.00000  2.456205411795e-05
39001.00000  40001.00000  2.178372340625e-05
40001.00000  41001.00000  2.155219584694e-05
41001.00000  42001.00000  1.965970970998e-05
42001.00000  43001.00000  1.805914962607e-05
43001.00000  44001.00000  1.694177749201e-05
44001.00000  45001.00000  1.614653065787e-05
45001.00000  46001.00000  1.546201439556e-05
46001.00000  47001.00000  1.457616982082e-05
47001.00000  48001.00000  1.439497433962e-05
48001.00000  49001.00000  1.373059090856e-05
49001.00000  50001.00000  1.154617871856e-05
50001.00000  51001.00000  1.184817118723e-05
51001.00000  52001.00000  1.020734544082e-05
52001.00000  53001.00000  1.023754468769e-05
53001.00000  54001.00000  9.693958244094e-06
54001.00000  55001.00000  9.402032191052e-06
55001.00000  56001.00000  8.566519694417e-06
56001.00000  57001.00000  8.324925719486e-06
57001.00000  58001.00000  7.791405691515e-06
58001.00000  59001.00000  7.539745300962e-06
59001.00000  60001.00000  6.865295454280e-06
60001.00000  61001.00000  6.643834310594e-06
61001.00000  62001.00000  6.392173920041e-06
62001.00000  63001.00000  5.908985970180e-06
63001.00000  64001.00000  6.039849373267e-06
64001.00000  65001.00000  5.848587476447e-06
65001.00000  66001.00000  5.335200279719e-06
66001.00000  67001.00000  5.214403292254e-06
67001.00000  68001.00000  4.660750433038e-06
68001.00000  69001.00000  4.630551186171e-06
69001.00000  70001.00000  4.781547420503e-06
70001.00000  71001.00000  4.086964742577e-06
71001.00000  72001.00000  3.734640195803e-06
72001.00000  73001.00000  3.573577545850e-06
73001.00000  74001.00000  3.432647727140e-06
74001.00000  75001.00000  3.412514895896e-06
75001.00000  76001.00000  3.281651492808e-06
76001.00000  77001.00000  3.080323180366e-06
77001.00000  78001.00000  2.949459777279e-06
78001.00000  79001.00000  2.808529958569e-06
79001.00000  80001.00000  2.687732971104e-06
80001.00000  81001.00000  2.566935983639e-06
81001.00000  82001.00000  2.436072580551e-06
82001.00000  83001.00000  2.788397127325e-06
83001.00000  84001.00000  2.436072580551e-06
84001.00000  85001.00000  2.144146527510e-06
85001.00000  86001.00000  2.063615202533e-06
86001.00000  87001.00000  1.993150293178e-06
87001.00000  88001.00000  1.811954811980e-06
88001.00000  89001.00000  1.721357071381e-06
89001.00000  90001.00000  1.761622733870e-06
90001.00000  91001.00000  1.620692915160e-06
91001.00000  92001.00000  1.822021227602e-06
92001.00000  93001.00000  1.469696680828e-06
93001.00000  94001.00000  1.409298187096e-06
94001.00000  95001.00000  1.278434784008e-06
95001.00000  96001.00000  1.399231771474e-06
96001.00000  97001.00000  1.228102705898e-06
97001.00000  98001.00000  1.228102705898e-06
98001.00000  99001.00000  1.167704212165e-06
99001.00000  100001.00000  1.298567615252e-06
100001.00000  101001.00000  9.965751465891e-07
101001.00000  102001.00000  9.462430684785e-07
102001.00000  103001.00000  1.097239302810e-06
103001.00000  104001.00000  1.087172887188e-06
104001.00000  105001.00000  9.663758997227e-07
105001.00000  106001.00000  7.147155091699e-07
106001.00000  107001.00000  8.254460810132e-07
107001.00000  108001.00000  9.663758997227e-07
108001.00000  109001.00000  8.556453278795e-07
109001.00000  110001.00000  8.455789122574e-07
110001.00000  111001.00000  6.241177685709e-07
111001.00000  112001.00000  7.147155091699e-07
112001.00000  113001.00000  6.744498466815e-07
113001.00000  114001.00000  6.744498466815e-07
114001.00000  115001.00000  6.341841841930e-07
115001.00000  116001.00000  7.449147560363e-07
116001.00000  117001.00000  5.033207811056e-07
117001.00000  118001.00000  4.529887029950e-07
118001.00000  119001.00000  4.328558717508e-07
119001.00000  120001.00000  5.435864435940e-07
120001.00000  121001.00000  3.523245467739e-07
121001.00000  122001.00000  3.925902092624e-07
122001.00000  123001.00000  4.127230405066e-07
123001.00000  124001.00000  4.227894561287e-07
124001.00000  125001.00000  3.422581311518e-07
125001.00000  126001.00000  4.328558717508e-07
126001.00000  127001.00000  3.623909623960e-07
127001.00000  128001.00000  2.516603905528e-07
128001.00000  129001.00000  4.127230405066e-07
129001.00000  130001.00000  3.019924686634e-07
130001.00000  131001.00000  3.623909623960e-07
131001.00000  132001.00000  3.321917155297e-07
132001.00000  133001.00000  2.818596374191e-07
133001.00000  134001.00000  4.227894561287e-07
134001.00000  135001.00000  2.214611436865e-07
135001.00000  136001.00000  2.617268061749e-07
136001.00000  137001.00000  3.321917155297e-07
137001.00000  138001.00000  1.610626499538e-07
138001.00000  139001.00000  3.321917155297e-07
139001.00000  140001.00000  1.811954811980e-07
140001.00000  141001.00000  2.315275593086e-07
141001.00000  142001.00000  2.818596374191e-07
142001.00000  143001.00000  2.818596374191e-07
143001.00000  144001.00000  2.415939749307e-07
144001.00000  145001.00000  1.308634030875e-07
145001.00000  146001.00000  2.315275593086e-07
146001.00000  147001.00000  2.415939749307e-07
147001.00000  148001.00000  1.912618968201e-07
148001.00000  149001.00000  2.214611436865e-07
149001.00000  150001.00000  1.308634030875e-07
150001.00000  151001.00000  1.610626499538e-07
151001.00000  152001.00000  2.113947280643e-07
152001.00000  153001.00000  2.315275593086e-07
153001.00000  154001.00000  1.107305718432e-07
154001.00000  155001.00000  1.610626499538e-07
155001.00000  156001.00000  1.409298187096e-07
156001.00000  157001.00000  8.053132497689e-08
157001.00000  158001.00000  8.053132497689e-08
158001.00000  159001.00000  6.039849373267e-08
159001.00000  160001.00000  1.409298187096e-07
160001.00000  161001.00000  9.059774059901e-08
161001.00000  162001.00000  1.006641562211e-07
162001.00000  163001.00000  8.053132497689e-08
163001.00000  164001.00000  9.059774059901e-08
164001.00000  165001.00000  5.033207811056e-08
165001.00000  166001.00000  1.308634030875e-07
166001.00000  167001.00000  1.006641562211e-07
167001.00000  168001.00000  8.053132497689e-08
168001.00000  169001.00000  4.026566248845e-08
169001.00000  170001.00000  1.207969874653e-07
170001.00000  171001.00000  9.059774059901e-08
171001.00000  172001.00000  4.026566248845e-08
172001.00000  173001.00000  7.046490935478e-08
173001.00000  174001.00000  8.053132497689e-08
174001.00000  175001.00000  5.033207811056e-08
175001.00000  176001.00000  8.053132497689e-08
176001.00000  177001.00000  5.033207811056e-08
177001.00000  178001.00000  3.019924686634e-08
178001.00000  179001.00000  4.026566248845e-08
179001.00000  180001.00000  3.019924686634e-08
180001.00000  181001.00000  9.059774059901e-08
181001.00000  182001.00000  6.039849373267e-08
182001.00000  183001.00000  9.059774059901e-08
183001.00000  184001.00000  1.006641562211e-07
184001.00000  185001.00000  5.033207811056e-08
185001.00000  186001.00000  6.039849373267e-08
186001.00000  187001.00000  4.026566248845e-08
187001.00000  188001.00000  3.019924686634e-08
188001.00000  189001.00000  6.039849373267e-08
189001.00000  190001.00000  3.019924686634e-08
190001.00000  191001.00000  3.019924686634e-08
191001.00000  192001.00000  5.033207811056e-08
192001.00000  193001.00000  3.019924686634e-08
193001.00000  194001.00000  2.013283124422e-08
194001.00000  195001.00000  5.033207811056e-08
195001.00000  196001.00000  4.026566248845e-08
196001.00000  197001.00000  2.013283124422e-08
197001.00000  198001.00000  5.033207811056e-08
198001.00000  199001.00000  3.019924686634e-08
