10001.00000  11001.00000  1.220796708846e-04
11001.00000  12001.00000  9.960616995395e-05
12001.00000  13001.00000  8.085943048416e-05
13001.00000  14001.00000  6.109630152504e-05
14001.00000  15001.00000  5.601435407841e-05
15001.00000  16001.00000  4.701742489512e-05
16001.00000  17001.00000  4.035442713176e-05
17001.00000  18001.00000  3.425609019580e-05
18001.00000  19001.00000  3.071754901074e-05
19001.00000  20001.00000  2.620026239152e-05
20001.00000  21001.00000  2.375339880610e-05
21001.00000  22001.00000  2.021485762104e-05
22001.00000  23001.00000  1.867145135947e-05
23001.00000  24001.00000  1.528348639505e-05
24001.00000  25001.00000  1.565992694665e-05
25001.00000  26001.00000  1.374008013348e-05
26001.00000  27001.00000  1.264840253384e-05
27001.00000  28001.00000  1.174494520999e-05
28001.00000  29001.00000  9.787454341658e-06
29001.00000  30001.00000  9.599234065857e-06
30001.00000  31001.00000  8.771064852332e-06
31001.00000  32001.00000  7.792319418166e-06
32001.00000  33001.00000  6.700641818520e-06
33001.00000  34001.00000  6.211269101437e-06
34001.00000  35001.00000  6.474777487558e-06
35001.00000  36001.00000  5.797184494674e-06
36001.00000  37001.00000  4.592574729547e-06
37001.00000  38001.00000  4.818439060509e-06
38001.00000  39001.00000  4.893727170829e-06
39001.00000  40001.00000  3.764405516022e-06
40001.00000  41001.00000  4.140846067625e-06
41001.00000  42001.00000  3.199744688619e-06
42001.00000  43001.00000  3.689117405702e-06
43001.00000  44001.00000  3.538541185061e-06
44001.00000  45001.00000  3.726761460862e-06
45001.00000  46001.00000  2.785660081857e-06
46001.00000  47001.00000  2.070423033812e-06
47001.00000  48001.00000  2.559795750895e-06
48001.00000  49001.00000  2.145711144133e-06
49001.00000  50001.00000  2.145711144133e-06
50001.00000  51001.00000  1.919846813171e-06
51001.00000  52001.00000  1.618694371890e-06
52001.00000  53001.00000  1.919846813171e-06
53001.00000  54001.00000  2.032778978652e-06
54001.00000  55001.00000  1.806914647691e-06
55001.00000  56001.00000  1.543406261569e-06
56001.00000  57001.00000  1.581050316729e-06
57001.00000  58001.00000  1.995134923492e-06
58001.00000  59001.00000  1.204609765127e-06
59001.00000  60001.00000  1.279897875448e-06
60001.00000  61001.00000  1.392830040928e-06
61001.00000  62001.00000  1.392830040928e-06
62001.00000  63001.00000  1.279897875448e-06
63001.00000  64001.00000  1.279897875448e-06
64001.00000  65001.00000  9.787454341658e-07
65001.00000  66001.00000  9.034573238454e-07
66001.00000  67001.00000  5.646608274033e-07
67001.00000  68001.00000  1.129321654807e-06
68001.00000  69001.00000  1.054033544486e-06
69001.00000  70001.00000  1.204609765127e-06
70001.00000  71001.00000  6.399489377238e-07
71001.00000  72001.00000  7.528811032045e-07
72001.00000  73001.00000  7.152370480442e-07
73001.00000  74001.00000  6.775929928840e-07
74001.00000  75001.00000  8.281692135249e-07
75001.00000  76001.00000  7.528811032045e-07
76001.00000  77001.00000  6.775929928840e-07
77001.00000  78001.00000  7.905251583647e-07
78001.00000  79001.00000  5.270167722431e-07
79001.00000  80001.00000  9.034573238454e-07
80001.00000  81001.00000  4.517286619227e-07
81001.00000  82001.00000  6.775929928840e-07
82001.00000  83001.00000  5.646608274033e-07
83001.00000  84001.00000  5.646608274033e-07
84001.00000  85001.00000  3.764405516022e-07
85001.00000  86001.00000  3.011524412818e-07
86001.00000  87001.00000  6.399489377238e-07
87001.00000  88001.00000  6.775929928840e-07
88001.00000  89001.00000  4.893727170829e-07
89001.00000  90001.00000  4.517286619227e-07
90001.00000  91001.00000  4.140846067625e-07
91001.00000  92001.00000  2.635083861216e-07
92001.00000  93001.00000  4.893727170829e-07
93001.00000  94001.00000  3.011524412818e-07
94001.00000  95001.00000  4.517286619227e-07
95001.00000  96001.00000  4.517286619227e-07
96001.00000  97001.00000  2.635083861216e-07
97001.00000  98001.00000  3.764405516022e-07
98001.00000  99001.00000  5.646608274033e-07
99001.00000  100001.00000  1.505762206409e-07
100001.00000  101001.00000  3.011524412818e-07
101001.00000  102001.00000  1.882202758011e-07
102001.00000  103001.00000  3.011524412818e-07
103001.00000  104001.00000  1.505762206409e-07
104001.00000  105001.00000  1.882202758011e-07
105001.00000  106001.00000  4.140846067625e-07
106001.00000  107001.00000  2.635083861216e-07
107001.00000  108001.00000  4.893727170829e-07
108001.00000  109001.00000  2.635083861216e-07
109001.00000  110001.00000  2.258643309613e-07
110001.00000  111001.00000  1.505762206409e-07
111001.00000  112001.00000  2.258643309613e-07
112001.00000  113001.00000  1.882202758011e-07
113001.00000  114001.00000  2.258643309613e-07
114001.00000  115001.00000  1.505762206409e-07
115001.00000  116001.00000  2.258643309613e-07
116001.00000  117001.00000  1.882202758011e-07
117001.00000  118001.00000  2.258643309613e-07
118001.00000  119001.00000  3.011524412818e-07
119001.00000  120001.00000  1.882202758011e-07
120001.00000  121001.00000  1.505762206409e-07
121001.00000  122001.00000  2.635083861216e-07
122001.00000  123001.00000  1.129321654807e-07
123001.00000  124001.00000  3.764405516022e-08
124001.00000  125001.00000  3.764405516022e-08
125001.00000  126001.00000  1.505762206409e-07
126001.00000  127001.00000  1.505762206409e-07
127001.00000  128001.00000  1.505762206409e-07
128001.00000  129001.00000  3.764405516022e-08
129001.00000  130001.00000  7.528811032045e-08
130001.00000  131001.00000  7.528811032045e-08
131001.00000  132001.00000  1.129321654807e-07
132001.00000  133001.00000  1.882202758011e-07
133001.00000  134001.00000  1.882202758011e-07
134001.00000  135001.00000  7.528811032045e-08
135001.00000  136001.00000  1.882202758011e-07
136001.00000  137001.00000  1.129321654807e-07
137001.00000  138001.00000  7.528811032045e-08
138001.00000  139001.00000  3.764405516022e-08
139001.00000  140001.00000  3.764405516022e-08
140001.00000  141001.00000  3.764405516022e-08
141001.00000  142001.00000  3.764405516022e-08
142001.00000  143001.00000  2.258643309613e-07
143001.00000  144001.00000  1.129321654807e-07
144001.00000  145001.00000  1.129321654807e-07
145001.00000  146001.00000  3.764405516022e-08
146001.00000  147001.00000  7.528811032045e-08
147001.00000  148001.00000  0.000000000000e+00
148001.00000  149001.00000  3.764405516022e-08
149001.00000  150001.00000  1.505762206409e-07
150001.00000  151001.00000  1.129321654807e-07
151001.00000  152001.00000  0.000000000000e+00
152001.00000  153001.00000  0.000000000000e+00
153001.00000  154001.00000  3.764405516022e-08
154001.00000  155001.00000  3.764405516022e-08
155001.00000  156001.00000  7.528811032045e-08
156001.00000  157001.00000  0.000000000000e+00
157001.00000  158001.00000  1.505762206409e-07
158001.00000  159001.00000  7.528811032045e-08
159001.00000  160001.00000  0.000000000000e+00
160001.00000  161001.00000  7.528811032045e-08
161001.00000  162001.00000  3.764405516022e-08
162001.00000  163001.00000  0.000000000000e+00
163001.00000  164001.00000  3.764405516022e-08
164001.00000  165001.00000  7.528811032045e-08
165001.00000  166001.00000  1.129321654807e-07
166001.00000  167001.00000  1.505762206409e-07
167001.00000  168001.00000  0.000000000000e+00
168001.00000  169001.00000  7.528811032045e-08
169001.00000  170001.00000  3.764405516022e-08
170001.00000  171001.00000  1.129321654807e-07
171001.00000  172001.00000  0.000000000000e+00
172001.00000  173001.00000  7.528811032045e-08
173001.00000  174001.00000  7.528811032045e-08
174001.00000  175001.00000  0.000000000000e+00
175001.00000  176001.00000  0.000000000000e+00
176001.00000  177001.00000  0.000000000000e+00
177001.00000  178001.00000  1.129321654807e-07
178001.00000  179001.00000  0.000000000000e+00
179001.00000  180001.00000  0.000000000000e+00
180001.00000  181001.00000  7.528811032045e-08
181001.00000  182001.00000  0.000000000000e+00
182001.00000  183001.00000  7.528811032045e-08
183001.00000  184001.00000  0.000000000000e+00
184001.00000  185001.00000  7.528811032045e-08
185001.00000  186001.00000  7.528811032045e-08
186001.00000  187001.00000  0.000000000000e+00
187001.00000  188001.00000  3.764405516022e-08
188001.00000  189001.00000  7.528811032045e-08
189001.00000  190001.00000  7.528811032045e-08
190001.00000  191001.00000  1.129321654807e-07
191001.00000  192001.00000  1.129321654807e-07
192001.00000  193001.00000  7.528811032045e-08
193001.00000  194001.00000  0.000000000000e+00
194001.00000  195001.00000  0.000000000000e+00
195001.00000  196001.00000  0.000000000000e+00
196001.00000  197001.00000  3.764405516022e-08
197001.00000  198001.00000  0.000000000000e+00
198001.00000  199001.00000  3.764405516022e-08
