300.00000  350.00000  6.212299405665e-01
350.00000  400.00000  4.390115973918e-01
400.00000  450.00000  3.259158055958e-01
450.00000  500.00000  2.475041085216e-01
500.00000  550.00000  1.956535372524e-01
550.00000  600.00000  1.562886280013e-01
600.00000  650.00000  1.277930017661e-01
650.00000  700.00000  1.064571210861e-01
700.00000  750.00000  8.928259083159e-02
750.00000  800.00000  7.583128933988e-02
800.00000  850.00000  6.545006097034e-02
850.00000  900.00000  5.650239245322e-02
900.00000  950.00000  4.982506394958e-02
950.00000  1000.00000  4.343283667503e-02
1000.00000  1050.00000  3.868034415302e-02
1050.00000  1100.00000  3.439979886333e-02
1100.00000  1150.00000  3.070797955798e-02
1150.00000  1200.00000  2.767012126396e-02
1200.00000  1250.00000  2.512514984055e-02
1250.00000  1300.00000  2.281534666259e-02
1300.00000  1350.00000  2.053695294208e-02
1350.00000  1400.00000  1.858795583934e-02
1400.00000  1450.00000  1.728244992878e-02
1450.00000  1500.00000  1.590365528420e-02
1500.00000  1550.00000  1.459976011506e-02
1550.00000  1600.00000  1.348190557844e-02
1600.00000  1650.00000  1.254848093296e-02
1650.00000  1700.00000  1.160297572692e-02
1700.00000  1750.00000  1.079841039401e-02
1750.00000  1800.00000  1.002605988925e-02
1800.00000  1850.00000  9.545253579195e-03
1850.00000  1900.00000  8.752768806842e-03
1900.00000  1950.00000  8.295318247191e-03
1950.00000  2000.00000  7.758135987883e-03
2000.00000  2050.00000  7.336927109894e-03
2050.00000  2100.00000  6.941490094421e-03
2100.00000  2150.00000  6.543636966838e-03
2150.00000  2200.00000  6.147394580661e-03
2200.00000  2250.00000  5.710883659304e-03
2250.00000  2300.00000  5.646454003015e-03
2300.00000  2350.00000  5.317057385238e-03
2350.00000  2400.00000  4.884573317399e-03
2400.00000  2450.00000  4.689673607126e-03
2450.00000  2500.00000  4.562425035955e-03
2500.00000  2550.00000  4.274907694766e-03
2550.00000  2600.00000  4.061484458309e-03
2600.00000  2650.00000  3.858531040999e-03
2650.00000  2700.00000  3.666047442836e-03
2700.00000  2750.00000  3.529939793926e-03
2750.00000  2800.00000  3.281885617214e-03
2800.00000  2850.00000  3.309268221137e-03
2850.00000  2900.00000  3.045106630352e-03
2900.00000  2950.00000  3.016918655726e-03
2950.00000  3000.00000  2.901750645110e-03
3000.00000  3050.00000  2.771280591125e-03
3050.00000  3100.00000  2.602152743366e-03
3100.00000  3150.00000  2.505508258933e-03
3150.00000  3200.00000  2.416112110832e-03
3200.00000  3250.00000  2.366984497912e-03
3250.00000  3300.00000  2.191413684525e-03
3300.00000  3350.00000  2.200272762265e-03
3350.00000  3400.00000  2.131816252458e-03
3400.00000  3450.00000  2.002956939880e-03
3450.00000  3500.00000  1.968325999625e-03
3500.00000  3550.00000  1.901480231225e-03
3550.00000  3600.00000  1.816916307346e-03
3600.00000  3650.00000  1.766983323722e-03
3650.00000  3700.00000  1.724298676431e-03
3700.00000  3750.00000  1.543895638822e-03
3750.00000  3800.00000  1.526177483342e-03
3800.00000  3850.00000  1.599466217371e-03
3850.00000  3900.00000  1.527788224750e-03
3900.00000  3950.00000  1.464969309868e-03
3950.00000  4000.00000  1.413425584837e-03
4000.00000  4050.00000  1.395707429357e-03
4050.00000  4100.00000  1.315975729700e-03
4100.00000  4150.00000  1.329667031661e-03
4150.00000  4200.00000  1.258794409744e-03
4200.00000  4250.00000  1.162955296014e-03
4250.00000  4300.00000  1.149263994053e-03
4300.00000  4350.00000  1.100941751836e-03
4350.00000  4400.00000  1.121076019426e-03
4400.00000  4450.00000  1.118659907315e-03
4450.00000  4500.00000  1.080002113542e-03
4500.00000  4550.00000  1.000270413885e-03
4550.00000  4600.00000  9.946328189593e-04
4600.00000  4650.00000  1.013156345142e-03
4650.00000  4700.00000  9.189279728199e-04
4700.00000  4750.00000  8.802701790466e-04
4750.00000  4800.00000  8.577197993455e-04
4800.00000  4850.00000  8.794648083430e-04
4850.00000  4900.00000  8.665788770852e-04
4900.00000  4950.00000  8.142297813505e-04
4950.00000  5000.00000  8.198673762758e-04
5000.00000  5050.00000  8.053707036108e-04
5050.00000  5100.00000  7.554377199869e-04
5100.00000  5150.00000  7.473840129508e-04
5150.00000  5200.00000  7.369141938039e-04
5200.00000  5250.00000  7.256390039533e-04
5250.00000  5300.00000  7.191960383244e-04
5300.00000  5350.00000  6.781221324403e-04
5350.00000  5400.00000  6.612093476645e-04
5400.00000  5450.00000  6.523502699247e-04
5450.00000  5500.00000  5.863098722287e-04
5500.00000  5550.00000  6.459073042958e-04
5550.00000  5600.00000  6.459073042958e-04
5600.00000  5650.00000  5.573165268987e-04
5650.00000  5700.00000  5.935582085611e-04
5700.00000  5750.00000  6.048333984117e-04
5750.00000  5800.00000  5.685917167492e-04
5800.00000  5850.00000  5.371822593084e-04
5850.00000  5900.00000  5.573165268987e-04
5900.00000  5950.00000  5.073835432748e-04
5950.00000  6000.00000  4.880546463881e-04
6000.00000  6050.00000  5.041620604604e-04
6050.00000  6100.00000  4.687257495015e-04
6100.00000  6150.00000  5.202694745326e-04
6150.00000  6200.00000  4.679203787979e-04
6200.00000  6250.00000  5.057728018676e-04
6250.00000  6300.00000  4.944976120170e-04
6300.00000  6350.00000  4.703364909087e-04
6350.00000  6400.00000  7.095315898811e-04
6400.00000  6450.00000  4.534237061329e-04
6450.00000  6500.00000  3.962423861765e-04
6500.00000  6550.00000  4.115444295451e-04
6550.00000  6600.00000  4.059068346198e-04
6600.00000  6650.00000  4.300679557282e-04
6650.00000  6700.00000  4.316786971354e-04
6700.00000  6750.00000  3.833564549187e-04
6750.00000  6800.00000  3.897994205476e-04
6800.00000  6850.00000  3.753027478826e-04
6850.00000  6900.00000  3.632221873285e-04
6900.00000  6950.00000  3.632221873285e-04
6950.00000  7000.00000  3.293966177768e-04
7000.00000  7050.00000  3.688597822537e-04
7050.00000  7100.00000  3.897994205476e-04
7100.00000  7150.00000  3.012086431504e-04
7150.00000  7200.00000  3.358395834057e-04
7200.00000  7250.00000  3.318127298876e-04
7250.00000  7300.00000  2.907388240035e-04
7300.00000  7350.00000  3.044301259649e-04
7350.00000  7400.00000  3.012086431504e-04
7400.00000  7450.00000  2.818797462638e-04
7450.00000  7500.00000  2.818797462638e-04
7500.00000  7550.00000  2.569132544518e-04
7550.00000  7600.00000  3.028193845577e-04
7600.00000  7650.00000  3.116784622974e-04
7650.00000  7700.00000  2.351682454543e-04
7700.00000  7750.00000  2.851012290782e-04
7750.00000  7800.00000  2.561078837482e-04
7800.00000  7850.00000  2.722152978204e-04
7850.00000  7900.00000  2.480541767121e-04
7900.00000  7950.00000  2.553025130446e-04
7950.00000  8000.00000  2.585239958591e-04
8000.00000  8050.00000  2.657723321916e-04
8050.00000  8100.00000  2.561078837482e-04
8100.00000  8150.00000  2.464434353049e-04
8150.00000  8200.00000  2.246984263074e-04
8200.00000  8250.00000  2.295306505291e-04
8250.00000  8300.00000  2.319467626399e-04
8300.00000  8350.00000  2.126178657532e-04
8350.00000  8400.00000  2.150339778641e-04
8400.00000  8450.00000  2.037587880135e-04
8450.00000  8500.00000  2.158393485677e-04
8500.00000  8550.00000  2.303360212327e-04
8550.00000  8600.00000  1.932889688666e-04
8600.00000  8650.00000  1.908728567558e-04
8650.00000  8700.00000  1.997319344955e-04
8700.00000  8750.00000  1.900674860521e-04
8750.00000  8800.00000  1.876513739413e-04
8800.00000  8850.00000  1.940943395702e-04
8850.00000  8900.00000  1.699332184619e-04
8900.00000  8950.00000  1.908728567558e-04
8950.00000  9000.00000  1.916782274594e-04
9000.00000  9050.00000  1.675171063510e-04
9050.00000  9100.00000  1.852352618305e-04
9100.00000  9150.00000  1.691278477583e-04
9150.00000  9200.00000  1.691278477583e-04
9200.00000  9250.00000  1.626848821294e-04
9250.00000  9300.00000  1.884567446449e-04
9300.00000  9350.00000  1.739600719799e-04
9350.00000  9400.00000  1.618795114258e-04
9400.00000  9450.00000  1.538258043897e-04
9450.00000  9500.00000  1.707385891655e-04
9500.00000  9550.00000  1.626848821294e-04
9550.00000  9600.00000  1.514096922788e-04
9600.00000  9650.00000  1.248324590597e-04
9650.00000  9700.00000  1.610741407222e-04
9700.00000  9750.00000  1.675171063510e-04
9750.00000  9800.00000  1.570472872041e-04
9800.00000  9850.00000  1.361076489102e-04
9850.00000  9900.00000  1.353022782066e-04
9900.00000  9950.00000  1.232217176525e-04
9950.00000  10000.00000  1.377183903174e-04
