300.00000  350.00000  2.895389821560e-05
350.00000  400.00000  3.981161004646e-05
400.00000  450.00000  3.981161004646e-05
450.00000  500.00000  3.719771645755e-05
500.00000  550.00000  3.981161004646e-05
550.00000  600.00000  2.272076734974e-05
600.00000  650.00000  2.654107336430e-05
650.00000  700.00000  1.990580502323e-05
700.00000  750.00000  2.272076734974e-05
750.00000  800.00000  2.392717977539e-05
800.00000  850.00000  3.076351685408e-05
850.00000  900.00000  2.111221744888e-05
900.00000  950.00000  1.769404890954e-05
950.00000  1000.00000  2.171542366170e-05
1000.00000  1050.00000  1.990580502323e-05
1050.00000  1100.00000  1.849832385997e-05
1100.00000  1150.00000  1.990580502323e-05
1150.00000  1200.00000  1.990580502323e-05
1200.00000  1250.00000  2.010687376084e-05
1250.00000  1300.00000  2.694321083952e-05
1300.00000  1350.00000  1.367267415737e-05
1350.00000  1400.00000  1.729191143432e-05
1400.00000  1450.00000  1.990580502323e-05
1450.00000  1500.00000  1.849832385997e-05
1500.00000  1550.00000  1.688977395910e-05
1550.00000  1600.00000  1.769404890954e-05
1600.00000  1650.00000  1.829725512236e-05
1650.00000  1700.00000  1.869939259758e-05
1700.00000  1750.00000  3.759985393276e-05
1750.00000  1800.00000  1.749298017193e-05
1800.00000  1850.00000  1.869939259758e-05
1850.00000  1900.00000  1.648763648389e-05
1900.00000  1950.00000  1.829725512236e-05
1950.00000  2000.00000  1.769404890954e-05
2000.00000  2050.00000  2.151435492409e-05
2050.00000  2100.00000  2.071007997366e-05
2100.00000  2150.00000  2.191649239931e-05
2150.00000  2200.00000  1.749298017193e-05
2200.00000  2250.00000  1.628656774628e-05
2250.00000  2300.00000  2.111221744888e-05
2300.00000  2350.00000  5.308214672861e-05
2350.00000  2400.00000  1.990580502323e-05
2400.00000  2450.00000  1.970473628562e-05
2450.00000  2500.00000  1.970473628562e-05
2500.00000  2550.00000  2.372611103779e-05
2550.00000  2600.00000  2.111221744888e-05
2600.00000  2650.00000  2.010687376084e-05
2650.00000  2700.00000  2.493252346344e-05
2700.00000  2750.00000  2.211756113692e-05
2750.00000  2800.00000  1.970473628562e-05
2800.00000  2850.00000  1.890046133519e-05
2850.00000  2900.00000  2.030794249844e-05
2900.00000  2950.00000  2.774748578995e-05
2950.00000  3000.00000  3.780092267037e-05
3000.00000  3050.00000  2.111221744888e-05
3050.00000  3100.00000  2.513359220105e-05
3100.00000  3150.00000  2.312290482496e-05
3150.00000  3200.00000  2.513359220105e-05
3200.00000  3250.00000  2.654107336430e-05
3250.00000  3300.00000  2.794855452756e-05
3300.00000  3350.00000  2.453038598822e-05
3350.00000  3400.00000  2.453038598822e-05
3400.00000  3450.00000  2.955710442843e-05
3450.00000  3500.00000  2.835069200278e-05
3500.00000  3550.00000  2.694321083952e-05
3550.00000  3600.00000  2.573679841387e-05
3600.00000  3650.00000  2.955710442843e-05
3650.00000  3700.00000  4.544153469949e-05
3700.00000  3750.00000  3.337741044299e-05
3750.00000  3800.00000  3.036137937886e-05
3800.00000  3850.00000  3.136672306690e-05
3850.00000  3900.00000  3.619237276950e-05
3900.00000  3950.00000  3.538809781907e-05
3950.00000  4000.00000  3.096458559169e-05
4000.00000  4050.00000  3.538809781907e-05
4050.00000  4100.00000  3.257313549255e-05
4100.00000  4150.00000  2.955710442843e-05
4150.00000  4200.00000  3.016031064125e-05
4200.00000  4250.00000  3.679557898233e-05
4250.00000  4300.00000  3.579023529429e-05
4300.00000  4350.00000  3.518702908146e-05
4350.00000  4400.00000  3.679557898233e-05
4400.00000  4450.00000  4.343084732341e-05
4450.00000  4500.00000  3.538809781907e-05
4500.00000  4550.00000  3.820306014559e-05
4550.00000  4600.00000  3.961054130885e-05
4600.00000  4650.00000  3.558916655668e-05
4650.00000  4700.00000  3.961054130885e-05
4700.00000  4750.00000  4.423512227384e-05
4750.00000  4800.00000  3.418168539342e-05
4800.00000  4850.00000  4.081695373450e-05
4850.00000  4900.00000  4.322977858580e-05
4900.00000  4950.00000  4.463725974906e-05
4950.00000  5000.00000  4.101802247211e-05
5000.00000  5050.00000  4.282764111058e-05
5050.00000  5100.00000  4.564260343710e-05
5100.00000  5150.00000  4.363191606101e-05
5150.00000  5200.00000  4.162122868493e-05
5200.00000  5250.00000  4.926184071405e-05
5250.00000  5300.00000  4.383298479862e-05
5300.00000  5350.00000  5.388642167904e-05
5350.00000  5400.00000  4.463725974906e-05
5400.00000  5450.00000  5.428855915426e-05
5450.00000  5500.00000  4.986504692687e-05
5500.00000  5550.00000  4.564260343710e-05
5550.00000  5600.00000  4.805542828840e-05
5600.00000  5650.00000  5.368535294143e-05
5650.00000  5700.00000  5.227787177817e-05
5700.00000  5750.00000  5.167466556535e-05
5750.00000  5800.00000  5.569604031752e-05
5800.00000  5850.00000  5.549497157991e-05
5850.00000  5900.00000  5.448962789187e-05
5900.00000  5950.00000  5.609817779273e-05
5950.00000  6000.00000  5.388642167904e-05
6000.00000  6050.00000  5.107145935252e-05
6050.00000  6100.00000  6.011955254490e-05
6100.00000  6150.00000  5.408749041665e-05
6150.00000  6200.00000  6.514627098511e-05
6200.00000  6250.00000  6.776016457402e-05
6250.00000  6300.00000  8.666062590920e-05
6300.00000  6350.00000  8.786703833485e-05
6350.00000  6400.00000  7.047459253173e-04
6400.00000  6450.00000  5.087039061492e-05
6450.00000  6500.00000  5.107145935252e-05
6500.00000  6550.00000  5.529390284230e-05
6550.00000  6600.00000  5.308214672861e-05
6600.00000  6650.00000  5.509283410469e-05
6650.00000  6700.00000  5.489176536708e-05
6700.00000  6750.00000  5.569604031752e-05
6750.00000  6800.00000  6.052169002012e-05
6800.00000  6850.00000  6.011955254490e-05
6850.00000  6900.00000  6.373878982185e-05
6900.00000  6950.00000  6.253237739620e-05
6950.00000  7000.00000  5.549497157991e-05
7000.00000  7050.00000  4.946290945166e-05
7050.00000  7100.00000  1.218476549907e-04
7100.00000  7150.00000  3.558916655668e-05
7150.00000  7200.00000  3.418168539342e-05
7200.00000  7250.00000  3.538809781907e-05
7250.00000  7300.00000  3.679557898233e-05
7300.00000  7350.00000  3.096458559169e-05
7350.00000  7400.00000  3.237206675495e-05
7400.00000  7450.00000  3.337741044299e-05
7450.00000  7500.00000  6.414092729707e-05
7500.00000  7550.00000  3.076351685408e-05
7550.00000  7600.00000  3.579023529429e-05
7600.00000  7650.00000  3.418168539342e-05
7650.00000  7700.00000  3.739878519516e-05
7700.00000  7750.00000  3.599130403190e-05
7750.00000  7800.00000  3.679557898233e-05
7800.00000  7850.00000  3.196992927973e-05
7850.00000  7900.00000  3.780092267037e-05
7900.00000  7950.00000  3.438275413103e-05
7950.00000  8000.00000  3.800199140798e-05
8000.00000  8050.00000  3.116565432930e-05
8050.00000  8100.00000  3.538809781907e-05
8100.00000  8150.00000  3.036137937886e-05
8150.00000  8200.00000  3.136672306690e-05
8200.00000  8250.00000  3.156779180451e-05
8250.00000  8300.00000  3.377954791820e-05
8300.00000  8350.00000  3.377954791820e-05
8350.00000  8400.00000  3.317634170538e-05
8400.00000  8450.00000  3.780092267037e-05
8450.00000  8500.00000  3.176886054212e-05
8500.00000  8550.00000  3.478489160625e-05
8550.00000  8600.00000  3.176886054212e-05
8600.00000  8650.00000  2.935603569082e-05
8650.00000  8700.00000  3.297527296777e-05
8700.00000  8750.00000  3.277420423016e-05
8750.00000  8800.00000  3.639344150711e-05
8800.00000  8850.00000  3.940947257124e-05
8850.00000  8900.00000  3.518702908146e-05
8900.00000  8950.00000  3.920840383363e-05
8950.00000  9000.00000  3.418168539342e-05
9000.00000  9050.00000  3.116565432930e-05
9050.00000  9100.00000  3.579023529429e-05
9100.00000  9150.00000  3.136672306690e-05
9150.00000  9200.00000  2.955710442843e-05
9200.00000  9250.00000  3.357847918060e-05
9250.00000  9300.00000  3.398061665581e-05
9300.00000  9350.00000  3.518702908146e-05
9350.00000  9400.00000  3.377954791820e-05
9400.00000  9450.00000  3.538809781907e-05
9450.00000  9500.00000  3.619237276950e-05
9500.00000  9550.00000  3.237206675495e-05
9550.00000  9600.00000  3.398061665581e-05
9600.00000  9650.00000  3.237206675495e-05
9650.00000  9700.00000  3.659451024472e-05
9700.00000  9750.00000  3.518702908146e-05
9750.00000  9800.00000  3.579023529429e-05
9800.00000  9850.00000  3.538809781907e-05
9850.00000  9900.00000  2.995924190365e-05
9900.00000  9950.00000  3.217099801734e-05
9950.00000  10000.00000  3.156779180451e-05
