300.00000  350.00000  6.102289577611e-05
350.00000  400.00000  9.643124270793e-05
400.00000  450.00000  7.232343203095e-05
450.00000  500.00000  8.136386103482e-05
500.00000  550.00000  4.233934250145e-04
550.00000  600.00000  5.198246677224e-05
600.00000  650.00000  1.092385171301e-04
650.00000  700.00000  6.478974119439e-05
700.00000  750.00000  9.191102820600e-05
750.00000  800.00000  6.102289577611e-05
800.00000  850.00000  1.793018419101e-04
850.00000  900.00000  5.800941944149e-05
900.00000  950.00000  5.800941944149e-05
950.00000  1000.00000  4.896899043762e-05
1000.00000  1050.00000  6.102289577611e-05
1050.00000  1100.00000  7.232343203095e-05
1100.00000  1150.00000  6.328300302708e-05
1150.00000  1200.00000  4.444877593569e-05
1200.00000  1250.00000  6.704984844536e-05
1250.00000  1300.00000  1.567007694004e-04
1300.00000  1350.00000  6.478974119439e-05
1350.00000  1400.00000  6.780321752901e-05
1400.00000  1450.00000  6.102289577611e-05
1450.00000  1500.00000  6.855658661267e-05
1500.00000  1550.00000  5.650268127418e-05
1550.00000  1600.00000  6.629647936170e-05
1600.00000  1650.00000  6.102289577611e-05
1650.00000  1700.00000  5.499594310687e-05
1700.00000  1750.00000  1.793018419101e-04
1750.00000  1800.00000  7.081669386364e-05
1800.00000  1850.00000  6.478974119439e-05
1850.00000  1900.00000  7.006332477998e-05
1900.00000  1950.00000  5.574931219052e-05
1950.00000  2000.00000  5.348920493956e-05
2000.00000  2050.00000  9.191102820600e-05
2050.00000  2100.00000  7.835038470019e-05
2100.00000  2150.00000  6.478974119439e-05
2150.00000  2200.00000  7.081669386364e-05
2200.00000  2250.00000  7.835038470019e-05
2250.00000  2300.00000  5.725605035783e-05
2300.00000  2350.00000  1.815619491610e-04
2350.00000  2400.00000  7.006332477998e-05
2400.00000  2450.00000  7.759701561654e-05
2450.00000  2500.00000  7.383017019826e-05
2500.00000  2550.00000  6.478974119439e-05
2550.00000  2600.00000  7.533690836557e-05
2600.00000  2650.00000  7.684364653288e-05
2650.00000  2700.00000  6.780321752901e-05
2700.00000  2750.00000  7.232343203095e-05
2750.00000  2800.00000  5.348920493956e-05
2800.00000  2850.00000  7.157006294729e-05
2850.00000  2900.00000  6.403637211073e-05
2900.00000  2950.00000  6.026952669246e-05
2950.00000  3000.00000  9.793798087524e-05
3000.00000  3050.00000  6.252963394342e-05
3050.00000  3100.00000  7.232343203095e-05
3100.00000  3150.00000  5.951615760880e-05
3150.00000  3200.00000  7.835038470019e-05
3200.00000  3250.00000  7.985712286750e-05
3250.00000  3300.00000  6.177626485977e-05
3300.00000  3350.00000  7.910375378385e-05
3350.00000  3400.00000  8.136386103482e-05
3400.00000  3450.00000  7.307680111460e-05
3450.00000  3500.00000  8.965092095503e-05
3500.00000  3550.00000  8.136386103482e-05
3550.00000  3600.00000  8.513070645309e-05
3600.00000  3650.00000  8.136386103482e-05
3650.00000  3700.00000  1.243058988032e-04
3700.00000  3750.00000  9.417113545696e-05
3750.00000  3800.00000  1.039649335445e-04
3800.00000  3850.00000  1.235525297195e-04
3850.00000  3900.00000  1.062250407955e-04
3900.00000  3950.00000  1.137587316320e-04
3950.00000  4000.00000  1.408800186436e-04
4000.00000  4050.00000  1.416333877273e-04
4050.00000  4100.00000  1.333463278071e-04
4100.00000  4150.00000  1.536872930658e-04
4150.00000  4200.00000  1.416333877273e-04
4200.00000  4250.00000  1.386199113926e-04
4250.00000  4300.00000  1.431401258946e-04
4300.00000  4350.00000  1.567007694004e-04
4350.00000  4400.00000  1.702614129062e-04
4400.00000  4450.00000  1.838220564120e-04
4450.00000  4500.00000  2.177236651765e-04
4500.00000  4550.00000  2.154635579255e-04
4550.00000  4600.00000  2.192304033438e-04
4600.00000  4650.00000  1.936158544995e-04
4650.00000  4700.00000  2.252573560131e-04
4700.00000  4750.00000  2.214905105948e-04
4750.00000  4800.00000  2.229972487621e-04
4800.00000  4850.00000  2.169702960928e-04
4850.00000  4900.00000  2.192304033438e-04
4900.00000  4950.00000  2.275174632640e-04
4950.00000  5000.00000  2.621724411122e-04
5000.00000  5050.00000  2.561454884429e-04
5050.00000  5100.00000  2.365578922679e-04
5100.00000  5150.00000  2.553921193593e-04
5150.00000  5200.00000  2.749797155343e-04
5200.00000  5250.00000  2.651859174468e-04
5250.00000  5300.00000  2.591589647776e-04
5300.00000  5350.00000  2.742263464507e-04
5350.00000  5400.00000  2.734729773670e-04
5400.00000  5450.00000  3.005942643786e-04
5450.00000  5500.00000  2.915538353748e-04
5500.00000  5550.00000  2.990875262113e-04
5550.00000  5600.00000  2.810066682036e-04
5600.00000  5650.00000  2.832667754545e-04
5650.00000  5700.00000  2.757330846180e-04
5700.00000  5750.00000  2.915538353748e-04
5750.00000  5800.00000  2.960740498767e-04
5800.00000  5850.00000  3.156616460517e-04
5850.00000  5900.00000  3.058678479642e-04
5900.00000  5950.00000  2.591589647776e-04
5950.00000  6000.00000  2.674460246978e-04
6000.00000  6050.00000  3.005942643786e-04
6050.00000  6100.00000  2.832667754545e-04
6100.00000  6150.00000  2.945673117094e-04
6150.00000  6200.00000  3.141549078844e-04
6200.00000  6250.00000  3.156616460517e-04
6250.00000  6300.00000  3.578503147365e-04
6300.00000  6350.00000  2.900470972074e-04
6350.00000  6400.00000  1.075811051460e-03
6400.00000  6450.00000  2.810066682036e-04
6450.00000  6500.00000  2.764864537016e-04
6500.00000  6550.00000  2.764864537016e-04
6550.00000  6600.00000  2.840201445382e-04
6600.00000  6650.00000  2.885403590401e-04
6650.00000  6700.00000  2.681993937814e-04
6700.00000  6750.00000  2.757330846180e-04
6750.00000  6800.00000  2.817600372872e-04
6800.00000  6850.00000  2.990875262113e-04
6850.00000  6900.00000  2.757330846180e-04
6900.00000  6950.00000  2.546387502756e-04
6950.00000  7000.00000  2.455983212718e-04
7000.00000  7050.00000  2.666926556141e-04
7050.00000  7100.00000  3.480565166489e-04
7100.00000  7150.00000  1.303328514724e-04
7150.00000  7200.00000  1.280727442215e-04
7200.00000  7250.00000  1.227991606359e-04
7250.00000  7300.00000  1.235525297195e-04
7300.00000  7350.00000  1.288261133051e-04
7350.00000  7400.00000  1.386199113926e-04
7400.00000  7450.00000  1.348530659744e-04
7450.00000  7500.00000  1.506738167311e-04
7500.00000  7550.00000  1.386199113926e-04
7550.00000  7600.00000  1.137587316320e-04
7600.00000  7650.00000  1.348530659744e-04
7650.00000  7700.00000  1.130053625484e-04
7700.00000  7750.00000  1.408800186436e-04
7750.00000  7800.00000  1.167722079666e-04
7800.00000  7850.00000  1.356064350580e-04
7850.00000  7900.00000  1.280727442215e-04
7900.00000  7950.00000  1.363598041417e-04
7950.00000  8000.00000  1.160188388830e-04
8000.00000  8050.00000  1.099918862137e-04
8050.00000  8100.00000  1.446468640619e-04
8100.00000  8150.00000  1.378665423090e-04
8150.00000  8200.00000  1.220457915522e-04
8200.00000  8250.00000  1.024581953772e-04
8250.00000  8300.00000  1.265660060542e-04
8300.00000  8350.00000  1.258126369705e-04
8350.00000  8400.00000  1.197856843013e-04
8400.00000  8450.00000  1.137587316320e-04
8450.00000  8500.00000  1.160188388830e-04
8500.00000  8550.00000  1.205390533849e-04
8550.00000  8600.00000  1.062250407955e-04
8600.00000  8650.00000  1.009514572099e-04
8650.00000  8700.00000  9.191102820600e-05
8700.00000  8750.00000  1.152654697993e-04
8750.00000  8800.00000  1.243058988032e-04
8800.00000  8850.00000  1.009514572099e-04
8850.00000  8900.00000  1.001980881262e-04
8900.00000  8950.00000  1.137587316320e-04
8950.00000  9000.00000  1.039649335445e-04
9000.00000  9050.00000  1.235525297195e-04
9050.00000  9100.00000  1.175255770503e-04
9100.00000  9150.00000  1.054716717118e-04
9150.00000  9200.00000  1.137587316320e-04
9200.00000  9250.00000  9.869134995890e-05
9250.00000  9300.00000  1.092385171301e-04
9300.00000  9350.00000  1.107452552974e-04
9350.00000  9400.00000  1.024581953772e-04
9400.00000  9450.00000  8.211723011847e-05
9450.00000  9500.00000  8.965092095503e-05
9500.00000  9550.00000  9.718461179159e-05
9550.00000  9600.00000  9.718461179159e-05
9600.00000  9650.00000  1.009514572099e-04
9650.00000  9700.00000  8.513070645309e-05
9700.00000  9750.00000  1.069784098791e-04
9750.00000  9800.00000  1.039649335445e-04
9800.00000  9850.00000  9.492450454062e-05
9850.00000  9900.00000  1.039649335445e-04
9900.00000  9950.00000  9.341776637331e-05
9950.00000  10000.00000  9.718461179159e-05
