300.00000  350.00000  6.328264886007e-02
350.00000  400.00000  4.712342449150e-02
400.00000  450.00000  3.705599813386e-02
450.00000  500.00000  2.950391095023e-02
500.00000  550.00000  2.435041121458e-02
550.00000  600.00000  2.011700076940e-02
600.00000  650.00000  1.690757793971e-02
650.00000  700.00000  1.450113563555e-02
700.00000  750.00000  1.259276262134e-02
750.00000  800.00000  1.099894089348e-02
800.00000  850.00000  9.794291585729e-03
850.00000  900.00000  8.779229943186e-03
900.00000  950.00000  7.796658842139e-03
950.00000  1000.00000  7.012244340322e-03
1000.00000  1050.00000  6.250680329227e-03
1050.00000  1100.00000  5.817592122261e-03
1100.00000  1150.00000  5.245615776375e-03
1150.00000  1200.00000  4.786820767347e-03
1200.00000  1250.00000  4.432638161156e-03
1250.00000  1300.00000  4.041323507541e-03
1300.00000  1350.00000  3.790325148516e-03
1350.00000  1400.00000  3.555393540780e-03
1400.00000  1450.00000  3.241199293353e-03
1450.00000  1500.00000  3.086244403144e-03
1500.00000  1550.00000  2.847385367315e-03
1550.00000  1600.00000  2.687788971178e-03
1600.00000  1650.00000  2.507127278907e-03
1650.00000  1700.00000  2.383591813441e-03
1700.00000  1750.00000  2.247917024779e-03
1750.00000  1800.00000  2.095818445911e-03
1800.00000  1850.00000  2.008343911116e-03
1850.00000  1900.00000  1.915513792557e-03
1900.00000  1950.00000  1.805545805958e-03
1950.00000  2000.00000  1.718428310080e-03
2000.00000  2050.00000  1.574184587397e-03
2050.00000  2100.00000  1.554547446933e-03
2100.00000  2150.00000  1.486353013684e-03
2150.00000  2200.00000  1.418872658271e-03
2200.00000  2250.00000  1.339610018579e-03
2250.00000  2300.00000  1.297836465228e-03
2300.00000  2350.00000  1.234283537907e-03
2350.00000  2400.00000  1.177157311102e-03
2400.00000  2450.00000  1.201792996412e-03
2450.00000  2500.00000  1.044695872698e-03
2500.00000  2550.00000  1.033270627337e-03
2550.00000  2600.00000  1.004350475017e-03
2600.00000  2650.00000  9.800718286244e-04
2650.00000  2700.00000  9.382982752732e-04
2700.00000  2750.00000  8.908120992415e-04
2750.00000  2800.00000  8.526089350656e-04
2800.00000  2850.00000  8.486815069728e-04
2850.00000  2900.00000  8.054797979514e-04
2900.00000  2950.00000  7.951256693430e-04
2950.00000  3000.00000  7.547802716620e-04
3000.00000  3050.00000  7.230038080016e-04
3050.00000  3100.00000  6.965829281043e-04
3100.00000  3150.00000  6.830154492381e-04
3150.00000  3200.00000  6.623071920212e-04
3200.00000  3250.00000  6.241040278454e-04
3250.00000  3300.00000  6.537382580005e-04
3300.00000  3350.00000  6.005394592883e-04
3350.00000  3400.00000  5.862579025870e-04
3400.00000  3450.00000  5.798312020714e-04
3450.00000  3500.00000  5.644785286176e-04
3500.00000  3550.00000  5.466265827410e-04
3550.00000  3600.00000  5.169923525859e-04
3600.00000  3650.00000  5.280605590293e-04
3650.00000  3700.00000  4.884292391833e-04
3700.00000  3750.00000  4.705772933067e-04
3750.00000  3800.00000  4.509401528425e-04
3800.00000  3850.00000  4.423712188217e-04
3850.00000  3900.00000  4.384437907289e-04
3900.00000  3950.00000  4.198777670172e-04
3950.00000  4000.00000  4.302318956257e-04
4000.00000  4050.00000  4.116658719140e-04
4050.00000  4100.00000  4.080954827387e-04
4100.00000  4150.00000  4.141651443367e-04
4150.00000  4200.00000  3.934568871199e-04
4200.00000  4250.00000  3.823886806764e-04
4250.00000  4300.00000  3.906005757796e-04
4300.00000  4350.00000  3.473988667583e-04
4350.00000  4400.00000  3.406151273252e-04
4400.00000  4450.00000  3.416862440778e-04
4450.00000  4500.00000  3.102668193350e-04
4500.00000  4550.00000  3.113379360876e-04
4550.00000  4600.00000  3.409721662427e-04
4600.00000  4650.00000  3.095527415000e-04
4650.00000  4700.00000  3.020549242318e-04
4700.00000  4750.00000  3.081245858298e-04
4750.00000  4800.00000  2.949141458812e-04
4800.00000  4850.00000  2.827748226851e-04
4850.00000  4900.00000  2.720636551591e-04
4900.00000  4950.00000  2.788473945922e-04
4950.00000  5000.00000  2.524265146949e-04
5000.00000  5050.00000  2.670651103137e-04
5050.00000  5100.00000  2.442146195917e-04
5100.00000  5150.00000  2.617095265507e-04
5150.00000  5200.00000  2.770622000046e-04
5200.00000  5250.00000  2.406442304163e-04
5250.00000  5300.00000  2.388590358287e-04
5300.00000  5350.00000  2.327893742306e-04
5350.00000  5400.00000  2.438575806741e-04
5400.00000  5450.00000  2.174367007768e-04
5450.00000  5500.00000  2.342175299008e-04
5500.00000  5550.00000  2.199359731995e-04
5550.00000  5600.00000  2.292189850553e-04
5600.00000  5650.00000  2.124381559313e-04
5650.00000  5700.00000  2.299330628904e-04
5700.00000  5750.00000  1.913728597970e-04
5750.00000  5800.00000  2.110100002612e-04
5800.00000  5850.00000  1.885165484567e-04
5850.00000  5900.00000  1.985136381476e-04
5900.00000  5950.00000  2.020840273229e-04
5950.00000  6000.00000  1.949432489723e-04
6000.00000  6050.00000  1.970854824775e-04
6050.00000  6100.00000  1.910158208794e-04
6100.00000  6150.00000  1.863743149515e-04
6150.00000  6200.00000  1.710216414977e-04
6200.00000  6250.00000  1.738779528379e-04
6250.00000  6300.00000  1.606675128893e-04
6300.00000  6350.00000  1.713786804152e-04
6350.00000  6400.00000  2.520694757774e-04
6400.00000  6450.00000  1.681653301574e-04
6450.00000  6500.00000  1.538837734562e-04
6500.00000  6550.00000  1.592393572191e-04
6550.00000  6600.00000  1.688794079925e-04
6600.00000  6650.00000  1.538837734562e-04
6650.00000  6700.00000  1.424585280951e-04
6700.00000  6750.00000  1.431726059302e-04
6750.00000  6800.00000  1.574541626315e-04
6800.00000  6850.00000  1.510274621159e-04
6850.00000  6900.00000  1.531696956211e-04
6900.00000  6950.00000  1.271058546413e-04
6950.00000  7000.00000  1.246065822186e-04
7000.00000  7050.00000  1.360318275796e-04
7050.00000  7100.00000  1.481711507756e-04
7100.00000  7150.00000  1.285340103114e-04
7150.00000  7200.00000  1.203221152082e-04
7200.00000  7250.00000  1.342466329919e-04
7250.00000  7300.00000  1.278199324763e-04
7300.00000  7350.00000  1.271058546413e-04
7350.00000  7400.00000  1.274628935588e-04
7400.00000  7450.00000  1.288910492289e-04
7450.00000  7500.00000  1.206791541257e-04
7500.00000  7550.00000  1.156806092803e-04
7550.00000  7600.00000  1.231784265484e-04
7600.00000  7650.00000  1.096109476822e-04
7650.00000  7700.00000  1.103250255173e-04
7700.00000  7750.00000  1.038983250017e-04
7750.00000  7800.00000  1.167517260329e-04
7800.00000  7850.00000  1.085398309296e-04
7850.00000  7900.00000  1.042553639192e-04
7900.00000  7950.00000  1.060405585069e-04
7950.00000  8000.00000  9.889978015627e-05
8000.00000  8050.00000  1.121102201049e-04
8050.00000  8100.00000  1.006849747439e-04
8100.00000  8150.00000  1.067546363420e-04
8150.00000  8200.00000  1.003279358264e-04
8200.00000  8250.00000  9.889978015627e-05
8250.00000  8300.00000  1.013990525790e-04
8300.00000  8350.00000  1.010420136615e-04
8350.00000  8400.00000  9.497235206342e-05
8400.00000  8450.00000  9.461531314589e-05
8450.00000  8500.00000  9.068788505304e-05
8500.00000  8550.00000  9.104492397058e-05
8550.00000  8600.00000  9.211604072317e-05
8600.00000  8650.00000  8.533230129007e-05
8650.00000  8700.00000  8.997380721798e-05
8700.00000  8750.00000  8.568934020760e-05
8750.00000  8800.00000  9.175900180564e-05
8800.00000  8850.00000  8.854565154785e-05
8850.00000  8900.00000  8.176191211475e-05
8900.00000  8950.00000  8.283302886735e-05
8950.00000  9000.00000  8.854565154785e-05
9000.00000  9050.00000  7.890560077450e-05
9050.00000  9100.00000  7.212186134140e-05
9100.00000  9150.00000  7.069370567127e-05
9150.00000  9200.00000  8.390414561994e-05
9200.00000  9250.00000  8.069079536216e-05
9250.00000  9300.00000  7.497817268165e-05
9300.00000  9350.00000  7.533521159918e-05
9350.00000  9400.00000  7.819152293944e-05
9400.00000  9450.00000  7.283593917646e-05
9450.00000  9500.00000  8.604637912513e-05
9500.00000  9550.00000  7.176482242387e-05
9550.00000  9600.00000  6.962258891868e-05
9600.00000  9650.00000  7.462113376412e-05
9650.00000  9700.00000  6.962258891868e-05
9700.00000  9750.00000  6.855147216608e-05
9750.00000  9800.00000  6.569516082583e-05
9800.00000  9850.00000  6.676627757842e-05
9850.00000  9900.00000  7.426409484659e-05
9900.00000  9950.00000  7.355001701152e-05
9950.00000  10000.00000  6.033957706285e-05
