10001.00000  11001.00000  2.017050927193e-04
11001.00000  12001.00000  1.622821967776e-04
12001.00000  13001.00000  1.317586471107e-04
13001.00000  14001.00000  1.059062475248e-04
14001.00000  15001.00000  9.080554683212e-05
15001.00000  16001.00000  7.707397633555e-05
16001.00000  17001.00000  6.716791668114e-05
17001.00000  18001.00000  5.822830187106e-05
18001.00000  19001.00000  4.840277928701e-05
19001.00000  20001.00000  4.155712830632e-05
20001.00000  21001.00000  3.773161746417e-05
21001.00000  22001.00000  3.084569794829e-05
22001.00000  23001.00000  2.959737335770e-05
23001.00000  24001.00000  2.456380646013e-05
24001.00000  25001.00000  2.122151804014e-05
25001.00000  26001.00000  1.940943395702e-05
26001.00000  27001.00000  1.804030376088e-05
27001.00000  28001.00000  1.433559852427e-05
28001.00000  29001.00000  1.409398731319e-05
29001.00000  30001.00000  1.276512565223e-05
30001.00000  31001.00000  9.382568697066e-06
31001.00000  32001.00000  1.075169889320e-05
32001.00000  33001.00000  9.744985513690e-06
33001.00000  34001.00000  7.973169965747e-06
34001.00000  35001.00000  6.684576839970e-06
35001.00000  36001.00000  7.046993656594e-06
36001.00000  37001.00000  6.604039769608e-06
37001.00000  38001.00000  5.838937601178e-06
38001.00000  39001.00000  4.550344475401e-06
39001.00000  40001.00000  4.630881545762e-06
40001.00000  41001.00000  5.154372503109e-06
41001.00000  42001.00000  3.865779377332e-06
42001.00000  43001.00000  3.583899631068e-06
43001.00000  44001.00000  3.503362560707e-06
44001.00000  45001.00000  2.496649181193e-06
45001.00000  46001.00000  2.899334532999e-06
46001.00000  47001.00000  3.100677208902e-06
47001.00000  48001.00000  2.375843575652e-06
48001.00000  49001.00000  2.013426759027e-06
49001.00000  50001.00000  1.570472872041e-06
50001.00000  51001.00000  2.093963829388e-06
51001.00000  52001.00000  2.577186251555e-06
52001.00000  53001.00000  1.449667266499e-06
53001.00000  54001.00000  9.261763091524e-07
54001.00000  55001.00000  1.288593125777e-06
55001.00000  56001.00000  1.127518985055e-06
56001.00000  57001.00000  8.859077739719e-07
57001.00000  58001.00000  1.006713379513e-06
58001.00000  59001.00000  1.087250449875e-06
59001.00000  60001.00000  1.127518985055e-06
60001.00000  61001.00000  1.087250449875e-06
61001.00000  62001.00000  8.456392387913e-07
62001.00000  63001.00000  7.651021684302e-07
63001.00000  64001.00000  9.261763091524e-07
64001.00000  65001.00000  7.248336332497e-07
65001.00000  66001.00000  7.651021684302e-07
66001.00000  67001.00000  5.234909573470e-07
67001.00000  68001.00000  6.442965628886e-07
68001.00000  69001.00000  6.040280277081e-07
69001.00000  70001.00000  7.248336332497e-07
70001.00000  71001.00000  7.651021684302e-07
71001.00000  72001.00000  6.845650980692e-07
72001.00000  73001.00000  4.832224221665e-07
73001.00000  74001.00000  4.026853518054e-07
74001.00000  75001.00000  2.818797462638e-07
75001.00000  76001.00000  3.624168166249e-07
76001.00000  77001.00000  6.442965628886e-07
77001.00000  78001.00000  4.429538869859e-07
78001.00000  79001.00000  4.832224221665e-07
79001.00000  80001.00000  3.624168166249e-07
80001.00000  81001.00000  8.053707036108e-08
81001.00000  82001.00000  3.221482814443e-07
82001.00000  83001.00000  1.610741407222e-07
83001.00000  84001.00000  4.832224221665e-07
84001.00000  85001.00000  2.416112110832e-07
85001.00000  86001.00000  2.416112110832e-07
86001.00000  87001.00000  2.416112110832e-07
87001.00000  88001.00000  2.818797462638e-07
88001.00000  89001.00000  2.818797462638e-07
89001.00000  90001.00000  4.026853518054e-08
90001.00000  91001.00000  8.053707036108e-08
91001.00000  92001.00000  1.208056055416e-07
92001.00000  93001.00000  2.013426759027e-07
93001.00000  94001.00000  1.208056055416e-07
94001.00000  95001.00000  1.610741407222e-07
95001.00000  96001.00000  1.610741407222e-07
96001.00000  97001.00000  1.208056055416e-07
97001.00000  98001.00000  1.610741407222e-07
98001.00000  99001.00000  1.208056055416e-07
99001.00000  100001.00000  4.026853518054e-08
100001.00000  101001.00000  4.026853518054e-08
101001.00000  102001.00000  1.208056055416e-07
102001.00000  103001.00000  8.053707036108e-08
103001.00000  104001.00000  0.000000000000e+00
104001.00000  105001.00000  0.000000000000e+00
105001.00000  106001.00000  8.053707036108e-08
106001.00000  107001.00000  1.208056055416e-07
107001.00000  108001.00000  0.000000000000e+00
108001.00000  109001.00000  0.000000000000e+00
109001.00000  110001.00000  1.610741407222e-07
110001.00000  111001.00000  0.000000000000e+00
111001.00000  112001.00000  1.610741407222e-07
112001.00000  113001.00000  8.053707036108e-08
113001.00000  114001.00000  1.208056055416e-07
114001.00000  115001.00000  4.026853518054e-08
115001.00000  116001.00000  0.000000000000e+00
116001.00000  117001.00000  1.208056055416e-07
117001.00000  118001.00000  4.026853518054e-08
118001.00000  119001.00000  0.000000000000e+00
119001.00000  120001.00000  0.000000000000e+00
120001.00000  121001.00000  4.026853518054e-08
121001.00000  122001.00000  0.000000000000e+00
122001.00000  123001.00000  0.000000000000e+00
123001.00000  124001.00000  0.000000000000e+00
124001.00000  125001.00000  0.000000000000e+00
125001.00000  126001.00000  4.026853518054e-08
126001.00000  127001.00000  0.000000000000e+00
127001.00000  128001.00000  0.000000000000e+00
128001.00000  129001.00000  0.000000000000e+00
129001.00000  130001.00000  0.000000000000e+00
130001.00000  131001.00000  0.000000000000e+00
131001.00000  132001.00000  0.000000000000e+00
132001.00000  133001.00000  4.026853518054e-08
133001.00000  134001.00000  0.000000000000e+00
134001.00000  135001.00000  0.000000000000e+00
135001.00000  136001.00000  0.000000000000e+00
136001.00000  137001.00000  0.000000000000e+00
137001.00000  138001.00000  8.053707036108e-08
138001.00000  139001.00000  4.026853518054e-08
139001.00000  140001.00000  0.000000000000e+00
140001.00000  141001.00000  0.000000000000e+00
141001.00000  142001.00000  4.026853518054e-08
142001.00000  143001.00000  0.000000000000e+00
143001.00000  144001.00000  0.000000000000e+00
144001.00000  145001.00000  0.000000000000e+00
145001.00000  146001.00000  0.000000000000e+00
146001.00000  147001.00000  4.026853518054e-08
147001.00000  148001.00000  0.000000000000e+00
148001.00000  149001.00000  0.000000000000e+00
149001.00000  150001.00000  0.000000000000e+00
150001.00000  151001.00000  4.026853518054e-08
151001.00000  152001.00000  4.026853518054e-08
152001.00000  153001.00000  4.026853518054e-08
153001.00000  154001.00000  0.000000000000e+00
154001.00000  155001.00000  0.000000000000e+00
155001.00000  156001.00000  4.026853518054e-08
156001.00000  157001.00000  0.000000000000e+00
157001.00000  158001.00000  0.000000000000e+00
158001.00000  159001.00000  0.000000000000e+00
159001.00000  160001.00000  0.000000000000e+00
160001.00000  161001.00000  0.000000000000e+00
161001.00000  162001.00000  4.026853518054e-08
162001.00000  163001.00000  0.000000000000e+00
163001.00000  164001.00000  0.000000000000e+00
164001.00000  165001.00000  0.000000000000e+00
165001.00000  166001.00000  0.000000000000e+00
166001.00000  167001.00000  0.000000000000e+00
167001.00000  168001.00000  0.000000000000e+00
168001.00000  169001.00000  0.000000000000e+00
169001.00000  170001.00000  0.000000000000e+00
170001.00000  171001.00000  0.000000000000e+00
171001.00000  172001.00000  0.000000000000e+00
172001.00000  173001.00000  0.000000000000e+00
173001.00000  174001.00000  0.000000000000e+00
174001.00000  175001.00000  0.000000000000e+00
175001.00000  176001.00000  0.000000000000e+00
176001.00000  177001.00000  0.000000000000e+00
177001.00000  178001.00000  0.000000000000e+00
178001.00000  179001.00000  0.000000000000e+00
179001.00000  180001.00000  4.026853518054e-08
180001.00000  181001.00000  0.000000000000e+00
181001.00000  182001.00000  0.000000000000e+00
182001.00000  183001.00000  0.000000000000e+00
183001.00000  184001.00000  0.000000000000e+00
184001.00000  185001.00000  0.000000000000e+00
185001.00000  186001.00000  0.000000000000e+00
186001.00000  187001.00000  0.000000000000e+00
187001.00000  188001.00000  0.000000000000e+00
188001.00000  189001.00000  0.000000000000e+00
189001.00000  190001.00000  0.000000000000e+00
190001.00000  191001.00000  0.000000000000e+00
191001.00000  192001.00000  0.000000000000e+00
192001.00000  193001.00000  4.026853518054e-08
193001.00000  194001.00000  0.000000000000e+00
194001.00000  195001.00000  0.000000000000e+00
195001.00000  196001.00000  0.000000000000e+00
196001.00000  197001.00000  0.000000000000e+00
197001.00000  198001.00000  4.026853518054e-08
198001.00000  199001.00000  0.000000000000e+00
