300.00000  350.00000  0.000000000000e+00
350.00000  400.00000  0.000000000000e+00
400.00000  450.00000  0.000000000000e+00
450.00000  500.00000  0.000000000000e+00
500.00000  550.00000  7.207384477258e-06
550.00000  600.00000  0.000000000000e+00
600.00000  650.00000  8.008204974731e-07
650.00000  700.00000  0.000000000000e+00
700.00000  750.00000  4.004102487365e-06
750.00000  800.00000  3.203281989892e-06
800.00000  850.00000  1.201230746210e-05
850.00000  900.00000  8.008204974731e-07
900.00000  950.00000  7.207384477258e-06
950.00000  1000.00000  5.605743482312e-06
1000.00000  1050.00000  7.207384477258e-06
1050.00000  1100.00000  3.203281989892e-06
1100.00000  1150.00000  8.008204974731e-06
1150.00000  1200.00000  8.008204974731e-06
1200.00000  1250.00000  1.441476895452e-05
1250.00000  1300.00000  2.482543542167e-05
1300.00000  1350.00000  1.121148696462e-05
1350.00000  1400.00000  1.841887144188e-05
1400.00000  1450.00000  1.761805094441e-05
1450.00000  1500.00000  1.361394845704e-05
1500.00000  1550.00000  1.041066646715e-05
1550.00000  1600.00000  1.521558945199e-05
1600.00000  1650.00000  1.041066646715e-05
1650.00000  1700.00000  1.201230746210e-05
1700.00000  1750.00000  4.804922984839e-05
1750.00000  1800.00000  2.322379442672e-05
1800.00000  1850.00000  2.802871741156e-05
1850.00000  1900.00000  2.082133293430e-05
1900.00000  1950.00000  1.921969193935e-05
1950.00000  2000.00000  2.963035840650e-05
2000.00000  2050.00000  1.521558945199e-05
2050.00000  2100.00000  2.722789691409e-05
2100.00000  2150.00000  2.082133293430e-05
2150.00000  2200.00000  2.322379442672e-05
2200.00000  2250.00000  2.642707641661e-05
2250.00000  2300.00000  1.841887144188e-05
2300.00000  2350.00000  7.607794725994e-05
2350.00000  2400.00000  3.763856338124e-05
2400.00000  2450.00000  2.722789691409e-05
2450.00000  2500.00000  3.363446089387e-05
2500.00000  2550.00000  1.761805094441e-05
2550.00000  2600.00000  2.082133293430e-05
2600.00000  2650.00000  2.722789691409e-05
2650.00000  2700.00000  3.763856338124e-05
2700.00000  2750.00000  2.882953790903e-05
2750.00000  2800.00000  4.084184537113e-05
2800.00000  2850.00000  3.843938387871e-05
2850.00000  2900.00000  4.004102487365e-05
2900.00000  2950.00000  4.644758885344e-05
2950.00000  3000.00000  9.209435720941e-05
3000.00000  3050.00000  6.326481930037e-05
3050.00000  3100.00000  5.365497333070e-05
3100.00000  3150.00000  6.806974228521e-05
3150.00000  3200.00000  7.127302427511e-05
3200.00000  3250.00000  6.806974228521e-05
3250.00000  3300.00000  7.928122924984e-05
3300.00000  3350.00000  7.848040875236e-05
3350.00000  3400.00000  9.049271621446e-05
3400.00000  3450.00000  1.089115876563e-04
3450.00000  3500.00000  1.145173311387e-04
3500.00000  3550.00000  1.337370230780e-04
3550.00000  3600.00000  1.457493305401e-04
3600.00000  3650.00000  1.449485100426e-04
3650.00000  3700.00000  1.825870734239e-04
3700.00000  3750.00000  1.697739454643e-04
3750.00000  3800.00000  1.889936374037e-04
3800.00000  3850.00000  2.066116883481e-04
3850.00000  3900.00000  2.066116883481e-04
3900.00000  3950.00000  2.210264573026e-04
3950.00000  4000.00000  2.122174318304e-04
4000.00000  4050.00000  2.514576362066e-04
4050.00000  4100.00000  2.658724051611e-04
4100.00000  4150.00000  2.658724051611e-04
4150.00000  4200.00000  2.802871741156e-04
4200.00000  4250.00000  2.963035840650e-04
4250.00000  4300.00000  3.187265579943e-04
4300.00000  4350.00000  2.906978405827e-04
4350.00000  4400.00000  3.203281989892e-04
4400.00000  4450.00000  3.507593778932e-04
4450.00000  4500.00000  3.227306604817e-04
4500.00000  4550.00000  3.611700443604e-04
4550.00000  4600.00000  3.731823518225e-04
4600.00000  4650.00000  4.028127102290e-04
4650.00000  4700.00000  3.932028642593e-04
4700.00000  4750.00000  4.100200947062e-04
4750.00000  4800.00000  3.803897362997e-04
4800.00000  4850.00000  4.252356841582e-04
4850.00000  4900.00000  4.340447096304e-04
4900.00000  4950.00000  4.044143512239e-04
4950.00000  5000.00000  4.404512736102e-04
5000.00000  5050.00000  4.652767090319e-04
5050.00000  5100.00000  4.476586580875e-04
5100.00000  5150.00000  4.276381456506e-04
5150.00000  5200.00000  4.772890164940e-04
5200.00000  5250.00000  4.316422481380e-04
5250.00000  5300.00000  4.981103494283e-04
5300.00000  5350.00000  4.796914779864e-04
5350.00000  5400.00000  4.548660425647e-04
5400.00000  5450.00000  4.692808115192e-04
5450.00000  5500.00000  4.876996829611e-04
5500.00000  5550.00000  4.893013239561e-04
5550.00000  5600.00000  5.005128109207e-04
5600.00000  5650.00000  5.053177339055e-04
5650.00000  5700.00000  4.868988624636e-04
5700.00000  5750.00000  4.604717860470e-04
5750.00000  5800.00000  4.925046059460e-04
5800.00000  5850.00000  4.788906574889e-04
5850.00000  5900.00000  5.149275798752e-04
5900.00000  5950.00000  5.077201953979e-04
5950.00000  6000.00000  5.005128109207e-04
6000.00000  6050.00000  4.989111699257e-04
6050.00000  6100.00000  5.245374258449e-04
6100.00000  6150.00000  4.989111699257e-04
6150.00000  6200.00000  5.213341438550e-04
6200.00000  6250.00000  5.149275798752e-04
6250.00000  6300.00000  5.934079886276e-04
6300.00000  6350.00000  5.805948606680e-04
6350.00000  6400.00000  1.720162428572e-03
6400.00000  6450.00000  4.949070674384e-04
6450.00000  6500.00000  4.588701450521e-04
6500.00000  6550.00000  4.660775295293e-04
6550.00000  6600.00000  4.532644015698e-04
6600.00000  6650.00000  4.700816320167e-04
6650.00000  6700.00000  4.380488121178e-04
6700.00000  6750.00000  4.548660425647e-04
6750.00000  6800.00000  4.516627605748e-04
6800.00000  6850.00000  4.556668630622e-04
6850.00000  6900.00000  4.564676835597e-04
6900.00000  6950.00000  4.917037854485e-04
6950.00000  7000.00000  4.708824525142e-04
7000.00000  7050.00000  4.428537351026e-04
7050.00000  7100.00000  5.910055271351e-04
7100.00000  7150.00000  2.834904561055e-04
7150.00000  7200.00000  2.450510722268e-04
7200.00000  7250.00000  2.426486107343e-04
7250.00000  7300.00000  2.266322007849e-04
7300.00000  7350.00000  2.754822511307e-04
7350.00000  7400.00000  2.746814306333e-04
7400.00000  7450.00000  2.866937380954e-04
7450.00000  7500.00000  2.866937380954e-04
7500.00000  7550.00000  2.522584567040e-04
7550.00000  7600.00000  2.514576362066e-04
7600.00000  7650.00000  2.658724051611e-04
7650.00000  7700.00000  2.578642001863e-04
7700.00000  7750.00000  2.538600976990e-04
7750.00000  7800.00000  2.530592772015e-04
7800.00000  7850.00000  2.554617386939e-04
7850.00000  7900.00000  2.578642001863e-04
7900.00000  7950.00000  2.554617386939e-04
7950.00000  8000.00000  2.538600976990e-04
8000.00000  8050.00000  2.370428672520e-04
8050.00000  8100.00000  2.682748666535e-04
8100.00000  8150.00000  2.274330212824e-04
8150.00000  8200.00000  2.530592772015e-04
8200.00000  8250.00000  2.394453287445e-04
8250.00000  8300.00000  2.562625591914e-04
8300.00000  8350.00000  2.610674821762e-04
8350.00000  8400.00000  2.530592772015e-04
8400.00000  8450.00000  2.514576362066e-04
8450.00000  8500.00000  2.386445082470e-04
8500.00000  8550.00000  2.498559952116e-04
8550.00000  8600.00000  2.346404057596e-04
8600.00000  8650.00000  2.154207138203e-04
8650.00000  8700.00000  2.290346622773e-04
8700.00000  8750.00000  2.650715846636e-04
8750.00000  8800.00000  2.298354827748e-04
8800.00000  8850.00000  2.362420467546e-04
8850.00000  8900.00000  2.402461492419e-04
8900.00000  8950.00000  2.522584567040e-04
8950.00000  9000.00000  2.394453287445e-04
9000.00000  9050.00000  2.218272778000e-04
9050.00000  9100.00000  2.250305597899e-04
9100.00000  9150.00000  2.210264573026e-04
9150.00000  9200.00000  2.106157908354e-04
9200.00000  9250.00000  2.058108678506e-04
9250.00000  9300.00000  2.178231753127e-04
9300.00000  9350.00000  2.322379442672e-04
9350.00000  9400.00000  2.386445082470e-04
9400.00000  9450.00000  2.426486107343e-04
9450.00000  9500.00000  2.266322007849e-04
9500.00000  9550.00000  2.026075858607e-04
9550.00000  9600.00000  2.298354827748e-04
9600.00000  9650.00000  2.226280982975e-04
9650.00000  9700.00000  2.154207138203e-04
9700.00000  9750.00000  2.202256368051e-04
9750.00000  9800.00000  2.074125088455e-04
9800.00000  9850.00000  2.042092268556e-04
9850.00000  9900.00000  2.242297392925e-04
9900.00000  9950.00000  1.994043038708e-04
9950.00000  10000.00000  2.034084063582e-04
