10001.00000  11001.00000  7.651720964853e-04
11001.00000  12001.00000  6.688362315077e-04
12001.00000  13001.00000  5.967289522676e-04
13001.00000  14001.00000  5.324022017541e-04
14001.00000  15001.00000  4.884860823613e-04
15001.00000  16001.00000  4.396239763059e-04
16001.00000  17001.00000  4.077016335376e-04
17001.00000  18001.00000  3.717781514613e-04
18001.00000  19001.00000  3.457659253094e-04
19001.00000  20001.00000  3.203225358302e-04
20001.00000  21001.00000  3.008760346633e-04
21001.00000  22001.00000  2.800508276625e-04
22001.00000  23001.00000  2.621662170207e-04
23001.00000  24001.00000  2.432210634297e-04
24001.00000  25001.00000  2.284409512389e-04
25001.00000  26001.00000  2.155505337574e-04
26001.00000  27001.00000  2.004329760828e-04
27001.00000  28001.00000  1.915051327112e-04
28001.00000  29001.00000  1.785472261329e-04
29001.00000  30001.00000  1.670933622825e-04
30001.00000  31001.00000  1.594188878507e-04
31001.00000  32001.00000  1.489195126545e-04
32001.00000  33001.00000  1.402327017713e-04
33001.00000  34001.00000  1.346600306387e-04
34001.00000  35001.00000  1.285088815339e-04
35001.00000  36001.00000  1.210657982910e-04
36001.00000  37001.00000  1.149532143843e-04
37001.00000  38001.00000  1.097179887355e-04
38001.00000  39001.00000  1.066713380817e-04
39001.00000  40001.00000  9.973924371429e-05
40001.00000  41001.00000  9.481253965068e-05
41001.00000  42001.00000  8.978942259170e-05
42001.00000  43001.00000  8.782259748607e-05
43001.00000  44001.00000  8.234633934884e-05
44001.00000  45001.00000  8.094835091592e-05
45001.00000  46001.00000  7.770887427135e-05
46001.00000  47001.00000  7.363060456704e-05
47001.00000  48001.00000  6.981264995023e-05
48001.00000  49001.00000  6.733483596912e-05
49001.00000  50001.00000  6.531980436581e-05
50001.00000  51001.00000  6.149220844947e-05
51001.00000  52001.00000  6.117404556473e-05
52001.00000  53001.00000  5.857089468964e-05
53001.00000  54001.00000  5.513859205433e-05
54001.00000  55001.00000  5.515787465340e-05
55001.00000  56001.00000  5.247759338201e-05
56001.00000  57001.00000  4.962376871894e-05
57001.00000  58001.00000  4.755088931840e-05
58001.00000  59001.00000  4.662532456281e-05
59001.00000  60001.00000  4.635536817577e-05
60001.00000  61001.00000  4.381006509789e-05
61001.00000  62001.00000  4.194929428718e-05
62001.00000  63001.00000  4.274952214878e-05
63001.00000  64001.00000  3.895085013105e-05
64001.00000  65001.00000  4.048381675750e-05
65001.00000  66001.00000  3.747573130183e-05
66001.00000  67001.00000  3.657909044485e-05
67001.00000  68001.00000  3.420733075866e-05
68001.00000  69001.00000  3.463154793830e-05
69001.00000  70001.00000  3.393737437161e-05
70001.00000  71001.00000  3.265508153314e-05
71001.00000  72001.00000  3.163310378217e-05
72001.00000  73001.00000  3.115103880530e-05
73001.00000  74001.00000  3.044722393907e-05
74001.00000  75001.00000  2.892389861217e-05
75001.00000  76001.00000  2.880820301772e-05
76001.00000  77001.00000  2.765124707323e-05
77001.00000  78001.00000  2.676424751579e-05
78001.00000  79001.00000  2.512522659444e-05
79001.00000  80001.00000  2.581940016113e-05
80001.00000  81001.00000  2.460459641942e-05
81001.00000  82001.00000  2.342835787585e-05
82001.00000  83001.00000  2.289808640130e-05
83001.00000  84001.00000  2.293665159945e-05
84001.00000  85001.00000  2.166400006051e-05
85001.00000  86001.00000  2.189539124941e-05
86001.00000  87001.00000  2.208821724016e-05
87001.00000  88001.00000  2.041063112065e-05
88001.00000  89001.00000  1.968753365535e-05
89001.00000  90001.00000  1.993820744332e-05
90001.00000  91001.00000  1.898371878912e-05
91001.00000  92001.00000  1.909941438357e-05
92001.00000  93001.00000  1.849201251271e-05
93001.00000  94001.00000  1.804851273399e-05
94001.00000  95001.00000  1.766286075250e-05
95001.00000  96001.00000  1.665052430107e-05
96001.00000  97001.00000  1.654447000616e-05
97001.00000  98001.00000  1.586957903854e-05
98001.00000  99001.00000  1.639020921356e-05
99001.00000  100001.00000  1.559962265150e-05
100001.00000  101001.00000  1.554177485427e-05
101001.00000  102001.00000  1.537787276214e-05
102001.00000  103001.00000  1.509827507555e-05
103001.00000  104001.00000  1.393167783153e-05
104001.00000  105001.00000  1.380634093754e-05
105001.00000  106001.00000  1.304467827409e-05
106001.00000  107001.00000  1.356530844911e-05
107001.00000  108001.00000  1.264938499305e-05
108001.00000  109001.00000  1.212875481804e-05
109001.00000  110001.00000  1.336284115882e-05
110001.00000  111001.00000  1.258189589629e-05
111001.00000  112001.00000  1.218660261526e-05
112001.00000  113001.00000  1.164668984117e-05
113001.00000  114001.00000  1.175274413608e-05
114001.00000  115001.00000  1.151171164764e-05
115001.00000  116001.00000  1.150207034810e-05
116001.00000  117001.00000  1.110677706707e-05
117001.00000  118001.00000  1.089466847725e-05
118001.00000  119001.00000  1.051865779529e-05
119001.00000  120001.00000  1.075004898419e-05
120001.00000  121001.00000  1.064399468928e-05
121001.00000  122001.00000  1.006551671703e-05
122001.00000  123001.00000  9.419549648029e-06
123001.00000  124001.00000  9.101386763295e-06
124001.00000  125001.00000  9.053180265608e-06
125001.00000  126001.00000  9.207441058206e-06
126001.00000  127001.00000  8.918202072085e-06
127001.00000  128001.00000  8.879636873935e-06
128001.00000  129001.00000  9.082104164220e-06
129001.00000  130001.00000  8.339724099841e-06
130001.00000  131001.00000  8.339724099841e-06
131001.00000  132001.00000  7.828735224360e-06
132001.00000  133001.00000  8.571115288739e-06
133001.00000  134001.00000  7.992637316495e-06
134001.00000  135001.00000  8.378289297991e-06
135001.00000  136001.00000  7.780528726673e-06
136001.00000  137001.00000  7.385235445640e-06
137001.00000  138001.00000  7.626267934075e-06
138001.00000  139001.00000  7.163485556280e-06
139001.00000  140001.00000  7.182768155355e-06
140001.00000  141001.00000  6.893529169233e-06
141001.00000  142001.00000  7.173126855817e-06
142001.00000  143001.00000  6.893529169233e-06
143001.00000  144001.00000  7.163485556280e-06
144001.00000  145001.00000  6.440388090976e-06
145001.00000  146001.00000  6.594648883574e-06
146001.00000  147001.00000  6.343975095602e-06
147001.00000  148001.00000  6.536801086350e-06
148001.00000  149001.00000  6.565724984962e-06
149001.00000  150001.00000  6.189714303004e-06
150001.00000  151001.00000  5.823344920583e-06
151001.00000  152001.00000  6.160790404391e-06
152001.00000  153001.00000  5.736573224746e-06
153001.00000  154001.00000  5.958323114106e-06
154001.00000  155001.00000  5.755855823821e-06
155001.00000  156001.00000  5.283432146489e-06
156001.00000  157001.00000  5.669084127985e-06
157001.00000  158001.00000  5.109888754816e-06
158001.00000  159001.00000  5.321997344639e-06
159001.00000  160001.00000  5.206301750190e-06
160001.00000  161001.00000  4.897780164994e-06
161001.00000  162001.00000  4.820649768694e-06
162001.00000  163001.00000  4.811008469157e-06
163001.00000  164001.00000  5.100247455279e-06
164001.00000  165001.00000  4.888138865456e-06
165001.00000  166001.00000  4.897780164994e-06
166001.00000  167001.00000  4.049345805703e-06
167001.00000  168001.00000  4.724236773321e-06
168001.00000  169001.00000  4.271095695063e-06
169001.00000  170001.00000  4.550693381648e-06
170001.00000  171001.00000  4.512128183498e-06
171001.00000  172001.00000  4.531410782573e-06
172001.00000  173001.00000  4.290378294138e-06
173001.00000  174001.00000  4.541052082110e-06
174001.00000  175001.00000  4.078269704315e-06
175001.00000  176001.00000  4.300019593675e-06
176001.00000  177001.00000  4.232530496914e-06
177001.00000  178001.00000  4.058987105241e-06
178001.00000  179001.00000  3.538356930222e-06
179001.00000  180001.00000  3.808313317269e-06
180001.00000  181001.00000  3.711900321895e-06
181001.00000  182001.00000  3.297324441787e-06
182001.00000  183001.00000  3.644411225133e-06
183001.00000  184001.00000  3.981856708942e-06
184001.00000  185001.00000  3.605846026983e-06
185001.00000  186001.00000  3.470867833460e-06
186001.00000  187001.00000  3.644411225133e-06
187001.00000  188001.00000  3.972215409404e-06
188001.00000  189001.00000  3.345530939474e-06
189001.00000  190001.00000  3.200911446413e-06
190001.00000  191001.00000  3.364813538549e-06
191001.00000  192001.00000  2.863465962604e-06
192001.00000  193001.00000  3.008085455665e-06
193001.00000  194001.00000  3.200911446413e-06
194001.00000  195001.00000  2.959878957978e-06
195001.00000  196001.00000  2.998444156128e-06
196001.00000  197001.00000  3.403378736698e-06
197001.00000  198001.00000  2.998444156128e-06
198001.00000  199001.00000  3.143063649189e-06
