300.00000  350.00000  0.000000000000e+00
350.00000  400.00000  1.349724255644e-06
400.00000  450.00000  3.856355016126e-07
450.00000  500.00000  5.784532524190e-07
500.00000  550.00000  1.523260231370e-05
550.00000  600.00000  5.784532524190e-07
600.00000  650.00000  4.820443770158e-06
650.00000  700.00000  5.784532524190e-07
700.00000  750.00000  3.277901763707e-06
750.00000  800.00000  7.712710032253e-07
800.00000  850.00000  1.812486857579e-05
850.00000  900.00000  2.120995258870e-06
900.00000  950.00000  1.542542006451e-06
950.00000  1000.00000  1.542542006451e-06
1000.00000  1050.00000  2.120995258870e-06
1050.00000  1100.00000  1.735359757257e-06
1100.00000  1150.00000  3.085084012901e-06
1150.00000  1200.00000  2.699448511288e-06
1200.00000  1250.00000  4.627626019352e-06
1250.00000  1300.00000  2.275249459515e-05
1300.00000  1350.00000  8.291163284672e-06
1350.00000  1400.00000  8.869616537091e-06
1400.00000  1450.00000  1.234033605160e-05
1450.00000  1500.00000  2.872984487014e-05
1500.00000  1550.00000  3.586410164998e-05
1550.00000  1600.00000  5.668841873706e-05
1600.00000  1650.00000  7.577737606688e-05
1650.00000  1700.00000  1.020005901765e-04
1700.00000  1750.00000  1.797061437515e-04
1750.00000  1800.00000  1.737287934765e-04
1800.00000  1850.00000  2.157630631523e-04
1850.00000  1900.00000  2.269464926990e-04
1900.00000  1950.00000  2.842133646885e-04
1950.00000  2000.00000  3.214271905941e-04
2000.00000  2050.00000  3.810078755933e-04
2050.00000  2100.00000  4.365393878255e-04
2100.00000  2150.00000  4.695112232134e-04
2150.00000  2200.00000  5.524228560601e-04
2200.00000  2250.00000  5.792245234222e-04
2250.00000  2300.00000  6.391908439230e-04
2300.00000  2350.00000  7.113046827245e-04
2350.00000  2400.00000  7.386848033390e-04
2400.00000  2450.00000  7.504466861382e-04
2450.00000  2500.00000  7.718494564777e-04
2500.00000  2550.00000  7.456262423680e-04
2550.00000  2600.00000  7.957588575777e-04
2600.00000  2650.00000  8.000008480954e-04
2650.00000  2700.00000  8.393356692599e-04
2700.00000  2750.00000  8.603528040978e-04
2750.00000  2800.00000  8.649804301172e-04
2800.00000  2850.00000  8.578461733373e-04
2850.00000  2900.00000  8.805986679325e-04
2900.00000  2950.00000  8.763566774147e-04
2950.00000  3000.00000  9.124135968155e-04
3000.00000  3050.00000  8.885041957155e-04
3050.00000  3100.00000  8.555323603276e-04
3100.00000  3150.00000  8.780920371720e-04
3150.00000  3200.00000  8.796345791784e-04
3200.00000  3250.00000  8.740428644051e-04
3250.00000  3300.00000  8.516760053115e-04
3300.00000  3350.00000  8.331655012341e-04
3350.00000  3400.00000  8.310445059752e-04
3400.00000  3450.00000  8.347080432406e-04
3450.00000  3500.00000  7.982654883382e-04
3500.00000  3550.00000  7.703069144712e-04
3550.00000  3600.00000  7.826472505229e-04
3600.00000  3650.00000  7.622085689374e-04
3650.00000  3700.00000  7.878533297946e-04
3700.00000  3750.00000  7.238378365269e-04
3750.00000  3800.00000  7.114975004753e-04
3800.00000  3850.00000  7.130400424818e-04
3850.00000  3900.00000  6.781400295858e-04
3900.00000  3950.00000  6.762118520778e-04
3950.00000  4000.00000  6.644499692786e-04
4000.00000  4050.00000  6.548090817383e-04
4050.00000  4100.00000  6.274289611238e-04
4100.00000  4150.00000  6.249223303633e-04
4150.00000  4200.00000  6.135460830657e-04
4200.00000  4250.00000  5.830808784383e-04
4250.00000  4300.00000  5.398897022577e-04
4300.00000  4350.00000  5.447101460279e-04
4350.00000  4400.00000  5.360333472416e-04
4400.00000  4450.00000  5.155946656561e-04
4450.00000  4500.00000  5.103885863843e-04
4500.00000  4550.00000  4.968913438279e-04
4550.00000  4600.00000  5.003620633424e-04
4600.00000  4650.00000  4.729819427279e-04
4650.00000  4700.00000  4.689327699610e-04
4700.00000  4750.00000  4.668117747021e-04
4750.00000  4800.00000  4.267056825344e-04
4800.00000  4850.00000  4.270913180360e-04
4850.00000  4900.00000  4.180288837481e-04
4900.00000  4950.00000  3.999040151723e-04
4950.00000  5000.00000  4.006752861755e-04
5000.00000  5050.00000  3.918056696384e-04
5050.00000  5100.00000  3.829360531014e-04
5100.00000  5150.00000  3.680890862893e-04
5150.00000  5200.00000  3.597979230046e-04
5200.00000  5250.00000  3.648111845256e-04
5250.00000  5300.00000  3.378166994127e-04
5300.00000  5350.00000  3.142929338143e-04
5350.00000  5400.00000  3.247050923578e-04
5400.00000  5450.00000  3.212343728433e-04
5450.00000  5500.00000  3.031095042675e-04
5500.00000  5550.00000  3.100509432966e-04
5550.00000  5600.00000  2.948183409829e-04
5600.00000  5650.00000  3.034951397691e-04
5650.00000  5700.00000  2.890338084587e-04
5700.00000  5750.00000  2.736083883942e-04
5750.00000  5800.00000  2.716802108861e-04
5800.00000  5850.00000  2.711017576337e-04
5850.00000  5900.00000  2.576045150772e-04
5900.00000  5950.00000  2.473851742845e-04
5950.00000  6000.00000  2.468067210321e-04
6000.00000  6050.00000  2.402509175047e-04
6050.00000  6100.00000  2.319597542200e-04
6100.00000  6150.00000  2.404437352555e-04
6150.00000  6200.00000  2.259824039450e-04
6200.00000  6250.00000  2.302243944627e-04
6250.00000  6300.00000  2.469995387829e-04
6300.00000  6350.00000  2.205835069224e-04
6350.00000  6400.00000  5.749825329044e-04
6400.00000  6450.00000  1.906967555475e-04
6450.00000  6500.00000  2.014945495926e-04
6500.00000  6550.00000  1.939746573112e-04
6550.00000  6600.00000  1.887685780394e-04
6600.00000  6650.00000  1.835624987676e-04
6650.00000  6700.00000  1.710293449652e-04
6700.00000  6750.00000  1.868404005313e-04
6750.00000  6800.00000  1.623525461789e-04
6800.00000  6850.00000  1.710293449652e-04
6850.00000  6900.00000  1.648591769394e-04
6900.00000  6950.00000  1.708365272144e-04
6950.00000  7000.00000  1.538685651434e-04
7000.00000  7050.00000  1.509762988813e-04
7050.00000  7100.00000  1.868404005313e-04
7100.00000  7150.00000  1.131840197233e-04
7150.00000  7200.00000  1.216680007588e-04
7200.00000  7250.00000  1.201254587523e-04
7250.00000  7300.00000  1.170403747394e-04
7300.00000  7350.00000  1.154978327330e-04
7350.00000  7400.00000  1.151121972314e-04
7400.00000  7450.00000  1.099061179596e-04
7450.00000  7500.00000  1.272597155322e-04
7500.00000  7550.00000  1.158834682346e-04
7550.00000  7600.00000  1.047000386878e-04
7600.00000  7650.00000  1.156906504838e-04
7650.00000  7700.00000  1.029646789306e-04
7700.00000  7750.00000  1.075923049499e-04
7750.00000  7800.00000  1.070138516975e-04
7800.00000  7850.00000  1.047000386878e-04
7850.00000  7900.00000  8.734644111526e-05
7900.00000  7950.00000  1.020005901765e-04
7950.00000  8000.00000  9.660169315397e-05
8000.00000  8050.00000  9.718014640639e-05
8050.00000  8100.00000  8.908180087252e-05
8100.00000  8150.00000  9.235970263623e-05
8150.00000  8200.00000  8.792489436768e-05
8200.00000  8250.00000  9.544478664913e-05
8250.00000  8300.00000  9.216688488542e-05
8300.00000  8350.00000  9.544478664913e-05
8350.00000  8400.00000  8.522544585639e-05
8400.00000  8450.00000  8.271881509591e-05
8450.00000  8500.00000  8.445417485317e-05
8500.00000  8550.00000  8.483981035478e-05
8550.00000  8600.00000  8.638235236123e-05
8600.00000  8650.00000  7.519892281446e-05
8650.00000  8700.00000  7.365638080801e-05
8700.00000  8750.00000  8.175472634188e-05
8750.00000  8800.00000  7.905527783059e-05
8800.00000  8850.00000  7.384919855882e-05
8850.00000  8900.00000  7.635582931930e-05
8900.00000  8950.00000  7.577737606688e-05
8950.00000  9000.00000  7.384919855882e-05
9000.00000  9050.00000  7.539174056527e-05
9050.00000  9100.00000  6.555803527415e-05
9100.00000  9150.00000  6.671494177899e-05
9150.00000  9200.00000  6.652212402818e-05
9200.00000  9250.00000  6.729339503141e-05
9250.00000  9300.00000  6.170168025802e-05
9300.00000  9350.00000  6.613648852657e-05
9350.00000  9400.00000  6.420831101850e-05
9400.00000  9450.00000  6.189449800883e-05
9450.00000  9500.00000  6.459394652012e-05
9500.00000  9550.00000  6.073759150399e-05
9550.00000  9600.00000  5.880941399593e-05
9600.00000  9650.00000  6.189449800883e-05
9650.00000  9700.00000  5.476024122899e-05
9700.00000  9750.00000  6.594367077576e-05
9750.00000  9800.00000  6.112322700560e-05
9800.00000  9850.00000  5.707405423867e-05
9850.00000  9900.00000  5.630278323545e-05
9900.00000  9950.00000  5.900223174673e-05
9950.00000  10000.00000  5.649560098625e-05
