10001.00000  11001.00000  2.815660902980e-04
11001.00000  12001.00000  2.281212090316e-04
12001.00000  13001.00000  1.858459234542e-04
13001.00000  14001.00000  1.537020955846e-04
14001.00000  15001.00000  1.283446141492e-04
15001.00000  16001.00000  1.103886720259e-04
16001.00000  17001.00000  9.718124992875e-05
17001.00000  18001.00000  8.493506670331e-05
18001.00000  19001.00000  7.193911715794e-05
19001.00000  20001.00000  6.557571582729e-05
20001.00000  21001.00000  5.715526331121e-05
21001.00000  22001.00000  5.133015574872e-05
22001.00000  23001.00000  4.537047474418e-05
23001.00000  24001.00000  4.035280783392e-05
24001.00000  25001.00000  3.470072326833e-05
25001.00000  26001.00000  3.393173217097e-05
26001.00000  27001.00000  3.064429522976e-05
27001.00000  28001.00000  2.749143173059e-05
28001.00000  29001.00000  2.281981081413e-05
29001.00000  30001.00000  2.145485161632e-05
30001.00000  31001.00000  1.960927298266e-05
31001.00000  32001.00000  1.872493322069e-05
32001.00000  33001.00000  1.651408381579e-05
33001.00000  34001.00000  1.641795992862e-05
34001.00000  35001.00000  1.476462906929e-05
35001.00000  36001.00000  1.274602743873e-05
36001.00000  37001.00000  1.241920622235e-05
37001.00000  38001.00000  1.147719212808e-05
38001.00000  39001.00000  9.919985155932e-06
39001.00000  40001.00000  9.554714384686e-06
40001.00000  41001.00000  9.266342723176e-06
41001.00000  42001.00000  9.035645393969e-06
42001.00000  43001.00000  7.382314534647e-06
43001.00000  44001.00000  7.305415424911e-06
44001.00000  45001.00000  7.074718095703e-06
45001.00000  46001.00000  6.594098659854e-06
46001.00000  47001.00000  5.709758897891e-06
47001.00000  48001.00000  5.133015574872e-06
48001.00000  49001.00000  5.171465129740e-06
49001.00000  50001.00000  5.229139462041e-06
50001.00000  51001.00000  4.133327148305e-06
51001.00000  52001.00000  4.460148364682e-06
52001.00000  53001.00000  3.941079373965e-06
53001.00000  54001.00000  3.441235160682e-06
54001.00000  55001.00000  3.364336050946e-06
55001.00000  56001.00000  2.845267060228e-06
56001.00000  57001.00000  3.210537831474e-06
57001.00000  58001.00000  2.941390947398e-06
58001.00000  59001.00000  3.037514834568e-06
59001.00000  60001.00000  2.460771511549e-06
60001.00000  61001.00000  2.518445843851e-06
61001.00000  62001.00000  2.576120176153e-06
62001.00000  63001.00000  1.634106081888e-06
63001.00000  64001.00000  2.345422846945e-06
64001.00000  65001.00000  1.691780414190e-06
65001.00000  66001.00000  2.076275962869e-06
66001.00000  67001.00000  1.653330859322e-06
67001.00000  68001.00000  1.595656527020e-06
68001.00000  69001.00000  1.749454746492e-06
69001.00000  70001.00000  1.364959197812e-06
70001.00000  71001.00000  1.384183975246e-06
71001.00000  72001.00000  1.230385755774e-06
72001.00000  73001.00000  1.403408752680e-06
73001.00000  74001.00000  1.249610533208e-06
74001.00000  75001.00000  1.153486646039e-06
75001.00000  76001.00000  9.612388716988e-07
76001.00000  77001.00000  8.458902070949e-07
77001.00000  78001.00000  8.266654296610e-07
78001.00000  79001.00000  8.458902070949e-07
79001.00000  80001.00000  8.074406522270e-07
80001.00000  81001.00000  8.843397619629e-07
81001.00000  82001.00000  7.305415424911e-07
82001.00000  83001.00000  5.575185455853e-07
83001.00000  84001.00000  7.689910973590e-07
84001.00000  85001.00000  7.113167650571e-07
85001.00000  86001.00000  5.959681004533e-07
86001.00000  87001.00000  7.113167650571e-07
87001.00000  88001.00000  7.497663199251e-07
88001.00000  89001.00000  8.266654296610e-07
89001.00000  90001.00000  6.344176553212e-07
90001.00000  91001.00000  4.613946584154e-07
91001.00000  92001.00000  5.959681004533e-07
92001.00000  93001.00000  3.844955486795e-07
93001.00000  94001.00000  4.421698809814e-07
94001.00000  95001.00000  4.613946584154e-07
95001.00000  96001.00000  2.306973292077e-07
96001.00000  97001.00000  2.883716615096e-07
97001.00000  98001.00000  4.037203261135e-07
98001.00000  99001.00000  3.844955486795e-07
99001.00000  100001.00000  2.499221066417e-07
100001.00000  101001.00000  1.922477743398e-07
101001.00000  102001.00000  4.229451035475e-07
102001.00000  103001.00000  4.229451035475e-07
103001.00000  104001.00000  3.268212163776e-07
104001.00000  105001.00000  3.075964389436e-07
105001.00000  106001.00000  2.883716615096e-07
106001.00000  107001.00000  2.499221066417e-07
107001.00000  108001.00000  1.537982194718e-07
108001.00000  109001.00000  1.345734420378e-07
109001.00000  110001.00000  1.153486646039e-07
110001.00000  111001.00000  1.345734420378e-07
111001.00000  112001.00000  1.922477743398e-07
112001.00000  113001.00000  1.345734420378e-07
113001.00000  114001.00000  3.268212163776e-07
114001.00000  115001.00000  2.114725517737e-07
115001.00000  116001.00000  1.153486646039e-07
116001.00000  117001.00000  2.114725517737e-07
117001.00000  118001.00000  7.689910973590e-08
118001.00000  119001.00000  1.922477743398e-07
119001.00000  120001.00000  1.537982194718e-07
120001.00000  121001.00000  2.114725517737e-07
121001.00000  122001.00000  1.730229969058e-07
122001.00000  123001.00000  1.345734420378e-07
123001.00000  124001.00000  1.345734420378e-07
124001.00000  125001.00000  2.114725517737e-07
125001.00000  126001.00000  1.345734420378e-07
126001.00000  127001.00000  7.689910973590e-08
127001.00000  128001.00000  1.730229969058e-07
128001.00000  129001.00000  1.345734420378e-07
129001.00000  130001.00000  1.153486646039e-07
130001.00000  131001.00000  1.153486646039e-07
131001.00000  132001.00000  1.153486646039e-07
132001.00000  133001.00000  9.612388716988e-08
133001.00000  134001.00000  5.767433230193e-08
134001.00000  135001.00000  3.844955486795e-08
135001.00000  136001.00000  7.689910973590e-08
136001.00000  137001.00000  3.844955486795e-08
137001.00000  138001.00000  9.612388716988e-08
138001.00000  139001.00000  1.922477743398e-08
139001.00000  140001.00000  1.922477743398e-08
140001.00000  141001.00000  0.000000000000e+00
141001.00000  142001.00000  1.345734420378e-07
142001.00000  143001.00000  9.612388716988e-08
143001.00000  144001.00000  5.767433230193e-08
144001.00000  145001.00000  5.767433230193e-08
145001.00000  146001.00000  5.767433230193e-08
146001.00000  147001.00000  3.844955486795e-08
147001.00000  148001.00000  1.153486646039e-07
148001.00000  149001.00000  9.612388716988e-08
149001.00000  150001.00000  1.922477743398e-08
150001.00000  151001.00000  3.844955486795e-08
151001.00000  152001.00000  3.844955486795e-08
152001.00000  153001.00000  1.922477743398e-08
153001.00000  154001.00000  1.922477743398e-08
154001.00000  155001.00000  5.767433230193e-08
155001.00000  156001.00000  1.922477743398e-08
156001.00000  157001.00000  5.767433230193e-08
157001.00000  158001.00000  5.767433230193e-08
158001.00000  159001.00000  3.844955486795e-08
159001.00000  160001.00000  3.844955486795e-08
160001.00000  161001.00000  0.000000000000e+00
161001.00000  162001.00000  7.689910973590e-08
162001.00000  163001.00000  0.000000000000e+00
163001.00000  164001.00000  3.844955486795e-08
164001.00000  165001.00000  0.000000000000e+00
165001.00000  166001.00000  1.922477743398e-08
166001.00000  167001.00000  1.922477743398e-08
167001.00000  168001.00000  0.000000000000e+00
168001.00000  169001.00000  1.922477743398e-08
169001.00000  170001.00000  1.922477743398e-08
170001.00000  171001.00000  3.844955486795e-08
171001.00000  172001.00000  1.922477743398e-08
172001.00000  173001.00000  5.767433230193e-08
173001.00000  174001.00000  1.922477743398e-08
174001.00000  175001.00000  1.922477743398e-08
175001.00000  176001.00000  1.922477743398e-08
176001.00000  177001.00000  0.000000000000e+00
177001.00000  178001.00000  0.000000000000e+00
178001.00000  179001.00000  1.922477743398e-08
179001.00000  180001.00000  0.000000000000e+00
180001.00000  181001.00000  0.000000000000e+00
181001.00000  182001.00000  0.000000000000e+00
182001.00000  183001.00000  1.922477743398e-08
183001.00000  184001.00000  0.000000000000e+00
184001.00000  185001.00000  0.000000000000e+00
185001.00000  186001.00000  1.922477743398e-08
186001.00000  187001.00000  0.000000000000e+00
187001.00000  188001.00000  0.000000000000e+00
188001.00000  189001.00000  0.000000000000e+00
189001.00000  190001.00000  1.922477743398e-08
190001.00000  191001.00000  1.922477743398e-08
191001.00000  192001.00000  0.000000000000e+00
192001.00000  193001.00000  0.000000000000e+00
193001.00000  194001.00000  1.922477743398e-08
194001.00000  195001.00000  3.844955486795e-08
195001.00000  196001.00000  0.000000000000e+00
196001.00000  197001.00000  1.922477743398e-08
197001.00000  198001.00000  0.000000000000e+00
198001.00000  199001.00000  0.000000000000e+00
