300.00000  350.00000  1.610482326779e-06
350.00000  400.00000  3.220964653558e-06
400.00000  450.00000  4.227516107795e-06
450.00000  500.00000  4.831446980337e-06
500.00000  550.00000  4.287909195049e-05
550.00000  600.00000  4.428826398642e-06
600.00000  650.00000  1.348778948677e-05
650.00000  700.00000  5.032757271184e-06
700.00000  750.00000  1.006551454237e-05
750.00000  800.00000  7.649791052200e-06
800.00000  850.00000  3.120309508134e-05
850.00000  900.00000  8.253721924742e-06
900.00000  950.00000  1.006551454237e-05
950.00000  1000.00000  1.006551454237e-05
1000.00000  1050.00000  1.107206599660e-05
1050.00000  1100.00000  1.026682483322e-05
1100.00000  1150.00000  8.656342506436e-06
1150.00000  1200.00000  1.288385861423e-05
1200.00000  1250.00000  1.550089239525e-05
1250.00000  1300.00000  3.985943758778e-05
1300.00000  1350.00000  1.167599686915e-05
1350.00000  1400.00000  1.248123803254e-05
1400.00000  1450.00000  1.529958210440e-05
1450.00000  1500.00000  1.972840850304e-05
1500.00000  1550.00000  1.650744384948e-05
1550.00000  1600.00000  1.872185704880e-05
1600.00000  1650.00000  1.731268501287e-05
1650.00000  1700.00000  1.932578792135e-05
1700.00000  1750.00000  6.562715481624e-05
1750.00000  1800.00000  1.811792617626e-05
1800.00000  1850.00000  2.214413199321e-05
1850.00000  1900.00000  2.274806286575e-05
1900.00000  1950.00000  2.496247606507e-05
1950.00000  2000.00000  2.174151141151e-05
2000.00000  2050.00000  2.154020112067e-05
2050.00000  2100.00000  2.637164810100e-05
2100.00000  2150.00000  2.677426868270e-05
2150.00000  2200.00000  2.737819955524e-05
2200.00000  2250.00000  3.261226711727e-05
2250.00000  2300.00000  3.100178479049e-05
2300.00000  2350.00000  1.107206599660e-04
2350.00000  2400.00000  3.824895526100e-05
2400.00000  2450.00000  4.287909195049e-05
2450.00000  2500.00000  4.187254049625e-05
2500.00000  2550.00000  4.287909195049e-05
2550.00000  2600.00000  5.133412416608e-05
2600.00000  2650.00000  5.858129463658e-05
2650.00000  2700.00000  6.139963870844e-05
2700.00000  2750.00000  6.824418859725e-05
2750.00000  2800.00000  7.589397964945e-05
2800.00000  2850.00000  7.931625459386e-05
2850.00000  2900.00000  1.066944541491e-04
2900.00000  2950.00000  1.022656277505e-04
2950.00000  3000.00000  1.574246474426e-04
3000.00000  3050.00000  1.354818257403e-04
3050.00000  3100.00000  1.503787872630e-04
3100.00000  3150.00000  1.505800975538e-04
3150.00000  3200.00000  1.767504353640e-04
3200.00000  3250.00000  1.799714000175e-04
3250.00000  3300.00000  2.035247040467e-04
3300.00000  3350.00000  2.089600818996e-04
3350.00000  3400.00000  2.343251785463e-04
3400.00000  3450.00000  2.433841416345e-04
3450.00000  3500.00000  2.544562076311e-04
3500.00000  3550.00000  2.745872367158e-04
3550.00000  3600.00000  3.043811597612e-04
3600.00000  3650.00000  3.285383946629e-04
3650.00000  3700.00000  3.921524465707e-04
3700.00000  3750.00000  3.575270765449e-04
3750.00000  3800.00000  3.688004528324e-04
3800.00000  3850.00000  3.841000349368e-04
3850.00000  3900.00000  4.171149226357e-04
3900.00000  3950.00000  4.251673342696e-04
3950.00000  4000.00000  4.400642957923e-04
4000.00000  4050.00000  4.622084277855e-04
4050.00000  4100.00000  4.758975275632e-04
4100.00000  4150.00000  4.752935966906e-04
4150.00000  4200.00000  4.859630421055e-04
4200.00000  4250.00000  5.056914506086e-04
4250.00000  4300.00000  4.962298669387e-04
4300.00000  4350.00000  5.368945456899e-04
4350.00000  4400.00000  5.391089588892e-04
4400.00000  4450.00000  5.854103257841e-04
4450.00000  4500.00000  5.743382597875e-04
4500.00000  4550.00000  6.017164593428e-04
4550.00000  4600.00000  6.043334931238e-04
4600.00000  4650.00000  5.954758403265e-04
4650.00000  4700.00000  6.421798278031e-04
4700.00000  4750.00000  6.311077618065e-04
4750.00000  4800.00000  6.550636864173e-04
4800.00000  4850.00000  6.546610658356e-04
4850.00000  4900.00000  6.536545143814e-04
4900.00000  4950.00000  6.725776817210e-04
4950.00000  5000.00000  6.802274727732e-04
5000.00000  5050.00000  6.582846510709e-04
5050.00000  5100.00000  6.888838152797e-04
5100.00000  5150.00000  6.967349166227e-04
5150.00000  5200.00000  6.977414680769e-04
5200.00000  5250.00000  7.017676738939e-04
5250.00000  5300.00000  6.989493298220e-04
5300.00000  5350.00000  7.043847076749e-04
5350.00000  5400.00000  7.225026338512e-04
5400.00000  5450.00000  7.520952466057e-04
5450.00000  5500.00000  7.140476016356e-04
5500.00000  5550.00000  7.432375938085e-04
5550.00000  5600.00000  7.138462913447e-04
5600.00000  5650.00000  7.361917336288e-04
5650.00000  5700.00000  7.265288396681e-04
5700.00000  5750.00000  7.438415246810e-04
5750.00000  5800.00000  7.466598687529e-04
5800.00000  5850.00000  7.537057289325e-04
5850.00000  5900.00000  7.438415246810e-04
5900.00000  5950.00000  7.380035262464e-04
5950.00000  6000.00000  7.371982850830e-04
6000.00000  6050.00000  7.456533172986e-04
6050.00000  6100.00000  7.524978671874e-04
6100.00000  6150.00000  7.494782128247e-04
6150.00000  6200.00000  7.891363401216e-04
6200.00000  6250.00000  8.070529560071e-04
6250.00000  6300.00000  8.807325224572e-04
6300.00000  6350.00000  8.509385994118e-04
6350.00000  6400.00000  2.701382792881e-03
6400.00000  6450.00000  7.400166291549e-04
6450.00000  6500.00000  7.150541530898e-04
6500.00000  6550.00000  7.446467658444e-04
6550.00000  6600.00000  7.428349732268e-04
6600.00000  6650.00000  7.094174649461e-04
6650.00000  6700.00000  7.068004311651e-04
6700.00000  6750.00000  7.357891130471e-04
6750.00000  6800.00000  7.065991208742e-04
6800.00000  6850.00000  7.223013235603e-04
6850.00000  6900.00000  7.386074571190e-04
6900.00000  6950.00000  7.259249087956e-04
6950.00000  7000.00000  7.295484940308e-04
7000.00000  7050.00000  7.142489119264e-04
7050.00000  7100.00000  9.244168555711e-04
7100.00000  7150.00000  4.994508315923e-04
7150.00000  7200.00000  4.883787655957e-04
7200.00000  7250.00000  4.545586367333e-04
7250.00000  7300.00000  4.889826964682e-04
7300.00000  7350.00000  4.760988378540e-04
7350.00000  7400.00000  4.982429698472e-04
7400.00000  7450.00000  4.807289745435e-04
7450.00000  7500.00000  5.646753658268e-04
7500.00000  7550.00000  4.688516673835e-04
7550.00000  7600.00000  4.668385644750e-04
7600.00000  7650.00000  4.845538700696e-04
7650.00000  7700.00000  4.648254615666e-04
7700.00000  7750.00000  4.400642957923e-04
7750.00000  7800.00000  4.968337978113e-04
7800.00000  7850.00000  4.702608394194e-04
7850.00000  7900.00000  4.911971096676e-04
7900.00000  7950.00000  4.684490468018e-04
7950.00000  8000.00000  4.781119407625e-04
8000.00000  8050.00000  4.724752526188e-04
8050.00000  8100.00000  4.684490468018e-04
8100.00000  8150.00000  4.658320130208e-04
8150.00000  8200.00000  4.763001481449e-04
8200.00000  8250.00000  4.614031866221e-04
8250.00000  8300.00000  4.676438056384e-04
8300.00000  8350.00000  4.720726320371e-04
8350.00000  8400.00000  4.595913940045e-04
8400.00000  8450.00000  4.501298103347e-04
8450.00000  8500.00000  4.567730499327e-04
8500.00000  8550.00000  4.632149792398e-04
8550.00000  8600.00000  4.412721575374e-04
8600.00000  8650.00000  4.636175998215e-04
8650.00000  8700.00000  4.529481544066e-04
8700.00000  8750.00000  4.402656060832e-04
8750.00000  8800.00000  4.561691190601e-04
8800.00000  8850.00000  4.763001481449e-04
8850.00000  8900.00000  4.477140868445e-04
8900.00000  8950.00000  4.293948503774e-04
8950.00000  9000.00000  4.362394002662e-04
9000.00000  9050.00000  4.356354693937e-04
9050.00000  9100.00000  4.340249870669e-04
9100.00000  9150.00000  4.412721575374e-04
9150.00000  9200.00000  4.302000915408e-04
9200.00000  9250.00000  4.306027121225e-04
9250.00000  9300.00000  4.314079532859e-04
9300.00000  9350.00000  4.297974709591e-04
9350.00000  9400.00000  4.229529210703e-04
9400.00000  9450.00000  4.267778165964e-04
9450.00000  9500.00000  4.253686445605e-04
9500.00000  9550.00000  4.227516107795e-04
9550.00000  9600.00000  4.310053327042e-04
9600.00000  9650.00000  4.275830577598e-04
9650.00000  9700.00000  4.287909195049e-04
9700.00000  9750.00000  4.183227843808e-04
9750.00000  9800.00000  4.060428566391e-04
9800.00000  9850.00000  4.086598904201e-04
9850.00000  9900.00000  4.082572698384e-04
9900.00000  9950.00000  3.996009273320e-04
9950.00000  10000.00000  3.955747215151e-04
