10001.00000  11001.00000  5.628676146619e-04
11001.00000  12001.00000  4.858728553941e-04
12001.00000  13001.00000  4.273160592852e-04
13001.00000  14001.00000  3.738954835613e-04
14001.00000  15001.00000  3.334562436684e-04
15001.00000  16001.00000  2.949103175281e-04
16001.00000  17001.00000  2.677728204092e-04
17001.00000  18001.00000  2.420237533754e-04
18001.00000  19001.00000  2.222750345417e-04
19001.00000  20001.00000  2.008854437893e-04
20001.00000  21001.00000  1.862146895329e-04
21001.00000  22001.00000  1.678252728805e-04
22001.00000  23001.00000  1.574071925912e-04
23001.00000  24001.00000  1.454259147934e-04
24001.00000  25001.00000  1.345029508368e-04
25001.00000  26001.00000  1.277938236421e-04
26001.00000  27001.00000  1.167058015634e-04
27001.00000  28001.00000  1.110161510047e-04
28001.00000  29001.00000  1.023651635510e-04
29001.00000  30001.00000  9.718039665961e-05
30001.00000  31001.00000  9.123830426719e-05
31001.00000  32001.00000  8.660696754957e-05
32001.00000  33001.00000  8.092702629212e-05
33001.00000  34001.00000  7.690737555607e-05
34001.00000  35001.00000  7.132452731157e-05
35001.00000  36001.00000  6.918848102671e-05
36001.00000  37001.00000  6.679028360690e-05
37001.00000  38001.00000  6.456685361039e-05
38001.00000  39001.00000  6.024621453420e-05
39001.00000  40001.00000  5.633336611240e-05
40001.00000  41001.00000  5.501290113631e-05
41001.00000  42001.00000  5.157580847795e-05
42001.00000  43001.00000  4.976987843712e-05
43001.00000  44001.00000  4.656580900984e-05
44001.00000  45001.00000  4.401226276931e-05
45001.00000  46001.00000  4.347825119809e-05
46001.00000  47001.00000  4.299278613335e-05
47001.00000  48001.00000  4.069168172649e-05
48001.00000  49001.00000  3.788569365229e-05
49001.00000  50001.00000  3.725458906813e-05
50001.00000  51001.00000  3.513796138586e-05
51001.00000  52001.00000  3.284656628029e-05
52001.00000  53001.00000  3.146784549643e-05
53001.00000  54001.00000  3.189505475340e-05
54001.00000  55001.00000  3.028331073847e-05
55001.00000  56001.00000  2.979784567373e-05
56001.00000  57001.00000  2.729284593967e-05
57001.00000  58001.00000  2.869098532612e-05
58001.00000  59001.00000  2.553546240531e-05
59001.00000  60001.00000  2.611802048300e-05
60001.00000  61001.00000  2.450627646806e-05
61001.00000  62001.00000  2.455482297454e-05
62001.00000  63001.00000  2.266150922205e-05
63001.00000  64001.00000  2.231197437544e-05
64001.00000  65001.00000  2.175854420164e-05
65001.00000  66001.00000  2.090412568769e-05
66001.00000  67001.00000  1.968075372455e-05
67001.00000  68001.00000  1.903023053780e-05
68001.00000  69001.00000  1.903023053780e-05
69001.00000  70001.00000  1.856418407565e-05
70001.00000  71001.00000  1.739906792027e-05
71001.00000  72001.00000  1.836999804975e-05
72001.00000  73001.00000  1.640871918820e-05
73001.00000  74001.00000  1.643784709209e-05
74001.00000  75001.00000  1.635046338044e-05
75001.00000  76001.00000  1.583587041181e-05
76001.00000  77001.00000  1.523389373153e-05
77001.00000  78001.00000  1.485523098104e-05
78001.00000  79001.00000  1.398139386451e-05
79001.00000  80001.00000  1.409790548004e-05
80001.00000  81001.00000  1.360273111401e-05
81001.00000  82001.00000  1.331145207516e-05
82001.00000  83001.00000  1.304930094020e-05
83001.00000  84001.00000  1.249587076640e-05
84001.00000  85001.00000  1.204924290684e-05
85001.00000  86001.00000  1.207837081073e-05
86001.00000  87001.00000  1.099092906571e-05
87001.00000  88001.00000  1.136959181621e-05
88001.00000  89001.00000  1.102976627089e-05
89001.00000  90001.00000  1.094238255923e-05
90001.00000  91001.00000  1.107831277736e-05
91001.00000  92001.00000  1.001028963493e-05
92001.00000  93001.00000  1.014621985306e-05
93001.00000  94001.00000  1.022389426342e-05
94001.00000  95001.00000  9.408312954657e-06
95001.00000  96001.00000  9.369475749477e-06
96001.00000  97001.00000  8.573313043304e-06
97001.00000  98001.00000  8.884010684738e-06
98001.00000  99001.00000  8.282034004460e-06
99001.00000  100001.00000  8.660696754957e-06
100001.00000  101001.00000  8.262615401871e-06
101001.00000  102001.00000  7.922789856553e-06
102001.00000  103001.00000  8.010173568206e-06
103001.00000  104001.00000  7.612092215120e-06
104001.00000  105001.00000  7.359650381455e-06
105001.00000  106001.00000  6.932441124484e-06
106001.00000  107001.00000  7.340231778865e-06
107001.00000  108001.00000  7.243138765917e-06
108001.00000  109001.00000  7.029534137432e-06
109001.00000  110001.00000  6.582906277871e-06
110001.00000  111001.00000  6.670289989524e-06
111001.00000  112001.00000  5.874127283351e-06
112001.00000  113001.00000  6.301336540322e-06
113001.00000  114001.00000  5.912964488530e-06
114001.00000  115001.00000  6.048894706657e-06
115001.00000  116001.00000  6.243080732553e-06
116001.00000  117001.00000  5.476045930265e-06
117001.00000  118001.00000  5.912964488530e-06
118001.00000  119001.00000  5.912964488530e-06
119001.00000  120001.00000  5.388662218611e-06
120001.00000  121001.00000  5.068255275883e-06
121001.00000  122001.00000  5.388662218611e-06
122001.00000  123001.00000  5.087673878473e-06
123001.00000  124001.00000  4.621627416323e-06
124001.00000  125001.00000  5.184766891421e-06
125001.00000  126001.00000  5.077964577178e-06
126001.00000  127001.00000  4.650755320207e-06
127001.00000  128001.00000  4.728429730565e-06
128001.00000  129001.00000  4.466278595606e-06
129001.00000  130001.00000  4.747848333155e-06
130001.00000  131001.00000  4.077906543814e-06
131001.00000  132001.00000  4.611918115028e-06
132001.00000  133001.00000  4.058487941224e-06
133001.00000  134001.00000  4.009941434750e-06
134001.00000  135001.00000  3.990522832161e-06
135001.00000  136001.00000  4.204127460646e-06
136001.00000  137001.00000  3.903139120508e-06
137001.00000  138001.00000  3.951685626982e-06
138001.00000  139001.00000  4.126453050288e-06
139001.00000  140001.00000  3.388546151884e-06
140001.00000  141001.00000  3.301162440230e-06
141001.00000  142001.00000  3.640987985548e-06
142001.00000  143001.00000  3.592441479074e-06
143001.00000  144001.00000  3.456511260947e-06
144001.00000  145001.00000  3.699243793317e-06
145001.00000  146001.00000  3.223488029872e-06
146001.00000  147001.00000  3.611860081664e-06
147001.00000  148001.00000  3.155522920808e-06
148001.00000  149001.00000  3.155522920808e-06
149001.00000  150001.00000  2.805988074196e-06
150001.00000  151001.00000  2.815697375491e-06
151001.00000  152001.00000  2.951627593618e-06
152001.00000  153001.00000  2.679767157364e-06
153001.00000  154001.00000  2.369069515930e-06
154001.00000  155001.00000  2.485581131468e-06
155001.00000  156001.00000  2.893371785849e-06
156001.00000  157001.00000  2.708895061248e-06
157001.00000  158001.00000  2.563255541826e-06
158001.00000  159001.00000  2.650639253479e-06
159001.00000  160001.00000  2.805988074196e-06
160001.00000  161001.00000  2.543836939236e-06
161001.00000  162001.00000  2.407906721109e-06
162001.00000  163001.00000  2.339941612046e-06
163001.00000  164001.00000  2.320523009456e-06
164001.00000  165001.00000  2.262267201687e-06
165001.00000  166001.00000  2.417616022404e-06
166001.00000  167001.00000  2.165174188739e-06
167001.00000  168001.00000  2.223429996508e-06
168001.00000  169001.00000  2.553546240531e-06
169001.00000  170001.00000  2.301104406866e-06
170001.00000  171001.00000  2.058371874497e-06
171001.00000  172001.00000  1.980697464138e-06
172001.00000  173001.00000  2.019534669317e-06
173001.00000  174001.00000  2.019534669317e-06
174001.00000  175001.00000  1.854476547306e-06
175001.00000  176001.00000  1.873895149895e-06
176001.00000  177001.00000  2.097209079676e-06
177001.00000  178001.00000  2.048662573202e-06
178001.00000  179001.00000  2.000116066728e-06
179001.00000  180001.00000  2.301104406866e-06
180001.00000  181001.00000  1.844767246011e-06
181001.00000  182001.00000  1.747674233063e-06
182001.00000  183001.00000  1.844767246011e-06
183001.00000  184001.00000  1.621453316231e-06
184001.00000  185001.00000  1.757383534358e-06
185001.00000  186001.00000  1.757383534358e-06
186001.00000  187001.00000  1.514651001988e-06
187001.00000  188001.00000  1.485523098104e-06
188001.00000  189001.00000  1.669999822705e-06
189001.00000  190001.00000  1.689418425294e-06
190001.00000  191001.00000  1.524360303283e-06
191001.00000  192001.00000  1.553488207167e-06
192001.00000  193001.00000  1.398139386451e-06
193001.00000  194001.00000  1.611744014936e-06
194001.00000  195001.00000  1.446685892924e-06
195001.00000  196001.00000  1.436976591630e-06
196001.00000  197001.00000  1.378720783861e-06
197001.00000  198001.00000  1.320464976092e-06
198001.00000  199001.00000  1.485523098104e-06
