10001.00000  11001.00000  6.343524455208e-04
11001.00000  12001.00000  5.328567803735e-04
12001.00000  13001.00000  4.514569301642e-04
13001.00000  14001.00000  3.893722986486e-04
14001.00000  15001.00000  3.344582605390e-04
15001.00000  16001.00000  2.925239041644e-04
16001.00000  17001.00000  2.601019299285e-04
17001.00000  18001.00000  2.275891886875e-04
18001.00000  19001.00000  2.007221551661e-04
19001.00000  20001.00000  1.807352606343e-04
20001.00000  21001.00000  1.620372575755e-04
21001.00000  22001.00000  1.453724354319e-04
22001.00000  23001.00000  1.332822703472e-04
23001.00000  24001.00000  1.214280994760e-04
24001.00000  25001.00000  1.125147795713e-04
25001.00000  26001.00000  1.013141311370e-04
26001.00000  27001.00000  9.410723092891e-05
27001.00000  28001.00000  8.884274463080e-05
28001.00000  29001.00000  7.911252167982e-05
29001.00000  30001.00000  7.225053609125e-05
30001.00000  31001.00000  6.872877629183e-05
31001.00000  32001.00000  6.475318146671e-05
32001.00000  33001.00000  5.992437679327e-05
33001.00000  34001.00000  5.578540135890e-05
34001.00000  35001.00000  5.249963577284e-05
35001.00000  36001.00000  4.881449536417e-05
36001.00000  37001.00000  4.710807566754e-05
37001.00000  38001.00000  4.387677028456e-05
38001.00000  39001.00000  4.071807850570e-05
39001.00000  40001.00000  3.881197139776e-05
40001.00000  41001.00000  3.661540987338e-05
41001.00000  42001.00000  3.556251261376e-05
42001.00000  43001.00000  3.309365007396e-05
43001.00000  44001.00000  3.180475860097e-05
44001.00000  45001.00000  2.944481646734e-05
45001.00000  46001.00000  2.810146479127e-05
46001.00000  47001.00000  2.677626651623e-05
47001.00000  48001.00000  2.510615362166e-05
48001.00000  49001.00000  2.439817098157e-05
49001.00000  50001.00000  2.316373971167e-05
50001.00000  51001.00000  2.218345605616e-05
51001.00000  52001.00000  2.114871219757e-05
52001.00000  53001.00000  1.967828671430e-05
53001.00000  54001.00000  1.871615645982e-05
54001.00000  55001.00000  1.777217960637e-05
55001.00000  56001.00000  1.626544732105e-05
56001.00000  57001.00000  1.744541838786e-05
57001.00000  58001.00000  1.648328813338e-05
58001.00000  59001.00000  1.637436772721e-05
59001.00000  60001.00000  1.475871503573e-05
60001.00000  61001.00000  1.497655584806e-05
61001.00000  62001.00000  1.317936914629e-05
62001.00000  63001.00000  1.279814772471e-05
63001.00000  64001.00000  1.305229533910e-05
64001.00000  65001.00000  1.221723889181e-05
65001.00000  66001.00000  1.152740965275e-05
66001.00000  67001.00000  1.141848924658e-05
67001.00000  68001.00000  1.105542122602e-05
68001.00000  69001.00000  1.114618823116e-05
69001.00000  70001.00000  1.065604640341e-05
70001.00000  71001.00000  9.548688940704e-06
71001.00000  72001.00000  9.476075336592e-06
72001.00000  73001.00000  8.713632493418e-06
73001.00000  74001.00000  8.768092696502e-06
74001.00000  75001.00000  9.131160717061e-06
75001.00000  76001.00000  8.277950868747e-06
76001.00000  77001.00000  7.969343051272e-06
77001.00000  78001.00000  8.205337264635e-06
78001.00000  79001.00000  7.987496452300e-06
79001.00000  80001.00000  7.442894421461e-06
80001.00000  81001.00000  7.279513812209e-06
81001.00000  82001.00000  6.753065182399e-06
82001.00000  83001.00000  6.861985588566e-06
83001.00000  84001.00000  6.807525385483e-06
84001.00000  85001.00000  5.972468938197e-06
85001.00000  86001.00000  6.444457364923e-06
86001.00000  87001.00000  5.863548532029e-06
87001.00000  88001.00000  5.391560105302e-06
88001.00000  89001.00000  5.591247516610e-06
89001.00000  90001.00000  5.409713506330e-06
90001.00000  91001.00000  5.082952287827e-06
91001.00000  92001.00000  4.919571678575e-06
92001.00000  93001.00000  5.028492084743e-06
93001.00000  94001.00000  4.302356043625e-06
94001.00000  95001.00000  4.356816246709e-06
95001.00000  96001.00000  4.084515231290e-06
96001.00000  97001.00000  4.320509444653e-06
97001.00000  98001.00000  4.302356043625e-06
98001.00000  99001.00000  4.502043454932e-06
99001.00000  100001.00000  4.138975434373e-06
100001.00000  101001.00000  4.138975434373e-06
101001.00000  102001.00000  3.848521017926e-06
102001.00000  103001.00000  3.467299596339e-06
103001.00000  104001.00000  3.576220002507e-06
104001.00000  105001.00000  3.666987007647e-06
105001.00000  106001.00000  3.558066601479e-06
106001.00000  107001.00000  3.612526804563e-06
107001.00000  108001.00000  3.358379190171e-06
108001.00000  109001.00000  2.795623758305e-06
109001.00000  110001.00000  3.176845179892e-06
110001.00000  111001.00000  3.140538377836e-06
111001.00000  112001.00000  3.086078174752e-06
112001.00000  113001.00000  2.668549951109e-06
113001.00000  114001.00000  2.632243149053e-06
114001.00000  115001.00000  3.031617971668e-06
115001.00000  116001.00000  2.723010154193e-06
116001.00000  117001.00000  2.196561524382e-06
117001.00000  118001.00000  3.049771372696e-06
118001.00000  119001.00000  2.614089748025e-06
119001.00000  120001.00000  2.559629544941e-06
120001.00000  121001.00000  2.541476143913e-06
121001.00000  122001.00000  2.269175128494e-06
122001.00000  123001.00000  2.269175128494e-06
123001.00000  124001.00000  2.432555737746e-06
124001.00000  125001.00000  1.978720712047e-06
125001.00000  126001.00000  2.069487717187e-06
126001.00000  127001.00000  1.887953706907e-06
127001.00000  128001.00000  1.942413909991e-06
128001.00000  129001.00000  1.760879899711e-06
129001.00000  130001.00000  2.196561524382e-06
130001.00000  131001.00000  1.724573097656e-06
131001.00000  132001.00000  1.779033300739e-06
132001.00000  133001.00000  1.815340102795e-06
133001.00000  134001.00000  1.833493503823e-06
134001.00000  135001.00000  1.742726498684e-06
135001.00000  136001.00000  1.561192488404e-06
136001.00000  137001.00000  1.543039087376e-06
137001.00000  138001.00000  1.633806092516e-06
138001.00000  139001.00000  1.906107107935e-06
139001.00000  140001.00000  1.452272082236e-06
140001.00000  141001.00000  1.397811879152e-06
141001.00000  142001.00000  1.361505077097e-06
142001.00000  143001.00000  1.089204061677e-06
143001.00000  144001.00000  1.179971066817e-06
144001.00000  145001.00000  1.415965280180e-06
145001.00000  146001.00000  1.270738071957e-06
146001.00000  147001.00000  1.052897259621e-06
147001.00000  148001.00000  1.379658478124e-06
148001.00000  149001.00000  1.325198275041e-06
149001.00000  150001.00000  1.089204061677e-06
150001.00000  151001.00000  9.439768534536e-07
151001.00000  152001.00000  1.252584670929e-06
152001.00000  153001.00000  1.307044874013e-06
153001.00000  154001.00000  1.325198275041e-06
154001.00000  155001.00000  9.984370565374e-07
155001.00000  156001.00000  9.621302544815e-07
156001.00000  157001.00000  9.439768534536e-07
157001.00000  158001.00000  9.076700513977e-07
158001.00000  159001.00000  9.984370565374e-07
159001.00000  160001.00000  1.270738071957e-06
160001.00000  161001.00000  8.895166503697e-07
161001.00000  162001.00000  8.350564472859e-07
162001.00000  163001.00000  9.802836555095e-07
163001.00000  164001.00000  8.169030462579e-07
164001.00000  165001.00000  9.439768534536e-07
165001.00000  166001.00000  8.532098483138e-07
166001.00000  167001.00000  7.805962442020e-07
167001.00000  168001.00000  8.532098483138e-07
168001.00000  169001.00000  1.198124467845e-06
169001.00000  170001.00000  7.079826400902e-07
170001.00000  171001.00000  8.895166503697e-07
171001.00000  172001.00000  7.261360411181e-07
172001.00000  173001.00000  8.895166503697e-07
173001.00000  174001.00000  7.624428431740e-07
174001.00000  175001.00000  9.076700513977e-07
175001.00000  176001.00000  8.350564472859e-07
176001.00000  177001.00000  9.076700513977e-07
177001.00000  178001.00000  8.350564472859e-07
178001.00000  179001.00000  4.901418277547e-07
179001.00000  180001.00000  5.990622339225e-07
180001.00000  181001.00000  8.895166503697e-07
181001.00000  182001.00000  6.353690359784e-07
182001.00000  183001.00000  8.350564472859e-07
183001.00000  184001.00000  5.264486298107e-07
184001.00000  185001.00000  5.627554318666e-07
185001.00000  186001.00000  5.082952287827e-07
186001.00000  187001.00000  5.264486298107e-07
187001.00000  188001.00000  3.993748226150e-07
188001.00000  189001.00000  4.356816246709e-07
189001.00000  190001.00000  4.901418277547e-07
190001.00000  191001.00000  4.538350256988e-07
191001.00000  192001.00000  4.356816246709e-07
192001.00000  193001.00000  5.990622339225e-07
193001.00000  194001.00000  5.627554318666e-07
194001.00000  195001.00000  5.627554318666e-07
195001.00000  196001.00000  6.172156349504e-07
196001.00000  197001.00000  6.353690359784e-07
197001.00000  198001.00000  4.175282236429e-07
198001.00000  199001.00000  3.449146195311e-07
