10001.00000  11001.00000  3.731118998369e-04
11001.00000  12001.00000  2.977532136637e-04
12001.00000  13001.00000  2.473387785468e-04
13001.00000  14001.00000  2.036487725550e-04
14001.00000  15001.00000  1.679980281988e-04
15001.00000  16001.00000  1.399733124036e-04
16001.00000  17001.00000  1.244958554228e-04
17001.00000  18001.00000  1.046231011927e-04
18001.00000  19001.00000  9.211340902136e-05
19001.00000  20001.00000  7.979155006581e-05
20001.00000  21001.00000  6.810832404394e-05
21001.00000  22001.00000  6.063256205566e-05
22001.00000  23001.00000  5.717643088520e-05
23001.00000  24001.00000  5.146630112531e-05
24001.00000  25001.00000  4.613183779700e-05
25001.00000  26001.00000  4.008360824869e-05
26001.00000  27001.00000  3.497454477932e-05
27001.00000  28001.00000  3.294594604883e-05
28001.00000  29001.00000  3.009088116889e-05
29001.00000  30001.00000  2.900144851733e-05
30001.00000  31001.00000  2.704798307316e-05
31001.00000  32001.00000  2.430561812268e-05
32001.00000  33001.00000  2.235215267851e-05
33001.00000  34001.00000  2.021085401855e-05
34001.00000  35001.00000  1.803198871544e-05
35001.00000  36001.00000  1.634148977337e-05
36001.00000  37001.00000  1.574042348285e-05
37001.00000  38001.00000  1.528962376497e-05
38001.00000  39001.00000  1.453829090182e-05
39001.00000  40001.00000  1.326102503448e-05
40001.00000  41001.00000  1.153295944925e-05
41001.00000  42001.00000  1.145782616293e-05
42001.00000  43001.00000  1.134512623346e-05
43001.00000  44001.00000  9.541927361919e-06
44001.00000  45001.00000  8.978427714562e-06
45001.00000  46001.00000  8.151961565104e-06
46001.00000  47001.00000  8.677894569305e-06
47001.00000  48001.00000  8.076828278790e-06
48001.00000  49001.00000  7.550895274590e-06
49001.00000  50001.00000  7.024962270389e-06
50001.00000  51001.00000  6.912262340918e-06
51001.00000  52001.00000  5.484729900946e-06
52001.00000  53001.00000  5.747696403046e-06
53001.00000  54001.00000  5.259330042003e-06
54001.00000  55001.00000  5.372029971474e-06
55001.00000  56001.00000  5.109063469374e-06
56001.00000  57001.00000  4.169897390445e-06
57001.00000  58001.00000  4.132330747288e-06
58001.00000  59001.00000  4.207464033602e-06
59001.00000  60001.00000  3.794230958873e-06
60001.00000  61001.00000  3.982064174659e-06
61001.00000  62001.00000  3.080464738887e-06
62001.00000  63001.00000  3.606397743088e-06
63001.00000  64001.00000  3.643964386245e-06
64001.00000  65001.00000  2.629665021001e-06
65001.00000  66001.00000  3.268297954673e-06
66001.00000  67001.00000  3.005331452573e-06
67001.00000  68001.00000  2.779931593630e-06
68001.00000  69001.00000  2.366698518901e-06
69001.00000  70001.00000  2.779931593630e-06
70001.00000  71001.00000  2.516965091530e-06
71001.00000  72001.00000  2.779931593630e-06
72001.00000  73001.00000  2.178865303115e-06
73001.00000  74001.00000  2.479398448373e-06
74001.00000  75001.00000  2.554531734687e-06
75001.00000  76001.00000  2.291565232587e-06
76001.00000  77001.00000  1.615365655758e-06
77001.00000  78001.00000  2.103732016801e-06
78001.00000  79001.00000  1.991032087330e-06
79001.00000  80001.00000  1.465099083129e-06
80001.00000  81001.00000  1.465099083129e-06
81001.00000  82001.00000  1.652932298915e-06
82001.00000  83001.00000  1.765632228387e-06
83001.00000  84001.00000  1.427532439972e-06
84001.00000  85001.00000  1.690498942072e-06
85001.00000  86001.00000  1.577799012601e-06
86001.00000  87001.00000  1.164565937872e-06
87001.00000  88001.00000  1.652932298915e-06
88001.00000  89001.00000  1.540232369444e-06
89001.00000  90001.00000  1.014299365243e-06
90001.00000  91001.00000  1.615365655758e-06
91001.00000  92001.00000  1.314832510501e-06
92001.00000  93001.00000  8.264661494576e-07
93001.00000  94001.00000  7.137662199861e-07
94001.00000  95001.00000  9.391660789291e-07
95001.00000  96001.00000  1.089432651558e-06
96001.00000  97001.00000  7.888995063004e-07
97001.00000  98001.00000  5.259330042003e-07
98001.00000  99001.00000  7.888995063004e-07
99001.00000  100001.00000  7.888995063004e-07
100001.00000  101001.00000  7.888995063004e-07
101001.00000  102001.00000  7.888995063004e-07
102001.00000  103001.00000  1.202132581029e-06
103001.00000  104001.00000  6.386329336718e-07
104001.00000  105001.00000  1.014299365243e-06
105001.00000  106001.00000  7.137662199861e-07
106001.00000  107001.00000  4.883663610431e-07
107001.00000  108001.00000  5.259330042003e-07
108001.00000  109001.00000  6.761995768289e-07
109001.00000  110001.00000  4.507997178860e-07
110001.00000  111001.00000  6.010662905146e-07
111001.00000  112001.00000  5.634996473574e-07
112001.00000  113001.00000  4.883663610431e-07
113001.00000  114001.00000  7.513328631433e-07
114001.00000  115001.00000  4.132330747288e-07
115001.00000  116001.00000  5.634996473574e-07
116001.00000  117001.00000  3.380997884145e-07
117001.00000  118001.00000  5.634996473574e-07
118001.00000  119001.00000  4.883663610431e-07
119001.00000  120001.00000  3.005331452573e-07
120001.00000  121001.00000  3.005331452573e-07
121001.00000  122001.00000  4.507997178860e-07
122001.00000  123001.00000  3.380997884145e-07
123001.00000  124001.00000  6.010662905146e-07
124001.00000  125001.00000  3.380997884145e-07
125001.00000  126001.00000  4.132330747288e-07
126001.00000  127001.00000  4.132330747288e-07
127001.00000  128001.00000  3.756664315716e-07
128001.00000  129001.00000  3.756664315716e-07
129001.00000  130001.00000  3.756664315716e-07
130001.00000  131001.00000  5.259330042003e-07
131001.00000  132001.00000  2.253998589430e-07
132001.00000  133001.00000  3.380997884145e-07
133001.00000  134001.00000  2.629665021001e-07
134001.00000  135001.00000  2.629665021001e-07
135001.00000  136001.00000  3.756664315716e-07
136001.00000  137001.00000  1.502665726287e-07
137001.00000  138001.00000  2.253998589430e-07
138001.00000  139001.00000  2.629665021001e-07
139001.00000  140001.00000  3.005331452573e-07
140001.00000  141001.00000  1.878332157858e-07
141001.00000  142001.00000  2.253998589430e-07
142001.00000  143001.00000  3.380997884145e-07
143001.00000  144001.00000  4.507997178860e-07
144001.00000  145001.00000  3.005331452573e-07
145001.00000  146001.00000  2.253998589430e-07
146001.00000  147001.00000  3.005331452573e-07
147001.00000  148001.00000  3.380997884145e-07
148001.00000  149001.00000  2.629665021001e-07
149001.00000  150001.00000  1.502665726287e-07
150001.00000  151001.00000  1.878332157858e-07
151001.00000  152001.00000  1.878332157858e-07
152001.00000  153001.00000  3.756664315716e-08
153001.00000  154001.00000  3.756664315716e-08
154001.00000  155001.00000  1.126999294715e-07
155001.00000  156001.00000  7.513328631433e-08
156001.00000  157001.00000  2.629665021001e-07
157001.00000  158001.00000  2.629665021001e-07
158001.00000  159001.00000  1.502665726287e-07
159001.00000  160001.00000  2.253998589430e-07
160001.00000  161001.00000  3.756664315716e-08
161001.00000  162001.00000  3.005331452573e-07
162001.00000  163001.00000  1.502665726287e-07
163001.00000  164001.00000  1.126999294715e-07
164001.00000  165001.00000  1.878332157858e-07
165001.00000  166001.00000  2.629665021001e-07
166001.00000  167001.00000  7.513328631433e-08
167001.00000  168001.00000  7.513328631433e-08
168001.00000  169001.00000  7.513328631433e-08
169001.00000  170001.00000  7.513328631433e-08
170001.00000  171001.00000  1.878332157858e-07
171001.00000  172001.00000  7.513328631433e-08
172001.00000  173001.00000  3.380997884145e-07
173001.00000  174001.00000  3.756664315716e-08
174001.00000  175001.00000  1.878332157858e-07
175001.00000  176001.00000  0.000000000000e+00
176001.00000  177001.00000  1.126999294715e-07
177001.00000  178001.00000  1.502665726287e-07
178001.00000  179001.00000  1.126999294715e-07
179001.00000  180001.00000  7.513328631433e-08
180001.00000  181001.00000  7.513328631433e-08
181001.00000  182001.00000  1.126999294715e-07
182001.00000  183001.00000  1.878332157858e-07
183001.00000  184001.00000  7.513328631433e-08
184001.00000  185001.00000  1.878332157858e-07
185001.00000  186001.00000  1.126999294715e-07
186001.00000  187001.00000  7.513328631433e-08
187001.00000  188001.00000  3.756664315716e-08
188001.00000  189001.00000  1.126999294715e-07
189001.00000  190001.00000  3.756664315716e-08
190001.00000  191001.00000  3.756664315716e-08
191001.00000  192001.00000  1.502665726287e-07
192001.00000  193001.00000  7.513328631433e-08
193001.00000  194001.00000  3.756664315716e-08
194001.00000  195001.00000  1.502665726287e-07
195001.00000  196001.00000  7.513328631433e-08
196001.00000  197001.00000  1.126999294715e-07
197001.00000  198001.00000  3.756664315716e-08
198001.00000  199001.00000  7.513328631433e-08
