10001.00000  11001.00000  3.144474731430e-04
11001.00000  12001.00000  2.628564490885e-04
12001.00000  13001.00000  2.252432886941e-04
13001.00000  14001.00000  1.919868650249e-04
14001.00000  15001.00000  1.647935666316e-04
15001.00000  16001.00000  1.450611798803e-04
16001.00000  17001.00000  1.295039991573e-04
17001.00000  18001.00000  1.134566855527e-04
18001.00000  19001.00000  9.982373021669e-05
19001.00000  20001.00000  8.880481691581e-05
20001.00000  21001.00000  8.105345615885e-05
21001.00000  22001.00000  7.377407521379e-05
22001.00000  23001.00000  6.758387845003e-05
23001.00000  24001.00000  5.941499709024e-05
24001.00000  25001.00000  5.543947482847e-05
25001.00000  26001.00000  5.208115693611e-05
26001.00000  27001.00000  4.710721584148e-05
27001.00000  28001.00000  4.342214269473e-05
28001.00000  29001.00000  4.093517214742e-05
29001.00000  30001.00000  3.744978276724e-05
30001.00000  31001.00000  3.443637319896e-05
31001.00000  32001.00000  3.136850442161e-05
32001.00000  33001.00000  3.015224875249e-05
33001.00000  34001.00000  2.851847248053e-05
34001.00000  35001.00000  2.608596114228e-05
35001.00000  36001.00000  2.486970547315e-05
36001.00000  37001.00000  2.305439850431e-05
37001.00000  38001.00000  2.194706125331e-05
38001.00000  39001.00000  2.031328498136e-05
39001.00000  40001.00000  1.809861047937e-05
40001.00000  41001.00000  1.958716219382e-05
41001.00000  42001.00000  1.715465085557e-05
42001.00000  43001.00000  1.593839518644e-05
43001.00000  44001.00000  1.561163993205e-05
44001.00000  45001.00000  1.450430268106e-05
45001.00000  46001.00000  1.399601672978e-05
46001.00000  47001.00000  1.319728166349e-05
47001.00000  48001.00000  1.227147510938e-05
48001.00000  49001.00000  1.174503608842e-05
49001.00000  50001.00000  1.147274004309e-05
50001.00000  51001.00000  1.143643390371e-05
51001.00000  52001.00000  9.802657631754e-06
52001.00000  53001.00000  9.675586143935e-06
53001.00000  54001.00000  9.421443168296e-06
54001.00000  55001.00000  9.258065541101e-06
55001.00000  56001.00000  8.513789683875e-06
56001.00000  57001.00000  7.969197593222e-06
57001.00000  58001.00000  7.751360756961e-06
58001.00000  59001.00000  7.261227875373e-06
59001.00000  60001.00000  7.279380945061e-06
60001.00000  61001.00000  7.061544108800e-06
61001.00000  62001.00000  6.153890624379e-06
62001.00000  63001.00000  6.280962112198e-06
63001.00000  64001.00000  6.353574390951e-06
64001.00000  65001.00000  5.845288439675e-06
65001.00000  66001.00000  5.845288439675e-06
66001.00000  67001.00000  5.808982300298e-06
67001.00000  68001.00000  5.409614767153e-06
68001.00000  69001.00000  5.246237139957e-06
69001.00000  70001.00000  5.391461697464e-06
70001.00000  71001.00000  4.610879700862e-06
71001.00000  72001.00000  4.483808213043e-06
72001.00000  73001.00000  4.483808213043e-06
73001.00000  74001.00000  4.592726631173e-06
74001.00000  75001.00000  4.029981470832e-06
75001.00000  76001.00000  3.830297704259e-06
76001.00000  77001.00000  3.394624031737e-06
77001.00000  78001.00000  3.539848589244e-06
78001.00000  79001.00000  3.721379286129e-06
79001.00000  80001.00000  3.721379286129e-06
80001.00000  81001.00000  2.958950359214e-06
81001.00000  82001.00000  3.485389380179e-06
82001.00000  83001.00000  3.412777101425e-06
83001.00000  84001.00000  3.086021847034e-06
84001.00000  85001.00000  2.958950359214e-06
85001.00000  86001.00000  2.813725801707e-06
86001.00000  87001.00000  2.795572732019e-06
87001.00000  88001.00000  2.868185010772e-06
88001.00000  89001.00000  2.759266592642e-06
89001.00000  90001.00000  2.777419662330e-06
90001.00000  91001.00000  2.142062223235e-06
91001.00000  92001.00000  2.250980641366e-06
92001.00000  93001.00000  1.797153899155e-06
93001.00000  94001.00000  2.523276686692e-06
94001.00000  95001.00000  2.069449944481e-06
95001.00000  96001.00000  2.414358268562e-06
96001.00000  97001.00000  2.069449944481e-06
97001.00000  98001.00000  2.359899059496e-06
98001.00000  99001.00000  2.014990735416e-06
99001.00000  100001.00000  1.960531526351e-06
100001.00000  101001.00000  1.797153899155e-06
101001.00000  102001.00000  1.760847759778e-06
102001.00000  103001.00000  1.470398644763e-06
103001.00000  104001.00000  1.724541620401e-06
104001.00000  105001.00000  1.760847759778e-06
105001.00000  106001.00000  1.742694690090e-06
106001.00000  107001.00000  1.397786366009e-06
107001.00000  108001.00000  1.470398644763e-06
108001.00000  109001.00000  1.597470132582e-06
109001.00000  110001.00000  1.434092505386e-06
110001.00000  111001.00000  1.724541620401e-06
111001.00000  112001.00000  1.107337250994e-06
112001.00000  113001.00000  1.397786366009e-06
113001.00000  114001.00000  1.343327156944e-06
114001.00000  115001.00000  1.343327156944e-06
115001.00000  116001.00000  1.543010923517e-06
116001.00000  117001.00000  1.252561808502e-06
117001.00000  118001.00000  1.125490320683e-06
118001.00000  119001.00000  9.258065541101e-07
119001.00000  120001.00000  1.143643390371e-06
120001.00000  121001.00000  1.216255669125e-06
121001.00000  122001.00000  9.439596237985e-07
122001.00000  123001.00000  9.439596237985e-07
123001.00000  124001.00000  9.802657631754e-07
124001.00000  125001.00000  9.621126934869e-07
125001.00000  126001.00000  1.034724972241e-06
126001.00000  127001.00000  9.439596237985e-07
127001.00000  128001.00000  9.621126934869e-07
128001.00000  129001.00000  9.439596237985e-07
129001.00000  130001.00000  8.350412056679e-07
130001.00000  131001.00000  6.716635784720e-07
131001.00000  132001.00000  9.258065541101e-07
132001.00000  133001.00000  8.350412056679e-07
133001.00000  134001.00000  8.168881359795e-07
134001.00000  135001.00000  7.987350662910e-07
135001.00000  136001.00000  7.987350662910e-07
136001.00000  137001.00000  7.442758572257e-07
137001.00000  138001.00000  5.445920906530e-07
138001.00000  139001.00000  7.261227875373e-07
139001.00000  140001.00000  4.719798118992e-07
140001.00000  141001.00000  7.987350662910e-07
141001.00000  142001.00000  8.168881359795e-07
142001.00000  143001.00000  6.535105087836e-07
143001.00000  144001.00000  5.082859512761e-07
144001.00000  145001.00000  7.987350662910e-07
145001.00000  146001.00000  4.356736725224e-07
146001.00000  147001.00000  6.172043694067e-07
147001.00000  148001.00000  5.445920906530e-07
148001.00000  149001.00000  6.898166481604e-07
149001.00000  150001.00000  5.445920906530e-07
150001.00000  151001.00000  4.719798118992e-07
151001.00000  152001.00000  5.264390209645e-07
152001.00000  153001.00000  5.990512997183e-07
153001.00000  154001.00000  6.172043694067e-07
154001.00000  155001.00000  3.449083240802e-07
155001.00000  156001.00000  5.990512997183e-07
156001.00000  157001.00000  4.901328815877e-07
157001.00000  158001.00000  3.993675331455e-07
158001.00000  159001.00000  3.267552543918e-07
159001.00000  160001.00000  6.716635784720e-07
160001.00000  161001.00000  3.086021847034e-07
161001.00000  162001.00000  3.267552543918e-07
162001.00000  163001.00000  4.719798118992e-07
163001.00000  164001.00000  3.267552543918e-07
164001.00000  165001.00000  3.812144634571e-07
165001.00000  166001.00000  3.086021847034e-07
166001.00000  167001.00000  4.175206028339e-07
167001.00000  168001.00000  3.086021847034e-07
168001.00000  169001.00000  2.178368362612e-07
169001.00000  170001.00000  4.901328815877e-07
170001.00000  171001.00000  2.904491150149e-07
171001.00000  172001.00000  3.630613937686e-07
172001.00000  173001.00000  3.267552543918e-07
173001.00000  174001.00000  5.445920906530e-07
174001.00000  175001.00000  3.812144634571e-07
175001.00000  176001.00000  4.901328815877e-07
176001.00000  177001.00000  3.630613937686e-07
177001.00000  178001.00000  3.086021847034e-07
178001.00000  179001.00000  3.630613937686e-07
179001.00000  180001.00000  2.904491150149e-07
180001.00000  181001.00000  3.449083240802e-07
181001.00000  182001.00000  2.359899059496e-07
182001.00000  183001.00000  2.722960453265e-07
183001.00000  184001.00000  2.359899059496e-07
184001.00000  185001.00000  2.722960453265e-07
185001.00000  186001.00000  4.175206028339e-07
186001.00000  187001.00000  2.359899059496e-07
187001.00000  188001.00000  2.541429756381e-07
188001.00000  189001.00000  3.267552543918e-07
189001.00000  190001.00000  1.996837665728e-07
190001.00000  191001.00000  2.359899059496e-07
191001.00000  192001.00000  2.722960453265e-07
192001.00000  193001.00000  2.904491150149e-07
193001.00000  194001.00000  2.178368362612e-07
194001.00000  195001.00000  2.178368362612e-07
195001.00000  196001.00000  1.996837665728e-07
196001.00000  197001.00000  2.541429756381e-07
197001.00000  198001.00000  1.996837665728e-07
198001.00000  199001.00000  1.270714878190e-07
