10001.00000  11001.00000  1.555555002371e-05
11001.00000  12001.00000  1.509062698439e-05
12001.00000  13001.00000  1.351182583006e-05
13001.00000  14001.00000  1.284349896104e-05
14001.00000  15001.00000  1.217517209203e-05
15001.00000  16001.00000  1.017987738164e-05
16001.00000  17001.00000  1.017019148499e-05
17001.00000  18001.00000  9.579351789194e-06
18001.00000  19001.00000  8.504217260781e-06
19001.00000  20001.00000  8.107095498033e-06
20001.00000  21001.00000  6.692954586787e-06
21001.00000  22001.00000  6.596095620264e-06
22001.00000  23001.00000  6.082743097688e-06
23001.00000  24001.00000  5.559704678460e-06
24001.00000  25001.00000  5.123839329104e-06
25001.00000  26001.00000  4.949493189361e-06
26001.00000  27001.00000  4.484570150047e-06
27001.00000  28001.00000  4.523313736657e-06
28001.00000  29001.00000  4.116506077257e-06
29001.00000  30001.00000  3.700012521205e-06
30001.00000  31001.00000  3.690326624553e-06
31001.00000  32001.00000  3.390063828329e-06
32001.00000  33001.00000  3.186659998630e-06
33001.00000  34001.00000  2.663621579402e-06
34001.00000  35001.00000  2.799224132535e-06
35001.00000  36001.00000  3.041371548844e-06
36001.00000  37001.00000  2.547390819573e-06
37001.00000  38001.00000  2.528019026269e-06
38001.00000  39001.00000  2.266499816655e-06
39001.00000  40001.00000  2.179326746783e-06
40001.00000  41001.00000  2.121211366869e-06
41001.00000  42001.00000  1.753147294079e-06
42001.00000  43001.00000  1.975922917083e-06
43001.00000  44001.00000  1.917807537169e-06
44001.00000  45001.00000  1.753147294079e-06
45001.00000  46001.00000  1.743461397427e-06
46001.00000  47001.00000  1.665974224208e-06
47001.00000  48001.00000  1.530371671074e-06
48001.00000  49001.00000  1.762833190731e-06
49001.00000  50001.00000  1.414140911246e-06
50001.00000  51001.00000  1.375397324637e-06
51001.00000  52001.00000  1.297910151418e-06
52001.00000  53001.00000  1.046076838456e-06
53001.00000  54001.00000  1.201051184894e-06
54001.00000  55001.00000  9.104742853228e-07
55001.00000  56001.00000  8.039294221467e-07
56001.00000  57001.00000  1.007333251846e-06
57001.00000  58001.00000  9.007883886704e-07
58001.00000  59001.00000  1.046076838456e-06
59001.00000  60001.00000  9.395319752799e-07
60001.00000  61001.00000  9.879614585417e-07
61001.00000  62001.00000  6.683268690135e-07
62001.00000  63001.00000  7.167563522754e-07
63001.00000  64001.00000  5.714679024898e-07
64001.00000  65001.00000  7.942435254943e-07
65001.00000  66001.00000  6.102114890993e-07
66001.00000  67001.00000  6.876986623183e-07
67001.00000  68001.00000  6.295832824040e-07
68001.00000  69001.00000  5.617820058374e-07
69001.00000  70001.00000  5.520961091851e-07
70001.00000  71001.00000  5.520961091851e-07
71001.00000  72001.00000  5.133525225756e-07
72001.00000  73001.00000  5.908396957946e-07
73001.00000  74001.00000  5.617820058374e-07
74001.00000  75001.00000  5.617820058374e-07
75001.00000  76001.00000  4.068076593995e-07
76001.00000  77001.00000  4.649230393137e-07
77001.00000  78001.00000  4.358653493566e-07
78001.00000  79001.00000  3.583781761377e-07
79001.00000  80001.00000  3.971217627472e-07
80001.00000  81001.00000  3.874358660948e-07
81001.00000  82001.00000  3.680640727901e-07
82001.00000  83001.00000  3.777499694424e-07
83001.00000  84001.00000  4.746089359661e-07
84001.00000  85001.00000  3.680640727901e-07
85001.00000  86001.00000  4.261794527043e-07
86001.00000  87001.00000  3.680640727901e-07
87001.00000  88001.00000  3.971217627472e-07
88001.00000  89001.00000  3.099486928758e-07
89001.00000  90001.00000  3.293204861806e-07
90001.00000  91001.00000  3.486922794853e-07
91001.00000  92001.00000  2.421474163092e-07
92001.00000  93001.00000  3.099486928758e-07
93001.00000  94001.00000  1.743461397427e-07
94001.00000  95001.00000  3.002627962235e-07
95001.00000  96001.00000  2.227756230045e-07
96001.00000  97001.00000  1.840320363950e-07
97001.00000  98001.00000  2.808910029187e-07
98001.00000  99001.00000  2.227756230045e-07
99001.00000  100001.00000  2.034038296998e-07
100001.00000  101001.00000  2.421474163092e-07
101001.00000  102001.00000  1.937179330474e-07
102001.00000  103001.00000  2.808910029187e-07
103001.00000  104001.00000  1.840320363950e-07
104001.00000  105001.00000  1.162307598284e-07
105001.00000  106001.00000  1.937179330474e-07
106001.00000  107001.00000  1.259166564808e-07
107001.00000  108001.00000  1.356025531332e-07
108001.00000  109001.00000  1.259166564808e-07
109001.00000  110001.00000  1.549743464379e-07
110001.00000  111001.00000  1.549743464379e-07
111001.00000  112001.00000  9.685896652370e-08
112001.00000  113001.00000  9.685896652370e-08
113001.00000  114001.00000  1.646602430903e-07
114001.00000  115001.00000  9.685896652370e-08
115001.00000  116001.00000  1.743461397427e-07
116001.00000  117001.00000  8.717306987133e-08
117001.00000  118001.00000  8.717306987133e-08
118001.00000  119001.00000  5.811537991422e-08
119001.00000  120001.00000  1.452884497855e-07
120001.00000  121001.00000  9.685896652370e-08
121001.00000  122001.00000  1.356025531332e-07
122001.00000  123001.00000  7.748717321896e-08
123001.00000  124001.00000  5.811537991422e-08
124001.00000  125001.00000  1.065448631761e-07
125001.00000  126001.00000  8.717306987133e-08
126001.00000  127001.00000  1.452884497855e-07
127001.00000  128001.00000  5.811537991422e-08
128001.00000  129001.00000  6.780127656659e-08
129001.00000  130001.00000  5.811537991422e-08
130001.00000  131001.00000  6.780127656659e-08
131001.00000  132001.00000  7.748717321896e-08
132001.00000  133001.00000  1.065448631761e-07
133001.00000  134001.00000  4.842948326185e-08
134001.00000  135001.00000  7.748717321896e-08
135001.00000  136001.00000  5.811537991422e-08
136001.00000  137001.00000  5.811537991422e-08
137001.00000  138001.00000  5.811537991422e-08
138001.00000  139001.00000  8.717306987133e-08
139001.00000  140001.00000  1.937179330474e-08
140001.00000  141001.00000  3.874358660948e-08
141001.00000  142001.00000  6.780127656659e-08
142001.00000  143001.00000  2.905768995711e-08
143001.00000  144001.00000  2.905768995711e-08
144001.00000  145001.00000  4.842948326185e-08
145001.00000  146001.00000  5.811537991422e-08
146001.00000  147001.00000  1.937179330474e-08
147001.00000  148001.00000  4.842948326185e-08
148001.00000  149001.00000  5.811537991422e-08
149001.00000  150001.00000  5.811537991422e-08
150001.00000  151001.00000  9.685896652370e-08
151001.00000  152001.00000  4.842948326185e-08
152001.00000  153001.00000  1.937179330474e-08
153001.00000  154001.00000  4.842948326185e-08
154001.00000  155001.00000  4.842948326185e-08
155001.00000  156001.00000  1.937179330474e-08
156001.00000  157001.00000  3.874358660948e-08
157001.00000  158001.00000  9.685896652370e-09
158001.00000  159001.00000  3.874358660948e-08
159001.00000  160001.00000  1.937179330474e-08
160001.00000  161001.00000  2.905768995711e-08
161001.00000  162001.00000  7.748717321896e-08
162001.00000  163001.00000  2.905768995711e-08
163001.00000  164001.00000  4.842948326185e-08
164001.00000  165001.00000  0.000000000000e+00
165001.00000  166001.00000  3.874358660948e-08
166001.00000  167001.00000  1.937179330474e-08
167001.00000  168001.00000  3.874358660948e-08
168001.00000  169001.00000  9.685896652370e-09
169001.00000  170001.00000  9.685896652370e-09
170001.00000  171001.00000  9.685896652370e-09
171001.00000  172001.00000  9.685896652370e-09
172001.00000  173001.00000  2.905768995711e-08
173001.00000  174001.00000  2.905768995711e-08
174001.00000  175001.00000  1.937179330474e-08
175001.00000  176001.00000  3.874358660948e-08
176001.00000  177001.00000  3.874358660948e-08
177001.00000  178001.00000  4.842948326185e-08
178001.00000  179001.00000  0.000000000000e+00
179001.00000  180001.00000  3.874358660948e-08
180001.00000  181001.00000  0.000000000000e+00
181001.00000  182001.00000  9.685896652370e-09
182001.00000  183001.00000  2.905768995711e-08
183001.00000  184001.00000  9.685896652370e-09
184001.00000  185001.00000  1.937179330474e-08
185001.00000  186001.00000  0.000000000000e+00
186001.00000  187001.00000  0.000000000000e+00
187001.00000  188001.00000  0.000000000000e+00
188001.00000  189001.00000  9.685896652370e-09
189001.00000  190001.00000  0.000000000000e+00
190001.00000  191001.00000  1.937179330474e-08
191001.00000  192001.00000  0.000000000000e+00
192001.00000  193001.00000  0.000000000000e+00
193001.00000  194001.00000  0.000000000000e+00
194001.00000  195001.00000  0.000000000000e+00
195001.00000  196001.00000  0.000000000000e+00
196001.00000  197001.00000  0.000000000000e+00
197001.00000  198001.00000  0.000000000000e+00
198001.00000  199001.00000  0.000000000000e+00
