10001.00000  11001.00000  8.843041956799e-04
11001.00000  12001.00000  7.659923187947e-04
12001.00000  13001.00000  6.765845318123e-04
13001.00000  14001.00000  5.939737146461e-04
14001.00000  15001.00000  5.308132847141e-04
15001.00000  16001.00000  4.748861493368e-04
16001.00000  17001.00000  4.265219760944e-04
17001.00000  18001.00000  3.902682383732e-04
18001.00000  19001.00000  3.523467705402e-04
19001.00000  20001.00000  3.244413794834e-04
20001.00000  21001.00000  2.939956088376e-04
21001.00000  22001.00000  2.731295902295e-04
22001.00000  23001.00000  2.509449013003e-04
23001.00000  24001.00000  2.353147795548e-04
24001.00000  25001.00000  2.166885612712e-04
25001.00000  26001.00000  2.029200917435e-04
26001.00000  27001.00000  1.886571208454e-04
27001.00000  28001.00000  1.770024022734e-04
28001.00000  29001.00000  1.661912448625e-04
29001.00000  30001.00000  1.577265449346e-04
30001.00000  31001.00000  1.482146656341e-04
31001.00000  32001.00000  1.393136409676e-04
32001.00000  33001.00000  1.301896058792e-04
33001.00000  34001.00000  1.244882959621e-04
34001.00000  35001.00000  1.173713546710e-04
35001.00000  36001.00000  1.114858187532e-04
36001.00000  37001.00000  1.058911659944e-04
37001.00000  38001.00000  1.004225626045e-04
38001.00000  39001.00000  9.744585827704e-05
39001.00000  40001.00000  9.196755878187e-05
40001.00000  41001.00000  8.728433992139e-05
41001.00000  42001.00000  8.277565095633e-05
42001.00000  43001.00000  7.847058020260e-05
43001.00000  44001.00000  7.767549956790e-05
44001.00000  45001.00000  7.181905196598e-05
45001.00000  46001.00000  6.955985943080e-05
46001.00000  47001.00000  6.707765647369e-05
47001.00000  48001.00000  6.358705856526e-05
48001.00000  49001.00000  6.141513097779e-05
49001.00000  50001.00000  6.034855939466e-05
50001.00000  51001.00000  5.720702127707e-05
51001.00000  52001.00000  5.549081063876e-05
52001.00000  53001.00000  5.335766747249e-05
53001.00000  54001.00000  5.109847493732e-05
54001.00000  55001.00000  4.962466693153e-05
55001.00000  56001.00000  4.782119134551e-05
56001.00000  57001.00000  4.507719354527e-05
57001.00000  58001.00000  4.537777280961e-05
58001.00000  59001.00000  4.282769711539e-05
59001.00000  60001.00000  4.175142942696e-05
60001.00000  61001.00000  3.938557973347e-05
61001.00000  62001.00000  3.810569383371e-05
62001.00000  63001.00000  3.737848593612e-05
63001.00000  64001.00000  3.523564666455e-05
64001.00000  65001.00000  3.469266476769e-05
65001.00000  66001.00000  3.376183865877e-05
66001.00000  67001.00000  3.274374760215e-05
67001.00000  68001.00000  3.154143054480e-05
68001.00000  69001.00000  3.149295001829e-05
69001.00000  70001.00000  3.065908496239e-05
70001.00000  71001.00000  2.924345358841e-05
71001.00000  72001.00000  2.894287432408e-05
72001.00000  73001.00000  2.693578052673e-05
73001.00000  74001.00000  2.710061431685e-05
74001.00000  75001.00000  2.644127915637e-05
75001.00000  76001.00000  2.636371031396e-05
76001.00000  77001.00000  2.437600872721e-05
77001.00000  78001.00000  2.310581893276e-05
78001.00000  79001.00000  2.297976956384e-05
79001.00000  80001.00000  2.258222924649e-05
80001.00000  81001.00000  2.180654082240e-05
81001.00000  82001.00000  2.078844976577e-05
82001.00000  83001.00000  2.012911460529e-05
83001.00000  84001.00000  1.998367302577e-05
84001.00000  85001.00000  2.018729123710e-05
85001.00000  86001.00000  1.946008333951e-05
86001.00000  87001.00000  1.812202080794e-05
87001.00000  88001.00000  1.782144154360e-05
88001.00000  89001.00000  1.777296101710e-05
89001.00000  90001.00000  1.788931428071e-05
90001.00000  91001.00000  1.698757648770e-05
91001.00000  92001.00000  1.596948543107e-05
92001.00000  93001.00000  1.596948543107e-05
93001.00000  94001.00000  1.499987490095e-05
94001.00000  95001.00000  1.555255290312e-05
95001.00000  96001.00000  1.445689300409e-05
96001.00000  97001.00000  1.483504111083e-05
97001.00000  98001.00000  1.469929563662e-05
98001.00000  99001.00000  1.395269552842e-05
99001.00000  100001.00000  1.330305647324e-05
100001.00000  101001.00000  1.334184089445e-05
101001.00000  102001.00000  1.326427205204e-05
102001.00000  103001.00000  1.341940973686e-05
103001.00000  104001.00000  1.250797583855e-05
104001.00000  105001.00000  1.154806141373e-05
105001.00000  106001.00000  1.196499394168e-05
106001.00000  107001.00000  1.189712120457e-05
107001.00000  108001.00000  1.098568730626e-05
108001.00000  109001.00000  1.084994183204e-05
109001.00000  110001.00000  1.082085351614e-05
110001.00000  111001.00000  1.052027425180e-05
111001.00000  112001.00000  1.020030277686e-05
112001.00000  113001.00000  1.048148983060e-05
113001.00000  114001.00000  1.073358856843e-05
114001.00000  115001.00000  9.870635196620e-06
115001.00000  116001.00000  9.599144248186e-06
116001.00000  117001.00000  9.482790984572e-06
117001.00000  118001.00000  9.608840353488e-06
118001.00000  119001.00000  8.968897403609e-06
119001.00000  120001.00000  8.086551821199e-06
120001.00000  121001.00000  8.551964875657e-06
121001.00000  122001.00000  8.959201298307e-06
122001.00000  123001.00000  8.610141507464e-06
123001.00000  124001.00000  8.212601190115e-06
124001.00000  125001.00000  7.756884240959e-06
125001.00000  126001.00000  8.299866137826e-06
126001.00000  127001.00000  7.252686765296e-06
127001.00000  128001.00000  7.252686765296e-06
128001.00000  129001.00000  7.155725712284e-06
129001.00000  130001.00000  7.485393292525e-06
130001.00000  131001.00000  6.670920447224e-06
131001.00000  132001.00000  6.845450342646e-06
132001.00000  133001.00000  7.019980238068e-06
133001.00000  134001.00000  6.767881500236e-06
134001.00000  135001.00000  6.476998341201e-06
135001.00000  136001.00000  6.215203498068e-06
136001.00000  137001.00000  6.118242445056e-06
137001.00000  138001.00000  5.769182654213e-06
138001.00000  139001.00000  5.769182654213e-06
139001.00000  140001.00000  6.224899603369e-06
140001.00000  141001.00000  5.555868337587e-06
141001.00000  142001.00000  6.011585286743e-06
142001.00000  143001.00000  5.255289073250e-06
143001.00000  144001.00000  5.361946231563e-06
144001.00000  145001.00000  4.925621493009e-06
145001.00000  146001.00000  5.361946231563e-06
146001.00000  147001.00000  5.158328020238e-06
147001.00000  148001.00000  5.284377389153e-06
148001.00000  149001.00000  4.906229282406e-06
149001.00000  150001.00000  4.692914965780e-06
150001.00000  151001.00000  4.625042228672e-06
151001.00000  152001.00000  4.722003281684e-06
152001.00000  153001.00000  4.818964334696e-06
153001.00000  154001.00000  4.605650018069e-06
154001.00000  155001.00000  4.673522755178e-06
155001.00000  156001.00000  4.508688965057e-06
156001.00000  157001.00000  4.188717490118e-06
157001.00000  158001.00000  3.820265488672e-06
158001.00000  159001.00000  4.411727912045e-06
159001.00000  160001.00000  3.965707068190e-06
160001.00000  161001.00000  4.159629174214e-06
161001.00000  162001.00000  3.946314857588e-06
162001.00000  163001.00000  3.829961593973e-06
163001.00000  164001.00000  4.072364226503e-06
164001.00000  165001.00000  3.674823909154e-06
165001.00000  166001.00000  3.752392751564e-06
166001.00000  167001.00000  3.868746015178e-06
167001.00000  168001.00000  3.451813487227e-06
168001.00000  169001.00000  3.703912225058e-06
169001.00000  170001.00000  3.509990119034e-06
170001.00000  171001.00000  3.626343382648e-06
171001.00000  172001.00000  3.277283591805e-06
172001.00000  173001.00000  3.248195275901e-06
173001.00000  174001.00000  2.976704327468e-06
174001.00000  175001.00000  3.374244644817e-06
175001.00000  176001.00000  3.393636855419e-06
176001.00000  177001.00000  3.151234222889e-06
177001.00000  178001.00000  3.248195275901e-06
178001.00000  179001.00000  2.782782221444e-06
179001.00000  180001.00000  2.947616011564e-06
180001.00000  181001.00000  2.986400432769e-06
181001.00000  182001.00000  2.811870537348e-06
182001.00000  183001.00000  2.792478326745e-06
183001.00000  184001.00000  3.160930328191e-06
184001.00000  185001.00000  2.724605589637e-06
185001.00000  186001.00000  2.569467904818e-06
186001.00000  187001.00000  2.734301694938e-06
187001.00000  188001.00000  2.996096538070e-06
188001.00000  189001.00000  2.540379588914e-06
189001.00000  190001.00000  2.365849693492e-06
190001.00000  191001.00000  2.899135485058e-06
191001.00000  192001.00000  2.462810746504e-06
192001.00000  193001.00000  2.394938009396e-06
193001.00000  194001.00000  2.268888640480e-06
194001.00000  195001.00000  2.162231482167e-06
195001.00000  196001.00000  2.375545798794e-06
196001.00000  197001.00000  2.336761377589e-06
197001.00000  198001.00000  2.433722430601e-06
198001.00000  199001.00000  2.142839271565e-06
