300.00000  350.00000  4.525472612769e-04
350.00000  400.00000  4.902293390774e-04
400.00000  450.00000  4.463876908672e-04
450.00000  500.00000  4.826204579831e-04
500.00000  550.00000  6.489288590448e-04
550.00000  600.00000  3.782700886894e-04
600.00000  650.00000  4.666780404521e-04
650.00000  700.00000  4.953019264736e-04
700.00000  750.00000  5.768256524843e-04
750.00000  800.00000  6.579870508238e-04
800.00000  850.00000  8.877027943382e-04
850.00000  900.00000  7.833524250446e-04
900.00000  950.00000  8.474844228396e-04
950.00000  1000.00000  9.735744524028e-04
1000.00000  1050.00000  1.147854062230e-03
1050.00000  1100.00000  1.349670575065e-03
1100.00000  1150.00000  1.560907607351e-03
1150.00000  1200.00000  1.766347396897e-03
1200.00000  1250.00000  2.011643230272e-03
1250.00000  1300.00000  2.380492799511e-03
1300.00000  1350.00000  2.340636755684e-03
1350.00000  1400.00000  2.658035795618e-03
1400.00000  1450.00000  2.910578182416e-03
1450.00000  1500.00000  3.284138011380e-03
1500.00000  1550.00000  3.582696012415e-03
1550.00000  1600.00000  3.929443593713e-03
1600.00000  1650.00000  4.205537279136e-03
1650.00000  1700.00000  4.460615959632e-03
1700.00000  1750.00000  4.839973031335e-03
1750.00000  1800.00000  4.960265818159e-03
1800.00000  1850.00000  5.135632411000e-03
1850.00000  1900.00000  4.929830293782e-03
1900.00000  1950.00000  5.134545427987e-03
1950.00000  2000.00000  5.405928853684e-03
2000.00000  2050.00000  5.524410002153e-03
2050.00000  2100.00000  5.636731580212e-03
2100.00000  2150.00000  5.753763417996e-03
2150.00000  2200.00000  5.911738282621e-03
2200.00000  2250.00000  5.951594326449e-03
2250.00000  2300.00000  5.874780860163e-03
2300.00000  2350.00000  6.112467812443e-03
2350.00000  2400.00000  6.050509780675e-03
2400.00000  2450.00000  5.961739501241e-03
2450.00000  2500.00000  5.785285925387e-03
2500.00000  2550.00000  5.751227124298e-03
2550.00000  2600.00000  5.685283488147e-03
2600.00000  2650.00000  5.623325456379e-03
2650.00000  2700.00000  5.529482589549e-03
2700.00000  2750.00000  5.618977524325e-03
2750.00000  2800.00000  5.584918723236e-03
2800.00000  2850.00000  5.482742319970e-03
2850.00000  2900.00000  5.450857484908e-03
2900.00000  2950.00000  5.342521511231e-03
2950.00000  3000.00000  5.338535906849e-03
3000.00000  3050.00000  5.207735617561e-03
3050.00000  3100.00000  5.178024748526e-03
3100.00000  3150.00000  5.015339624175e-03
3150.00000  3200.00000  4.939250813232e-03
3200.00000  3250.00000  4.782000603949e-03
3250.00000  3300.00000  4.792508106413e-03
3300.00000  3350.00000  4.755913011626e-03
3350.00000  3400.00000  4.635257897130e-03
3400.00000  3450.00000  4.574749176047e-03
3450.00000  3500.00000  4.495037088392e-03
3500.00000  3550.00000  4.440687937718e-03
3550.00000  3600.00000  4.392860685125e-03
3600.00000  3650.00000  4.291408937201e-03
3650.00000  3700.00000  4.250103582689e-03
3700.00000  3750.00000  4.145028558053e-03
3750.00000  3800.00000  4.134883383260e-03
3800.00000  3850.00000  3.924371006317e-03
3850.00000  3900.00000  3.934878508781e-03
3900.00000  3950.00000  3.883790307148e-03
3950.00000  4000.00000  3.774367350458e-03
4000.00000  4050.00000  3.812774083600e-03
4050.00000  4100.00000  3.721829838140e-03
4100.00000  4150.00000  3.577261097347e-03
4150.00000  4200.00000  3.524723585029e-03
4200.00000  4250.00000  3.471461417369e-03
4250.00000  4300.00000  3.446823135730e-03
4300.00000  4350.00000  3.298268790555e-03
4350.00000  4400.00000  3.216382736874e-03
4400.00000  4450.00000  3.238847052485e-03
4450.00000  4500.00000  3.168917811952e-03
4500.00000  4550.00000  3.050436663483e-03
4550.00000  4600.00000  3.040653816362e-03
4600.00000  4650.00000  2.974710180211e-03
4650.00000  4700.00000  2.980145095278e-03
4700.00000  4750.00000  2.892099471187e-03
4750.00000  4800.00000  2.861301619138e-03
4800.00000  4850.00000  2.821445575311e-03
4850.00000  4900.00000  2.792459361618e-03
4900.00000  4950.00000  2.671804247122e-03
4950.00000  5000.00000  2.660572089317e-03
5000.00000  5050.00000  2.577961380292e-03
5050.00000  5100.00000  2.541366285505e-03
5100.00000  5150.00000  2.486654807160e-03
5150.00000  5200.00000  2.492089722228e-03
5200.00000  5250.00000  2.439914537581e-03
5250.00000  5300.00000  2.409116685533e-03
5300.00000  5350.00000  2.387014697592e-03
5350.00000  5400.00000  2.342448394039e-03
5400.00000  5450.00000  2.269982859808e-03
5450.00000  5500.00000  2.249330182552e-03
5500.00000  5550.00000  2.255489752961e-03
5550.00000  5600.00000  2.168168784212e-03
5600.00000  5650.00000  2.098239543679e-03
5650.00000  5700.00000  2.128675068056e-03
5700.00000  5750.00000  2.037006167253e-03
5750.00000  5800.00000  2.022150732735e-03
5800.00000  5850.00000  1.983019344250e-03
5850.00000  5900.00000  1.990265897673e-03
5900.00000  5950.00000  1.965627616035e-03
5950.00000  6000.00000  1.934829763986e-03
6000.00000  6050.00000  1.911640793032e-03
6050.00000  6100.00000  1.818522581544e-03
6100.00000  6150.00000  1.826493790310e-03
6150.00000  6200.00000  1.776492571690e-03
6200.00000  6250.00000  1.801493181000e-03
6250.00000  6300.00000  1.731926268137e-03
6300.00000  6350.00000  1.690983241297e-03
6350.00000  6400.00000  1.946786577134e-03
6400.00000  6450.00000  1.675040823766e-03
6450.00000  6500.00000  1.723230404030e-03
6500.00000  6550.00000  1.630836847884e-03
6550.00000  6600.00000  1.621778656105e-03
6600.00000  6650.00000  1.565255539405e-03
6650.00000  6700.00000  1.488804400790e-03
6700.00000  6750.00000  1.557284330639e-03
6750.00000  6800.00000  1.543153551464e-03
6800.00000  6850.00000  1.491340694488e-03
6850.00000  6900.00000  1.492065349831e-03
6900.00000  6950.00000  1.444600424909e-03
6950.00000  7000.00000  1.448586029292e-03
7000.00000  7050.00000  1.398222483000e-03
7050.00000  7100.00000  1.442426458882e-03
7100.00000  7150.00000  1.363076698898e-03
7150.00000  7200.00000  1.326481604111e-03
7200.00000  7250.00000  1.275031074807e-03
7250.00000  7300.00000  1.264161244672e-03
7300.00000  7350.00000  1.238435980020e-03
7350.00000  7400.00000  1.251117448510e-03
7400.00000  7450.00000  1.250755120839e-03
7450.00000  7500.00000  1.208725110985e-03
7500.00000  7550.00000  1.166695101130e-03
7550.00000  7600.00000  1.126839057303e-03
7600.00000  7650.00000  1.149303372915e-03
7650.00000  7700.00000  1.129013023330e-03
7700.00000  7750.00000  1.167419756473e-03
7750.00000  7800.00000  1.117056210182e-03
7800.00000  7850.00000  1.134447938397e-03
7850.00000  7900.00000  1.078287149368e-03
7900.00000  7950.00000  1.106911035389e-03
7950.00000  8000.00000  1.059808438138e-03
8000.00000  8050.00000  1.021401704996e-03
8050.00000  8100.00000  1.048213952661e-03
8100.00000  8150.00000  1.039155760882e-03
8150.00000  8200.00000  1.025749637050e-03
8200.00000  8250.00000  9.895168699337e-04
8250.00000  8300.00000  1.008720236505e-03
8300.00000  8350.00000  9.956764403434e-04
8350.00000  8400.00000  9.663278989796e-04
8400.00000  8450.00000  9.253848721387e-04
8450.00000  8500.00000  9.489361707640e-04
8500.00000  8550.00000  9.076308162519e-04
8550.00000  8600.00000  9.203122847425e-04
8600.00000  8650.00000  9.300951318638e-04
8650.00000  8700.00000  9.181383187155e-04
8700.00000  8750.00000  8.916883987210e-04
8750.00000  8800.00000  9.061815055673e-04
8800.00000  8850.00000  8.739343428342e-04
8850.00000  8900.00000  8.565426146186e-04
8900.00000  8950.00000  8.471220951685e-04
8950.00000  9000.00000  8.206721751739e-04
9000.00000  9050.00000  8.768329642035e-04
9050.00000  9100.00000  8.105270003815e-04
9100.00000  9150.00000  8.253824348990e-04
9150.00000  9200.00000  8.315420053087e-04
9200.00000  9250.00000  8.058167406564e-04
9250.00000  9300.00000  7.750188886079e-04
9300.00000  9350.00000  7.645113861443e-04
9350.00000  9400.00000  8.203098475027e-04
9400.00000  9450.00000  7.851640634004e-04
9450.00000  9500.00000  7.771928546349e-04
9500.00000  9550.00000  7.699463012117e-04
9550.00000  9600.00000  7.434963812172e-04
9600.00000  9650.00000  7.380614661498e-04
9650.00000  9700.00000  7.279162913573e-04
9700.00000  9750.00000  7.235683593034e-04
9750.00000  9800.00000  6.800890387644e-04
9800.00000  9850.00000  6.931328349261e-04
9850.00000  9900.00000  7.065389587590e-04
9900.00000  9950.00000  7.050896480744e-04
9950.00000  10000.00000  6.880602475299e-04
