300.00000  350.00000  1.542661556833e-05
350.00000  400.00000  3.491286681253e-05
400.00000  450.00000  1.948625124420e-05
450.00000  500.00000  2.922937686630e-05
500.00000  550.00000  2.119129822807e-04
550.00000  600.00000  3.734864821806e-05
600.00000  650.00000  6.170646227331e-05
650.00000  700.00000  4.222021102911e-05
700.00000  750.00000  5.115140951603e-05
750.00000  800.00000  3.328901254218e-05
800.00000  850.00000  1.331560501687e-04
850.00000  900.00000  5.845875373261e-05
900.00000  950.00000  4.952755524568e-05
950.00000  1000.00000  5.358719092156e-05
1000.00000  1050.00000  4.709177384016e-05
1050.00000  1100.00000  5.845875373261e-05
1100.00000  1150.00000  4.790370097533e-05
1150.00000  1200.00000  5.115140951603e-05
1200.00000  1250.00000  5.602297232708e-05
1250.00000  1300.00000  1.428991757908e-04
1300.00000  1350.00000  5.277526378638e-05
1350.00000  1400.00000  5.033948238086e-05
1400.00000  1450.00000  5.115140951603e-05
1450.00000  1500.00000  6.495417081401e-05
1500.00000  1550.00000  5.115140951603e-05
1550.00000  1600.00000  5.764682659743e-05
1600.00000  1650.00000  6.008260800296e-05
1650.00000  1700.00000  7.388536930094e-05
1700.00000  1750.00000  1.347799044391e-04
1750.00000  1800.00000  5.683489946226e-05
1800.00000  1850.00000  6.901380648989e-05
1850.00000  1900.00000  4.952755524568e-05
1900.00000  1950.00000  5.033948238086e-05
1950.00000  2000.00000  5.115140951603e-05
2000.00000  2050.00000  6.170646227331e-05
2050.00000  2100.00000  6.738995221954e-05
2100.00000  2150.00000  6.008260800296e-05
2150.00000  2200.00000  6.576609794919e-05
2200.00000  2250.00000  6.576609794919e-05
2250.00000  2300.00000  6.170646227331e-05
2300.00000  2350.00000  1.729404797923e-04
2350.00000  2400.00000  6.414224367884e-05
2400.00000  2450.00000  7.550922357129e-05
2450.00000  2500.00000  6.089453513813e-05
2500.00000  2550.00000  7.550922357129e-05
2550.00000  2600.00000  6.333031654366e-05
2600.00000  2650.00000  6.901380648989e-05
2650.00000  2700.00000  6.008260800296e-05
2700.00000  2750.00000  6.495417081401e-05
2750.00000  2800.00000  6.333031654366e-05
2800.00000  2850.00000  7.388536930094e-05
2850.00000  2900.00000  6.657802508436e-05
2900.00000  2950.00000  6.414224367884e-05
2950.00000  3000.00000  9.012391200444e-05
3000.00000  3050.00000  7.794500497681e-05
3050.00000  3100.00000  7.550922357129e-05
3100.00000  3150.00000  7.956885924716e-05
3150.00000  3200.00000  8.038078638234e-05
3200.00000  3250.00000  7.063766076024e-05
3250.00000  3300.00000  8.119271351751e-05
3300.00000  3350.00000  8.119271351751e-05
3350.00000  3400.00000  9.337162054514e-05
3400.00000  3450.00000  8.362849492304e-05
3450.00000  3500.00000  9.661932908584e-05
3500.00000  3550.00000  9.743125622102e-05
3550.00000  3600.00000  9.174776627479e-05
3600.00000  3650.00000  1.120459446542e-04
3650.00000  3700.00000  1.534542285481e-04
3700.00000  3750.00000  1.152936531949e-04
3750.00000  3800.00000  1.136697989245e-04
3800.00000  3850.00000  1.234129245466e-04
3850.00000  3900.00000  1.396514672501e-04
3900.00000  3950.00000  1.274725602225e-04
3950.00000  4000.00000  1.550780828184e-04
4000.00000  4050.00000  1.591377184943e-04
4050.00000  4100.00000  1.607615727647e-04
4100.00000  4150.00000  1.485826657370e-04
4150.00000  4200.00000  1.648212084406e-04
4200.00000  4250.00000  1.623854270350e-04
4250.00000  4300.00000  1.696927712516e-04
4300.00000  4350.00000  1.745643340627e-04
4350.00000  4400.00000  1.997340752531e-04
4400.00000  4450.00000  1.859313139551e-04
4450.00000  4500.00000  2.021698566586e-04
4500.00000  4550.00000  2.086652737400e-04
4550.00000  4600.00000  2.192203264973e-04
4600.00000  4650.00000  2.232799621732e-04
4650.00000  4700.00000  2.265276707139e-04
4700.00000  4750.00000  2.452019948229e-04
4750.00000  4800.00000  2.590047561209e-04
4800.00000  4850.00000  2.403304320118e-04
4850.00000  4900.00000  2.598166832560e-04
4900.00000  4950.00000  2.590047561209e-04
4950.00000  5000.00000  2.646882460671e-04
5000.00000  5050.00000  2.663121003374e-04
5050.00000  5100.00000  2.744313716892e-04
5100.00000  5150.00000  2.768671530947e-04
5150.00000  5200.00000  3.101561656369e-04
5200.00000  5250.00000  2.955414772037e-04
5250.00000  5300.00000  2.931056957982e-04
5300.00000  5350.00000  3.109680927721e-04
5350.00000  5400.00000  3.020368942851e-04
5400.00000  5450.00000  2.939176229334e-04
5450.00000  5500.00000  3.223350726645e-04
5500.00000  5550.00000  3.093442385017e-04
5550.00000  5600.00000  3.004130400148e-04
5600.00000  5650.00000  3.020368942851e-04
5650.00000  5700.00000  3.052846028258e-04
5700.00000  5750.00000  3.134038741776e-04
5750.00000  5800.00000  3.231469997997e-04
5800.00000  5850.00000  2.971653314741e-04
5850.00000  5900.00000  3.450690324494e-04
5900.00000  5950.00000  3.101561656369e-04
5950.00000  6000.00000  2.971653314741e-04
6000.00000  6050.00000  3.004130400148e-04
6050.00000  6100.00000  3.288304897459e-04
6100.00000  6150.00000  2.939176229334e-04
6150.00000  6200.00000  3.150277284480e-04
6200.00000  6250.00000  3.280185626108e-04
6250.00000  6300.00000  3.669910650992e-04
6300.00000  6350.00000  3.840415349378e-04
6350.00000  6400.00000  1.334808210228e-03
6400.00000  6450.00000  3.134038741776e-04
6450.00000  6500.00000  3.044726756907e-04
6500.00000  6550.00000  2.931056957982e-04
6550.00000  6600.00000  3.052846028258e-04
6600.00000  6650.00000  2.931056957982e-04
6650.00000  6700.00000  3.182754369887e-04
6700.00000  6750.00000  2.719955902837e-04
6750.00000  6800.00000  3.036607485555e-04
6800.00000  6850.00000  2.671240274726e-04
6850.00000  6900.00000  2.752432988244e-04
6900.00000  6950.00000  2.573809018505e-04
6950.00000  7000.00000  2.793029345002e-04
7000.00000  7050.00000  2.590047561209e-04
7050.00000  7100.00000  3.418213239087e-04
7100.00000  7150.00000  1.493945928722e-04
7150.00000  7200.00000  1.510184471426e-04
7200.00000  7250.00000  1.428991757908e-04
7250.00000  7300.00000  1.437111029260e-04
7300.00000  7350.00000  1.355918315742e-04
7350.00000  7400.00000  1.461468843315e-04
7400.00000  7450.00000  1.388395401149e-04
7450.00000  7500.00000  1.664450627109e-04
7500.00000  7550.00000  1.453349571963e-04
7550.00000  7600.00000  1.347799044391e-04
7600.00000  7650.00000  1.380276129798e-04
7650.00000  7700.00000  1.217890702763e-04
7700.00000  7750.00000  1.217890702763e-04
7750.00000  7800.00000  1.453349571963e-04
7800.00000  7850.00000  1.526423014129e-04
7850.00000  7900.00000  1.372156858446e-04
7900.00000  7950.00000  1.510184471426e-04
7950.00000  8000.00000  1.193532888707e-04
8000.00000  8050.00000  1.226009974114e-04
8050.00000  8100.00000  1.461468843315e-04
8100.00000  8150.00000  1.274725602225e-04
8150.00000  8200.00000  1.355918315742e-04
8200.00000  8250.00000  1.323441230335e-04
8250.00000  8300.00000  1.266606330873e-04
8300.00000  8350.00000  1.217890702763e-04
8350.00000  8400.00000  1.266606330873e-04
8400.00000  8450.00000  1.209771431411e-04
8450.00000  8500.00000  1.355918315742e-04
8500.00000  8550.00000  1.315321958984e-04
8550.00000  8600.00000  1.242248516818e-04
8600.00000  8650.00000  1.217890702763e-04
8650.00000  8700.00000  1.152936531949e-04
8700.00000  8750.00000  1.193532888707e-04
8750.00000  8800.00000  1.347799044391e-04
8800.00000  8850.00000  1.128578717893e-04
8850.00000  8900.00000  1.217890702763e-04
8900.00000  8950.00000  1.112340175190e-04
8950.00000  9000.00000  1.355918315742e-04
9000.00000  9050.00000  1.226009974114e-04
9050.00000  9100.00000  1.226009974114e-04
9100.00000  9150.00000  1.136697989245e-04
9150.00000  9200.00000  9.661932908584e-05
9200.00000  9250.00000  1.128578717893e-04
9250.00000  9300.00000  1.120459446542e-04
9300.00000  9350.00000  9.824318335619e-05
9350.00000  9400.00000  1.014908918969e-04
9400.00000  9450.00000  1.152936531949e-04
9450.00000  9500.00000  1.201652160059e-04
9500.00000  9550.00000  9.580740195067e-05
9550.00000  9600.00000  9.661932908584e-05
9600.00000  9650.00000  1.120459446542e-04
9650.00000  9700.00000  1.047386004376e-04
9700.00000  9750.00000  9.580740195067e-05
9750.00000  9800.00000  1.063624547079e-04
9800.00000  9850.00000  1.047386004376e-04
9850.00000  9900.00000  9.743125622102e-05
9900.00000  9950.00000  7.550922357129e-05
9950.00000  10000.00000  1.039266733024e-04
