300.00000  350.00000  3.856519814956e-07
350.00000  400.00000  4.434997787199e-06
400.00000  450.00000  4.049345805703e-06
450.00000  500.00000  3.702259022357e-05
500.00000  550.00000  1.380634093754e-04
550.00000  600.00000  6.189714303004e-05
600.00000  650.00000  1.814492572937e-04
650.00000  700.00000  3.796743757824e-04
700.00000  750.00000  5.630518929835e-04
750.00000  800.00000  8.403356676788e-04
800.00000  850.00000  1.208054832035e-03
850.00000  900.00000  1.262431761426e-03
900.00000  950.00000  1.421513203793e-03
950.00000  1000.00000  1.682599595265e-03
1000.00000  1050.00000  1.858264072836e-03
1050.00000  1100.00000  2.000569654008e-03
1100.00000  1150.00000  2.091005043669e-03
1150.00000  1200.00000  2.184911301163e-03
1200.00000  1250.00000  2.195131078673e-03
1250.00000  1300.00000  2.094283085512e-03
1300.00000  1350.00000  1.953327286275e-03
1350.00000  1400.00000  1.965475323692e-03
1400.00000  1450.00000  1.947349680562e-03
1450.00000  1500.00000  1.836281909891e-03
1500.00000  1550.00000  1.802344535519e-03
1550.00000  1600.00000  1.697640022543e-03
1600.00000  1650.00000  1.599491593253e-03
1650.00000  1700.00000  1.548392705705e-03
1700.00000  1750.00000  1.480903608943e-03
1750.00000  1800.00000  1.336669767864e-03
1800.00000  1850.00000  1.177588325497e-03
1850.00000  1900.00000  1.142879647162e-03
1900.00000  1950.00000  1.121090310208e-03
1950.00000  2000.00000  1.078668592243e-03
2000.00000  2050.00000  1.000766891981e-03
2050.00000  2100.00000  9.695290814798e-04
2100.00000  2150.00000  9.072462864683e-04
2150.00000  2200.00000  8.673313063835e-04
2200.00000  2250.00000  8.158467668538e-04
2250.00000  2300.00000  7.876941722047e-04
2300.00000  2350.00000  7.821022184730e-04
2350.00000  2400.00000  6.775905314877e-04
2400.00000  2450.00000  6.477025029218e-04
2450.00000  2500.00000  6.089444787815e-04
2500.00000  2550.00000  5.788636242248e-04
2550.00000  2600.00000  5.314284305009e-04
2600.00000  2650.00000  5.196660450653e-04
2650.00000  2700.00000  4.974910561293e-04
2700.00000  2750.00000  4.704954174246e-04
2750.00000  2800.00000  4.427284747569e-04
2800.00000  2850.00000  4.024278426906e-04
2850.00000  2900.00000  4.028134946721e-04
2900.00000  2950.00000  3.725398141247e-04
2950.00000  3000.00000  3.781317678564e-04
3000.00000  3050.00000  3.642482965225e-04
3050.00000  3100.00000  3.247189684193e-04
3100.00000  3150.00000  3.216337525673e-04
3150.00000  3200.00000  3.062076733075e-04
3200.00000  3250.00000  2.838398583807e-04
3250.00000  3300.00000  2.680281271394e-04
3300.00000  3350.00000  2.576155236390e-04
3350.00000  3400.00000  2.568442196760e-04
3400.00000  3450.00000  2.348620567308e-04
3450.00000  3500.00000  2.365974906475e-04
3500.00000  3550.00000  2.227140193137e-04
3550.00000  3600.00000  2.128798937855e-04
3600.00000  3650.00000  2.005390303777e-04
3650.00000  3700.00000  2.230996712952e-04
3700.00000  3750.00000  1.901264268773e-04
3750.00000  3800.00000  1.872340370161e-04
3800.00000  3850.00000  1.756644775712e-04
3850.00000  3900.00000  1.754716515805e-04
3900.00000  3950.00000  1.675657859598e-04
3950.00000  4000.00000  1.735433916730e-04
4000.00000  4050.00000  1.581173124132e-04
4050.00000  4100.00000  1.505970987740e-04
4100.00000  4150.00000  1.467405789591e-04
4150.00000  4200.00000  1.357494974864e-04
4200.00000  4250.00000  1.419199291904e-04
4250.00000  4300.00000  1.415342772089e-04
4300.00000  4350.00000  1.336284115882e-04
4350.00000  4400.00000  1.315073256900e-04
4400.00000  4450.00000  1.236014600693e-04
4450.00000  4500.00000  1.199377662451e-04
4500.00000  4550.00000  1.266866759213e-04
4550.00000  4600.00000  1.210947221896e-04
4600.00000  4650.00000  1.149242904857e-04
4650.00000  4700.00000  1.209018961989e-04
4700.00000  4750.00000  1.091395107632e-04
4750.00000  4800.00000  1.108749446800e-04
4800.00000  4850.00000  1.112605966615e-04
4850.00000  4900.00000  1.056686429298e-04
4900.00000  4950.00000  1.056686429298e-04
4950.00000  5000.00000  1.066327728835e-04
5000.00000  5050.00000  9.969103721660e-05
5050.00000  5100.00000  1.077897288280e-04
5100.00000  5150.00000  9.139951961445e-05
5150.00000  5200.00000  9.872690726286e-05
5200.00000  5250.00000  9.043538966071e-05
5250.00000  5300.00000  9.583451740164e-05
5300.00000  5350.00000  9.756995131837e-05
5350.00000  5400.00000  9.699147334613e-05
5400.00000  5450.00000  1.101036407170e-04
5450.00000  5500.00000  9.139951961445e-05
5500.00000  5550.00000  9.197799758669e-05
5550.00000  5600.00000  8.715734781799e-05
5600.00000  5650.00000  9.024256366996e-05
5650.00000  5700.00000  8.754299979949e-05
5700.00000  5750.00000  8.426495795678e-05
5750.00000  5800.00000  8.812147777173e-05
5800.00000  5850.00000  9.255647555893e-05
5850.00000  5900.00000  9.911255924436e-05
5900.00000  5950.00000  9.564169141090e-05
5950.00000  6000.00000  9.178517159594e-05
6000.00000  6050.00000  9.525603942940e-05
6050.00000  6100.00000  9.352060551267e-05
6100.00000  6150.00000  1.027762530686e-04
6150.00000  6200.00000  1.068255988743e-04
6200.00000  6250.00000  1.355566714957e-04
6250.00000  6300.00000  2.038170722204e-04
6300.00000  6350.00000  1.748931736082e-04
6350.00000  6400.00000  1.311216737085e-03
6400.00000  6450.00000  8.233669804930e-05
6450.00000  6500.00000  7.809452625285e-05
6500.00000  6550.00000  7.925148219734e-05
6550.00000  6600.00000  8.638604385500e-05
6600.00000  6650.00000  8.831430376248e-05
6650.00000  6700.00000  8.445778394753e-05
6700.00000  6750.00000  7.828735224360e-05
6750.00000  6800.00000  8.677169583650e-05
6800.00000  6850.00000  8.272235003080e-05
6850.00000  6900.00000  9.178517159594e-05
6900.00000  6950.00000  9.082104164220e-05
6950.00000  7000.00000  7.732322228986e-05
7000.00000  7050.00000  8.040843814182e-05
7050.00000  7100.00000  2.121085898226e-04
7100.00000  7150.00000  4.917062764068e-05
7150.00000  7200.00000  5.437692939087e-05
7200.00000  7250.00000  4.994193160367e-05
7250.00000  7300.00000  5.167736552040e-05
7300.00000  7350.00000  4.724236773321e-05
7350.00000  7400.00000  5.476258137237e-05
7400.00000  7450.00000  5.302714745564e-05
7450.00000  7500.00000  1.039332090131e-04
7500.00000  7550.00000  4.743519372395e-05
7550.00000  7600.00000  5.553388533536e-05
7600.00000  7650.00000  5.707649326134e-05
7650.00000  7700.00000  4.492845584423e-05
7700.00000  7750.00000  6.170431703929e-05
7750.00000  7800.00000  5.013475759442e-05
7800.00000  7850.00000  4.396432589049e-05
7850.00000  7900.00000  5.013475759442e-05
7900.00000  7950.00000  5.109888754816e-05
7950.00000  8000.00000  5.148453952966e-05
8000.00000  8050.00000  5.090606155741e-05
8050.00000  8100.00000  5.553388533536e-05
8100.00000  8150.00000  5.283432146489e-05
8150.00000  8200.00000  4.782084570545e-05
8200.00000  8250.00000  5.225584349265e-05
8250.00000  8300.00000  5.572671132611e-05
8300.00000  8350.00000  5.302714745564e-05
8350.00000  8400.00000  5.109888754816e-05
8400.00000  8450.00000  5.399127740938e-05
8450.00000  8500.00000  4.762801971470e-05
8500.00000  8550.00000  4.974910561293e-05
8550.00000  8600.00000  4.492845584423e-05
8600.00000  8650.00000  5.090606155741e-05
8650.00000  8700.00000  4.512128183498e-05
8700.00000  8750.00000  4.859214966844e-05
8750.00000  8800.00000  4.859214966844e-05
8800.00000  8850.00000  5.225584349265e-05
8850.00000  8900.00000  4.936345363143e-05
8900.00000  8950.00000  4.145758801077e-05
8950.00000  9000.00000  4.878497565919e-05
9000.00000  9050.00000  5.456975538162e-05
9050.00000  9100.00000  4.782084570545e-05
9100.00000  9150.00000  4.994193160367e-05
9150.00000  9200.00000  4.878497565919e-05
9200.00000  9250.00000  4.955627962218e-05
9250.00000  9300.00000  5.418410340013e-05
9300.00000  9350.00000  5.071323556667e-05
9350.00000  9400.00000  5.264149547414e-05
9400.00000  9450.00000  4.492845584423e-05
9450.00000  9500.00000  5.264149547414e-05
9500.00000  9550.00000  4.782084570545e-05
9550.00000  9600.00000  5.187019151115e-05
9600.00000  9650.00000  5.379845141863e-05
9650.00000  9700.00000  5.109888754816e-05
9700.00000  9750.00000  5.321997344639e-05
9750.00000  9800.00000  5.283432146489e-05
9800.00000  9850.00000  5.495540736312e-05
9850.00000  9900.00000  5.321997344639e-05
9900.00000  9950.00000  5.283432146489e-05
9950.00000  10000.00000  5.341279943713e-05
