10001.00000  11001.00000  7.403199061754e-05
11001.00000  12001.00000  6.282568196447e-05
12001.00000  13001.00000  5.385058454097e-05
13001.00000  14001.00000  4.692578932844e-05
14001.00000  15001.00000  4.034271115108e-05
15001.00000  16001.00000  3.396064299439e-05
16001.00000  17001.00000  3.174953276688e-05
17001.00000  18001.00000  2.792029187287e-05
18001.00000  19001.00000  2.538756561226e-05
19001.00000  20001.00000  2.264377882994e-05
20001.00000  21001.00000  2.138746620067e-05
21001.00000  22001.00000  1.826176037905e-05
22001.00000  23001.00000  1.662352871048e-05
23001.00000  24001.00000  1.500539804398e-05
24001.00000  25001.00000  1.356817639610e-05
25001.00000  26001.00000  1.202039923684e-05
26001.00000  27001.00000  1.125656115825e-05
27001.00000  28001.00000  1.088469261998e-05
28001.00000  29001.00000  9.779137506227e-06
29001.00000  30001.00000  9.346965961759e-06
30001.00000  31001.00000  7.859491808705e-06
31001.00000  32001.00000  7.517774773544e-06
32001.00000  33001.00000  7.176057738383e-06
33001.00000  34001.00000  6.311714649446e-06
34001.00000  35001.00000  6.351916653582e-06
35001.00000  36001.00000  5.658432082226e-06
36001.00000  37001.00000  5.849391601875e-06
37001.00000  38001.00000  4.974998011904e-06
38001.00000  39001.00000  4.532775966401e-06
39001.00000  40001.00000  4.643331477777e-06
40001.00000  41001.00000  4.090553920899e-06
41001.00000  42001.00000  3.497574359884e-06
42001.00000  43001.00000  3.306614840235e-06
43001.00000  44001.00000  3.346816844372e-06
44001.00000  45001.00000  3.226210831962e-06
45001.00000  46001.00000  2.944796803006e-06
46001.00000  47001.00000  2.673433275084e-06
47001.00000  48001.00000  2.542776761640e-06
48001.00000  49001.00000  2.623180769913e-06
49001.00000  50001.00000  2.170908223376e-06
50001.00000  51001.00000  2.301564736820e-06
51001.00000  52001.00000  2.321665738888e-06
52001.00000  53001.00000  2.020150707864e-06
53001.00000  54001.00000  2.030201208898e-06
54001.00000  55001.00000  1.909595196488e-06
55001.00000  56001.00000  1.587979163396e-06
56001.00000  57001.00000  1.598029664430e-06
57001.00000  58001.00000  1.567878161327e-06
58001.00000  59001.00000  1.477423652020e-06
59001.00000  60001.00000  1.376918641678e-06
60001.00000  61001.00000  1.587979163396e-06
61001.00000  62001.00000  1.175908620995e-06
62001.00000  63001.00000  1.165858119961e-06
63001.00000  64001.00000  9.648480992783e-07
64001.00000  65001.00000  9.447470972100e-07
65001.00000  66001.00000  1.185959122030e-06
66001.00000  67001.00000  8.944945920393e-07
67001.00000  68001.00000  9.748986003125e-07
68001.00000  69001.00000  9.648480992783e-07
69001.00000  70001.00000  8.743935899710e-07
70001.00000  71001.00000  9.145955941076e-07
71001.00000  72001.00000  8.140905837661e-07
72001.00000  73001.00000  6.834340703222e-07
73001.00000  74001.00000  7.537875775612e-07
74001.00000  75001.00000  5.427270558441e-07
75001.00000  76001.00000  6.532825672197e-07
76001.00000  77001.00000  5.527775568782e-07
77001.00000  78001.00000  4.422220455026e-07
78001.00000  79001.00000  5.125755527416e-07
79001.00000  80001.00000  4.723735486050e-07
80001.00000  81001.00000  3.919695403318e-07
81001.00000  82001.00000  4.522725465367e-07
82001.00000  83001.00000  4.221210434343e-07
83001.00000  84001.00000  3.919695403318e-07
84001.00000  85001.00000  4.522725465367e-07
85001.00000  86001.00000  4.924745506733e-07
86001.00000  87001.00000  3.216160330928e-07
87001.00000  88001.00000  3.216160330928e-07
88001.00000  89001.00000  3.316665341269e-07
89001.00000  90001.00000  3.115655320586e-07
90001.00000  91001.00000  3.115655320586e-07
91001.00000  92001.00000  3.316665341269e-07
92001.00000  93001.00000  3.316665341269e-07
93001.00000  94001.00000  2.914645299903e-07
94001.00000  95001.00000  2.211110227513e-07
95001.00000  96001.00000  3.015150310245e-07
96001.00000  97001.00000  1.507575155122e-07
97001.00000  98001.00000  2.110605217171e-07
98001.00000  99001.00000  2.713635279220e-07
99001.00000  100001.00000  2.914645299903e-07
100001.00000  101001.00000  1.507575155122e-07
101001.00000  102001.00000  1.507575155122e-07
102001.00000  103001.00000  1.507575155122e-07
103001.00000  104001.00000  1.708585175805e-07
104001.00000  105001.00000  1.809090186147e-07
105001.00000  106001.00000  1.708585175805e-07
106001.00000  107001.00000  2.412120248196e-07
107001.00000  108001.00000  1.105555113756e-07
108001.00000  109001.00000  1.407070144781e-07
109001.00000  110001.00000  1.507575155122e-07
110001.00000  111001.00000  1.306565134439e-07
111001.00000  112001.00000  2.010100206830e-07
112001.00000  113001.00000  1.507575155122e-07
113001.00000  114001.00000  1.608080165464e-07
114001.00000  115001.00000  8.040400827319e-08
115001.00000  116001.00000  8.040400827319e-08
116001.00000  117001.00000  7.035350723904e-08
117001.00000  118001.00000  1.306565134439e-07
118001.00000  119001.00000  1.407070144781e-07
119001.00000  120001.00000  1.005050103415e-07
120001.00000  121001.00000  9.045450930734e-08
121001.00000  122001.00000  1.005050103415e-07
122001.00000  123001.00000  1.005050103415e-07
123001.00000  124001.00000  9.045450930734e-08
124001.00000  125001.00000  9.045450930734e-08
125001.00000  126001.00000  9.045450930734e-08
126001.00000  127001.00000  1.005050103415e-07
127001.00000  128001.00000  8.040400827319e-08
128001.00000  129001.00000  5.025250517075e-08
129001.00000  130001.00000  8.040400827319e-08
130001.00000  131001.00000  7.035350723904e-08
131001.00000  132001.00000  8.040400827319e-08
132001.00000  133001.00000  3.015150310245e-08
133001.00000  134001.00000  4.020200413660e-08
134001.00000  135001.00000  6.030300620490e-08
135001.00000  136001.00000  5.025250517075e-08
136001.00000  137001.00000  4.020200413660e-08
137001.00000  138001.00000  6.030300620490e-08
138001.00000  139001.00000  5.025250517075e-08
139001.00000  140001.00000  3.015150310245e-08
140001.00000  141001.00000  1.005050103415e-07
141001.00000  142001.00000  7.035350723904e-08
142001.00000  143001.00000  5.025250517075e-08
143001.00000  144001.00000  4.020200413660e-08
144001.00000  145001.00000  2.010100206830e-08
145001.00000  146001.00000  0.000000000000e+00
146001.00000  147001.00000  1.005050103415e-08
147001.00000  148001.00000  3.015150310245e-08
148001.00000  149001.00000  3.015150310245e-08
149001.00000  150001.00000  2.010100206830e-08
150001.00000  151001.00000  3.015150310245e-08
151001.00000  152001.00000  3.015150310245e-08
152001.00000  153001.00000  0.000000000000e+00
153001.00000  154001.00000  2.010100206830e-08
154001.00000  155001.00000  0.000000000000e+00
155001.00000  156001.00000  9.045450930734e-08
156001.00000  157001.00000  4.020200413660e-08
157001.00000  158001.00000  4.020200413660e-08
158001.00000  159001.00000  4.020200413660e-08
159001.00000  160001.00000  2.010100206830e-08
160001.00000  161001.00000  4.020200413660e-08
161001.00000  162001.00000  2.010100206830e-08
162001.00000  163001.00000  0.000000000000e+00
163001.00000  164001.00000  1.005050103415e-08
164001.00000  165001.00000  0.000000000000e+00
165001.00000  166001.00000  3.015150310245e-08
166001.00000  167001.00000  1.005050103415e-08
167001.00000  168001.00000  0.000000000000e+00
168001.00000  169001.00000  0.000000000000e+00
169001.00000  170001.00000  3.015150310245e-08
170001.00000  171001.00000  1.005050103415e-08
171001.00000  172001.00000  1.005050103415e-08
172001.00000  173001.00000  2.010100206830e-08
173001.00000  174001.00000  1.005050103415e-08
174001.00000  175001.00000  0.000000000000e+00
175001.00000  176001.00000  5.025250517075e-08
176001.00000  177001.00000  1.005050103415e-08
177001.00000  178001.00000  0.000000000000e+00
178001.00000  179001.00000  0.000000000000e+00
179001.00000  180001.00000  1.005050103415e-08
180001.00000  181001.00000  0.000000000000e+00
181001.00000  182001.00000  1.005050103415e-08
182001.00000  183001.00000  2.010100206830e-08
183001.00000  184001.00000  0.000000000000e+00
184001.00000  185001.00000  0.000000000000e+00
185001.00000  186001.00000  5.025250517075e-08
186001.00000  187001.00000  1.005050103415e-08
187001.00000  188001.00000  0.000000000000e+00
188001.00000  189001.00000  0.000000000000e+00
189001.00000  190001.00000  2.010100206830e-08
190001.00000  191001.00000  0.000000000000e+00
191001.00000  192001.00000  2.010100206830e-08
192001.00000  193001.00000  0.000000000000e+00
193001.00000  194001.00000  1.005050103415e-08
194001.00000  195001.00000  0.000000000000e+00
195001.00000  196001.00000  0.000000000000e+00
196001.00000  197001.00000  2.010100206830e-08
197001.00000  198001.00000  1.005050103415e-08
198001.00000  199001.00000  2.010100206830e-08
