10001.00000  11001.00000  4.949634879618e-05
11001.00000  12001.00000  4.230167404727e-05
12001.00000  13001.00000  3.360026113104e-05
13001.00000  14001.00000  2.859035672473e-05
14001.00000  15001.00000  2.403247376862e-05
15001.00000  16001.00000  1.898490090812e-05
16001.00000  17001.00000  1.589608766514e-05
17001.00000  18001.00000  1.525572394403e-05
18001.00000  19001.00000  1.250592678868e-05
19001.00000  20001.00000  1.066017253373e-05
20001.00000  21001.00000  9.718461179159e-06
21001.00000  22001.00000  8.211723011847e-06
22001.00000  23001.00000  7.458353928191e-06
23001.00000  24001.00000  6.742653298719e-06
24001.00000  25001.00000  5.913947306697e-06
25001.00000  26001.00000  5.235915131407e-06
26001.00000  27001.00000  4.444877593569e-06
27001.00000  28001.00000  4.030524597558e-06
28001.00000  29001.00000  3.729176964096e-06
29001.00000  30001.00000  2.900470972074e-06
30001.00000  31001.00000  2.900470972074e-06
31001.00000  32001.00000  3.766845418279e-06
32001.00000  33001.00000  3.051144788806e-06
33001.00000  34001.00000  2.862802517892e-06
34001.00000  35001.00000  2.448449521881e-06
35001.00000  36001.00000  2.260107250967e-06
36001.00000  37001.00000  1.996428071688e-06
37001.00000  38001.00000  2.034096525870e-06
38001.00000  39001.00000  1.996428071688e-06
39001.00000  40001.00000  1.393732804763e-06
40001.00000  41001.00000  1.431401258946e-06
41001.00000  42001.00000  1.770417346591e-06
42001.00000  43001.00000  1.431401258946e-06
43001.00000  44001.00000  1.017048262935e-06
44001.00000  45001.00000  1.054716717118e-06
45001.00000  46001.00000  7.910375378385e-07
46001.00000  47001.00000  8.663744462041e-07
47001.00000  48001.00000  1.017048262935e-06
48001.00000  49001.00000  8.287059920213e-07
49001.00000  50001.00000  5.650268127418e-07
50001.00000  51001.00000  8.287059920213e-07
51001.00000  52001.00000  4.520214501934e-07
52001.00000  53001.00000  8.663744462041e-07
53001.00000  54001.00000  6.026952669246e-07
54001.00000  55001.00000  6.026952669246e-07
55001.00000  56001.00000  6.026952669246e-07
56001.00000  57001.00000  5.650268127418e-07
57001.00000  58001.00000  4.896899043762e-07
58001.00000  59001.00000  6.026952669246e-07
59001.00000  60001.00000  4.520214501934e-07
60001.00000  61001.00000  4.143529960106e-07
61001.00000  62001.00000  6.026952669246e-07
62001.00000  63001.00000  3.766845418279e-07
63001.00000  64001.00000  3.766845418279e-07
64001.00000  65001.00000  4.896899043762e-07
65001.00000  66001.00000  2.636791792795e-07
66001.00000  67001.00000  3.013476334623e-07
67001.00000  68001.00000  2.260107250967e-07
68001.00000  69001.00000  3.766845418279e-07
69001.00000  70001.00000  3.013476334623e-07
70001.00000  71001.00000  1.506738167311e-07
71001.00000  72001.00000  5.650268127418e-07
72001.00000  73001.00000  1.883422709139e-07
73001.00000  74001.00000  1.130053625484e-07
74001.00000  75001.00000  3.013476334623e-07
75001.00000  76001.00000  2.260107250967e-07
76001.00000  77001.00000  1.506738167311e-07
77001.00000  78001.00000  2.636791792795e-07
78001.00000  79001.00000  1.506738167311e-07
79001.00000  80001.00000  1.883422709139e-07
80001.00000  81001.00000  7.533690836557e-08
81001.00000  82001.00000  7.533690836557e-08
82001.00000  83001.00000  1.883422709139e-07
83001.00000  84001.00000  1.883422709139e-07
84001.00000  85001.00000  7.533690836557e-08
85001.00000  86001.00000  1.506738167311e-07
86001.00000  87001.00000  0.000000000000e+00
87001.00000  88001.00000  7.533690836557e-08
88001.00000  89001.00000  7.533690836557e-08
89001.00000  90001.00000  1.130053625484e-07
90001.00000  91001.00000  3.766845418279e-08
91001.00000  92001.00000  3.766845418279e-08
92001.00000  93001.00000  0.000000000000e+00
93001.00000  94001.00000  2.636791792795e-07
94001.00000  95001.00000  0.000000000000e+00
95001.00000  96001.00000  3.766845418279e-08
96001.00000  97001.00000  7.533690836557e-08
97001.00000  98001.00000  7.533690836557e-08
98001.00000  99001.00000  3.766845418279e-08
99001.00000  100001.00000  1.506738167311e-07
100001.00000  101001.00000  1.130053625484e-07
101001.00000  102001.00000  0.000000000000e+00
102001.00000  103001.00000  1.130053625484e-07
103001.00000  104001.00000  0.000000000000e+00
104001.00000  105001.00000  3.766845418279e-08
105001.00000  106001.00000  3.766845418279e-08
106001.00000  107001.00000  1.506738167311e-07
107001.00000  108001.00000  3.766845418279e-08
108001.00000  109001.00000  3.766845418279e-08
109001.00000  110001.00000  0.000000000000e+00
110001.00000  111001.00000  3.766845418279e-08
111001.00000  112001.00000  7.533690836557e-08
112001.00000  113001.00000  3.766845418279e-08
113001.00000  114001.00000  3.766845418279e-08
114001.00000  115001.00000  3.766845418279e-08
115001.00000  116001.00000  7.533690836557e-08
116001.00000  117001.00000  0.000000000000e+00
117001.00000  118001.00000  3.766845418279e-08
118001.00000  119001.00000  0.000000000000e+00
119001.00000  120001.00000  7.533690836557e-08
120001.00000  121001.00000  3.766845418279e-08
121001.00000  122001.00000  7.533690836557e-08
122001.00000  123001.00000  0.000000000000e+00
123001.00000  124001.00000  3.766845418279e-08
124001.00000  125001.00000  3.766845418279e-08
125001.00000  126001.00000  0.000000000000e+00
126001.00000  127001.00000  0.000000000000e+00
127001.00000  128001.00000  3.766845418279e-08
128001.00000  129001.00000  3.766845418279e-08
129001.00000  130001.00000  0.000000000000e+00
130001.00000  131001.00000  0.000000000000e+00
131001.00000  132001.00000  0.000000000000e+00
132001.00000  133001.00000  0.000000000000e+00
133001.00000  134001.00000  0.000000000000e+00
134001.00000  135001.00000  0.000000000000e+00
135001.00000  136001.00000  0.000000000000e+00
136001.00000  137001.00000  0.000000000000e+00
137001.00000  138001.00000  3.766845418279e-08
138001.00000  139001.00000  0.000000000000e+00
139001.00000  140001.00000  0.000000000000e+00
140001.00000  141001.00000  7.533690836557e-08
141001.00000  142001.00000  0.000000000000e+00
142001.00000  143001.00000  3.766845418279e-08
143001.00000  144001.00000  0.000000000000e+00
144001.00000  145001.00000  0.000000000000e+00
145001.00000  146001.00000  3.766845418279e-08
146001.00000  147001.00000  0.000000000000e+00
147001.00000  148001.00000  0.000000000000e+00
148001.00000  149001.00000  0.000000000000e+00
149001.00000  150001.00000  0.000000000000e+00
150001.00000  151001.00000  0.000000000000e+00
151001.00000  152001.00000  0.000000000000e+00
152001.00000  153001.00000  0.000000000000e+00
153001.00000  154001.00000  3.766845418279e-08
154001.00000  155001.00000  3.766845418279e-08
155001.00000  156001.00000  0.000000000000e+00
156001.00000  157001.00000  3.766845418279e-08
157001.00000  158001.00000  0.000000000000e+00
158001.00000  159001.00000  3.766845418279e-08
159001.00000  160001.00000  0.000000000000e+00
160001.00000  161001.00000  0.000000000000e+00
161001.00000  162001.00000  0.000000000000e+00
162001.00000  163001.00000  0.000000000000e+00
163001.00000  164001.00000  0.000000000000e+00
164001.00000  165001.00000  0.000000000000e+00
165001.00000  166001.00000  0.000000000000e+00
166001.00000  167001.00000  0.000000000000e+00
167001.00000  168001.00000  0.000000000000e+00
168001.00000  169001.00000  0.000000000000e+00
169001.00000  170001.00000  3.766845418279e-08
170001.00000  171001.00000  3.766845418279e-08
171001.00000  172001.00000  0.000000000000e+00
172001.00000  173001.00000  0.000000000000e+00
173001.00000  174001.00000  0.000000000000e+00
174001.00000  175001.00000  0.000000000000e+00
175001.00000  176001.00000  0.000000000000e+00
176001.00000  177001.00000  0.000000000000e+00
177001.00000  178001.00000  0.000000000000e+00
178001.00000  179001.00000  0.000000000000e+00
179001.00000  180001.00000  0.000000000000e+00
180001.00000  181001.00000  0.000000000000e+00
181001.00000  182001.00000  0.000000000000e+00
182001.00000  183001.00000  0.000000000000e+00
183001.00000  184001.00000  0.000000000000e+00
184001.00000  185001.00000  0.000000000000e+00
185001.00000  186001.00000  3.766845418279e-08
186001.00000  187001.00000  0.000000000000e+00
187001.00000  188001.00000  0.000000000000e+00
188001.00000  189001.00000  0.000000000000e+00
189001.00000  190001.00000  0.000000000000e+00
190001.00000  191001.00000  0.000000000000e+00
191001.00000  192001.00000  0.000000000000e+00
192001.00000  193001.00000  0.000000000000e+00
193001.00000  194001.00000  0.000000000000e+00
194001.00000  195001.00000  0.000000000000e+00
195001.00000  196001.00000  0.000000000000e+00
196001.00000  197001.00000  0.000000000000e+00
197001.00000  198001.00000  0.000000000000e+00
198001.00000  199001.00000  0.000000000000e+00
