300.00000  350.00000  1.302723495930e+00
350.00000  400.00000  9.219639455007e-01
400.00000  450.00000  6.816527241564e-01
450.00000  500.00000  5.207562360236e-01
500.00000  550.00000  4.102752052948e-01
550.00000  600.00000  3.287309730240e-01
600.00000  650.00000  2.684237704315e-01
650.00000  700.00000  2.233331897845e-01
700.00000  750.00000  1.878596045358e-01
750.00000  800.00000  1.599819100638e-01
800.00000  850.00000  1.382269958493e-01
850.00000  900.00000  1.197073545075e-01
900.00000  950.00000  1.044741723007e-01
950.00000  1000.00000  9.218570565412e-02
1000.00000  1050.00000  8.195673332578e-02
1050.00000  1100.00000  7.272514037305e-02
1100.00000  1150.00000  6.531291794925e-02
1150.00000  1200.00000  5.899818920818e-02
1200.00000  1250.00000  5.308015399990e-02
1250.00000  1300.00000  4.842145139190e-02
1300.00000  1350.00000  4.392232948401e-02
1350.00000  1400.00000  4.013078237842e-02
1400.00000  1450.00000  3.718079764410e-02
1450.00000  1500.00000  3.398692542472e-02
1500.00000  1550.00000  3.132147608962e-02
1550.00000  1600.00000  2.900605045993e-02
1600.00000  1650.00000  2.707075810168e-02
1650.00000  1700.00000  2.514224039581e-02
1700.00000  1750.00000  2.341997321741e-02
1750.00000  1800.00000  2.193331339340e-02
1800.00000  1850.00000  2.036535774104e-02
1850.00000  1900.00000  1.924452914461e-02
1900.00000  1950.00000  1.796487258724e-02
1950.00000  2000.00000  1.689598299225e-02
2000.00000  2050.00000  1.595957548792e-02
2050.00000  2100.00000  1.481164828204e-02
2100.00000  2150.00000  1.403482147779e-02
2150.00000  2200.00000  1.339424045996e-02
2200.00000  2250.00000  1.264827596092e-02
2250.00000  2300.00000  1.207920516247e-02
2300.00000  2350.00000  1.141754744839e-02
2350.00000  2400.00000  1.099902448021e-02
2400.00000  2450.00000  1.032306472226e-02
2450.00000  2500.00000  9.875184927175e-03
2500.00000  2550.00000  9.358053130165e-03
2550.00000  2600.00000  8.923722639810e-03
2600.00000  2650.00000  8.503694193330e-03
2650.00000  2700.00000  8.160445140293e-03
2700.00000  2750.00000  7.729878345694e-03
2750.00000  2800.00000  7.363294378964e-03
2800.00000  2850.00000  7.165323982147e-03
2850.00000  2900.00000  6.807772885233e-03
2900.00000  2950.00000  6.462265614742e-03
2950.00000  3000.00000  6.290641088223e-03
3000.00000  3050.00000  6.097187126314e-03
3050.00000  3100.00000  5.777272986971e-03
3100.00000  3150.00000  5.601132025544e-03
3150.00000  3200.00000  5.369288366914e-03
3200.00000  3250.00000  5.134433751678e-03
3250.00000  3300.00000  5.059159836538e-03
3300.00000  3350.00000  4.825810699605e-03
3350.00000  3400.00000  4.532995169712e-03
3400.00000  3450.00000  4.546544474437e-03
3450.00000  3500.00000  4.295882337022e-03
3500.00000  3550.00000  4.100922896810e-03
3550.00000  3600.00000  3.949622327379e-03
3600.00000  3650.00000  3.910479891507e-03
3650.00000  3700.00000  3.810365584371e-03
3700.00000  3750.00000  3.667345145605e-03
3750.00000  3800.00000  3.534110315808e-03
3800.00000  3850.00000  3.401628225162e-03
3850.00000  3900.00000  3.292481048210e-03
3900.00000  3950.00000  3.224734524584e-03
3950.00000  4000.00000  2.990632648500e-03
4000.00000  4050.00000  2.969555952261e-03
4050.00000  4100.00000  2.936435429599e-03
4100.00000  4150.00000  2.871699862579e-03
4150.00000  4200.00000  2.695558901152e-03
4200.00000  4250.00000  2.693300683698e-03
4250.00000  4300.00000  2.626306899224e-03
4300.00000  4350.00000  2.642867160554e-03
4350.00000  4400.00000  2.569851462869e-03
4400.00000  4450.00000  2.423067328346e-03
4450.00000  4500.00000  2.307145499031e-03
4500.00000  4550.00000  2.294348933458e-03
4550.00000  4600.00000  2.222838714075e-03
4600.00000  4650.00000  2.137026450816e-03
4650.00000  4700.00000  2.142295624875e-03
4700.00000  4750.00000  2.078312797007e-03
4750.00000  4800.00000  2.017340925744e-03
4800.00000  4850.00000  2.003038881867e-03
4850.00000  4900.00000  1.913462922851e-03
4900.00000  4950.00000  1.845716399225e-03
4950.00000  5000.00000  1.856254747345e-03
5000.00000  5050.00000  1.787002745416e-03
5050.00000  5100.00000  1.750118526998e-03
5100.00000  5150.00000  1.722267178396e-03
5150.00000  5200.00000  1.677855568464e-03
5200.00000  5250.00000  1.628174784471e-03
5250.00000  5300.00000  1.597312479264e-03
5300.00000  5350.00000  1.519027607519e-03
5350.00000  5400.00000  1.515263911762e-03
5400.00000  5450.00000  1.526554999033e-03
5450.00000  5500.00000  1.491176258917e-03
5500.00000  5550.00000  1.449022866439e-03
5550.00000  5600.00000  1.339122950335e-03
5600.00000  5650.00000  1.369985255542e-03
5650.00000  5700.00000  1.312024340885e-03
5700.00000  5750.00000  1.263096296044e-03
5750.00000  5800.00000  1.273634644163e-03
5800.00000  5850.00000  1.266107252649e-03
5850.00000  5900.00000  1.261590817741e-03
5900.00000  5950.00000  1.263849035195e-03
5950.00000  6000.00000  1.209651816295e-03
6000.00000  6050.00000  1.191586076661e-03
6050.00000  6100.00000  1.226212077625e-03
6100.00000  6150.00000  1.120075857278e-03
6150.00000  6200.00000  1.086955334617e-03
6200.00000  6250.00000  1.095235465282e-03
6250.00000  6300.00000  1.089213552071e-03
6300.00000  6350.00000  1.064373160075e-03
6350.00000  6400.00000  1.531824173093e-03
6400.00000  6450.00000  1.008670462872e-03
6450.00000  6500.00000  9.853355491785e-04
6500.00000  6550.00000  1.013939636932e-03
6550.00000  6600.00000  9.228581996125e-04
6600.00000  6650.00000  9.416766783974e-04
6650.00000  6700.00000  9.514622873656e-04
6700.00000  6750.00000  9.160835472500e-04
6750.00000  6800.00000  9.183417647041e-04
6800.00000  6850.00000  8.159692401142e-04
6850.00000  6900.00000  8.746828939231e-04
6900.00000  6950.00000  8.061836311460e-04
6950.00000  7000.00000  8.197329358712e-04
7000.00000  7050.00000  8.099473269030e-04
7050.00000  7100.00000  7.933870655723e-04
7100.00000  7150.00000  7.534918905482e-04
7150.00000  7200.00000  6.917672801337e-04
7200.00000  7250.00000  7.715576301818e-04
7250.00000  7300.00000  7.354261509147e-04
7300.00000  7350.00000  7.294042377035e-04
7350.00000  7400.00000  7.030583674046e-04
7400.00000  7450.00000  6.932727584365e-04
7450.00000  7500.00000  7.444590207315e-04
7500.00000  7550.00000  6.857453669225e-04
7550.00000  7600.00000  6.164933649940e-04
7600.00000  7650.00000  6.345591046275e-04
7650.00000  7700.00000  6.097187126314e-04
7700.00000  7750.00000  6.179988432968e-04
7750.00000  7800.00000  6.609049749264e-04
7800.00000  7850.00000  6.300426697192e-04
7850.00000  7900.00000  5.555214937309e-04
7900.00000  7950.00000  5.871365380895e-04
7950.00000  8000.00000  5.893947555437e-04
8000.00000  8050.00000  5.502523196711e-04
8050.00000  8100.00000  5.472413630655e-04
8100.00000  8150.00000  5.653071026990e-04
8150.00000  8200.00000  5.502523196711e-04
8200.00000  8250.00000  5.675653201532e-04
8250.00000  8300.00000  5.186372753124e-04
8300.00000  8350.00000  5.080989271929e-04
8350.00000  8400.00000  5.246591885236e-04
8400.00000  8450.00000  5.449831456113e-04
8450.00000  8500.00000  5.246591885236e-04
8500.00000  8550.00000  5.261646668264e-04
8550.00000  8600.00000  4.990660573761e-04
8600.00000  8650.00000  4.727201870772e-04
8650.00000  8700.00000  5.028297531331e-04
8700.00000  8750.00000  4.960551007705e-04
8750.00000  8800.00000  4.810003177426e-04
8800.00000  8850.00000  4.155120115711e-04
8850.00000  8900.00000  4.666982738660e-04
8900.00000  8950.00000  4.554071865951e-04
8950.00000  9000.00000  4.380941861130e-04
9000.00000  9050.00000  4.358359686588e-04
9050.00000  9100.00000  4.192757073280e-04
9100.00000  9150.00000  4.079846200571e-04
9150.00000  9200.00000  4.335777512046e-04
9200.00000  9250.00000  3.936825761805e-04
9250.00000  9300.00000  4.140065332683e-04
9300.00000  9350.00000  4.079846200571e-04
9350.00000  9400.00000  4.012099676945e-04
9400.00000  9450.00000  4.102428375113e-04
9450.00000  9500.00000  3.838969672124e-04
9500.00000  9550.00000  4.132537941169e-04
9550.00000  9600.00000  4.012099676945e-04
9600.00000  9650.00000  3.748640973956e-04
9650.00000  9700.00000  3.726058799414e-04
9700.00000  9750.00000  3.635730101247e-04
9750.00000  9800.00000  3.635730101247e-04
9800.00000  9850.00000  3.470127487939e-04
9850.00000  9900.00000  3.432490530370e-04
9900.00000  9950.00000  3.470127487939e-04
9950.00000  10000.00000  3.424963138856e-04
