300.00000  350.00000  1.170640455928e-01
350.00000  400.00000  9.271314395280e-02
400.00000  450.00000  7.594850034164e-02
450.00000  500.00000  6.363104008489e-02
500.00000  550.00000  5.397671532969e-02
550.00000  600.00000  4.674263298092e-02
600.00000  650.00000  4.084446265529e-02
650.00000  700.00000  3.611403274244e-02
700.00000  750.00000  3.218854822986e-02
750.00000  800.00000  2.898266830035e-02
800.00000  850.00000  2.615676739404e-02
850.00000  900.00000  2.376934837884e-02
900.00000  950.00000  2.172367879000e-02
950.00000  1000.00000  1.993634859803e-02
1000.00000  1050.00000  1.844848358135e-02
1050.00000  1100.00000  1.714462263435e-02
1100.00000  1150.00000  1.589752684631e-02
1150.00000  1200.00000  1.481396877811e-02
1200.00000  1250.00000  1.393623268081e-02
1250.00000  1300.00000  1.296774956069e-02
1300.00000  1350.00000  1.219601370919e-02
1350.00000  1400.00000  1.151386640788e-02
1400.00000  1450.00000  1.092961004395e-02
1450.00000  1500.00000  1.032585272406e-02
1500.00000  1550.00000  9.808787772766e-03
1550.00000  1600.00000  9.198079617078e-03
1600.00000  1650.00000  8.712679584387e-03
1650.00000  1700.00000  8.324784331533e-03
1700.00000  1750.00000  7.978401014649e-03
1750.00000  1800.00000  7.666192640401e-03
1800.00000  1850.00000  7.312472330183e-03
1850.00000  1900.00000  6.985010732950e-03
1900.00000  1950.00000  6.754667758010e-03
1950.00000  2000.00000  6.378936467789e-03
2000.00000  2050.00000  6.128899458110e-03
2050.00000  2100.00000  5.898363404398e-03
2100.00000  2150.00000  5.657980333316e-03
2150.00000  2200.00000  5.528038319792e-03
2200.00000  2250.00000  5.311790095204e-03
2250.00000  2300.00000  5.105002730442e-03
2300.00000  2350.00000  4.940306537966e-03
2350.00000  2400.00000  4.770204139875e-03
2400.00000  2450.00000  4.654549955475e-03
2450.00000  2500.00000  4.495646126158e-03
2500.00000  2550.00000  4.278046350167e-03
2550.00000  2600.00000  4.137098846641e-03
2600.00000  2650.00000  4.072031300493e-03
2650.00000  2700.00000  3.914092865035e-03
2700.00000  2750.00000  3.795928656600e-03
2750.00000  2800.00000  3.705953948869e-03
2800.00000  2850.00000  3.636445590966e-03
2850.00000  2900.00000  3.511523625513e-03
2900.00000  2950.00000  3.407840324974e-03
2950.00000  3000.00000  3.349144378300e-03
3000.00000  3050.00000  3.241599502322e-03
3050.00000  3100.00000  3.156451763891e-03
3100.00000  3150.00000  3.040025264403e-03
3150.00000  3200.00000  2.950629792989e-03
3200.00000  3250.00000  2.903132415088e-03
3250.00000  3300.00000  2.823583961043e-03
3300.00000  3350.00000  2.707157461556e-03
3350.00000  3400.00000  2.678388724535e-03
3400.00000  3450.00000  2.610231918035e-03
3450.00000  3500.00000  2.555397546800e-03
3500.00000  3550.00000  2.524311864516e-03
3550.00000  3600.00000  2.487626897845e-03
3600.00000  3650.00000  2.409043837660e-03
3650.00000  3700.00000  2.312504451683e-03
3700.00000  3750.00000  2.304008985717e-03
3750.00000  3800.00000  2.228515185884e-03
3800.00000  3850.00000  2.189513273949e-03
3850.00000  3900.00000  2.151862913418e-03
3900.00000  3950.00000  2.126955751836e-03
3950.00000  4000.00000  2.083513028147e-03
4000.00000  4050.00000  2.035050256387e-03
4050.00000  4100.00000  2.014004670244e-03
4100.00000  4150.00000  1.924223041285e-03
4150.00000  4200.00000  1.919009914443e-03
4200.00000  4250.00000  1.875181033209e-03
4250.00000  4300.00000  1.836758357591e-03
4300.00000  4350.00000  1.826139025133e-03
4350.00000  4400.00000  1.796404894252e-03
4400.00000  4450.00000  1.745625177229e-03
4450.00000  4500.00000  1.710484840733e-03
4500.00000  4550.00000  1.686929230555e-03
4550.00000  4600.00000  1.636535671075e-03
4600.00000  4650.00000  1.597533759141e-03
4650.00000  4700.00000  1.614524691073e-03
4700.00000  4750.00000  1.559690319838e-03
4750.00000  4800.00000  1.502539003340e-03
4800.00000  4850.00000  1.526287692290e-03
4850.00000  4900.00000  1.485161913864e-03
4900.00000  4950.00000  1.464888642809e-03
4950.00000  5000.00000  1.406578853679e-03
5000.00000  5050.00000  1.423183628067e-03
5050.00000  5100.00000  1.381092455781e-03
5100.00000  5150.00000  1.360433027182e-03
5150.00000  5200.00000  1.353289112620e-03
5200.00000  5250.00000  1.323748060511e-03
5250.00000  5300.00000  1.323748060511e-03
5300.00000  5350.00000  1.285711542436e-03
5350.00000  5400.00000  1.231456407517e-03
5400.00000  5450.00000  1.255012017696e-03
5450.00000  5500.00000  1.203266906812e-03
5500.00000  5550.00000  1.202301512952e-03
5550.00000  5600.00000  1.220837075060e-03
5600.00000  5650.00000  1.195350677162e-03
5650.00000  5700.00000  1.168319649089e-03
5700.00000  5750.00000  1.165616546281e-03
5750.00000  5800.00000  1.117733010837e-03
5800.00000  5850.00000  1.110009859959e-03
5850.00000  5900.00000  1.087998879956e-03
5900.00000  5950.00000  1.085875013465e-03
5950.00000  6000.00000  1.083944225745e-03
6000.00000  6050.00000  1.066953293813e-03
6050.00000  6100.00000  1.069849475393e-03
6100.00000  6150.00000  1.025055200299e-03
6150.00000  6200.00000  1.015015104158e-03
6200.00000  6250.00000  1.019842073457e-03
6250.00000  6300.00000  1.007291953280e-03
6300.00000  6350.00000  9.939695180150e-04
6350.00000  6400.00000  1.164458073650e-03
6400.00000  6450.00000  9.590222602915e-04
6450.00000  6500.00000  9.233026874801e-04
6500.00000  6550.00000  9.348874137973e-04
6550.00000  6600.00000  9.061186767763e-04
6600.00000  6650.00000  9.018709437933e-04
6650.00000  6700.00000  8.584282201038e-04
6700.00000  6750.00000  8.916377688798e-04
6750.00000  6800.00000  8.729091280003e-04
6800.00000  6850.00000  8.443334697513e-04
6850.00000  6900.00000  8.536012508050e-04
6900.00000  6950.00000  8.592005351917e-04
6950.00000  7000.00000  8.250255925559e-04
7000.00000  7050.00000  8.223224897486e-04
7050.00000  7100.00000  8.551458809806e-04
7100.00000  7150.00000  7.844790504458e-04
7150.00000  7200.00000  7.759835844798e-04
7200.00000  7250.00000  7.703843000932e-04
7250.00000  7300.00000  7.396847753526e-04
7300.00000  7350.00000  7.580272586882e-04
7350.00000  7400.00000  7.485663988625e-04
7400.00000  7450.00000  7.506902653540e-04
7450.00000  7500.00000  7.524279743016e-04
7500.00000  7550.00000  7.157430076304e-04
7550.00000  7600.00000  7.246246311403e-04
7600.00000  7650.00000  6.948905002595e-04
7650.00000  7700.00000  7.006828634181e-04
7700.00000  7750.00000  6.929597125400e-04
7750.00000  7800.00000  6.854296404338e-04
7800.00000  7850.00000  6.865881130655e-04
7850.00000  7900.00000  6.863950342936e-04
7900.00000  7950.00000  6.583986123604e-04
7950.00000  8000.00000  6.456554134114e-04
8000.00000  8050.00000  6.589778486762e-04
8050.00000  8100.00000  6.670871570982e-04
8100.00000  8150.00000  6.172728339343e-04
8150.00000  8200.00000  6.456554134114e-04
8200.00000  8250.00000  6.566609034128e-04
8250.00000  8300.00000  6.182382277941e-04
8300.00000  8350.00000  6.081981316525e-04
8350.00000  8400.00000  6.029850048098e-04
8400.00000  8450.00000  6.043365562135e-04
8450.00000  8500.00000  6.053019500732e-04
8500.00000  8550.00000  5.956480114756e-04
8550.00000  8600.00000  5.886971756853e-04
8600.00000  8650.00000  5.848356002462e-04
8650.00000  8700.00000  5.834840488425e-04
8700.00000  8750.00000  5.664931169106e-04
8750.00000  8800.00000  5.587699660325e-04
8800.00000  8850.00000  5.487298698909e-04
8850.00000  8900.00000  5.645623291911e-04
8900.00000  8950.00000  5.512398939263e-04
8950.00000  9000.00000  5.504675788385e-04
9000.00000  9050.00000  5.384966949774e-04
9050.00000  9100.00000  5.282635200639e-04
9100.00000  9150.00000  5.160995574309e-04
9150.00000  9200.00000  5.224711569053e-04
9200.00000  9250.00000  5.317389379591e-04
9250.00000  9300.00000  5.060594612893e-04
9300.00000  9350.00000  4.998809405868e-04
9350.00000  9400.00000  5.124310607637e-04
9400.00000  9450.00000  4.962124439197e-04
9450.00000  9500.00000  4.867515840940e-04
9500.00000  9550.00000  4.962124439197e-04
9550.00000  9600.00000  5.054802249734e-04
9600.00000  9650.00000  4.989155467270e-04
9650.00000  9700.00000  4.784491969000e-04
9700.00000  9750.00000  4.846277176025e-04
9750.00000  9800.00000  4.778699605841e-04
9800.00000  9850.00000  4.682160219865e-04
9850.00000  9900.00000  4.759391728646e-04
9900.00000  9950.00000  4.799938270756e-04
9950.00000  10000.00000  4.604928711083e-04
