10001.00000  11001.00000  1.328434948452e-04
11001.00000  12001.00000  1.074713844869e-04
12001.00000  13001.00000  8.885778387475e-05
13001.00000  14001.00000  7.109361344925e-05
14001.00000  15001.00000  6.090045120925e-05
15001.00000  16001.00000  5.100274294723e-05
16001.00000  17001.00000  4.501979989332e-05
17001.00000  18001.00000  4.051412672926e-05
18001.00000  19001.00000  3.172437088463e-05
19001.00000  20001.00000  2.692324374260e-05
20001.00000  21001.00000  2.640619928115e-05
21001.00000  22001.00000  2.215904834782e-05
22001.00000  23001.00000  1.961075778782e-05
23001.00000  24001.00000  1.883519109565e-05
24001.00000  25001.00000  1.743178470028e-05
25001.00000  26001.00000  1.506815287652e-05
26001.00000  27001.00000  1.473576715130e-05
27001.00000  28001.00000  1.185509086608e-05
28001.00000  29001.00000  1.041475272347e-05
29001.00000  30001.00000  1.159656863536e-05
30001.00000  31001.00000  9.454527295069e-06
31001.00000  32001.00000  9.159073317098e-06
32001.00000  33001.00000  8.014189152461e-06
33001.00000  34001.00000  7.460212943765e-06
34001.00000  35001.00000  6.315328779128e-06
35001.00000  36001.00000  6.721577998838e-06
36001.00000  37001.00000  5.687489075940e-06
37001.00000  38001.00000  6.241465284635e-06
38001.00000  39001.00000  5.502830339708e-06
39001.00000  40001.00000  5.022717625505e-06
40001.00000  41001.00000  4.948854131013e-06
41001.00000  42001.00000  4.764195394781e-06
42001.00000  43001.00000  4.838058889274e-06
43001.00000  44001.00000  3.730106471883e-06
44001.00000  45001.00000  3.693174724636e-06
45001.00000  46001.00000  3.471584241158e-06
46001.00000  47001.00000  3.065335021448e-06
47001.00000  48001.00000  2.511358812753e-06
48001.00000  49001.00000  2.917608032463e-06
49001.00000  50001.00000  2.511358812753e-06
50001.00000  51001.00000  2.105109593043e-06
51001.00000  52001.00000  2.880676285216e-06
52001.00000  53001.00000  1.957382604057e-06
53001.00000  54001.00000  2.031246098550e-06
54001.00000  55001.00000  2.252836582028e-06
55001.00000  56001.00000  2.363631823767e-06
56001.00000  57001.00000  1.809655615072e-06
57001.00000  58001.00000  2.068177845796e-06
58001.00000  59001.00000  2.142041340289e-06
59001.00000  60001.00000  1.624996878840e-06
60001.00000  61001.00000  1.218747659130e-06
61001.00000  62001.00000  1.366474648115e-06
62001.00000  63001.00000  1.329542900869e-06
63001.00000  64001.00000  1.661928626086e-06
64001.00000  65001.00000  1.366474648115e-06
65001.00000  66001.00000  1.329542900869e-06
66001.00000  67001.00000  8.494301866664e-07
67001.00000  68001.00000  1.477269889855e-06
68001.00000  69001.00000  1.034088922898e-06
69001.00000  70001.00000  1.107952417391e-06
70001.00000  71001.00000  8.863619339127e-07
71001.00000  72001.00000  1.218747659130e-06
72001.00000  73001.00000  9.971571756518e-07
73001.00000  74001.00000  1.144884164637e-06
74001.00000  75001.00000  5.909079559418e-07
75001.00000  76001.00000  8.494301866664e-07
76001.00000  77001.00000  8.124984394200e-07
77001.00000  78001.00000  7.386349449273e-07
78001.00000  79001.00000  8.863619339127e-07
79001.00000  80001.00000  8.863619339127e-07
80001.00000  81001.00000  1.034088922898e-06
81001.00000  82001.00000  4.801127142027e-07
82001.00000  83001.00000  8.124984394200e-07
83001.00000  84001.00000  7.755666921736e-07
84001.00000  85001.00000  5.909079559418e-07
85001.00000  86001.00000  6.647714504345e-07
86001.00000  87001.00000  4.801127142027e-07
87001.00000  88001.00000  5.539762086955e-07
88001.00000  89001.00000  3.693174724636e-07
89001.00000  90001.00000  5.170444614491e-07
90001.00000  91001.00000  3.323857252173e-07
91001.00000  92001.00000  4.062492197100e-07
92001.00000  93001.00000  2.215904834782e-07
93001.00000  94001.00000  7.017031976809e-07
94001.00000  95001.00000  3.693174724636e-07
95001.00000  96001.00000  5.170444614491e-07
96001.00000  97001.00000  5.539762086955e-07
97001.00000  98001.00000  5.539762086955e-07
98001.00000  99001.00000  3.323857252173e-07
99001.00000  100001.00000  5.170444614491e-07
100001.00000  101001.00000  5.909079559418e-07
101001.00000  102001.00000  3.693174724636e-07
102001.00000  103001.00000  3.323857252173e-07
103001.00000  104001.00000  6.278397031882e-07
104001.00000  105001.00000  5.170444614491e-07
105001.00000  106001.00000  4.062492197100e-07
106001.00000  107001.00000  4.062492197100e-07
107001.00000  108001.00000  2.585222307245e-07
108001.00000  109001.00000  4.431809669564e-07
109001.00000  110001.00000  2.215904834782e-07
110001.00000  111001.00000  2.954539779709e-07
111001.00000  112001.00000  2.585222307245e-07
112001.00000  113001.00000  2.954539779709e-07
113001.00000  114001.00000  4.801127142027e-07
114001.00000  115001.00000  3.323857252173e-07
115001.00000  116001.00000  1.107952417391e-07
116001.00000  117001.00000  1.107952417391e-07
117001.00000  118001.00000  5.539762086955e-07
118001.00000  119001.00000  3.323857252173e-07
119001.00000  120001.00000  3.693174724636e-07
120001.00000  121001.00000  1.477269889855e-07
121001.00000  122001.00000  2.585222307245e-07
122001.00000  123001.00000  2.585222307245e-07
123001.00000  124001.00000  1.477269889855e-07
124001.00000  125001.00000  1.846587362318e-07
125001.00000  126001.00000  4.062492197100e-07
126001.00000  127001.00000  2.585222307245e-07
127001.00000  128001.00000  1.107952417391e-07
128001.00000  129001.00000  1.846587362318e-07
129001.00000  130001.00000  1.846587362318e-07
130001.00000  131001.00000  2.215904834782e-07
131001.00000  132001.00000  3.693174724636e-08
132001.00000  133001.00000  1.477269889855e-07
133001.00000  134001.00000  2.954539779709e-07
134001.00000  135001.00000  1.477269889855e-07
135001.00000  136001.00000  1.846587362318e-07
136001.00000  137001.00000  7.386349449273e-08
137001.00000  138001.00000  1.846587362318e-07
138001.00000  139001.00000  7.386349449273e-08
139001.00000  140001.00000  1.846587362318e-07
140001.00000  141001.00000  1.477269889855e-07
141001.00000  142001.00000  1.477269889855e-07
142001.00000  143001.00000  2.215904834782e-07
143001.00000  144001.00000  1.107952417391e-07
144001.00000  145001.00000  2.585222307245e-07
145001.00000  146001.00000  1.107952417391e-07
146001.00000  147001.00000  1.846587362318e-07
147001.00000  148001.00000  7.386349449273e-08
148001.00000  149001.00000  2.954539779709e-07
149001.00000  150001.00000  7.386349449273e-08
150001.00000  151001.00000  1.107952417391e-07
151001.00000  152001.00000  3.693174724636e-08
152001.00000  153001.00000  1.107952417391e-07
153001.00000  154001.00000  1.846587362318e-07
154001.00000  155001.00000  2.954539779709e-07
155001.00000  156001.00000  7.386349449273e-08
156001.00000  157001.00000  7.386349449273e-08
157001.00000  158001.00000  7.386349449273e-08
158001.00000  159001.00000  1.477269889855e-07
159001.00000  160001.00000  3.693174724636e-08
160001.00000  161001.00000  2.215904834782e-07
161001.00000  162001.00000  1.107952417391e-07
162001.00000  163001.00000  1.107952417391e-07
163001.00000  164001.00000  7.386349449273e-08
164001.00000  165001.00000  7.386349449273e-08
165001.00000  166001.00000  1.107952417391e-07
166001.00000  167001.00000  7.386349449273e-08
167001.00000  168001.00000  7.386349449273e-08
168001.00000  169001.00000  0.000000000000e+00
169001.00000  170001.00000  1.107952417391e-07
170001.00000  171001.00000  7.386349449273e-08
171001.00000  172001.00000  7.386349449273e-08
172001.00000  173001.00000  0.000000000000e+00
173001.00000  174001.00000  7.386349449273e-08
174001.00000  175001.00000  1.107952417391e-07
175001.00000  176001.00000  7.386349449273e-08
176001.00000  177001.00000  1.107952417391e-07
177001.00000  178001.00000  7.386349449273e-08
178001.00000  179001.00000  1.477269889855e-07
179001.00000  180001.00000  0.000000000000e+00
180001.00000  181001.00000  7.386349449273e-08
181001.00000  182001.00000  7.386349449273e-08
182001.00000  183001.00000  1.477269889855e-07
183001.00000  184001.00000  3.693174724636e-08
184001.00000  185001.00000  7.386349449273e-08
185001.00000  186001.00000  0.000000000000e+00
186001.00000  187001.00000  7.386349449273e-08
187001.00000  188001.00000  3.693174724636e-08
188001.00000  189001.00000  7.386349449273e-08
189001.00000  190001.00000  3.693174724636e-08
190001.00000  191001.00000  0.000000000000e+00
191001.00000  192001.00000  7.386349449273e-08
192001.00000  193001.00000  7.386349449273e-08
193001.00000  194001.00000  0.000000000000e+00
194001.00000  195001.00000  3.693174724636e-08
195001.00000  196001.00000  3.693174724636e-08
196001.00000  197001.00000  7.386349449273e-08
197001.00000  198001.00000  7.386349449273e-08
198001.00000  199001.00000  0.000000000000e+00
