10001.00000  11001.00000  1.004951263478e-03
11001.00000  12001.00000  8.659080785841e-04
12001.00000  13001.00000  7.513831957591e-04
13001.00000  14001.00000  6.682950024820e-04
14001.00000  15001.00000  5.927041412426e-04
15001.00000  16001.00000  5.267816541366e-04
16001.00000  17001.00000  4.787967992804e-04
17001.00000  18001.00000  4.333689495593e-04
18001.00000  19001.00000  3.945989622654e-04
19001.00000  20001.00000  3.632780616293e-04
20001.00000  21001.00000  3.341667993930e-04
21001.00000  22001.00000  3.063485133382e-04
22001.00000  23001.00000  2.831424856025e-04
23001.00000  24001.00000  2.651952042769e-04
24001.00000  25001.00000  2.476242369145e-04
25001.00000  26001.00000  2.285094173950e-04
26001.00000  27001.00000  2.132928245721e-04
27001.00000  28001.00000  1.999674506416e-04
28001.00000  29001.00000  1.892376781501e-04
29001.00000  30001.00000  1.785079056586e-04
30001.00000  31001.00000  1.666202440494e-04
31001.00000  32001.00000  1.598369436343e-04
32001.00000  33001.00000  1.520211920893e-04
33001.00000  34001.00000  1.435686015294e-04
34001.00000  35001.00000  1.362835491634e-04
35001.00000  36001.00000  1.290853384811e-04
36001.00000  37001.00000  1.223599325220e-04
37001.00000  38001.00000  1.162038220458e-04
38001.00000  39001.00000  1.105591125966e-04
39001.00000  40001.00000  1.068442183437e-04
40001.00000  41001.00000  1.030907277869e-04
41001.00000  42001.00000  9.851706577160e-05
42001.00000  43001.00000  9.521708178591e-05
43001.00000  44001.00000  9.105833003787e-05
44001.00000  45001.00000  8.816360724340e-05
45001.00000  46001.00000  8.318468403692e-05
46001.00000  47001.00000  8.061802982583e-05
47001.00000  48001.00000  7.746278197987e-05
48001.00000  49001.00000  7.555226493552e-05
49001.00000  50001.00000  7.131632057962e-05
50001.00000  51001.00000  6.829615979740e-05
51001.00000  52001.00000  6.553652406667e-05
52001.00000  53001.00000  6.230408361285e-05
53001.00000  54001.00000  6.225583823295e-05
54001.00000  55001.00000  6.091461667151e-05
55001.00000  56001.00000  5.824182262462e-05
56001.00000  57001.00000  5.627341112439e-05
57001.00000  58001.00000  5.385149305302e-05
58001.00000  59001.00000  5.270325301121e-05
59001.00000  60001.00000  5.074449058696e-05
60001.00000  61001.00000  4.960589962114e-05
61001.00000  62001.00000  4.853485218719e-05
62001.00000  63001.00000  4.690415834630e-05
63001.00000  64001.00000  4.509013206177e-05
64001.00000  65001.00000  4.298663349780e-05
65001.00000  66001.00000  4.206997127955e-05
66001.00000  67001.00000  4.113401090934e-05
67001.00000  68001.00000  4.071910064213e-05
68001.00000  69001.00000  3.898226696545e-05
69001.00000  70001.00000  3.862525115414e-05
70001.00000  71001.00000  3.655069981810e-05
71001.00000  72001.00000  3.531561809246e-05
72001.00000  73001.00000  3.494895320517e-05
73001.00000  74001.00000  3.475597168554e-05
74001.00000  75001.00000  3.354983718784e-05
75001.00000  76001.00000  3.290334909708e-05
76001.00000  77001.00000  3.181300351116e-05
77001.00000  78001.00000  3.204458133472e-05
78001.00000  79001.00000  3.028844950608e-05
79001.00000  80001.00000  2.979634663102e-05
80001.00000  81001.00000  2.885073718483e-05
81001.00000  82001.00000  2.759635730723e-05
82001.00000  83001.00000  2.731653410376e-05
83001.00000  84001.00000  2.689197476057e-05
84001.00000  85001.00000  2.639022280953e-05
85001.00000  86001.00000  2.576303287073e-05
86001.00000  87001.00000  2.486566880445e-05
87001.00000  88001.00000  2.429637332154e-05
88001.00000  89001.00000  2.428672424556e-05
89001.00000  90001.00000  2.422882978967e-05
90001.00000  91001.00000  2.323497496357e-05
91001.00000  92001.00000  2.279111746842e-05
92001.00000  93001.00000  2.179726264232e-05
93001.00000  94001.00000  2.197094600998e-05
94001.00000  95001.00000  2.070691705640e-05
95001.00000  96001.00000  2.126656346333e-05
96001.00000  97001.00000  1.996393820582e-05
97001.00000  98001.00000  1.928850288711e-05
98001.00000  99001.00000  1.901832875963e-05
99001.00000  100001.00000  1.900867968365e-05
100001.00000  101001.00000  1.851657680859e-05
101001.00000  102001.00000  1.788938686979e-05
102001.00000  103001.00000  1.756131828642e-05
103001.00000  104001.00000  1.731044231090e-05
104001.00000  105001.00000  1.624904395293e-05
105001.00000  106001.00000  1.691483019565e-05
106001.00000  107001.00000  1.632623656078e-05
107001.00000  108001.00000  1.624904395293e-05
108001.00000  109001.00000  1.558325771020e-05
109001.00000  110001.00000  1.552536325431e-05
110001.00000  111001.00000  1.514904929103e-05
111001.00000  112001.00000  1.456045565616e-05
112001.00000  113001.00000  1.482098070766e-05
113001.00000  114001.00000  1.431922875662e-05
114001.00000  115001.00000  1.488852423953e-05
115001.00000  116001.00000  1.459905196008e-05
116001.00000  117001.00000  1.387537126147e-05
117001.00000  118001.00000  1.385607310950e-05
118001.00000  119001.00000  1.290081458733e-05
119001.00000  120001.00000  1.336397023444e-05
120001.00000  121001.00000  1.295870904322e-05
121001.00000  122001.00000  1.355695175407e-05
122001.00000  123001.00000  1.301660349911e-05
123001.00000  124001.00000  1.150169857000e-05
124001.00000  125001.00000  1.165608378571e-05
125001.00000  126001.00000  1.150169857000e-05
126001.00000  127001.00000  1.147275134206e-05
127001.00000  128001.00000  1.102889384691e-05
128001.00000  129001.00000  1.110608645476e-05
129001.00000  130001.00000  1.038240575615e-05
130001.00000  131001.00000  1.101924477093e-05
131001.00000  132001.00000  1.044994928802e-05
132001.00000  133001.00000  1.025696776839e-05
133001.00000  134001.00000  1.018942423651e-05
134001.00000  135001.00000  9.996442716884e-06
135001.00000  136001.00000  9.803461197253e-06
136001.00000  137001.00000  9.417498157991e-06
137001.00000  138001.00000  9.079780498636e-06
138001.00000  139001.00000  9.774513969308e-06
139001.00000  140001.00000  8.491186863762e-06
140001.00000  141001.00000  8.857851751061e-06
141001.00000  142001.00000  9.214867562378e-06
142001.00000  143001.00000  8.664870231430e-06
143001.00000  144001.00000  8.780659143208e-06
144001.00000  145001.00000  8.433292407873e-06
145001.00000  146001.00000  8.973640662839e-06
146001.00000  147001.00000  8.211363660297e-06
147001.00000  148001.00000  8.056978444592e-06
148001.00000  149001.00000  8.500835939744e-06
149001.00000  150001.00000  7.564875569533e-06
150001.00000  151001.00000  8.114872900482e-06
151001.00000  152001.00000  7.854347848980e-06
152001.00000  153001.00000  7.516630189626e-06
153001.00000  154001.00000  7.642068177386e-06
154001.00000  155001.00000  7.304350518032e-06
155001.00000  156001.00000  7.516630189626e-06
156001.00000  157001.00000  7.014878238585e-06
157001.00000  158001.00000  6.995580086622e-06
158001.00000  159001.00000  7.063123618493e-06
159001.00000  160001.00000  7.121018074382e-06
160001.00000  161001.00000  6.744704111102e-06
161001.00000  162001.00000  6.754353187083e-06
162001.00000  163001.00000  6.571020743434e-06
163001.00000  164001.00000  6.638564275305e-06
164001.00000  165001.00000  6.435933679692e-06
165001.00000  166001.00000  5.779796512947e-06
166001.00000  167001.00000  6.329793843895e-06
167001.00000  168001.00000  5.692954829113e-06
168001.00000  169001.00000  6.021023412486e-06
169001.00000  170001.00000  5.596464069298e-06
170001.00000  171001.00000  5.799094664910e-06
171001.00000  172001.00000  5.364886245741e-06
172001.00000  173001.00000  6.011374336504e-06
173001.00000  174001.00000  5.287693637888e-06
174001.00000  175001.00000  5.393833473685e-06
175001.00000  176001.00000  5.374535321722e-06
176001.00000  177001.00000  5.393833473685e-06
177001.00000  178001.00000  5.499973309482e-06
178001.00000  179001.00000  5.432429777611e-06
179001.00000  180001.00000  5.306991789851e-06
180001.00000  181001.00000  5.056115814331e-06
181001.00000  182001.00000  5.200851954054e-06
182001.00000  183001.00000  5.094712118257e-06
183001.00000  184001.00000  5.017519510405e-06
184001.00000  185001.00000  5.364886245741e-06
185001.00000  186001.00000  5.278044561907e-06
186001.00000  187001.00000  4.592960167217e-06
187001.00000  188001.00000  4.882432446663e-06
188001.00000  189001.00000  4.834187066755e-06
189001.00000  190001.00000  4.718398154977e-06
190001.00000  191001.00000  4.872783370682e-06
191001.00000  192001.00000  4.255242507863e-06
192001.00000  193001.00000  4.322786039733e-06
193001.00000  194001.00000  4.592960167217e-06
194001.00000  195001.00000  4.149102672066e-06
195001.00000  196001.00000  4.496469407401e-06
196001.00000  197001.00000  4.313136963752e-06
197001.00000  198001.00000  4.245593431881e-06
198001.00000  199001.00000  4.004366532342e-06
