10001.00000  11001.00000  8.208409977017e-04
11001.00000  12001.00000  7.071576286929e-04
12001.00000  13001.00000  6.212437253863e-04
13001.00000  14001.00000  5.411897895545e-04
14001.00000  15001.00000  4.853796530436e-04
15001.00000  16001.00000  4.307802536141e-04
16001.00000  17001.00000  3.865350777061e-04
17001.00000  18001.00000  3.536127149847e-04
18001.00000  19001.00000  3.194699292851e-04
19001.00000  20001.00000  2.911483674736e-04
20001.00000  21001.00000  2.665752476665e-04
21001.00000  22001.00000  2.462736082832e-04
22001.00000  23001.00000  2.248677766814e-04
23001.00000  24001.00000  2.074719062938e-04
24001.00000  25001.00000  1.949674137156e-04
25001.00000  26001.00000  1.815427609554e-04
26001.00000  27001.00000  1.699584285591e-04
27001.00000  28001.00000  1.592845704482e-04
28001.00000  29001.00000  1.501217122151e-04
29001.00000  30001.00000  1.387310977519e-04
30001.00000  31001.00000  1.327064700341e-04
31001.00000  32001.00000  1.225750221357e-04
32001.00000  33001.00000  1.179839071225e-04
33001.00000  34001.00000  1.085111001965e-04
34001.00000  35001.00000  1.052082094380e-04
35001.00000  36001.00000  9.809876129520e-05
36001.00000  37001.00000  9.281994761966e-05
37001.00000  38001.00000  8.975920427751e-05
38001.00000  39001.00000  8.413169832248e-05
39001.00000  40001.00000  8.235917923510e-05
40001.00000  41001.00000  7.700287838634e-05
41001.00000  42001.00000  7.443611577346e-05
42001.00000  43001.00000  7.080390452882e-05
43001.00000  44001.00000  6.817902653603e-05
44001.00000  45001.00000  6.484707808762e-05
45001.00000  46001.00000  6.190256550530e-05
46001.00000  47001.00000  5.976198234512e-05
47001.00000  48001.00000  5.755359790838e-05
48001.00000  49001.00000  5.439599559971e-05
49001.00000  50001.00000  5.298185468846e-05
50001.00000  51001.00000  4.936901523713e-05
51001.00000  52001.00000  4.995016903627e-05
52001.00000  53001.00000  4.636638727489e-05
53001.00000  54001.00000  4.502973353687e-05
54001.00000  55001.00000  4.409988745824e-05
55001.00000  56001.00000  4.338313110596e-05
56001.00000  57001.00000  4.124254794579e-05
57001.00000  58001.00000  3.906322119901e-05
58001.00000  59001.00000  3.880170198939e-05
59001.00000  60001.00000  3.730038800828e-05
60001.00000  61001.00000  3.541163816106e-05
61001.00000  62001.00000  3.441399080587e-05
62001.00000  63001.00000  3.420090107952e-05
63001.00000  64001.00000  3.175036922647e-05
64001.00000  65001.00000  3.082052314784e-05
65001.00000  66001.00000  3.017156807213e-05
66001.00000  67001.00000  2.868962588432e-05
67001.00000  68001.00000  2.814721567179e-05
68001.00000  69001.00000  2.772103621908e-05
69001.00000  70001.00000  2.630689530784e-05
70001.00000  71001.00000  2.530924795264e-05
71001.00000  72001.00000  2.449563263384e-05
72001.00000  73001.00000  2.361421603848e-05
73001.00000  74001.00000  2.373044679831e-05
74001.00000  75001.00000  2.222913281719e-05
75001.00000  76001.00000  2.239379306028e-05
76001.00000  77001.00000  2.105713932225e-05
77001.00000  78001.00000  2.049535731641e-05
78001.00000  79001.00000  1.972048558422e-05
79001.00000  80001.00000  1.966237020431e-05
80001.00000  81001.00000  1.902310102525e-05
81001.00000  82001.00000  1.870346643573e-05
82001.00000  83001.00000  1.859692157255e-05
83001.00000  84001.00000  1.748304345753e-05
84001.00000  85001.00000  1.738618449100e-05
85001.00000  86001.00000  1.724089604122e-05
86001.00000  87001.00000  1.620450509941e-05
87001.00000  88001.00000  1.620450509941e-05
88001.00000  89001.00000  1.506156929443e-05
89001.00000  90001.00000  1.532308850405e-05
90001.00000  91001.00000  1.480973598147e-05
91001.00000  92001.00000  1.519717184757e-05
92001.00000  93001.00000  1.421889628568e-05
93001.00000  94001.00000  1.391863348946e-05
94001.00000  95001.00000  1.393800528276e-05
95001.00000  96001.00000  1.299847330748e-05
96001.00000  97001.00000  1.365711427984e-05
97001.00000  98001.00000  1.282412716774e-05
98001.00000  99001.00000  1.251417847486e-05
99001.00000  100001.00000  1.155527470628e-05
100001.00000  101001.00000  1.135187087658e-05
101001.00000  102001.00000  1.127438370336e-05
102001.00000  103001.00000  1.170056315606e-05
103001.00000  104001.00000  1.133249908327e-05
104001.00000  105001.00000  1.098380680379e-05
105001.00000  106001.00000  1.015081969168e-05
106001.00000  107001.00000  1.035422352138e-05
107001.00000  108001.00000  1.046076838456e-05
108001.00000  109001.00000  9.666524859065e-06
109001.00000  110001.00000  9.414691546103e-06
110001.00000  111001.00000  8.717306987133e-06
111001.00000  112001.00000  9.211287716404e-06
112001.00000  113001.00000  8.891653126875e-06
113001.00000  114001.00000  9.075685163270e-06
114001.00000  115001.00000  8.930396713485e-06
115001.00000  116001.00000  8.310499327733e-06
116001.00000  117001.00000  7.874633978377e-06
117001.00000  118001.00000  8.659191607219e-06
118001.00000  119001.00000  7.642172458720e-06
119001.00000  120001.00000  7.564685285501e-06
120001.00000  121001.00000  7.283794282582e-06
121001.00000  122001.00000  7.748717321896e-06
122001.00000  123001.00000  7.409710939063e-06
123001.00000  124001.00000  6.993217383011e-06
124001.00000  125001.00000  6.906044313140e-06
125001.00000  126001.00000  6.470178963783e-06
126001.00000  127001.00000  6.043999511079e-06
127001.00000  128001.00000  6.373319997259e-06
128001.00000  129001.00000  6.644525103526e-06
129001.00000  130001.00000  6.024627717774e-06
130001.00000  131001.00000  6.847928933225e-06
131001.00000  132001.00000  6.082743097688e-06
132001.00000  133001.00000  5.821223888074e-06
133001.00000  134001.00000  5.869653371336e-06
134001.00000  135001.00000  5.307871365499e-06
135001.00000  136001.00000  5.453159815284e-06
136001.00000  137001.00000  5.879339267988e-06
137001.00000  138001.00000  5.685621334941e-06
138001.00000  139001.00000  5.511275195198e-06
139001.00000  140001.00000  5.211012398975e-06
140001.00000  141001.00000  5.152897019061e-06
141001.00000  142001.00000  4.542685529961e-06
142001.00000  143001.00000  5.143211122408e-06
143001.00000  144001.00000  4.813890636228e-06
144001.00000  145001.00000  4.804204739575e-06
145001.00000  146001.00000  4.678288083095e-06
146001.00000  147001.00000  4.513627840004e-06
147001.00000  148001.00000  4.116506077257e-06
148001.00000  149001.00000  4.223050940433e-06
149001.00000  150001.00000  4.620172703180e-06
150001.00000  151001.00000  4.097134283952e-06
151001.00000  152001.00000  4.319909906957e-06
152001.00000  153001.00000  4.271480423695e-06
153001.00000  154001.00000  4.242422733738e-06
154001.00000  155001.00000  4.184307353824e-06
155001.00000  156001.00000  3.806557384381e-06
156001.00000  157001.00000  3.913102247557e-06
157001.00000  158001.00000  3.787185591077e-06
158001.00000  159001.00000  3.574095864724e-06
159001.00000  160001.00000  3.835615074338e-06
160001.00000  161001.00000  3.545038174767e-06
161001.00000  162001.00000  3.089801032106e-06
162001.00000  163001.00000  3.312576655110e-06
163001.00000  164001.00000  3.138230515368e-06
164001.00000  165001.00000  3.196345895282e-06
165001.00000  166001.00000  3.264147171849e-06
166001.00000  167001.00000  3.283518965153e-06
167001.00000  168001.00000  2.886397202406e-06
168001.00000  169001.00000  3.041371548844e-06
169001.00000  170001.00000  2.973570272278e-06
170001.00000  171001.00000  2.876711305754e-06
171001.00000  172001.00000  3.021999755539e-06
172001.00000  173001.00000  2.789538235882e-06
173001.00000  174001.00000  2.741108752621e-06
174001.00000  175001.00000  2.963884375625e-06
175001.00000  176001.00000  2.721736959316e-06
176001.00000  177001.00000  2.663621579402e-06
177001.00000  178001.00000  2.837967719144e-06
178001.00000  179001.00000  2.760480545925e-06
179001.00000  180001.00000  2.682993372706e-06
180001.00000  181001.00000  2.702365166011e-06
181001.00000  182001.00000  2.586134406183e-06
182001.00000  183001.00000  2.673307476054e-06
183001.00000  184001.00000  2.537704922921e-06
184001.00000  185001.00000  2.421474163092e-06
185001.00000  186001.00000  2.285871609959e-06
186001.00000  187001.00000  2.256813920002e-06
187001.00000  188001.00000  2.072781883607e-06
188001.00000  189001.00000  2.295557506612e-06
189001.00000  190001.00000  2.392416473135e-06
190001.00000  191001.00000  2.159954953478e-06
191001.00000  192001.00000  2.169640850131e-06
192001.00000  193001.00000  2.034038296998e-06
193001.00000  194001.00000  2.053410090302e-06
194001.00000  195001.00000  2.072781883607e-06
195001.00000  196001.00000  2.082467780259e-06
196001.00000  197001.00000  1.772519087384e-06
197001.00000  198001.00000  1.888749847212e-06
198001.00000  199001.00000  1.733775500774e-06
