300.00000  350.00000  2.211756113692e-06
350.00000  400.00000  4.423512227384e-06
400.00000  450.00000  2.814962326517e-06
450.00000  500.00000  3.016031064125e-06
500.00000  550.00000  3.840412888320e-05
550.00000  600.00000  3.619237276950e-06
600.00000  650.00000  1.528122405824e-05
650.00000  700.00000  3.418168539342e-06
700.00000  750.00000  8.042749504334e-06
750.00000  800.00000  6.233130865859e-06
800.00000  850.00000  2.634000462670e-05
850.00000  900.00000  6.434199603468e-06
900.00000  950.00000  6.434199603468e-06
950.00000  1000.00000  5.026718440209e-06
1000.00000  1050.00000  5.428855915426e-06
1050.00000  1100.00000  6.233130865859e-06
1100.00000  1150.00000  6.233130865859e-06
1150.00000  1200.00000  6.836337078684e-06
1200.00000  1250.00000  7.238474553901e-06
1250.00000  1300.00000  2.593786715148e-05
1300.00000  1350.00000  8.042749504334e-06
1350.00000  1400.00000  5.830993390642e-06
1400.00000  1450.00000  7.238474553901e-06
1450.00000  1500.00000  1.125984930607e-05
1500.00000  1550.00000  1.065664309324e-05
1550.00000  1600.00000  1.065664309324e-05
1600.00000  1650.00000  9.852368142810e-06
1650.00000  1700.00000  9.048093192376e-06
1700.00000  1750.00000  4.202336616015e-05
1750.00000  1800.00000  1.186305551889e-05
1800.00000  1850.00000  1.125984930607e-05
1850.00000  1900.00000  1.105878056846e-05
1900.00000  1950.00000  1.306946794454e-05
1950.00000  2000.00000  1.306946794454e-05
2000.00000  2050.00000  1.146091804368e-05
2050.00000  2100.00000  1.266733046933e-05
2100.00000  2150.00000  1.085771183085e-05
2150.00000  2200.00000  1.508015532063e-05
2200.00000  2250.00000  1.045557435563e-05
2250.00000  2300.00000  1.668870522149e-05
2300.00000  2350.00000  5.066932187731e-05
2350.00000  2400.00000  1.186305551889e-05
2400.00000  2450.00000  1.367267415737e-05
2450.00000  2500.00000  1.548229279584e-05
2500.00000  2550.00000  1.387374289498e-05
2550.00000  2600.00000  1.407481163259e-05
2600.00000  2650.00000  1.347160541976e-05
2650.00000  2700.00000  1.407481163259e-05
2700.00000  2750.00000  1.648763648389e-05
2750.00000  2800.00000  1.306946794454e-05
2800.00000  2850.00000  1.447694910780e-05
2850.00000  2900.00000  1.447694910780e-05
2900.00000  2950.00000  1.367267415737e-05
2950.00000  3000.00000  2.835069200278e-05
3000.00000  3050.00000  1.709084269671e-05
3050.00000  3100.00000  1.528122405824e-05
3100.00000  3150.00000  1.568336153345e-05
3150.00000  3200.00000  2.392717977539e-05
3200.00000  3250.00000  2.030794249844e-05
3250.00000  3300.00000  1.688977395910e-05
3300.00000  3350.00000  1.487908658302e-05
3350.00000  3400.00000  1.548229279584e-05
3400.00000  3450.00000  1.869939259758e-05
3450.00000  3500.00000  1.829725512236e-05
3500.00000  3550.00000  2.050901123605e-05
3550.00000  3600.00000  1.709084269671e-05
3600.00000  3650.00000  1.990580502323e-05
3650.00000  3700.00000  2.895389821560e-05
3700.00000  3750.00000  2.171542366170e-05
3750.00000  3800.00000  2.191649239931e-05
3800.00000  3850.00000  2.030794249844e-05
3850.00000  3900.00000  1.950366754801e-05
3900.00000  3950.00000  2.432931725061e-05
3950.00000  4000.00000  1.890046133519e-05
4000.00000  4050.00000  2.332397356257e-05
4050.00000  4100.00000  1.829725512236e-05
4100.00000  4150.00000  2.191649239931e-05
4150.00000  4200.00000  2.453038598822e-05
4200.00000  4250.00000  1.809618638475e-05
4250.00000  4300.00000  2.050901123605e-05
4300.00000  4350.00000  1.930259881040e-05
4350.00000  4400.00000  2.372611103779e-05
4400.00000  4450.00000  2.754641705235e-05
4450.00000  4500.00000  2.111221744888e-05
4500.00000  4550.00000  2.352504230018e-05
4550.00000  4600.00000  2.091114871127e-05
4600.00000  4650.00000  1.910153007279e-05
4650.00000  4700.00000  2.151435492409e-05
4700.00000  4750.00000  2.251969861214e-05
4750.00000  4800.00000  2.473145472583e-05
4800.00000  4850.00000  2.372611103779e-05
4850.00000  4900.00000  2.372611103779e-05
4900.00000  4950.00000  2.191649239931e-05
4950.00000  5000.00000  2.251969861214e-05
5000.00000  5050.00000  2.312290482496e-05
5050.00000  5100.00000  1.930259881040e-05
5100.00000  5150.00000  1.970473628562e-05
5150.00000  5200.00000  2.191649239931e-05
5200.00000  5250.00000  1.628656774628e-05
5250.00000  5300.00000  2.372611103779e-05
5300.00000  5350.00000  2.231862987453e-05
5350.00000  5400.00000  2.432931725061e-05
5400.00000  5450.00000  2.553572967626e-05
5450.00000  5500.00000  2.613893588909e-05
5500.00000  5550.00000  2.211756113692e-05
5550.00000  5600.00000  2.191649239931e-05
5600.00000  5650.00000  2.432931725061e-05
5650.00000  5700.00000  2.251969861214e-05
5700.00000  5750.00000  2.392717977539e-05
5750.00000  5800.00000  1.769404890954e-05
5800.00000  5850.00000  1.950366754801e-05
5850.00000  5900.00000  2.533466093865e-05
5900.00000  5950.00000  2.272076734974e-05
5950.00000  6000.00000  2.131328618649e-05
6000.00000  6050.00000  2.071007997366e-05
6050.00000  6100.00000  2.372611103779e-05
6100.00000  6150.00000  2.312290482496e-05
6150.00000  6200.00000  2.533466093865e-05
6200.00000  6250.00000  2.613893588909e-05
6250.00000  6300.00000  2.694321083952e-05
6300.00000  6350.00000  3.619237276950e-05
6350.00000  6400.00000  3.088415809664e-04
6400.00000  6450.00000  2.251969861214e-05
6450.00000  6500.00000  2.211756113692e-05
6500.00000  6550.00000  2.312290482496e-05
6550.00000  6600.00000  2.211756113692e-05
6600.00000  6650.00000  1.688977395910e-05
6650.00000  6700.00000  2.292183608735e-05
6700.00000  6750.00000  2.151435492409e-05
6750.00000  6800.00000  1.769404890954e-05
6800.00000  6850.00000  1.930259881040e-05
6850.00000  6900.00000  2.171542366170e-05
6900.00000  6950.00000  2.412824851300e-05
6950.00000  7000.00000  2.272076734974e-05
7000.00000  7050.00000  2.231862987453e-05
7050.00000  7100.00000  4.966397818926e-05
7100.00000  7150.00000  1.347160541976e-05
7150.00000  7200.00000  1.487908658302e-05
7200.00000  7250.00000  1.045557435563e-05
7250.00000  7300.00000  1.266733046933e-05
7300.00000  7350.00000  1.407481163259e-05
7350.00000  7400.00000  1.367267415737e-05
7400.00000  7450.00000  1.166198678128e-05
7450.00000  7500.00000  2.050901123605e-05
7500.00000  7550.00000  1.266733046933e-05
7550.00000  7600.00000  1.367267415737e-05
7600.00000  7650.00000  1.367267415737e-05
7650.00000  7700.00000  1.206412425650e-05
7700.00000  7750.00000  1.407481163259e-05
7750.00000  7800.00000  9.651299405201e-06
7800.00000  7850.00000  1.125984930607e-05
7850.00000  7900.00000  1.327053668215e-05
7900.00000  7950.00000  1.407481163259e-05
7950.00000  8000.00000  1.467801784541e-05
8000.00000  8050.00000  1.487908658302e-05
8050.00000  8100.00000  1.306946794454e-05
8100.00000  8150.00000  1.186305551889e-05
8150.00000  8200.00000  1.447694910780e-05
8200.00000  8250.00000  1.226519299411e-05
8250.00000  8300.00000  1.528122405824e-05
8300.00000  8350.00000  1.166198678128e-05
8350.00000  8400.00000  1.266733046933e-05
8400.00000  8450.00000  1.246626173172e-05
8450.00000  8500.00000  1.327053668215e-05
8500.00000  8550.00000  1.266733046933e-05
8550.00000  8600.00000  1.588443027106e-05
8600.00000  8650.00000  9.450230667593e-06
8650.00000  8700.00000  1.487908658302e-05
8700.00000  8750.00000  1.286839920694e-05
8750.00000  8800.00000  1.327053668215e-05
8800.00000  8850.00000  1.125984930607e-05
8850.00000  8900.00000  1.427588037019e-05
8900.00000  8950.00000  1.467801784541e-05
8950.00000  9000.00000  1.447694910780e-05
9000.00000  9050.00000  1.146091804368e-05
9050.00000  9100.00000  1.286839920694e-05
9100.00000  9150.00000  1.065664309324e-05
9150.00000  9200.00000  1.186305551889e-05
9200.00000  9250.00000  1.045557435563e-05
9250.00000  9300.00000  1.427588037019e-05
9300.00000  9350.00000  1.186305551889e-05
9350.00000  9400.00000  1.246626173172e-05
9400.00000  9450.00000  1.206412425650e-05
9450.00000  9500.00000  1.226519299411e-05
9500.00000  9550.00000  1.487908658302e-05
9550.00000  9600.00000  1.407481163259e-05
9600.00000  9650.00000  1.125984930607e-05
9650.00000  9700.00000  1.246626173172e-05
9700.00000  9750.00000  1.407481163259e-05
9750.00000  9800.00000  1.487908658302e-05
9800.00000  9850.00000  1.286839920694e-05
9850.00000  9900.00000  1.487908658302e-05
9900.00000  9950.00000  1.327053668215e-05
9950.00000  10000.00000  1.045557435563e-05
