300.00000  350.00000  7.809879661504e-05
350.00000  400.00000  1.020998902089e-04
400.00000  450.00000  9.714728359432e-05
450.00000  500.00000  8.990885854220e-05
500.00000  550.00000  8.381334270883e-05
550.00000  600.00000  5.257382406281e-05
600.00000  650.00000  6.057418859411e-05
650.00000  700.00000  4.533539901068e-05
700.00000  750.00000  4.266861083358e-05
750.00000  800.00000  3.466824630229e-05
800.00000  850.00000  5.371673328157e-05
850.00000  900.00000  3.543018578146e-05
900.00000  950.00000  3.923988317731e-05
950.00000  1000.00000  3.200145812519e-05
1000.00000  1050.00000  3.390630682312e-05
1050.00000  1100.00000  3.504921604187e-05
1100.00000  1150.00000  3.314436734394e-05
1150.00000  1200.00000  3.238242786477e-05
1200.00000  1250.00000  3.085854890643e-05
1250.00000  1300.00000  3.885891343773e-05
1300.00000  1350.00000  2.857273046892e-05
1350.00000  1400.00000  2.895370020850e-05
1400.00000  1450.00000  2.628691203140e-05
1450.00000  1500.00000  3.009660942726e-05
1500.00000  1550.00000  3.200145812519e-05
1550.00000  1600.00000  2.628691203140e-05
1600.00000  1650.00000  3.238242786477e-05
1650.00000  1700.00000  3.047757916685e-05
1700.00000  1750.00000  5.676449119825e-05
1750.00000  1800.00000  2.590594229182e-05
1800.00000  1850.00000  2.552497255223e-05
1850.00000  1900.00000  2.704885151058e-05
1900.00000  1950.00000  2.666788177099e-05
1950.00000  2000.00000  2.781079098975e-05
2000.00000  2050.00000  2.781079098975e-05
2050.00000  2100.00000  3.314436734394e-05
2100.00000  2150.00000  2.362012385431e-05
2150.00000  2200.00000  1.790557776052e-05
2200.00000  2250.00000  2.476303307306e-05
2250.00000  2300.00000  2.438206333348e-05
2300.00000  2350.00000  7.009843208375e-05
2350.00000  2400.00000  3.581115552104e-05
2400.00000  2450.00000  3.238242786477e-05
2450.00000  2500.00000  2.476303307306e-05
2500.00000  2550.00000  2.666788177099e-05
2550.00000  2600.00000  2.666788177099e-05
2600.00000  2650.00000  3.200145812519e-05
2650.00000  2700.00000  2.400109359389e-05
2700.00000  2750.00000  2.666788177099e-05
2750.00000  2800.00000  3.085854890643e-05
2800.00000  2850.00000  2.400109359389e-05
2850.00000  2900.00000  2.666788177099e-05
2900.00000  2950.00000  2.171527515638e-05
2950.00000  3000.00000  4.533539901068e-05
3000.00000  3050.00000  3.047757916685e-05
3050.00000  3100.00000  2.895370020850e-05
3100.00000  3150.00000  2.819176072933e-05
3150.00000  3200.00000  3.314436734394e-05
3200.00000  3250.00000  3.123951864602e-05
3250.00000  3300.00000  3.314436734394e-05
3300.00000  3350.00000  2.971563968767e-05
3350.00000  3400.00000  3.543018578146e-05
3400.00000  3450.00000  3.695406473980e-05
3450.00000  3500.00000  3.581115552104e-05
3500.00000  3550.00000  2.933466994809e-05
3550.00000  3600.00000  3.543018578146e-05
3600.00000  3650.00000  3.619212526063e-05
3650.00000  3700.00000  4.952606614612e-05
3700.00000  3750.00000  3.885891343773e-05
3750.00000  3800.00000  3.428727656270e-05
3800.00000  3850.00000  3.923988317731e-05
3850.00000  3900.00000  4.000182265649e-05
3900.00000  3950.00000  3.123951864602e-05
3950.00000  4000.00000  3.543018578146e-05
4000.00000  4050.00000  3.657309500022e-05
4050.00000  4100.00000  3.581115552104e-05
4100.00000  4150.00000  3.962085291690e-05
4150.00000  4200.00000  4.038279239607e-05
4200.00000  4250.00000  3.771600421897e-05
4250.00000  4300.00000  4.266861083358e-05
4300.00000  4350.00000  4.343055031276e-05
4350.00000  4400.00000  5.104994510447e-05
4400.00000  4450.00000  4.952606614612e-05
4450.00000  4500.00000  4.647830822944e-05
4500.00000  4550.00000  3.962085291690e-05
4550.00000  4600.00000  4.381152005234e-05
4600.00000  4650.00000  4.990703588571e-05
4650.00000  4700.00000  5.409770302115e-05
4700.00000  4750.00000  4.419248979193e-05
4750.00000  4800.00000  4.952606614612e-05
4800.00000  4850.00000  4.685927796903e-05
4850.00000  4900.00000  5.524061223991e-05
4900.00000  4950.00000  4.266861083358e-05
4950.00000  5000.00000  5.066897536488e-05
5000.00000  5050.00000  5.066897536488e-05
5050.00000  5100.00000  5.600255171908e-05
5100.00000  5150.00000  5.295479380239e-05
5150.00000  5200.00000  4.876412666695e-05
5200.00000  5250.00000  4.838315692737e-05
5250.00000  5300.00000  4.914509640654e-05
5300.00000  5350.00000  5.181188458364e-05
5350.00000  5400.00000  5.828837015659e-05
5400.00000  5450.00000  5.600255171908e-05
5450.00000  5500.00000  4.990703588571e-05
5500.00000  5550.00000  5.447867276074e-05
5550.00000  5600.00000  5.143091484405e-05
5600.00000  5650.00000  5.524061223991e-05
5650.00000  5700.00000  5.714546093784e-05
5700.00000  5750.00000  5.447867276074e-05
5750.00000  5800.00000  5.104994510447e-05
5800.00000  5850.00000  5.524061223991e-05
5850.00000  5900.00000  5.714546093784e-05
5900.00000  5950.00000  5.905030963576e-05
5950.00000  6000.00000  5.104994510447e-05
6000.00000  6050.00000  5.866933989618e-05
6050.00000  6100.00000  5.866933989618e-05
6100.00000  6150.00000  5.600255171908e-05
6150.00000  6200.00000  6.247903729203e-05
6200.00000  6250.00000  5.790740041701e-05
6250.00000  6300.00000  7.657491765670e-05
6300.00000  6350.00000  7.733685713587e-05
6350.00000  6400.00000  5.691687909408e-04
6400.00000  6450.00000  6.019321885452e-05
6450.00000  6500.00000  4.685927796903e-05
6500.00000  6550.00000  5.676449119825e-05
6550.00000  6600.00000  4.990703588571e-05
6600.00000  6650.00000  5.371673328157e-05
6650.00000  6700.00000  5.333576354198e-05
6700.00000  6750.00000  5.981224911494e-05
6750.00000  6800.00000  5.600255171908e-05
6800.00000  6850.00000  5.790740041701e-05
6850.00000  6900.00000  5.562158197949e-05
6900.00000  6950.00000  5.333576354198e-05
6950.00000  7000.00000  5.181188458364e-05
7000.00000  7050.00000  4.914509640654e-05
7050.00000  7100.00000  1.188625587507e-04
7100.00000  7150.00000  2.704885151058e-05
7150.00000  7200.00000  3.238242786477e-05
7200.00000  7250.00000  2.895370020850e-05
7250.00000  7300.00000  3.085854890643e-05
7300.00000  7350.00000  3.200145812519e-05
7350.00000  7400.00000  3.276339760436e-05
7400.00000  7450.00000  3.543018578146e-05
7450.00000  7500.00000  4.724024770861e-05
7500.00000  7550.00000  3.352533708353e-05
7550.00000  7600.00000  2.742982125016e-05
7600.00000  7650.00000  3.543018578146e-05
7650.00000  7700.00000  3.390630682312e-05
7700.00000  7750.00000  2.933466994809e-05
7750.00000  7800.00000  3.428727656270e-05
7800.00000  7850.00000  3.162048838560e-05
7850.00000  7900.00000  3.619212526063e-05
7900.00000  7950.00000  2.704885151058e-05
7950.00000  8000.00000  3.200145812519e-05
8000.00000  8050.00000  3.238242786477e-05
8050.00000  8100.00000  3.619212526063e-05
8100.00000  8150.00000  2.819176072933e-05
8150.00000  8200.00000  3.657309500022e-05
8200.00000  8250.00000  2.704885151058e-05
8250.00000  8300.00000  3.162048838560e-05
8300.00000  8350.00000  2.895370020850e-05
8350.00000  8400.00000  3.085854890643e-05
8400.00000  8450.00000  3.123951864602e-05
8450.00000  8500.00000  2.552497255223e-05
8500.00000  8550.00000  3.314436734394e-05
8550.00000  8600.00000  3.581115552104e-05
8600.00000  8650.00000  2.742982125016e-05
8650.00000  8700.00000  3.085854890643e-05
8700.00000  8750.00000  2.552497255223e-05
8750.00000  8800.00000  2.933466994809e-05
8800.00000  8850.00000  2.704885151058e-05
8850.00000  8900.00000  2.476303307306e-05
8900.00000  8950.00000  2.552497255223e-05
8950.00000  9000.00000  2.552497255223e-05
9000.00000  9050.00000  2.933466994809e-05
9050.00000  9100.00000  2.819176072933e-05
9100.00000  9150.00000  2.971563968767e-05
9150.00000  9200.00000  2.133430541679e-05
9200.00000  9250.00000  3.276339760436e-05
9250.00000  9300.00000  2.628691203140e-05
9300.00000  9350.00000  4.076376213566e-05
9350.00000  9400.00000  2.590594229182e-05
9400.00000  9450.00000  3.162048838560e-05
9450.00000  9500.00000  3.200145812519e-05
9500.00000  9550.00000  2.704885151058e-05
9550.00000  9600.00000  2.704885151058e-05
9600.00000  9650.00000  3.085854890643e-05
9650.00000  9700.00000  3.009660942726e-05
9700.00000  9750.00000  2.933466994809e-05
9750.00000  9800.00000  2.666788177099e-05
9800.00000  9850.00000  3.009660942726e-05
9850.00000  9900.00000  3.123951864602e-05
9900.00000  9950.00000  3.123951864602e-05
9950.00000  10000.00000  2.666788177099e-05
