10001.00000  11001.00000  3.553327943747e-04
11001.00000  12001.00000  3.335107588468e-04
12001.00000  13001.00000  3.134401228493e-04
13001.00000  14001.00000  2.857398268287e-04
14001.00000  15001.00000  2.647431634934e-04
15001.00000  16001.00000  2.409784836588e-04
16001.00000  17001.00000  2.182404863076e-04
17001.00000  18001.00000  1.994683016861e-04
18001.00000  19001.00000  1.828501371767e-04
19001.00000  20001.00000  1.660205968618e-04
20001.00000  21001.00000  1.485971911890e-04
21001.00000  22001.00000  1.378170251141e-04
22001.00000  23001.00000  1.272079727864e-04
23001.00000  24001.00000  1.139617556487e-04
24001.00000  25001.00000  1.059093440148e-04
25001.00000  26001.00000  9.852125634070e-05
26001.00000  27001.00000  8.971393111613e-05
27001.00000  28001.00000  8.254728476196e-05
28001.00000  29001.00000  7.680994147281e-05
29001.00000  30001.00000  7.129403950359e-05
30001.00000  31001.00000  6.497289637099e-05
31001.00000  32001.00000  5.968850123624e-05
32001.00000  33001.00000  5.533013343940e-05
33001.00000  34001.00000  5.176694129140e-05
34001.00000  35001.00000  4.855604215238e-05
35001.00000  36001.00000  4.565717396418e-05
36001.00000  37001.00000  4.271804371781e-05
37001.00000  38001.00000  3.949707906425e-05
38001.00000  39001.00000  3.751417269941e-05
39001.00000  40001.00000  3.531989052917e-05
40001.00000  41001.00000  3.258207057365e-05
41001.00000  42001.00000  3.077027795602e-05
42001.00000  43001.00000  2.842501306765e-05
43001.00000  44001.00000  2.799219594233e-05
44001.00000  45001.00000  2.395592461084e-05
45001.00000  46001.00000  2.414716938714e-05
46001.00000  47001.00000  2.213406647867e-05
47001.00000  48001.00000  2.112751502443e-05
48001.00000  49001.00000  1.957742578491e-05
49001.00000  50001.00000  1.858093984521e-05
50001.00000  51001.00000  1.814812271989e-05
51001.00000  52001.00000  1.670875414033e-05
52001.00000  53001.00000  1.605449569508e-05
53001.00000  54001.00000  1.547069585162e-05
54001.00000  55001.00000  1.423263756291e-05
55001.00000  56001.00000  1.387027903938e-05
56001.00000  57001.00000  1.200815884904e-05
57001.00000  58001.00000  1.212894502355e-05
58001.00000  59001.00000  1.149481760738e-05
59001.00000  60001.00000  1.128344180199e-05
60001.00000  61001.00000  1.046813512406e-05
61001.00000  62001.00000  9.622631902504e-06
62001.00000  63001.00000  9.532042271622e-06
63001.00000  64001.00000  9.360928524402e-06
64001.00000  65001.00000  8.666408020979e-06
65001.00000  66001.00000  7.971887517555e-06
66001.00000  67001.00000  7.146515325081e-06
67001.00000  68001.00000  7.216973926878e-06
68001.00000  69001.00000  6.733829228844e-06
69001.00000  70001.00000  6.270815559895e-06
70001.00000  71001.00000  6.321143132607e-06
71001.00000  72001.00000  5.515901969218e-06
72001.00000  73001.00000  5.848063949116e-06
73001.00000  74001.00000  5.415246823794e-06
74001.00000  75001.00000  5.183739989320e-06
75001.00000  76001.00000  5.042822785726e-06
76001.00000  77001.00000  4.811315951252e-06
77001.00000  78001.00000  3.985943758778e-06
78001.00000  79001.00000  4.388564340472e-06
79001.00000  80001.00000  3.623585235252e-06
80001.00000  81001.00000  3.875223098812e-06
81001.00000  82001.00000  3.744371409761e-06
82001.00000  83001.00000  3.824895526100e-06
83001.00000  84001.00000  3.382012886236e-06
84001.00000  85001.00000  2.828409586405e-06
85001.00000  86001.00000  2.999523333626e-06
86001.00000  87001.00000  3.039785391795e-06
87001.00000  88001.00000  2.808278557321e-06
88001.00000  89001.00000  2.838475100948e-06
89001.00000  90001.00000  2.526444150134e-06
90001.00000  91001.00000  2.546575179219e-06
91001.00000  92001.00000  2.445920033795e-06
92001.00000  93001.00000  2.315068344745e-06
93001.00000  94001.00000  2.093627024813e-06
94001.00000  95001.00000  2.003037393931e-06
95001.00000  96001.00000  1.912447763050e-06
96001.00000  97001.00000  2.013102908474e-06
97001.00000  98001.00000  2.043299452101e-06
98001.00000  99001.00000  1.922513277592e-06
99001.00000  100001.00000  1.872185704880e-06
100001.00000  101001.00000  1.640678870406e-06
101001.00000  102001.00000  1.660809899491e-06
102001.00000  103001.00000  1.429303065016e-06
103001.00000  104001.00000  1.620547841321e-06
104001.00000  105001.00000  1.540023724982e-06
105001.00000  106001.00000  1.590351297694e-06
106001.00000  107001.00000  1.157534172372e-06
107001.00000  108001.00000  1.026682483322e-06
108001.00000  109001.00000  1.177665201457e-06
109001.00000  110001.00000  1.197796230542e-06
110001.00000  111001.00000  9.763549106097e-07
111001.00000  112001.00000  1.077010056033e-06
112001.00000  113001.00000  9.662893960673e-07
113001.00000  114001.00000  9.864204251521e-07
114001.00000  115001.00000  8.756997651860e-07
115001.00000  116001.00000  8.857652797284e-07
116001.00000  117001.00000  7.347825615929e-07
117001.00000  118001.00000  7.347825615929e-07
118001.00000  119001.00000  7.146515325081e-07
119001.00000  120001.00000  8.756997651860e-07
120001.00000  121001.00000  7.750446197623e-07
121001.00000  122001.00000  7.045860179658e-07
122001.00000  123001.00000  6.441929307116e-07
123001.00000  124001.00000  5.536032998302e-07
124001.00000  125001.00000  6.139963870844e-07
125001.00000  126001.00000  5.234067562031e-07
126001.00000  127001.00000  5.737343289150e-07
127001.00000  128001.00000  5.133412416608e-07
128001.00000  129001.00000  4.831446980337e-07
129001.00000  130001.00000  5.536032998302e-07
130001.00000  131001.00000  4.529481544066e-07
131001.00000  132001.00000  3.522930089829e-07
132001.00000  133001.00000  6.139963870844e-07
133001.00000  134001.00000  4.730791834913e-07
134001.00000  135001.00000  4.126860962371e-07
135001.00000  136001.00000  3.824895526100e-07
136001.00000  137001.00000  3.623585235252e-07
137001.00000  138001.00000  3.724240380676e-07
138001.00000  139001.00000  3.220964653558e-07
139001.00000  140001.00000  4.227516107795e-07
140001.00000  141001.00000  3.925550671524e-07
141001.00000  142001.00000  3.220964653558e-07
142001.00000  143001.00000  2.315068344745e-07
143001.00000  144001.00000  2.717688926439e-07
144001.00000  145001.00000  2.818344071863e-07
145001.00000  146001.00000  2.415723490168e-07
146001.00000  147001.00000  3.623585235252e-07
147001.00000  148001.00000  2.717688926439e-07
148001.00000  149001.00000  2.717688926439e-07
149001.00000  150001.00000  2.315068344745e-07
150001.00000  151001.00000  2.717688926439e-07
151001.00000  152001.00000  1.610482326779e-07
152001.00000  153001.00000  2.315068344745e-07
153001.00000  154001.00000  1.811792617626e-07
154001.00000  155001.00000  3.422274944405e-07
155001.00000  156001.00000  1.409172035932e-07
156001.00000  157001.00000  1.409172035932e-07
157001.00000  158001.00000  1.207861745084e-07
158001.00000  159001.00000  1.610482326779e-07
159001.00000  160001.00000  2.516378635592e-07
160001.00000  161001.00000  1.711137472203e-07
161001.00000  162001.00000  1.912447763050e-07
162001.00000  163001.00000  1.509827181355e-07
163001.00000  164001.00000  1.811792617626e-07
164001.00000  165001.00000  1.207861745084e-07
165001.00000  166001.00000  1.107206599660e-07
166001.00000  167001.00000  9.058963088131e-08
167001.00000  168001.00000  1.207861745084e-07
168001.00000  169001.00000  1.107206599660e-07
169001.00000  170001.00000  8.052411633894e-08
170001.00000  171001.00000  1.409172035932e-07
171001.00000  172001.00000  1.509827181355e-07
172001.00000  173001.00000  1.107206599660e-07
173001.00000  174001.00000  1.207861745084e-07
174001.00000  175001.00000  1.006551454237e-07
175001.00000  176001.00000  1.006551454237e-07
176001.00000  177001.00000  6.039308725421e-08
177001.00000  178001.00000  1.107206599660e-07
178001.00000  179001.00000  9.058963088131e-08
179001.00000  180001.00000  9.058963088131e-08
180001.00000  181001.00000  1.207861745084e-07
181001.00000  182001.00000  1.107206599660e-07
182001.00000  183001.00000  7.045860179658e-08
183001.00000  184001.00000  6.039308725421e-08
184001.00000  185001.00000  3.019654362710e-08
185001.00000  186001.00000  8.052411633894e-08
186001.00000  187001.00000  8.052411633894e-08
187001.00000  188001.00000  3.019654362710e-08
188001.00000  189001.00000  1.006551454237e-07
189001.00000  190001.00000  3.019654362710e-08
190001.00000  191001.00000  6.039308725421e-08
191001.00000  192001.00000  3.019654362710e-08
192001.00000  193001.00000  8.052411633894e-08
193001.00000  194001.00000  4.026205816947e-08
194001.00000  195001.00000  4.026205816947e-08
195001.00000  196001.00000  2.013102908474e-08
196001.00000  197001.00000  4.026205816947e-08
197001.00000  198001.00000  5.032757271184e-08
198001.00000  199001.00000  4.026205816947e-08
