300.00000  350.00000  6.212481011706e-05
350.00000  400.00000  5.649537748510e-05
400.00000  450.00000  5.750063331223e-05
450.00000  500.00000  5.991324729736e-05
500.00000  550.00000  8.001836384010e-05
550.00000  600.00000  5.026279135685e-05
600.00000  650.00000  8.082256850181e-05
650.00000  700.00000  1.202285969256e-04
700.00000  750.00000  1.664703649739e-04
750.00000  800.00000  2.384466821969e-04
800.00000  850.00000  3.269091949849e-04
850.00000  900.00000  3.230892228418e-04
900.00000  950.00000  3.602836884459e-04
950.00000  1000.00000  4.210011404049e-04
1000.00000  1050.00000  4.547777361967e-04
1050.00000  1100.00000  4.778986202209e-04
1100.00000  1150.00000  5.054426298844e-04
1150.00000  1200.00000  5.084583973659e-04
1200.00000  1250.00000  5.056436810499e-04
1250.00000  1300.00000  4.935806111242e-04
1300.00000  1350.00000  4.459314849179e-04
1350.00000  1400.00000  4.555819408585e-04
1400.00000  1450.00000  4.382915406317e-04
1450.00000  1500.00000  4.057212518325e-04
1500.00000  1550.00000  4.085359681484e-04
1550.00000  1600.00000  3.725478095369e-04
1600.00000  1650.00000  3.707383490481e-04
1650.00000  1700.00000  3.452048510388e-04
1700.00000  1750.00000  3.407817253994e-04
1750.00000  1800.00000  3.090156412619e-04
1800.00000  1850.00000  2.700117151690e-04
1850.00000  1900.00000  2.613665150556e-04
1900.00000  1950.00000  2.573454917471e-04
1950.00000  2000.00000  2.434729613326e-04
2000.00000  2050.00000  2.277909704292e-04
2050.00000  2100.00000  2.127121330222e-04
2100.00000  2150.00000  1.928080676449e-04
2150.00000  2200.00000  1.962259374571e-04
2200.00000  2250.00000  1.972311932843e-04
2250.00000  2300.00000  1.664703649739e-04
2300.00000  2350.00000  1.938133234720e-04
2350.00000  2400.00000  1.483757600854e-04
2400.00000  2450.00000  1.632535463270e-04
2450.00000  2500.00000  1.481747089200e-04
2500.00000  2550.00000  1.399316111375e-04
2550.00000  2600.00000  1.248527737304e-04
2600.00000  2650.00000  1.276674900464e-04
2650.00000  2700.00000  1.107791921505e-04
2700.00000  2750.00000  1.123876014739e-04
2750.00000  2800.00000  1.103770898196e-04
2800.00000  2850.00000  1.065571176765e-04
2850.00000  2900.00000  9.710771290143e-05
2900.00000  2950.00000  9.931927572113e-05
2950.00000  3000.00000  1.043455548568e-04
3000.00000  3050.00000  9.167933143489e-05
3050.00000  3100.00000  8.263202899066e-05
3100.00000  3150.00000  7.479103353899e-05
3150.00000  3200.00000  8.102361966724e-05
3200.00000  3250.00000  8.182782432895e-05
3250.00000  3300.00000  8.001836384010e-05
3300.00000  3350.00000  7.539418703527e-05
3350.00000  3400.00000  7.217736838843e-05
3400.00000  3450.00000  6.956370323788e-05
3450.00000  3500.00000  6.795529391446e-05
3500.00000  3550.00000  7.036790789958e-05
3550.00000  3600.00000  6.735214041817e-05
3600.00000  3650.00000  6.373321944048e-05
3650.00000  3700.00000  7.499208470441e-05
3700.00000  3750.00000  6.373321944048e-05
3750.00000  3800.00000  6.292901477877e-05
3800.00000  3850.00000  6.111955428993e-05
3850.00000  3900.00000  6.292901477877e-05
3900.00000  3950.00000  6.031534962822e-05
3950.00000  4000.00000  6.192375895163e-05
4000.00000  4050.00000  5.810378680851e-05
4050.00000  4100.00000  5.207225184569e-05
4100.00000  4150.00000  5.850588913937e-05
4150.00000  4200.00000  5.689747981595e-05
4200.00000  4250.00000  5.428381466539e-05
4250.00000  4300.00000  5.267540534197e-05
4300.00000  4350.00000  6.252691244792e-05
4350.00000  4400.00000  5.770168447766e-05
4400.00000  4450.00000  6.031534962822e-05
4450.00000  4500.00000  5.689747981595e-05
4500.00000  4550.00000  5.830483797394e-05
4550.00000  4600.00000  5.528907049253e-05
4600.00000  4650.00000  5.890799147022e-05
4650.00000  4700.00000  5.951114496651e-05
4700.00000  4750.00000  5.267540534197e-05
4750.00000  4800.00000  5.006174019142e-05
4800.00000  4850.00000  5.890799147022e-05
4850.00000  4900.00000  5.488696816168e-05
4900.00000  4950.00000  5.629432631967e-05
4950.00000  5000.00000  5.528907049253e-05
5000.00000  5050.00000  5.689747981595e-05
5050.00000  5100.00000  5.347961000368e-05
5100.00000  5150.00000  5.167014951484e-05
5150.00000  5200.00000  6.232586128249e-05
5200.00000  5250.00000  6.473847526762e-05
5250.00000  5300.00000  5.689747981595e-05
5300.00000  5350.00000  6.172270778621e-05
5350.00000  5400.00000  6.514057759847e-05
5400.00000  5450.00000  7.217736838843e-05
5450.00000  5500.00000  5.669642865052e-05
5500.00000  5550.00000  5.830483797394e-05
5550.00000  5600.00000  5.870694030480e-05
5600.00000  5650.00000  5.770168447766e-05
5650.00000  5700.00000  6.031534962822e-05
5700.00000  5750.00000  6.292901477877e-05
5750.00000  5800.00000  6.534162876390e-05
5800.00000  5850.00000  6.192375895163e-05
5850.00000  5900.00000  7.438893120813e-05
5900.00000  5950.00000  6.815634507988e-05
5950.00000  6000.00000  6.835739624531e-05
6000.00000  6050.00000  6.835739624531e-05
6050.00000  6100.00000  6.715108925275e-05
6100.00000  6150.00000  7.398682887728e-05
6150.00000  6200.00000  8.243097782523e-05
6200.00000  6250.00000  1.021339920371e-04
6250.00000  6300.00000  1.330958715129e-04
6300.00000  6350.00000  1.326937691821e-04
6350.00000  6400.00000  8.641179090069e-04
6400.00000  6450.00000  7.237841955386e-05
6450.00000  6500.00000  7.197631722300e-05
6500.00000  6550.00000  6.956370323788e-05
6550.00000  6600.00000  6.956370323788e-05
6600.00000  6650.00000  7.177526605758e-05
6650.00000  6700.00000  7.016685673416e-05
6700.00000  6750.00000  7.338367538100e-05
6750.00000  6800.00000  6.674898692189e-05
6800.00000  6850.00000  6.172270778621e-05
6850.00000  6900.00000  7.479103353899e-05
6900.00000  6950.00000  7.840995451668e-05
6950.00000  7000.00000  8.142572199809e-05
7000.00000  7050.00000  6.715108925275e-05
7050.00000  7100.00000  1.584283183568e-04
7100.00000  7150.00000  3.639026094236e-05
7150.00000  7200.00000  2.915241898697e-05
7200.00000  7250.00000  3.880287492749e-05
7250.00000  7300.00000  3.357554462637e-05
7300.00000  7350.00000  3.578710744607e-05
7350.00000  7400.00000  3.900392609291e-05
7400.00000  7450.00000  3.739551676949e-05
7450.00000  7500.00000  6.011429846279e-05
7500.00000  7550.00000  3.136398180667e-05
7550.00000  7600.00000  3.578710744607e-05
7600.00000  7650.00000  3.277133996466e-05
7650.00000  7700.00000  3.417869812266e-05
7700.00000  7750.00000  3.558605628065e-05
7750.00000  7800.00000  3.518395394979e-05
7800.00000  7850.00000  3.960707958919e-05
7850.00000  7900.00000  3.920497725834e-05
7900.00000  7950.00000  3.920497725834e-05
7950.00000  8000.00000  3.659131210778e-05
8000.00000  8050.00000  4.041128425090e-05
8050.00000  8100.00000  4.101443774719e-05
8100.00000  8150.00000  3.478185161894e-05
8150.00000  8200.00000  4.061233541633e-05
8200.00000  8250.00000  4.141654007804e-05
8250.00000  8300.00000  4.101443774719e-05
8300.00000  8350.00000  3.679236327321e-05
8350.00000  8400.00000  4.121548891261e-05
8400.00000  8450.00000  3.819972143120e-05
8450.00000  8500.00000  3.900392609291e-05
8500.00000  8550.00000  3.779761910035e-05
8550.00000  8600.00000  3.055977714496e-05
8600.00000  8650.00000  3.840077259663e-05
8650.00000  8700.00000  3.980813075462e-05
8700.00000  8750.00000  3.639026094236e-05
8750.00000  8800.00000  3.900392609291e-05
8800.00000  8850.00000  3.739551676949e-05
8850.00000  8900.00000  4.403020522860e-05
8900.00000  8950.00000  3.759656793492e-05
8950.00000  9000.00000  4.181864240890e-05
9000.00000  9050.00000  3.498290278437e-05
9050.00000  9100.00000  4.423125639402e-05
9100.00000  9150.00000  3.940602842377e-05
9150.00000  9200.00000  4.262284707061e-05
9200.00000  9250.00000  4.242179590518e-05
9250.00000  9300.00000  4.000918192005e-05
9300.00000  9350.00000  4.322600056689e-05
9350.00000  9400.00000  4.061233541633e-05
9400.00000  9450.00000  3.719446560407e-05
9450.00000  9500.00000  3.960707958919e-05
9500.00000  9550.00000  3.920497725834e-05
9550.00000  9600.00000  3.980813075462e-05
9600.00000  9650.00000  4.423125639402e-05
9650.00000  9700.00000  3.900392609291e-05
9700.00000  9750.00000  4.543756338659e-05
9750.00000  9800.00000  4.242179590518e-05
9800.00000  9850.00000  4.362810289774e-05
9850.00000  9900.00000  3.960707958919e-05
9900.00000  9950.00000  4.282389823603e-05
9950.00000  10000.00000  3.880287492749e-05
