300.00000  350.00000  7.948806690104e-05
350.00000  400.00000  9.509531291357e-05
400.00000  450.00000  8.783612872169e-05
450.00000  500.00000  7.622143401469e-05
500.00000  550.00000  7.549551559550e-05
550.00000  600.00000  4.827357487597e-05
600.00000  650.00000  4.863653408556e-05
650.00000  700.00000  4.718469724719e-05
700.00000  750.00000  4.246622752247e-05
750.00000  800.00000  3.847367621694e-05
800.00000  850.00000  5.952531037338e-05
850.00000  900.00000  3.738479858816e-05
900.00000  950.00000  4.028847226491e-05
950.00000  1000.00000  3.593296174978e-05
1000.00000  1050.00000  3.266632886344e-05
1050.00000  1100.00000  3.738479858816e-05
1100.00000  1150.00000  3.448112491141e-05
1150.00000  1200.00000  3.339224728263e-05
1200.00000  1250.00000  3.339224728263e-05
1250.00000  1300.00000  5.952531037338e-05
1300.00000  1350.00000  3.375520649222e-05
1350.00000  1400.00000  3.593296174978e-05
1400.00000  1450.00000  3.230336965385e-05
1450.00000  1500.00000  3.411816570181e-05
1500.00000  1550.00000  4.065143147450e-05
1550.00000  1600.00000  3.702183937856e-05
1600.00000  1650.00000  3.919959463613e-05
1650.00000  1700.00000  3.121449202506e-05
1700.00000  1750.00000  9.037684318885e-05
1750.00000  1800.00000  3.484408412100e-05
1800.00000  1850.00000  4.101439068410e-05
1850.00000  1900.00000  3.484408412100e-05
1900.00000  1950.00000  3.339224728263e-05
1950.00000  2000.00000  4.065143147450e-05
2000.00000  2050.00000  3.411816570181e-05
2050.00000  2100.00000  4.319214594166e-05
2100.00000  2150.00000  3.230336965385e-05
2150.00000  2200.00000  4.500694198963e-05
2200.00000  2250.00000  3.629592095938e-05
2250.00000  2300.00000  4.428102357044e-05
2300.00000  2350.00000  1.125173549741e-04
2350.00000  2400.00000  3.919959463613e-05
2400.00000  2450.00000  4.282918673206e-05
2450.00000  2500.00000  4.282918673206e-05
2500.00000  2550.00000  4.464398278003e-05
2550.00000  2600.00000  3.919959463613e-05
2600.00000  2650.00000  4.972541171435e-05
2650.00000  2700.00000  4.609581961841e-05
2700.00000  2750.00000  4.355510515125e-05
2750.00000  2800.00000  4.391806436085e-05
2800.00000  2850.00000  4.500694198963e-05
2850.00000  2900.00000  4.246622752247e-05
2900.00000  2950.00000  4.791061566638e-05
2950.00000  3000.00000  6.642153535566e-05
3000.00000  3050.00000  4.355510515125e-05
3050.00000  3100.00000  5.045133013353e-05
3100.00000  3150.00000  4.899949329516e-05
3150.00000  3200.00000  5.879939195419e-05
3200.00000  3250.00000  4.863653408556e-05
3250.00000  3300.00000  5.299204460069e-05
3300.00000  3350.00000  5.008837092394e-05
3350.00000  3400.00000  5.081428934313e-05
3400.00000  3450.00000  5.081428934313e-05
3450.00000  3500.00000  5.299204460069e-05
3500.00000  3550.00000  5.408092222947e-05
3550.00000  3600.00000  5.625867748703e-05
3600.00000  3650.00000  5.081428934313e-05
3650.00000  3700.00000  8.856204714088e-05
3700.00000  3750.00000  5.988826958297e-05
3750.00000  3800.00000  6.242898405013e-05
3800.00000  3850.00000  6.025122879257e-05
3850.00000  3900.00000  6.242898405013e-05
3900.00000  3950.00000  6.134010642135e-05
3950.00000  4000.00000  5.879939195419e-05
4000.00000  4050.00000  7.368071954753e-05
4050.00000  4100.00000  5.771051432541e-05
4100.00000  4150.00000  6.025122879257e-05
4150.00000  4200.00000  6.134010642135e-05
4200.00000  4250.00000  7.005112745160e-05
4250.00000  4300.00000  5.734755511582e-05
4300.00000  4350.00000  7.005112745160e-05
4350.00000  4400.00000  7.114000508038e-05
4400.00000  4450.00000  6.061418800216e-05
4450.00000  4500.00000  7.186592349957e-05
4500.00000  4550.00000  7.440663796672e-05
4550.00000  4600.00000  7.222888270916e-05
4600.00000  4650.00000  7.985102611063e-05
4650.00000  4700.00000  7.005112745160e-05
4700.00000  4750.00000  7.803623006266e-05
4750.00000  4800.00000  7.404367875713e-05
4800.00000  4850.00000  7.150296428997e-05
4850.00000  4900.00000  7.694735243388e-05
4900.00000  4950.00000  7.549551559550e-05
4950.00000  5000.00000  7.622143401469e-05
5000.00000  5050.00000  7.912510769144e-05
5050.00000  5100.00000  7.985102611063e-05
5100.00000  5150.00000  7.948806690104e-05
5150.00000  5200.00000  7.658439322429e-05
5200.00000  5250.00000  7.476959717632e-05
5250.00000  5300.00000  8.493245504494e-05
5300.00000  5350.00000  8.711021030250e-05
5350.00000  5400.00000  8.783612872169e-05
5400.00000  5450.00000  9.073980239844e-05
5450.00000  5500.00000  9.255459844641e-05
5500.00000  5550.00000  8.892500635047e-05
5550.00000  5600.00000  8.928796556007e-05
5600.00000  5650.00000  8.456949583535e-05
5650.00000  5700.00000  9.110276160804e-05
5700.00000  5750.00000  9.146572081763e-05
5750.00000  5800.00000  8.638429188332e-05
5800.00000  5850.00000  9.328051686560e-05
5850.00000  5900.00000  9.836194579991e-05
5900.00000  5950.00000  8.783612872169e-05
5950.00000  6000.00000  1.034433747342e-04
6000.00000  6050.00000  9.110276160804e-05
6050.00000  6100.00000  8.565837346413e-05
6100.00000  6150.00000  1.067100076206e-04
6150.00000  6200.00000  9.763602738072e-05
6200.00000  6250.00000  1.215913352139e-04
6250.00000  6300.00000  1.782129719105e-04
6300.00000  6350.00000  1.731315429762e-04
6350.00000  6400.00000  1.234061312619e-03
6400.00000  6450.00000  9.037684318885e-05
6450.00000  6500.00000  9.618419054235e-05
6500.00000  6550.00000  9.291755765600e-05
6550.00000  6600.00000  9.872490500950e-05
6600.00000  6650.00000  1.023544971054e-04
6650.00000  6700.00000  1.059840892014e-04
6700.00000  6750.00000  9.945082342869e-05
6750.00000  6800.00000  9.436939449438e-05
6800.00000  6850.00000  1.215913352139e-04
6850.00000  6900.00000  1.030804155246e-04
6900.00000  6950.00000  1.092507220877e-04
6950.00000  7000.00000  8.965092476966e-05
7000.00000  7050.00000  8.856204714088e-05
7050.00000  7100.00000  2.264865467865e-04
7100.00000  7150.00000  5.335500381028e-05
7150.00000  7200.00000  5.408092222947e-05
7200.00000  7250.00000  5.625867748703e-05
7250.00000  7300.00000  5.226612618150e-05
7300.00000  7350.00000  5.807347353500e-05
7350.00000  7400.00000  5.843643274460e-05
7400.00000  7450.00000  5.625867748703e-05
7450.00000  7500.00000  9.799898659032e-05
7500.00000  7550.00000  5.371796301988e-05
7550.00000  7600.00000  6.097714721175e-05
7600.00000  7650.00000  5.625867748703e-05
7650.00000  7700.00000  5.516979985825e-05
7700.00000  7750.00000  5.480684064866e-05
7750.00000  7800.00000  4.391806436085e-05
7800.00000  7850.00000  6.025122879257e-05
7850.00000  7900.00000  5.662163669663e-05
7900.00000  7950.00000  5.589571827744e-05
7950.00000  8000.00000  5.154020776232e-05
8000.00000  8050.00000  5.299204460069e-05
8050.00000  8100.00000  5.662163669663e-05
8100.00000  8150.00000  5.662163669663e-05
8150.00000  8200.00000  5.444388143907e-05
8200.00000  8250.00000  5.662163669663e-05
8250.00000  8300.00000  5.807347353500e-05
8300.00000  8350.00000  6.134010642135e-05
8350.00000  8400.00000  5.698459590622e-05
8400.00000  8450.00000  5.045133013353e-05
8450.00000  8500.00000  5.262908539110e-05
8500.00000  8550.00000  5.879939195419e-05
8550.00000  8600.00000  5.190316697191e-05
8600.00000  8650.00000  6.351786167891e-05
8650.00000  8700.00000  5.589571827744e-05
8700.00000  8750.00000  6.206602484053e-05
8750.00000  8800.00000  5.480684064866e-05
8800.00000  8850.00000  5.335500381028e-05
8850.00000  8900.00000  5.117724855272e-05
8900.00000  8950.00000  6.642153535566e-05
8950.00000  9000.00000  5.190316697191e-05
9000.00000  9050.00000  4.936245250475e-05
9050.00000  9100.00000  5.916235116378e-05
9100.00000  9150.00000  4.936245250475e-05
9150.00000  9200.00000  6.025122879257e-05
9200.00000  9250.00000  5.516979985825e-05
9250.00000  9300.00000  6.351786167891e-05
9300.00000  9350.00000  5.553275906785e-05
9350.00000  9400.00000  5.226612618150e-05
9400.00000  9450.00000  5.444388143907e-05
9450.00000  9500.00000  5.081428934313e-05
9500.00000  9550.00000  5.771051432541e-05
9550.00000  9600.00000  5.371796301988e-05
9600.00000  9650.00000  6.061418800216e-05
9650.00000  9700.00000  5.734755511582e-05
9700.00000  9750.00000  5.879939195419e-05
9750.00000  9800.00000  5.553275906785e-05
9800.00000  9850.00000  5.625867748703e-05
9850.00000  9900.00000  5.480684064866e-05
9900.00000  9950.00000  6.351786167891e-05
9950.00000  10000.00000  5.335500381028e-05
