300.00000  350.00000  8.543946297617e-01
350.00000  400.00000  6.397223637884e-01
400.00000  450.00000  4.964254710589e-01
450.00000  500.00000  3.974756531504e-01
500.00000  550.00000  3.244610746606e-01
550.00000  600.00000  2.703753500151e-01
600.00000  650.00000  2.283638648058e-01
650.00000  700.00000  1.955682620711e-01
700.00000  750.00000  1.690937751002e-01
750.00000  800.00000  1.481148607320e-01
800.00000  850.00000  1.307259476588e-01
850.00000  900.00000  1.158209460186e-01
900.00000  950.00000  1.034857061680e-01
950.00000  1000.00000  9.326529786923e-02
1000.00000  1050.00000  8.396854742475e-02
1050.00000  1100.00000  7.593234083201e-02
1100.00000  1150.00000  6.924636105281e-02
1150.00000  1200.00000  6.373775759243e-02
1200.00000  1250.00000  5.863732658632e-02
1250.00000  1300.00000  5.410450441099e-02
1300.00000  1350.00000  5.003044507864e-02
1350.00000  1400.00000  4.632163302227e-02
1400.00000  1450.00000  4.307426663252e-02
1450.00000  1500.00000  3.995337621452e-02
1500.00000  1550.00000  3.743612111623e-02
1550.00000  1600.00000  3.514728928812e-02
1600.00000  1650.00000  3.291747958016e-02
1650.00000  1700.00000  3.116291291755e-02
1700.00000  1750.00000  2.906264526550e-02
1750.00000  1800.00000  2.760663854832e-02
1800.00000  1850.00000  2.605366691947e-02
1850.00000  1900.00000  2.464403472527e-02
1900.00000  1950.00000  2.338502391560e-02
1950.00000  2000.00000  2.214096026623e-02
2000.00000  2050.00000  2.117016136793e-02
2050.00000  2100.00000  2.007135345581e-02
2100.00000  2150.00000  1.914462951737e-02
2150.00000  2200.00000  1.826542988347e-02
2200.00000  2250.00000  1.742493956213e-02
2250.00000  2300.00000  1.653270907052e-02
2300.00000  2350.00000  1.589496356450e-02
2350.00000  2400.00000  1.523077308257e-02
2400.00000  2450.00000  1.457884693729e-02
2450.00000  2500.00000  1.387019823498e-02
2500.00000  2550.00000  1.347735620152e-02
2550.00000  2600.00000  1.270316995022e-02
2600.00000  2650.00000  1.241495803884e-02
2650.00000  2700.00000  1.201521731602e-02
2700.00000  2750.00000  1.139931765966e-02
2750.00000  2800.00000  1.094477068241e-02
2800.00000  2850.00000  1.061861597951e-02
2850.00000  2900.00000  1.027138194798e-02
2900.00000  2950.00000  9.846346030805e-03
2950.00000  3000.00000  9.489530486269e-03
3000.00000  3050.00000  9.260723955562e-03
3050.00000  3100.00000  8.857533888052e-03
3100.00000  3150.00000  8.591551086862e-03
3150.00000  3200.00000  8.342815009092e-03
3200.00000  3250.00000  8.116691302028e-03
3250.00000  3300.00000  7.817364835559e-03
3300.00000  3350.00000  7.627650877937e-03
3350.00000  3400.00000  7.327174629907e-03
3400.00000  3450.00000  7.090319628271e-03
3450.00000  3500.00000  6.964226917043e-03
3500.00000  3550.00000  6.773746438381e-03
3550.00000  3600.00000  6.506997116150e-03
3600.00000  3650.00000  6.357908773696e-03
3650.00000  3700.00000  6.180459152729e-03
3700.00000  3750.00000  6.006842136967e-03
3750.00000  3800.00000  5.825176650275e-03
3800.00000  3850.00000  5.582189480311e-03
3850.00000  3900.00000  5.459162853248e-03
3900.00000  3950.00000  5.311607552876e-03
3950.00000  4000.00000  5.222307851612e-03
4000.00000  4050.00000  5.143356184400e-03
4050.00000  4100.00000  4.965523302912e-03
4100.00000  4150.00000  4.858976878228e-03
4150.00000  4200.00000  4.739782856369e-03
4200.00000  4250.00000  4.554668024993e-03
4250.00000  4300.00000  4.485681131312e-03
4300.00000  4350.00000  4.368403412056e-03
4350.00000  4400.00000  4.243460482390e-03
4400.00000  4450.00000  4.143812747074e-03
4450.00000  4500.00000  4.112385384397e-03
4500.00000  4550.00000  4.053746524769e-03
4550.00000  4600.00000  3.886261677333e-03
4600.00000  4650.00000  3.750587453095e-03
4650.00000  4700.00000  3.760935487147e-03
4700.00000  4750.00000  3.660521230790e-03
4750.00000  4800.00000  3.554358066626e-03
4800.00000  4850.00000  3.494952685957e-03
4850.00000  4900.00000  3.347780646105e-03
4900.00000  4950.00000  3.437846868410e-03
4950.00000  5000.00000  3.231652708410e-03
5000.00000  5050.00000  3.214022724469e-03
5050.00000  5100.00000  3.123956502164e-03
5100.00000  5150.00000  3.094828702610e-03
5150.00000  5200.00000  2.993647925212e-03
5200.00000  5250.00000  2.977167722833e-03
5250.00000  5300.00000  2.868704995546e-03
5300.00000  5350.00000  2.855674137851e-03
5350.00000  5400.00000  2.812365699041e-03
5400.00000  5450.00000  2.739546200156e-03
5450.00000  5500.00000  2.674391911680e-03
5500.00000  5550.00000  2.569378529077e-03
5550.00000  5600.00000  2.532202258594e-03
5600.00000  5650.00000  2.554814629300e-03
5650.00000  5700.00000  2.444435599411e-03
5700.00000  5750.00000  2.429488439114e-03
5750.00000  5800.00000  2.389246084467e-03
5800.00000  5850.00000  2.364334150638e-03
5850.00000  5900.00000  2.272351625731e-03
5900.00000  5950.00000  2.300329643723e-03
5950.00000  6000.00000  2.188417571753e-03
6000.00000  6050.00000  2.207197337255e-03
6050.00000  6100.00000  2.127095888481e-03
6100.00000  6150.00000  2.060791818444e-03
6150.00000  6200.00000  2.096435046845e-03
6200.00000  6250.00000  1.981073630191e-03
6250.00000  6300.00000  1.945047141269e-03
6300.00000  6350.00000  1.995254269447e-03
6350.00000  6400.00000  2.242457305136e-03
6400.00000  6450.00000  1.890240886845e-03
6450.00000  6500.00000  1.952712351678e-03
6500.00000  6550.00000  1.841183540228e-03
6550.00000  6600.00000  1.829685724614e-03
6600.00000  6650.00000  1.759165788852e-03
6650.00000  6700.00000  1.750734057402e-03
6700.00000  6750.00000  1.699377147662e-03
6750.00000  6800.00000  1.707425618592e-03
6800.00000  6850.00000  1.679447600599e-03
6850.00000  6900.00000  1.666800003424e-03
6900.00000  6950.00000  1.649936540525e-03
6950.00000  7000.00000  1.641504809075e-03
7000.00000  7050.00000  1.547989242086e-03
7050.00000  7100.00000  1.613910051603e-03
7100.00000  7150.00000  1.530742518666e-03
7150.00000  7200.00000  1.476319524762e-03
7200.00000  7250.00000  1.490500164019e-03
7250.00000  7300.00000  1.474403222160e-03
7300.00000  7350.00000  1.401583723275e-03
7350.00000  7400.00000  1.390469168182e-03
7400.00000  7450.00000  1.369389839557e-03
7450.00000  7500.00000  1.387786344539e-03
7500.00000  7550.00000  1.304618811602e-03
7550.00000  7600.00000  1.329530745431e-03
7600.00000  7650.00000  1.334513132197e-03
7650.00000  7700.00000  1.288138609223e-03
7700.00000  7750.00000  1.239847783646e-03
7750.00000  7800.00000  1.222984320747e-03
7800.00000  7850.00000  1.225283883869e-03
7850.00000  7900.00000  1.231032791676e-03
7900.00000  7950.00000  1.184658268702e-03
7950.00000  8000.00000  1.186574571304e-03
8000.00000  8050.00000  1.187341092345e-03
8050.00000  8100.00000  1.176609797772e-03
8100.00000  8150.00000  1.102257256806e-03
8150.00000  8200.00000  1.108389425133e-03
8200.00000  8250.00000  1.122570064389e-03
8250.00000  8300.00000  1.098041391081e-03
8300.00000  8350.00000  1.086160314947e-03
8350.00000  8400.00000  1.087310096508e-03
8400.00000  8450.00000  1.039785791973e-03
8450.00000  8500.00000  1.050900347066e-03
8500.00000  8550.00000  1.034036884166e-03
8550.00000  8600.00000  1.045917960300e-03
8600.00000  8650.00000  1.014107337103e-03
8650.00000  8700.00000  9.600676037199e-04
8700.00000  8750.00000  9.776975876604e-04
8750.00000  8800.00000  9.562349985154e-04
8800.00000  8850.00000  9.424376197793e-04
8850.00000  8900.00000  9.443539223815e-04
8900.00000  8950.00000  9.010454835710e-04
8950.00000  9000.00000  8.949133152439e-04
9000.00000  9050.00000  9.048780887755e-04
9050.00000  9100.00000  9.025785256528e-04
9100.00000  9150.00000  8.945300547234e-04
9150.00000  9200.00000  8.661687762103e-04
9200.00000  9250.00000  8.512216159129e-04
9250.00000  9300.00000  8.370409766564e-04
9300.00000  9350.00000  8.213272953180e-04
9350.00000  9400.00000  8.228603373998e-04
9400.00000  9450.00000  8.232435979203e-04
9450.00000  9500.00000  7.964153614890e-04
9500.00000  9550.00000  8.006312272139e-04
9550.00000  9600.00000  7.707369066190e-04
9600.00000  9650.00000  7.496575779944e-04
9650.00000  9700.00000  7.726532092213e-04
9700.00000  9750.00000  7.600056120465e-04
9750.00000  9800.00000  7.623051751692e-04
9800.00000  9850.00000  7.538734437194e-04
9850.00000  9900.00000  7.143976101133e-04
9900.00000  9950.00000  7.189967363587e-04
9950.00000  10000.00000  7.385430229015e-04
