300.00000  350.00000  1.920806305441e-07
350.00000  400.00000  7.683225221765e-07
400.00000  450.00000  9.604031527206e-07
450.00000  500.00000  1.728725674897e-06
500.00000  550.00000  2.593088512346e-05
550.00000  600.00000  2.304967566530e-06
600.00000  650.00000  7.491144591221e-06
650.00000  700.00000  1.920806305441e-06
700.00000  750.00000  4.994096394147e-06
750.00000  800.00000  3.073290088706e-06
800.00000  850.00000  1.978430494605e-05
850.00000  900.00000  4.033693241427e-06
900.00000  950.00000  3.265370719250e-06
950.00000  1000.00000  3.265370719250e-06
1000.00000  1050.00000  5.570338285780e-06
1050.00000  1100.00000  5.570338285780e-06
1100.00000  1150.00000  5.954499546868e-06
1150.00000  1200.00000  4.802015763603e-06
1200.00000  1250.00000  5.762418916324e-06
1250.00000  1300.00000  2.228135314312e-05
1300.00000  1350.00000  6.146580177412e-06
1350.00000  1400.00000  5.186177024691e-06
1400.00000  1450.00000  7.106983330133e-06
1450.00000  1500.00000  6.338660807956e-06
1500.00000  1550.00000  1.114067657156e-05
1550.00000  1600.00000  6.338660807956e-06
1600.00000  1650.00000  9.027789635574e-06
1650.00000  1700.00000  8.067386482853e-06
1700.00000  1750.00000  3.438243286740e-05
1750.00000  1800.00000  1.037235404938e-05
1800.00000  1850.00000  1.037235404938e-05
1850.00000  1900.00000  1.018027341884e-05
1900.00000  1950.00000  9.604031527206e-06
1950.00000  2000.00000  1.267732161591e-05
2000.00000  2050.00000  1.133275720210e-05
2050.00000  2100.00000  1.171691846319e-05
2100.00000  2150.00000  1.248524098537e-05
2150.00000  2200.00000  1.479020855190e-05
2200.00000  2250.00000  1.286940224646e-05
2250.00000  2300.00000  1.363772476863e-05
2300.00000  2350.00000  5.359049592181e-05
2350.00000  2400.00000  1.440604729081e-05
2400.00000  2450.00000  1.210107972428e-05
2450.00000  2500.00000  1.517436981299e-05
2500.00000  2550.00000  1.671101485734e-05
2550.00000  2600.00000  1.709517611843e-05
2600.00000  2650.00000  1.747933737952e-05
2650.00000  2700.00000  1.344564413809e-05
2700.00000  2750.00000  1.632685359625e-05
2750.00000  2800.00000  1.594269233516e-05
2800.00000  2850.00000  1.690309548788e-05
2850.00000  2900.00000  2.036054683768e-05
2900.00000  2950.00000  1.709517611843e-05
2950.00000  3000.00000  4.033693241427e-05
3000.00000  3050.00000  2.074470809877e-05
3050.00000  3100.00000  2.093678872931e-05
3100.00000  3150.00000  2.727544953727e-05
3150.00000  3200.00000  3.111706214815e-05
3200.00000  3250.00000  2.785169142890e-05
3250.00000  3300.00000  2.746753016781e-05
3300.00000  3350.00000  3.764780358665e-05
3350.00000  3400.00000  3.630323917284e-05
3400.00000  3450.00000  3.803196484774e-05
3450.00000  3500.00000  4.321814187243e-05
3500.00000  3550.00000  4.725183511386e-05
3550.00000  3600.00000  4.878848015821e-05
3600.00000  3650.00000  6.088955988249e-05
3650.00000  3700.00000  9.162246076955e-05
3700.00000  3750.00000  7.164607519296e-05
3750.00000  3800.00000  8.201842924234e-05
3800.00000  3850.00000  8.643628374486e-05
3850.00000  3900.00000  9.392742833608e-05
3900.00000  3950.00000  1.006502504051e-04
3950.00000  4000.00000  1.133275720210e-04
4000.00000  4050.00000  1.198583134595e-04
4050.00000  4100.00000  1.167850233708e-04
4100.00000  4150.00000  1.179375071541e-04
4150.00000  4200.00000  1.486704080412e-04
4200.00000  4250.00000  1.492466499328e-04
4250.00000  4300.00000  1.598110846127e-04
4300.00000  4350.00000  1.628843747014e-04
4350.00000  4400.00000  1.755616963173e-04
4400.00000  4450.00000  1.907360661303e-04
4450.00000  4500.00000  1.978430494605e-04
4500.00000  4550.00000  2.118649354902e-04
4550.00000  4600.00000  2.174352737760e-04
4600.00000  4650.00000  2.147461449483e-04
4650.00000  4700.00000  2.343383692638e-04
4700.00000  4750.00000  2.418295138551e-04
4750.00000  4800.00000  2.612296575400e-04
4800.00000  4850.00000  2.571959642986e-04
4850.00000  4900.00000  2.541226742099e-04
4900.00000  4950.00000  2.789010755501e-04
4950.00000  5000.00000  2.944596066242e-04
5000.00000  5050.00000  3.006061868016e-04
5050.00000  5100.00000  3.092498151760e-04
5100.00000  5150.00000  3.203904917476e-04
5150.00000  5200.00000  3.073290088706e-04
5200.00000  5250.00000  3.336440552552e-04
5250.00000  5300.00000  3.478580219154e-04
5300.00000  5350.00000  3.501629894819e-04
5350.00000  5400.00000  3.436322480434e-04
5400.00000  5450.00000  3.747493101916e-04
5450.00000  5500.00000  3.528521183096e-04
5500.00000  5550.00000  3.701393750585e-04
5550.00000  5600.00000  3.707156169502e-04
5600.00000  5650.00000  3.985673083791e-04
5650.00000  5700.00000  3.789750840636e-04
5700.00000  5750.00000  4.001039534234e-04
5750.00000  5800.00000  3.956860989209e-04
5800.00000  5850.00000  4.014485178372e-04
5850.00000  5900.00000  4.075950980146e-04
5900.00000  5950.00000  4.016405984678e-04
5950.00000  6000.00000  4.018326790983e-04
6000.00000  6050.00000  4.002960340540e-04
6050.00000  6100.00000  4.062505336008e-04
6100.00000  6150.00000  4.308368543105e-04
6150.00000  6200.00000  4.394804826850e-04
6200.00000  6250.00000  5.017146069813e-04
6250.00000  6300.00000  5.800835042433e-04
6300.00000  6350.00000  5.476218776813e-04
6350.00000  6400.00000  2.869876700960e-03
6400.00000  6450.00000  4.143179200837e-04
6450.00000  6500.00000  4.125891944088e-04
6500.00000  6550.00000  4.145100007142e-04
6550.00000  6600.00000  4.074030173841e-04
6600.00000  6650.00000  4.037534854038e-04
6650.00000  6700.00000  4.148941619753e-04
6700.00000  6750.00000  4.081713399063e-04
6750.00000  6800.00000  4.189278552167e-04
6800.00000  6850.00000  4.220011453055e-04
6850.00000  6900.00000  4.229615484582e-04
6900.00000  6950.00000  4.437062565569e-04
6950.00000  7000.00000  4.171991295418e-04
7000.00000  7050.00000  3.912682444184e-04
7050.00000  7100.00000  6.747792551015e-04
7100.00000  7150.00000  2.231976926923e-04
7150.00000  7200.00000  2.132094999040e-04
7200.00000  7250.00000  2.041817102684e-04
7250.00000  7300.00000  2.149382255789e-04
7300.00000  7350.00000  2.147461449483e-04
7350.00000  7400.00000  2.203164832341e-04
7400.00000  7450.00000  2.155144674705e-04
7450.00000  7500.00000  3.017586705848e-04
7500.00000  7550.00000  2.289601116086e-04
7550.00000  7600.00000  2.168590318843e-04
7600.00000  7650.00000  2.158986287316e-04
7650.00000  7700.00000  2.195481607119e-04
7700.00000  7750.00000  2.183956769287e-04
7750.00000  7800.00000  2.137857417956e-04
7800.00000  7850.00000  2.337621273722e-04
7850.00000  7900.00000  2.262709827810e-04
7900.00000  7950.00000  2.143619836872e-04
7950.00000  8000.00000  2.256947408894e-04
8000.00000  8050.00000  2.331858854806e-04
8050.00000  8100.00000  2.145540643178e-04
8100.00000  8150.00000  2.349146111555e-04
8150.00000  8200.00000  2.157065481011e-04
8200.00000  8250.00000  2.270393053032e-04
8250.00000  8300.00000  2.341462886333e-04
8300.00000  8350.00000  2.145540643178e-04
8350.00000  8400.00000  2.103282904458e-04
8400.00000  8450.00000  2.014925814408e-04
8450.00000  8500.00000  2.255026602588e-04
8500.00000  8550.00000  2.107124517069e-04
8550.00000  8600.00000  2.185877575592e-04
8600.00000  8650.00000  2.264630634115e-04
8650.00000  8700.00000  2.268472246726e-04
8700.00000  8750.00000  2.216610476479e-04
8750.00000  8800.00000  2.247343377366e-04
8800.00000  8850.00000  2.118649354902e-04
8850.00000  8900.00000  2.341462886333e-04
8900.00000  8950.00000  2.255026602588e-04
8950.00000  9000.00000  2.122490967513e-04
9000.00000  9050.00000  2.182035962981e-04
9050.00000  9100.00000  2.149382255789e-04
9100.00000  9150.00000  2.218531282785e-04
9150.00000  9200.00000  2.091758066626e-04
9200.00000  9250.00000  2.155144674705e-04
9250.00000  9300.00000  2.241580958450e-04
9300.00000  9350.00000  2.091758066626e-04
9350.00000  9400.00000  2.134015805345e-04
9400.00000  9450.00000  2.180115156676e-04
9450.00000  9500.00000  2.122490967513e-04
9500.00000  9550.00000  2.112886935985e-04
9550.00000  9600.00000  2.085995647709e-04
9600.00000  9650.00000  2.087916454015e-04
9650.00000  9700.00000  2.020688233324e-04
9700.00000  9750.00000  2.103282904458e-04
9750.00000  9800.00000  2.093678872931e-04
9800.00000  9850.00000  2.097520485542e-04
9850.00000  9900.00000  2.097520485542e-04
9900.00000  9950.00000  2.126332580124e-04
9950.00000  10000.00000  2.085995647709e-04
