10001.00000  11001.00000  5.577797860225e-04
11001.00000  12001.00000  4.687903003307e-04
12001.00000  13001.00000  4.014745229792e-04
13001.00000  14001.00000  3.445563890002e-04
14001.00000  15001.00000  3.058341309232e-04
15001.00000  16001.00000  2.733683858410e-04
16001.00000  17001.00000  2.399525112783e-04
17001.00000  18001.00000  2.172390386007e-04
18001.00000  19001.00000  1.959417966583e-04
19001.00000  20001.00000  1.804349664562e-04
20001.00000  21001.00000  1.640138607161e-04
21001.00000  22001.00000  1.506941210164e-04
22001.00000  23001.00000  1.351155829290e-04
23001.00000  24001.00000  1.269050300589e-04
24001.00000  25001.00000  1.158082348044e-04
25001.00000  26001.00000  1.066296254825e-04
26001.00000  27001.00000  9.650088667993e-05
27001.00000  28001.00000  9.210877870360e-05
28001.00000  29001.00000  8.393407977622e-05
29001.00000  30001.00000  7.801817923668e-05
30001.00000  31001.00000  7.471961651160e-05
31001.00000  32001.00000  6.803285620478e-05
32001.00000  33001.00000  6.208110172257e-05
33001.00000  34001.00000  5.883631991148e-05
34001.00000  35001.00000  5.385262188120e-05
35001.00000  36001.00000  5.301005422860e-05
36001.00000  37001.00000  4.825940682563e-05
37001.00000  38001.00000  4.661012546309e-05
38001.00000  39001.00000  4.365217519332e-05
39001.00000  40001.00000  4.248692205674e-05
40001.00000  41001.00000  3.809481408041e-05
41001.00000  42001.00000  3.637382483254e-05
42001.00000  43001.00000  3.447356587135e-05
43001.00000  44001.00000  3.271672268082e-05
44001.00000  45001.00000  3.056548612099e-05
45001.00000  46001.00000  3.045792429300e-05
46001.00000  47001.00000  2.882656990179e-05
47001.00000  48001.00000  2.559971506204e-05
48001.00000  49001.00000  2.705179973992e-05
49001.00000  50001.00000  2.391457975683e-05
50001.00000  51001.00000  2.518739472140e-05
51001.00000  52001.00000  2.169163531167e-05
52001.00000  53001.00000  2.271347267759e-05
53001.00000  54001.00000  2.131516891370e-05
54001.00000  55001.00000  1.979137635048e-05
55001.00000  56001.00000  1.833929167259e-05
56001.00000  57001.00000  1.853648835724e-05
57001.00000  58001.00000  1.676171819538e-05
58001.00000  59001.00000  1.706647670802e-05
59001.00000  60001.00000  1.556061111614e-05
60001.00000  61001.00000  1.521999866083e-05
61001.00000  62001.00000  1.514829077550e-05
62001.00000  63001.00000  1.448499283622e-05
63001.00000  64001.00000  1.353486335563e-05
64001.00000  65001.00000  1.290741935901e-05
65001.00000  66001.00000  1.346315547030e-05
66001.00000  67001.00000  1.328388575698e-05
67001.00000  68001.00000  1.106094131182e-05
68001.00000  69001.00000  1.208277867774e-05
69001.00000  70001.00000  1.145533468112e-05
70001.00000  71001.00000  1.059484005719e-05
71001.00000  72001.00000  9.841907261245e-06
72001.00000  73001.00000  1.014666577389e-05
73001.00000  74001.00000  9.949469089236e-06
74001.00000  75001.00000  9.375806006614e-06
75001.00000  76001.00000  8.640800182003e-06
76001.00000  77001.00000  8.784215952659e-06
77001.00000  78001.00000  8.318114698028e-06
78001.00000  79001.00000  7.923721328725e-06
79001.00000  80001.00000  7.869940414729e-06
80001.00000  81001.00000  7.367985217435e-06
81001.00000  82001.00000  7.314204303439e-06
82001.00000  83001.00000  7.475547045426e-06
83001.00000  84001.00000  6.758468192148e-06
84001.00000  85001.00000  7.493474016758e-06
85001.00000  86001.00000  6.883956991472e-06
86001.00000  87001.00000  6.005535396206e-06
87001.00000  88001.00000  6.220659052189e-06
88001.00000  89001.00000  6.686760306820e-06
89001.00000  90001.00000  6.184805109525e-06
90001.00000  91001.00000  5.037478944280e-06
91001.00000  92001.00000  5.306383514259e-06
92001.00000  93001.00000  5.270529571595e-06
93001.00000  94001.00000  5.127113800940e-06
94001.00000  95001.00000  5.055405915612e-06
95001.00000  96001.00000  4.858209230960e-06
96001.00000  97001.00000  5.216748657600e-06
97001.00000  98001.00000  4.445888890325e-06
98001.00000  99001.00000  4.714793460305e-06
99001.00000  100001.00000  4.894063173624e-06
100001.00000  101001.00000  4.176984320346e-06
101001.00000  102001.00000  4.571377689649e-06
102001.00000  103001.00000  3.836371865039e-06
103001.00000  104001.00000  4.051495521022e-06
104001.00000  105001.00000  3.908079750367e-06
105001.00000  106001.00000  3.764663979711e-06
106001.00000  107001.00000  4.212838263010e-06
107001.00000  108001.00000  3.961860664363e-06
108001.00000  109001.00000  3.495759409732e-06
109001.00000  110001.00000  3.836371865039e-06
110001.00000  111001.00000  3.890152779035e-06
111001.00000  112001.00000  3.298562725080e-06
112001.00000  113001.00000  3.298562725080e-06
113001.00000  114001.00000  2.940023298441e-06
114001.00000  115001.00000  3.710883065715e-06
115001.00000  116001.00000  3.029658155101e-06
116001.00000  117001.00000  3.119293011761e-06
117001.00000  118001.00000  2.993804212437e-06
118001.00000  119001.00000  3.065512097765e-06
119001.00000  120001.00000  2.922096327109e-06
120001.00000  121001.00000  2.689045699794e-06
121001.00000  122001.00000  3.173073925756e-06
122001.00000  123001.00000  2.796607527785e-06
123001.00000  124001.00000  2.473922043810e-06
124001.00000  125001.00000  2.581483871802e-06
125001.00000  126001.00000  2.617337814466e-06
126001.00000  127001.00000  2.384287187150e-06
127001.00000  128001.00000  2.563556900470e-06
128001.00000  129001.00000  2.366360215818e-06
129001.00000  130001.00000  2.509775986474e-06
130001.00000  131001.00000  2.438068101146e-06
131001.00000  132001.00000  2.061601703175e-06
132001.00000  133001.00000  2.169163531167e-06
133001.00000  134001.00000  1.971966846515e-06
134001.00000  135001.00000  1.756843190532e-06
135001.00000  136001.00000  2.240871416495e-06
136001.00000  137001.00000  1.828551075860e-06
137001.00000  138001.00000  1.738916219200e-06
138001.00000  139001.00000  1.882331989856e-06
139001.00000  140001.00000  1.828551075860e-06
140001.00000  141001.00000  1.792697133196e-06
141001.00000  142001.00000  1.828551075860e-06
142001.00000  143001.00000  1.667208333872e-06
143001.00000  144001.00000  2.007820789179e-06
144001.00000  145001.00000  1.828551075860e-06
145001.00000  146001.00000  1.434157706557e-06
146001.00000  147001.00000  1.577573477212e-06
147001.00000  148001.00000  1.703062276536e-06
148001.00000  149001.00000  1.290741935901e-06
149001.00000  150001.00000  1.523792563216e-06
150001.00000  151001.00000  1.649281362540e-06
151001.00000  152001.00000  1.434157706557e-06
152001.00000  153001.00000  1.129399193913e-06
153001.00000  154001.00000  1.703062276536e-06
154001.00000  155001.00000  1.398303763893e-06
155001.00000  156001.00000  1.487938620552e-06
156001.00000  157001.00000  1.236961021905e-06
157001.00000  158001.00000  1.290741935901e-06
158001.00000  159001.00000  1.219034050573e-06
159001.00000  160001.00000  1.165253136577e-06
160001.00000  161001.00000  9.859834232577e-07
161001.00000  162001.00000  1.057691308585e-06
162001.00000  163001.00000  1.075618279917e-06
163001.00000  164001.00000  1.219034050573e-06
164001.00000  165001.00000  1.308668907233e-06
165001.00000  166001.00000  1.254887993237e-06
166001.00000  167001.00000  8.425676526020e-07
167001.00000  168001.00000  1.201107079241e-06
168001.00000  169001.00000  1.147326165245e-06
169001.00000  170001.00000  9.501294805937e-07
170001.00000  171001.00000  1.183180107909e-06
171001.00000  172001.00000  1.147326165245e-06
172001.00000  173001.00000  8.067137099381e-07
173001.00000  174001.00000  1.129399193913e-06
174001.00000  175001.00000  1.165253136577e-06
175001.00000  176001.00000  9.322025092618e-07
176001.00000  177001.00000  8.425676526020e-07
177001.00000  178001.00000  9.322025092618e-07
178001.00000  179001.00000  9.142755379298e-07
179001.00000  180001.00000  8.067137099381e-07
180001.00000  181001.00000  8.604946239340e-07
181001.00000  182001.00000  8.784215952659e-07
182001.00000  183001.00000  8.784215952659e-07
183001.00000  184001.00000  6.991518819463e-07
184001.00000  185001.00000  9.501294805937e-07
185001.00000  186001.00000  8.425676526020e-07
186001.00000  187001.00000  8.604946239340e-07
187001.00000  188001.00000  7.529327959422e-07
188001.00000  189001.00000  7.887867386061e-07
189001.00000  190001.00000  7.170788532783e-07
190001.00000  191001.00000  5.736630826226e-07
191001.00000  192001.00000  7.708597672742e-07
192001.00000  193001.00000  7.350058246103e-07
193001.00000  194001.00000  7.529327959422e-07
194001.00000  195001.00000  6.453709679505e-07
195001.00000  196001.00000  7.170788532783e-07
196001.00000  197001.00000  8.784215952659e-07
197001.00000  198001.00000  6.453709679505e-07
198001.00000  199001.00000  8.963485665979e-07
