300.00000  350.00000  2.197854086448e-02
350.00000  400.00000  1.740266645660e-02
400.00000  450.00000  1.419137729841e-02
450.00000  500.00000  1.183433126507e-02
500.00000  550.00000  1.015600159547e-02
550.00000  600.00000  8.745214918581e-03
600.00000  650.00000  7.679102487361e-03
650.00000  700.00000  6.701526682342e-03
700.00000  750.00000  6.010438388305e-03
750.00000  800.00000  5.420065339357e-03
800.00000  850.00000  4.927701175746e-03
850.00000  900.00000  4.450801925007e-03
900.00000  950.00000  4.054513532623e-03
950.00000  1000.00000  3.770152447160e-03
1000.00000  1050.00000  3.455248158773e-03
1050.00000  1100.00000  3.192537951333e-03
1100.00000  1150.00000  2.984921496006e-03
1150.00000  1200.00000  2.719698240225e-03
1200.00000  1250.00000  2.651845934992e-03
1250.00000  1300.00000  2.424318404340e-03
1300.00000  1350.00000  2.272762258179e-03
1350.00000  1400.00000  2.194084513935e-03
1400.00000  1450.00000  2.022230669627e-03
1450.00000  1500.00000  1.924415095702e-03
1500.00000  1550.00000  1.829885815763e-03
1550.00000  1600.00000  1.735163224412e-03
1600.00000  1650.00000  1.654359054648e-03
1650.00000  1700.00000  1.580900718499e-03
1700.00000  1750.00000  1.509182185047e-03
1750.00000  1800.00000  1.410979988300e-03
1800.00000  1850.00000  1.379663539732e-03
1850.00000  1900.00000  1.308331629102e-03
1900.00000  1950.00000  1.252078008525e-03
1950.00000  2000.00000  1.216315397505e-03
2000.00000  2050.00000  1.190025045620e-03
2050.00000  2100.00000  1.145756732519e-03
2100.00000  2150.00000  1.061666268769e-03
2150.00000  2200.00000  1.030349820200e-03
2200.00000  2250.00000  1.004059468315e-03
2250.00000  2300.00000  9.700366599934e-04
2300.00000  2350.00000  9.128164823612e-04
2350.00000  2400.00000  9.097234997865e-04
2400.00000  2450.00000  8.625555155222e-04
2450.00000  2500.00000  8.441909314849e-04
2500.00000  2550.00000  7.794316088269e-04
2550.00000  2600.00000  7.861975082091e-04
2600.00000  2650.00000  7.566208623384e-04
2650.00000  2700.00000  7.454088005051e-04
2700.00000  2750.00000  7.550743710510e-04
2750.00000  2800.00000  6.802628550252e-04
2800.00000  2850.00000  6.841290832436e-04
2850.00000  2900.00000  6.719504643557e-04
2900.00000  2950.00000  6.702106616574e-04
2950.00000  3000.00000  6.224627431604e-04
3000.00000  3050.00000  5.890198690713e-04
3050.00000  3100.00000  5.984921282064e-04
3100.00000  3150.00000  5.878600006058e-04
3150.00000  3200.00000  5.737482676087e-04
3200.00000  3250.00000  5.511308325311e-04
3250.00000  3300.00000  5.470712929018e-04
3300.00000  3350.00000  5.244538578242e-04
3350.00000  3400.00000  5.244538578242e-04
3400.00000  3450.00000  5.242605464133e-04
3450.00000  3500.00000  5.026096683904e-04
3500.00000  3550.00000  4.859848870513e-04
3550.00000  3600.00000  4.556349955369e-04
3600.00000  3650.00000  4.482891619220e-04
3650.00000  3700.00000  4.297312664737e-04
3700.00000  3750.00000  4.332108718703e-04
3750.00000  3800.00000  4.277981523646e-04
3800.00000  3850.00000  4.183258932295e-04
3850.00000  3900.00000  4.051807172870e-04
3900.00000  3950.00000  3.982215064939e-04
3950.00000  4000.00000  4.075004542180e-04
4000.00000  4050.00000  3.939686554537e-04
4050.00000  4100.00000  3.767639398818e-04
4100.00000  4150.00000  3.759906942382e-04
4150.00000  4200.00000  3.580127330227e-04
4200.00000  4250.00000  3.526000135169e-04
4250.00000  4300.00000  3.435143772037e-04
4300.00000  4350.00000  3.506668994077e-04
4350.00000  4400.00000  3.510535222296e-04
4400.00000  4450.00000  3.251497931664e-04
4450.00000  4500.00000  3.203170078934e-04
4500.00000  4550.00000  3.288227099738e-04
4550.00000  4600.00000  3.100715031147e-04
4600.00000  4650.00000  3.174173367296e-04
4650.00000  4700.00000  3.017591124451e-04
4700.00000  4750.00000  3.005992439796e-04
4750.00000  4800.00000  2.909336734336e-04
4800.00000  4850.00000  2.911269848446e-04
4850.00000  4900.00000  2.820413485314e-04
4900.00000  4950.00000  2.723757779854e-04
4950.00000  5000.00000  2.696694182325e-04
5000.00000  5050.00000  2.702493524653e-04
5050.00000  5100.00000  2.793349887785e-04
5100.00000  5150.00000  2.642566987268e-04
5150.00000  5200.00000  2.530446368934e-04
5200.00000  5250.00000  2.638700759049e-04
5250.00000  5300.00000  2.484051630314e-04
5300.00000  5350.00000  2.464720489222e-04
5350.00000  5400.00000  2.294606447613e-04
5400.00000  5450.00000  2.369997897871e-04
5450.00000  5500.00000  2.342934300343e-04
5500.00000  5550.00000  2.310071360486e-04
5550.00000  5600.00000  2.362265441435e-04
5600.00000  5650.00000  2.341001186234e-04
5650.00000  5700.00000  2.263676621866e-04
5700.00000  5750.00000  2.101295036694e-04
5750.00000  5800.00000  2.124492406004e-04
5800.00000  5850.00000  2.045234727527e-04
5850.00000  5900.00000  1.936980337412e-04
5900.00000  5950.00000  2.054900298073e-04
5950.00000  6000.00000  2.045234727527e-04
6000.00000  6050.00000  2.109027493130e-04
6050.00000  6100.00000  2.012371787671e-04
6100.00000  6150.00000  1.940846565630e-04
6150.00000  6200.00000  1.886719370573e-04
6200.00000  6250.00000  1.848057088389e-04
6250.00000  6300.00000  1.851923316608e-04
6300.00000  6350.00000  1.915716082211e-04
6350.00000  6400.00000  1.985308190142e-04
6400.00000  6450.00000  1.840324631952e-04
6450.00000  6500.00000  1.896384941119e-04
6500.00000  6550.00000  1.795863007441e-04
6550.00000  6600.00000  1.714672214855e-04
6600.00000  6650.00000  1.664411248016e-04
6650.00000  6700.00000  1.639280764596e-04
6700.00000  6750.00000  1.710805986636e-04
6750.00000  6800.00000  1.641213878705e-04
6800.00000  6850.00000  1.710805986636e-04
6850.00000  6900.00000  1.726270899510e-04
6900.00000  6950.00000  1.519427689826e-04
6950.00000  7000.00000  1.523293918045e-04
7000.00000  7050.00000  1.641213878705e-04
7050.00000  7100.00000  1.602551596522e-04
7100.00000  7150.00000  1.461434266550e-04
7150.00000  7200.00000  1.641213878705e-04
7200.00000  7250.00000  1.550357515573e-04
7250.00000  7300.00000  1.536825716809e-04
7300.00000  7350.00000  1.366711675200e-04
7350.00000  7400.00000  1.471099837096e-04
7400.00000  7450.00000  1.428571326694e-04
7450.00000  7500.00000  1.384109702183e-04
7500.00000  7550.00000  1.411173299711e-04
7550.00000  7600.00000  1.434370669022e-04
7600.00000  7650.00000  1.351246762326e-04
7650.00000  7700.00000  1.430504440803e-04
7700.00000  7750.00000  1.331915621234e-04
7750.00000  7800.00000  1.300985795487e-04
7800.00000  7850.00000  1.362845446982e-04
7850.00000  7900.00000  1.204330090028e-04
7900.00000  7950.00000  1.237193029884e-04
7950.00000  8000.00000  1.183065834827e-04
8000.00000  8050.00000  1.333848735344e-04
8050.00000  8100.00000  1.192731405372e-04
8100.00000  8150.00000  1.219795002901e-04
8150.00000  8200.00000  1.204330090028e-04
8200.00000  8250.00000  1.173400264281e-04
8250.00000  8300.00000  1.204330090028e-04
8300.00000  8350.00000  1.138604210315e-04
8350.00000  8400.00000  1.181132720717e-04
8400.00000  8450.00000  1.146336666752e-04
8450.00000  8500.00000  1.192731405372e-04
8500.00000  8550.00000  1.128938639769e-04
8550.00000  8600.00000  1.098008814022e-04
8600.00000  8650.00000  1.171467150171e-04
8650.00000  8700.00000  1.053547189511e-04
8700.00000  8750.00000  1.067078988275e-04
8750.00000  8800.00000  1.022617363763e-04
8800.00000  8850.00000  9.781557392520e-05
8850.00000  8900.00000  9.704232828152e-05
8900.00000  8950.00000  9.626908263784e-05
8950.00000  9000.00000  1.041948504855e-04
9000.00000  9050.00000  1.028416706091e-04
9050.00000  9100.00000  1.063212760057e-04
9100.00000  9150.00000  1.022617363763e-04
9150.00000  9200.00000  1.072878330602e-04
9200.00000  9250.00000  9.742895110336e-05
9250.00000  9300.00000  8.602357785912e-05
9300.00000  9350.00000  9.414265711773e-05
9350.00000  9400.00000  9.182292018670e-05
9400.00000  9450.00000  1.040015390746e-04
9450.00000  9500.00000  9.858881956888e-05
9500.00000  9550.00000  9.143629736486e-05
9550.00000  9600.00000  9.356272288497e-05
9600.00000  9650.00000  9.626908263784e-05
9650.00000  9700.00000  9.356272288497e-05
9700.00000  9750.00000  8.950318325567e-05
9750.00000  9800.00000  9.220954300854e-05
9800.00000  9850.00000  9.124298595394e-05
9850.00000  9900.00000  8.273728387349e-05
9900.00000  9950.00000  9.472259135049e-05
9950.00000  10000.00000  7.887105565510e-05
