10001.00000  11001.00000  5.155716512570e-04
11001.00000  12001.00000  4.143032817672e-04
12001.00000  13001.00000  3.437638574849e-04
13001.00000  14001.00000  2.813051449701e-04
14001.00000  15001.00000  2.367129603082e-04
15001.00000  16001.00000  1.992006653142e-04
16001.00000  17001.00000  1.715853888611e-04
17001.00000  18001.00000  1.441925173190e-04
18001.00000  19001.00000  1.277716213878e-04
19001.00000  20001.00000  1.138713144483e-04
20001.00000  21001.00000  9.919259032021e-05
21001.00000  22001.00000  9.107481106754e-05
22001.00000  23001.00000  8.162260234869e-05
23001.00000  24001.00000  7.320828321465e-05
24001.00000  25001.00000  6.282938736650e-05
25001.00000  26001.00000  5.908557136413e-05
26001.00000  27001.00000  5.415559583626e-05
27001.00000  28001.00000  5.000403749700e-05
28001.00000  29001.00000  4.614901903911e-05
29001.00000  30001.00000  3.977341158953e-05
30001.00000  31001.00000  3.691921523129e-05
31001.00000  32001.00000  3.602959558716e-05
32001.00000  33001.00000  3.021000041516e-05
33001.00000  34001.00000  3.128495748515e-05
34001.00000  35001.00000  2.839369364173e-05
35001.00000  36001.00000  2.468694512454e-05
36001.00000  37001.00000  2.461281015419e-05
37001.00000  38001.00000  2.146207391457e-05
38001.00000  39001.00000  2.020177941873e-05
39001.00000  40001.00000  2.075779169631e-05
40001.00000  41001.00000  1.738465054566e-05
41001.00000  42001.00000  1.616142353498e-05
42001.00000  43001.00000  1.616142353498e-05
43001.00000  44001.00000  1.508646646499e-05
44001.00000  45001.00000  1.460458915776e-05
45001.00000  46001.00000  1.301068729536e-05
46001.00000  47001.00000  1.364083454329e-05
47001.00000  48001.00000  1.267707992882e-05
48001.00000  49001.00000  1.141678543297e-05
49001.00000  50001.00000  1.074957069987e-05
50001.00000  51001.00000  1.030476087781e-05
51001.00000  52001.00000  9.897018540918e-06
52001.00000  53001.00000  1.004528848161e-05
53001.00000  54001.00000  9.081533867134e-06
54001.00000  55001.00000  8.266049193351e-06
55001.00000  56001.00000  7.413497034395e-06
56001.00000  57001.00000  7.598834460255e-06
57001.00000  58001.00000  7.672969430599e-06
58001.00000  59001.00000  7.116957153019e-06
59001.00000  60001.00000  7.154024638191e-06
60001.00000  61001.00000  6.820417271644e-06
61001.00000  62001.00000  6.412674934752e-06
62001.00000  63001.00000  5.819595172000e-06
63001.00000  64001.00000  6.079067568204e-06
64001.00000  65001.00000  5.782527686828e-06
65001.00000  66001.00000  5.189447924077e-06
66001.00000  67001.00000  4.411030735465e-06
67001.00000  68001.00000  4.411030735465e-06
68001.00000  69001.00000  4.818773072357e-06
69001.00000  70001.00000  3.855018457885e-06
70001.00000  71001.00000  3.669681032026e-06
71001.00000  72001.00000  4.670503131669e-06
72001.00000  73001.00000  3.929153428229e-06
73001.00000  74001.00000  3.632613546854e-06
74001.00000  75001.00000  3.669681032026e-06
75001.00000  76001.00000  4.040355883745e-06
76001.00000  77001.00000  3.743816002370e-06
77001.00000  78001.00000  3.261938695134e-06
78001.00000  79001.00000  3.076601269274e-06
79001.00000  80001.00000  2.891263843414e-06
80001.00000  81001.00000  2.594723962038e-06
81001.00000  82001.00000  3.299006180306e-06
82001.00000  83001.00000  2.446454021350e-06
83001.00000  84001.00000  2.186981625147e-06
84001.00000  85001.00000  2.854196358242e-06
85001.00000  86001.00000  2.557656476866e-06
86001.00000  87001.00000  2.186981625147e-06
87001.00000  88001.00000  1.927509228943e-06
88001.00000  89001.00000  2.075779169631e-06
89001.00000  90001.00000  2.668858932382e-06
90001.00000  91001.00000  2.186981625147e-06
91001.00000  92001.00000  2.112846654803e-06
92001.00000  93001.00000  2.594723962038e-06
93001.00000  94001.00000  2.112846654803e-06
94001.00000  95001.00000  1.779239288255e-06
95001.00000  96001.00000  1.482699406879e-06
96001.00000  97001.00000  1.816306773427e-06
97001.00000  98001.00000  1.482699406879e-06
98001.00000  99001.00000  1.482699406879e-06
99001.00000  100001.00000  1.371496951363e-06
100001.00000  101001.00000  1.149092040331e-06
101001.00000  102001.00000  1.593901862395e-06
102001.00000  103001.00000  1.297361981019e-06
103001.00000  104001.00000  1.519766892051e-06
104001.00000  105001.00000  1.705104317911e-06
105001.00000  106001.00000  1.223227010675e-06
106001.00000  107001.00000  1.556834377223e-06
107001.00000  108001.00000  9.637546144714e-07
108001.00000  109001.00000  1.519766892051e-06
109001.00000  110001.00000  1.074957069987e-06
110001.00000  111001.00000  1.297361981019e-06
111001.00000  112001.00000  1.223227010675e-06
112001.00000  113001.00000  8.525521589554e-07
113001.00000  114001.00000  1.037889584815e-06
114001.00000  115001.00000  1.223227010675e-06
115001.00000  116001.00000  1.149092040331e-06
116001.00000  117001.00000  1.112024555159e-06
117001.00000  118001.00000  1.186159525503e-06
118001.00000  119001.00000  1.297361981019e-06
119001.00000  120001.00000  9.266871292994e-07
120001.00000  121001.00000  1.297361981019e-06
121001.00000  122001.00000  8.154846737835e-07
122001.00000  123001.00000  9.637546144714e-07
123001.00000  124001.00000  1.223227010675e-06
124001.00000  125001.00000  4.818773072357e-07
125001.00000  126001.00000  5.930797627516e-07
126001.00000  127001.00000  5.560122775796e-07
127001.00000  128001.00000  8.525521589554e-07
128001.00000  129001.00000  8.154846737835e-07
129001.00000  130001.00000  7.042822182675e-07
130001.00000  131001.00000  8.896196441274e-07
131001.00000  132001.00000  8.154846737835e-07
132001.00000  133001.00000  7.413497034395e-07
133001.00000  134001.00000  6.301472479236e-07
134001.00000  135001.00000  7.413497034395e-07
135001.00000  136001.00000  5.560122775796e-07
136001.00000  137001.00000  5.189447924077e-07
137001.00000  138001.00000  7.784171886115e-07
138001.00000  139001.00000  5.560122775796e-07
139001.00000  140001.00000  5.930797627516e-07
140001.00000  141001.00000  6.672147330956e-07
141001.00000  142001.00000  7.413497034395e-07
142001.00000  143001.00000  5.560122775796e-07
143001.00000  144001.00000  5.930797627516e-07
144001.00000  145001.00000  4.077423368917e-07
145001.00000  146001.00000  4.077423368917e-07
146001.00000  147001.00000  5.560122775796e-07
147001.00000  148001.00000  4.077423368917e-07
148001.00000  149001.00000  7.784171886115e-07
149001.00000  150001.00000  3.706748517198e-07
150001.00000  151001.00000  5.560122775796e-07
151001.00000  152001.00000  4.077423368917e-07
152001.00000  153001.00000  3.336073665478e-07
153001.00000  154001.00000  3.336073665478e-07
154001.00000  155001.00000  3.336073665478e-07
155001.00000  156001.00000  4.448098220637e-07
156001.00000  157001.00000  5.930797627516e-07
157001.00000  158001.00000  6.301472479236e-07
158001.00000  159001.00000  6.301472479236e-07
159001.00000  160001.00000  1.112024555159e-07
160001.00000  161001.00000  3.706748517198e-07
161001.00000  162001.00000  2.965398813758e-07
162001.00000  163001.00000  3.706748517198e-07
163001.00000  164001.00000  3.706748517198e-07
164001.00000  165001.00000  5.930797627516e-07
165001.00000  166001.00000  4.448098220637e-07
166001.00000  167001.00000  7.413497034395e-08
167001.00000  168001.00000  3.336073665478e-07
168001.00000  169001.00000  3.336073665478e-07
169001.00000  170001.00000  2.965398813758e-07
170001.00000  171001.00000  3.706748517198e-07
171001.00000  172001.00000  3.706748517198e-07
172001.00000  173001.00000  4.818773072357e-07
173001.00000  174001.00000  3.706748517198e-07
174001.00000  175001.00000  2.224049110319e-07
175001.00000  176001.00000  3.706748517198e-07
176001.00000  177001.00000  2.224049110319e-07
177001.00000  178001.00000  3.706748517198e-07
178001.00000  179001.00000  4.077423368917e-07
179001.00000  180001.00000  1.853374258599e-07
180001.00000  181001.00000  2.224049110319e-07
181001.00000  182001.00000  3.336073665478e-07
182001.00000  183001.00000  2.965398813758e-07
183001.00000  184001.00000  3.336073665478e-07
184001.00000  185001.00000  2.965398813758e-07
185001.00000  186001.00000  2.594723962038e-07
186001.00000  187001.00000  1.482699406879e-07
187001.00000  188001.00000  3.336073665478e-07
188001.00000  189001.00000  1.853374258599e-07
189001.00000  190001.00000  2.224049110319e-07
190001.00000  191001.00000  2.594723962038e-07
191001.00000  192001.00000  1.482699406879e-07
192001.00000  193001.00000  1.482699406879e-07
193001.00000  194001.00000  3.706748517198e-08
194001.00000  195001.00000  7.413497034395e-08
195001.00000  196001.00000  1.853374258599e-07
196001.00000  197001.00000  1.482699406879e-07
197001.00000  198001.00000  1.853374258599e-07
198001.00000  199001.00000  1.482699406879e-07
