300.00000  350.00000  7.157464377965e-07
350.00000  400.00000  3.220858970084e-06
400.00000  450.00000  1.789366094491e-06
450.00000  500.00000  1.789366094491e-06
500.00000  550.00000  4.580777201897e-05
550.00000  600.00000  3.578732188982e-06
600.00000  650.00000  1.503067519373e-05
650.00000  700.00000  3.578732188982e-06
700.00000  750.00000  1.145194300474e-05
750.00000  800.00000  9.662576910252e-06
800.00000  850.00000  2.934560394966e-05
850.00000  900.00000  6.441717940168e-06
900.00000  950.00000  6.441717940168e-06
950.00000  1000.00000  5.010225064575e-06
1000.00000  1050.00000  1.002045012915e-05
1050.00000  1100.00000  8.231084034659e-06
1100.00000  1150.00000  8.946830472456e-06
1150.00000  1200.00000  9.662576910252e-06
1200.00000  1250.00000  1.145194300474e-05
1250.00000  1300.00000  2.970347716855e-05
1300.00000  1350.00000  6.799591159067e-06
1350.00000  1400.00000  1.037832334805e-05
1400.00000  1450.00000  8.946830472456e-06
1450.00000  1500.00000  1.359918231813e-05
1500.00000  1550.00000  1.109406978585e-05
1550.00000  1600.00000  1.252556266144e-05
1600.00000  1650.00000  1.503067519373e-05
1650.00000  1700.00000  1.109406978585e-05
1700.00000  1750.00000  3.865030764101e-05
1750.00000  1800.00000  1.109406978585e-05
1800.00000  1850.00000  1.109406978585e-05
1850.00000  1900.00000  1.180981622364e-05
1900.00000  1950.00000  1.216768944254e-05
1950.00000  2000.00000  1.431492875593e-05
2000.00000  2050.00000  1.467280197483e-05
2050.00000  2100.00000  9.662576910252e-06
2100.00000  2150.00000  9.662576910252e-06
2150.00000  2200.00000  1.395705553703e-05
2200.00000  2250.00000  1.538854841262e-05
2250.00000  2300.00000  1.288343588034e-05
2300.00000  2350.00000  4.867075777016e-05
2350.00000  2400.00000  1.538854841262e-05
2400.00000  2450.00000  1.252556266144e-05
2450.00000  2500.00000  1.753578772601e-05
2500.00000  2550.00000  1.145194300474e-05
2550.00000  2600.00000  1.395705553703e-05
2600.00000  2650.00000  1.288343588034e-05
2650.00000  2700.00000  1.109406978585e-05
2700.00000  2750.00000  1.574642163152e-05
2750.00000  2800.00000  1.610429485042e-05
2800.00000  2850.00000  1.252556266144e-05
2850.00000  2900.00000  1.431492875593e-05
2900.00000  2950.00000  1.395705553703e-05
2950.00000  3000.00000  3.686094154652e-05
3000.00000  3050.00000  1.682004128822e-05
3050.00000  3100.00000  1.717791450712e-05
3100.00000  3150.00000  1.860940738271e-05
3150.00000  3200.00000  1.682004128822e-05
3200.00000  3250.00000  1.968302703940e-05
3250.00000  3300.00000  1.717791450712e-05
3300.00000  3350.00000  2.218813957169e-05
3350.00000  3400.00000  2.397750566618e-05
3400.00000  3450.00000  2.505112532288e-05
3450.00000  3500.00000  2.612474497957e-05
3500.00000  3550.00000  3.006135038745e-05
3550.00000  3600.00000  3.614519510872e-05
3600.00000  3650.00000  4.366053270558e-05
3650.00000  3700.00000  7.622699562532e-05
3700.00000  3750.00000  4.544989880008e-05
3750.00000  3800.00000  4.580777201897e-05
3800.00000  3850.00000  5.189161674024e-05
3850.00000  3900.00000  6.871165802846e-05
3900.00000  3950.00000  6.620654549617e-05
3950.00000  4000.00000  8.052147425210e-05
4000.00000  4050.00000  8.338446000329e-05
4050.00000  4100.00000  9.304703691354e-05
4100.00000  4150.00000  9.841513519702e-05
4150.00000  4200.00000  9.984662807261e-05
4200.00000  4250.00000  1.027096138238e-04
4250.00000  4300.00000  1.084355853262e-04
4300.00000  4350.00000  1.209611479876e-04
4350.00000  4400.00000  1.313394713357e-04
4400.00000  4450.00000  1.456544000916e-04
4450.00000  4500.00000  1.424335411215e-04
4500.00000  4550.00000  1.717791450712e-04
4550.00000  4600.00000  1.699897789767e-04
4600.00000  4650.00000  1.646216806932e-04
4650.00000  4700.00000  1.875255667027e-04
4700.00000  4750.00000  1.907464256728e-04
4750.00000  4800.00000  2.068507205232e-04
4800.00000  4850.00000  1.979038900507e-04
4850.00000  4900.00000  2.132924384633e-04
4900.00000  4950.00000  2.251022546870e-04
4950.00000  5000.00000  2.283231136571e-04
5000.00000  5050.00000  2.379856905673e-04
5050.00000  5100.00000  2.591002104823e-04
5100.00000  5150.00000  2.644683087658e-04
5150.00000  5200.00000  2.630368158902e-04
5200.00000  5250.00000  2.519427461044e-04
5250.00000  5300.00000  2.880879412131e-04
5300.00000  5350.00000  2.791411107406e-04
5350.00000  5400.00000  2.991820109989e-04
5400.00000  5450.00000  3.024028699690e-04
5450.00000  5500.00000  3.013292503123e-04
5500.00000  5550.00000  2.984662645611e-04
5550.00000  5600.00000  3.056237289391e-04
5600.00000  5650.00000  3.364008257643e-04
5650.00000  5700.00000  3.185071648194e-04
5700.00000  5750.00000  3.077709682525e-04
5750.00000  5800.00000  3.124233200982e-04
5800.00000  5850.00000  3.267382488541e-04
5850.00000  5900.00000  3.507157545203e-04
5900.00000  5950.00000  3.371165722021e-04
5950.00000  6000.00000  3.306748542620e-04
6000.00000  6050.00000  3.349693328888e-04
6050.00000  6100.00000  3.202965309139e-04
6100.00000  6150.00000  3.517893741770e-04
6150.00000  6200.00000  3.746932601865e-04
6200.00000  6250.00000  4.072597231062e-04
6250.00000  6300.00000  4.437627914338e-04
6300.00000  6350.00000  4.716769025079e-04
6350.00000  6400.00000  1.990132970293e-03
6400.00000  6450.00000  3.417689240478e-04
6450.00000  6500.00000  3.703987815597e-04
6500.00000  6550.00000  3.503578813014e-04
6550.00000  6600.00000  3.421267972667e-04
6600.00000  6650.00000  3.482106419880e-04
6650.00000  6700.00000  3.560838528037e-04
6700.00000  6750.00000  3.414110508289e-04
6750.00000  6800.00000  3.546523599282e-04
6800.00000  6850.00000  3.567995992415e-04
6850.00000  6900.00000  3.474948955502e-04
6900.00000  6950.00000  3.446319097990e-04
6950.00000  7000.00000  3.270961220730e-04
7000.00000  7050.00000  3.245910095407e-04
7050.00000  7100.00000  5.103272101489e-04
7100.00000  7150.00000  1.513803715940e-04
7150.00000  7200.00000  1.671267932255e-04
7200.00000  7250.00000  1.592535824097e-04
7250.00000  7300.00000  1.707055254145e-04
7300.00000  7350.00000  1.699897789767e-04
7350.00000  7400.00000  1.581799627530e-04
7400.00000  7450.00000  1.420756679026e-04
7450.00000  7500.00000  2.315439726272e-04
7500.00000  7550.00000  1.621165681609e-04
7550.00000  7600.00000  1.750000040412e-04
7600.00000  7650.00000  1.649795539121e-04
7650.00000  7700.00000  1.699897789767e-04
7700.00000  7750.00000  1.753578772601e-04
7750.00000  7800.00000  1.581799627530e-04
7800.00000  7850.00000  1.671267932255e-04
7850.00000  7900.00000  1.649795539121e-04
7900.00000  7950.00000  1.771472433546e-04
7950.00000  8000.00000  1.660531735688e-04
8000.00000  8050.00000  1.585378359719e-04
8050.00000  8100.00000  1.785787362302e-04
8100.00000  8150.00000  1.689161593200e-04
8150.00000  8200.00000  1.707055254145e-04
8200.00000  8250.00000  1.621165681609e-04
8250.00000  8300.00000  1.875255667027e-04
8300.00000  8350.00000  1.760736236979e-04
8350.00000  8400.00000  1.678425396633e-04
8400.00000  8450.00000  1.721370182901e-04
8450.00000  8500.00000  1.721370182901e-04
8500.00000  8550.00000  1.689161593200e-04
8550.00000  8600.00000  1.642638074743e-04
8600.00000  8650.00000  1.710633986334e-04
8650.00000  8700.00000  1.581799627530e-04
8700.00000  8750.00000  1.578220895341e-04
8750.00000  8800.00000  1.510224983751e-04
8800.00000  8850.00000  1.603272020664e-04
8850.00000  8900.00000  1.585378359719e-04
8900.00000  8950.00000  1.674846664444e-04
8950.00000  9000.00000  1.646216806932e-04
9000.00000  9050.00000  1.599693288475e-04
9050.00000  9100.00000  1.563905966585e-04
9100.00000  9150.00000  1.728527647278e-04
9150.00000  9200.00000  1.610429485042e-04
9200.00000  9250.00000  1.739263843845e-04
9250.00000  9300.00000  1.707055254145e-04
9300.00000  9350.00000  1.717791450712e-04
9350.00000  9400.00000  1.474437661861e-04
9400.00000  9450.00000  1.735685111656e-04
9450.00000  9500.00000  1.520961180318e-04
9500.00000  9550.00000  1.746421308223e-04
9550.00000  9600.00000  1.410020482459e-04
9600.00000  9650.00000  1.513803715940e-04
9650.00000  9700.00000  1.581799627530e-04
9700.00000  9750.00000  1.560327234396e-04
9750.00000  9800.00000  1.656953003499e-04
9800.00000  9850.00000  1.574642163152e-04
9850.00000  9900.00000  1.664110467877e-04
9900.00000  9950.00000  1.535276109073e-04
9950.00000  10000.00000  1.524539912506e-04
