10001.00000  11001.00000  4.553679424395e-05
11001.00000  12001.00000  4.549830160300e-05
12001.00000  13001.00000  4.551754792348e-05
13001.00000  14001.00000  4.161054486704e-05
14001.00000  15001.00000  4.195697863559e-05
15001.00000  16001.00000  4.087918468899e-05
16001.00000  17001.00000  3.693368899161e-05
17001.00000  18001.00000  3.483584005983e-05
18001.00000  19001.00000  3.129451709242e-05
19001.00000  20001.00000  3.056315691437e-05
20001.00000  21001.00000  2.769545516359e-05
21001.00000  22001.00000  2.440433436235e-05
22001.00000  23001.00000  2.240271703295e-05
23001.00000  24001.00000  1.993918801214e-05
24001.00000  25001.00000  1.872666982222e-05
25001.00000  26001.00000  1.659032824949e-05
26001.00000  27001.00000  1.489665204768e-05
27001.00000  28001.00000  1.351091697348e-05
28001.00000  29001.00000  1.216367454023e-05
29001.00000  30001.00000  1.097040267077e-05
30001.00000  31001.00000  1.052773729985e-05
31001.00000  32001.00000  9.372958071346e-06
32001.00000  33001.00000  7.737020830967e-06
33001.00000  34001.00000  7.563803946692e-06
34001.00000  35001.00000  7.332848100991e-06
35001.00000  36001.00000  5.908620385838e-06
36001.00000  37001.00000  5.831635103938e-06
37001.00000  38001.00000  4.965550682561e-06
38001.00000  39001.00000  4.599870593535e-06
39001.00000  40001.00000  4.676855875435e-06
40001.00000  41001.00000  3.849264095009e-06
41001.00000  42001.00000  3.791525133583e-06
42001.00000  43001.00000  3.252628160282e-06
43001.00000  44001.00000  3.291120801232e-06
44001.00000  45001.00000  2.983179673632e-06
45001.00000  46001.00000  2.983179673632e-06
46001.00000  47001.00000  2.328804777480e-06
47001.00000  48001.00000  2.136341572730e-06
48001.00000  49001.00000  2.213326854630e-06
49001.00000  50001.00000  2.020863649879e-06
50001.00000  51001.00000  1.809154124654e-06
51001.00000  52001.00000  1.963124688454e-06
52001.00000  53001.00000  1.924632047504e-06
53001.00000  54001.00000  1.270257151353e-06
54001.00000  55001.00000  1.308749792303e-06
55001.00000  56001.00000  1.135532908028e-06
56001.00000  57001.00000  1.270257151353e-06
57001.00000  58001.00000  1.212518189928e-06
58001.00000  59001.00000  1.116286587552e-06
59001.00000  60001.00000  1.039301305652e-06
60001.00000  61001.00000  7.698528190017e-07
61001.00000  62001.00000  6.736212166265e-07
62001.00000  63001.00000  8.468381009019e-07
63001.00000  64001.00000  9.623160237521e-07
64001.00000  65001.00000  6.736212166265e-07
65001.00000  66001.00000  6.351285756764e-07
66001.00000  67001.00000  7.698528190017e-07
67001.00000  68001.00000  6.351285756764e-07
68001.00000  69001.00000  4.619116914010e-07
69001.00000  70001.00000  6.543748961514e-07
70001.00000  71001.00000  4.234190504509e-07
71001.00000  72001.00000  5.581432937762e-07
72001.00000  73001.00000  5.004043323511e-07
73001.00000  74001.00000  4.041727299759e-07
74001.00000  75001.00000  5.196506528262e-07
75001.00000  76001.00000  4.041727299759e-07
76001.00000  77001.00000  4.426653709260e-07
77001.00000  78001.00000  3.079411276007e-07
78001.00000  79001.00000  3.271874480757e-07
79001.00000  80001.00000  4.619116914010e-07
80001.00000  81001.00000  1.924632047504e-07
81001.00000  82001.00000  2.694484866506e-07
82001.00000  83001.00000  3.464337685508e-07
83001.00000  84001.00000  2.117095252255e-07
84001.00000  85001.00000  2.886948071256e-07
85001.00000  86001.00000  1.154779228503e-07
86001.00000  87001.00000  1.924632047504e-07
87001.00000  88001.00000  1.347242433253e-07
88001.00000  89001.00000  1.539705638003e-07
89001.00000  90001.00000  2.502021661756e-07
90001.00000  91001.00000  2.502021661756e-07
91001.00000  92001.00000  1.539705638003e-07
92001.00000  93001.00000  1.539705638003e-07
93001.00000  94001.00000  1.347242433253e-07
94001.00000  95001.00000  7.698528190017e-08
95001.00000  96001.00000  1.924632047504e-07
96001.00000  97001.00000  1.154779228503e-07
97001.00000  98001.00000  1.924632047504e-07
98001.00000  99001.00000  3.849264095009e-08
99001.00000  100001.00000  5.773896142513e-08
100001.00000  101001.00000  1.347242433253e-07
101001.00000  102001.00000  1.732168842754e-07
102001.00000  103001.00000  3.849264095009e-08
103001.00000  104001.00000  7.698528190017e-08
104001.00000  105001.00000  9.623160237521e-08
105001.00000  106001.00000  5.773896142513e-08
106001.00000  107001.00000  1.924632047504e-08
107001.00000  108001.00000  5.773896142513e-08
108001.00000  109001.00000  3.849264095009e-08
109001.00000  110001.00000  3.849264095009e-08
110001.00000  111001.00000  1.924632047504e-08
111001.00000  112001.00000  5.773896142513e-08
112001.00000  113001.00000  1.924632047504e-08
113001.00000  114001.00000  1.924632047504e-08
114001.00000  115001.00000  5.773896142513e-08
115001.00000  116001.00000  3.849264095009e-08
116001.00000  117001.00000  7.698528190017e-08
117001.00000  118001.00000  1.924632047504e-08
118001.00000  119001.00000  5.773896142513e-08
119001.00000  120001.00000  1.924632047504e-08
120001.00000  121001.00000  1.924632047504e-08
121001.00000  122001.00000  5.773896142513e-08
122001.00000  123001.00000  5.773896142513e-08
123001.00000  124001.00000  5.773896142513e-08
124001.00000  125001.00000  7.698528190017e-08
125001.00000  126001.00000  5.773896142513e-08
126001.00000  127001.00000  5.773896142513e-08
127001.00000  128001.00000  0.000000000000e+00
128001.00000  129001.00000  5.773896142513e-08
129001.00000  130001.00000  7.698528190017e-08
130001.00000  131001.00000  3.849264095009e-08
131001.00000  132001.00000  1.924632047504e-08
132001.00000  133001.00000  1.924632047504e-08
133001.00000  134001.00000  1.924632047504e-08
134001.00000  135001.00000  3.849264095009e-08
135001.00000  136001.00000  5.773896142513e-08
136001.00000  137001.00000  0.000000000000e+00
137001.00000  138001.00000  1.924632047504e-08
138001.00000  139001.00000  0.000000000000e+00
139001.00000  140001.00000  1.924632047504e-08
140001.00000  141001.00000  3.849264095009e-08
141001.00000  142001.00000  0.000000000000e+00
142001.00000  143001.00000  1.924632047504e-08
143001.00000  144001.00000  0.000000000000e+00
144001.00000  145001.00000  0.000000000000e+00
145001.00000  146001.00000  0.000000000000e+00
146001.00000  147001.00000  0.000000000000e+00
147001.00000  148001.00000  0.000000000000e+00
148001.00000  149001.00000  0.000000000000e+00
149001.00000  150001.00000  0.000000000000e+00
150001.00000  151001.00000  3.849264095009e-08
151001.00000  152001.00000  1.924632047504e-08
152001.00000  153001.00000  1.924632047504e-08
153001.00000  154001.00000  1.924632047504e-08
154001.00000  155001.00000  0.000000000000e+00
155001.00000  156001.00000  1.924632047504e-08
156001.00000  157001.00000  1.924632047504e-08
157001.00000  158001.00000  0.000000000000e+00
158001.00000  159001.00000  0.000000000000e+00
159001.00000  160001.00000  0.000000000000e+00
160001.00000  161001.00000  1.924632047504e-08
161001.00000  162001.00000  0.000000000000e+00
162001.00000  163001.00000  0.000000000000e+00
163001.00000  164001.00000  0.000000000000e+00
164001.00000  165001.00000  0.000000000000e+00
165001.00000  166001.00000  0.000000000000e+00
166001.00000  167001.00000  0.000000000000e+00
167001.00000  168001.00000  0.000000000000e+00
168001.00000  169001.00000  0.000000000000e+00
169001.00000  170001.00000  0.000000000000e+00
170001.00000  171001.00000  0.000000000000e+00
171001.00000  172001.00000  0.000000000000e+00
172001.00000  173001.00000  3.849264095009e-08
173001.00000  174001.00000  0.000000000000e+00
174001.00000  175001.00000  1.924632047504e-08
175001.00000  176001.00000  0.000000000000e+00
176001.00000  177001.00000  1.924632047504e-08
177001.00000  178001.00000  0.000000000000e+00
178001.00000  179001.00000  1.924632047504e-08
179001.00000  180001.00000  0.000000000000e+00
180001.00000  181001.00000  0.000000000000e+00
181001.00000  182001.00000  0.000000000000e+00
182001.00000  183001.00000  0.000000000000e+00
183001.00000  184001.00000  0.000000000000e+00
184001.00000  185001.00000  0.000000000000e+00
185001.00000  186001.00000  0.000000000000e+00
186001.00000  187001.00000  0.000000000000e+00
187001.00000  188001.00000  0.000000000000e+00
188001.00000  189001.00000  0.000000000000e+00
189001.00000  190001.00000  0.000000000000e+00
190001.00000  191001.00000  1.924632047504e-08
191001.00000  192001.00000  0.000000000000e+00
192001.00000  193001.00000  0.000000000000e+00
193001.00000  194001.00000  0.000000000000e+00
194001.00000  195001.00000  0.000000000000e+00
195001.00000  196001.00000  0.000000000000e+00
196001.00000  197001.00000  0.000000000000e+00
197001.00000  198001.00000  0.000000000000e+00
198001.00000  199001.00000  0.000000000000e+00
