300.00000  350.00000  2.507725355073e-05
350.00000  400.00000  4.334782399484e-05
400.00000  450.00000  3.295867609525e-05
450.00000  500.00000  3.869061976399e-05
500.00000  550.00000  2.844477045612e-04
550.00000  600.00000  2.543550003003e-05
600.00000  650.00000  7.415702121431e-05
650.00000  700.00000  2.615199298862e-05
700.00000  750.00000  5.767768316668e-05
750.00000  800.00000  4.012360568117e-05
800.00000  850.00000  1.497470283458e-04
850.00000  900.00000  3.152569017806e-05
900.00000  950.00000  2.865971834369e-05
950.00000  1000.00000  3.546640145032e-05
1000.00000  1050.00000  3.904886624328e-05
1050.00000  1100.00000  3.725763384680e-05
1100.00000  1150.00000  2.615199298862e-05
1150.00000  1200.00000  3.116744369877e-05
1200.00000  1250.00000  3.904886624328e-05
1250.00000  1300.00000  1.114146550611e-04
1300.00000  1350.00000  4.048185216047e-05
1350.00000  1400.00000  4.048185216047e-05
1400.00000  1450.00000  4.012360568117e-05
1450.00000  1500.00000  5.194573949794e-05
1500.00000  1550.00000  4.227308455695e-05
1550.00000  1600.00000  4.513905639132e-05
1600.00000  1650.00000  4.334782399484e-05
1650.00000  1700.00000  4.549730287061e-05
1700.00000  1750.00000  1.347006762154e-04
1750.00000  1800.00000  4.943801414287e-05
1800.00000  1850.00000  5.552820429091e-05
1850.00000  1900.00000  4.084009863976e-05
1900.00000  1950.00000  4.728853526709e-05
1950.00000  2000.00000  5.051275358076e-05
2000.00000  2050.00000  5.337872541513e-05
2050.00000  2100.00000  4.764678174639e-05
2100.00000  2150.00000  5.230398597724e-05
2150.00000  2200.00000  5.087100006006e-05
2200.00000  2250.00000  5.409521837372e-05
2250.00000  2300.00000  5.839417612528e-05
2300.00000  2350.00000  1.601361762454e-04
2350.00000  2400.00000  5.266223245654e-05
2400.00000  2450.00000  6.126014795964e-05
2450.00000  2500.00000  6.305138035613e-05
2500.00000  2550.00000  4.585554934991e-05
2550.00000  2600.00000  5.409521837372e-05
2600.00000  2650.00000  5.875242260457e-05
2650.00000  2700.00000  5.767768316668e-05
2700.00000  2750.00000  5.767768316668e-05
2750.00000  2800.00000  6.054365500105e-05
2800.00000  2850.00000  5.911066908387e-05
2850.00000  2900.00000  6.591735219049e-05
2900.00000  2950.00000  6.663384514909e-05
2950.00000  3000.00000  8.311318319671e-05
3000.00000  3050.00000  5.767768316668e-05
3050.00000  3100.00000  5.588645077020e-05
3100.00000  3150.00000  6.627559866979e-05
3150.00000  3200.00000  6.663384514909e-05
3200.00000  3250.00000  6.269313387683e-05
3250.00000  3300.00000  6.484261275261e-05
3300.00000  3350.00000  6.520085923190e-05
3350.00000  3400.00000  6.842507754557e-05
3400.00000  3450.00000  6.842507754557e-05
3450.00000  3500.00000  6.878332402486e-05
3500.00000  3550.00000  6.555910571120e-05
3550.00000  3600.00000  6.914157050416e-05
3600.00000  3650.00000  6.735033810768e-05
3650.00000  3700.00000  9.636830293067e-05
3700.00000  3750.00000  6.985806346275e-05
3750.00000  3800.00000  6.806683106627e-05
3800.00000  3850.00000  7.953071840375e-05
3850.00000  3900.00000  6.627559866979e-05
3900.00000  3950.00000  7.129104937994e-05
3950.00000  4000.00000  6.448436627331e-05
4000.00000  4050.00000  7.236578881783e-05
4050.00000  4100.00000  7.594825361079e-05
4100.00000  4150.00000  7.164929585923e-05
4150.00000  4200.00000  7.415702121431e-05
4200.00000  4250.00000  7.021630994205e-05
4250.00000  4300.00000  7.845597896586e-05
4300.00000  4350.00000  6.878332402486e-05
4350.00000  4400.00000  7.630650009008e-05
4400.00000  4450.00000  7.164929585923e-05
4450.00000  4500.00000  8.132195080023e-05
4500.00000  4550.00000  7.559000713149e-05
4550.00000  4600.00000  7.523176065220e-05
4600.00000  4650.00000  7.773948600727e-05
4650.00000  4700.00000  8.239669023812e-05
4700.00000  4750.00000  8.382967615530e-05
4750.00000  4800.00000  7.451526769360e-05
4800.00000  4850.00000  8.060545784164e-05
4850.00000  4900.00000  7.451526769360e-05
4900.00000  4950.00000  7.666474656938e-05
4950.00000  5000.00000  7.379877473501e-05
5000.00000  5050.00000  8.669564798967e-05
5050.00000  5100.00000  8.597915503108e-05
5100.00000  5150.00000  7.487351417290e-05
5150.00000  5200.00000  8.812863390686e-05
5200.00000  5250.00000  8.848688038615e-05
5250.00000  5300.00000  9.206934517912e-05
5300.00000  5350.00000  7.487351417290e-05
5350.00000  5400.00000  7.881422544516e-05
5400.00000  5450.00000  9.135285222052e-05
5450.00000  5500.00000  8.848688038615e-05
5500.00000  5550.00000  8.060545784164e-05
5550.00000  5600.00000  8.526266207249e-05
5600.00000  5650.00000  7.809773248656e-05
5650.00000  5700.00000  8.096370432093e-05
5700.00000  5750.00000  7.917247192445e-05
5750.00000  5800.00000  8.741214094827e-05
5800.00000  5850.00000  9.027811278263e-05
5850.00000  5900.00000  7.881422544516e-05
5900.00000  5950.00000  8.418792263460e-05
5950.00000  6000.00000  7.881422544516e-05
6000.00000  6050.00000  8.562090855178e-05
6050.00000  6100.00000  7.953071840375e-05
6100.00000  6150.00000  8.168019727953e-05
6150.00000  6200.00000  7.953071840375e-05
6200.00000  6250.00000  1.010255071615e-04
6250.00000  6300.00000  1.336259367775e-04
6300.00000  6350.00000  1.354171691740e-04
6350.00000  6400.00000  1.096234226646e-03
6400.00000  6450.00000  7.200754233853e-05
6450.00000  6500.00000  8.526266207249e-05
6500.00000  6550.00000  8.490441559319e-05
6550.00000  6600.00000  7.917247192445e-05
6600.00000  6650.00000  7.594825361079e-05
6650.00000  6700.00000  7.809773248656e-05
6700.00000  6750.00000  7.451526769360e-05
6750.00000  6800.00000  7.845597896586e-05
6800.00000  6850.00000  8.096370432093e-05
6850.00000  6900.00000  7.845597896586e-05
6900.00000  6950.00000  7.451526769360e-05
6950.00000  7000.00000  7.988896488305e-05
7000.00000  7050.00000  7.630650009008e-05
7050.00000  7100.00000  1.887958945891e-04
7100.00000  7150.00000  5.266223245654e-05
7150.00000  7200.00000  5.051275358076e-05
7200.00000  7250.00000  4.191483807765e-05
7250.00000  7300.00000  5.337872541513e-05
7300.00000  7350.00000  5.158749301865e-05
7350.00000  7400.00000  4.442256343272e-05
7400.00000  7450.00000  5.194573949794e-05
7450.00000  7500.00000  8.633740151038e-05
7500.00000  7550.00000  4.406431695343e-05
7550.00000  7600.00000  4.943801414287e-05
7600.00000  7650.00000  5.087100006006e-05
7650.00000  7700.00000  4.657204230850e-05
7700.00000  7750.00000  5.051275358076e-05
7750.00000  7800.00000  4.442256343272e-05
7800.00000  7850.00000  4.836327470498e-05
7850.00000  7900.00000  5.337872541513e-05
7900.00000  7950.00000  4.549730287061e-05
7950.00000  8000.00000  3.940711272258e-05
8000.00000  8050.00000  4.621379582921e-05
8050.00000  8100.00000  4.693028878780e-05
8100.00000  8150.00000  4.764678174639e-05
8150.00000  8200.00000  4.585554934991e-05
8200.00000  8250.00000  5.302047893583e-05
8250.00000  8300.00000  4.728853526709e-05
8300.00000  8350.00000  3.904886624328e-05
8350.00000  8400.00000  4.370607047413e-05
8400.00000  8450.00000  3.761588032610e-05
8450.00000  8500.00000  4.764678174639e-05
8500.00000  8550.00000  4.263133103624e-05
8550.00000  8600.00000  3.833237328469e-05
8600.00000  8650.00000  4.263133103624e-05
8650.00000  8700.00000  4.764678174639e-05
8700.00000  8750.00000  3.761588032610e-05
8750.00000  8800.00000  4.263133103624e-05
8800.00000  8850.00000  4.084009863976e-05
8850.00000  8900.00000  5.051275358076e-05
8900.00000  8950.00000  4.012360568117e-05
8950.00000  9000.00000  4.907976766358e-05
9000.00000  9050.00000  3.904886624328e-05
9050.00000  9100.00000  4.370607047413e-05
9100.00000  9150.00000  4.549730287061e-05
9150.00000  9200.00000  4.728853526709e-05
9200.00000  9250.00000  3.904886624328e-05
9250.00000  9300.00000  4.084009863976e-05
9300.00000  9350.00000  4.585554934991e-05
9350.00000  9400.00000  4.334782399484e-05
9400.00000  9450.00000  4.298957751554e-05
9450.00000  9500.00000  4.012360568117e-05
9500.00000  9550.00000  4.084009863976e-05
9550.00000  9600.00000  4.084009863976e-05
9600.00000  9650.00000  4.191483807765e-05
9650.00000  9700.00000  3.833237328469e-05
9700.00000  9750.00000  4.048185216047e-05
9750.00000  9800.00000  3.582464792962e-05
9800.00000  9850.00000  3.797412680539e-05
9850.00000  9900.00000  3.654114088821e-05
9900.00000  9950.00000  3.654114088821e-05
9950.00000  10000.00000  3.940711272258e-05
