300.00000  350.00000  0.000000000000e+00
350.00000  400.00000  0.000000000000e+00
400.00000  450.00000  0.000000000000e+00
450.00000  500.00000  0.000000000000e+00
500.00000  550.00000  1.204610652330e-06
550.00000  600.00000  0.000000000000e+00
600.00000  650.00000  4.015368841101e-07
650.00000  700.00000  6.023053261651e-07
700.00000  750.00000  8.030737682202e-07
750.00000  800.00000  6.023053261651e-07
800.00000  850.00000  5.019211051376e-06
850.00000  900.00000  1.003842210275e-06
900.00000  950.00000  8.030737682202e-07
950.00000  1000.00000  1.003842210275e-06
1000.00000  1050.00000  2.810758188771e-06
1050.00000  1100.00000  2.208452862605e-06
1100.00000  1150.00000  2.208452862605e-06
1150.00000  1200.00000  1.405379094385e-06
1200.00000  1250.00000  3.212295072881e-06
1250.00000  1300.00000  1.586070692235e-05
1300.00000  1350.00000  3.011526630826e-06
1350.00000  1400.00000  5.621516377541e-06
1400.00000  1450.00000  4.617674167266e-06
1450.00000  1500.00000  5.420747935486e-06
1500.00000  1550.00000  8.432274566312e-06
1550.00000  1600.00000  6.625358587816e-06
1600.00000  1650.00000  6.023053261651e-06
1650.00000  1700.00000  7.629200798092e-06
1700.00000  1750.00000  3.593755112785e-05
1750.00000  1800.00000  1.244764340741e-05
1800.00000  1850.00000  1.244764340741e-05
1850.00000  1900.00000  1.104226431303e-05
1900.00000  1950.00000  8.633043008367e-06
1950.00000  2000.00000  1.104226431303e-05
2000.00000  2050.00000  1.043995898686e-05
2050.00000  2100.00000  1.244764340741e-05
2100.00000  2150.00000  1.244764340741e-05
2150.00000  2200.00000  1.606147536440e-05
2200.00000  2250.00000  1.325071717563e-05
2250.00000  2300.00000  1.445532782796e-05
2300.00000  2350.00000  7.026895471927e-05
2350.00000  2400.00000  1.445532782796e-05
2400.00000  2450.00000  1.967530732139e-05
2450.00000  2500.00000  2.188376018400e-05
2500.00000  2550.00000  2.047838108961e-05
2550.00000  2600.00000  1.626224380646e-05
2600.00000  2650.00000  2.188376018400e-05
2650.00000  2700.00000  2.248606551016e-05
2700.00000  2750.00000  2.569836058305e-05
2750.00000  2800.00000  2.469451837277e-05
2800.00000  2850.00000  2.911142409798e-05
2850.00000  2900.00000  2.650143435127e-05
2900.00000  2950.00000  3.573678268580e-05
2950.00000  3000.00000  6.223821703706e-05
3000.00000  3050.00000  3.935061464279e-05
3050.00000  3100.00000  4.718058388294e-05
3100.00000  3150.00000  5.059364739787e-05
3150.00000  3200.00000  5.641593221747e-05
3200.00000  3250.00000  5.942745884829e-05
3250.00000  3300.00000  5.782131131185e-05
3300.00000  3350.00000  6.585204899405e-05
3350.00000  3400.00000  7.167433381365e-05
3400.00000  3450.00000  7.950430305380e-05
3450.00000  3500.00000  8.974349359860e-05
3500.00000  3550.00000  1.068088111733e-04
3550.00000  3600.00000  1.041988214266e-04
3600.00000  3650.00000  1.180518439284e-04
3650.00000  3700.00000  1.752708499141e-04
3700.00000  3750.00000  1.391325303441e-04
3750.00000  3800.00000  1.497732577731e-04
3800.00000  3850.00000  1.638270487169e-04
3850.00000  3900.00000  1.670393437898e-04
3900.00000  3950.00000  1.883207986476e-04
3950.00000  4000.00000  1.965523047719e-04
4000.00000  4050.00000  2.222506653549e-04
4050.00000  4100.00000  2.059884215485e-04
4100.00000  4150.00000  2.276714132904e-04
4150.00000  4200.00000  2.210460547026e-04
4200.00000  4250.00000  2.549759214099e-04
4250.00000  4300.00000  2.565820689463e-04
4300.00000  4350.00000  2.656166488388e-04
4350.00000  4400.00000  2.754543024995e-04
4400.00000  4450.00000  2.686281754696e-04
4450.00000  4500.00000  2.969365257994e-04
4500.00000  4550.00000  3.123956958376e-04
4550.00000  4600.00000  3.019557368508e-04
4600.00000  4650.00000  3.194225913096e-04
4650.00000  4700.00000  3.288587080862e-04
4700.00000  4750.00000  3.248433392451e-04
4750.00000  4800.00000  3.348817613478e-04
4800.00000  4850.00000  3.435148043562e-04
4850.00000  4900.00000  3.449201834506e-04
4900.00000  4950.00000  3.666031751925e-04
4950.00000  5000.00000  3.664024067505e-04
5000.00000  5050.00000  3.728269968962e-04
5050.00000  5100.00000  3.674062489607e-04
5100.00000  5150.00000  3.832669558831e-04
5150.00000  5200.00000  3.760392919691e-04
5200.00000  5250.00000  4.043476422989e-04
5250.00000  5300.00000  4.015368841101e-04
5300.00000  5350.00000  4.186022016848e-04
5350.00000  5400.00000  4.177991279165e-04
5400.00000  5450.00000  4.469105520145e-04
5450.00000  5500.00000  4.256290971567e-04
5500.00000  5550.00000  4.226175705259e-04
5550.00000  5600.00000  4.192045070109e-04
5600.00000  5650.00000  4.334590663968e-04
5650.00000  5700.00000  4.372736667959e-04
5700.00000  5750.00000  4.336598348389e-04
5750.00000  5800.00000  4.276367815772e-04
5800.00000  5850.00000  4.372736667959e-04
5850.00000  5900.00000  4.398836565426e-04
5900.00000  5950.00000  4.182006648007e-04
5950.00000  6000.00000  4.362698245856e-04
6000.00000  6050.00000  4.196060438950e-04
6050.00000  6100.00000  4.320536873025e-04
6100.00000  6150.00000  4.549412896967e-04
6150.00000  6200.00000  4.479143942248e-04
6200.00000  6250.00000  5.103533797039e-04
6250.00000  6300.00000  5.733946705092e-04
6300.00000  6350.00000  5.816261766335e-04
6350.00000  6400.00000  2.772612184780e-03
6400.00000  6450.00000  4.272352446931e-04
6450.00000  6500.00000  4.121776115390e-04
6500.00000  6550.00000  4.216137283156e-04
6550.00000  6600.00000  4.165945172642e-04
6600.00000  6650.00000  3.995291996895e-04
6650.00000  6700.00000  4.188029701268e-04
6700.00000  6750.00000  4.087645480241e-04
6750.00000  6800.00000  4.041468738568e-04
6800.00000  6850.00000  4.133822221913e-04
6850.00000  6900.00000  4.141852959596e-04
6900.00000  6950.00000  4.216137283156e-04
6950.00000  7000.00000  4.021391894363e-04
7000.00000  7050.00000  3.979230521531e-04
7050.00000  7100.00000  6.103360638473e-04
7100.00000  7150.00000  2.206445178185e-04
7150.00000  7200.00000  2.075945690849e-04
7200.00000  7250.00000  2.357021509726e-04
7250.00000  7300.00000  2.200422124923e-04
7300.00000  7350.00000  2.310844768054e-04
7350.00000  7400.00000  2.363044562988e-04
7400.00000  7450.00000  2.332929296680e-04
7450.00000  7500.00000  3.043649581554e-04
7500.00000  7550.00000  2.230537391232e-04
7550.00000  7600.00000  2.248606551016e-04
7600.00000  7650.00000  2.214475915867e-04
7650.00000  7700.00000  2.278721817325e-04
7700.00000  7750.00000  2.194399071662e-04
7750.00000  7800.00000  2.274706448484e-04
7800.00000  7850.00000  2.112084010419e-04
7850.00000  7900.00000  2.210460547026e-04
7900.00000  7950.00000  2.208452862605e-04
7950.00000  8000.00000  2.340960034362e-04
8000.00000  8050.00000  2.188376018400e-04
8050.00000  8100.00000  2.120114748101e-04
8100.00000  8150.00000  2.049845793382e-04
8150.00000  8200.00000  2.150230014410e-04
8200.00000  8250.00000  2.150230014410e-04
8250.00000  8300.00000  2.260652657540e-04
8300.00000  8350.00000  2.126137801363e-04
8350.00000  8400.00000  1.975561469822e-04
8400.00000  8450.00000  2.134168539045e-04
8450.00000  8500.00000  2.130153170204e-04
8500.00000  8550.00000  2.092007166214e-04
8550.00000  8600.00000  2.089999481793e-04
8600.00000  8650.00000  2.033784318018e-04
8650.00000  8700.00000  2.053861162223e-04
8700.00000  8750.00000  1.891238724159e-04
8750.00000  8800.00000  2.122122432522e-04
8800.00000  8850.00000  1.925369359308e-04
8850.00000  8900.00000  2.081968744111e-04
8900.00000  8950.00000  2.051853477803e-04
8950.00000  9000.00000  2.114091694840e-04
9000.00000  9050.00000  2.041815055700e-04
9050.00000  9100.00000  1.925369359308e-04
9100.00000  9150.00000  1.989615260765e-04
9150.00000  9200.00000  1.995638314027e-04
9200.00000  9250.00000  1.945446203513e-04
9250.00000  9300.00000  1.933400096990e-04
9300.00000  9350.00000  2.029768949176e-04
9350.00000  9400.00000  2.092007166214e-04
9400.00000  9450.00000  1.969538416560e-04
9450.00000  9500.00000  1.847069666906e-04
9500.00000  9550.00000  1.923361674887e-04
9550.00000  9600.00000  1.949461572354e-04
9600.00000  9650.00000  1.826992822701e-04
9650.00000  9700.00000  1.929384728149e-04
9700.00000  9750.00000  1.883207986476e-04
9750.00000  9800.00000  1.907300199523e-04
9800.00000  9850.00000  1.734639339356e-04
9850.00000  9900.00000  1.889231039738e-04
9900.00000  9950.00000  1.935407781411e-04
9950.00000  10000.00000  1.688462597683e-04
