10001.00000  11001.00000  3.378818713335e-04
11001.00000  12001.00000  2.791014206259e-04
12001.00000  13001.00000  2.313350962282e-04
13001.00000  14001.00000  1.962167563188e-04
14001.00000  15001.00000  1.673070774881e-04
15001.00000  16001.00000  1.445868378752e-04
16001.00000  17001.00000  1.246922118182e-04
17001.00000  18001.00000  1.081037458402e-04
18001.00000  19001.00000  9.278392268328e-05
19001.00000  20001.00000  8.326910152558e-05
20001.00000  21001.00000  7.396572083805e-05
21001.00000  22001.00000  6.348980663412e-05
22001.00000  23001.00000  6.026053399878e-05
23001.00000  24001.00000  5.282167382094e-05
24001.00000  25001.00000  4.715122484817e-05
25001.00000  26001.00000  4.261486566995e-05
26001.00000  27001.00000  3.821305951820e-05
27001.00000  28001.00000  3.454168408160e-05
28001.00000  29001.00000  3.236961379711e-05
29001.00000  30001.00000  2.777558903612e-05
30001.00000  31001.00000  2.664149924156e-05
31001.00000  32001.00000  2.341222660622e-05
32001.00000  33001.00000  2.210514006335e-05
33001.00000  34001.00000  2.027906327551e-05
34001.00000  35001.00000  1.816465857379e-05
35001.00000  36001.00000  1.651157853427e-05
36001.00000  37001.00000  1.545437618342e-05
37001.00000  38001.00000  1.474316732921e-05
38001.00000  39001.00000  1.284020309767e-05
39001.00000  40001.00000  1.255187518380e-05
40001.00000  41001.00000  1.197521935606e-05
41001.00000  42001.00000  1.011069884637e-05
42001.00000  43001.00000  1.051435792578e-05
43001.00000  44001.00000  9.572486740475e-06
44001.00000  45001.00000  9.188049521982e-06
45001.00000  46001.00000  8.246178336675e-06
46001.00000  47001.00000  7.150532263970e-06
47001.00000  48001.00000  6.650763879929e-06
48001.00000  49001.00000  6.958313654723e-06
49001.00000  50001.00000  6.727651323627e-06
50001.00000  51001.00000  5.516674085374e-06
51001.00000  52001.00000  5.958776886641e-06
52001.00000  53001.00000  5.209124310580e-06
53001.00000  54001.00000  5.036127562258e-06
54001.00000  55001.00000  4.574802900067e-06
55001.00000  56001.00000  4.209587542498e-06
56001.00000  57001.00000  3.671375436608e-06
57001.00000  58001.00000  3.113941469793e-06
58001.00000  59001.00000  3.748262880307e-06
59001.00000  60001.00000  3.575266131985e-06
60001.00000  61001.00000  2.844835416848e-06
61001.00000  62001.00000  2.979388443321e-06
62001.00000  63001.00000  2.691060529451e-06
63001.00000  64001.00000  2.345067032807e-06
64001.00000  65001.00000  2.133626562636e-06
65001.00000  66001.00000  1.960629814314e-06
66001.00000  67001.00000  2.421954476506e-06
67001.00000  68001.00000  2.229735867259e-06
68001.00000  69001.00000  1.941407953390e-06
69001.00000  70001.00000  2.018295397088e-06
70001.00000  71001.00000  1.691523761369e-06
71001.00000  72001.00000  1.845298648766e-06
72001.00000  73001.00000  1.518527013047e-06
73001.00000  74001.00000  1.653080039520e-06
74001.00000  75001.00000  1.441639569349e-06
75001.00000  76001.00000  1.230199099178e-06
76001.00000  77001.00000  1.307086542876e-06
77001.00000  78001.00000  1.364752125650e-06
78001.00000  79001.00000  1.057202350856e-06
79001.00000  80001.00000  7.688744369860e-07
80001.00000  81001.00000  9.418711853078e-07
81001.00000  82001.00000  9.995367680818e-07
82001.00000  83001.00000  7.304307151367e-07
83001.00000  84001.00000  9.610930462325e-07
84001.00000  85001.00000  8.842056025339e-07
85001.00000  86001.00000  9.418711853078e-07
86001.00000  87001.00000  6.727651323627e-07
87001.00000  88001.00000  8.649837416092e-07
88001.00000  89001.00000  7.688744369860e-07
89001.00000  90001.00000  8.265400197599e-07
90001.00000  91001.00000  5.766558277395e-07
91001.00000  92001.00000  5.766558277395e-07
92001.00000  93001.00000  5.574339668148e-07
93001.00000  94001.00000  6.535432714381e-07
94001.00000  95001.00000  6.343214105134e-07
95001.00000  96001.00000  4.421028012669e-07
96001.00000  97001.00000  3.652153575683e-07
97001.00000  98001.00000  5.189902449655e-07
98001.00000  99001.00000  5.189902449655e-07
99001.00000  100001.00000  3.652153575683e-07
100001.00000  101001.00000  3.267716357190e-07
101001.00000  102001.00000  3.652153575683e-07
102001.00000  103001.00000  3.652153575683e-07
103001.00000  104001.00000  3.652153575683e-07
104001.00000  105001.00000  3.844372184930e-07
105001.00000  106001.00000  1.729967483218e-07
106001.00000  107001.00000  4.036590794176e-07
107001.00000  108001.00000  3.267716357190e-07
108001.00000  109001.00000  2.498841920204e-07
109001.00000  110001.00000  3.459934966437e-07
110001.00000  111001.00000  3.844372184930e-07
111001.00000  112001.00000  1.729967483218e-07
112001.00000  113001.00000  2.691060529451e-07
113001.00000  114001.00000  1.345530264725e-07
114001.00000  115001.00000  2.306623310958e-07
115001.00000  116001.00000  1.729967483218e-07
116001.00000  117001.00000  2.114404701711e-07
117001.00000  118001.00000  1.537748873972e-07
118001.00000  119001.00000  1.729967483218e-07
119001.00000  120001.00000  1.922186092465e-07
120001.00000  121001.00000  1.922186092465e-07
121001.00000  122001.00000  1.345530264725e-07
122001.00000  123001.00000  7.688744369860e-08
123001.00000  124001.00000  1.729967483218e-07
124001.00000  125001.00000  1.345530264725e-07
125001.00000  126001.00000  9.610930462325e-08
126001.00000  127001.00000  1.537748873972e-07
127001.00000  128001.00000  1.153311655479e-07
128001.00000  129001.00000  1.729967483218e-07
129001.00000  130001.00000  7.688744369860e-08
130001.00000  131001.00000  1.922186092465e-07
131001.00000  132001.00000  1.729967483218e-07
132001.00000  133001.00000  5.766558277395e-08
133001.00000  134001.00000  9.610930462325e-08
134001.00000  135001.00000  1.922186092465e-08
135001.00000  136001.00000  1.922186092465e-08
136001.00000  137001.00000  1.345530264725e-07
137001.00000  138001.00000  3.844372184930e-08
138001.00000  139001.00000  1.345530264725e-07
139001.00000  140001.00000  7.688744369860e-08
140001.00000  141001.00000  3.844372184930e-08
141001.00000  142001.00000  7.688744369860e-08
142001.00000  143001.00000  1.153311655479e-07
143001.00000  144001.00000  0.000000000000e+00
144001.00000  145001.00000  9.610930462325e-08
145001.00000  146001.00000  9.610930462325e-08
146001.00000  147001.00000  1.922186092465e-08
147001.00000  148001.00000  1.922186092465e-08
148001.00000  149001.00000  9.610930462325e-08
149001.00000  150001.00000  5.766558277395e-08
150001.00000  151001.00000  9.610930462325e-08
151001.00000  152001.00000  1.922186092465e-08
152001.00000  153001.00000  1.922186092465e-08
153001.00000  154001.00000  1.922186092465e-08
154001.00000  155001.00000  1.922186092465e-08
155001.00000  156001.00000  1.922186092465e-08
156001.00000  157001.00000  0.000000000000e+00
157001.00000  158001.00000  1.922186092465e-08
158001.00000  159001.00000  3.844372184930e-08
159001.00000  160001.00000  0.000000000000e+00
160001.00000  161001.00000  5.766558277395e-08
161001.00000  162001.00000  3.844372184930e-08
162001.00000  163001.00000  0.000000000000e+00
163001.00000  164001.00000  0.000000000000e+00
164001.00000  165001.00000  7.688744369860e-08
165001.00000  166001.00000  0.000000000000e+00
166001.00000  167001.00000  3.844372184930e-08
167001.00000  168001.00000  3.844372184930e-08
168001.00000  169001.00000  0.000000000000e+00
169001.00000  170001.00000  5.766558277395e-08
170001.00000  171001.00000  0.000000000000e+00
171001.00000  172001.00000  1.922186092465e-08
172001.00000  173001.00000  1.922186092465e-08
173001.00000  174001.00000  1.922186092465e-08
174001.00000  175001.00000  1.922186092465e-08
175001.00000  176001.00000  0.000000000000e+00
176001.00000  177001.00000  0.000000000000e+00
177001.00000  178001.00000  1.922186092465e-08
178001.00000  179001.00000  1.922186092465e-08
179001.00000  180001.00000  0.000000000000e+00
180001.00000  181001.00000  1.922186092465e-08
181001.00000  182001.00000  0.000000000000e+00
182001.00000  183001.00000  0.000000000000e+00
183001.00000  184001.00000  0.000000000000e+00
184001.00000  185001.00000  1.922186092465e-08
185001.00000  186001.00000  0.000000000000e+00
186001.00000  187001.00000  1.922186092465e-08
187001.00000  188001.00000  1.922186092465e-08
188001.00000  189001.00000  0.000000000000e+00
189001.00000  190001.00000  0.000000000000e+00
190001.00000  191001.00000  1.922186092465e-08
191001.00000  192001.00000  1.922186092465e-08
192001.00000  193001.00000  0.000000000000e+00
193001.00000  194001.00000  0.000000000000e+00
194001.00000  195001.00000  0.000000000000e+00
195001.00000  196001.00000  3.844372184930e-08
196001.00000  197001.00000  0.000000000000e+00
197001.00000  198001.00000  0.000000000000e+00
198001.00000  199001.00000  0.000000000000e+00
