10001.00000  11001.00000  1.872843648024e-04
11001.00000  12001.00000  1.737890943203e-04
12001.00000  13001.00000  1.528714250729e-04
13001.00000  14001.00000  1.312415054390e-04
14001.00000  15001.00000  1.135102194999e-04
15001.00000  16001.00000  1.000149490178e-04
16001.00000  17001.00000  8.816910048344e-05
17001.00000  18001.00000  8.029685936885e-05
18001.00000  19001.00000  6.751383927325e-05
19001.00000  20001.00000  6.166588873098e-05
20001.00000  21001.00000  5.450589800294e-05
21001.00000  22001.00000  4.940768470968e-05
22001.00000  23001.00000  4.457187945358e-05
23001.00000  24001.00000  3.917377126071e-05
24001.00000  25001.00000  3.441293972951e-05
25001.00000  26001.00000  3.163891190817e-05
26001.00000  27001.00000  2.856498918724e-05
27001.00000  28001.00000  2.519117156670e-05
28001.00000  29001.00000  2.684059351452e-05
29001.00000  30001.00000  2.215473570821e-05
30001.00000  31001.00000  2.114259042205e-05
31001.00000  32001.00000  1.825610201337e-05
32001.00000  33001.00000  1.896835239992e-05
33001.00000  34001.00000  1.585694281654e-05
34001.00000  35001.00000  1.469485008057e-05
35001.00000  36001.00000  1.476982380547e-05
36001.00000  37001.00000  1.278302009560e-05
37001.00000  38001.00000  1.319537558256e-05
38001.00000  39001.00000  1.105862442288e-05
39001.00000  40001.00000  1.135851932248e-05
40001.00000  41001.00000  1.060878207348e-05
41001.00000  42001.00000  8.247109739098e-06
42001.00000  43001.00000  8.621978363602e-06
43001.00000  44001.00000  8.621978363602e-06
44001.00000  45001.00000  8.322083463998e-06
45001.00000  46001.00000  7.647319939890e-06
46001.00000  47001.00000  7.759780527242e-06
47001.00000  48001.00000  6.710148378629e-06
48001.00000  49001.00000  6.110358579422e-06
49001.00000  50001.00000  5.960411129620e-06
50001.00000  51001.00000  4.685857806305e-06
51001.00000  52001.00000  4.310989181801e-06
52001.00000  53001.00000  4.948265843459e-06
53001.00000  54001.00000  4.760831531206e-06
54001.00000  55001.00000  3.861146832396e-06
55001.00000  56001.00000  4.873292118558e-06
56001.00000  57001.00000  4.273502319351e-06
57001.00000  58001.00000  3.861146832396e-06
58001.00000  59001.00000  4.310989181801e-06
59001.00000  60001.00000  3.448791345441e-06
60001.00000  61001.00000  2.811514683783e-06
61001.00000  62001.00000  3.148896445837e-06
62001.00000  63001.00000  3.223870170738e-06
63001.00000  64001.00000  3.448791345441e-06
64001.00000  65001.00000  3.298843895639e-06
65001.00000  66001.00000  2.774027821333e-06
66001.00000  67001.00000  2.549106646630e-06
67001.00000  68001.00000  2.736540958882e-06
68001.00000  69001.00000  2.099264297225e-06
69001.00000  70001.00000  2.361672334378e-06
70001.00000  71001.00000  2.774027821333e-06
71001.00000  72001.00000  2.099264297225e-06
72001.00000  73001.00000  1.387013910666e-06
73001.00000  74001.00000  2.361672334378e-06
74001.00000  75001.00000  1.686908810270e-06
75001.00000  76001.00000  2.249211747027e-06
76001.00000  77001.00000  1.686908810270e-06
77001.00000  78001.00000  2.211724884576e-06
78001.00000  79001.00000  1.574448222919e-06
79001.00000  80001.00000  1.461987635567e-06
80001.00000  81001.00000  1.199579598414e-06
81001.00000  82001.00000  1.162092735964e-06
82001.00000  83001.00000  1.274553323315e-06
83001.00000  84001.00000  1.012145286162e-06
84001.00000  85001.00000  1.686908810270e-06
85001.00000  86001.00000  1.312040185766e-06
86001.00000  87001.00000  1.049632148612e-06
87001.00000  88001.00000  9.746584237115e-07
88001.00000  89001.00000  1.162092735964e-06
89001.00000  90001.00000  1.162092735964e-06
90001.00000  91001.00000  1.199579598414e-06
91001.00000  92001.00000  8.996846988106e-07
92001.00000  93001.00000  8.996846988106e-07
93001.00000  94001.00000  1.274553323315e-06
94001.00000  95001.00000  9.371715612611e-07
95001.00000  96001.00000  1.237066460865e-06
96001.00000  97001.00000  5.623029367566e-07
97001.00000  98001.00000  1.049632148612e-06
98001.00000  99001.00000  6.372766616575e-07
99001.00000  100001.00000  6.372766616575e-07
100001.00000  101001.00000  8.621978363602e-07
101001.00000  102001.00000  5.623029367566e-07
102001.00000  103001.00000  9.746584237115e-07
103001.00000  104001.00000  5.248160743062e-07
104001.00000  105001.00000  5.997897992071e-07
105001.00000  106001.00000  5.623029367566e-07
106001.00000  107001.00000  8.247109739098e-07
107001.00000  108001.00000  2.249211747027e-07
108001.00000  109001.00000  7.872241114593e-07
109001.00000  110001.00000  5.997897992071e-07
110001.00000  111001.00000  4.873292118558e-07
111001.00000  112001.00000  2.624080371531e-07
112001.00000  113001.00000  6.747635241080e-07
113001.00000  114001.00000  5.997897992071e-07
114001.00000  115001.00000  4.123554869549e-07
115001.00000  116001.00000  5.623029367566e-07
116001.00000  117001.00000  7.497372490089e-07
117001.00000  118001.00000  2.624080371531e-07
118001.00000  119001.00000  4.873292118558e-07
119001.00000  120001.00000  4.873292118558e-07
120001.00000  121001.00000  3.373817620540e-07
121001.00000  122001.00000  4.498423494053e-07
122001.00000  123001.00000  4.498423494053e-07
123001.00000  124001.00000  2.998948996035e-07
124001.00000  125001.00000  4.498423494053e-07
125001.00000  126001.00000  2.998948996035e-07
126001.00000  127001.00000  2.624080371531e-07
127001.00000  128001.00000  2.624080371531e-07
128001.00000  129001.00000  4.123554869549e-07
129001.00000  130001.00000  2.249211747027e-07
130001.00000  131001.00000  2.624080371531e-07
131001.00000  132001.00000  4.498423494053e-07
132001.00000  133001.00000  2.249211747027e-07
133001.00000  134001.00000  4.123554869549e-07
134001.00000  135001.00000  3.748686245044e-07
135001.00000  136001.00000  4.123554869549e-07
136001.00000  137001.00000  2.624080371531e-07
137001.00000  138001.00000  2.998948996035e-07
138001.00000  139001.00000  2.249211747027e-07
139001.00000  140001.00000  2.249211747027e-07
140001.00000  141001.00000  1.499474498018e-07
141001.00000  142001.00000  1.874343122522e-07
142001.00000  143001.00000  2.249211747027e-07
143001.00000  144001.00000  3.373817620540e-07
144001.00000  145001.00000  2.998948996035e-07
145001.00000  146001.00000  1.499474498018e-07
146001.00000  147001.00000  2.624080371531e-07
147001.00000  148001.00000  1.874343122522e-07
148001.00000  149001.00000  3.748686245044e-07
149001.00000  150001.00000  2.249211747027e-07
150001.00000  151001.00000  2.249211747027e-07
151001.00000  152001.00000  1.874343122522e-07
152001.00000  153001.00000  2.624080371531e-07
153001.00000  154001.00000  2.998948996035e-07
154001.00000  155001.00000  2.998948996035e-07
155001.00000  156001.00000  2.624080371531e-07
156001.00000  157001.00000  1.874343122522e-07
157001.00000  158001.00000  2.624080371531e-07
158001.00000  159001.00000  1.499474498018e-07
159001.00000  160001.00000  1.499474498018e-07
160001.00000  161001.00000  7.497372490089e-08
161001.00000  162001.00000  2.998948996035e-07
162001.00000  163001.00000  7.497372490089e-08
163001.00000  164001.00000  1.124605873513e-07
164001.00000  165001.00000  2.624080371531e-07
165001.00000  166001.00000  2.249211747027e-07
166001.00000  167001.00000  1.124605873513e-07
167001.00000  168001.00000  1.499474498018e-07
168001.00000  169001.00000  3.748686245044e-08
169001.00000  170001.00000  2.624080371531e-07
170001.00000  171001.00000  2.249211747027e-07
171001.00000  172001.00000  3.748686245044e-08
172001.00000  173001.00000  3.748686245044e-08
173001.00000  174001.00000  1.499474498018e-07
174001.00000  175001.00000  1.124605873513e-07
175001.00000  176001.00000  2.249211747027e-07
176001.00000  177001.00000  1.499474498018e-07
177001.00000  178001.00000  7.497372490089e-08
178001.00000  179001.00000  1.499474498018e-07
179001.00000  180001.00000  1.499474498018e-07
180001.00000  181001.00000  1.499474498018e-07
181001.00000  182001.00000  1.499474498018e-07
182001.00000  183001.00000  2.249211747027e-07
183001.00000  184001.00000  3.748686245044e-08
184001.00000  185001.00000  7.497372490089e-08
185001.00000  186001.00000  3.748686245044e-08
186001.00000  187001.00000  3.748686245044e-08
187001.00000  188001.00000  1.124605873513e-07
188001.00000  189001.00000  1.124605873513e-07
189001.00000  190001.00000  1.124605873513e-07
190001.00000  191001.00000  0.000000000000e+00
191001.00000  192001.00000  1.124605873513e-07
192001.00000  193001.00000  7.497372490089e-08
193001.00000  194001.00000  7.497372490089e-08
194001.00000  195001.00000  1.499474498018e-07
195001.00000  196001.00000  7.497372490089e-08
196001.00000  197001.00000  3.748686245044e-08
197001.00000  198001.00000  1.124605873513e-07
198001.00000  199001.00000  1.124605873513e-07
