300.00000  350.00000  1.081039419359e-05
350.00000  400.00000  1.930427534570e-05
400.00000  450.00000  1.312690723508e-05
450.00000  500.00000  1.081039419359e-05
500.00000  550.00000  1.316551578577e-04
550.00000  600.00000  1.196865071434e-05
600.00000  650.00000  4.324157677438e-05
650.00000  700.00000  1.621559129039e-05
700.00000  750.00000  2.393730142867e-05
750.00000  800.00000  1.969036085262e-05
800.00000  850.00000  6.602062168231e-05
850.00000  900.00000  1.505733476965e-05
900.00000  950.00000  1.544342027656e-05
950.00000  1000.00000  1.428516375582e-05
1000.00000  1050.00000  1.505733476965e-05
1050.00000  1100.00000  1.737384781113e-05
1100.00000  1150.00000  1.891818983879e-05
1150.00000  1200.00000  1.544342027656e-05
1200.00000  1250.00000  1.698776230422e-05
1250.00000  1300.00000  6.756496370996e-05
1300.00000  1350.00000  2.084861737336e-05
1350.00000  1400.00000  1.969036085262e-05
1400.00000  1450.00000  2.007644635953e-05
1450.00000  1500.00000  2.393730142867e-05
1500.00000  1550.00000  2.432338693559e-05
1550.00000  1600.00000  2.663989997707e-05
1600.00000  1650.00000  2.548164345633e-05
1650.00000  1700.00000  2.934249852547e-05
1700.00000  1750.00000  8.648315354875e-05
1750.00000  1800.00000  2.895641301856e-05
1800.00000  1850.00000  2.741207099090e-05
1850.00000  1900.00000  1.969036085262e-05
1900.00000  1950.00000  2.586772896324e-05
1950.00000  2000.00000  2.355121592176e-05
2000.00000  2050.00000  2.702598548399e-05
2050.00000  2100.00000  3.050075504621e-05
2100.00000  2150.00000  3.165901156695e-05
2150.00000  2200.00000  2.509555794942e-05
2200.00000  2250.00000  2.509555794942e-05
2250.00000  2300.00000  2.895641301856e-05
2300.00000  2350.00000  8.879966659024e-05
2350.00000  2400.00000  3.088684055313e-05
2400.00000  2450.00000  3.165901156695e-05
2450.00000  2500.00000  3.551986663610e-05
2500.00000  2550.00000  3.088684055313e-05
2550.00000  2600.00000  3.088684055313e-05
2600.00000  2650.00000  3.436161011535e-05
2650.00000  2700.00000  3.204509707387e-05
2700.00000  2750.00000  3.127292606004e-05
2750.00000  2800.00000  3.397552460844e-05
2800.00000  2850.00000  2.663989997707e-05
2850.00000  2900.00000  2.625381447016e-05
2900.00000  2950.00000  3.436161011535e-05
2950.00000  3000.00000  4.401374778821e-05
3000.00000  3050.00000  3.165901156695e-05
3050.00000  3100.00000  3.358943910153e-05
3100.00000  3150.00000  3.011466953930e-05
3150.00000  3200.00000  3.899463619832e-05
3200.00000  3250.00000  2.818424200473e-05
3250.00000  3300.00000  3.860855069141e-05
3300.00000  3350.00000  3.011466953930e-05
3350.00000  3400.00000  2.972858403238e-05
3400.00000  3450.00000  2.548164345633e-05
3450.00000  3500.00000  3.050075504621e-05
3500.00000  3550.00000  3.745029417067e-05
3550.00000  3600.00000  3.243118258078e-05
3600.00000  3650.00000  3.127292606004e-05
3650.00000  3700.00000  4.246940576055e-05
3700.00000  3750.00000  3.243118258078e-05
3750.00000  3800.00000  3.629203764992e-05
3800.00000  3850.00000  3.474769562227e-05
3850.00000  3900.00000  2.548164345633e-05
3900.00000  3950.00000  3.011466953930e-05
3950.00000  4000.00000  3.860855069141e-05
4000.00000  4050.00000  3.358943910153e-05
4050.00000  4100.00000  2.818424200473e-05
4100.00000  4150.00000  2.972858403238e-05
4150.00000  4200.00000  3.667812315684e-05
4200.00000  4250.00000  3.127292606004e-05
4250.00000  4300.00000  3.706420866375e-05
4300.00000  4350.00000  3.436161011535e-05
4350.00000  4400.00000  3.358943910153e-05
4400.00000  4450.00000  3.474769562227e-05
4450.00000  4500.00000  3.629203764992e-05
4500.00000  4550.00000  3.243118258078e-05
4550.00000  4600.00000  3.474769562227e-05
4600.00000  4650.00000  3.320335359461e-05
4650.00000  4700.00000  3.513378112918e-05
4700.00000  4750.00000  2.741207099090e-05
4750.00000  4800.00000  3.204509707387e-05
4800.00000  4850.00000  3.860855069141e-05
4850.00000  4900.00000  3.745029417067e-05
4900.00000  4950.00000  2.470947244250e-05
4950.00000  5000.00000  2.895641301856e-05
5000.00000  5050.00000  2.663989997707e-05
5050.00000  5100.00000  3.050075504621e-05
5100.00000  5150.00000  2.393730142867e-05
5150.00000  5200.00000  3.011466953930e-05
5200.00000  5250.00000  2.934249852547e-05
5250.00000  5300.00000  3.474769562227e-05
5300.00000  5350.00000  2.934249852547e-05
5350.00000  5400.00000  2.741207099090e-05
5400.00000  5450.00000  3.011466953930e-05
5450.00000  5500.00000  3.127292606004e-05
5500.00000  5550.00000  2.972858403238e-05
5550.00000  5600.00000  3.436161011535e-05
5600.00000  5650.00000  3.011466953930e-05
5650.00000  5700.00000  2.741207099090e-05
5700.00000  5750.00000  2.972858403238e-05
5750.00000  5800.00000  2.625381447016e-05
5800.00000  5850.00000  2.895641301856e-05
5850.00000  5900.00000  2.895641301856e-05
5900.00000  5950.00000  3.204509707387e-05
5950.00000  6000.00000  3.165901156695e-05
6000.00000  6050.00000  2.509555794942e-05
6050.00000  6100.00000  2.663989997707e-05
6100.00000  6150.00000  3.474769562227e-05
6150.00000  6200.00000  2.586772896324e-05
6200.00000  6250.00000  2.972858403238e-05
6250.00000  6300.00000  3.320335359461e-05
6300.00000  6350.00000  2.934249852547e-05
6350.00000  6400.00000  2.992162678584e-04
6400.00000  6450.00000  2.470947244250e-05
6450.00000  6500.00000  2.586772896324e-05
6500.00000  6550.00000  2.663989997707e-05
6550.00000  6600.00000  2.895641301856e-05
6600.00000  6650.00000  2.316513041484e-05
6650.00000  6700.00000  3.050075504621e-05
6700.00000  6750.00000  2.548164345633e-05
6750.00000  6800.00000  2.857032751164e-05
6800.00000  6850.00000  2.625381447016e-05
6850.00000  6900.00000  2.084861737336e-05
6900.00000  6950.00000  2.663989997707e-05
6950.00000  7000.00000  2.355121592176e-05
7000.00000  7050.00000  2.355121592176e-05
7050.00000  7100.00000  5.173545792649e-05
7100.00000  7150.00000  1.544342027656e-05
7150.00000  7200.00000  1.389907824891e-05
7200.00000  7250.00000  1.930427534570e-05
7250.00000  7300.00000  1.737384781113e-05
7300.00000  7350.00000  1.660167679731e-05
7350.00000  7400.00000  1.428516375582e-05
7400.00000  7450.00000  1.891818983879e-05
7450.00000  7500.00000  2.277904490793e-05
7500.00000  7550.00000  1.930427534570e-05
7550.00000  7600.00000  1.737384781113e-05
7600.00000  7650.00000  1.698776230422e-05
7650.00000  7700.00000  1.505733476965e-05
7700.00000  7750.00000  1.428516375582e-05
7750.00000  7800.00000  1.274082172816e-05
7800.00000  7850.00000  1.737384781113e-05
7850.00000  7900.00000  1.312690723508e-05
7900.00000  7950.00000  1.119647970051e-05
7950.00000  8000.00000  1.158256520742e-05
8000.00000  8050.00000  1.814601882496e-05
8050.00000  8100.00000  1.428516375582e-05
8100.00000  8150.00000  1.235473622125e-05
8150.00000  8200.00000  1.505733476965e-05
8200.00000  8250.00000  1.621559129039e-05
8250.00000  8300.00000  1.660167679731e-05
8300.00000  8350.00000  1.467124926274e-05
8350.00000  8400.00000  1.081039419359e-05
8400.00000  8450.00000  1.235473622125e-05
8450.00000  8500.00000  1.042430868668e-05
8500.00000  8550.00000  1.582950578348e-05
8550.00000  8600.00000  1.737384781113e-05
8600.00000  8650.00000  1.312690723508e-05
8650.00000  8700.00000  1.081039419359e-05
8700.00000  8750.00000  1.196865071434e-05
8750.00000  8800.00000  1.196865071434e-05
8800.00000  8850.00000  1.158256520742e-05
8850.00000  8900.00000  1.003822317977e-05
8900.00000  8950.00000  1.042430868668e-05
8950.00000  9000.00000  1.235473622125e-05
9000.00000  9050.00000  1.582950578348e-05
9050.00000  9100.00000  1.003822317977e-05
9100.00000  9150.00000  1.158256520742e-05
9150.00000  9200.00000  1.312690723508e-05
9200.00000  9250.00000  1.274082172816e-05
9250.00000  9300.00000  1.274082172816e-05
9300.00000  9350.00000  1.158256520742e-05
9350.00000  9400.00000  1.119647970051e-05
9400.00000  9450.00000  1.042430868668e-05
9450.00000  9500.00000  6.949539124453e-06
9500.00000  9550.00000  1.235473622125e-05
9550.00000  9600.00000  8.493881152110e-06
9600.00000  9650.00000  1.119647970051e-05
9650.00000  9700.00000  1.235473622125e-05
9700.00000  9750.00000  7.721710138282e-06
9750.00000  9800.00000  1.274082172816e-05
9800.00000  9850.00000  1.235473622125e-05
9850.00000  9900.00000  6.949539124453e-06
9900.00000  9950.00000  1.544342027656e-05
9950.00000  10000.00000  9.652137672852e-06
