10001.00000  11001.00000  5.093421738749e-05
11001.00000  12001.00000  5.276936050777e-05
12001.00000  13001.00000  5.224760413044e-05
13001.00000  14001.00000  5.055639380390e-05
14001.00000  15001.00000  5.016057862109e-05
15001.00000  16001.00000  4.904509946955e-05
16001.00000  17001.00000  4.927899025939e-05
17001.00000  18001.00000  4.622041839225e-05
18001.00000  19001.00000  4.427732567665e-05
19001.00000  20001.00000  3.995934186422e-05
20001.00000  21001.00000  3.981540907047e-05
21001.00000  22001.00000  3.616311442912e-05
22001.00000  23001.00000  3.260077778387e-05
23001.00000  24001.00000  3.065768506827e-05
24001.00000  25001.00000  2.817484437612e-05
25001.00000  26001.00000  2.743718880817e-05
26001.00000  27001.00000  2.493635651680e-05
27001.00000  28001.00000  2.268740661449e-05
28001.00000  29001.00000  2.277736461058e-05
29001.00000  30001.00000  1.941293555673e-05
30001.00000  31001.00000  1.827946480597e-05
31001.00000  32001.00000  1.716398565442e-05
32001.00000  33001.00000  1.606649810209e-05
33001.00000  34001.00000  1.556273332398e-05
34001.00000  35001.00000  1.347570781463e-05
35001.00000  36001.00000  1.268407744902e-05
36001.00000  37001.00000  1.270206904824e-05
37001.00000  38001.00000  1.165855629357e-05
38001.00000  39001.00000  1.000332916547e-05
39001.00000  40001.00000  1.016525355844e-05
40001.00000  41001.00000  8.581992827210e-06
41001.00000  42001.00000  9.031782807672e-06
42001.00000  43001.00000  8.150194445967e-06
43001.00000  44001.00000  8.096219648311e-06
44001.00000  45001.00000  6.728858107708e-06
45001.00000  46001.00000  6.944757298329e-06
46001.00000  47001.00000  6.207101730372e-06
47001.00000  48001.00000  6.890782500674e-06
48001.00000  49001.00000  5.685345353036e-06
49001.00000  50001.00000  5.343504967885e-06
50001.00000  51001.00000  5.487437761633e-06
51001.00000  52001.00000  4.515891403836e-06
52001.00000  53001.00000  5.109614178045e-06
53001.00000  54001.00000  4.389950209307e-06
54001.00000  55001.00000  3.922168629626e-06
55001.00000  56001.00000  4.066101423374e-06
56001.00000  57001.00000  3.490370248383e-06
57001.00000  58001.00000  3.616311442912e-06
58001.00000  59001.00000  3.832210633534e-06
59001.00000  60001.00000  3.436395450728e-06
60001.00000  61001.00000  2.950622271829e-06
61001.00000  62001.00000  2.752714680426e-06
62001.00000  63001.00000  2.914639073392e-06
63001.00000  64001.00000  3.130538264014e-06
64001.00000  65001.00000  2.734723081207e-06
65001.00000  66001.00000  2.464849092930e-06
66001.00000  67001.00000  2.518823890586e-06
67001.00000  68001.00000  2.428865894493e-06
68001.00000  69001.00000  1.925101116376e-06
69001.00000  70001.00000  2.230958303090e-06
70001.00000  71001.00000  2.141000306998e-06
71001.00000  72001.00000  1.997067513250e-06
72001.00000  73001.00000  1.943092715595e-06
73001.00000  74001.00000  1.979075914032e-06
74001.00000  75001.00000  1.673218727318e-06
75001.00000  76001.00000  1.943092715595e-06
76001.00000  77001.00000  1.601252330444e-06
77001.00000  78001.00000  1.619243929662e-06
78001.00000  79001.00000  1.907109517158e-06
79001.00000  80001.00000  1.367361540604e-06
80001.00000  81001.00000  1.511294334351e-06
81001.00000  82001.00000  1.295395143730e-06
82001.00000  83001.00000  1.097487552327e-06
83001.00000  84001.00000  1.439327937478e-06
84001.00000  85001.00000  1.169453949201e-06
85001.00000  86001.00000  1.151462349982e-06
86001.00000  87001.00000  8.096219648311e-07
87001.00000  88001.00000  8.635967624865e-07
88001.00000  89001.00000  9.355631593604e-07
89001.00000  90001.00000  7.736387663942e-07
90001.00000  91001.00000  9.175715601419e-07
91001.00000  92001.00000  7.916303656127e-07
92001.00000  93001.00000  8.096219648311e-07
93001.00000  94001.00000  9.535547585789e-07
94001.00000  95001.00000  7.736387663942e-07
95001.00000  96001.00000  9.895379570158e-07
96001.00000  97001.00000  8.096219648311e-07
97001.00000  98001.00000  8.276135640496e-07
98001.00000  99001.00000  9.175715601419e-07
99001.00000  100001.00000  5.757311749910e-07
100001.00000  101001.00000  6.656891710834e-07
101001.00000  102001.00000  7.736387663942e-07
102001.00000  103001.00000  7.016723695203e-07
103001.00000  104001.00000  6.836807703018e-07
104001.00000  105001.00000  5.937227742095e-07
105001.00000  106001.00000  5.577395757726e-07
106001.00000  107001.00000  7.376555679573e-07
107001.00000  108001.00000  4.857731788987e-07
108001.00000  109001.00000  7.556471671757e-07
109001.00000  110001.00000  7.376555679573e-07
110001.00000  111001.00000  4.138067820248e-07
111001.00000  112001.00000  5.757311749910e-07
112001.00000  113001.00000  4.677815796802e-07
113001.00000  114001.00000  4.857731788987e-07
114001.00000  115001.00000  5.217563773356e-07
115001.00000  116001.00000  4.497899804617e-07
116001.00000  117001.00000  3.778235835879e-07
117001.00000  118001.00000  4.138067820248e-07
118001.00000  119001.00000  3.598319843694e-07
119001.00000  120001.00000  3.958151828063e-07
120001.00000  121001.00000  4.857731788987e-07
121001.00000  122001.00000  2.878655874955e-07
122001.00000  123001.00000  2.878655874955e-07
123001.00000  124001.00000  1.979075914032e-07
124001.00000  125001.00000  3.418403851509e-07
125001.00000  126001.00000  2.878655874955e-07
126001.00000  127001.00000  1.979075914032e-07
127001.00000  128001.00000  2.338907898401e-07
128001.00000  129001.00000  1.619243929662e-07
129001.00000  130001.00000  2.518823890586e-07
130001.00000  131001.00000  3.058571867140e-07
131001.00000  132001.00000  3.238487859325e-07
132001.00000  133001.00000  2.698739882770e-07
133001.00000  134001.00000  1.979075914032e-07
134001.00000  135001.00000  1.979075914032e-07
135001.00000  136001.00000  2.698739882770e-07
136001.00000  137001.00000  1.979075914032e-07
137001.00000  138001.00000  2.338907898401e-07
138001.00000  139001.00000  1.619243929662e-07
139001.00000  140001.00000  2.878655874955e-07
140001.00000  141001.00000  2.158991906216e-07
141001.00000  142001.00000  1.799159921847e-07
142001.00000  143001.00000  1.439327937478e-07
143001.00000  144001.00000  2.158991906216e-07
144001.00000  145001.00000  1.799159921847e-07
145001.00000  146001.00000  1.439327937478e-07
146001.00000  147001.00000  1.619243929662e-07
147001.00000  148001.00000  7.196639687388e-08
148001.00000  149001.00000  1.439327937478e-07
149001.00000  150001.00000  2.338907898401e-07
150001.00000  151001.00000  1.259411945293e-07
151001.00000  152001.00000  2.158991906216e-07
152001.00000  153001.00000  8.995799609235e-08
153001.00000  154001.00000  3.598319843694e-08
154001.00000  155001.00000  1.079495953108e-07
155001.00000  156001.00000  1.619243929662e-07
156001.00000  157001.00000  1.979075914032e-07
157001.00000  158001.00000  1.979075914032e-07
158001.00000  159001.00000  1.079495953108e-07
159001.00000  160001.00000  1.259411945293e-07
160001.00000  161001.00000  8.995799609235e-08
161001.00000  162001.00000  7.196639687388e-08
162001.00000  163001.00000  1.799159921847e-07
163001.00000  164001.00000  1.619243929662e-07
164001.00000  165001.00000  1.259411945293e-07
165001.00000  166001.00000  5.397479765541e-08
166001.00000  167001.00000  5.397479765541e-08
167001.00000  168001.00000  8.995799609235e-08
168001.00000  169001.00000  1.619243929662e-07
169001.00000  170001.00000  5.397479765541e-08
170001.00000  171001.00000  1.079495953108e-07
171001.00000  172001.00000  8.995799609235e-08
172001.00000  173001.00000  1.079495953108e-07
173001.00000  174001.00000  5.397479765541e-08
174001.00000  175001.00000  8.995799609235e-08
175001.00000  176001.00000  1.079495953108e-07
176001.00000  177001.00000  1.439327937478e-07
177001.00000  178001.00000  1.079495953108e-07
178001.00000  179001.00000  1.439327937478e-07
179001.00000  180001.00000  1.439327937478e-07
180001.00000  181001.00000  8.995799609235e-08
181001.00000  182001.00000  1.259411945293e-07
182001.00000  183001.00000  1.259411945293e-07
183001.00000  184001.00000  1.439327937478e-07
184001.00000  185001.00000  3.598319843694e-08
185001.00000  186001.00000  1.979075914032e-07
186001.00000  187001.00000  8.995799609235e-08
187001.00000  188001.00000  7.196639687388e-08
188001.00000  189001.00000  5.397479765541e-08
189001.00000  190001.00000  7.196639687388e-08
190001.00000  191001.00000  5.397479765541e-08
191001.00000  192001.00000  1.619243929662e-07
192001.00000  193001.00000  7.196639687388e-08
193001.00000  194001.00000  5.397479765541e-08
194001.00000  195001.00000  1.799159921847e-08
195001.00000  196001.00000  8.995799609235e-08
196001.00000  197001.00000  2.158991906216e-07
197001.00000  198001.00000  1.799159921847e-08
198001.00000  199001.00000  5.397479765541e-08
