10001.00000  11001.00000  8.451119203184e-04
11001.00000  12001.00000  7.093382602836e-04
12001.00000  13001.00000  6.125637381146e-04
13001.00000  14001.00000  5.254937927560e-04
14001.00000  15001.00000  4.610578138094e-04
15001.00000  16001.00000  4.069995034397e-04
16001.00000  17001.00000  3.622539701955e-04
17001.00000  18001.00000  3.210748186985e-04
18001.00000  19001.00000  2.867170001770e-04
19001.00000  20001.00000  2.582160846373e-04
20001.00000  21001.00000  2.334925199058e-04
21001.00000  22001.00000  2.074127254959e-04
22001.00000  23001.00000  1.897214628010e-04
23001.00000  24001.00000  1.708146164684e-04
24001.00000  25001.00000  1.563381204188e-04
25001.00000  26001.00000  1.440315918548e-04
26001.00000  27001.00000  1.317853401654e-04
27001.00000  28001.00000  1.203226878458e-04
28001.00000  29001.00000  1.133908472669e-04
29001.00000  30001.00000  1.036661781649e-04
30001.00000  31001.00000  9.436344718508e-05
31001.00000  32001.00000  8.840608274552e-05
32001.00000  33001.00000  8.260945663823e-05
33001.00000  34001.00000  7.690324584284e-05
34001.00000  35001.00000  7.190026525110e-05
35001.00000  36001.00000  6.643516195411e-05
36001.00000  37001.00000  6.074904345025e-05
37001.00000  38001.00000  5.833796846628e-05
38001.00000  39001.00000  5.369664912214e-05
39001.00000  40001.00000  4.942703717136e-05
40001.00000  41001.00000  4.693559302126e-05
41001.00000  42001.00000  4.356008804370e-05
42001.00000  43001.00000  4.088781326980e-05
43001.00000  44001.00000  3.849683057737e-05
44001.00000  45001.00000  3.697986256662e-05
45001.00000  46001.00000  3.500077185061e-05
46001.00000  47001.00000  3.282075821927e-05
47001.00000  48001.00000  2.965622230282e-05
48001.00000  49001.00000  2.866165387193e-05
49001.00000  50001.00000  2.666247086439e-05
50001.00000  51001.00000  2.595924066073e-05
51001.00000  52001.00000  2.423130358889e-05
52001.00000  53001.00000  2.297553536807e-05
53001.00000  54001.00000  2.245313578821e-05
54001.00000  55001.00000  2.013247611614e-05
55001.00000  56001.00000  1.960003039051e-05
56001.00000  57001.00000  1.871596956306e-05
57001.00000  58001.00000  1.758075509144e-05
58001.00000  59001.00000  1.656609436902e-05
59001.00000  60001.00000  1.527014156514e-05
60001.00000  61001.00000  1.467741896491e-05
61001.00000  62001.00000  1.406460407315e-05
62001.00000  63001.00000  1.323077397453e-05
63001.00000  64001.00000  1.217592866904e-05
64001.00000  65001.00000  1.200514419101e-05
65001.00000  66001.00000  1.156311377728e-05
66001.00000  67001.00000  1.053840690910e-05
67001.00000  68001.00000  1.014660722420e-05
68001.00000  69001.00000  9.995915037704e-06
69001.00000  70001.00000  9.744761393540e-06
70001.00000  71001.00000  8.549270047323e-06
71001.00000  72001.00000  8.669823796521e-06
72001.00000  73001.00000  8.710008379587e-06
73001.00000  74001.00000  7.936455155564e-06
74001.00000  75001.00000  7.293501826506e-06
75001.00000  76001.00000  7.233224951906e-06
76001.00000  77001.00000  6.680686934747e-06
77001.00000  78001.00000  6.238656521019e-06
78001.00000  79001.00000  5.806672253058e-06
79001.00000  80001.00000  5.967410585323e-06
80001.00000  81001.00000  5.384734130864e-06
81001.00000  82001.00000  5.595703191961e-06
82001.00000  83001.00000  4.932657571369e-06
83001.00000  84001.00000  5.002980591735e-06
84001.00000  85001.00000  4.942703717136e-06
85001.00000  86001.00000  4.159104347346e-06
86001.00000  87001.00000  4.329888825377e-06
87001.00000  88001.00000  4.380119554210e-06
88001.00000  89001.00000  3.917996848949e-06
89001.00000  90001.00000  3.827581537050e-06
90001.00000  91001.00000  3.626658621720e-06
91001.00000  92001.00000  3.285089665657e-06
92001.00000  93001.00000  3.224812791058e-06
93001.00000  94001.00000  3.455874143689e-06
94001.00000  95001.00000  3.194674353759e-06
95001.00000  96001.00000  2.742597794264e-06
96001.00000  97001.00000  2.873197689229e-06
97001.00000  98001.00000  2.632090190833e-06
98001.00000  99001.00000  2.772736231564e-06
99001.00000  100001.00000  2.501490295868e-06
100001.00000  101001.00000  2.350798109370e-06
101001.00000  102001.00000  2.230244360171e-06
102001.00000  103001.00000  2.169967485572e-06
103001.00000  104001.00000  2.119736756739e-06
104001.00000  105001.00000  1.748029363377e-06
105001.00000  106001.00000  1.768121654910e-06
106001.00000  107001.00000  1.858536966809e-06
107001.00000  108001.00000  1.938906132942e-06
108001.00000  109001.00000  1.828398529510e-06
109001.00000  110001.00000  1.496875719214e-06
110001.00000  111001.00000  1.627475614179e-06
111001.00000  112001.00000  1.657614051479e-06
112001.00000  113001.00000  1.275860512350e-06
113001.00000  114001.00000  1.406460407315e-06
114001.00000  115001.00000  1.255768220817e-06
115001.00000  116001.00000  1.316045095416e-06
116001.00000  117001.00000  1.215583637751e-06
117001.00000  118001.00000  1.135214471619e-06
118001.00000  119001.00000  1.135214471619e-06
119001.00000  120001.00000  1.145260617385e-06
120001.00000  121001.00000  1.014660722420e-06
121001.00000  122001.00000  1.074937597019e-06
122001.00000  123001.00000  1.044799159720e-06
123001.00000  124001.00000  8.941069732218e-07
124001.00000  125001.00000  1.125168325852e-06
125001.00000  126001.00000  9.744761393540e-07
126001.00000  127001.00000  8.639685359221e-07
127001.00000  128001.00000  9.744761393540e-07
128001.00000  129001.00000  7.835993697898e-07
129001.00000  130001.00000  7.032302036576e-07
130001.00000  131001.00000  8.237839528560e-07
131001.00000  132001.00000  7.635070782568e-07
132001.00000  133001.00000  7.132763494241e-07
133001.00000  134001.00000  7.835993697898e-07
134001.00000  135001.00000  6.228610375253e-07
135001.00000  136001.00000  6.228610375253e-07
136001.00000  137001.00000  4.721688510272e-07
137001.00000  138001.00000  5.324457256264e-07
138001.00000  139001.00000  5.927226002257e-07
139001.00000  140001.00000  7.032302036576e-07
140001.00000  141001.00000  6.128148917587e-07
141001.00000  142001.00000  5.023072883268e-07
142001.00000  143001.00000  3.717073933619e-07
143001.00000  144001.00000  5.324457256264e-07
144001.00000  145001.00000  4.319842679611e-07
145001.00000  146001.00000  4.520765594941e-07
146001.00000  147001.00000  4.420304137276e-07
147001.00000  148001.00000  3.817535391284e-07
148001.00000  149001.00000  4.621227052607e-07
149001.00000  150001.00000  2.411074983969e-07
150001.00000  151001.00000  3.616612475953e-07
151001.00000  152001.00000  2.611997899299e-07
152001.00000  153001.00000  3.315228102957e-07
153001.00000  154001.00000  4.018458306615e-07
154001.00000  155001.00000  2.812920814630e-07
155001.00000  156001.00000  2.009229153307e-07
156001.00000  157001.00000  3.516151018288e-07
157001.00000  158001.00000  2.812920814630e-07
158001.00000  159001.00000  3.214766645292e-07
159001.00000  160001.00000  2.411074983969e-07
160001.00000  161001.00000  2.109690610973e-07
161001.00000  162001.00000  2.511536441634e-07
162001.00000  163001.00000  1.908767695642e-07
163001.00000  164001.00000  1.707844780311e-07
164001.00000  165001.00000  2.310613526303e-07
165001.00000  166001.00000  2.109690610973e-07
166001.00000  167001.00000  1.808306237977e-07
167001.00000  168001.00000  2.109690610973e-07
168001.00000  169001.00000  2.511536441634e-07
169001.00000  170001.00000  1.406460407315e-07
170001.00000  171001.00000  2.009229153307e-07
171001.00000  172001.00000  2.511536441634e-07
172001.00000  173001.00000  1.205537491984e-07
173001.00000  174001.00000  1.707844780311e-07
174001.00000  175001.00000  1.205537491984e-07
175001.00000  176001.00000  1.607383322646e-07
176001.00000  177001.00000  1.305998949650e-07
177001.00000  178001.00000  1.607383322646e-07
178001.00000  179001.00000  9.041531189883e-08
179001.00000  180001.00000  9.041531189883e-08
180001.00000  181001.00000  1.205537491984e-07
181001.00000  182001.00000  1.205537491984e-07
182001.00000  183001.00000  1.406460407315e-07
183001.00000  184001.00000  7.032302036576e-08
184001.00000  185001.00000  1.607383322646e-07
185001.00000  186001.00000  8.036916613229e-08
186001.00000  187001.00000  1.305998949650e-07
187001.00000  188001.00000  7.032302036576e-08
188001.00000  189001.00000  6.027687459922e-08
189001.00000  190001.00000  7.032302036576e-08
190001.00000  191001.00000  5.023072883268e-08
191001.00000  192001.00000  1.004614576654e-07
192001.00000  193001.00000  1.004614576654e-07
193001.00000  194001.00000  7.032302036576e-08
194001.00000  195001.00000  1.105076034319e-07
195001.00000  196001.00000  7.032302036576e-08
196001.00000  197001.00000  6.027687459922e-08
197001.00000  198001.00000  5.023072883268e-08
198001.00000  199001.00000  8.036916613229e-08
