10001.00000  11001.00000  1.629251395908e-04
11001.00000  12001.00000  1.425691536818e-04
12001.00000  13001.00000  1.221359154543e-04
13001.00000  14001.00000  1.095824137077e-04
14001.00000  15001.00000  9.459546393027e-05
15001.00000  16001.00000  8.125012591969e-05
16001.00000  17001.00000  7.219229158255e-05
17001.00000  18001.00000  6.488229095013e-05
18001.00000  19001.00000  5.810340000698e-05
19001.00000  20001.00000  5.204874954922e-05
20001.00000  21001.00000  4.738464082338e-05
21001.00000  22001.00000  4.276881479656e-05
22001.00000  23001.00000  3.918623852889e-05
23001.00000  24001.00000  3.517877450980e-05
24001.00000  25001.00000  3.267773070029e-05
25001.00000  26001.00000  3.188589443627e-05
26001.00000  27001.00000  2.816812661133e-05
27001.00000  28001.00000  2.535807352806e-05
28001.00000  29001.00000  2.422825837087e-05
29001.00000  30001.00000  2.237420272830e-05
30001.00000  31001.00000  2.074224750125e-05
31001.00000  32001.00000  2.032701628963e-05
32001.00000  33001.00000  1.819292099271e-05
33001.00000  34001.00000  1.775837670149e-05
34001.00000  35001.00000  1.674444002196e-05
35001.00000  36001.00000  1.551805946671e-05
36001.00000  37001.00000  1.415648735420e-05
37001.00000  38001.00000  1.351915572707e-05
38001.00000  39001.00000  1.277560216208e-05
39001.00000  40001.00000  1.215758361456e-05
40001.00000  41001.00000  1.126918195249e-05
41001.00000  42001.00000  1.071875918360e-05
42001.00000  43001.00000  1.045803260887e-05
43001.00000  44001.00000  1.018764949433e-05
44001.00000  45001.00000  1.001383177784e-05
45001.00000  46001.00000  8.777794682790e-06
46001.00000  47001.00000  8.121149976047e-06
47001.00000  48001.00000  8.063210737216e-06
48001.00000  49001.00000  7.580383746964e-06
49001.00000  50001.00000  7.310000632422e-06
50001.00000  51001.00000  7.010647898466e-06
51001.00000  52001.00000  6.672669005289e-06
52001.00000  53001.00000  6.122246236401e-06
53001.00000  54001.00000  6.836830181975e-06
54001.00000  55001.00000  6.122246236401e-06
55001.00000  56001.00000  5.793923883030e-06
56001.00000  57001.00000  5.436631910243e-06
57001.00000  58001.00000  5.369036131608e-06
58001.00000  59001.00000  5.291783813167e-06
59001.00000  60001.00000  5.011744158821e-06
60001.00000  61001.00000  4.635139106424e-06
61001.00000  62001.00000  4.538573708373e-06
62001.00000  63001.00000  4.075059797731e-06
63001.00000  64001.00000  4.200594815197e-06
64001.00000  65001.00000  4.287503673442e-06
65001.00000  66001.00000  3.959181320070e-06
66001.00000  67001.00000  3.727424364749e-06
67001.00000  68001.00000  3.582576267673e-06
68001.00000  69001.00000  3.447384710403e-06
69001.00000  70001.00000  3.167345056056e-06
70001.00000  71001.00000  3.273566993912e-06
71001.00000  72001.00000  3.138375436641e-06
72001.00000  73001.00000  2.790740003659e-06
73001.00000  74001.00000  2.665204986194e-06
74001.00000  75001.00000  2.810053083269e-06
75001.00000  76001.00000  2.414134951262e-06
76001.00000  77001.00000  2.414134951262e-06
77001.00000  78001.00000  2.423791491067e-06
78001.00000  79001.00000  2.230660694966e-06
79001.00000  80001.00000  2.317569553212e-06
80001.00000  81001.00000  2.163064916331e-06
81001.00000  82001.00000  1.950621040620e-06
82001.00000  83001.00000  2.056842978476e-06
83001.00000  84001.00000  2.018216819255e-06
84001.00000  85001.00000  1.940964500815e-06
85001.00000  86001.00000  1.747833704714e-06
86001.00000  87001.00000  1.969934120230e-06
87001.00000  88001.00000  1.767146784324e-06
88001.00000  89001.00000  1.805772943544e-06
89001.00000  90001.00000  1.516076749393e-06
90001.00000  91001.00000  1.525733289198e-06
91001.00000  92001.00000  1.265006714461e-06
92001.00000  93001.00000  1.612642147443e-06
93001.00000  94001.00000  1.361572112512e-06
94001.00000  95001.00000  1.458137510562e-06
95001.00000  96001.00000  1.390541731927e-06
96001.00000  97001.00000  1.361572112512e-06
97001.00000  98001.00000  1.062219378555e-06
98001.00000  99001.00000  1.149128236801e-06
99001.00000  100001.00000  1.265006714461e-06
100001.00000  101001.00000  1.265006714461e-06
101001.00000  102001.00000  1.033249759140e-06
102001.00000  103001.00000  1.091188997971e-06
103001.00000  104001.00000  8.980582018696e-07
104001.00000  105001.00000  8.884016620646e-07
105001.00000  106001.00000  8.594320426494e-07
106001.00000  107001.00000  8.690885824545e-07
107001.00000  108001.00000  8.980582018696e-07
108001.00000  109001.00000  8.980582018696e-07
109001.00000  110001.00000  8.111493436242e-07
110001.00000  111001.00000  6.083620077181e-07
111001.00000  112001.00000  9.077147416747e-07
112001.00000  113001.00000  8.787451222595e-07
113001.00000  114001.00000  8.014928038191e-07
114001.00000  115001.00000  7.049274057686e-07
115001.00000  116001.00000  6.663012465484e-07
116001.00000  117001.00000  6.469881669383e-07
117001.00000  118001.00000  6.856143261585e-07
118001.00000  119001.00000  7.338970251838e-07
119001.00000  120001.00000  5.890489281080e-07
120001.00000  121001.00000  6.180185475232e-07
121001.00000  122001.00000  5.793923883030e-07
122001.00000  123001.00000  4.828269902525e-07
123001.00000  124001.00000  5.021400698626e-07
124001.00000  125001.00000  4.345442912272e-07
125001.00000  126001.00000  3.862615922020e-07
126001.00000  127001.00000  4.924835300575e-07
127001.00000  128001.00000  4.731704504474e-07
128001.00000  129001.00000  2.414134951262e-07
129001.00000  130001.00000  5.021400698626e-07
130001.00000  131001.00000  5.117966096676e-07
131001.00000  132001.00000  3.379788931767e-07
132001.00000  133001.00000  3.379788931767e-07
133001.00000  134001.00000  3.959181320070e-07
134001.00000  135001.00000  2.221004155161e-07
135001.00000  136001.00000  4.248877514222e-07
136001.00000  137001.00000  2.703831145414e-07
137001.00000  138001.00000  3.379788931767e-07
138001.00000  139001.00000  2.221004155161e-07
139001.00000  140001.00000  3.283223533717e-07
140001.00000  141001.00000  2.896961941515e-07
141001.00000  142001.00000  2.896961941515e-07
142001.00000  143001.00000  3.283223533717e-07
143001.00000  144001.00000  4.055746718121e-07
144001.00000  145001.00000  1.834742562959e-07
145001.00000  146001.00000  2.510700349313e-07
146001.00000  147001.00000  2.510700349313e-07
147001.00000  148001.00000  2.510700349313e-07
148001.00000  149001.00000  2.800396543464e-07
149001.00000  150001.00000  2.993527339565e-07
150001.00000  151001.00000  2.607265747363e-07
151001.00000  152001.00000  2.317569553212e-07
152001.00000  153001.00000  1.641611766858e-07
153001.00000  154001.00000  2.414134951262e-07
154001.00000  155001.00000  2.414134951262e-07
155001.00000  156001.00000  2.607265747363e-07
156001.00000  157001.00000  1.641611766858e-07
157001.00000  158001.00000  1.448480970757e-07
158001.00000  159001.00000  2.124438757111e-07
159001.00000  160001.00000  1.834742562959e-07
160001.00000  161001.00000  1.738177164909e-07
161001.00000  162001.00000  1.545046368808e-07
162001.00000  163001.00000  1.158784776606e-07
163001.00000  164001.00000  2.124438757111e-07
164001.00000  165001.00000  1.255350174656e-07
165001.00000  166001.00000  1.158784776606e-07
166001.00000  167001.00000  2.124438757111e-07
167001.00000  168001.00000  1.545046368808e-07
168001.00000  169001.00000  1.641611766858e-07
169001.00000  170001.00000  1.255350174656e-07
170001.00000  171001.00000  1.931307961010e-07
171001.00000  172001.00000  1.738177164909e-07
172001.00000  173001.00000  1.738177164909e-07
173001.00000  174001.00000  1.738177164909e-07
174001.00000  175001.00000  9.656539805050e-08
175001.00000  176001.00000  8.690885824545e-08
176001.00000  177001.00000  1.351915572707e-07
177001.00000  178001.00000  1.641611766858e-07
178001.00000  179001.00000  9.656539805050e-08
179001.00000  180001.00000  1.351915572707e-07
180001.00000  181001.00000  7.725231844040e-08
181001.00000  182001.00000  1.062219378555e-07
182001.00000  183001.00000  8.690885824545e-08
183001.00000  184001.00000  7.725231844040e-08
184001.00000  185001.00000  4.828269902525e-08
185001.00000  186001.00000  6.759577863535e-08
186001.00000  187001.00000  9.656539805050e-08
187001.00000  188001.00000  1.931307961010e-08
188001.00000  189001.00000  9.656539805050e-08
189001.00000  190001.00000  4.828269902525e-08
190001.00000  191001.00000  5.793923883030e-08
191001.00000  192001.00000  6.759577863535e-08
192001.00000  193001.00000  3.862615922020e-08
193001.00000  194001.00000  4.828269902525e-08
194001.00000  195001.00000  3.862615922020e-08
195001.00000  196001.00000  2.896961941515e-08
196001.00000  197001.00000  3.862615922020e-08
197001.00000  198001.00000  3.862615922020e-08
198001.00000  199001.00000  1.931307961010e-08
