300.00000  350.00000  6.942847054817e-02
350.00000  400.00000  5.521895137738e-02
400.00000  450.00000  4.508998230523e-02
450.00000  500.00000  3.779409737898e-02
500.00000  550.00000  3.229045784055e-02
550.00000  600.00000  2.778432889726e-02
600.00000  650.00000  2.428245048556e-02
650.00000  700.00000  2.139140288617e-02
700.00000  750.00000  1.918108886861e-02
750.00000  800.00000  1.728312276326e-02
800.00000  850.00000  1.563819312935e-02
850.00000  900.00000  1.415271113497e-02
900.00000  950.00000  1.300711450746e-02
950.00000  1000.00000  1.198437729302e-02
1000.00000  1050.00000  1.100689393763e-02
1050.00000  1100.00000  1.021254428417e-02
1100.00000  1150.00000  9.457478831747e-03
1150.00000  1200.00000  8.857046778534e-03
1200.00000  1250.00000  8.298980040173e-03
1250.00000  1300.00000  7.773072427176e-03
1300.00000  1350.00000  7.198829841326e-03
1350.00000  1400.00000  6.862025588257e-03
1400.00000  1450.00000  6.485937134144e-03
1450.00000  1500.00000  6.173781791534e-03
1500.00000  1550.00000  5.852960816340e-03
1550.00000  1600.00000  5.553322498573e-03
1600.00000  1650.00000  5.233079232219e-03
1650.00000  1700.00000  5.078060693785e-03
1700.00000  1750.00000  4.769179034595e-03
1750.00000  1800.00000  4.542332030527e-03
1800.00000  1850.00000  4.378070150671e-03
1850.00000  1900.00000  4.154111690797e-03
1900.00000  1950.00000  4.018927822499e-03
1950.00000  2000.00000  3.840223221671e-03
2000.00000  2050.00000  3.708313036792e-03
2050.00000  2100.00000  3.546169422679e-03
2100.00000  2150.00000  3.381714973210e-03
2150.00000  2200.00000  3.275223977243e-03
2200.00000  2250.00000  3.180287158053e-03
2250.00000  2300.00000  3.030467999169e-03
2300.00000  2350.00000  3.043370163238e-03
2350.00000  2400.00000  2.868131815443e-03
2400.00000  2450.00000  2.773580135479e-03
2450.00000  2500.00000  2.700018543328e-03
2500.00000  2550.00000  2.592179560070e-03
2550.00000  2600.00000  2.509952335335e-03
2600.00000  2650.00000  2.437931300088e-03
2650.00000  2700.00000  2.355704075353e-03
2700.00000  2750.00000  2.282720192041e-03
2750.00000  2800.00000  2.216476245183e-03
2800.00000  2850.00000  2.195678726983e-03
2850.00000  2900.00000  2.129434780124e-03
2900.00000  2950.00000  2.046437276938e-03
2950.00000  3000.00000  2.024099201834e-03
3000.00000  3050.00000  1.892574156182e-03
3050.00000  3100.00000  1.897966105345e-03
3100.00000  3150.00000  1.836536398810e-03
3150.00000  3200.00000  1.792823096668e-03
3200.00000  3250.00000  1.769907312726e-03
3250.00000  3300.00000  1.723305466389e-03
3300.00000  3350.00000  1.691916619476e-03
3350.00000  3400.00000  1.622398989197e-03
3400.00000  3450.00000  1.598135217964e-03
3450.00000  3500.00000  1.550185384337e-03
3500.00000  3550.00000  1.531506131880e-03
3550.00000  3600.00000  1.493377348514e-03
3600.00000  3650.00000  1.457751970116e-03
3650.00000  3700.00000  1.417312351394e-03
3700.00000  3750.00000  1.393433719387e-03
3750.00000  3800.00000  1.359734037119e-03
3800.00000  3850.00000  1.356460353698e-03
3850.00000  3900.00000  1.279432508514e-03
3900.00000  3950.00000  1.282898761547e-03
3950.00000  4000.00000  1.266145205219e-03
4000.00000  4050.00000  1.229364409144e-03
4050.00000  4100.00000  1.195279587650e-03
4100.00000  4150.00000  1.179874018613e-03
4150.00000  4200.00000  1.163313031898e-03
4200.00000  4250.00000  1.119984868982e-03
4250.00000  4300.00000  1.129420780017e-03
4300.00000  4350.00000  1.104771869558e-03
4350.00000  4400.00000  1.100535338073e-03
4400.00000  4450.00000  1.046615846444e-03
4450.00000  4500.00000  1.032365695085e-03
4500.00000  4550.00000  1.010220189594e-03
4550.00000  4600.00000  1.024662910566e-03
4600.00000  4650.00000  9.884598233295e-04
4650.00000  4700.00000  9.730542542926e-04
4700.00000  4750.00000  9.734393935185e-04
4750.00000  4800.00000  9.331923444096e-04
4800.00000  4850.00000  9.283781040856e-04
4850.00000  4900.00000  9.102765604672e-04
4900.00000  4950.00000  8.865904980730e-04
4950.00000  5000.00000  8.842796627175e-04
5000.00000  5050.00000  8.611713091622e-04
5050.00000  5100.00000  8.494245627715e-04
5100.00000  5150.00000  8.623267268399e-04
5150.00000  5200.00000  8.457657401253e-04
5200.00000  5250.00000  8.191911335366e-04
5250.00000  5300.00000  8.047484125645e-04
5300.00000  5350.00000  7.974307672720e-04
5350.00000  5400.00000  7.897279827536e-04
5400.00000  5450.00000  7.774035275241e-04
5450.00000  5500.00000  7.756704010074e-04
5500.00000  5550.00000  7.556431612595e-04
5550.00000  5600.00000  7.398524529966e-04
5600.00000  5650.00000  7.200177828617e-04
5650.00000  5700.00000  7.063453403414e-04
5700.00000  5750.00000  7.101967326006e-04
5750.00000  5800.00000  6.999905431137e-04
5800.00000  5850.00000  6.867032398194e-04
5850.00000  5900.00000  6.882437967231e-04
5900.00000  5950.00000  6.901694928527e-04
5950.00000  6000.00000  6.664834304585e-04
6000.00000  6050.00000  6.549292536808e-04
6050.00000  6100.00000  6.429899376772e-04
6100.00000  6150.00000  6.393311150309e-04
6150.00000  6200.00000  6.264289509625e-04
6200.00000  6250.00000  6.306654824477e-04
6250.00000  6300.00000  6.360574316106e-04
6300.00000  6350.00000  6.329763178032e-04
6350.00000  6400.00000  9.320369267319e-04
6400.00000  6450.00000  5.961955217276e-04
6450.00000  6500.00000  5.769385604315e-04
6500.00000  6550.00000  5.623032698465e-04
6550.00000  6600.00000  5.559484726188e-04
6600.00000  6650.00000  5.596072952650e-04
6650.00000  6700.00000  5.499788146170e-04
6700.00000  6750.00000  5.576815991354e-04
6750.00000  6800.00000  5.332252582894e-04
6800.00000  6850.00000  5.399651947430e-04
6850.00000  6900.00000  5.357286632579e-04
6900.00000  6950.00000  5.305292837079e-04
6950.00000  7000.00000  5.187825373173e-04
7000.00000  7050.00000  5.020289809897e-04
7050.00000  7100.00000  5.368840809356e-04
7100.00000  7150.00000  5.056878036359e-04
7150.00000  7200.00000  4.781503489825e-04
7200.00000  7250.00000  4.843125765972e-04
7250.00000  7300.00000  4.787280578214e-04
7300.00000  7350.00000  4.806537539510e-04
7350.00000  7400.00000  4.768023616918e-04
7400.00000  7450.00000  4.600488053641e-04
7450.00000  7500.00000  4.644779064622e-04
7500.00000  7550.00000  4.431026794236e-04
7550.00000  7600.00000  4.502277551031e-04
7600.00000  7650.00000  4.440655274884e-04
7650.00000  7700.00000  4.440655274884e-04
7700.00000  7750.00000  4.344370468403e-04
7750.00000  7800.00000  4.273119711607e-04
7800.00000  7850.00000  4.382884390995e-04
7850.00000  7900.00000  4.407918440680e-04
7900.00000  7950.00000  4.251937054182e-04
7950.00000  8000.00000  4.068995921869e-04
8000.00000  8050.00000  4.053590352832e-04
8050.00000  8100.00000  4.003522253462e-04
8100.00000  8150.00000  4.072847314128e-04
8150.00000  8200.00000  3.938048585055e-04
8200.00000  8250.00000  3.789769983075e-04
8250.00000  8300.00000  3.922643016018e-04
8300.00000  8350.00000  3.949602761833e-04
8350.00000  8400.00000  3.839838082445e-04
8400.00000  8450.00000  3.774364414038e-04
8450.00000  8500.00000  3.772438717908e-04
8500.00000  8550.00000  3.745478972094e-04
8550.00000  8600.00000  3.793621375334e-04
8600.00000  8650.00000  3.772438717908e-04
8650.00000  8700.00000  3.722370618539e-04
8700.00000  8750.00000  3.712742137891e-04
8750.00000  8800.00000  3.549057966874e-04
8800.00000  8850.00000  3.410407845542e-04
8850.00000  8900.00000  3.537503790096e-04
8900.00000  8950.00000  3.629937204317e-04
8950.00000  9000.00000  3.408482149412e-04
9000.00000  9050.00000  3.472030121689e-04
9050.00000  9100.00000  3.423887718449e-04
9100.00000  9150.00000  3.466253033300e-04
9150.00000  9200.00000  3.341082784876e-04
9200.00000  9250.00000  3.329528608098e-04
9250.00000  9300.00000  3.212061144192e-04
9300.00000  9350.00000  3.187027094507e-04
9350.00000  9400.00000  3.385373795857e-04
9400.00000  9450.00000  2.998308873805e-04
9450.00000  9500.00000  3.133107602878e-04
9500.00000  9550.00000  3.190878486766e-04
9550.00000  9600.00000  3.046451277045e-04
9600.00000  9650.00000  2.973274824120e-04
9650.00000  9700.00000  3.029120011879e-04
9700.00000  9750.00000  2.957869255083e-04
9750.00000  9800.00000  2.957869255083e-04
9800.00000  9850.00000  2.848104575695e-04
9850.00000  9900.00000  2.955943558953e-04
9900.00000  9950.00000  2.961720647342e-04
9950.00000  10000.00000  2.894321282806e-04
