10001.00000  11001.00000  9.247072325920e-05
11001.00000  12001.00000  8.262550764502e-05
12001.00000  13001.00000  7.318896135822e-05
13001.00000  14001.00000  6.486696778247e-05
14001.00000  15001.00000  5.951711476948e-05
15001.00000  16001.00000  5.375859242911e-05
16001.00000  17001.00000  4.911462279978e-05
17001.00000  18001.00000  4.495362601190e-05
18001.00000  19001.00000  4.082978098106e-05
19001.00000  20001.00000  3.923225542857e-05
20001.00000  21001.00000  3.351088484524e-05
21001.00000  22001.00000  3.117032415206e-05
22001.00000  23001.00000  2.778951426190e-05
23001.00000  24001.00000  2.790096953301e-05
24001.00000  25001.00000  2.314554463258e-05
25001.00000  26001.00000  2.266257179113e-05
26001.00000  27001.00000  1.969043122835e-05
27001.00000  28001.00000  1.931891365801e-05
28001.00000  29001.00000  1.623531782413e-05
29001.00000  30001.00000  1.642107660931e-05
30001.00000  31001.00000  1.434057821537e-05
31001.00000  32001.00000  1.218577630736e-05
32001.00000  33001.00000  1.315172199026e-05
33001.00000  34001.00000  1.069970602597e-05
34001.00000  35001.00000  1.073685778301e-05
35001.00000  36001.00000  1.017958142749e-05
36001.00000  37001.00000  8.953573445346e-06
37001.00000  38001.00000  7.839020734307e-06
38001.00000  39001.00000  8.099083033550e-06
39001.00000  40001.00000  7.058833836580e-06
40001.00000  41001.00000  5.832825854437e-06
41001.00000  42001.00000  5.795674097403e-06
42001.00000  43001.00000  5.758522340368e-06
43001.00000  44001.00000  5.981432882576e-06
44001.00000  45001.00000  4.309603816017e-06
45001.00000  46001.00000  5.349853012987e-06
46001.00000  47001.00000  4.495362601190e-06
47001.00000  48001.00000  3.789479217532e-06
48001.00000  49001.00000  4.198148544913e-06
49001.00000  50001.00000  4.829728414502e-06
50001.00000  51001.00000  4.086693273809e-06
51001.00000  52001.00000  3.455113404221e-06
52001.00000  53001.00000  3.566568675325e-06
53001.00000  54001.00000  3.455113404221e-06
54001.00000  55001.00000  2.972140562771e-06
55001.00000  56001.00000  2.972140562771e-06
56001.00000  57001.00000  2.860685291667e-06
57001.00000  58001.00000  2.637774749459e-06
58001.00000  59001.00000  2.414864207251e-06
59001.00000  60001.00000  2.563471235390e-06
60001.00000  61001.00000  2.117650150974e-06
61001.00000  62001.00000  2.414864207251e-06
62001.00000  63001.00000  1.931891365801e-06
63001.00000  64001.00000  2.229105422078e-06
64001.00000  65001.00000  2.229105422078e-06
65001.00000  66001.00000  2.191953665043e-06
66001.00000  67001.00000  1.634677309524e-06
67001.00000  68001.00000  1.783284337662e-06
68001.00000  69001.00000  1.448918524351e-06
69001.00000  70001.00000  1.708980823593e-06
70001.00000  71001.00000  1.486070281385e-06
71001.00000  72001.00000  1.263159739177e-06
72001.00000  73001.00000  1.077400954004e-06
73001.00000  74001.00000  1.374615010281e-06
74001.00000  75001.00000  1.151704468074e-06
75001.00000  76001.00000  1.263159739177e-06
76001.00000  77001.00000  1.151704468074e-06
77001.00000  78001.00000  1.448918524351e-06
78001.00000  79001.00000  1.040249196970e-06
79001.00000  80001.00000  8.916421688312e-07
80001.00000  81001.00000  1.003097439935e-06
81001.00000  82001.00000  9.287939258658e-07
82001.00000  83001.00000  8.173386547619e-07
83001.00000  84001.00000  1.151704468074e-06
84001.00000  85001.00000  7.430351406926e-07
85001.00000  86001.00000  7.058833836580e-07
86001.00000  87001.00000  1.040249196970e-06
87001.00000  88001.00000  1.226007982143e-06
88001.00000  89001.00000  5.944281125541e-07
89001.00000  90001.00000  7.801868977273e-07
90001.00000  91001.00000  4.458210844156e-07
91001.00000  92001.00000  8.544904117965e-07
92001.00000  93001.00000  5.944281125541e-07
93001.00000  94001.00000  7.058833836580e-07
94001.00000  95001.00000  6.315798695887e-07
95001.00000  96001.00000  5.201245984848e-07
96001.00000  97001.00000  4.829728414502e-07
97001.00000  98001.00000  6.315798695887e-07
98001.00000  99001.00000  9.287939258658e-07
99001.00000  100001.00000  5.572763555195e-07
100001.00000  101001.00000  5.572763555195e-07
101001.00000  102001.00000  7.058833836580e-07
102001.00000  103001.00000  4.086693273809e-07
103001.00000  104001.00000  4.086693273809e-07
104001.00000  105001.00000  4.458210844156e-07
105001.00000  106001.00000  4.829728414502e-07
106001.00000  107001.00000  7.430351406926e-07
107001.00000  108001.00000  3.343658133117e-07
108001.00000  109001.00000  4.458210844156e-07
109001.00000  110001.00000  4.086693273809e-07
110001.00000  111001.00000  5.201245984848e-07
111001.00000  112001.00000  4.458210844156e-07
112001.00000  113001.00000  2.972140562771e-07
113001.00000  114001.00000  3.715175703463e-07
114001.00000  115001.00000  2.600622992424e-07
115001.00000  116001.00000  1.486070281385e-07
116001.00000  117001.00000  5.201245984848e-07
117001.00000  118001.00000  3.715175703463e-07
118001.00000  119001.00000  2.229105422078e-07
119001.00000  120001.00000  2.600622992424e-07
120001.00000  121001.00000  3.343658133117e-07
121001.00000  122001.00000  3.343658133117e-07
122001.00000  123001.00000  2.600622992424e-07
123001.00000  124001.00000  3.715175703463e-07
124001.00000  125001.00000  2.972140562771e-07
125001.00000  126001.00000  2.600622992424e-07
126001.00000  127001.00000  1.857587851732e-07
127001.00000  128001.00000  1.857587851732e-07
128001.00000  129001.00000  2.229105422078e-07
129001.00000  130001.00000  2.972140562771e-07
130001.00000  131001.00000  1.857587851732e-07
131001.00000  132001.00000  1.857587851732e-07
132001.00000  133001.00000  2.229105422078e-07
133001.00000  134001.00000  1.857587851732e-07
134001.00000  135001.00000  7.430351406926e-08
135001.00000  136001.00000  1.486070281385e-07
136001.00000  137001.00000  4.458210844156e-07
137001.00000  138001.00000  2.229105422078e-07
138001.00000  139001.00000  1.857587851732e-07
139001.00000  140001.00000  1.114552711039e-07
140001.00000  141001.00000  4.086693273809e-07
141001.00000  142001.00000  3.343658133117e-07
142001.00000  143001.00000  2.600622992424e-07
143001.00000  144001.00000  1.486070281385e-07
144001.00000  145001.00000  1.114552711039e-07
145001.00000  146001.00000  2.600622992424e-07
146001.00000  147001.00000  7.430351406926e-08
147001.00000  148001.00000  2.972140562771e-07
148001.00000  149001.00000  1.857587851732e-07
149001.00000  150001.00000  7.430351406926e-08
150001.00000  151001.00000  2.229105422078e-07
151001.00000  152001.00000  1.486070281385e-07
152001.00000  153001.00000  1.857587851732e-07
153001.00000  154001.00000  1.857587851732e-07
154001.00000  155001.00000  7.430351406926e-08
155001.00000  156001.00000  7.430351406926e-08
156001.00000  157001.00000  1.486070281385e-07
157001.00000  158001.00000  1.486070281385e-07
158001.00000  159001.00000  2.229105422078e-07
159001.00000  160001.00000  1.114552711039e-07
160001.00000  161001.00000  1.114552711039e-07
161001.00000  162001.00000  2.229105422078e-07
162001.00000  163001.00000  1.857587851732e-07
163001.00000  164001.00000  2.229105422078e-07
164001.00000  165001.00000  1.114552711039e-07
165001.00000  166001.00000  7.430351406926e-08
166001.00000  167001.00000  7.430351406926e-08
167001.00000  168001.00000  1.857587851732e-07
168001.00000  169001.00000  1.486070281385e-07
169001.00000  170001.00000  7.430351406926e-08
170001.00000  171001.00000  1.486070281385e-07
171001.00000  172001.00000  0.000000000000e+00
172001.00000  173001.00000  7.430351406926e-08
173001.00000  174001.00000  7.430351406926e-08
174001.00000  175001.00000  1.114552711039e-07
175001.00000  176001.00000  3.715175703463e-08
176001.00000  177001.00000  7.430351406926e-08
177001.00000  178001.00000  1.486070281385e-07
178001.00000  179001.00000  7.430351406926e-08
179001.00000  180001.00000  7.430351406926e-08
180001.00000  181001.00000  0.000000000000e+00
181001.00000  182001.00000  0.000000000000e+00
182001.00000  183001.00000  0.000000000000e+00
183001.00000  184001.00000  3.715175703463e-08
184001.00000  185001.00000  3.715175703463e-08
185001.00000  186001.00000  1.114552711039e-07
186001.00000  187001.00000  1.114552711039e-07
187001.00000  188001.00000  0.000000000000e+00
188001.00000  189001.00000  3.715175703463e-08
189001.00000  190001.00000  7.430351406926e-08
190001.00000  191001.00000  7.430351406926e-08
191001.00000  192001.00000  7.430351406926e-08
192001.00000  193001.00000  3.715175703463e-08
193001.00000  194001.00000  0.000000000000e+00
194001.00000  195001.00000  7.430351406926e-08
195001.00000  196001.00000  1.486070281385e-07
196001.00000  197001.00000  3.715175703463e-08
197001.00000  198001.00000  0.000000000000e+00
198001.00000  199001.00000  0.000000000000e+00
