10001.00000  11001.00000  6.744407183738e-06
11001.00000  12001.00000  7.391870273377e-06
12001.00000  13001.00000  7.859482504783e-06
13001.00000  14001.00000  7.913437762253e-06
14001.00000  15001.00000  8.596871023538e-06
15001.00000  16001.00000  9.316274456470e-06
16001.00000  17001.00000  9.622020915466e-06
17001.00000  18001.00000  8.327094736189e-06
18001.00000  19001.00000  9.262319199000e-06
19001.00000  20001.00000  8.219184221249e-06
20001.00000  21001.00000  7.697616732373e-06
21001.00000  22001.00000  7.247989586790e-06
22001.00000  23001.00000  6.870302784501e-06
23001.00000  24001.00000  7.140079071851e-06
24001.00000  25001.00000  6.078959008276e-06
25001.00000  26001.00000  5.917093235866e-06
26001.00000  27001.00000  5.269630146227e-06
27001.00000  28001.00000  4.963883687231e-06
28001.00000  29001.00000  4.208510082653e-06
29001.00000  30001.00000  4.190524996829e-06
30001.00000  31001.00000  3.399181220604e-06
31001.00000  32001.00000  3.003509332491e-06
32001.00000  33001.00000  3.093434761608e-06
33001.00000  34001.00000  3.039479504138e-06
34001.00000  35001.00000  3.021494418315e-06
35001.00000  36001.00000  2.679777787672e-06
36001.00000  37001.00000  2.733733045142e-06
37001.00000  38001.00000  2.248135727913e-06
38001.00000  39001.00000  2.248135727913e-06
39001.00000  40001.00000  2.392016414499e-06
40001.00000  41001.00000  1.780523496507e-06
41001.00000  42001.00000  1.708583153214e-06
42001.00000  43001.00000  1.456791951687e-06
43001.00000  44001.00000  1.528732294981e-06
44001.00000  45001.00000  1.240970921808e-06
45001.00000  46001.00000  1.222985835984e-06
46001.00000  47001.00000  9.891797202816e-07
47001.00000  48001.00000  1.187015664338e-06
48001.00000  49001.00000  9.172393769884e-07
49001.00000  50001.00000  7.373885187554e-07
50001.00000  51001.00000  1.061120063575e-06
51001.00000  52001.00000  8.093288620486e-07
52001.00000  53001.00000  7.913437762253e-07
53001.00000  54001.00000  9.172393769884e-07
54001.00000  55001.00000  7.373885187554e-07
55001.00000  56001.00000  8.093288620486e-07
56001.00000  57001.00000  7.373885187554e-07
57001.00000  58001.00000  7.373885187554e-07
58001.00000  59001.00000  7.194034329321e-07
59001.00000  60001.00000  5.755227463456e-07
60001.00000  61001.00000  4.316420597592e-07
61001.00000  62001.00000  4.496271455825e-07
62001.00000  63001.00000  6.834332612855e-07
63001.00000  64001.00000  4.676122314058e-07
64001.00000  65001.00000  4.676122314058e-07
65001.00000  66001.00000  4.855973172291e-07
66001.00000  67001.00000  3.417166306427e-07
67001.00000  68001.00000  3.237315448194e-07
68001.00000  69001.00000  3.597017164660e-07
69001.00000  70001.00000  4.496271455825e-07
70001.00000  71001.00000  4.136569739359e-07
71001.00000  72001.00000  2.517912015262e-07
72001.00000  73001.00000  2.517912015262e-07
73001.00000  74001.00000  2.877613731728e-07
74001.00000  75001.00000  4.316420597592e-07
75001.00000  76001.00000  3.597017164660e-07
76001.00000  77001.00000  2.158210298796e-07
77001.00000  78001.00000  1.618657724097e-07
78001.00000  79001.00000  2.517912015262e-07
79001.00000  80001.00000  3.956718881126e-07
80001.00000  81001.00000  2.517912015262e-07
81001.00000  82001.00000  2.158210298796e-07
82001.00000  83001.00000  1.618657724097e-07
83001.00000  84001.00000  8.992542911651e-08
84001.00000  85001.00000  1.258956007631e-07
85001.00000  86001.00000  1.618657724097e-07
86001.00000  87001.00000  1.258956007631e-07
87001.00000  88001.00000  1.798508582330e-07
88001.00000  89001.00000  1.978359440563e-07
89001.00000  90001.00000  1.079105149398e-07
90001.00000  91001.00000  2.517912015262e-07
91001.00000  92001.00000  1.258956007631e-07
92001.00000  93001.00000  1.618657724097e-07
93001.00000  94001.00000  1.618657724097e-07
94001.00000  95001.00000  8.992542911651e-08
95001.00000  96001.00000  3.597017164660e-08
96001.00000  97001.00000  1.079105149398e-07
97001.00000  98001.00000  1.258956007631e-07
98001.00000  99001.00000  1.618657724097e-07
99001.00000  100001.00000  5.395525746990e-08
100001.00000  101001.00000  1.438806865864e-07
101001.00000  102001.00000  1.438806865864e-07
102001.00000  103001.00000  1.438806865864e-07
103001.00000  104001.00000  3.597017164660e-08
104001.00000  105001.00000  1.079105149398e-07
105001.00000  106001.00000  1.438806865864e-07
106001.00000  107001.00000  8.992542911651e-08
107001.00000  108001.00000  5.395525746990e-08
108001.00000  109001.00000  3.597017164660e-08
109001.00000  110001.00000  7.194034329321e-08
110001.00000  111001.00000  1.438806865864e-07
111001.00000  112001.00000  1.079105149398e-07
112001.00000  113001.00000  8.992542911651e-08
113001.00000  114001.00000  1.079105149398e-07
114001.00000  115001.00000  7.194034329321e-08
115001.00000  116001.00000  1.258956007631e-07
116001.00000  117001.00000  7.194034329321e-08
117001.00000  118001.00000  3.597017164660e-08
118001.00000  119001.00000  5.395525746990e-08
119001.00000  120001.00000  7.194034329321e-08
120001.00000  121001.00000  7.194034329321e-08
121001.00000  122001.00000  7.194034329321e-08
122001.00000  123001.00000  3.597017164660e-08
123001.00000  124001.00000  3.597017164660e-08
124001.00000  125001.00000  3.597017164660e-08
125001.00000  126001.00000  5.395525746990e-08
126001.00000  127001.00000  8.992542911651e-08
127001.00000  128001.00000  5.395525746990e-08
128001.00000  129001.00000  5.395525746990e-08
129001.00000  130001.00000  1.798508582330e-08
130001.00000  131001.00000  1.798508582330e-08
131001.00000  132001.00000  5.395525746990e-08
132001.00000  133001.00000  3.597017164660e-08
133001.00000  134001.00000  3.597017164660e-08
134001.00000  135001.00000  3.597017164660e-08
135001.00000  136001.00000  0.000000000000e+00
136001.00000  137001.00000  3.597017164660e-08
137001.00000  138001.00000  3.597017164660e-08
138001.00000  139001.00000  1.798508582330e-08
139001.00000  140001.00000  3.597017164660e-08
140001.00000  141001.00000  3.597017164660e-08
141001.00000  142001.00000  5.395525746990e-08
142001.00000  143001.00000  7.194034329321e-08
143001.00000  144001.00000  0.000000000000e+00
144001.00000  145001.00000  7.194034329321e-08
145001.00000  146001.00000  3.597017164660e-08
146001.00000  147001.00000  1.798508582330e-08
147001.00000  148001.00000  0.000000000000e+00
148001.00000  149001.00000  1.798508582330e-08
149001.00000  150001.00000  1.798508582330e-08
150001.00000  151001.00000  1.798508582330e-08
151001.00000  152001.00000  5.395525746990e-08
152001.00000  153001.00000  0.000000000000e+00
153001.00000  154001.00000  0.000000000000e+00
154001.00000  155001.00000  1.798508582330e-08
155001.00000  156001.00000  1.798508582330e-08
156001.00000  157001.00000  1.798508582330e-08
157001.00000  158001.00000  1.798508582330e-08
158001.00000  159001.00000  3.597017164660e-08
159001.00000  160001.00000  3.597017164660e-08
160001.00000  161001.00000  0.000000000000e+00
161001.00000  162001.00000  0.000000000000e+00
162001.00000  163001.00000  1.798508582330e-08
163001.00000  164001.00000  0.000000000000e+00
164001.00000  165001.00000  0.000000000000e+00
165001.00000  166001.00000  3.597017164660e-08
166001.00000  167001.00000  0.000000000000e+00
167001.00000  168001.00000  0.000000000000e+00
168001.00000  169001.00000  0.000000000000e+00
169001.00000  170001.00000  1.798508582330e-08
170001.00000  171001.00000  0.000000000000e+00
171001.00000  172001.00000  1.798508582330e-08
172001.00000  173001.00000  0.000000000000e+00
173001.00000  174001.00000  3.597017164660e-08
174001.00000  175001.00000  1.798508582330e-08
175001.00000  176001.00000  3.597017164660e-08
176001.00000  177001.00000  0.000000000000e+00
177001.00000  178001.00000  0.000000000000e+00
178001.00000  179001.00000  0.000000000000e+00
179001.00000  180001.00000  0.000000000000e+00
180001.00000  181001.00000  0.000000000000e+00
181001.00000  182001.00000  0.000000000000e+00
182001.00000  183001.00000  0.000000000000e+00
183001.00000  184001.00000  0.000000000000e+00
184001.00000  185001.00000  0.000000000000e+00
185001.00000  186001.00000  0.000000000000e+00
186001.00000  187001.00000  0.000000000000e+00
187001.00000  188001.00000  0.000000000000e+00
188001.00000  189001.00000  0.000000000000e+00
189001.00000  190001.00000  0.000000000000e+00
190001.00000  191001.00000  0.000000000000e+00
191001.00000  192001.00000  0.000000000000e+00
192001.00000  193001.00000  0.000000000000e+00
193001.00000  194001.00000  0.000000000000e+00
194001.00000  195001.00000  0.000000000000e+00
195001.00000  196001.00000  0.000000000000e+00
196001.00000  197001.00000  0.000000000000e+00
197001.00000  198001.00000  0.000000000000e+00
198001.00000  199001.00000  0.000000000000e+00
