10001.00000  11001.00000  2.760403282689e-04
11001.00000  12001.00000  2.538817919493e-04
12001.00000  13001.00000  2.360318599141e-04
13001.00000  14001.00000  2.137465999391e-04
14001.00000  15001.00000  1.903932405826e-04
15001.00000  16001.00000  1.695743543347e-04
16001.00000  17001.00000  1.536252771308e-04
17001.00000  18001.00000  1.399753291038e-04
18001.00000  19001.00000  1.240986654173e-04
19001.00000  20001.00000  1.132185344303e-04
20001.00000  21001.00000  1.022840933053e-04
21001.00000  22001.00000  9.556773956791e-05
22001.00000  23001.00000  8.671518706768e-05
23001.00000  24001.00000  8.008935022702e-05
24001.00000  25001.00000  7.469454318189e-05
25001.00000  26001.00000  6.685577992504e-05
26001.00000  27001.00000  6.290924322760e-05
27001.00000  28001.00000  5.727909225097e-05
28001.00000  29001.00000  5.159463113631e-05
29001.00000  30001.00000  5.074377230704e-05
30001.00000  31001.00000  4.609120381510e-05
31001.00000  32001.00000  4.402741856965e-05
32001.00000  33001.00000  4.093174070147e-05
33001.00000  34001.00000  3.859640476583e-05
34001.00000  35001.00000  3.642399924430e-05
35001.00000  36001.00000  3.390762951519e-05
36001.00000  37001.00000  3.073953812963e-05
37001.00000  38001.00000  3.052229757748e-05
38001.00000  39001.00000  2.871195964287e-05
39001.00000  40001.00000  2.675679467349e-05
40001.00000  41001.00000  2.451197563458e-05
41001.00000  42001.00000  2.284646473474e-05
42001.00000  43001.00000  2.261112080324e-05
43001.00000  44001.00000  2.143440114575e-05
44001.00000  45001.00000  1.993182066003e-05
45001.00000  46001.00000  1.920768548618e-05
46001.00000  47001.00000  1.844734355365e-05
47001.00000  48001.00000  1.745165768961e-05
48001.00000  49001.00000  1.683614279185e-05
49001.00000  50001.00000  1.609390423866e-05
50001.00000  51001.00000  1.542407920285e-05
51001.00000  52001.00000  1.551459609958e-05
52001.00000  53001.00000  1.397580885517e-05
53001.00000  54001.00000  1.236460809337e-05
54001.00000  55001.00000  1.312495002590e-05
55001.00000  56001.00000  1.301632974983e-05
56001.00000  57001.00000  1.238271147271e-05
57001.00000  58001.00000  1.113357829783e-05
58001.00000  59001.00000  1.069909719353e-05
59001.00000  60001.00000  1.042754650334e-05
60001.00000  61001.00000  9.431860639303e-06
61001.00000  62001.00000  9.468067397996e-06
62001.00000  63001.00000  9.178413328458e-06
63001.00000  64001.00000  9.051689673036e-06
64001.00000  65001.00000  8.490484913308e-06
65001.00000  66001.00000  8.291347740501e-06
66001.00000  67001.00000  7.874970015541e-06
67001.00000  68001.00000  6.861180772161e-06
68001.00000  69001.00000  6.698250358047e-06
69001.00000  70001.00000  7.150834841698e-06
70001.00000  71001.00000  7.060317944968e-06
71001.00000  72001.00000  6.788767254777e-06
72001.00000  73001.00000  7.205144979737e-06
73001.00000  74001.00000  5.847391528781e-06
74001.00000  75001.00000  6.010321942896e-06
75001.00000  76001.00000  5.774978011397e-06
76001.00000  77001.00000  5.539634079898e-06
77001.00000  78001.00000  5.431013803822e-06
78001.00000  79001.00000  4.761188768017e-06
79001.00000  80001.00000  4.779292147363e-06
80001.00000  81001.00000  5.503427321206e-06
81001.00000  82001.00000  4.779292147363e-06
82001.00000  83001.00000  4.724982009325e-06
83001.00000  84001.00000  4.507741457172e-06
84001.00000  85001.00000  3.928433318098e-06
85001.00000  86001.00000  4.833602285401e-06
86001.00000  87001.00000  4.634465112594e-06
87001.00000  88001.00000  3.964640076790e-06
88001.00000  89001.00000  3.964640076790e-06
89001.00000  90001.00000  3.711192765945e-06
90001.00000  91001.00000  3.222401523601e-06
91001.00000  92001.00000  3.385331937715e-06
92001.00000  93001.00000  3.548262351830e-06
93001.00000  94001.00000  3.204298144255e-06
94001.00000  95001.00000  3.367228558369e-06
95001.00000  96001.00000  3.222401523601e-06
96001.00000  97001.00000  2.588783246488e-06
97001.00000  98001.00000  2.697403522565e-06
98001.00000  99001.00000  3.312918420331e-06
99001.00000  100001.00000  2.860333936679e-06
100001.00000  101001.00000  2.878437316025e-06
101001.00000  102001.00000  2.570679867142e-06
102001.00000  103001.00000  2.516369729104e-06
103001.00000  104001.00000  2.208612280221e-06
104001.00000  105001.00000  2.733610281257e-06
105001.00000  106001.00000  2.443956211720e-06
106001.00000  107001.00000  2.498266349758e-06
107001.00000  108001.00000  2.136198762836e-06
108001.00000  109001.00000  2.063785245452e-06
109001.00000  110001.00000  2.299129176951e-06
110001.00000  111001.00000  2.190508900875e-06
111001.00000  112001.00000  1.719821037877e-06
112001.00000  113001.00000  1.792234555261e-06
113001.00000  114001.00000  1.719821037877e-06
114001.00000  115001.00000  2.045681866106e-06
115001.00000  116001.00000  1.991371728068e-06
116001.00000  117001.00000  1.955164969376e-06
117001.00000  118001.00000  1.611200761800e-06
118001.00000  119001.00000  1.937061590030e-06
119001.00000  120001.00000  1.701717658531e-06
120001.00000  121001.00000  1.665510899839e-06
121001.00000  122001.00000  1.556890623762e-06
122001.00000  123001.00000  1.556890623762e-06
123001.00000  124001.00000  1.683614279185e-06
124001.00000  125001.00000  1.538787244416e-06
125001.00000  126001.00000  1.430166968340e-06
126001.00000  127001.00000  1.484477106378e-06
127001.00000  128001.00000  1.303443312917e-06
128001.00000  129001.00000  1.574994003108e-06
129001.00000  130001.00000  1.520683865070e-06
130001.00000  131001.00000  1.357753450955e-06
131001.00000  132001.00000  1.484477106378e-06
132001.00000  133001.00000  1.049996002072e-06
133001.00000  134001.00000  1.647407520493e-06
134001.00000  135001.00000  1.357753450955e-06
135001.00000  136001.00000  1.122409519456e-06
136001.00000  137001.00000  1.031892622726e-06
137001.00000  138001.00000  9.956858640340e-07
138001.00000  139001.00000  1.321546692263e-06
139001.00000  140001.00000  9.956858640340e-07
140001.00000  141001.00000  1.176719657495e-06
141001.00000  142001.00000  1.176719657495e-06
142001.00000  143001.00000  9.413757259957e-07
143001.00000  144001.00000  1.140512898803e-06
144001.00000  145001.00000  1.357753450955e-06
145001.00000  146001.00000  6.517216564586e-07
146001.00000  147001.00000  9.413757259957e-07
147001.00000  148001.00000  8.508588292654e-07
148001.00000  149001.00000  8.508588292654e-07
149001.00000  150001.00000  6.698250358047e-07
150001.00000  151001.00000  9.413757259957e-07
151001.00000  152001.00000  8.146520705732e-07
152001.00000  153001.00000  9.413757259957e-07
153001.00000  154001.00000  6.879284151507e-07
154001.00000  155001.00000  7.603419325350e-07
155001.00000  156001.00000  1.049996002072e-06
156001.00000  157001.00000  5.431013803822e-07
157001.00000  158001.00000  6.336182771125e-07
158001.00000  159001.00000  1.031892622726e-06
159001.00000  160001.00000  8.508588292654e-07
160001.00000  161001.00000  8.146520705732e-07
161001.00000  162001.00000  7.603419325350e-07
162001.00000  163001.00000  5.431013803822e-07
163001.00000  164001.00000  6.879284151507e-07
164001.00000  165001.00000  4.887912423439e-07
165001.00000  166001.00000  7.241351738429e-07
166001.00000  167001.00000  7.060317944968e-07
167001.00000  168001.00000  5.612047597282e-07
168001.00000  169001.00000  5.431013803822e-07
169001.00000  170001.00000  4.163777249597e-07
170001.00000  171001.00000  5.431013803822e-07
171001.00000  172001.00000  7.060317944968e-07
172001.00000  173001.00000  5.612047597282e-07
173001.00000  174001.00000  4.344811043057e-07
174001.00000  175001.00000  5.068946216900e-07
175001.00000  176001.00000  6.698250358047e-07
176001.00000  177001.00000  5.793081390743e-07
177001.00000  178001.00000  5.068946216900e-07
178001.00000  179001.00000  6.336182771125e-07
179001.00000  180001.00000  6.517216564586e-07
180001.00000  181001.00000  3.982743456136e-07
181001.00000  182001.00000  6.155148977664e-07
182001.00000  183001.00000  3.439642075754e-07
183001.00000  184001.00000  4.525844836518e-07
184001.00000  185001.00000  3.801709662675e-07
185001.00000  186001.00000  3.439642075754e-07
186001.00000  187001.00000  4.344811043057e-07
187001.00000  188001.00000  3.801709662675e-07
188001.00000  189001.00000  5.068946216900e-07
189001.00000  190001.00000  4.706878629979e-07
190001.00000  191001.00000  4.525844836518e-07
191001.00000  192001.00000  3.258608282293e-07
192001.00000  193001.00000  4.887912423439e-07
193001.00000  194001.00000  3.620675869214e-07
194001.00000  195001.00000  2.896540695372e-07
195001.00000  196001.00000  3.982743456136e-07
196001.00000  197001.00000  3.982743456136e-07
197001.00000  198001.00000  3.801709662675e-07
198001.00000  199001.00000  5.068946216900e-07
