300.00000  350.00000  9.678155491309e-04
350.00000  400.00000  8.072632022208e-04
400.00000  450.00000  6.669674598274e-04
450.00000  500.00000  5.259214728223e-04
500.00000  550.00000  5.004131560235e-04
550.00000  600.00000  2.445797434238e-04
600.00000  650.00000  2.445797434238e-04
650.00000  700.00000  1.635533253570e-04
700.00000  750.00000  1.883113975441e-04
750.00000  800.00000  1.598021022984e-04
800.00000  850.00000  2.655865925522e-04
850.00000  900.00000  1.260410947705e-04
900.00000  950.00000  1.192888932650e-04
950.00000  1000.00000  1.005327779717e-04
1000.00000  1050.00000  1.065347348656e-04
1050.00000  1100.00000  9.828204413655e-05
1100.00000  1150.00000  9.453082107790e-05
1150.00000  1200.00000  9.077959801926e-05
1200.00000  1250.00000  7.802543961986e-05
1250.00000  1300.00000  1.125366917594e-04
1300.00000  1350.00000  7.277372733775e-05
1350.00000  1400.00000  5.551810126798e-05
1400.00000  1450.00000  6.752201505565e-05
1450.00000  1500.00000  7.427421656121e-05
1500.00000  1550.00000  4.801565515068e-05
1550.00000  1600.00000  5.851907971489e-05
1600.00000  1650.00000  4.801565515068e-05
1650.00000  1700.00000  4.876589976241e-05
1700.00000  1750.00000  7.652495039640e-05
1750.00000  1800.00000  4.051320903339e-05
1800.00000  1850.00000  4.276394286858e-05
1850.00000  1900.00000  3.526149675128e-05
1900.00000  1950.00000  4.201369825685e-05
1950.00000  2000.00000  3.526149675128e-05
2000.00000  2050.00000  2.925953985745e-05
2050.00000  2100.00000  3.226051830436e-05
2100.00000  2150.00000  3.076002908091e-05
2150.00000  2200.00000  3.751223058647e-05
2200.00000  2250.00000  2.625856141053e-05
2250.00000  2300.00000  2.700880602226e-05
2300.00000  2350.00000  6.827225966738e-05
2350.00000  2400.00000  2.625856141053e-05
2400.00000  2450.00000  3.000978446918e-05
2450.00000  2500.00000  2.550831679880e-05
2500.00000  2550.00000  2.325758296361e-05
2550.00000  2600.00000  2.850929524572e-05
2600.00000  2650.00000  1.725562606978e-05
2650.00000  2700.00000  1.950635990496e-05
2700.00000  2750.00000  1.875611529323e-05
2750.00000  2800.00000  1.950635990496e-05
2800.00000  2850.00000  1.800587068151e-05
2850.00000  2900.00000  2.850929524572e-05
2900.00000  2950.00000  2.400782757534e-05
2950.00000  3000.00000  2.925953985745e-05
3000.00000  3050.00000  1.875611529323e-05
3050.00000  3100.00000  1.500489223459e-05
3100.00000  3150.00000  2.025660451669e-05
3150.00000  3200.00000  2.175709374015e-05
3200.00000  3250.00000  2.025660451669e-05
3250.00000  3300.00000  1.950635990496e-05
3300.00000  3350.00000  1.875611529323e-05
3350.00000  3400.00000  1.350440301113e-05
3400.00000  3450.00000  2.700880602226e-05
3450.00000  3500.00000  2.475807218707e-05
3500.00000  3550.00000  1.425464762286e-05
3550.00000  3600.00000  1.500489223459e-05
3600.00000  3650.00000  2.550831679880e-05
3650.00000  3700.00000  2.400782757534e-05
3700.00000  3750.00000  1.350440301113e-05
3750.00000  3800.00000  1.575513684632e-05
3800.00000  3850.00000  1.725562606978e-05
3850.00000  3900.00000  1.425464762286e-05
3900.00000  3950.00000  2.475807218707e-05
3950.00000  4000.00000  1.575513684632e-05
4000.00000  4050.00000  2.100684912842e-05
4050.00000  4100.00000  1.950635990496e-05
4100.00000  4150.00000  2.250733835188e-05
4150.00000  4200.00000  2.325758296361e-05
4200.00000  4250.00000  1.350440301113e-05
4250.00000  4300.00000  2.100684912842e-05
4300.00000  4350.00000  3.076002908091e-05
4350.00000  4400.00000  1.425464762286e-05
4400.00000  4450.00000  2.400782757534e-05
4450.00000  4500.00000  1.500489223459e-05
4500.00000  4550.00000  1.575513684632e-05
4550.00000  4600.00000  2.400782757534e-05
4600.00000  4650.00000  2.025660451669e-05
4650.00000  4700.00000  2.250733835188e-05
4700.00000  4750.00000  1.650538145805e-05
4750.00000  4800.00000  1.650538145805e-05
4800.00000  4850.00000  2.100684912842e-05
4850.00000  4900.00000  2.100684912842e-05
4900.00000  4950.00000  2.100684912842e-05
4950.00000  5000.00000  2.475807218707e-05
5000.00000  5050.00000  1.875611529323e-05
5050.00000  5100.00000  1.650538145805e-05
5100.00000  5150.00000  2.475807218707e-05
5150.00000  5200.00000  2.325758296361e-05
5200.00000  5250.00000  2.025660451669e-05
5250.00000  5300.00000  1.950635990496e-05
5300.00000  5350.00000  2.100684912842e-05
5350.00000  5400.00000  2.550831679880e-05
5400.00000  5450.00000  2.325758296361e-05
5450.00000  5500.00000  2.100684912842e-05
5500.00000  5550.00000  1.725562606978e-05
5550.00000  5600.00000  2.100684912842e-05
5600.00000  5650.00000  1.875611529323e-05
5650.00000  5700.00000  1.950635990496e-05
5700.00000  5750.00000  2.100684912842e-05
5750.00000  5800.00000  2.025660451669e-05
5800.00000  5850.00000  2.025660451669e-05
5850.00000  5900.00000  2.025660451669e-05
5900.00000  5950.00000  2.025660451669e-05
5950.00000  6000.00000  2.325758296361e-05
6000.00000  6050.00000  2.100684912842e-05
6050.00000  6100.00000  1.575513684632e-05
6100.00000  6150.00000  2.100684912842e-05
6150.00000  6200.00000  2.400782757534e-05
6200.00000  6250.00000  2.400782757534e-05
6250.00000  6300.00000  3.901271980993e-05
6300.00000  6350.00000  2.475807218707e-05
6350.00000  6400.00000  2.220724050719e-04
6400.00000  6450.00000  1.725562606978e-05
6450.00000  6500.00000  2.100684912842e-05
6500.00000  6550.00000  1.650538145805e-05
6550.00000  6600.00000  2.100684912842e-05
6600.00000  6650.00000  1.875611529323e-05
6650.00000  6700.00000  2.175709374015e-05
6700.00000  6750.00000  1.725562606978e-05
6750.00000  6800.00000  1.950635990496e-05
6800.00000  6850.00000  2.625856141053e-05
6850.00000  6900.00000  1.650538145805e-05
6900.00000  6950.00000  1.875611529323e-05
6950.00000  7000.00000  2.700880602226e-05
7000.00000  7050.00000  1.725562606978e-05
7050.00000  7100.00000  4.576492131549e-05
7100.00000  7150.00000  8.252690729023e-06
7150.00000  7200.00000  1.425464762286e-05
7200.00000  7250.00000  8.252690729023e-06
7250.00000  7300.00000  1.350440301113e-05
7300.00000  7350.00000  1.500489223459e-05
7350.00000  7400.00000  1.125366917594e-05
7400.00000  7450.00000  1.050342456421e-05
7450.00000  7500.00000  1.125366917594e-05
7500.00000  7550.00000  9.002935340753e-06
7550.00000  7600.00000  9.002935340753e-06
7600.00000  7650.00000  1.500489223459e-05
7650.00000  7700.00000  1.050342456421e-05
7700.00000  7750.00000  6.001956893835e-06
7750.00000  7800.00000  9.002935340753e-06
7800.00000  7850.00000  6.752201505565e-06
7850.00000  7900.00000  1.125366917594e-05
7900.00000  7950.00000  1.200391378767e-05
7950.00000  8000.00000  1.125366917594e-05
8000.00000  8050.00000  1.050342456421e-05
8050.00000  8100.00000  8.252690729023e-06
8100.00000  8150.00000  1.425464762286e-05
8150.00000  8200.00000  8.252690729023e-06
8200.00000  8250.00000  1.125366917594e-05
8250.00000  8300.00000  1.050342456421e-05
8300.00000  8350.00000  8.252690729023e-06
8350.00000  8400.00000  1.275415839940e-05
8400.00000  8450.00000  9.002935340753e-06
8450.00000  8500.00000  7.502446117294e-06
8500.00000  8550.00000  1.200391378767e-05
8550.00000  8600.00000  7.502446117294e-06
8600.00000  8650.00000  1.500489223459e-05
8650.00000  8700.00000  9.753179952482e-06
8700.00000  8750.00000  1.425464762286e-05
8750.00000  8800.00000  8.252690729023e-06
8800.00000  8850.00000  1.050342456421e-05
8850.00000  8900.00000  1.200391378767e-05
8900.00000  8950.00000  1.050342456421e-05
8950.00000  9000.00000  1.050342456421e-05
9000.00000  9050.00000  2.250733835188e-06
9050.00000  9100.00000  9.002935340753e-06
9100.00000  9150.00000  1.050342456421e-05
9150.00000  9200.00000  1.050342456421e-05
9200.00000  9250.00000  7.502446117294e-06
9250.00000  9300.00000  9.002935340753e-06
9300.00000  9350.00000  6.752201505565e-06
9350.00000  9400.00000  8.252690729023e-06
9400.00000  9450.00000  4.501467670376e-06
9450.00000  9500.00000  9.753179952482e-06
9500.00000  9550.00000  7.502446117294e-06
9550.00000  9600.00000  1.050342456421e-05
9600.00000  9650.00000  1.200391378767e-05
9650.00000  9700.00000  9.002935340753e-06
9700.00000  9750.00000  1.200391378767e-05
9750.00000  9800.00000  1.050342456421e-05
9800.00000  9850.00000  8.252690729023e-06
9850.00000  9900.00000  9.002935340753e-06
9900.00000  9950.00000  6.001956893835e-06
9950.00000  10000.00000  9.753179952482e-06
