300.00000  350.00000  7.545484464827e-07
350.00000  400.00000  0.000000000000e+00
400.00000  450.00000  0.000000000000e+00
450.00000  500.00000  7.545484464827e-07
500.00000  550.00000  5.281839125379e-06
550.00000  600.00000  0.000000000000e+00
600.00000  650.00000  3.018193785931e-06
650.00000  700.00000  1.509096892965e-06
700.00000  750.00000  3.018193785931e-06
750.00000  800.00000  7.545484464827e-07
800.00000  850.00000  7.545484464827e-06
850.00000  900.00000  3.772742232413e-06
900.00000  950.00000  7.545484464827e-07
950.00000  1000.00000  4.527290678896e-06
1000.00000  1050.00000  4.527290678896e-06
1050.00000  1100.00000  7.545484464827e-06
1100.00000  1150.00000  9.809129804275e-06
1150.00000  1200.00000  2.263645339448e-06
1200.00000  1250.00000  8.300032911309e-06
1250.00000  1300.00000  2.339100184096e-05
1300.00000  1350.00000  7.545484464827e-06
1350.00000  1400.00000  1.433642048317e-05
1400.00000  1450.00000  1.131822669724e-05
1450.00000  1500.00000  1.660006582262e-05
1500.00000  1550.00000  2.112735650152e-05
1550.00000  1600.00000  1.358187203669e-05
1600.00000  1650.00000  1.282732359021e-05
1650.00000  1700.00000  1.207277514372e-05
1700.00000  1750.00000  6.262752105806e-05
1750.00000  1800.00000  2.263645339448e-05
1800.00000  1850.00000  1.810916271558e-05
1850.00000  1900.00000  1.961825960855e-05
1900.00000  1950.00000  1.886371116207e-05
1950.00000  2000.00000  2.112735650152e-05
2000.00000  2050.00000  1.660006582262e-05
2050.00000  2100.00000  3.395468009172e-05
2100.00000  2150.00000  2.037280805503e-05
2150.00000  2200.00000  2.188190494800e-05
2200.00000  2250.00000  2.339100184096e-05
2250.00000  2300.00000  3.169103475227e-05
2300.00000  2350.00000  8.677307134551e-05
2350.00000  2400.00000  2.640919562689e-05
2400.00000  2450.00000  2.339100184096e-05
2450.00000  2500.00000  3.320013164524e-05
2500.00000  2550.00000  2.716374407338e-05
2550.00000  2600.00000  2.716374407338e-05
2600.00000  2650.00000  3.923651921710e-05
2650.00000  2700.00000  2.791829251986e-05
2700.00000  2750.00000  3.169103475227e-05
2750.00000  2800.00000  3.093648630579e-05
2800.00000  2850.00000  3.697287387765e-05
2850.00000  2900.00000  4.376380989600e-05
2900.00000  2950.00000  4.225471300303e-05
2950.00000  3000.00000  6.564571484399e-05
3000.00000  3050.00000  5.130929436082e-05
3050.00000  3100.00000  6.941845707641e-05
3100.00000  3150.00000  5.659113348620e-05
3150.00000  3200.00000  6.036387571861e-05
3200.00000  3250.00000  6.489116639751e-05
3250.00000  3300.00000  7.243665086234e-05
3300.00000  3350.00000  8.903671668496e-05
3350.00000  3400.00000  1.033731371681e-04
3400.00000  3450.00000  1.094095247400e-04
3450.00000  3500.00000  1.124277185259e-04
3500.00000  3550.00000  1.063913309541e-04
3550.00000  3600.00000  1.275186874556e-04
3600.00000  3650.00000  1.328005265810e-04
3650.00000  3700.00000  1.644915613332e-04
3700.00000  3750.00000  1.569460768684e-04
3750.00000  3800.00000  1.426096563852e-04
3800.00000  3850.00000  1.765643364769e-04
3850.00000  3900.00000  1.765643364769e-04
3900.00000  3950.00000  1.931644022996e-04
3950.00000  4000.00000  2.097644681222e-04
4000.00000  4050.00000  2.120281134616e-04
4050.00000  4100.00000  2.090099196757e-04
4100.00000  4150.00000  2.271190823913e-04
4150.00000  4200.00000  2.180645010335e-04
4200.00000  4250.00000  2.369282121956e-04
4250.00000  4300.00000  2.293827277307e-04
4300.00000  4350.00000  2.520191811252e-04
4350.00000  4400.00000  2.897466034493e-04
4400.00000  4450.00000  2.663556016084e-04
4450.00000  4500.00000  2.739010860732e-04
4500.00000  4550.00000  3.003102817001e-04
4550.00000  4600.00000  3.154012506298e-04
4600.00000  4650.00000  2.920102487888e-04
4650.00000  4700.00000  3.214376382016e-04
4700.00000  4750.00000  3.191739928622e-04
4750.00000  4800.00000  3.395468009172e-04
4800.00000  4850.00000  3.553923182933e-04
4850.00000  4900.00000  3.169103475227e-04
4900.00000  4950.00000  3.282285742200e-04
4950.00000  5000.00000  3.365286071313e-04
5000.00000  5050.00000  3.719923841160e-04
5050.00000  5100.00000  3.221921866481e-04
5100.00000  5150.00000  3.350195102383e-04
5150.00000  5200.00000  3.523741245074e-04
5200.00000  5250.00000  3.561468667398e-04
5250.00000  5300.00000  3.523741245074e-04
5300.00000  5350.00000  3.267194773270e-04
5350.00000  5400.00000  3.448286400426e-04
5400.00000  5450.00000  3.810469654738e-04
5450.00000  5500.00000  3.704832872230e-04
5500.00000  5550.00000  3.742560294554e-04
5550.00000  5600.00000  3.576559636328e-04
5600.00000  5650.00000  3.501104791680e-04
5650.00000  5700.00000  3.704832872230e-04
5700.00000  5750.00000  3.810469654738e-04
5750.00000  5800.00000  3.667105449906e-04
5800.00000  5850.00000  3.644468996511e-04
5850.00000  5900.00000  3.478468338285e-04
5900.00000  5950.00000  3.335104133453e-04
5950.00000  6000.00000  3.335104133453e-04
6000.00000  6050.00000  3.282285742200e-04
6050.00000  6100.00000  3.214376382016e-04
6100.00000  6150.00000  3.614287058652e-04
6150.00000  6200.00000  3.455831884891e-04
6200.00000  6250.00000  3.719923841160e-04
6250.00000  6300.00000  4.051925157612e-04
6300.00000  6350.00000  3.689741903300e-04
6350.00000  6400.00000  1.709052231283e-03
6400.00000  6450.00000  3.146467021833e-04
6450.00000  6500.00000  3.214376382016e-04
6500.00000  6550.00000  3.116285083973e-04
6550.00000  6600.00000  3.312467680059e-04
6600.00000  6650.00000  3.025739270396e-04
6650.00000  6700.00000  2.957829910212e-04
6700.00000  6750.00000  3.093648630579e-04
6750.00000  6800.00000  3.018193785931e-04
6800.00000  6850.00000  2.867284096634e-04
6850.00000  6900.00000  3.154012506298e-04
6900.00000  6950.00000  3.169103475227e-04
6950.00000  7000.00000  2.656010531619e-04
7000.00000  7050.00000  2.625828593760e-04
7050.00000  7100.00000  4.512199709966e-04
7100.00000  7150.00000  1.599642706543e-04
7150.00000  7200.00000  1.652461097797e-04
7200.00000  7250.00000  1.411005594923e-04
7250.00000  7300.00000  1.622279159938e-04
7300.00000  7350.00000  1.411005594923e-04
7350.00000  7400.00000  1.328005265810e-04
7400.00000  7450.00000  1.441187532782e-04
7450.00000  7500.00000  1.893916600672e-04
7500.00000  7550.00000  1.554369799754e-04
7550.00000  7600.00000  1.592097222078e-04
7600.00000  7650.00000  1.463823986176e-04
7650.00000  7700.00000  1.395914625993e-04
7700.00000  7750.00000  1.343096234739e-04
7750.00000  7800.00000  1.592097222078e-04
7800.00000  7850.00000  1.365732688134e-04
7850.00000  7900.00000  1.320459781345e-04
7900.00000  7950.00000  1.411005594923e-04
7950.00000  8000.00000  1.312914296880e-04
8000.00000  8050.00000  1.448733017247e-04
8050.00000  8100.00000  1.531733346360e-04
8100.00000  8150.00000  1.343096234739e-04
8150.00000  8200.00000  1.312914296880e-04
8200.00000  8250.00000  1.463823986176e-04
8250.00000  8300.00000  1.177095576513e-04
8300.00000  8350.00000  1.252550421161e-04
8350.00000  8400.00000  1.622279159938e-04
8400.00000  8450.00000  1.214822998837e-04
8450.00000  8500.00000  1.471369470641e-04
8500.00000  8550.00000  1.463823986176e-04
8550.00000  8600.00000  1.297823327950e-04
8600.00000  8650.00000  1.267641390091e-04
8650.00000  8700.00000  1.192186545443e-04
8700.00000  8750.00000  1.358187203669e-04
8750.00000  8800.00000  1.373278172598e-04
8800.00000  8850.00000  1.229913967767e-04
8850.00000  8900.00000  1.380823657063e-04
8900.00000  8950.00000  1.290277843485e-04
8950.00000  9000.00000  1.260095905626e-04
9000.00000  9050.00000  1.305368812415e-04
9050.00000  9100.00000  1.252550421161e-04
9100.00000  9150.00000  1.101640731865e-04
9150.00000  9200.00000  1.146913638654e-04
9200.00000  9250.00000  1.312914296880e-04
9250.00000  9300.00000  8.903671668496e-05
9300.00000  9350.00000  1.146913638654e-04
9350.00000  9400.00000  1.282732359021e-04
9400.00000  9450.00000  1.131822669724e-04
9450.00000  9500.00000  1.109186216330e-04
9500.00000  9550.00000  1.048822340611e-04
9550.00000  9600.00000  1.131822669724e-04
9600.00000  9650.00000  1.116731700794e-04
9650.00000  9700.00000  1.063913309541e-04
9700.00000  9750.00000  1.124277185259e-04
9750.00000  9800.00000  9.960039493571e-05
9800.00000  9850.00000  1.033731371681e-04
9850.00000  9900.00000  1.177095576513e-04
9900.00000  9950.00000  1.146913638654e-04
9950.00000  10000.00000  1.026185887216e-04
