10001.00000  11001.00000  3.625557086182e-04
11001.00000  12001.00000  2.828797308526e-04
12001.00000  13001.00000  2.333260742478e-04
13001.00000  14001.00000  1.935631098262e-04
14001.00000  15001.00000  1.615276649053e-04
15001.00000  16001.00000  1.381950574806e-04
16001.00000  17001.00000  1.182385508086e-04
17001.00000  18001.00000  1.018832182729e-04
18001.00000  19001.00000  8.672827711592e-05
19001.00000  20001.00000  7.776285400575e-05
20001.00000  21001.00000  6.909752874028e-05
21001.00000  22001.00000  5.814395740903e-05
22001.00000  23001.00000  5.458029550331e-05
23001.00000  24001.00000  4.760302061423e-05
24001.00000  25001.00000  4.235130833212e-05
25001.00000  26001.00000  3.691203489709e-05
26001.00000  27001.00000  3.286071399375e-05
27001.00000  28001.00000  3.229803053495e-05
28001.00000  29001.00000  3.034739454445e-05
29001.00000  30001.00000  2.760900171164e-05
30001.00000  31001.00000  2.329509519420e-05
31001.00000  32001.00000  2.096933689784e-05
32001.00000  33001.00000  1.920626206027e-05
33001.00000  34001.00000  1.950635990496e-05
34001.00000  35001.00000  1.736816276154e-05
35001.00000  36001.00000  1.526747784869e-05
36001.00000  37001.00000  1.357942747230e-05
37001.00000  38001.00000  1.459225769814e-05
38001.00000  39001.00000  1.279167062999e-05
39001.00000  40001.00000  1.211645047943e-05
40001.00000  41001.00000  1.211645047943e-05
41001.00000  42001.00000  1.151625479005e-05
42001.00000  43001.00000  8.740349726647e-06
43001.00000  44001.00000  9.340545416031e-06
44001.00000  45001.00000  8.665325265475e-06
45001.00000  46001.00000  7.389909425535e-06
46001.00000  47001.00000  8.365227420783e-06
47001.00000  48001.00000  7.690007270226e-06
48001.00000  49001.00000  6.602152583219e-06
49001.00000  50001.00000  6.527128122046e-06
50001.00000  51001.00000  6.114493585595e-06
51001.00000  52001.00000  5.664346818557e-06
52001.00000  53001.00000  5.401761204452e-06
53001.00000  54001.00000  5.401761204452e-06
54001.00000  55001.00000  5.476785665625e-06
55001.00000  56001.00000  4.351418748031e-06
56001.00000  57001.00000  4.088833133925e-06
57001.00000  58001.00000  4.463955439790e-06
58001.00000  59001.00000  4.651516592722e-06
59001.00000  60001.00000  4.238882056271e-06
60001.00000  61001.00000  4.126345364512e-06
61001.00000  62001.00000  3.863759750406e-06
62001.00000  63001.00000  3.451125213955e-06
63001.00000  64001.00000  3.526149675128e-06
64001.00000  65001.00000  2.888441755158e-06
65001.00000  66001.00000  3.188539599850e-06
66001.00000  67001.00000  3.151027369263e-06
67001.00000  68001.00000  2.025660451669e-06
68001.00000  69001.00000  2.213221604602e-06
69001.00000  70001.00000  2.363270526948e-06
70001.00000  71001.00000  2.475807218707e-06
71001.00000  72001.00000  2.063172682256e-06
72001.00000  73001.00000  2.175709374015e-06
73001.00000  74001.00000  1.838099298737e-06
74001.00000  75001.00000  2.063172682256e-06
75001.00000  76001.00000  2.288246065775e-06
76001.00000  77001.00000  2.138197143429e-06
77001.00000  78001.00000  1.538001454045e-06
78001.00000  79001.00000  2.063172682256e-06
79001.00000  80001.00000  1.387952531699e-06
80001.00000  81001.00000  1.575513684632e-06
81001.00000  82001.00000  1.538001454045e-06
82001.00000  83001.00000  1.575513684632e-06
83001.00000  84001.00000  1.050342456421e-06
84001.00000  85001.00000  1.725562606978e-06
85001.00000  86001.00000  9.002935340753e-07
86001.00000  87001.00000  1.162879148181e-06
87001.00000  88001.00000  1.237903609354e-06
88001.00000  89001.00000  1.312928070526e-06
89001.00000  90001.00000  8.252690729023e-07
90001.00000  91001.00000  8.252690729023e-07
91001.00000  92001.00000  7.127323811429e-07
92001.00000  93001.00000  1.275415839940e-06
93001.00000  94001.00000  8.627813034888e-07
94001.00000  95001.00000  8.252690729023e-07
95001.00000  96001.00000  8.627813034888e-07
96001.00000  97001.00000  8.252690729023e-07
97001.00000  98001.00000  1.125366917594e-06
98001.00000  99001.00000  6.752201505565e-07
99001.00000  100001.00000  1.237903609354e-06
100001.00000  101001.00000  9.002935340753e-07
101001.00000  102001.00000  7.877568423159e-07
102001.00000  103001.00000  1.125366917594e-06
103001.00000  104001.00000  8.252690729023e-07
104001.00000  105001.00000  6.001956893835e-07
105001.00000  106001.00000  7.502446117294e-07
106001.00000  107001.00000  9.002935340753e-07
107001.00000  108001.00000  5.251712282106e-07
108001.00000  109001.00000  8.252690729023e-07
109001.00000  110001.00000  5.251712282106e-07
110001.00000  111001.00000  7.877568423159e-07
111001.00000  112001.00000  5.251712282106e-07
112001.00000  113001.00000  6.001956893835e-07
113001.00000  114001.00000  4.501467670376e-07
114001.00000  115001.00000  6.001956893835e-07
115001.00000  116001.00000  7.127323811429e-07
116001.00000  117001.00000  4.501467670376e-07
117001.00000  118001.00000  4.876589976241e-07
118001.00000  119001.00000  6.377079199700e-07
119001.00000  120001.00000  4.501467670376e-07
120001.00000  121001.00000  1.500489223459e-07
121001.00000  122001.00000  3.000978446918e-07
122001.00000  123001.00000  4.501467670376e-07
123001.00000  124001.00000  3.376100752782e-07
124001.00000  125001.00000  4.501467670376e-07
125001.00000  126001.00000  5.626834587970e-07
126001.00000  127001.00000  2.250733835188e-07
127001.00000  128001.00000  4.876589976241e-07
128001.00000  129001.00000  3.751223058647e-07
129001.00000  130001.00000  4.126345364512e-07
130001.00000  131001.00000  3.376100752782e-07
131001.00000  132001.00000  1.875611529323e-07
132001.00000  133001.00000  5.626834587970e-07
133001.00000  134001.00000  4.126345364512e-07
134001.00000  135001.00000  3.000978446918e-07
135001.00000  136001.00000  4.876589976241e-07
136001.00000  137001.00000  1.125366917594e-07
137001.00000  138001.00000  3.000978446918e-07
138001.00000  139001.00000  5.251712282106e-07
139001.00000  140001.00000  2.250733835188e-07
140001.00000  141001.00000  2.250733835188e-07
141001.00000  142001.00000  2.625856141053e-07
142001.00000  143001.00000  1.125366917594e-07
143001.00000  144001.00000  3.751223058647e-07
144001.00000  145001.00000  2.250733835188e-07
145001.00000  146001.00000  4.876589976241e-07
146001.00000  147001.00000  2.625856141053e-07
147001.00000  148001.00000  3.376100752782e-07
148001.00000  149001.00000  1.125366917594e-07
149001.00000  150001.00000  1.125366917594e-07
150001.00000  151001.00000  4.126345364512e-07
151001.00000  152001.00000  2.625856141053e-07
152001.00000  153001.00000  1.125366917594e-07
153001.00000  154001.00000  2.625856141053e-07
154001.00000  155001.00000  1.500489223459e-07
155001.00000  156001.00000  1.125366917594e-07
156001.00000  157001.00000  1.500489223459e-07
157001.00000  158001.00000  1.125366917594e-07
158001.00000  159001.00000  7.502446117294e-08
159001.00000  160001.00000  2.625856141053e-07
160001.00000  161001.00000  3.000978446918e-07
161001.00000  162001.00000  1.500489223459e-07
162001.00000  163001.00000  1.875611529323e-07
163001.00000  164001.00000  1.125366917594e-07
164001.00000  165001.00000  1.875611529323e-07
165001.00000  166001.00000  1.500489223459e-07
166001.00000  167001.00000  7.502446117294e-08
167001.00000  168001.00000  1.125366917594e-07
168001.00000  169001.00000  1.875611529323e-07
169001.00000  170001.00000  7.502446117294e-08
170001.00000  171001.00000  1.125366917594e-07
171001.00000  172001.00000  3.751223058647e-08
172001.00000  173001.00000  1.875611529323e-07
173001.00000  174001.00000  1.125366917594e-07
174001.00000  175001.00000  1.875611529323e-07
175001.00000  176001.00000  1.125366917594e-07
176001.00000  177001.00000  1.125366917594e-07
177001.00000  178001.00000  1.500489223459e-07
178001.00000  179001.00000  1.875611529323e-07
179001.00000  180001.00000  7.502446117294e-08
180001.00000  181001.00000  7.502446117294e-08
181001.00000  182001.00000  7.502446117294e-08
182001.00000  183001.00000  1.125366917594e-07
183001.00000  184001.00000  7.502446117294e-08
184001.00000  185001.00000  1.500489223459e-07
185001.00000  186001.00000  7.502446117294e-08
186001.00000  187001.00000  1.500489223459e-07
187001.00000  188001.00000  1.125366917594e-07
188001.00000  189001.00000  1.500489223459e-07
189001.00000  190001.00000  1.125366917594e-07
190001.00000  191001.00000  3.751223058647e-08
191001.00000  192001.00000  1.125366917594e-07
192001.00000  193001.00000  7.502446117294e-08
193001.00000  194001.00000  7.502446117294e-08
194001.00000  195001.00000  1.125366917594e-07
195001.00000  196001.00000  1.125366917594e-07
196001.00000  197001.00000  7.502446117294e-08
197001.00000  198001.00000  1.125366917594e-07
198001.00000  199001.00000  3.751223058647e-08
