10001.00000  11001.00000  6.475793366731e-04
11001.00000  12001.00000  5.502505277539e-04
12001.00000  13001.00000  4.591520479457e-04
13001.00000  14001.00000  3.973129074292e-04
14001.00000  15001.00000  3.472739031372e-04
15001.00000  16001.00000  3.040007863323e-04
16001.00000  17001.00000  2.629413108162e-04
17001.00000  18001.00000  2.346459766018e-04
18001.00000  19001.00000  2.076359824905e-04
19001.00000  20001.00000  1.880345459181e-04
20001.00000  21001.00000  1.715036440363e-04
21001.00000  22001.00000  1.527769528118e-04
22001.00000  23001.00000  1.414409671802e-04
23001.00000  24001.00000  1.259811820511e-04
24001.00000  25001.00000  1.171980246798e-04
25001.00000  26001.00000  1.077186414193e-04
26001.00000  27001.00000  9.948889437020e-05
27001.00000  28001.00000  9.177685375152e-05
28001.00000  29001.00000  8.370777421530e-05
29001.00000  30001.00000  7.669195948580e-05
30001.00000  31001.00000  7.397846371256e-05
31001.00000  32001.00000  6.842650854494e-05
32001.00000  33001.00000  6.251751445980e-05
33001.00000  34001.00000  5.791171242364e-05
34001.00000  35001.00000  5.698341123805e-05
35001.00000  36001.00000  5.366294930501e-05
36001.00000  37001.00000  4.853944083843e-05
37001.00000  38001.00000  4.557601782292e-05
38001.00000  39001.00000  4.477268025847e-05
39001.00000  40001.00000  4.286252204968e-05
40001.00000  41001.00000  4.032754573520e-05
41001.00000  42001.00000  3.798894082537e-05
42001.00000  43001.00000  3.623945012946e-05
43001.00000  44001.00000  3.436499581242e-05
44001.00000  45001.00000  3.190142728145e-05
45001.00000  46001.00000  3.086601442061e-05
46001.00000  47001.00000  2.906296788708e-05
47001.00000  48001.00000  2.822392643088e-05
48001.00000  49001.00000  2.697429021952e-05
49001.00000  50001.00000  2.586746957517e-05
50001.00000  51001.00000  2.442146195917e-05
51001.00000  52001.00000  2.335034520657e-05
52001.00000  53001.00000  2.197574537407e-05
53001.00000  54001.00000  2.163655840242e-05
54001.00000  55001.00000  2.117240780963e-05
55001.00000  56001.00000  2.060114554158e-05
56001.00000  57001.00000  1.910158208794e-05
57001.00000  58001.00000  1.847676398226e-05
58001.00000  59001.00000  1.769127836369e-05
59001.00000  60001.00000  1.749490695905e-05
60001.00000  61001.00000  1.583467599253e-05
61001.00000  62001.00000  1.594178766779e-05
62001.00000  63001.00000  1.520985788685e-05
63001.00000  64001.00000  1.631667853120e-05
64001.00000  65001.00000  1.392451778374e-05
65001.00000  66001.00000  1.263917768062e-05
66001.00000  67001.00000  1.306762438166e-05
67001.00000  68001.00000  1.208576735845e-05
68001.00000  69001.00000  1.224643487134e-05
69001.00000  70001.00000  1.201435957494e-05
70001.00000  71001.00000  1.192509984556e-05
71001.00000  72001.00000  1.155020898215e-05
72001.00000  73001.00000  1.046124028368e-05
73001.00000  74001.00000  1.067546363420e-05
74001.00000  75001.00000  1.038983250017e-05
75001.00000  76001.00000  1.092539087647e-05
76001.00000  77001.00000  9.889978015627e-06
77001.00000  78001.00000  8.658193750143e-06
78001.00000  79001.00000  9.068788505304e-06
79001.00000  80001.00000  9.372271585206e-06
80001.00000  81001.00000  8.729601533649e-06
81001.00000  82001.00000  8.747453479526e-06
82001.00000  83001.00000  8.194043157352e-06
83001.00000  84001.00000  8.051227590339e-06
84001.00000  85001.00000  8.122635373846e-06
85001.00000  86001.00000  7.033666675374e-06
86001.00000  87001.00000  7.033666675374e-06
87001.00000  88001.00000  6.480256353200e-06
88001.00000  89001.00000  7.158630296510e-06
89001.00000  90001.00000  7.408557538782e-06
90001.00000  91001.00000  6.373144677940e-06
91001.00000  92001.00000  6.212477165051e-06
92001.00000  93001.00000  6.408848569693e-06
93001.00000  94001.00000  6.141069381545e-06
94001.00000  95001.00000  5.302027925345e-06
95001.00000  96001.00000  5.302027925345e-06
96001.00000  97001.00000  5.087804574826e-06
97001.00000  98001.00000  4.944989007814e-06
98001.00000  99001.00000  4.998544845443e-06
99001.00000  100001.00000  4.820025386678e-06
100001.00000  101001.00000  4.998544845443e-06
101001.00000  102001.00000  4.641505927912e-06
102001.00000  103001.00000  5.230620141839e-06
103001.00000  104001.00000  4.712913711418e-06
104001.00000  105001.00000  4.052391713984e-06
105001.00000  106001.00000  4.944989007814e-06
106001.00000  107001.00000  4.373726739763e-06
107001.00000  108001.00000  3.963131984602e-06
108001.00000  109001.00000  4.230911172750e-06
109001.00000  110001.00000  4.373726739763e-06
110001.00000  111001.00000  4.302318956257e-06
111001.00000  112001.00000  4.070243659861e-06
112001.00000  113001.00000  3.445425554181e-06
113001.00000  114001.00000  3.659648904700e-06
114001.00000  115001.00000  3.748908634083e-06
115001.00000  116001.00000  3.623945012946e-06
116001.00000  117001.00000  3.159794420155e-06
117001.00000  118001.00000  3.427573608304e-06
118001.00000  119001.00000  3.498981391810e-06
119001.00000  120001.00000  3.249054149538e-06
120001.00000  121001.00000  3.463277500057e-06
121001.00000  122001.00000  3.231202203662e-06
122001.00000  123001.00000  3.016978853143e-06
123001.00000  124001.00000  2.892015232007e-06
124001.00000  125001.00000  3.124090528402e-06
125001.00000  126001.00000  3.124090528402e-06
126001.00000  127001.00000  2.820607448500e-06
127001.00000  128001.00000  2.909867177883e-06
128001.00000  129001.00000  2.892015232007e-06
129001.00000  130001.00000  2.892015232007e-06
130001.00000  131001.00000  2.767051610870e-06
131001.00000  132001.00000  2.374308801586e-06
132001.00000  133001.00000  2.677791881488e-06
133001.00000  134001.00000  2.624236043858e-06
134001.00000  135001.00000  2.356456855709e-06
135001.00000  136001.00000  2.302901018079e-06
136001.00000  137001.00000  2.035121829931e-06
137001.00000  138001.00000  2.088677667560e-06
138001.00000  139001.00000  1.928010154671e-06
139001.00000  140001.00000  2.338604909832e-06
140001.00000  141001.00000  2.124381559313e-06
141001.00000  142001.00000  2.285049072203e-06
142001.00000  143001.00000  1.713786804152e-06
143001.00000  144001.00000  1.963714046424e-06
144001.00000  145001.00000  2.142233505190e-06
145001.00000  146001.00000  2.427864639215e-06
146001.00000  147001.00000  1.892306262918e-06
147001.00000  148001.00000  1.945862100548e-06
148001.00000  149001.00000  1.731638750029e-06
149001.00000  150001.00000  1.963714046424e-06
150001.00000  151001.00000  1.820898479412e-06
151001.00000  152001.00000  1.910158208794e-06
152001.00000  153001.00000  1.820898479412e-06
153001.00000  154001.00000  1.928010154671e-06
154001.00000  155001.00000  1.660230966522e-06
155001.00000  156001.00000  1.785194587658e-06
156001.00000  157001.00000  1.642379020646e-06
157001.00000  158001.00000  1.535267345386e-06
158001.00000  159001.00000  1.910158208794e-06
159001.00000  160001.00000  1.713786804152e-06
160001.00000  161001.00000  1.481711507756e-06
161001.00000  162001.00000  1.196080373731e-06
162001.00000  163001.00000  1.499563453633e-06
163001.00000  164001.00000  1.446007616003e-06
164001.00000  165001.00000  1.481711507756e-06
165001.00000  166001.00000  1.249636211361e-06
166001.00000  167001.00000  1.446007616003e-06
167001.00000  168001.00000  1.267488157237e-06
168001.00000  169001.00000  1.160376481978e-06
169001.00000  170001.00000  1.249636211361e-06
170001.00000  171001.00000  1.410303724250e-06
171001.00000  172001.00000  1.106820644348e-06
172001.00000  173001.00000  1.446007616003e-06
173001.00000  174001.00000  1.088968698472e-06
174001.00000  175001.00000  1.088968698472e-06
175001.00000  176001.00000  1.035412860842e-06
176001.00000  177001.00000  1.142524536101e-06
177001.00000  178001.00000  1.106820644348e-06
178001.00000  179001.00000  1.267488157237e-06
179001.00000  180001.00000  1.303192048991e-06
180001.00000  181001.00000  1.142524536101e-06
181001.00000  182001.00000  1.106820644348e-06
182001.00000  183001.00000  1.124672590225e-06
183001.00000  184001.00000  1.106820644348e-06
184001.00000  185001.00000  1.053264806718e-06
185001.00000  186001.00000  1.267488157237e-06
186001.00000  187001.00000  1.053264806718e-06
187001.00000  188001.00000  7.140778350633e-07
188001.00000  189001.00000  1.249636211361e-06
189001.00000  190001.00000  9.104492397058e-07
190001.00000  191001.00000  1.142524536101e-06
191001.00000  192001.00000  9.818570232121e-07
192001.00000  193001.00000  8.390414561994e-07
193001.00000  194001.00000  9.640050773355e-07
194001.00000  195001.00000  6.783739433102e-07
195001.00000  196001.00000  7.497817268165e-07
196001.00000  197001.00000  8.568934020760e-07
197001.00000  198001.00000  1.017560914965e-06
198001.00000  199001.00000  8.925972938292e-07
