10001.00000  11001.00000  4.325164735294e-04
11001.00000  12001.00000  3.533919084243e-04
12001.00000  13001.00000  3.000192174495e-04
13001.00000  14001.00000  2.546793860254e-04
14001.00000  15001.00000  2.203735048567e-04
15001.00000  16001.00000  1.928784822333e-04
16001.00000  17001.00000  1.680610794602e-04
17001.00000  18001.00000  1.482574749301e-04
18001.00000  19001.00000  1.347435814577e-04
19001.00000  20001.00000  1.207444817037e-04
20001.00000  21001.00000  1.075181178796e-04
21001.00000  22001.00000  9.596302013658e-05
22001.00000  23001.00000  8.884666133994e-05
23001.00000  24001.00000  8.074191937709e-05
24001.00000  25001.00000  7.479364977686e-05
25001.00000  26001.00000  6.931261585521e-05
26001.00000  27001.00000  6.431678821514e-05
27001.00000  28001.00000  5.799113595145e-05
28001.00000  29001.00000  5.403760328665e-05
29001.00000  30001.00000  5.164751308474e-05
30001.00000  31001.00000  4.602271433891e-05
31001.00000  32001.00000  4.280597639800e-05
32001.00000  33001.00000  4.102688669884e-05
33001.00000  34001.00000  3.831332564255e-05
34001.00000  35001.00000  3.649829473734e-05
35001.00000  36001.00000  3.407226332939e-05
36001.00000  37001.00000  3.182593795166e-05
37001.00000  38001.00000  3.134073167007e-05
38001.00000  39001.00000  2.986714222228e-05
39001.00000  40001.00000  2.765675805060e-05
40001.00000  41001.00000  2.478146156711e-05
41001.00000  42001.00000  2.415249046134e-05
42001.00000  43001.00000  2.239137136520e-05
43001.00000  44001.00000  2.196007689268e-05
44001.00000  45001.00000  2.059431106302e-05
45001.00000  46001.00000  1.937231005753e-05
46001.00000  47001.00000  1.885116256990e-05
47001.00000  48001.00000  1.802451483090e-05
48001.00000  49001.00000  1.655092538311e-05
49001.00000  50001.00000  1.678454322239e-05
50001.00000  51001.00000  1.498748292021e-05
51001.00000  52001.00000  1.491560050812e-05
52001.00000  53001.00000  1.450227663862e-05
53001.00000  54001.00000  1.380142312077e-05
54001.00000  55001.00000  1.473589447790e-05
55001.00000  56001.00000  1.205827462765e-05
56001.00000  57001.00000  1.173480377326e-05
57001.00000  58001.00000  1.164495075815e-05
58001.00000  59001.00000  1.141133291886e-05
59001.00000  60001.00000  1.085424422519e-05
60001.00000  61001.00000  1.013542010431e-05
61001.00000  62001.00000  1.054874397382e-05
62001.00000  63001.00000  9.919772868051e-06
63001.00000  64001.00000  9.758037440855e-06
64001.00000  65001.00000  9.452537189484e-06
65001.00000  66001.00000  8.967330907894e-06
66001.00000  67001.00000  7.781271108453e-06
67001.00000  68001.00000  8.068800756802e-06
68001.00000  69001.00000  8.032859550759e-06
69001.00000  70001.00000  7.493741460104e-06
70001.00000  71001.00000  7.493741460104e-06
71001.00000  72001.00000  6.756946736209e-06
72001.00000  73001.00000  7.062446987580e-06
73001.00000  74001.00000  6.703034927143e-06
74001.00000  75001.00000  6.361593469728e-06
75001.00000  76001.00000  6.505358293903e-06
76001.00000  77001.00000  6.092034424401e-06
77001.00000  78001.00000  5.696681157921e-06
78001.00000  79001.00000  5.660739951877e-06
79001.00000  80001.00000  5.552916333746e-06
80001.00000  81001.00000  5.157563067266e-06
81001.00000  82001.00000  5.427122112593e-06
82001.00000  83001.00000  5.211474876331e-06
83001.00000  84001.00000  4.726268594742e-06
84001.00000  85001.00000  4.941915831004e-06
85001.00000  86001.00000  5.211474876331e-06
86001.00000  87001.00000  4.510621358480e-06
87001.00000  88001.00000  4.528591961502e-06
88001.00000  89001.00000  5.013798243091e-06
89001.00000  90001.00000  4.277003519196e-06
90001.00000  91001.00000  3.701944222497e-06
91001.00000  92001.00000  3.953532664803e-06
92001.00000  93001.00000  3.827738443650e-06
93001.00000  94001.00000  3.612091207388e-06
94001.00000  95001.00000  3.666003016454e-06
95001.00000  96001.00000  3.953532664803e-06
96001.00000  97001.00000  3.612091207388e-06
97001.00000  98001.00000  3.252679146952e-06
98001.00000  99001.00000  2.983120101624e-06
99001.00000  100001.00000  3.737885428541e-06
100001.00000  101001.00000  3.252679146952e-06
101001.00000  102001.00000  2.767472865362e-06
102001.00000  103001.00000  3.378473368104e-06
103001.00000  104001.00000  3.090943719755e-06
104001.00000  105001.00000  2.749502262340e-06
105001.00000  106001.00000  3.630061810410e-06
106001.00000  107001.00000  3.234708543930e-06
107001.00000  108001.00000  3.037031910690e-06
108001.00000  109001.00000  2.390090201904e-06
109001.00000  110001.00000  3.055002513711e-06
110001.00000  111001.00000  2.911237689537e-06
111001.00000  112001.00000  2.012707538445e-06
112001.00000  113001.00000  2.354148995860e-06
113001.00000  114001.00000  2.444002010969e-06
114001.00000  115001.00000  2.444002010969e-06
115001.00000  116001.00000  2.066619347511e-06
116001.00000  117001.00000  2.300237186794e-06
117001.00000  118001.00000  2.264295980751e-06
118001.00000  119001.00000  1.940825126358e-06
119001.00000  120001.00000  2.210384171685e-06
120001.00000  121001.00000  1.725177890096e-06
121001.00000  122001.00000  1.491560050812e-06
122001.00000  123001.00000  2.246325377729e-06
123001.00000  124001.00000  1.850972111249e-06
124001.00000  125001.00000  1.958795729380e-06
125001.00000  126001.00000  1.761119096140e-06
126001.00000  127001.00000  1.815030905205e-06
127001.00000  128001.00000  1.725177890096e-06
128001.00000  129001.00000  1.904883920314e-06
129001.00000  130001.00000  1.761119096140e-06
130001.00000  131001.00000  1.761119096140e-06
131001.00000  132001.00000  1.401707035703e-06
132001.00000  133001.00000  1.563442462899e-06
133001.00000  134001.00000  1.635324874987e-06
134001.00000  135001.00000  1.491560050812e-06
135001.00000  136001.00000  1.473589447790e-06
136001.00000  137001.00000  1.725177890096e-06
137001.00000  138001.00000  1.419677638725e-06
138001.00000  139001.00000  1.347795226637e-06
139001.00000  140001.00000  1.707207287074e-06
140001.00000  141001.00000  1.383736432681e-06
141001.00000  142001.00000  1.132147990375e-06
142001.00000  143001.00000  1.401707035703e-06
143001.00000  144001.00000  1.275912814550e-06
144001.00000  145001.00000  1.222001005485e-06
145001.00000  146001.00000  1.168089196419e-06
146001.00000  147001.00000  1.383736432681e-06
147001.00000  148001.00000  1.455618844768e-06
148001.00000  149001.00000  1.150118593397e-06
149001.00000  150001.00000  1.024324372244e-06
150001.00000  151001.00000  1.293883417572e-06
151001.00000  152001.00000  1.186059799441e-06
152001.00000  153001.00000  9.883831662007e-07
153001.00000  154001.00000  1.257942211528e-06
154001.00000  155001.00000  9.704125631789e-07
155001.00000  156001.00000  1.132147990375e-06
156001.00000  157001.00000  1.150118593397e-06
157001.00000  158001.00000  1.060265578288e-06
158001.00000  159001.00000  1.078236181310e-06
159001.00000  160001.00000  9.883831662007e-07
160001.00000  161001.00000  1.204030402463e-06
161001.00000  162001.00000  1.006353769223e-06
162001.00000  163001.00000  9.704125631789e-07
163001.00000  164001.00000  8.086771359824e-07
164001.00000  165001.00000  7.727359299388e-07
165001.00000  166001.00000  7.907065329606e-07
166001.00000  167001.00000  1.024324372244e-06
167001.00000  168001.00000  7.727359299388e-07
168001.00000  169001.00000  6.828829148296e-07
169001.00000  170001.00000  7.727359299388e-07
170001.00000  171001.00000  8.805595480698e-07
171001.00000  172001.00000  7.727359299388e-07
172001.00000  173001.00000  8.805595480698e-07
173001.00000  174001.00000  7.907065329606e-07
174001.00000  175001.00000  8.266477390043e-07
175001.00000  176001.00000  7.008535178514e-07
176001.00000  177001.00000  8.086771359824e-07
177001.00000  178001.00000  5.750592966986e-07
178001.00000  179001.00000  7.367947238951e-07
179001.00000  180001.00000  7.727359299388e-07
180001.00000  181001.00000  6.649123118078e-07
181001.00000  182001.00000  4.852062815895e-07
182001.00000  183001.00000  7.367947238951e-07
183001.00000  184001.00000  6.828829148296e-07
184001.00000  185001.00000  6.469417087859e-07
185001.00000  186001.00000  6.289711057641e-07
186001.00000  187001.00000  7.188241208733e-07
187001.00000  188001.00000  6.469417087859e-07
188001.00000  189001.00000  7.367947238951e-07
189001.00000  190001.00000  5.031768846113e-07
190001.00000  191001.00000  7.907065329606e-07
191001.00000  192001.00000  4.672356785676e-07
192001.00000  193001.00000  5.211474876331e-07
193001.00000  194001.00000  5.031768846113e-07
194001.00000  195001.00000  6.469417087859e-07
195001.00000  196001.00000  5.211474876331e-07
196001.00000  197001.00000  7.188241208733e-07
197001.00000  198001.00000  5.211474876331e-07
198001.00000  199001.00000  7.367947238951e-07
