300.00000  350.00000  8.198227484257e-06
350.00000  400.00000  1.318845290946e-05
400.00000  450.00000  8.198227484257e-06
450.00000  500.00000  8.554672157485e-06
500.00000  550.00000  7.307115801185e-05
550.00000  600.00000  5.703114771657e-06
600.00000  650.00000  2.423823777954e-05
650.00000  700.00000  9.267561503942e-06
700.00000  750.00000  1.782223366143e-05
750.00000  800.00000  1.104978487008e-05
800.00000  850.00000  3.885246938191e-05
850.00000  900.00000  9.980450850399e-06
900.00000  950.00000  9.624006177171e-06
950.00000  1000.00000  9.267561503942e-06
1000.00000  1050.00000  7.841782811028e-06
1050.00000  1100.00000  7.485338137799e-06
1100.00000  1150.00000  7.841782811028e-06
1150.00000  1200.00000  1.211911888977e-05
1200.00000  1250.00000  2.138668039371e-05
1250.00000  1300.00000  5.703114771657e-05
1300.00000  1350.00000  3.243646526380e-05
1350.00000  1400.00000  5.631825837011e-05
1400.00000  1450.00000  9.018050232682e-05
1450.00000  1500.00000  1.500632074292e-04
1500.00000  1550.00000  2.006783510277e-04
1550.00000  1600.00000  2.602046114568e-04
1600.00000  1650.00000  3.550188945356e-04
1650.00000  1700.00000  4.459122862089e-04
1700.00000  1750.00000  6.230652888035e-04
1750.00000  1800.00000  6.544324200476e-04
1800.00000  1850.00000  7.075426763587e-04
1850.00000  1900.00000  6.897204426972e-04
1900.00000  1950.00000  8.023569594375e-04
1950.00000  2000.00000  9.353108225517e-04
2000.00000  2050.00000  1.009807759256e-03
2050.00000  2100.00000  1.094285146812e-03
2100.00000  2150.00000  1.187317206524e-03
2150.00000  2200.00000  1.293537719146e-03
2200.00000  2250.00000  1.279636376890e-03
2250.00000  2300.00000  1.412233795331e-03
2300.00000  2350.00000  1.605426808221e-03
2350.00000  2400.00000  1.467482719682e-03
2400.00000  2450.00000  1.512038303835e-03
2450.00000  2500.00000  1.455007156119e-03
2500.00000  2550.00000  1.387282668206e-03
2550.00000  2600.00000  1.383718221473e-03
2600.00000  2650.00000  1.436115588438e-03
2650.00000  2700.00000  1.426491582261e-03
2700.00000  2750.00000  1.487800066056e-03
2750.00000  2800.00000  1.406530680560e-03
2800.00000  2850.00000  1.385144000166e-03
2850.00000  2900.00000  1.385144000166e-03
2900.00000  2950.00000  1.390134225591e-03
2950.00000  3000.00000  1.385144000166e-03
3000.00000  3050.00000  1.312429286828e-03
3050.00000  3100.00000  1.330251520489e-03
3100.00000  3150.00000  1.256111028457e-03
3150.00000  3200.00000  1.291042606434e-03
3200.00000  3250.00000  1.224743897213e-03
3250.00000  3300.00000  1.179118979040e-03
3300.00000  3350.00000  1.204070106166e-03
3350.00000  3400.00000  1.135276284233e-03
3400.00000  3450.00000  1.065056683607e-03
3450.00000  3500.00000  1.059710013508e-03
3500.00000  3550.00000  1.051511786024e-03
3550.00000  3600.00000  1.022639767493e-03
3600.00000  3650.00000  1.028342882264e-03
3650.00000  3700.00000  1.011589982623e-03
3700.00000  3750.00000  9.378059352643e-04
3750.00000  3800.00000  8.961019084966e-04
3800.00000  3850.00000  8.679427793115e-04
3850.00000  3900.00000  8.943196851304e-04
3900.00000  3950.00000  8.159018570201e-04
3950.00000  4000.00000  7.991489573784e-04
4000.00000  4050.00000  7.592271539768e-04
4050.00000  4100.00000  7.374840289099e-04
4100.00000  4150.00000  7.674253814611e-04
4150.00000  4200.00000  7.086120103783e-04
4200.00000  4250.00000  6.825915492327e-04
4250.00000  4300.00000  6.754626557681e-04
4300.00000  4350.00000  6.455213032169e-04
4350.00000  4400.00000  6.244910674964e-04
4400.00000  4450.00000  6.252039568429e-04
4450.00000  4500.00000  5.802919280161e-04
4500.00000  4550.00000  5.678163644531e-04
4550.00000  4600.00000  5.578359136027e-04
4600.00000  4650.00000  5.104287720633e-04
4650.00000  4700.00000  5.368056778822e-04
4700.00000  4750.00000  5.025869892522e-04
4750.00000  4800.00000  5.065078806578e-04
4800.00000  4850.00000  4.726456367011e-04
4850.00000  4900.00000  4.569620710790e-04
4900.00000  4950.00000  4.459122862089e-04
4950.00000  5000.00000  4.302287205869e-04
5000.00000  5050.00000  4.255949398349e-04
5050.00000  5100.00000  3.831780237207e-04
5100.00000  5150.00000  4.059904828073e-04
5150.00000  5200.00000  3.735540175435e-04
5200.00000  5250.00000  3.810393556813e-04
5250.00000  5300.00000  3.714153495041e-04
5300.00000  5350.00000  3.671380134254e-04
5350.00000  5400.00000  3.568011179018e-04
5400.00000  5450.00000  3.500286691104e-04
5450.00000  5500.00000  3.115326444017e-04
5500.00000  5550.00000  3.357708821813e-04
5550.00000  5600.00000  3.108197550553e-04
5600.00000  5650.00000  2.933539660671e-04
5650.00000  5700.00000  2.862250726025e-04
5700.00000  5750.00000  2.823041811970e-04
5750.00000  5800.00000  2.580659434175e-04
5800.00000  5850.00000  2.769575110986e-04
5850.00000  5900.00000  2.701850623072e-04
5900.00000  5950.00000  2.477290478938e-04
5950.00000  6000.00000  2.505806052797e-04
6000.00000  6050.00000  2.381050417167e-04
6050.00000  6100.00000  2.163619166497e-04
6100.00000  6150.00000  2.363228183505e-04
6150.00000  6200.00000  2.309761482521e-04
6200.00000  6250.00000  2.117281358978e-04
6250.00000  6300.00000  2.348970396576e-04
6300.00000  6350.00000  2.113716912245e-04
6350.00000  6400.00000  6.679773176303e-04
6400.00000  6450.00000  1.981832383151e-04
6450.00000  6500.00000  1.956881256025e-04
6500.00000  6550.00000  1.757272239017e-04
6550.00000  6600.00000  1.718063324962e-04
6600.00000  6650.00000  1.735885558623e-04
6650.00000  6700.00000  1.696676644568e-04
6700.00000  6750.00000  1.703805538032e-04
6750.00000  6800.00000  1.593307689332e-04
6800.00000  6850.00000  1.600436582796e-04
6850.00000  6900.00000  1.643209943584e-04
6900.00000  6950.00000  1.436472033111e-04
6950.00000  7000.00000  1.493503180828e-04
7000.00000  7050.00000  1.579049902402e-04
7050.00000  7100.00000  2.056685764529e-04
7100.00000  7150.00000  1.268943036694e-04
7150.00000  7200.00000  1.272507483426e-04
7200.00000  7250.00000  1.158445187993e-04
7250.00000  7300.00000  1.251120803032e-04
7300.00000  7350.00000  1.268943036694e-04
7350.00000  7400.00000  1.154880741260e-04
7400.00000  7450.00000  1.115671827205e-04
7450.00000  7500.00000  1.447165373308e-04
7500.00000  7550.00000  1.112107380473e-04
7550.00000  7600.00000  1.090720700079e-04
7600.00000  7650.00000  9.303205971265e-05
7650.00000  7700.00000  1.026560658898e-04
7700.00000  7750.00000  1.154880741260e-04
7750.00000  7800.00000  1.072898466418e-04
7800.00000  7850.00000  9.624006177171e-05
7850.00000  7900.00000  1.033689552363e-04
7900.00000  7950.00000  9.766584046462e-05
7950.00000  8000.00000  9.338850438588e-05
8000.00000  8050.00000  8.483383222839e-05
8050.00000  8100.00000  8.875472363391e-05
8100.00000  8150.00000  1.008738425237e-04
8150.00000  8200.00000  8.590316624808e-05
8200.00000  8250.00000  8.554672157485e-05
8250.00000  8300.00000  8.768538961422e-05
8300.00000  8350.00000  7.414049203154e-05
8350.00000  8400.00000  8.412094288194e-05
8400.00000  8450.00000  7.984360680319e-05
8450.00000  8500.00000  8.412094288194e-05
8500.00000  8550.00000  8.340805353548e-05
8550.00000  8600.00000  6.594226454728e-05
8600.00000  8650.00000  7.806138343705e-05
8650.00000  8700.00000  6.808093258665e-05
8700.00000  8750.00000  7.663560474414e-05
8750.00000  8800.00000  7.200182399217e-05
8800.00000  8850.00000  7.235826866539e-05
8850.00000  8900.00000  6.202137314177e-05
8900.00000  8950.00000  6.808093258665e-05
8950.00000  9000.00000  6.558581987405e-05
9000.00000  9050.00000  6.772448791342e-05
9050.00000  9100.00000  7.342760268508e-05
9100.00000  9150.00000  5.703114771657e-05
9150.00000  9200.00000  5.311025631105e-05
9200.00000  9250.00000  5.667470304334e-05
9250.00000  9300.00000  5.560536902365e-05
9300.00000  9350.00000  5.596181369688e-05
9350.00000  9400.00000  6.736804324020e-05
9400.00000  9450.00000  6.202137314177e-05
9450.00000  9500.00000  5.168447761814e-05
9500.00000  9550.00000  5.810048173625e-05
9550.00000  9600.00000  5.667470304334e-05
9600.00000  9650.00000  4.562491817325e-05
9650.00000  9700.00000  4.847647555908e-05
9700.00000  9750.00000  4.669425219294e-05
9750.00000  9800.00000  5.061514359845e-05
9800.00000  9850.00000  5.346670098428e-05
9850.00000  9900.00000  4.812003088585e-05
9900.00000  9950.00000  4.740714153940e-05
9950.00000  10000.00000  4.847647555908e-05
