300.00000  350.00000  2.081429415078e-05
350.00000  400.00000  3.732218261518e-05
400.00000  450.00000  2.224976271290e-05
450.00000  500.00000  3.516897977200e-05
500.00000  550.00000  2.081429415078e-04
550.00000  600.00000  2.260862985343e-05
600.00000  650.00000  7.033795954400e-05
650.00000  700.00000  3.122144122616e-05
700.00000  750.00000  4.880593111216e-05
750.00000  800.00000  2.978597266404e-05
800.00000  850.00000  1.108899464240e-04
850.00000  900.00000  2.978597266404e-05
900.00000  950.00000  2.476183269661e-05
950.00000  1000.00000  2.224976271290e-05
1000.00000  1050.00000  3.229804264775e-05
1050.00000  1100.00000  2.942710552351e-05
1100.00000  1150.00000  3.122144122616e-05
1150.00000  1200.00000  2.942710552351e-05
1200.00000  1250.00000  3.445124549094e-05
1250.00000  1300.00000  9.761186222432e-05
1300.00000  1350.00000  3.409237835041e-05
1350.00000  1400.00000  2.583843411820e-05
1400.00000  1450.00000  4.162858830155e-05
1450.00000  1500.00000  4.629386112845e-05
1500.00000  1550.00000  3.624558119359e-05
1550.00000  1600.00000  4.701159540951e-05
1600.00000  1650.00000  3.445124549094e-05
1650.00000  1700.00000  4.701159540951e-05
1700.00000  1750.00000  1.460589261960e-04
1750.00000  1800.00000  5.239460251747e-05
1800.00000  1850.00000  5.311233679853e-05
1850.00000  1900.00000  4.342292400420e-05
1900.00000  1950.00000  5.777760962543e-05
1950.00000  2000.00000  5.275346965800e-05
2000.00000  2050.00000  5.813647676596e-05
2050.00000  2100.00000  5.921307818755e-05
2100.00000  2150.00000  5.957194532808e-05
2150.00000  2200.00000  5.383007107959e-05
2200.00000  2250.00000  5.526553964171e-05
2250.00000  2300.00000  5.849534390649e-05
2300.00000  2350.00000  1.510830661634e-04
2350.00000  2400.00000  5.454780536065e-05
2400.00000  2450.00000  5.705987534437e-05
2450.00000  2500.00000  5.383007107959e-05
2500.00000  2550.00000  5.060026681482e-05
2550.00000  2600.00000  5.454780536065e-05
2600.00000  2650.00000  5.598327392277e-05
2650.00000  2700.00000  5.490667250118e-05
2700.00000  2750.00000  5.562440678224e-05
2750.00000  2800.00000  6.495495243604e-05
2800.00000  2850.00000  4.629386112845e-05
2850.00000  2900.00000  6.208401531179e-05
2900.00000  2950.00000  5.634214106330e-05
2950.00000  3000.00000  6.567268671710e-05
3000.00000  3050.00000  5.095913395535e-05
3050.00000  3100.00000  5.131800109588e-05
3100.00000  3150.00000  4.449952542579e-05
3150.00000  3200.00000  5.239460251747e-05
3200.00000  3250.00000  5.670100820384e-05
3250.00000  3300.00000  4.737046255004e-05
3300.00000  3350.00000  5.383007107959e-05
3350.00000  3400.00000  5.024139967428e-05
3400.00000  3450.00000  4.772932969057e-05
3450.00000  3500.00000  4.844706397163e-05
3500.00000  3550.00000  5.060026681482e-05
3550.00000  3600.00000  4.162858830155e-05
3600.00000  3650.00000  3.839878403677e-05
3650.00000  3700.00000  5.598327392277e-05
3700.00000  3750.00000  4.449952542579e-05
3750.00000  3800.00000  5.167686823641e-05
3800.00000  3850.00000  3.983425259890e-05
3850.00000  3900.00000  4.485839256633e-05
3900.00000  3950.00000  3.875765117731e-05
3950.00000  4000.00000  4.665272826898e-05
4000.00000  4050.00000  4.916479825269e-05
4050.00000  4100.00000  3.983425259890e-05
4100.00000  4150.00000  3.768104975571e-05
4150.00000  4200.00000  3.660444833412e-05
4200.00000  4250.00000  3.373351120988e-05
4250.00000  4300.00000  3.122144122616e-05
4300.00000  4350.00000  3.588671405306e-05
4350.00000  4400.00000  3.265690978829e-05
4400.00000  4450.00000  3.086257408563e-05
4450.00000  4500.00000  3.086257408563e-05
4500.00000  4550.00000  3.445124549094e-05
4550.00000  4600.00000  3.193917550722e-05
4600.00000  4650.00000  2.942710552351e-05
4650.00000  4700.00000  3.086257408563e-05
4700.00000  4750.00000  3.229804264775e-05
4750.00000  4800.00000  2.942710552351e-05
4800.00000  4850.00000  3.301577692882e-05
4850.00000  4900.00000  2.763276982086e-05
4900.00000  4950.00000  2.799163696139e-05
4950.00000  5000.00000  2.835050410192e-05
5000.00000  5050.00000  2.583843411820e-05
5050.00000  5100.00000  2.835050410192e-05
5100.00000  5150.00000  2.260862985343e-05
5150.00000  5200.00000  2.727390268033e-05
5200.00000  5250.00000  2.224976271290e-05
5250.00000  5300.00000  2.978597266404e-05
5300.00000  5350.00000  1.973769272918e-05
5350.00000  5400.00000  2.512069983714e-05
5400.00000  5450.00000  2.978597266404e-05
5450.00000  5500.00000  2.009655986971e-05
5500.00000  5550.00000  2.009655986971e-05
5550.00000  5600.00000  2.153202843184e-05
5600.00000  5650.00000  2.081429415078e-05
5650.00000  5700.00000  2.189089557237e-05
5700.00000  5750.00000  2.619730125873e-05
5750.00000  5800.00000  2.153202843184e-05
5800.00000  5850.00000  1.722562274547e-05
5850.00000  5900.00000  1.901995844812e-05
5900.00000  5950.00000  2.153202843184e-05
5950.00000  6000.00000  1.794335702653e-05
6000.00000  6050.00000  2.117316129131e-05
6050.00000  6100.00000  1.543128704282e-05
6100.00000  6150.00000  1.758448988600e-05
6150.00000  6200.00000  1.686675560494e-05
6200.00000  6250.00000  1.579015418335e-05
6250.00000  6300.00000  1.614902132388e-05
6300.00000  6350.00000  1.722562274547e-05
6350.00000  6400.00000  1.919939201839e-04
6400.00000  6450.00000  1.866109130759e-05
6450.00000  6500.00000  1.543128704282e-05
6500.00000  6550.00000  1.686675560494e-05
6550.00000  6600.00000  1.363695134016e-05
6600.00000  6650.00000  1.614902132388e-05
6650.00000  6700.00000  1.399581848069e-05
6700.00000  6750.00000  1.076601421592e-05
6750.00000  6800.00000  1.579015418335e-05
6800.00000  6850.00000  1.722562274547e-05
6850.00000  6900.00000  1.614902132388e-05
6900.00000  6950.00000  2.045542701024e-05
6950.00000  7000.00000  1.435468562122e-05
7000.00000  7050.00000  1.363695134016e-05
7050.00000  7100.00000  3.158030836669e-05
7100.00000  7150.00000  1.650788846441e-05
7150.00000  7200.00000  1.291921705910e-05
7200.00000  7250.00000  1.184261563751e-05
7250.00000  7300.00000  1.291921705910e-05
7300.00000  7350.00000  1.184261563751e-05
7350.00000  7400.00000  1.327808419963e-05
7400.00000  7450.00000  8.612811372735e-06
7450.00000  7500.00000  1.794335702653e-05
7500.00000  7550.00000  1.040714707539e-05
7550.00000  7600.00000  1.220148277804e-05
7600.00000  7650.00000  1.291921705910e-05
7650.00000  7700.00000  1.112488135645e-05
7700.00000  7750.00000  1.076601421592e-05
7750.00000  7800.00000  6.459608529551e-06
7800.00000  7850.00000  1.184261563751e-05
7850.00000  7900.00000  1.291921705910e-05
7900.00000  7950.00000  1.004827993486e-05
7950.00000  8000.00000  1.004827993486e-05
8000.00000  8050.00000  1.148374849698e-05
8050.00000  8100.00000  1.076601421592e-05
8100.00000  8150.00000  9.689412794326e-06
8150.00000  8200.00000  9.689412794326e-06
8200.00000  8250.00000  6.459608529551e-06
8250.00000  8300.00000  8.612811372735e-06
8300.00000  8350.00000  6.459608529551e-06
8350.00000  8400.00000  7.177342810612e-06
8400.00000  8450.00000  1.076601421592e-05
8450.00000  8500.00000  7.177342810612e-06
8500.00000  8550.00000  8.612811372735e-06
8550.00000  8600.00000  1.004827993486e-05
8600.00000  8650.00000  9.689412794326e-06
8650.00000  8700.00000  7.536209951143e-06
8700.00000  8750.00000  8.612811372735e-06
8750.00000  8800.00000  1.076601421592e-05
8800.00000  8850.00000  8.253944232204e-06
8850.00000  8900.00000  8.253944232204e-06
8900.00000  8950.00000  6.459608529551e-06
8950.00000  9000.00000  8.971678513265e-06
9000.00000  9050.00000  7.177342810612e-06
9050.00000  9100.00000  7.536209951143e-06
9100.00000  9150.00000  6.100741389020e-06
9150.00000  9200.00000  6.100741389020e-06
9200.00000  9250.00000  7.895077091673e-06
9250.00000  9300.00000  7.895077091673e-06
9300.00000  9350.00000  5.383007107959e-06
9350.00000  9400.00000  7.536209951143e-06
9400.00000  9450.00000  5.741874248490e-06
9450.00000  9500.00000  8.612811372735e-06
9500.00000  9550.00000  1.040714707539e-05
9550.00000  9600.00000  5.024139967428e-06
9600.00000  9650.00000  6.459608529551e-06
9650.00000  9700.00000  8.612811372735e-06
9700.00000  9750.00000  4.306405686367e-06
9750.00000  9800.00000  5.383007107959e-06
9800.00000  9850.00000  7.177342810612e-06
9850.00000  9900.00000  5.024139967428e-06
9900.00000  9950.00000  6.818475670081e-06
9950.00000  10000.00000  7.895077091673e-06
