300.00000  350.00000  1.020766243246e+00
350.00000  400.00000  7.223132954995e-01
400.00000  450.00000  5.316770645893e-01
450.00000  500.00000  4.065548370939e-01
500.00000  550.00000  3.194250759230e-01
550.00000  600.00000  2.561295234720e-01
600.00000  650.00000  2.092592704363e-01
650.00000  700.00000  1.740771075229e-01
700.00000  750.00000  1.456610209059e-01
750.00000  800.00000  1.243591122268e-01
800.00000  850.00000  1.072439820989e-01
850.00000  900.00000  9.265637258425e-02
900.00000  950.00000  8.103041502042e-02
950.00000  1000.00000  7.175991867730e-02
1000.00000  1050.00000  6.336644729326e-02
1050.00000  1100.00000  5.630484305870e-02
1100.00000  1150.00000  5.038870829840e-02
1150.00000  1200.00000  4.526675508597e-02
1200.00000  1250.00000  4.106723139454e-02
1250.00000  1300.00000  3.707481623113e-02
1300.00000  1350.00000  3.399367859106e-02
1350.00000  1400.00000  3.095396265659e-02
1400.00000  1450.00000  2.846388089266e-02
1450.00000  1500.00000  2.635296704928e-02
1500.00000  1550.00000  2.400467496992e-02
1550.00000  1600.00000  2.223787991158e-02
1600.00000  1650.00000  2.054038655299e-02
1650.00000  1700.00000  1.904840857992e-02
1700.00000  1750.00000  1.805349107411e-02
1750.00000  1800.00000  1.668020221902e-02
1800.00000  1850.00000  1.558650987677e-02
1850.00000  1900.00000  1.447051353919e-02
1900.00000  1950.00000  1.373846454973e-02
1950.00000  2000.00000  1.269256648318e-02
2000.00000  2050.00000  1.210788317713e-02
2050.00000  2100.00000  1.135114047856e-02
2100.00000  2150.00000  1.075530517484e-02
2150.00000  2200.00000  9.973072195900e-03
2200.00000  2250.00000  9.510264292879e-03
2250.00000  2300.00000  8.931953556919e-03
2300.00000  2350.00000  8.607749053426e-03
2350.00000  2400.00000  8.060504596670e-03
2400.00000  2450.00000  7.773738942475e-03
2450.00000  2500.00000  7.443958440150e-03
2500.00000  2550.00000  7.099839655116e-03
2550.00000  2600.00000  6.743772301157e-03
2600.00000  2650.00000  6.292116395800e-03
2650.00000  2700.00000  6.061907301182e-03
2700.00000  2750.00000  5.878695911002e-03
2750.00000  2800.00000  5.603878825731e-03
2800.00000  2850.00000  5.325875455414e-03
2850.00000  2900.00000  5.161781775514e-03
2900.00000  2950.00000  4.920420683233e-03
2950.00000  3000.00000  4.707736156371e-03
3000.00000  3050.00000  4.429732786054e-03
3050.00000  3100.00000  4.399463078111e-03
3100.00000  3150.00000  4.214658545408e-03
3150.00000  3200.00000  3.998787733500e-03
3200.00000  3250.00000  3.821948913413e-03
3250.00000  3300.00000  3.605281530243e-03
3300.00000  3350.00000  3.644313522064e-03
3350.00000  3400.00000  3.520048405246e-03
3400.00000  3450.00000  3.336837015066e-03
3450.00000  3500.00000  3.214961612033e-03
3500.00000  3550.00000  3.026174223021e-03
3550.00000  3600.00000  2.914654246390e-03
3600.00000  3650.00000  2.868453113214e-03
3650.00000  3700.00000  2.783219988217e-03
3700.00000  3750.00000  2.758526279105e-03
3750.00000  3800.00000  2.555400607384e-03
3800.00000  3850.00000  2.584873744065e-03
3850.00000  3900.00000  2.554604036122e-03
3900.00000  3950.00000  2.399272640100e-03
3950.00000  4000.00000  2.349885221877e-03
4000.00000  4050.00000  2.251110385432e-03
4050.00000  4100.00000  2.184994970715e-03
4100.00000  4150.00000  2.063916138944e-03
4150.00000  4200.00000  2.052764141281e-03
4200.00000  4250.00000  2.032053288478e-03
4250.00000  4300.00000  1.906991600398e-03
4300.00000  4350.00000  1.826537902971e-03
4350.00000  4400.00000  1.766795058347e-03
4400.00000  4450.00000  1.804233907645e-03
4450.00000  4500.00000  1.729356209049e-03
4500.00000  4550.00000  1.643326512791e-03
4550.00000  4600.00000  1.585176810690e-03
4600.00000  4650.00000  1.569245385457e-03
4650.00000  4700.00000  1.558889959056e-03
4700.00000  4750.00000  1.458521980087e-03
4750.00000  4800.00000  1.401168849248e-03
4800.00000  4850.00000  1.450556267471e-03
4850.00000  4900.00000  1.420286559528e-03
4900.00000  4950.00000  1.301597441542e-03
4950.00000  5000.00000  1.291242015140e-03
5000.00000  5050.00000  1.303987155326e-03
5050.00000  5100.00000  1.274514018645e-03
5100.00000  5150.00000  1.271327733599e-03
5150.00000  5200.00000  1.191670607433e-03
5200.00000  5250.00000  1.207602032666e-03
5250.00000  5300.00000  1.162994042014e-03
5300.00000  5350.00000  1.145469474257e-03
5350.00000  5400.00000  1.099268341082e-03
5400.00000  5450.00000  1.077760917017e-03
5450.00000  5500.00000  1.034746068888e-03
5500.00000  5550.00000  9.757997955253e-04
5550.00000  5600.00000  1.048287780336e-03
5600.00000  5650.00000  1.015628358608e-03
5650.00000  5700.00000  9.327849473960e-04
5700.00000  5750.00000  9.447335163208e-04
5750.00000  5800.00000  9.487163726291e-04
5800.00000  5850.00000  9.033118107149e-04
5850.00000  5900.00000  8.658729614172e-04
5900.00000  5950.00000  8.244512558112e-04
5950.00000  6000.00000  8.316203971661e-04
6000.00000  6050.00000  8.164855431947e-04
6050.00000  6100.00000  7.854192639902e-04
6100.00000  6150.00000  8.132992581480e-04
6150.00000  6200.00000  7.870124065135e-04
6200.00000  6250.00000  7.798432651586e-04
6250.00000  6300.00000  7.607255548789e-04
6300.00000  6350.00000  7.559461273090e-04
6350.00000  6400.00000  1.109623767483e-03
6400.00000  6450.00000  6.954067114233e-04
6450.00000  6500.00000  6.842547137602e-04
6500.00000  6550.00000  6.523918632941e-04
6550.00000  6600.00000  6.507987207708e-04
6600.00000  6650.00000  6.826615712369e-04
6650.00000  6700.00000  6.420364368926e-04
6700.00000  6750.00000  6.284947254445e-04
6750.00000  6800.00000  6.348672955377e-04
6800.00000  6850.00000  6.006147312866e-04
6850.00000  6900.00000  5.838867347919e-04
6900.00000  6950.00000  5.655655957739e-04
6950.00000  7000.00000  5.711415946054e-04
7000.00000  7050.00000  5.934455899317e-04
7050.00000  7100.00000  5.560067406340e-04
7100.00000  7150.00000  5.337027453077e-04
7150.00000  7200.00000  5.344993165694e-04
7200.00000  7250.00000  5.631758819889e-04
7250.00000  7300.00000  5.337027453077e-04
7300.00000  7350.00000  5.352958878310e-04
7350.00000  7400.00000  4.420970502176e-04
7400.00000  7450.00000  4.835187558236e-04
7450.00000  7500.00000  4.524524766191e-04
7500.00000  7550.00000  4.556387616657e-04
7550.00000  7600.00000  5.098056074581e-04
7600.00000  7650.00000  4.452833352642e-04
7650.00000  7700.00000  4.365210513860e-04
7700.00000  7750.00000  4.213861974146e-04
7750.00000  7800.00000  4.444867640026e-04
7800.00000  7850.00000  4.436901927409e-04
7850.00000  7900.00000  4.126239135364e-04
7900.00000  7950.00000  4.078444859665e-04
7950.00000  8000.00000  3.775747780237e-04
8000.00000  8050.00000  3.927096319951e-04
8050.00000  8100.00000  4.022684871349e-04
8100.00000  8150.00000  3.815576343319e-04
8150.00000  8200.00000  3.544742114357e-04
8200.00000  8250.00000  3.672193516222e-04
8250.00000  8300.00000  3.688124941455e-04
8300.00000  8350.00000  3.688124941455e-04
8350.00000  8400.00000  3.377462149410e-04
8400.00000  8450.00000  3.592536390056e-04
8450.00000  8500.00000  3.281873598012e-04
8500.00000  8550.00000  3.178319333997e-04
8550.00000  8600.00000  3.473050700808e-04
8600.00000  8650.00000  3.425256425109e-04
8650.00000  8700.00000  3.273907885395e-04
8700.00000  8750.00000  3.138490770914e-04
8750.00000  8800.00000  3.098662207831e-04
8800.00000  8850.00000  3.114593633064e-04
8850.00000  8900.00000  3.305770735861e-04
8900.00000  8950.00000  2.939347955501e-04
8950.00000  9000.00000  3.218147897079e-04
9000.00000  9050.00000  3.050867932132e-04
9050.00000  9100.00000  3.011039369050e-04
9100.00000  9150.00000  2.931382242884e-04
9150.00000  9200.00000  2.668513726539e-04
9200.00000  9250.00000  2.867656541952e-04
9250.00000  9300.00000  3.082730782598e-04
9300.00000  9350.00000  2.963245093350e-04
9350.00000  9400.00000  2.700376577005e-04
9400.00000  9450.00000  2.684445151772e-04
9450.00000  9500.00000  2.644616588689e-04
9500.00000  9550.00000  2.525130899441e-04
9550.00000  9600.00000  2.692410864388e-04
9600.00000  9650.00000  2.461405198509e-04
9650.00000  9700.00000  2.517165186824e-04
9700.00000  9750.00000  2.588856600373e-04
9750.00000  9800.00000  2.485302336358e-04
9800.00000  9850.00000  2.230399532629e-04
9850.00000  9900.00000  2.262262383095e-04
9900.00000  9950.00000  2.533096612058e-04
9950.00000  10000.00000  2.397679497576e-04
