300.00000  350.00000  1.974491838123e-01
350.00000  400.00000  1.396989301568e-01
400.00000  450.00000  1.031691084707e-01
450.00000  500.00000  7.895495679984e-02
500.00000  550.00000  6.209964827805e-02
550.00000  600.00000  4.979071918781e-02
600.00000  650.00000  4.079982319174e-02
650.00000  700.00000  3.405065926134e-02
700.00000  750.00000  2.849838401818e-02
750.00000  800.00000  2.443210824656e-02
800.00000  850.00000  2.085567302653e-02
850.00000  900.00000  1.827839269310e-02
900.00000  950.00000  1.569137546797e-02
950.00000  1000.00000  1.401438312082e-02
1000.00000  1050.00000  1.230892909025e-02
1050.00000  1100.00000  1.107384182788e-02
1100.00000  1150.00000  9.770596323615e-03
1150.00000  1200.00000  8.898021029095e-03
1200.00000  1250.00000  8.152774318325e-03
1250.00000  1300.00000  7.371576007437e-03
1300.00000  1350.00000  6.735682080358e-03
1350.00000  1400.00000  6.148472611771e-03
1400.00000  1450.00000  5.688591726934e-03
1450.00000  1500.00000  5.127596966766e-03
1500.00000  1550.00000  4.799538615694e-03
1550.00000  1600.00000  4.482715139658e-03
1600.00000  1650.00000  4.344151680871e-03
1650.00000  1700.00000  3.899999621086e-03
1700.00000  1750.00000  3.718743637160e-03
1750.00000  1800.00000  3.387689319410e-03
1800.00000  1850.00000  3.228154093889e-03
1850.00000  1900.00000  3.036412226595e-03
1900.00000  1950.00000  2.887362884441e-03
1950.00000  2000.00000  2.765277242375e-03
2000.00000  2050.00000  2.685135133780e-03
2050.00000  2100.00000  2.530842849942e-03
2100.00000  2150.00000  2.390781407817e-03
2150.00000  2200.00000  2.446955783001e-03
2200.00000  2250.00000  2.312886274229e-03
2250.00000  2300.00000  2.290416524156e-03
2300.00000  2350.00000  2.234991140641e-03
2350.00000  2400.00000  2.202035507200e-03
2400.00000  2450.00000  2.074706923451e-03
2450.00000  2500.00000  1.967601114767e-03
2500.00000  2550.00000  1.918167664605e-03
2550.00000  2600.00000  1.888207997841e-03
2600.00000  2650.00000  1.836527572672e-03
2650.00000  2700.00000  1.808065889245e-03
2700.00000  2750.00000  1.688227222187e-03
2750.00000  2800.00000  1.712194955599e-03
2800.00000  2850.00000  1.682984280503e-03
2850.00000  2900.00000  1.602842171908e-03
2900.00000  2950.00000  1.593854271878e-03
2950.00000  3000.00000  1.557902671761e-03
3000.00000  3050.00000  1.560898638437e-03
3050.00000  3100.00000  1.432072071349e-03
3100.00000  3150.00000  1.445553921393e-03
3150.00000  3200.00000  1.472517621482e-03
3200.00000  3250.00000  1.444804929724e-03
3250.00000  3300.00000  1.354925929430e-03
3300.00000  3350.00000  1.350431979416e-03
3350.00000  3400.00000  1.297253570908e-03
3400.00000  3450.00000  1.306990462607e-03
3450.00000  3500.00000  1.202880620600e-03
3500.00000  3550.00000  1.268791887482e-03
3550.00000  3600.00000  1.323468279328e-03
3600.00000  3650.00000  1.220107428990e-03
3650.00000  3700.00000  1.181908853865e-03
3700.00000  3750.00000  1.142961287071e-03
3750.00000  3800.00000  1.122738512004e-03
3800.00000  3850.00000  1.099519770262e-03
3850.00000  3900.00000  1.086786911887e-03
3900.00000  3950.00000  1.086786911887e-03
3950.00000  4000.00000  1.039600436733e-03
4000.00000  4050.00000  1.012636736644e-03
4050.00000  4100.00000  9.339926113873e-04
4100.00000  4150.00000  9.639522781519e-04
4150.00000  4200.00000  9.489724447696e-04
4200.00000  4250.00000  9.714421948431e-04
4250.00000  4300.00000  9.362395863947e-04
4300.00000  4350.00000  8.927980695860e-04
4350.00000  4400.00000  8.478585694390e-04
4400.00000  4450.00000  8.141539443288e-04
4450.00000  4500.00000  8.396196610787e-04
4500.00000  4550.00000  8.358747027332e-04
4550.00000  4600.00000  7.991741109465e-04
4600.00000  4650.00000  8.313807527185e-04
4650.00000  4700.00000  8.104089859832e-04
4700.00000  4750.00000  7.385057857481e-04
4750.00000  4800.00000  7.377567940790e-04
4800.00000  4850.00000  7.407527607555e-04
4850.00000  4900.00000  7.325138523952e-04
4900.00000  4950.00000  6.681005688512e-04
4950.00000  5000.00000  7.444977191010e-04
5000.00000  5050.00000  6.853273772409e-04
5050.00000  5100.00000  6.875743522482e-04
5100.00000  5150.00000  6.561167021454e-04
5150.00000  5200.00000  6.740925022042e-04
5200.00000  5250.00000  6.478777937851e-04
5250.00000  5300.00000  6.194161103587e-04
5300.00000  5350.00000  6.403878770940e-04
5350.00000  5400.00000  5.991933352926e-04
5400.00000  5450.00000  5.954483769470e-04
5450.00000  5500.00000  6.044362769764e-04
5500.00000  5550.00000  6.119261936676e-04
5550.00000  5600.00000  5.774725768882e-04
5600.00000  5650.00000  5.759745935500e-04
5650.00000  5700.00000  5.684846768588e-04
5700.00000  5750.00000  5.617437518368e-04
5750.00000  5800.00000  5.175532433590e-04
5800.00000  5850.00000  5.257921517192e-04
5850.00000  5900.00000  5.212982017046e-04
5900.00000  5950.00000  5.377760184251e-04
5950.00000  6000.00000  5.003264349693e-04
6000.00000  6050.00000  5.123103016752e-04
6050.00000  6100.00000  4.741117265503e-04
6100.00000  6150.00000  4.868445849252e-04
6150.00000  6200.00000  5.040713933149e-04
6200.00000  6250.00000  4.688687848664e-04
6250.00000  6300.00000  5.055693766531e-04
6300.00000  6350.00000  4.763587015576e-04
6350.00000  6400.00000  9.107738696447e-04
6400.00000  6450.00000  4.456500431239e-04
6450.00000  6500.00000  4.239292847195e-04
6500.00000  6550.00000  4.126944096828e-04
6550.00000  6600.00000  4.141923930210e-04
6600.00000  6650.00000  4.344151680871e-04
6650.00000  6700.00000  4.381601264327e-04
6700.00000  6750.00000  4.141923930210e-04
6750.00000  6800.00000  3.924716346166e-04
6800.00000  6850.00000  3.984635679696e-04
6850.00000  6900.00000  3.714998678814e-04
6900.00000  6950.00000  3.842327262564e-04
6950.00000  7000.00000  3.677549095358e-04
7000.00000  7050.00000  3.707508762123e-04
7050.00000  7100.00000  4.411560931092e-04
7100.00000  7150.00000  3.265603677345e-04
7150.00000  7200.00000  3.190704510433e-04
7200.00000  7250.00000  3.370462511021e-04
7250.00000  7300.00000  3.003456593154e-04
7300.00000  7350.00000  2.831188509257e-04
7350.00000  7400.00000  2.793738925802e-04
7400.00000  7450.00000  2.861148176022e-04
7450.00000  7500.00000  2.891107842787e-04
7500.00000  7550.00000  2.748799425655e-04
7550.00000  7600.00000  2.651430508670e-04
7600.00000  7650.00000  3.018436426536e-04
7650.00000  7700.00000  2.808718759184e-04
7700.00000  7750.00000  2.838678425949e-04
7750.00000  7800.00000  2.486652341464e-04
7800.00000  7850.00000  2.621470841905e-04
7850.00000  7900.00000  2.621470841905e-04
7900.00000  7950.00000  2.606491008523e-04
7950.00000  8000.00000  2.838678425949e-04
8000.00000  8050.00000  2.666410342052e-04
8050.00000  8100.00000  2.464182591391e-04
8100.00000  8150.00000  2.591511175140e-04
8150.00000  8200.00000  2.456692674700e-04
8200.00000  8250.00000  2.389283424479e-04
8250.00000  8300.00000  2.344343924332e-04
8300.00000  8350.00000  2.239485090656e-04
8350.00000  8400.00000  2.179565757127e-04
8400.00000  8450.00000  2.044747256686e-04
8450.00000  8500.00000  2.127136340289e-04
8500.00000  8550.00000  2.187055673818e-04
8550.00000  8600.00000  2.389283424479e-04
8600.00000  8650.00000  2.194545590509e-04
8650.00000  8700.00000  2.067217006759e-04
8700.00000  8750.00000  2.194545590509e-04
8750.00000  8800.00000  2.082196840142e-04
8800.00000  8850.00000  1.917418672936e-04
8850.00000  8900.00000  1.984827923157e-04
8900.00000  8950.00000  1.887459006172e-04
8950.00000  9000.00000  2.187055673818e-04
9000.00000  9050.00000  2.022277506612e-04
9050.00000  9100.00000  1.879969089480e-04
9100.00000  9150.00000  2.059727090068e-04
9150.00000  9200.00000  1.767620339113e-04
9200.00000  9250.00000  1.864989256098e-04
9250.00000  9300.00000  1.962358173083e-04
9300.00000  9350.00000  1.722680838966e-04
9350.00000  9400.00000  1.797580005878e-04
9400.00000  9450.00000  1.894948922863e-04
9450.00000  9500.00000  1.550412755070e-04
9500.00000  9550.00000  1.737660672349e-04
9550.00000  9600.00000  1.685231255510e-04
9600.00000  9650.00000  1.707701005584e-04
9650.00000  9700.00000  1.707701005584e-04
9700.00000  9750.00000  1.700211088893e-04
9750.00000  9800.00000  1.775110255804e-04
9800.00000  9850.00000  1.745150589040e-04
9850.00000  9900.00000  1.640291755363e-04
9900.00000  9950.00000  1.760130422422e-04
9950.00000  10000.00000  1.438064004702e-04
