300.00000  350.00000  1.453610951529e-01
350.00000  400.00000  1.155530453356e-01
400.00000  450.00000  9.440255255550e-02
450.00000  500.00000  7.889613380689e-02
500.00000  550.00000  6.716797282014e-02
550.00000  600.00000  5.796484012555e-02
600.00000  650.00000  5.047230813248e-02
650.00000  700.00000  4.484680345377e-02
700.00000  750.00000  3.956967597986e-02
750.00000  800.00000  3.561420200373e-02
800.00000  850.00000  3.223962582334e-02
850.00000  900.00000  2.927115331393e-02
900.00000  950.00000  2.677700666275e-02
950.00000  1000.00000  2.448470080232e-02
1000.00000  1050.00000  2.273353010186e-02
1050.00000  1100.00000  2.095490905385e-02
1100.00000  1150.00000  1.949519645522e-02
1150.00000  1200.00000  1.818827733518e-02
1200.00000  1250.00000  1.702587622130e-02
1250.00000  1300.00000  1.593835804080e-02
1300.00000  1350.00000  1.501957876135e-02
1350.00000  1400.00000  1.395688699810e-02
1400.00000  1450.00000  1.331018910457e-02
1450.00000  1500.00000  1.249455046919e-02
1500.00000  1550.00000  1.179819974113e-02
1550.00000  1600.00000  1.132205731578e-02
1600.00000  1650.00000  1.065376245764e-02
1650.00000  1700.00000  1.028903614877e-02
1700.00000  1750.00000  9.777571585035e-03
1750.00000  1800.00000  9.236840106642e-03
1800.00000  1850.00000  8.831745639626e-03
1850.00000  1900.00000  8.485386842716e-03
1900.00000  1950.00000  8.154166105112e-03
1950.00000  2000.00000  7.823147208298e-03
2000.00000  2050.00000  7.469723983712e-03
2050.00000  2100.00000  7.136081156618e-03
2100.00000  2150.00000  6.873889969447e-03
2150.00000  2200.00000  6.631075498186e-03
2200.00000  2250.00000  6.411674558652e-03
2250.00000  2300.00000  6.151299938597e-03
2300.00000  2350.00000  5.880631438215e-03
2350.00000  2400.00000  5.680203533010e-03
2400.00000  2450.00000  5.543153636097e-03
2450.00000  2500.00000  5.373001849503e-03
2500.00000  2550.00000  5.182665983835e-03
2550.00000  2600.00000  5.038753500037e-03
2600.00000  2650.00000  4.882326887214e-03
2650.00000  2700.00000  4.684522912288e-03
2700.00000  2750.00000  4.575125203707e-03
2750.00000  2800.00000  4.429194312002e-03
2800.00000  2850.00000  4.329888642958e-03
2850.00000  2900.00000  4.200710536884e-03
2900.00000  2950.00000  4.020264869963e-03
2950.00000  3000.00000  3.941345120783e-03
3000.00000  3050.00000  3.838204476715e-03
3050.00000  3100.00000  3.700145375849e-03
3100.00000  3150.00000  3.642620750488e-03
3150.00000  3200.00000  3.546342693305e-03
3200.00000  3250.00000  3.441789163701e-03
3250.00000  3300.00000  3.353584738148e-03
3300.00000  3350.00000  3.301307973346e-03
3350.00000  3400.00000  3.186460563415e-03
3400.00000  3450.00000  3.132367231497e-03
3450.00000  3500.00000  3.080292307486e-03
3500.00000  3550.00000  2.978160867371e-03
3550.00000  3600.00000  2.857863756090e-03
3600.00000  3650.00000  2.807605399196e-03
3650.00000  3700.00000  2.783384504307e-03
3700.00000  3750.00000  2.703455551174e-03
3750.00000  3800.00000  2.624333961204e-03
3800.00000  3850.00000  2.580130828031e-03
3850.00000  3900.00000  2.558735704213e-03
3900.00000  3950.00000  2.455191378563e-03
3950.00000  4000.00000  2.449741677213e-03
4000.00000  4050.00000  2.371629291197e-03
4050.00000  4100.00000  2.323389342210e-03
4100.00000  4150.00000  2.205110638836e-03
4150.00000  4200.00000  2.285846955132e-03
4200.00000  4250.00000  2.190779942694e-03
4250.00000  4300.00000  2.149200739801e-03
4300.00000  4350.00000  2.097327656581e-03
4350.00000  4400.00000  2.048078503640e-03
4400.00000  4450.00000  2.042628802290e-03
4450.00000  4500.00000  1.992370445396e-03
4500.00000  4550.00000  1.983287609813e-03
4550.00000  4600.00000  1.898110796120e-03
4600.00000  4650.00000  1.862586816950e-03
4650.00000  4700.00000  1.847045076063e-03
4700.00000  4750.00000  1.792951744145e-03
4750.00000  4800.00000  1.769134530838e-03
4800.00000  4850.00000  1.757831446556e-03
4850.00000  4900.00000  1.701517865940e-03
4900.00000  4950.00000  1.639956424764e-03
4950.00000  5000.00000  1.667003090723e-03
5000.00000  5050.00000  1.634708564205e-03
5050.00000  5100.00000  1.572339759866e-03
5100.00000  5150.00000  1.571936078284e-03
5150.00000  5200.00000  1.550742795257e-03
5200.00000  5250.00000  1.505934139712e-03
5250.00000  5300.00000  1.475456180311e-03
5300.00000  5350.00000  1.488172150127e-03
5350.00000  5400.00000  1.443767176164e-03
5400.00000  5450.00000  1.426408868161e-03
5450.00000  5500.00000  1.404610062761e-03
5500.00000  5550.00000  1.388059117920e-03
5550.00000  5600.00000  1.356773795355e-03
5600.00000  5650.00000  1.362829019078e-03
5650.00000  5700.00000  1.338204442607e-03
5700.00000  5750.00000  1.292386583109e-03
5750.00000  5800.00000  1.259082852637e-03
5800.00000  5850.00000  1.269376732965e-03
5850.00000  5900.00000  1.236476684074e-03
5900.00000  5950.00000  1.248990813100e-03
5950.00000  6000.00000  1.186823849552e-03
6000.00000  6050.00000  1.159171661221e-03
6050.00000  6100.00000  1.189649620623e-03
6100.00000  6150.00000  1.195906685135e-03
6150.00000  6200.00000  1.176731810015e-03
6200.00000  6250.00000  1.137171015030e-03
6250.00000  6300.00000  1.112344597769e-03
6300.00000  6350.00000  1.119005343863e-03
6350.00000  6400.00000  1.258679171056e-03
6400.00000  6450.00000  1.104069125349e-03
6450.00000  6500.00000  1.086508976554e-03
6500.00000  6550.00000  1.059058629014e-03
6550.00000  6600.00000  1.013644451097e-03
6600.00000  6650.00000  9.936622128138e-04
6650.00000  6700.00000  1.016873903749e-03
6700.00000  6750.00000  9.922493272786e-04
6750.00000  6800.00000  9.518811691306e-04
6800.00000  6850.00000  9.577345520621e-04
6850.00000  6900.00000  9.621750494583e-04
6900.00000  6950.00000  9.389633585232e-04
6950.00000  7000.00000  9.242289807992e-04
7000.00000  7050.00000  9.327062940103e-04
7050.00000  7100.00000  9.224124136825e-04
7100.00000  7150.00000  8.634749027864e-04
7150.00000  7200.00000  8.654933106938e-04
7200.00000  7250.00000  8.533828632494e-04
7250.00000  7300.00000  8.570159974827e-04
7300.00000  7350.00000  8.695301265086e-04
7350.00000  7400.00000  8.344098289198e-04
7400.00000  7450.00000  8.263361972902e-04
7450.00000  7500.00000  8.005005760755e-04
7500.00000  7550.00000  8.049410734718e-04
7550.00000  7600.00000  8.025189839829e-04
7600.00000  7650.00000  7.863717207237e-04
7650.00000  7700.00000  7.536735126238e-04
7700.00000  7750.00000  7.676005271848e-04
7750.00000  7800.00000  7.651784376959e-04
7800.00000  7850.00000  7.607379402997e-04
7850.00000  7900.00000  7.242047571757e-04
7900.00000  7950.00000  7.284434137812e-04
7950.00000  8000.00000  7.451961994127e-04
8000.00000  8050.00000  7.413612243886e-04
8050.00000  8100.00000  6.917083898665e-04
8100.00000  8150.00000  6.913047082851e-04
8150.00000  8200.00000  7.082593347072e-04
8200.00000  8250.00000  6.838365990277e-04
8250.00000  8300.00000  6.949378425184e-04
8300.00000  8350.00000  6.816163503295e-04
8350.00000  8400.00000  6.515420725092e-04
8400.00000  8450.00000  6.503310277648e-04
8450.00000  8500.00000  6.594138633481e-04
8500.00000  8550.00000  6.501291869741e-04
8550.00000  8600.00000  6.559825699055e-04
8600.00000  8650.00000  6.277248592019e-04
8650.00000  8700.00000  6.105683919890e-04
8700.00000  8750.00000  6.372113763667e-04
8750.00000  8800.00000  6.251009289223e-04
8800.00000  8850.00000  6.031002827316e-04
8850.00000  8900.00000  5.940174471483e-04
8900.00000  8950.00000  5.988616261261e-04
8950.00000  9000.00000  5.861456563094e-04
9000.00000  9050.00000  5.645486917002e-04
9050.00000  9100.00000  5.675763035613e-04
9100.00000  9150.00000  5.681818259336e-04
9150.00000  9200.00000  5.744388904465e-04
9200.00000  9250.00000  5.500161547669e-04
9250.00000  9300.00000  5.615210798391e-04
9300.00000  9350.00000  5.431535678818e-04
9350.00000  9400.00000  5.582916271873e-04
9400.00000  9450.00000  5.122719268985e-04
9450.00000  9500.00000  5.296302349022e-04
9500.00000  9550.00000  5.370983441596e-04
9550.00000  9600.00000  5.447682942077e-04
9600.00000  9650.00000  5.211529216911e-04
9650.00000  9700.00000  5.102535189911e-04
9700.00000  9750.00000  5.050056584319e-04
9750.00000  9800.00000  5.134829716430e-04
9800.00000  9850.00000  5.102535189911e-04
9850.00000  9900.00000  5.114645637356e-04
9900.00000  9950.00000  4.840142161949e-04
9950.00000  10000.00000  4.815921267060e-04
