10001.00000  11001.00000  8.412760111656e-05
11001.00000  12001.00000  7.191194484875e-05
12001.00000  13001.00000  6.210269555141e-05
13001.00000  14001.00000  5.559863173160e-05
14001.00000  15001.00000  4.879497507611e-05
15001.00000  16001.00000  4.334431832370e-05
16001.00000  17001.00000  3.958491145014e-05
17001.00000  18001.00000  3.679193307878e-05
18001.00000  19001.00000  3.427921897306e-05
19001.00000  20001.00000  3.043283353430e-05
20001.00000  21001.00000  2.783314086338e-05
21001.00000  22001.00000  2.555236959818e-05
22001.00000  23001.00000  2.351320545854e-05
23001.00000  24001.00000  2.168665558938e-05
24001.00000  25001.00000  2.005339142066e-05
25001.00000  26001.00000  1.926092004886e-05
26001.00000  27001.00000  1.747302731979e-05
27001.00000  28001.00000  1.655492024270e-05
28001.00000  29001.00000  1.613935598675e-05
29001.00000  30001.00000  1.451575610305e-05
30001.00000  31001.00000  1.420649898235e-05
31001.00000  32001.00000  1.323040619513e-05
32001.00000  33001.00000  1.246692767839e-05
33001.00000  34001.00000  1.198371342729e-05
34001.00000  35001.00000  1.129754919073e-05
35001.00000  36001.00000  1.100762064007e-05
36001.00000  37001.00000  9.702942162094e-06
37001.00000  38001.00000  1.061138495416e-05
38001.00000  39001.00000  9.026442210554e-06
39001.00000  40001.00000  8.678527949762e-06
40001.00000  41001.00000  8.272627978837e-06
41001.00000  42001.00000  7.866728007913e-06
42001.00000  43001.00000  6.880970935668e-06
43001.00000  44001.00000  7.634785167385e-06
44001.00000  45001.00000  7.122578061219e-06
45001.00000  46001.00000  6.049842423776e-06
46001.00000  47001.00000  6.320442404392e-06
47001.00000  48001.00000  6.069170993820e-06
48001.00000  49001.00000  5.701928162984e-06
49001.00000  50001.00000  5.112406776641e-06
50001.00000  51001.00000  5.044756781487e-06
51001.00000  52001.00000  5.344349617169e-06
52001.00000  53001.00000  4.687178235673e-06
53001.00000  54001.00000  4.754828230827e-06
54001.00000  55001.00000  4.290942549771e-06
55001.00000  56001.00000  4.542213960343e-06
56001.00000  57001.00000  4.252285409683e-06
57001.00000  58001.00000  4.300606834793e-06
58001.00000  59001.00000  3.943028288979e-06
59001.00000  60001.00000  3.943028288979e-06
60001.00000  61001.00000  3.778735443604e-06
61001.00000  62001.00000  4.010678284133e-06
62001.00000  63001.00000  3.575785458142e-06
63001.00000  64001.00000  3.730414018494e-06
64001.00000  65001.00000  3.179549772240e-06
65001.00000  66001.00000  2.860628366514e-06
66001.00000  67001.00000  2.966935501756e-06
67001.00000  68001.00000  2.918614076646e-06
68001.00000  69001.00000  2.696335521140e-06
69001.00000  70001.00000  2.522378390744e-06
70001.00000  71001.00000  2.474056965634e-06
71001.00000  72001.00000  2.648014096030e-06
72001.00000  73001.00000  2.309764120259e-06
73001.00000  74001.00000  2.406406970480e-06
74001.00000  75001.00000  2.145471274885e-06
75001.00000  76001.00000  2.329092690304e-06
76001.00000  77001.00000  2.019835569599e-06
77001.00000  78001.00000  1.961849859467e-06
78001.00000  79001.00000  2.155135559907e-06
79001.00000  80001.00000  2.145471274885e-06
80001.00000  81001.00000  1.990842714533e-06
81001.00000  82001.00000  2.019835569599e-06
82001.00000  83001.00000  1.710578448895e-06
83001.00000  84001.00000  1.613935598675e-06
84001.00000  85001.00000  1.720242733917e-06
85001.00000  86001.00000  1.797557014093e-06
86001.00000  87001.00000  1.700914163873e-06
87001.00000  88001.00000  1.613935598675e-06
88001.00000  89001.00000  1.681585593829e-06
89001.00000  90001.00000  1.391657043169e-06
90001.00000  91001.00000  1.439978468279e-06
91001.00000  92001.00000  1.449642753301e-06
92001.00000  93001.00000  1.729907018939e-06
93001.00000  94001.00000  1.478635608367e-06
94001.00000  95001.00000  1.439978468279e-06
95001.00000  96001.00000  1.372328473125e-06
96001.00000  97001.00000  1.295014192949e-06
97001.00000  98001.00000  1.188707057707e-06
98001.00000  99001.00000  1.256357052861e-06
99001.00000  100001.00000  1.285349907927e-06
100001.00000  101001.00000  1.430314183257e-06
101001.00000  102001.00000  9.374356471346e-07
102001.00000  103001.00000  1.217699912773e-06
103001.00000  104001.00000  1.150049917619e-06
104001.00000  105001.00000  1.082399922465e-06
105001.00000  106001.00000  1.043742782377e-06
106001.00000  107001.00000  9.470999321566e-07
107001.00000  108001.00000  8.987785070466e-07
108001.00000  109001.00000  1.014749927311e-06
109001.00000  110001.00000  8.601213669586e-07
110001.00000  111001.00000  9.470999321566e-07
111001.00000  112001.00000  8.891142220246e-07
112001.00000  113001.00000  8.214642268705e-07
113001.00000  114001.00000  8.601213669586e-07
114001.00000  115001.00000  7.828070867825e-07
115001.00000  116001.00000  7.828070867825e-07
116001.00000  117001.00000  8.601213669586e-07
117001.00000  118001.00000  6.475070964744e-07
118001.00000  119001.00000  8.891142220246e-07
119001.00000  120001.00000  6.088499563864e-07
120001.00000  121001.00000  8.601213669586e-07
121001.00000  122001.00000  9.470999321566e-07
122001.00000  123001.00000  7.924713718045e-07
123001.00000  124001.00000  7.731428017605e-07
124001.00000  125001.00000  7.248213766505e-07
125001.00000  126001.00000  7.248213766505e-07
126001.00000  127001.00000  7.924713718045e-07
127001.00000  128001.00000  8.214642268705e-07
128001.00000  129001.00000  6.475070964744e-07
129001.00000  130001.00000  5.122071061663e-07
130001.00000  131001.00000  6.475070964744e-07
131001.00000  132001.00000  5.315356762103e-07
132001.00000  133001.00000  7.248213766505e-07
133001.00000  134001.00000  6.378428114524e-07
134001.00000  135001.00000  5.798571013204e-07
135001.00000  136001.00000  6.185142414084e-07
136001.00000  137001.00000  6.185142414084e-07
137001.00000  138001.00000  4.252285409683e-07
138001.00000  139001.00000  5.605285312764e-07
139001.00000  140001.00000  5.315356762103e-07
140001.00000  141001.00000  5.122071061663e-07
141001.00000  142001.00000  4.542213960343e-07
142001.00000  143001.00000  5.508642462544e-07
143001.00000  144001.00000  3.865714008802e-07
144001.00000  145001.00000  5.315356762103e-07
145001.00000  146001.00000  4.542213960343e-07
146001.00000  147001.00000  4.058999709243e-07
147001.00000  148001.00000  4.445571110123e-07
148001.00000  149001.00000  5.218713911883e-07
149001.00000  150001.00000  6.088499563864e-07
150001.00000  151001.00000  3.865714008802e-07
151001.00000  152001.00000  4.445571110123e-07
152001.00000  153001.00000  4.445571110123e-07
153001.00000  154001.00000  3.865714008802e-07
154001.00000  155001.00000  4.735499660783e-07
155001.00000  156001.00000  3.769071158582e-07
156001.00000  157001.00000  4.058999709243e-07
157001.00000  158001.00000  4.058999709243e-07
158001.00000  159001.00000  3.285856907482e-07
159001.00000  160001.00000  4.252285409683e-07
160001.00000  161001.00000  3.382499757702e-07
161001.00000  162001.00000  3.285856907482e-07
162001.00000  163001.00000  2.802642656382e-07
163001.00000  164001.00000  2.802642656382e-07
164001.00000  165001.00000  3.189214057262e-07
165001.00000  166001.00000  3.092571207042e-07
166001.00000  167001.00000  2.802642656382e-07
167001.00000  168001.00000  3.962356859023e-07
168001.00000  169001.00000  2.705999806162e-07
169001.00000  170001.00000  3.769071158582e-07
170001.00000  171001.00000  3.769071158582e-07
171001.00000  172001.00000  2.416071255502e-07
172001.00000  173001.00000  3.189214057262e-07
173001.00000  174001.00000  1.836214154181e-07
174001.00000  175001.00000  2.705999806162e-07
175001.00000  176001.00000  3.189214057262e-07
176001.00000  177001.00000  4.058999709243e-07
177001.00000  178001.00000  3.672428308362e-07
178001.00000  179001.00000  1.642928453741e-07
179001.00000  180001.00000  2.802642656382e-07
180001.00000  181001.00000  2.995928356822e-07
181001.00000  182001.00000  2.512714105722e-07
182001.00000  183001.00000  2.319428405281e-07
183001.00000  184001.00000  2.899285506602e-07
184001.00000  185001.00000  2.802642656382e-07
185001.00000  186001.00000  2.512714105722e-07
186001.00000  187001.00000  2.029499854621e-07
187001.00000  188001.00000  2.995928356822e-07
188001.00000  189001.00000  2.222785555061e-07
189001.00000  190001.00000  1.546285603521e-07
190001.00000  191001.00000  2.319428405281e-07
191001.00000  192001.00000  1.352999903081e-07
192001.00000  193001.00000  2.222785555061e-07
193001.00000  194001.00000  1.642928453741e-07
194001.00000  195001.00000  1.932857004401e-07
195001.00000  196001.00000  1.642928453741e-07
196001.00000  197001.00000  1.449642753301e-07
197001.00000  198001.00000  1.836214154181e-07
198001.00000  199001.00000  7.731428017605e-08
