10001.00000  11001.00000  2.229627023459e-05
11001.00000  12001.00000  2.472404665725e-05
12001.00000  13001.00000  2.404569736268e-05
13001.00000  14001.00000  2.511677519621e-05
14001.00000  15001.00000  2.609859654361e-05
15001.00000  16001.00000  2.550950373517e-05
16001.00000  17001.00000  2.661628416315e-05
17001.00000  18001.00000  2.509892389898e-05
18001.00000  19001.00000  2.517032908788e-05
19001.00000  20001.00000  2.442057460441e-05
20001.00000  21001.00000  2.163577223724e-05
21001.00000  22001.00000  2.063609959262e-05
22001.00000  23001.00000  1.908303673401e-05
23001.00000  24001.00000  1.847609262834e-05
24001.00000  25001.00000  1.733360960591e-05
25001.00000  26001.00000  1.629823436684e-05
26001.00000  27001.00000  1.478087410267e-05
27001.00000  28001.00000  1.387045794417e-05
28001.00000  29001.00000  1.315640605516e-05
29001.00000  30001.00000  1.171045097989e-05
30001.00000  31001.00000  1.121061465758e-05
31001.00000  32001.00000  9.853916068448e-06
32001.00000  33001.00000  9.139864179430e-06
33001.00000  34001.00000  9.514741421165e-06
34001.00000  35001.00000  9.050607693303e-06
35001.00000  36001.00000  8.158042832030e-06
36001.00000  37001.00000  7.104816295729e-06
37001.00000  38001.00000  6.801344242896e-06
38001.00000  39001.00000  6.194400137231e-06
39001.00000  40001.00000  5.890928084398e-06
40001.00000  41001.00000  5.801671598271e-06
41001.00000  42001.00000  5.962333273300e-06
42001.00000  43001.00000  4.569932089715e-06
43001.00000  44001.00000  4.712742467519e-06
44001.00000  45001.00000  3.820177606246e-06
45001.00000  46001.00000  4.748445061970e-06
46001.00000  47001.00000  4.105798361853e-06
47001.00000  48001.00000  3.570259445090e-06
48001.00000  49001.00000  3.802326309021e-06
49001.00000  50001.00000  3.123977014454e-06
50001.00000  51001.00000  3.248936095032e-06
51001.00000  52001.00000  2.981166636650e-06
52001.00000  53001.00000  3.016869231101e-06
53001.00000  54001.00000  3.034720528326e-06
54001.00000  55001.00000  2.891910150523e-06
55001.00000  56001.00000  2.588438097690e-06
56001.00000  57001.00000  2.481330314337e-06
57001.00000  58001.00000  1.820832316996e-06
58001.00000  59001.00000  2.284966044858e-06
59001.00000  60001.00000  1.927940100349e-06
60001.00000  61001.00000  1.874386208672e-06
61001.00000  62001.00000  1.981493992025e-06
62001.00000  63001.00000  1.927940100349e-06
63001.00000  64001.00000  1.553062858614e-06
64001.00000  65001.00000  1.713724533643e-06
65001.00000  66001.00000  1.356698589134e-06
66001.00000  67001.00000  1.731575830869e-06
67001.00000  68001.00000  1.320995994683e-06
68001.00000  69001.00000  1.267442103007e-06
69001.00000  70001.00000  1.481657669712e-06
70001.00000  71001.00000  9.282674557234e-07
71001.00000  72001.00000  1.267442103007e-06
72001.00000  73001.00000  9.818213473997e-07
73001.00000  74001.00000  1.196036914105e-06
74001.00000  75001.00000  1.106780427978e-06
75001.00000  76001.00000  1.053226536302e-06
76001.00000  77001.00000  8.033083751452e-07
77001.00000  78001.00000  6.783492945671e-07
78001.00000  79001.00000  9.104161584979e-07
79001.00000  80001.00000  9.639700501743e-07
80001.00000  81001.00000  5.890928084398e-07
81001.00000  82001.00000  7.676057806943e-07
82001.00000  83001.00000  6.783492945671e-07
83001.00000  84001.00000  8.925648612725e-07
84001.00000  85001.00000  6.426467001162e-07
85001.00000  86001.00000  6.426467001162e-07
86001.00000  87001.00000  8.747135640470e-07
87001.00000  88001.00000  5.890928084398e-07
88001.00000  89001.00000  4.998363223126e-07
89001.00000  90001.00000  7.854570779198e-07
90001.00000  91001.00000  6.604979973416e-07
91001.00000  92001.00000  3.748772417344e-07
92001.00000  93001.00000  4.284311334108e-07
93001.00000  94001.00000  4.462824306362e-07
94001.00000  95001.00000  3.570259445090e-07
95001.00000  96001.00000  5.712415112144e-07
96001.00000  97001.00000  3.213233500581e-07
97001.00000  98001.00000  5.355389167635e-07
98001.00000  99001.00000  3.034720528326e-07
99001.00000  100001.00000  3.213233500581e-07
100001.00000  101001.00000  4.105798361853e-07
101001.00000  102001.00000  3.748772417344e-07
102001.00000  103001.00000  4.105798361853e-07
103001.00000  104001.00000  3.748772417344e-07
104001.00000  105001.00000  3.570259445090e-07
105001.00000  106001.00000  2.677694583817e-07
106001.00000  107001.00000  3.391746472835e-07
107001.00000  108001.00000  3.391746472835e-07
108001.00000  109001.00000  4.105798361853e-07
109001.00000  110001.00000  3.213233500581e-07
110001.00000  111001.00000  2.856207556072e-07
111001.00000  112001.00000  2.142155667054e-07
112001.00000  113001.00000  2.499181611563e-07
113001.00000  114001.00000  1.963642694799e-07
114001.00000  115001.00000  2.856207556072e-07
115001.00000  116001.00000  2.499181611563e-07
116001.00000  117001.00000  1.249590805781e-07
117001.00000  118001.00000  1.428103778036e-07
118001.00000  119001.00000  2.142155667054e-07
119001.00000  120001.00000  1.785129722545e-07
120001.00000  121001.00000  2.142155667054e-07
121001.00000  122001.00000  2.856207556072e-07
122001.00000  123001.00000  1.606616750290e-07
123001.00000  124001.00000  1.606616750290e-07
124001.00000  125001.00000  2.499181611563e-07
125001.00000  126001.00000  2.320668639308e-07
126001.00000  127001.00000  2.142155667054e-07
127001.00000  128001.00000  3.034720528326e-07
128001.00000  129001.00000  8.925648612725e-08
129001.00000  130001.00000  8.925648612725e-08
130001.00000  131001.00000  1.606616750290e-07
131001.00000  132001.00000  3.570259445090e-08
132001.00000  133001.00000  1.428103778036e-07
133001.00000  134001.00000  8.925648612725e-08
134001.00000  135001.00000  1.606616750290e-07
135001.00000  136001.00000  1.606616750290e-07
136001.00000  137001.00000  7.140518890180e-08
137001.00000  138001.00000  8.925648612725e-08
138001.00000  139001.00000  1.249590805781e-07
139001.00000  140001.00000  7.140518890180e-08
140001.00000  141001.00000  1.963642694799e-07
141001.00000  142001.00000  1.249590805781e-07
142001.00000  143001.00000  8.925648612725e-08
143001.00000  144001.00000  8.925648612725e-08
144001.00000  145001.00000  7.140518890180e-08
145001.00000  146001.00000  1.606616750290e-07
146001.00000  147001.00000  1.428103778036e-07
147001.00000  148001.00000  8.925648612725e-08
148001.00000  149001.00000  5.355389167635e-08
149001.00000  150001.00000  3.570259445090e-08
150001.00000  151001.00000  5.355389167635e-08
151001.00000  152001.00000  1.785129722545e-08
152001.00000  153001.00000  7.140518890180e-08
153001.00000  154001.00000  3.570259445090e-08
154001.00000  155001.00000  7.140518890180e-08
155001.00000  156001.00000  5.355389167635e-08
156001.00000  157001.00000  7.140518890180e-08
157001.00000  158001.00000  0.000000000000e+00
158001.00000  159001.00000  5.355389167635e-08
159001.00000  160001.00000  1.785129722545e-08
160001.00000  161001.00000  0.000000000000e+00
161001.00000  162001.00000  0.000000000000e+00
162001.00000  163001.00000  3.570259445090e-08
163001.00000  164001.00000  7.140518890180e-08
164001.00000  165001.00000  7.140518890180e-08
165001.00000  166001.00000  3.570259445090e-08
166001.00000  167001.00000  0.000000000000e+00
167001.00000  168001.00000  3.570259445090e-08
168001.00000  169001.00000  1.785129722545e-08
169001.00000  170001.00000  1.785129722545e-08
170001.00000  171001.00000  1.785129722545e-08
171001.00000  172001.00000  0.000000000000e+00
172001.00000  173001.00000  8.925648612725e-08
173001.00000  174001.00000  3.570259445090e-08
174001.00000  175001.00000  1.785129722545e-08
175001.00000  176001.00000  1.785129722545e-08
176001.00000  177001.00000  0.000000000000e+00
177001.00000  178001.00000  0.000000000000e+00
178001.00000  179001.00000  1.785129722545e-08
179001.00000  180001.00000  0.000000000000e+00
180001.00000  181001.00000  0.000000000000e+00
181001.00000  182001.00000  1.785129722545e-08
182001.00000  183001.00000  0.000000000000e+00
183001.00000  184001.00000  0.000000000000e+00
184001.00000  185001.00000  0.000000000000e+00
185001.00000  186001.00000  0.000000000000e+00
186001.00000  187001.00000  0.000000000000e+00
187001.00000  188001.00000  0.000000000000e+00
188001.00000  189001.00000  0.000000000000e+00
189001.00000  190001.00000  0.000000000000e+00
190001.00000  191001.00000  0.000000000000e+00
191001.00000  192001.00000  0.000000000000e+00
192001.00000  193001.00000  0.000000000000e+00
193001.00000  194001.00000  0.000000000000e+00
194001.00000  195001.00000  0.000000000000e+00
195001.00000  196001.00000  0.000000000000e+00
196001.00000  197001.00000  0.000000000000e+00
197001.00000  198001.00000  0.000000000000e+00
198001.00000  199001.00000  0.000000000000e+00
