10001.00000  11001.00000  3.999885321087e-04
11001.00000  12001.00000  3.310726192712e-04
12001.00000  13001.00000  2.779058400807e-04
13001.00000  14001.00000  2.392863813772e-04
14001.00000  15001.00000  2.042006121138e-04
15001.00000  16001.00000  1.785140980109e-04
16001.00000  17001.00000  1.557693355232e-04
17001.00000  18001.00000  1.387107636574e-04
18001.00000  19001.00000  1.220288794984e-04
19001.00000  20001.00000  1.092394349765e-04
20001.00000  21001.00000  9.926617950084e-05
21001.00000  22001.00000  9.079967485242e-05
22001.00000  23001.00000  8.105960700475e-05
23001.00000  24001.00000  7.417160322298e-05
24001.00000  25001.00000  6.792934979575e-05
25001.00000  26001.00000  6.256603435109e-05
26001.00000  27001.00000  5.738209400492e-05
27001.00000  28001.00000  5.119365310723e-05
28001.00000  29001.00000  4.943577714209e-05
29001.00000  30001.00000  4.455677446334e-05
30001.00000  31001.00000  4.181233545654e-05
31001.00000  32001.00000  3.804545838838e-05
32001.00000  33001.00000  3.600058226567e-05
33001.00000  34001.00000  3.400951867250e-05
34001.00000  35001.00000  3.194670503994e-05
35001.00000  36001.00000  3.060139180131e-05
36001.00000  37001.00000  2.792870283390e-05
37001.00000  38001.00000  2.654751457558e-05
38001.00000  39001.00000  2.464613853165e-05
39001.00000  40001.00000  2.425151331499e-05
40001.00000  41001.00000  2.252951236954e-05
41001.00000  42001.00000  2.127388668016e-05
42001.00000  43001.00000  1.933663561654e-05
43001.00000  44001.00000  1.878057281124e-05
44001.00000  45001.00000  1.802719739761e-05
45001.00000  46001.00000  1.635900898171e-05
46001.00000  47001.00000  1.603613380444e-05
47001.00000  48001.00000  1.594644625520e-05
48001.00000  49001.00000  1.585675870595e-05
49001.00000  50001.00000  1.329169479764e-05
50001.00000  51001.00000  1.239481930522e-05
51001.00000  52001.00000  1.348900740597e-05
52001.00000  53001.00000  1.137238124386e-05
53001.00000  54001.00000  1.124681867492e-05
54001.00000  55001.00000  1.104950606659e-05
55001.00000  56001.00000  1.013469306433e-05
56001.00000  57001.00000  9.901505436297e-06
57001.00000  58001.00000  1.024231812342e-05
58001.00000  59001.00000  9.919442946145e-06
59001.00000  60001.00000  9.399255160543e-06
60001.00000  61001.00000  8.430629628731e-06
61001.00000  62001.00000  8.484442158276e-06
62001.00000  63001.00000  7.910441843128e-06
63001.00000  64001.00000  7.462004096919e-06
64001.00000  65001.00000  7.533754136313e-06
65001.00000  66001.00000  7.408191567374e-06
66001.00000  67001.00000  6.493378565108e-06
67001.00000  68001.00000  7.031503860559e-06
68001.00000  69001.00000  6.296065956776e-06
69001.00000  70001.00000  6.116690858292e-06
70001.00000  71001.00000  5.291565405267e-06
71001.00000  72001.00000  5.058377777239e-06
72001.00000  73001.00000  5.560628052993e-06
73001.00000  74001.00000  5.004565247693e-06
74001.00000  75001.00000  4.843127659058e-06
75001.00000  76001.00000  5.130127816632e-06
76001.00000  77001.00000  4.627877540878e-06
77001.00000  78001.00000  4.358814893152e-06
78001.00000  79001.00000  3.820689597701e-06
79001.00000  80001.00000  4.000064696185e-06
80001.00000  81001.00000  4.340877383304e-06
81001.00000  82001.00000  4.179439794669e-06
82001.00000  83001.00000  4.125627265124e-06
83001.00000  84001.00000  4.125627265124e-06
84001.00000  85001.00000  3.892439637095e-06
85001.00000  86001.00000  3.605439479521e-06
86001.00000  87001.00000  3.838627107550e-06
87001.00000  88001.00000  3.264626792402e-06
88001.00000  89001.00000  3.121126713615e-06
89001.00000  90001.00000  3.282564302251e-06
90001.00000  91001.00000  2.834126556041e-06
91001.00000  92001.00000  3.300501812099e-06
92001.00000  93001.00000  2.941751615132e-06
93001.00000  94001.00000  3.157001733312e-06
94001.00000  95001.00000  2.726501496951e-06
95001.00000  96001.00000  2.690626477255e-06
96001.00000  97001.00000  2.600938928013e-06
97001.00000  98001.00000  2.529188888619e-06
98001.00000  99001.00000  2.403626319681e-06
99001.00000  100001.00000  2.493313868923e-06
100001.00000  101001.00000  2.403626319681e-06
101001.00000  102001.00000  2.224251221197e-06
102001.00000  103001.00000  1.847563514381e-06
103001.00000  104001.00000  1.937251063623e-06
104001.00000  105001.00000  2.349813790136e-06
105001.00000  106001.00000  1.901376043927e-06
106001.00000  107001.00000  1.811688494685e-06
107001.00000  108001.00000  1.668188415898e-06
108001.00000  109001.00000  2.009001103017e-06
109001.00000  110001.00000  1.775813474988e-06
110001.00000  111001.00000  1.955188573472e-06
111001.00000  112001.00000  1.560563356808e-06
112001.00000  113001.00000  1.668188415898e-06
113001.00000  114001.00000  1.524688337111e-06
114001.00000  115001.00000  1.399125768172e-06
115001.00000  116001.00000  1.435000787869e-06
116001.00000  117001.00000  1.381188258324e-06
117001.00000  118001.00000  1.650250906049e-06
118001.00000  119001.00000  1.614375886353e-06
119001.00000  120001.00000  1.363250748476e-06
120001.00000  121001.00000  1.237688179537e-06
121001.00000  122001.00000  1.219750669689e-06
122001.00000  123001.00000  1.452938297717e-06
123001.00000  124001.00000  1.165938140144e-06
124001.00000  125001.00000  1.183875649992e-06
125001.00000  126001.00000  1.435000787869e-06
126001.00000  127001.00000  1.219750669689e-06
127001.00000  128001.00000  1.381188258324e-06
128001.00000  129001.00000  1.112125610599e-06
129001.00000  130001.00000  1.345313238627e-06
130001.00000  131001.00000  1.004500551508e-06
131001.00000  132001.00000  1.076250590902e-06
132001.00000  133001.00000  1.022438061357e-06
133001.00000  134001.00000  1.112125610599e-06
134001.00000  135001.00000  1.148000630295e-06
135001.00000  136001.00000  9.686255318116e-07
136001.00000  137001.00000  8.789379825698e-07
137001.00000  138001.00000  8.071879431764e-07
138001.00000  139001.00000  9.686255318116e-07
139001.00000  140001.00000  1.094188100750e-06
140001.00000  141001.00000  7.713129234796e-07
141001.00000  142001.00000  6.098753348444e-07
142001.00000  143001.00000  1.076250590902e-06
143001.00000  144001.00000  6.636878643895e-07
144001.00000  145001.00000  8.610004727215e-07
145001.00000  146001.00000  6.995628840862e-07
146001.00000  147001.00000  8.789379825698e-07
147001.00000  148001.00000  8.789379825698e-07
148001.00000  149001.00000  6.636878643895e-07
149001.00000  150001.00000  7.533754136313e-07
150001.00000  151001.00000  8.071879431764e-07
151001.00000  152001.00000  9.506880219633e-07
152001.00000  153001.00000  6.636878643895e-07
153001.00000  154001.00000  8.430629628731e-07
154001.00000  155001.00000  6.098753348444e-07
155001.00000  156001.00000  4.843127659058e-07
156001.00000  157001.00000  6.457503545411e-07
157001.00000  158001.00000  6.816253742378e-07
158001.00000  159001.00000  6.457503545411e-07
159001.00000  160001.00000  5.022502757542e-07
160001.00000  161001.00000  6.816253742378e-07
161001.00000  162001.00000  4.843127659058e-07
162001.00000  163001.00000  5.560628052993e-07
163001.00000  164001.00000  6.816253742378e-07
164001.00000  165001.00000  6.098753348444e-07
165001.00000  166001.00000  5.560628052993e-07
166001.00000  167001.00000  5.919378249960e-07
167001.00000  168001.00000  5.560628052993e-07
168001.00000  169001.00000  5.201877856025e-07
169001.00000  170001.00000  5.022502757542e-07
170001.00000  171001.00000  3.946252166640e-07
171001.00000  172001.00000  4.305002363607e-07
172001.00000  173001.00000  5.201877856025e-07
173001.00000  174001.00000  4.843127659058e-07
174001.00000  175001.00000  3.766877068156e-07
175001.00000  176001.00000  3.766877068156e-07
176001.00000  177001.00000  6.816253742378e-07
177001.00000  178001.00000  4.125627265124e-07
178001.00000  179001.00000  3.766877068156e-07
179001.00000  180001.00000  5.201877856025e-07
180001.00000  181001.00000  4.663752560575e-07
181001.00000  182001.00000  3.049376674222e-07
182001.00000  183001.00000  3.587501969673e-07
183001.00000  184001.00000  3.228751772705e-07
184001.00000  185001.00000  4.305002363607e-07
185001.00000  186001.00000  2.331876280287e-07
186001.00000  187001.00000  3.049376674222e-07
187001.00000  188001.00000  3.228751772705e-07
188001.00000  189001.00000  3.408126871189e-07
189001.00000  190001.00000  3.228751772705e-07
190001.00000  191001.00000  3.408126871189e-07
191001.00000  192001.00000  1.793750984836e-07
192001.00000  193001.00000  3.587501969673e-07
193001.00000  194001.00000  2.331876280287e-07
194001.00000  195001.00000  2.690626477255e-07
195001.00000  196001.00000  4.484377462091e-07
196001.00000  197001.00000  4.125627265124e-07
197001.00000  198001.00000  3.408126871189e-07
198001.00000  199001.00000  2.331876280287e-07
