10001.00000  11001.00000  7.415405897385e-04
11001.00000  12001.00000  6.409837040846e-04
12001.00000  13001.00000  5.608571169671e-04
13001.00000  14001.00000  4.940189217549e-04
14001.00000  15001.00000  4.383333114581e-04
15001.00000  16001.00000  3.975403643802e-04
16001.00000  17001.00000  3.510068319993e-04
17001.00000  18001.00000  3.218786769429e-04
18001.00000  19001.00000  2.971767644267e-04
19001.00000  20001.00000  2.695948949739e-04
20001.00000  21001.00000  2.484011179206e-04
21001.00000  22001.00000  2.295557621277e-04
22001.00000  23001.00000  2.102175277987e-04
23001.00000  24001.00000  1.946000432031e-04
24001.00000  25001.00000  1.809927298921e-04
25001.00000  26001.00000  1.699077949719e-04
26001.00000  27001.00000  1.546285603521e-04
27001.00000  28001.00000  1.458147324120e-04
28001.00000  29001.00000  1.381799472446e-04
29001.00000  30001.00000  1.297236978504e-04
30001.00000  31001.00000  1.229973554751e-04
31001.00000  32001.00000  1.165416130804e-04
32001.00000  33001.00000  1.083656279518e-04
33001.00000  34001.00000  1.021998141077e-04
34001.00000  35001.00000  9.805383583328e-05
35001.00000  36001.00000  9.226492910509e-05
36001.00000  37001.00000  8.815760797074e-05
37001.00000  38001.00000  8.422424396678e-05
38001.00000  39001.00000  7.946941573596e-05
39001.00000  40001.00000  7.649281594918e-05
40001.00000  41001.00000  7.324561618179e-05
41001.00000  42001.00000  6.849078795096e-05
42001.00000  43001.00000  6.606505241043e-05
43001.00000  44001.00000  6.285650978313e-05
44001.00000  45001.00000  5.981226000120e-05
45001.00000  46001.00000  5.738652446067e-05
46001.00000  47001.00000  5.551165316640e-05
47001.00000  48001.00000  5.282498193029e-05
48001.00000  49001.00000  5.168459629769e-05
49001.00000  50001.00000  4.843739653030e-05
50001.00000  51001.00000  4.603098955982e-05
51001.00000  52001.00000  4.458134680651e-05
52001.00000  53001.00000  4.272580408229e-05
53001.00000  54001.00000  4.262916123207e-05
54001.00000  55001.00000  4.074462565278e-05
55001.00000  56001.00000  3.918867576424e-05
56001.00000  57001.00000  3.733313304001e-05
57001.00000  58001.00000  3.607677598715e-05
58001.00000  59001.00000  3.360271902152e-05
59001.00000  60001.00000  3.464646180389e-05
60001.00000  61001.00000  3.222072626337e-05
61001.00000  62001.00000  3.070343351491e-05
62001.00000  63001.00000  3.105134777571e-05
63001.00000  64001.00000  2.971767644267e-05
64001.00000  65001.00000  2.944707646205e-05
65001.00000  66001.00000  2.769784087307e-05
66001.00000  67001.00000  2.565867673343e-05
67001.00000  68001.00000  2.655745524047e-05
68001.00000  69001.00000  2.503049820700e-05
69001.00000  70001.00000  2.491452678673e-05
70001.00000  71001.00000  2.410272684488e-05
71001.00000  72001.00000  2.379346972418e-05
72001.00000  73001.00000  2.249845553123e-05
73001.00000  74001.00000  2.255644124136e-05
74001.00000  75001.00000  2.117444848322e-05
75001.00000  76001.00000  2.077821279731e-05
76001.00000  77001.00000  1.900964863829e-05
77001.00000  78001.00000  1.908696291846e-05
78001.00000  79001.00000  1.781127729556e-05
79001.00000  80001.00000  1.772429873036e-05
80001.00000  81001.00000  1.829449154666e-05
81001.00000  82001.00000  1.844912010701e-05
82001.00000  83001.00000  1.672887737309e-05
83001.00000  84001.00000  1.599439171142e-05
84001.00000  85001.00000  1.587842029116e-05
85001.00000  86001.00000  1.570446316076e-05
86001.00000  87001.00000  1.457374181319e-05
87001.00000  88001.00000  1.417750612728e-05
88001.00000  89001.00000  1.437079182772e-05
89001.00000  90001.00000  1.424515612244e-05
90001.00000  91001.00000  1.424515612244e-05
91001.00000  92001.00000  1.317242048499e-05
92001.00000  93001.00000  1.267954194887e-05
93001.00000  94001.00000  1.220599198279e-05
94001.00000  95001.00000  1.223498483786e-05
95001.00000  96001.00000  1.194505628720e-05
96001.00000  97001.00000  1.173244201672e-05
97001.00000  98001.00000  1.148117060614e-05
98001.00000  99001.00000  1.125889205064e-05
99001.00000  100001.00000  1.102694921011e-05
100001.00000  101001.00000  1.093997064491e-05
101001.00000  102001.00000  1.083366350967e-05
102001.00000  103001.00000  1.028279926341e-05
103001.00000  104001.00000  9.741599302182e-06
104001.00000  105001.00000  9.615963596896e-06
105001.00000  106001.00000  9.432342181478e-06
106001.00000  107001.00000  9.335699331258e-06
107001.00000  108001.00000  9.258385051082e-06
108001.00000  109001.00000  9.026442210554e-06
109001.00000  110001.00000  8.562556529498e-06
110001.00000  111001.00000  8.340277973991e-06
111001.00000  112001.00000  8.543227959454e-06
112001.00000  113001.00000  8.639870809674e-06
113001.00000  114001.00000  8.436920824211e-06
114001.00000  115001.00000  8.204977983683e-06
115001.00000  116001.00000  7.557470887209e-06
116001.00000  117001.00000  7.199892341395e-06
117001.00000  118001.00000  7.354520901747e-06
118001.00000  119001.00000  7.538142317165e-06
119001.00000  120001.00000  6.678020950206e-06
120001.00000  121001.00000  7.064592351087e-06
121001.00000  122001.00000  6.726342375316e-06
122001.00000  123001.00000  6.204470984128e-06
123001.00000  124001.00000  5.837228153292e-06
124001.00000  125001.00000  6.359099544480e-06
125001.00000  126001.00000  6.165813844040e-06
126001.00000  127001.00000  5.817899583248e-06
127001.00000  128001.00000  5.721256733028e-06
128001.00000  129001.00000  5.730921018050e-06
129001.00000  130001.00000  5.953199573556e-06
130001.00000  131001.00000  5.605285312764e-06
131001.00000  132001.00000  5.093078206597e-06
132001.00000  133001.00000  5.286363907037e-06
133001.00000  134001.00000  5.296028192059e-06
134001.00000  135001.00000  5.218713911883e-06
135001.00000  136001.00000  5.344349617169e-06
136001.00000  137001.00000  5.015763926421e-06
137001.00000  138001.00000  4.851471081047e-06
138001.00000  139001.00000  4.658185380607e-06
139001.00000  140001.00000  4.803149655937e-06
140001.00000  141001.00000  4.522885390299e-06
141001.00000  142001.00000  4.600199670475e-06
142001.00000  143001.00000  4.300606834793e-06
143001.00000  144001.00000  4.020342569155e-06
144001.00000  145001.00000  4.232956839639e-06
145001.00000  146001.00000  4.203963984573e-06
146001.00000  147001.00000  4.319935404837e-06
147001.00000  148001.00000  4.165306844485e-06
148001.00000  149001.00000  3.933364003957e-06
149001.00000  150001.00000  4.001013999111e-06
150001.00000  151001.00000  3.430821182812e-06
151001.00000  152001.00000  3.662764023340e-06
152001.00000  153001.00000  3.827056868714e-06
153001.00000  154001.00000  3.537128318054e-06
154001.00000  155001.00000  3.450149752856e-06
155001.00000  156001.00000  3.305185477526e-06
156001.00000  157001.00000  3.769071158582e-06
157001.00000  158001.00000  3.546792603076e-06
158001.00000  159001.00000  3.421156897790e-06
159001.00000  160001.00000  2.957271216734e-06
160001.00000  161001.00000  3.285856907482e-06
161001.00000  162001.00000  2.889621221580e-06
162001.00000  163001.00000  2.908949791624e-06
163001.00000  164001.00000  2.879956936558e-06
164001.00000  165001.00000  2.619021240964e-06
165001.00000  166001.00000  2.870292651536e-06
166001.00000  167001.00000  2.928278361668e-06
167001.00000  168001.00000  2.754321231272e-06
168001.00000  169001.00000  2.899285506602e-06
169001.00000  170001.00000  2.580364100876e-06
170001.00000  171001.00000  2.976599786778e-06
171001.00000  172001.00000  2.705999806162e-06
172001.00000  173001.00000  2.677006951096e-06
173001.00000  174001.00000  2.319428405281e-06
174001.00000  175001.00000  2.696335521140e-06
175001.00000  176001.00000  2.570699815854e-06
176001.00000  177001.00000  2.541706960788e-06
177001.00000  178001.00000  2.280771265193e-06
178001.00000  179001.00000  2.203456985017e-06
179001.00000  180001.00000  2.203456985017e-06
180001.00000  181001.00000  2.464392680612e-06
181001.00000  182001.00000  2.213121270039e-06
182001.00000  183001.00000  1.874871294269e-06
183001.00000  184001.00000  1.855542724225e-06
184001.00000  185001.00000  1.942521289423e-06
185001.00000  186001.00000  1.990842714533e-06
186001.00000  187001.00000  2.058492709687e-06
187001.00000  188001.00000  2.145471274885e-06
188001.00000  189001.00000  2.068156994709e-06
189001.00000  190001.00000  1.874871294269e-06
190001.00000  191001.00000  1.787892729071e-06
191001.00000  192001.00000  1.720242733917e-06
192001.00000  193001.00000  1.932857004401e-06
193001.00000  194001.00000  1.797557014093e-06
194001.00000  195001.00000  1.874871294269e-06
195001.00000  196001.00000  1.826549869159e-06
196001.00000  197001.00000  1.884535579291e-06
197001.00000  198001.00000  1.652592738763e-06
198001.00000  199001.00000  1.729907018939e-06
