10001.00000  11001.00000  4.827992637843e-05
11001.00000  12001.00000  4.974060938447e-05
12001.00000  13001.00000  5.285544334437e-05
13001.00000  14001.00000  5.306825808697e-05
14001.00000  15001.00000  5.500293756517e-05
15001.00000  16001.00000  5.548660743472e-05
16001.00000  17001.00000  5.649264076338e-05
17001.00000  18001.00000  5.481914301474e-05
18001.00000  19001.00000  5.587354333036e-05
19001.00000  20001.00000  5.568974877993e-05
20001.00000  21001.00000  5.360029494348e-05
21001.00000  22001.00000  5.028231963837e-05
22001.00000  23001.00000  4.936334688622e-05
23001.00000  24001.00000  4.736095362629e-05
24001.00000  25001.00000  4.477815652289e-05
25001.00000  26001.00000  4.212764563776e-05
26001.00000  27001.00000  4.061859564477e-05
27001.00000  28001.00000  3.828730687354e-05
28001.00000  29001.00000  3.555940880928e-05
29001.00000  30001.00000  3.342158798587e-05
30001.00000  31001.00000  3.072271011379e-05
31001.00000  32001.00000  3.025838703902e-05
32001.00000  33001.00000  2.769493673041e-05
33001.00000  34001.00000  2.762722294867e-05
34001.00000  35001.00000  2.529593417744e-05
35001.00000  36001.00000  2.375786399227e-05
36001.00000  37001.00000  2.347733546793e-05
37001.00000  38001.00000  2.181351111668e-05
38001.00000  39001.00000  1.982079125414e-05
39001.00000  40001.00000  1.890181850200e-05
40001.00000  41001.00000  1.748950248291e-05
41001.00000  42001.00000  1.756688966204e-05
42001.00000  43001.00000  1.617392043774e-05
43001.00000  44001.00000  1.597077909253e-05
44001.00000  45001.00000  1.440368871518e-05
45001.00000  46001.00000  1.467454384213e-05
46001.00000  47001.00000  1.316549384914e-05
47001.00000  48001.00000  1.234325507090e-05
48001.00000  49001.00000  1.247868263438e-05
49001.00000  50001.00000  1.151134289528e-05
50001.00000  51001.00000  1.163709706136e-05
51001.00000  52001.00000  1.063106373270e-05
52001.00000  53001.00000  1.047628937444e-05
53001.00000  54001.00000  9.789478159682e-06
54001.00000  55001.00000  9.596010211863e-06
55001.00000  56001.00000  8.928545791884e-06
56001.00000  57001.00000  9.034953163185e-06
57001.00000  58001.00000  8.251407974515e-06
58001.00000  59001.00000  7.390475606717e-06
59001.00000  60001.00000  8.502916306681e-06
60001.00000  61001.00000  7.255048043243e-06
61001.00000  62001.00000  7.390475606717e-06
62001.00000  63001.00000  7.080926890205e-06
63001.00000  64001.00000  6.345748688490e-06
64001.00000  65001.00000  6.307055098926e-06
65001.00000  66001.00000  6.355422085881e-06
66001.00000  67001.00000  5.978159587632e-06
67001.00000  68001.00000  5.407429141564e-06
68001.00000  69001.00000  5.668610871120e-06
69001.00000  70001.00000  4.778658311149e-06
70001.00000  71001.00000  4.894739079841e-06
71001.00000  72001.00000  4.778658311149e-06
72001.00000  73001.00000  4.904412477232e-06
73001.00000  74001.00000  4.285315044209e-06
74001.00000  75001.00000  4.507803184202e-06
75001.00000  76001.00000  4.169234275517e-06
76001.00000  77001.00000  4.236948057254e-06
77001.00000  78001.00000  3.695237803358e-06
78001.00000  79001.00000  3.453402868584e-06
79001.00000  80001.00000  3.453402868584e-06
80001.00000  81001.00000  3.134180754681e-06
81001.00000  82001.00000  3.376015689456e-06
82001.00000  83001.00000  3.037446780771e-06
83001.00000  84001.00000  2.863325627733e-06
84001.00000  85001.00000  2.950386204252e-06
85001.00000  86001.00000  3.192221139027e-06
86001.00000  87001.00000  2.834305435560e-06
87001.00000  88001.00000  2.640837487740e-06
88001.00000  89001.00000  2.476389732094e-06
89001.00000  90001.00000  2.321615373838e-06
90001.00000  91001.00000  2.457042937312e-06
91001.00000  92001.00000  2.186187810364e-06
92001.00000  93001.00000  2.215208002537e-06
93001.00000  94001.00000  2.273248386883e-06
94001.00000  95001.00000  2.437696142530e-06
95001.00000  96001.00000  1.915332683416e-06
96001.00000  97001.00000  1.963699670371e-06
97001.00000  98001.00000  2.253901592101e-06
98001.00000  99001.00000  1.731538132987e-06
99001.00000  100001.00000  1.557416979949e-06
100001.00000  101001.00000  1.818598709506e-06
101001.00000  102001.00000  1.702517940814e-06
102001.00000  103001.00000  1.857292299070e-06
103001.00000  104001.00000  1.654150953859e-06
104001.00000  105001.00000  1.451009608649e-06
105001.00000  106001.00000  1.557416979949e-06
106001.00000  107001.00000  1.586437172122e-06
107001.00000  108001.00000  1.625130761686e-06
108001.00000  109001.00000  1.441336211258e-06
109001.00000  110001.00000  1.325255442566e-06
110001.00000  111001.00000  1.209174673874e-06
111001.00000  112001.00000  1.392969224303e-06
112001.00000  113001.00000  1.170481084310e-06
113001.00000  114001.00000  1.199501276483e-06
114001.00000  115001.00000  1.189827879092e-06
115001.00000  116001.00000  1.334928839957e-06
116001.00000  117001.00000  1.247868263438e-06
117001.00000  118001.00000  1.170481084310e-06
118001.00000  119001.00000  1.131787494746e-06
119001.00000  120001.00000  1.209174673874e-06
120001.00000  121001.00000  8.802791625801e-07
121001.00000  122001.00000  9.576663417081e-07
122001.00000  123001.00000  8.609323677982e-07
123001.00000  124001.00000  1.083420507791e-06
124001.00000  125001.00000  1.054400315618e-06
125001.00000  126001.00000  8.222387782342e-07
126001.00000  127001.00000  9.576663417081e-07
127001.00000  128001.00000  7.738717912792e-07
128001.00000  129001.00000  8.899525599711e-07
129001.00000  130001.00000  8.899525599711e-07
130001.00000  131001.00000  8.706057651891e-07
131001.00000  132001.00000  8.996259573621e-07
132001.00000  133001.00000  8.899525599711e-07
133001.00000  134001.00000  8.125653808432e-07
134001.00000  135001.00000  8.512589704072e-07
135001.00000  136001.00000  7.641983938882e-07
136001.00000  137001.00000  7.255048043243e-07
137001.00000  138001.00000  7.641983938882e-07
138001.00000  139001.00000  6.577910225874e-07
139001.00000  140001.00000  6.190974330234e-07
140001.00000  141001.00000  5.320368565045e-07
141001.00000  142001.00000  6.674644199783e-07
142001.00000  143001.00000  4.159560878126e-07
143001.00000  144001.00000  4.643230747675e-07
144001.00000  145001.00000  5.610570486774e-07
145001.00000  146001.00000  5.707304460684e-07
146001.00000  147001.00000  4.836698695495e-07
147001.00000  148001.00000  5.320368565045e-07
148001.00000  149001.00000  4.062826904216e-07
149001.00000  150001.00000  3.966092930306e-07
150001.00000  151001.00000  3.675891008576e-07
151001.00000  152001.00000  3.385689086847e-07
152001.00000  153001.00000  3.288955112937e-07
153001.00000  154001.00000  4.159560878126e-07
154001.00000  155001.00000  3.482423060757e-07
155001.00000  156001.00000  4.062826904216e-07
156001.00000  157001.00000  2.902019217297e-07
157001.00000  158001.00000  3.095487165117e-07
158001.00000  159001.00000  3.385689086847e-07
159001.00000  160001.00000  1.934679478198e-07
160001.00000  161001.00000  2.418349347748e-07
161001.00000  162001.00000  3.095487165117e-07
162001.00000  163001.00000  2.321615373838e-07
163001.00000  164001.00000  2.418349347748e-07
164001.00000  165001.00000  2.128147426018e-07
165001.00000  166001.00000  2.998753191207e-07
166001.00000  167001.00000  1.934679478198e-07
167001.00000  168001.00000  1.451009608649e-07
168001.00000  169001.00000  1.547743582558e-07
169001.00000  170001.00000  1.644477556468e-07
170001.00000  171001.00000  1.257541660829e-07
171001.00000  172001.00000  1.354275634739e-07
172001.00000  173001.00000  1.354275634739e-07
173001.00000  174001.00000  1.354275634739e-07
174001.00000  175001.00000  8.706057651891e-08
175001.00000  176001.00000  8.706057651891e-08
176001.00000  177001.00000  9.673397390990e-08
177001.00000  178001.00000  7.738717912792e-08
178001.00000  179001.00000  7.738717912792e-08
179001.00000  180001.00000  6.771378173693e-08
180001.00000  181001.00000  7.738717912792e-08
181001.00000  182001.00000  7.738717912792e-08
182001.00000  183001.00000  6.771378173693e-08
183001.00000  184001.00000  5.804038434594e-08
184001.00000  185001.00000  3.869358956396e-08
185001.00000  186001.00000  9.673397390990e-09
186001.00000  187001.00000  9.673397390990e-09
187001.00000  188001.00000  1.934679478198e-08
188001.00000  189001.00000  0.000000000000e+00
189001.00000  190001.00000  9.673397390990e-09
190001.00000  191001.00000  0.000000000000e+00
191001.00000  192001.00000  0.000000000000e+00
192001.00000  193001.00000  0.000000000000e+00
193001.00000  194001.00000  0.000000000000e+00
194001.00000  195001.00000  0.000000000000e+00
195001.00000  196001.00000  0.000000000000e+00
196001.00000  197001.00000  0.000000000000e+00
197001.00000  198001.00000  0.000000000000e+00
198001.00000  199001.00000  0.000000000000e+00
