300.00000  350.00000  5.221465226840e-06
350.00000  400.00000  7.459236038343e-06
400.00000  450.00000  2.237770811503e-06
450.00000  500.00000  2.983694415337e-06
500.00000  550.00000  1.044293045368e-05
550.00000  600.00000  7.459236038343e-07
600.00000  650.00000  5.967388830674e-06
650.00000  700.00000  2.237770811503e-06
700.00000  750.00000  2.983694415337e-06
750.00000  800.00000  0.000000000000e+00
800.00000  850.00000  6.713312434509e-06
850.00000  900.00000  0.000000000000e+00
900.00000  950.00000  7.459236038343e-07
950.00000  1000.00000  1.491847207669e-06
1000.00000  1050.00000  1.491847207669e-06
1050.00000  1100.00000  1.491847207669e-06
1100.00000  1150.00000  2.237770811503e-06
1150.00000  1200.00000  2.237770811503e-06
1200.00000  1250.00000  2.983694415337e-06
1250.00000  1300.00000  7.459236038343e-06
1300.00000  1350.00000  1.491847207669e-06
1350.00000  1400.00000  2.983694415337e-06
1400.00000  1450.00000  3.729618019172e-06
1450.00000  1500.00000  2.237770811503e-06
1500.00000  1550.00000  1.491847207669e-06
1550.00000  1600.00000  2.237770811503e-06
1600.00000  1650.00000  5.221465226840e-06
1650.00000  1700.00000  2.237770811503e-06
1700.00000  1750.00000  2.163178451119e-05
1750.00000  1800.00000  2.237770811503e-06
1800.00000  1850.00000  2.983694415337e-06
1850.00000  1900.00000  2.237770811503e-06
1900.00000  1950.00000  2.983694415337e-06
1950.00000  2000.00000  7.459236038343e-07
2000.00000  2050.00000  3.729618019172e-06
2050.00000  2100.00000  2.237770811503e-06
2100.00000  2150.00000  2.983694415337e-06
2150.00000  2200.00000  5.967388830674e-06
2200.00000  2250.00000  4.475541623006e-06
2250.00000  2300.00000  1.491847207669e-06
2300.00000  2350.00000  2.909102054954e-05
2350.00000  2400.00000  6.713312434509e-06
2400.00000  2450.00000  5.221465226840e-06
2450.00000  2500.00000  9.697006849846e-06
2500.00000  2550.00000  8.205159642177e-06
2550.00000  2600.00000  5.967388830674e-06
2600.00000  2650.00000  7.459236038343e-06
2650.00000  2700.00000  8.951083246012e-06
2700.00000  2750.00000  5.967388830674e-06
2750.00000  2800.00000  9.697006849846e-06
2800.00000  2850.00000  8.205159642177e-06
2850.00000  2900.00000  9.697006849846e-06
2900.00000  2950.00000  4.475541623006e-06
2950.00000  3000.00000  3.058286775721e-05
3000.00000  3050.00000  1.417254847285e-05
3050.00000  3100.00000  7.459236038343e-06
3100.00000  3150.00000  8.205159642177e-06
3150.00000  3200.00000  1.044293045368e-05
3200.00000  3250.00000  1.044293045368e-05
3250.00000  3300.00000  1.118885405751e-05
3300.00000  3350.00000  8.205159642177e-06
3350.00000  3400.00000  1.268070126518e-05
3400.00000  3450.00000  8.951083246012e-06
3450.00000  3500.00000  1.342662486902e-05
3500.00000  3550.00000  8.205159642177e-06
3550.00000  3600.00000  1.193477766135e-05
3600.00000  3650.00000  2.312363171886e-05
3650.00000  3700.00000  2.386955532270e-05
3700.00000  3750.00000  2.163178451119e-05
3750.00000  3800.00000  1.342662486902e-05
3800.00000  3850.00000  1.864809009586e-05
3850.00000  3900.00000  2.013993730353e-05
3900.00000  3950.00000  2.237770811503e-05
3950.00000  4000.00000  2.759917334187e-05
4000.00000  4050.00000  3.058286775721e-05
4050.00000  4100.00000  2.685324973804e-05
4100.00000  4150.00000  3.655025658788e-05
4150.00000  4200.00000  3.431248577638e-05
4200.00000  4250.00000  3.953395100322e-05
4250.00000  4300.00000  4.102579821089e-05
4300.00000  4350.00000  4.400949262622e-05
4350.00000  4400.00000  4.624726343773e-05
4400.00000  4450.00000  5.370649947607e-05
4450.00000  4500.00000  6.041981191058e-05
4500.00000  4550.00000  5.743611749524e-05
4550.00000  4600.00000  6.713312434509e-05
4600.00000  4650.00000  6.713312434509e-05
4650.00000  4700.00000  5.743611749524e-05
4700.00000  4750.00000  6.489535353358e-05
4750.00000  4800.00000  7.683013119493e-05
4800.00000  4850.00000  7.683013119493e-05
4850.00000  4900.00000  1.006996865176e-04
4900.00000  4950.00000  8.578121444095e-05
4950.00000  5000.00000  8.876490885628e-05
5000.00000  5050.00000  1.178559294058e-04
5050.00000  5100.00000  1.096507697636e-04
5100.00000  5150.00000  1.141263113866e-04
5150.00000  5200.00000  9.697006849846e-05
5200.00000  5250.00000  9.995376291380e-05
5250.00000  5300.00000  1.200937002173e-04
5300.00000  5350.00000  1.111426169713e-04
5350.00000  5400.00000  1.290447834633e-04
5400.00000  5450.00000  1.327744014825e-04
5450.00000  5500.00000  1.297907070672e-04
5500.00000  5550.00000  1.357580958978e-04
5550.00000  5600.00000  1.342662486902e-04
5600.00000  5650.00000  1.536602623899e-04
5650.00000  5700.00000  1.529143387860e-04
5700.00000  5750.00000  1.536602623899e-04
5750.00000  5800.00000  1.566439568052e-04
5800.00000  5850.00000  1.566439568052e-04
5850.00000  5900.00000  1.805135121279e-04
5900.00000  5950.00000  1.685787344666e-04
5950.00000  6000.00000  1.805135121279e-04
6000.00000  6050.00000  1.596276512205e-04
6050.00000  6100.00000  1.790216649202e-04
6100.00000  6150.00000  1.663409636551e-04
6150.00000  6200.00000  1.447091791439e-04
6200.00000  6250.00000  1.872268245624e-04
6250.00000  6300.00000  1.887186717701e-04
6300.00000  6350.00000  1.954319842046e-04
6350.00000  6400.00000  4.453163914891e-04
6400.00000  6450.00000  1.879727481662e-04
6450.00000  6500.00000  1.834972065432e-04
6500.00000  6550.00000  1.887186717701e-04
6550.00000  6600.00000  1.984156786199e-04
6600.00000  6650.00000  1.946860606008e-04
6650.00000  6700.00000  1.991616022238e-04
6700.00000  6750.00000  2.021452966391e-04
6750.00000  6800.00000  1.849890537509e-04
6800.00000  6850.00000  1.879727481662e-04
6850.00000  6900.00000  1.834972065432e-04
6900.00000  6950.00000  1.902105189777e-04
6950.00000  7000.00000  1.805135121279e-04
7000.00000  7050.00000  1.872268245624e-04
7050.00000  7100.00000  2.081126854698e-04
7100.00000  7150.00000  1.014456101215e-04
7150.00000  7200.00000  8.205159642177e-05
7200.00000  7250.00000  7.906790200644e-05
7250.00000  7300.00000  7.608420759110e-05
7300.00000  7350.00000  1.006996865176e-04
7350.00000  7400.00000  7.086274236426e-05
7400.00000  7450.00000  8.503529083711e-05
7450.00000  7500.00000  9.846191570613e-05
7500.00000  7550.00000  8.279752002561e-05
7550.00000  7600.00000  8.428936723328e-05
7600.00000  7650.00000  8.652713804478e-05
7650.00000  7700.00000  7.757605479877e-05
7700.00000  7750.00000  9.100267966779e-05
7750.00000  7800.00000  8.652713804478e-05
7800.00000  7850.00000  8.503529083711e-05
7850.00000  7900.00000  1.066670753483e-04
7900.00000  7950.00000  9.697006849846e-05
7950.00000  8000.00000  9.697006849846e-05
8000.00000  8050.00000  1.141263113866e-04
8050.00000  8100.00000  9.547822129079e-05
8100.00000  8150.00000  8.951083246012e-05
8150.00000  8200.00000  1.081589225560e-04
8200.00000  8250.00000  1.118885405751e-04
8250.00000  8300.00000  9.622414489463e-05
8300.00000  8350.00000  8.279752002561e-05
8350.00000  8400.00000  9.324045047929e-05
8400.00000  8450.00000  9.547822129079e-05
8450.00000  8500.00000  9.920783930996e-05
8500.00000  8550.00000  1.029374573291e-04
8550.00000  8600.00000  8.354344362944e-05
8600.00000  8650.00000  9.697006849846e-05
8650.00000  8700.00000  9.920783930996e-05
8700.00000  8750.00000  9.771599210229e-05
8750.00000  8800.00000  9.995376291380e-05
8800.00000  8850.00000  9.697006849846e-05
8850.00000  8900.00000  1.029374573291e-04
8900.00000  8950.00000  7.981382561027e-05
8950.00000  9000.00000  1.051752281406e-04
9000.00000  9050.00000  1.096507697636e-04
9050.00000  9100.00000  1.036833809330e-04
9100.00000  9150.00000  1.200937002173e-04
9150.00000  9200.00000  1.059211517445e-04
9200.00000  9250.00000  9.920783930996e-05
9250.00000  9300.00000  9.771599210229e-05
9300.00000  9350.00000  9.920783930996e-05
9350.00000  9400.00000  1.074129989521e-04
9400.00000  9450.00000  1.014456101215e-04
9450.00000  9500.00000  1.021915337253e-04
9500.00000  9550.00000  1.133803877828e-04
9550.00000  9600.00000  1.059211517445e-04
9600.00000  9650.00000  1.059211517445e-04
9650.00000  9700.00000  9.920783930996e-05
9700.00000  9750.00000  9.697006849846e-05
9750.00000  9800.00000  9.547822129079e-05
9800.00000  9850.00000  9.771599210229e-05
9850.00000  9900.00000  1.066670753483e-04
9900.00000  9950.00000  1.156181585943e-04
9950.00000  10000.00000  1.081589225560e-04
