300.00000  350.00000  1.929301045017e-01
350.00000  400.00000  1.363384536876e-01
400.00000  450.00000  1.007543277330e-01
450.00000  500.00000  7.709056908358e-02
500.00000  550.00000  6.054012799339e-02
550.00000  600.00000  4.845474256267e-02
600.00000  650.00000  3.970081001552e-02
650.00000  700.00000  3.275251058187e-02
700.00000  750.00000  2.755722978688e-02
750.00000  800.00000  2.340706378739e-02
800.00000  850.00000  2.007800247085e-02
850.00000  900.00000  1.748873255799e-02
900.00000  950.00000  1.546546684406e-02
950.00000  1000.00000  1.356417104906e-02
1000.00000  1050.00000  1.213241958246e-02
1050.00000  1100.00000  1.061058575745e-02
1100.00000  1150.00000  9.465822335382e-03
1150.00000  1200.00000  8.678996779965e-03
1200.00000  1250.00000  7.780564762786e-03
1250.00000  1300.00000  7.024032389847e-03
1300.00000  1350.00000  6.456433812890e-03
1350.00000  1400.00000  5.826654492951e-03
1400.00000  1450.00000  5.357907353554e-03
1450.00000  1500.00000  4.928222475773e-03
1500.00000  1550.00000  4.617318760867e-03
1550.00000  1600.00000  4.151760377520e-03
1600.00000  1650.00000  3.991525385991e-03
1650.00000  1700.00000  3.679824482072e-03
1700.00000  1750.00000  3.392039248530e-03
1750.00000  1800.00000  3.157665678832e-03
1800.00000  1850.00000  2.944816212473e-03
1850.00000  1900.00000  2.817265970460e-03
1900.00000  1950.00000  2.574123321623e-03
1950.00000  2000.00000  2.409902385031e-03
2000.00000  2050.00000  2.332575050811e-03
2050.00000  2100.00000  2.121319962477e-03
2100.00000  2150.00000  2.098998670125e-03
2150.00000  2200.00000  1.961882159961e-03
2200.00000  2250.00000  1.809619058558e-03
2250.00000  2300.00000  1.687649139633e-03
2300.00000  2350.00000  1.650978445054e-03
2350.00000  2400.00000  1.575245488859e-03
2400.00000  2450.00000  1.482771563400e-03
2450.00000  2500.00000  1.359207266450e-03
2500.00000  2550.00000  1.354424132374e-03
2550.00000  2600.00000  1.289851822355e-03
2600.00000  2650.00000  1.249992371726e-03
2650.00000  2700.00000  1.121644940701e-03
2700.00000  2750.00000  1.124833696751e-03
2750.00000  2800.00000  1.068233276858e-03
2800.00000  2850.00000  1.021199125116e-03
2850.00000  2900.00000  1.052289496606e-03
2900.00000  2950.00000  9.064039073041e-04
2950.00000  3000.00000  8.816910479141e-04
3000.00000  3050.00000  8.641528896373e-04
3050.00000  3100.00000  8.402372192599e-04
3100.00000  3150.00000  7.995805796183e-04
3150.00000  3200.00000  7.509520498509e-04
3200.00000  3250.00000  6.999319530457e-04
3250.00000  3300.00000  7.246448124357e-04
3300.00000  3350.00000  6.393455880896e-04
3350.00000  3400.00000  6.760162826683e-04
3400.00000  3450.00000  6.329680759890e-04
3450.00000  3500.00000  6.608696914293e-04
3500.00000  3550.00000  6.050664605486e-04
3550.00000  3600.00000  5.620182538693e-04
3600.00000  3650.00000  5.652070099196e-04
3650.00000  3700.00000  5.396969615170e-04
3700.00000  3750.00000  4.846909196490e-04
3750.00000  3800.00000  4.942571877999e-04
3800.00000  3850.00000  4.815021635987e-04
3850.00000  3900.00000  4.894740537245e-04
3900.00000  3950.00000  4.320764448187e-04
3950.00000  4000.00000  4.392511459319e-04
4000.00000  4050.00000  4.631668163093e-04
4050.00000  4100.00000  4.041748293783e-04
4100.00000  4150.00000  3.930141832022e-04
4150.00000  4200.00000  3.722872688751e-04
4200.00000  4250.00000  3.946085612274e-04
4250.00000  4300.00000  4.009860733280e-04
4300.00000  4350.00000  3.587350556613e-04
4350.00000  4400.00000  3.603294336864e-04
4400.00000  4450.00000  3.491687875103e-04
4450.00000  4500.00000  2.925683676171e-04
4500.00000  4550.00000  3.356165742964e-04
4550.00000  4600.00000  3.324278182461e-04
4600.00000  4650.00000  2.798133434158e-04
4650.00000  4700.00000  2.853936665038e-04
4700.00000  4750.00000  2.726386423026e-04
4750.00000  4800.00000  2.726386423026e-04
4800.00000  4850.00000  2.678555082271e-04
4850.00000  4900.00000  2.702470752648e-04
4900.00000  4950.00000  2.391567037742e-04
4950.00000  5000.00000  2.638695631642e-04
5000.00000  5050.00000  2.630723741516e-04
5050.00000  5100.00000  2.646667521767e-04
5100.00000  5150.00000  2.463314048874e-04
5150.00000  5200.00000  2.248073015477e-04
5200.00000  5250.00000  2.287932466106e-04
5250.00000  5300.00000  2.200241674722e-04
5300.00000  5350.00000  2.319820026609e-04
5350.00000  5400.00000  2.016888201829e-04
5400.00000  5450.00000  1.905281740068e-04
5450.00000  5500.00000  1.953113080822e-04
5500.00000  5550.00000  1.809619058558e-04
5550.00000  5600.00000  1.857450399313e-04
5600.00000  5650.00000  1.745843937551e-04
5650.00000  5700.00000  1.921225520319e-04
5700.00000  5750.00000  1.761787717803e-04
5750.00000  5800.00000  1.674096926419e-04
5800.00000  5850.00000  1.801647168432e-04
5850.00000  5900.00000  1.809619058558e-04
5900.00000  5950.00000  1.610321805413e-04
5950.00000  6000.00000  1.530602904155e-04
6000.00000  6050.00000  1.618293695539e-04
6050.00000  6100.00000  1.538574794280e-04
6100.00000  6150.00000  1.546546684406e-04
6150.00000  6200.00000  1.195783518871e-04
6200.00000  6250.00000  1.562490464658e-04
6250.00000  6300.00000  1.482771563400e-04
6300.00000  6350.00000  1.426968332519e-04
6350.00000  6400.00000  1.530602904155e-04
6400.00000  6450.00000  1.474799673274e-04
6450.00000  6500.00000  1.267530530003e-04
6500.00000  6550.00000  1.179839738619e-04
6550.00000  6600.00000  1.155924068242e-04
6600.00000  6650.00000  1.323333760884e-04
6650.00000  6700.00000  1.187811628745e-04
6700.00000  6750.00000  1.291446200381e-04
6750.00000  6800.00000  1.139980287990e-04
6800.00000  6850.00000  1.219699189248e-04
6850.00000  6900.00000  1.084177057110e-04
6900.00000  6950.00000  9.247392545935e-05
6950.00000  7000.00000  9.885143755999e-05
7000.00000  7050.00000  1.108092727487e-04
7050.00000  7100.00000  1.068233276858e-04
7100.00000  7150.00000  1.060261386732e-04
7150.00000  7200.00000  9.964862657257e-05
7200.00000  7250.00000  8.769079138386e-05
7250.00000  7300.00000  8.609641335870e-05
7300.00000  7350.00000  9.327111447193e-05
7350.00000  7400.00000  9.964862657257e-05
7400.00000  7450.00000  8.290765730838e-05
7450.00000  7500.00000  9.008235842160e-05
7500.00000  7550.00000  8.928516940902e-05
7550.00000  7600.00000  8.529922434612e-05
7600.00000  7650.00000  7.334138915741e-05
7650.00000  7700.00000  9.327111447193e-05
7700.00000  7750.00000  7.653014520773e-05
7750.00000  7800.00000  8.609641335870e-05
7800.00000  7850.00000  8.051609027064e-05
7850.00000  7900.00000  7.971890125806e-05
7900.00000  7950.00000  7.892171224548e-05
7950.00000  8000.00000  6.696387705677e-05
8000.00000  8050.00000  7.334138915741e-05
8050.00000  8100.00000  8.211046829580e-05
8100.00000  8150.00000  5.341166384290e-05
8150.00000  8200.00000  5.739760890580e-05
8200.00000  8250.00000  7.732733422031e-05
8250.00000  8300.00000  7.812452323290e-05
8300.00000  8350.00000  6.058636495612e-05
8350.00000  8400.00000  6.297793199386e-05
8400.00000  8450.00000  6.138355396870e-05
8450.00000  8500.00000  6.058636495612e-05
8500.00000  8550.00000  6.138355396870e-05
8550.00000  8600.00000  6.138355396870e-05
8600.00000  8650.00000  4.783134075483e-05
8650.00000  8700.00000  5.739760890580e-05
8700.00000  8750.00000  5.899198693096e-05
8750.00000  8800.00000  7.334138915741e-05
8800.00000  8850.00000  5.181728581774e-05
8850.00000  8900.00000  5.739760890580e-05
8900.00000  8950.00000  5.341166384290e-05
8950.00000  9000.00000  4.783134075483e-05
9000.00000  9050.00000  7.015263310709e-05
9050.00000  9100.00000  4.862852976741e-05
9100.00000  9150.00000  4.703415174225e-05
9150.00000  9200.00000  5.181728581774e-05
9200.00000  9250.00000  5.261447483032e-05
9250.00000  9300.00000  5.660041989322e-05
9300.00000  9350.00000  5.022290779258e-05
9350.00000  9400.00000  4.543977371709e-05
9400.00000  9450.00000  5.660041989322e-05
9450.00000  9500.00000  5.022290779258e-05
9500.00000  9550.00000  4.384539569193e-05
9550.00000  9600.00000  4.304820667935e-05
9600.00000  9650.00000  4.304820667935e-05
9650.00000  9700.00000  5.181728581774e-05
9700.00000  9750.00000  4.623696272967e-05
9750.00000  9800.00000  3.985945062903e-05
9800.00000  9850.00000  5.341166384290e-05
9850.00000  9900.00000  4.862852976741e-05
9900.00000  9950.00000  3.348193852838e-05
9950.00000  10000.00000  4.783134075483e-05
