10001.00000  11001.00000  1.973476383682e-04
11001.00000  12001.00000  1.779924449414e-04
12001.00000  13001.00000  1.607137817475e-04
13001.00000  14001.00000  1.420056930909e-04
14001.00000  15001.00000  1.284841008766e-04
15001.00000  16001.00000  1.122871650599e-04
16001.00000  17001.00000  1.005620129540e-04
17001.00000  18001.00000  8.984132198408e-05
18001.00000  19001.00000  8.083980488140e-05
19001.00000  20001.00000  7.241778458790e-05
20001.00000  21001.00000  6.519339103339e-05
21001.00000  22001.00000  5.999723631102e-05
22001.00000  23001.00000  5.507151343294e-05
23001.00000  24001.00000  5.002989119303e-05
24001.00000  25001.00000  4.584785588674e-05
25001.00000  26001.00000  4.232258363086e-05
26001.00000  27001.00000  3.966655658876e-05
27001.00000  28001.00000  3.616060089318e-05
28001.00000  29001.00000  3.350457385108e-05
29001.00000  30001.00000  3.090649648990e-05
30001.00000  31001.00000  2.937082994556e-05
31001.00000  32001.00000  2.731361627295e-05
32001.00000  33001.00000  2.446442362779e-05
33001.00000  34001.00000  2.397185133998e-05
34001.00000  35001.00000  2.253276759717e-05
35001.00000  36001.00000  2.148001506048e-05
36001.00000  37001.00000  1.929724374588e-05
37001.00000  38001.00000  1.859218929471e-05
38001.00000  39001.00000  1.735592943511e-05
39001.00000  40001.00000  1.764567783970e-05
40001.00000  41001.00000  1.587821257169e-05
41001.00000  42001.00000  1.522144952128e-05
42001.00000  43001.00000  1.444878710903e-05
43001.00000  44001.00000  1.443912882888e-05
44001.00000  45001.00000  1.273927152193e-05
45001.00000  46001.00000  1.240123171657e-05
46001.00000  47001.00000  1.154164478295e-05
47001.00000  48001.00000  1.123257981805e-05
48001.00000  49001.00000  1.125189637835e-05
49001.00000  50001.00000  9.977003398146e-06
50001.00000  51001.00000  9.474772830185e-06
51001.00000  52001.00000  9.880420596615e-06
52001.00000  53001.00000  8.808351499622e-06
53001.00000  54001.00000  8.595869336254e-06
54001.00000  55001.00000  8.122613608752e-06
55001.00000  56001.00000  7.939106285843e-06
56001.00000  57001.00000  7.514141959107e-06
57001.00000  58001.00000  7.716965842322e-06
58001.00000  59001.00000  6.809087507931e-06
59001.00000  60001.00000  6.471047702573e-06
60001.00000  61001.00000  6.326173500277e-06
61001.00000  62001.00000  6.239248978899e-06
62001.00000  63001.00000  5.717701850632e-06
63001.00000  64001.00000  5.756334971244e-06
64001.00000  65001.00000  5.592144208641e-06
65001.00000  66001.00000  5.273420963589e-06
66001.00000  67001.00000  5.070597080374e-06
67001.00000  68001.00000  5.128546761293e-06
68001.00000  69001.00000  4.780848675782e-06
69001.00000  70001.00000  4.558708232260e-06
70001.00000  71001.00000  4.230326707055e-06
71001.00000  72001.00000  4.317251228433e-06
72001.00000  73001.00000  4.008186263534e-06
73001.00000  74001.00000  4.008186263534e-06
74001.00000  75001.00000  3.766729259707e-06
75001.00000  76001.00000  3.872970341391e-06
76001.00000  77001.00000  3.332106652817e-06
77001.00000  78001.00000  3.515613975726e-06
78001.00000  79001.00000  3.013383407765e-06
79001.00000  80001.00000  3.158257610062e-06
80001.00000  81001.00000  3.563905376492e-06
81001.00000  82001.00000  2.858850925316e-06
82001.00000  83001.00000  3.023041687918e-06
83001.00000  84001.00000  2.704318442866e-06
84001.00000  85001.00000  2.559444240570e-06
85001.00000  86001.00000  2.713976723019e-06
86001.00000  87001.00000  2.453203158886e-06
87001.00000  88001.00000  2.540127680264e-06
88001.00000  89001.00000  2.501494559651e-06
89001.00000  90001.00000  2.375936917661e-06
90001.00000  91001.00000  2.289012396283e-06
91001.00000  92001.00000  2.375936917661e-06
92001.00000  93001.00000  2.153796474140e-06
93001.00000  94001.00000  2.105505073375e-06
94001.00000  95001.00000  1.970289151231e-06
95001.00000  96001.00000  1.815756668782e-06
96001.00000  97001.00000  1.815756668782e-06
97001.00000  98001.00000  1.825414948935e-06
98001.00000  99001.00000  1.583957945107e-06
99001.00000  100001.00000  1.690199026791e-06
100001.00000  101001.00000  1.535666544342e-06
101001.00000  102001.00000  1.468058583270e-06
102001.00000  103001.00000  1.699857306945e-06
103001.00000  104001.00000  1.661224186332e-06
104001.00000  105001.00000  1.178310178677e-06
105001.00000  106001.00000  1.554983104648e-06
106001.00000  107001.00000  1.516349984036e-06
107001.00000  108001.00000  1.332842661127e-06
108001.00000  109001.00000  1.120360497759e-06
109001.00000  110001.00000  1.526008264189e-06
110001.00000  111001.00000  1.207285019137e-06
111001.00000  112001.00000  1.197626738984e-06
112001.00000  113001.00000  1.091385657300e-06
113001.00000  114001.00000  1.130018777912e-06
114001.00000  115001.00000  1.101043937453e-06
115001.00000  116001.00000  1.072069096993e-06
116001.00000  117001.00000  1.149335338218e-06
117001.00000  118001.00000  1.081727377147e-06
118001.00000  119001.00000  1.091385657300e-06
119001.00000  120001.00000  8.402703733192e-07
120001.00000  121001.00000  9.948028557687e-07
121001.00000  122001.00000  7.919789725537e-07
122001.00000  123001.00000  8.982200542378e-07
123001.00000  124001.00000  8.499286534723e-07
124001.00000  125001.00000  7.919789725537e-07
125001.00000  126001.00000  6.084716496449e-07
126001.00000  127001.00000  6.277882099511e-07
127001.00000  128001.00000  6.664213305635e-07
128001.00000  129001.00000  8.306120931661e-07
129001.00000  130001.00000  5.988133694918e-07
130001.00000  131001.00000  5.022305679609e-07
131001.00000  132001.00000  6.567630504104e-07
132001.00000  133001.00000  7.340292916352e-07
133001.00000  134001.00000  5.794968091856e-07
134001.00000  135001.00000  5.408636885733e-07
135001.00000  136001.00000  6.567630504104e-07
136001.00000  137001.00000  5.408636885733e-07
137001.00000  138001.00000  4.442808870423e-07
138001.00000  139001.00000  5.408636885733e-07
139001.00000  140001.00000  4.153060465830e-07
140001.00000  141001.00000  4.442808870423e-07
141001.00000  142001.00000  3.959894862769e-07
142001.00000  143001.00000  3.573563656645e-07
143001.00000  144001.00000  3.959894862769e-07
144001.00000  145001.00000  4.153060465830e-07
145001.00000  146001.00000  5.505219687264e-07
146001.00000  147001.00000  3.766729259707e-07
147001.00000  148001.00000  3.863312061238e-07
148001.00000  149001.00000  2.994066847459e-07
149001.00000  150001.00000  3.380398053583e-07
150001.00000  151001.00000  3.283815252052e-07
151001.00000  152001.00000  3.670146458176e-07
152001.00000  153001.00000  2.994066847459e-07
153001.00000  154001.00000  3.380398053583e-07
154001.00000  155001.00000  2.511152839804e-07
155001.00000  156001.00000  2.317987236743e-07
156001.00000  157001.00000  3.670146458176e-07
157001.00000  158001.00000  3.283815252052e-07
158001.00000  159001.00000  2.800901244397e-07
159001.00000  160001.00000  3.766729259707e-07
160001.00000  161001.00000  2.704318442866e-07
161001.00000  162001.00000  3.090649648990e-07
162001.00000  163001.00000  2.124821633681e-07
163001.00000  164001.00000  2.607735641335e-07
164001.00000  165001.00000  2.897484045928e-07
165001.00000  166001.00000  2.317987236743e-07
166001.00000  167001.00000  1.835073229088e-07
167001.00000  168001.00000  2.317987236743e-07
168001.00000  169001.00000  1.641907626026e-07
169001.00000  170001.00000  2.607735641335e-07
170001.00000  171001.00000  2.414570038274e-07
171001.00000  172001.00000  2.221404435212e-07
172001.00000  173001.00000  2.124821633681e-07
173001.00000  174001.00000  2.511152839804e-07
174001.00000  175001.00000  1.835073229088e-07
175001.00000  176001.00000  1.835073229088e-07
176001.00000  177001.00000  1.738490427557e-07
177001.00000  178001.00000  1.738490427557e-07
178001.00000  179001.00000  1.448742022964e-07
179001.00000  180001.00000  1.352159221433e-07
180001.00000  181001.00000  1.255576419902e-07
181001.00000  182001.00000  1.448742022964e-07
182001.00000  183001.00000  1.352159221433e-07
183001.00000  184001.00000  1.641907626026e-07
184001.00000  185001.00000  1.158993618371e-07
185001.00000  186001.00000  9.658280153094e-08
186001.00000  187001.00000  1.255576419902e-07
187001.00000  188001.00000  1.158993618371e-07
188001.00000  189001.00000  7.726624122475e-08
189001.00000  190001.00000  6.760796107166e-08
190001.00000  191001.00000  6.760796107166e-08
191001.00000  192001.00000  4.829140076547e-08
192001.00000  193001.00000  3.863312061238e-08
193001.00000  194001.00000  1.931656030619e-08
194001.00000  195001.00000  9.658280153094e-09
195001.00000  196001.00000  2.897484045928e-08
196001.00000  197001.00000  9.658280153094e-09
197001.00000  198001.00000  2.897484045928e-08
198001.00000  199001.00000  9.658280153094e-09
