300.00000  350.00000  7.271821741609e-05
350.00000  400.00000  9.587227669285e-05
400.00000  450.00000  9.116910840226e-05
450.00000  500.00000  8.972197969746e-05
500.00000  550.00000  7.886851441148e-05
550.00000  600.00000  4.269029679153e-05
600.00000  650.00000  4.920237596312e-05
650.00000  700.00000  4.413742549633e-05
700.00000  750.00000  3.726356414854e-05
750.00000  800.00000  4.558455420113e-05
800.00000  850.00000  6.692970259690e-05
850.00000  900.00000  4.269029679153e-05
900.00000  950.00000  3.256039585795e-05
950.00000  1000.00000  3.292217803415e-05
1000.00000  1050.00000  4.413742549633e-05
1050.00000  1100.00000  3.617821761994e-05
1100.00000  1150.00000  3.653999979614e-05
1150.00000  1200.00000  4.088138591054e-05
1200.00000  1250.00000  4.051960373434e-05
1250.00000  1300.00000  6.620613824450e-05
1300.00000  1350.00000  3.871069285334e-05
1350.00000  1400.00000  4.088138591054e-05
1400.00000  1450.00000  4.594633637733e-05
1450.00000  1500.00000  4.124316808674e-05
1500.00000  1550.00000  4.594633637733e-05
1550.00000  1600.00000  5.245841554892e-05
1600.00000  1650.00000  4.196673243913e-05
1650.00000  1700.00000  5.824693036811e-05
1700.00000  1750.00000  1.060021776264e-04
1750.00000  1800.00000  6.186475213010e-05
1800.00000  1850.00000  5.824693036811e-05
1850.00000  1900.00000  6.367366301110e-05
1900.00000  1950.00000  6.910039565409e-05
1950.00000  2000.00000  6.331188083490e-05
2000.00000  2050.00000  7.344178176849e-05
2050.00000  2100.00000  7.525069264948e-05
2100.00000  2150.00000  8.212455399727e-05
2150.00000  2200.00000  9.949009845484e-05
2200.00000  2250.00000  8.791306881646e-05
2250.00000  2300.00000  9.442514798805e-05
2300.00000  2350.00000  1.906592068571e-04
2350.00000  2400.00000  1.175792072648e-04
2400.00000  2450.00000  1.259001973174e-04
2450.00000  2500.00000  1.331358408414e-04
2500.00000  2550.00000  1.121524746218e-04
2550.00000  2600.00000  1.215588112030e-04
2600.00000  2650.00000  1.306033656080e-04
2650.00000  2700.00000  1.439893061274e-04
2700.00000  2750.00000  1.447128704798e-04
2750.00000  2800.00000  1.508631674752e-04
2800.00000  2850.00000  1.711229693423e-04
2850.00000  2900.00000  1.830617811569e-04
2900.00000  2950.00000  1.964477216763e-04
2950.00000  3000.00000  2.192399987769e-04
3000.00000  3050.00000  1.989801969097e-04
3050.00000  3100.00000  2.047687117289e-04
3100.00000  3150.00000  2.347966323534e-04
3150.00000  3200.00000  2.347966323534e-04
3200.00000  3250.00000  2.546946520444e-04
3250.00000  3300.00000  2.337112858248e-04
3300.00000  3350.00000  2.724219786782e-04
3350.00000  3400.00000  2.778487113212e-04
3400.00000  3450.00000  2.619302955684e-04
3450.00000  3500.00000  2.879786122547e-04
3500.00000  3550.00000  3.172829685269e-04
3550.00000  3600.00000  3.259657407557e-04
3600.00000  3650.00000  3.364574238655e-04
3650.00000  3700.00000  3.773388097760e-04
3700.00000  3750.00000  3.632293049042e-04
3750.00000  3800.00000  3.614203940232e-04
3800.00000  3850.00000  3.744445523664e-04
3850.00000  3900.00000  3.625057405518e-04
3900.00000  3950.00000  4.073667304006e-04
3950.00000  4000.00000  3.834891067714e-04
4000.00000  4050.00000  4.095374234578e-04
4050.00000  4100.00000  4.229233639771e-04
4100.00000  4150.00000  4.091756412816e-04
4150.00000  4200.00000  4.185819778627e-04
4200.00000  4250.00000  4.106227699864e-04
4250.00000  4300.00000  4.254558392105e-04
4300.00000  4350.00000  4.381182153775e-04
4350.00000  4400.00000  4.305207896773e-04
4400.00000  4450.00000  4.250940570343e-04
4450.00000  4500.00000  4.232851461533e-04
4500.00000  4550.00000  4.522277202493e-04
4550.00000  4600.00000  4.330532649107e-04
4600.00000  4650.00000  4.786378191119e-04
4650.00000  4700.00000  4.728493042927e-04
4700.00000  4750.00000  4.786378191119e-04
4750.00000  4800.00000  4.793613834643e-04
4800.00000  4850.00000  4.800849478166e-04
4850.00000  4900.00000  4.764671260547e-04
4900.00000  4950.00000  4.833409874024e-04
4950.00000  5000.00000  4.844263339310e-04
5000.00000  5050.00000  4.768289082309e-04
5050.00000  5100.00000  4.685079181783e-04
5100.00000  5150.00000  4.844263339310e-04
5150.00000  5200.00000  5.010683140362e-04
5200.00000  5250.00000  4.847881161072e-04
5250.00000  5300.00000  4.771906904071e-04
5300.00000  5350.00000  4.938326705122e-04
5350.00000  5400.00000  4.761053438785e-04
5400.00000  5450.00000  4.804467299928e-04
5450.00000  5500.00000  4.804467299928e-04
5500.00000  5550.00000  4.746582151737e-04
5550.00000  5600.00000  4.869588091644e-04
5600.00000  5650.00000  4.515041558969e-04
5650.00000  5700.00000  4.609104924781e-04
5700.00000  5750.00000  4.591015815971e-04
5750.00000  5800.00000  4.565691063637e-04
5800.00000  5850.00000  4.486098984873e-04
5850.00000  5900.00000  4.677843538259e-04
5900.00000  5950.00000  4.601869281257e-04
5950.00000  6000.00000  4.417360371395e-04
6000.00000  6050.00000  4.522277202493e-04
6050.00000  6100.00000  4.254558392105e-04
6100.00000  6150.00000  4.471627697825e-04
6150.00000  6200.00000  4.413742549633e-04
6200.00000  6250.00000  4.612722746543e-04
6250.00000  6300.00000  5.115599971460e-04
6300.00000  6350.00000  4.735728686451e-04
6350.00000  6400.00000  1.907315632923e-03
6400.00000  6450.00000  4.001310868766e-04
6450.00000  6500.00000  4.080902947530e-04
6500.00000  6550.00000  3.900011859430e-04
6550.00000  6600.00000  3.928954433526e-04
6600.00000  6650.00000  3.834891067714e-04
6650.00000  6700.00000  3.972368294670e-04
6700.00000  6750.00000  3.791477206570e-04
6750.00000  6800.00000  3.885540572382e-04
6800.00000  6850.00000  3.610586118470e-04
6850.00000  6900.00000  3.784241563046e-04
6900.00000  6950.00000  3.704649484282e-04
6950.00000  7000.00000  3.599732653184e-04
7000.00000  7050.00000  3.386281169227e-04
7050.00000  7100.00000  5.187956406700e-04
7100.00000  7150.00000  2.217724740103e-04
7150.00000  7200.00000  2.127279196053e-04
7200.00000  7250.00000  2.130897017815e-04
7250.00000  7300.00000  2.159839591911e-04
7300.00000  7350.00000  2.094718800195e-04
7350.00000  7400.00000  2.167075235435e-04
7400.00000  7450.00000  2.217724740103e-04
7450.00000  7500.00000  2.586742559826e-04
7500.00000  7550.00000  1.968095038525e-04
7550.00000  7600.00000  2.127279196053e-04
7600.00000  7650.00000  2.062158404337e-04
7650.00000  7700.00000  2.141750483101e-04
7700.00000  7750.00000  2.123661374291e-04
7750.00000  7800.00000  2.069394047861e-04
7800.00000  7850.00000  1.957241573239e-04
7850.00000  7900.00000  1.964477216763e-04
7900.00000  7950.00000  2.018744543193e-04
7950.00000  8000.00000  1.924681177381e-04
8000.00000  8050.00000  1.910209890333e-04
8050.00000  8100.00000  1.848706920379e-04
8100.00000  8150.00000  2.054922760813e-04
8150.00000  8200.00000  1.859560385665e-04
8200.00000  8250.00000  1.877649494475e-04
8250.00000  8300.00000  1.960859395001e-04
8300.00000  8350.00000  1.837853455093e-04
8350.00000  8400.00000  1.722083158709e-04
8400.00000  8450.00000  1.714847515185e-04
8450.00000  8500.00000  1.696758406375e-04
8500.00000  8550.00000  1.667815832279e-04
8550.00000  8600.00000  1.939152464429e-04
8600.00000  8650.00000  1.794439593949e-04
8650.00000  8700.00000  1.794439593949e-04
8700.00000  8750.00000  1.845089098617e-04
8750.00000  8800.00000  1.725700980471e-04
8800.00000  8850.00000  1.649726723469e-04
8850.00000  8900.00000  1.722083158709e-04
8900.00000  8950.00000  1.628019792897e-04
8950.00000  9000.00000  1.606312862325e-04
9000.00000  9050.00000  1.519485140038e-04
9050.00000  9100.00000  1.620784149373e-04
9100.00000  9150.00000  1.693140584613e-04
9150.00000  9200.00000  1.649726723469e-04
9200.00000  9250.00000  1.675051475803e-04
9250.00000  9300.00000  1.599077218802e-04
9300.00000  9350.00000  1.617166327611e-04
9350.00000  9400.00000  1.497778209466e-04
9400.00000  9450.00000  1.635255436421e-04
9450.00000  9500.00000  1.620784149373e-04
9500.00000  9550.00000  1.501396031228e-04
9550.00000  9600.00000  1.461599991846e-04
9600.00000  9650.00000  1.570134644706e-04
9650.00000  9700.00000  1.570134644706e-04
9700.00000  9750.00000  1.530338605324e-04
9750.00000  9800.00000  1.382007913082e-04
9800.00000  9850.00000  1.523102961800e-04
9850.00000  9900.00000  1.392861378368e-04
9900.00000  9950.00000  1.389243556606e-04
9950.00000  10000.00000  1.313269299604e-04
