300.00000  350.00000  1.960422643647e-05
350.00000  400.00000  2.639030481832e-05
400.00000  450.00000  2.412827869103e-05
450.00000  500.00000  2.111224385465e-05
500.00000  550.00000  1.606038550372e-04
550.00000  600.00000  1.508017418190e-05
600.00000  650.00000  3.468440061836e-05
650.00000  700.00000  1.734220030918e-05
700.00000  750.00000  3.543840932746e-05
750.00000  800.00000  1.658819160009e-05
800.00000  850.00000  5.730466189121e-05
850.00000  900.00000  1.583418289099e-05
900.00000  950.00000  1.432616547280e-05
950.00000  1000.00000  1.734220030918e-05
1000.00000  1050.00000  1.206413934552e-05
1050.00000  1100.00000  7.540087090948e-06
1100.00000  1150.00000  8.294095800043e-06
1150.00000  1200.00000  1.432616547280e-05
1200.00000  1250.00000  1.055612192733e-05
1250.00000  1300.00000  2.035823514556e-05
1300.00000  1350.00000  6.032069672759e-06
1350.00000  1400.00000  9.802113218233e-06
1400.00000  1450.00000  7.540087090948e-06
1450.00000  1500.00000  1.281814805461e-05
1500.00000  1550.00000  1.131013063642e-05
1550.00000  1600.00000  8.294095800043e-06
1600.00000  1650.00000  9.802113218233e-06
1650.00000  1700.00000  8.294095800043e-06
1700.00000  1750.00000  2.337426998194e-05
1750.00000  1800.00000  5.278060963664e-06
1800.00000  1850.00000  6.786078381853e-06
1850.00000  1900.00000  5.278060963664e-06
1900.00000  1950.00000  4.524052254569e-06
1950.00000  2000.00000  7.540087090948e-06
2000.00000  2050.00000  3.770043545474e-06
2050.00000  2100.00000  3.770043545474e-06
2100.00000  2150.00000  5.278060963664e-06
2150.00000  2200.00000  2.262026127284e-06
2200.00000  2250.00000  5.278060963664e-06
2250.00000  2300.00000  4.524052254569e-06
2300.00000  2350.00000  1.734220030918e-05
2350.00000  2400.00000  2.262026127284e-06
2400.00000  2450.00000  3.770043545474e-06
2450.00000  2500.00000  3.016034836379e-06
2500.00000  2550.00000  6.032069672759e-06
2550.00000  2600.00000  6.786078381853e-06
2600.00000  2650.00000  1.508017418190e-06
2650.00000  2700.00000  3.770043545474e-06
2700.00000  2750.00000  3.016034836379e-06
2750.00000  2800.00000  6.786078381853e-06
2800.00000  2850.00000  2.262026127284e-06
2850.00000  2900.00000  4.524052254569e-06
2900.00000  2950.00000  2.262026127284e-06
2950.00000  3000.00000  1.131013063642e-05
3000.00000  3050.00000  3.016034836379e-06
3050.00000  3100.00000  4.524052254569e-06
3100.00000  3150.00000  1.508017418190e-06
3150.00000  3200.00000  8.294095800043e-06
3200.00000  3250.00000  2.262026127284e-06
3250.00000  3300.00000  6.032069672759e-06
3300.00000  3350.00000  9.802113218233e-06
3350.00000  3400.00000  9.802113218233e-06
3400.00000  3450.00000  9.048104509138e-06
3450.00000  3500.00000  7.540087090948e-06
3500.00000  3550.00000  1.432616547280e-05
3550.00000  3600.00000  1.809620901828e-05
3600.00000  3650.00000  2.262026127284e-05
3650.00000  3700.00000  3.166836578198e-05
3700.00000  3750.00000  2.865233094560e-05
3750.00000  3800.00000  2.262026127284e-05
3800.00000  3850.00000  2.639030481832e-05
3850.00000  3900.00000  3.920845287293e-05
3900.00000  3950.00000  5.579664447302e-05
3950.00000  4000.00000  5.805867060030e-05
4000.00000  4050.00000  7.313884478220e-05
4050.00000  4100.00000  5.504263576392e-05
4100.00000  4150.00000  6.409074027306e-05
4150.00000  4200.00000  6.182871414577e-05
4200.00000  4250.00000  8.067893187315e-05
4250.00000  4300.00000  8.294095800043e-05
4300.00000  4350.00000  8.444897541862e-05
4350.00000  4400.00000  9.500509734595e-05
4400.00000  4450.00000  9.952914960052e-05
4450.00000  4500.00000  1.213954021643e-04
4500.00000  4550.00000  1.364755763462e-04
4550.00000  4600.00000  1.485397156917e-04
4600.00000  4650.00000  1.492937244008e-04
4650.00000  4700.00000  1.530637679462e-04
4700.00000  4750.00000  1.500477331099e-04
4750.00000  4800.00000  1.719139856736e-04
4800.00000  4850.00000  1.711599769645e-04
4850.00000  4900.00000  1.741760118009e-04
4900.00000  4950.00000  1.885021772737e-04
4950.00000  5000.00000  2.156464908011e-04
5000.00000  5050.00000  2.043363601647e-04
5050.00000  5100.00000  2.058443775829e-04
5100.00000  5150.00000  2.239405866012e-04
5150.00000  5200.00000  2.518389088377e-04
5200.00000  5250.00000  2.450528304558e-04
5250.00000  5300.00000  2.495768827104e-04
5300.00000  5350.00000  2.488228740013e-04
5350.00000  5400.00000  2.435448130376e-04
5400.00000  5450.00000  2.744591701105e-04
5450.00000  5500.00000  2.804912397833e-04
5500.00000  5550.00000  2.827532659106e-04
5550.00000  5600.00000  3.046195184743e-04
5600.00000  5650.00000  3.023574923470e-04
5650.00000  5700.00000  3.174376665289e-04
5700.00000  5750.00000  3.114055968562e-04
5750.00000  5800.00000  3.098975794380e-04
5800.00000  5850.00000  3.076355533107e-04
5850.00000  5900.00000  3.325178407108e-04
5900.00000  5950.00000  3.181916752380e-04
5950.00000  6000.00000  3.393039190927e-04
6000.00000  6050.00000  3.385499103836e-04
6050.00000  6100.00000  3.362878842563e-04
6100.00000  6150.00000  3.928385374384e-04
6150.00000  6200.00000  3.370418929654e-04
6200.00000  6250.00000  3.913305200202e-04
6250.00000  6300.00000  4.177208248385e-04
6300.00000  6350.00000  4.463731557841e-04
6350.00000  6400.00000  1.404718225044e-03
6400.00000  6450.00000  3.468440061836e-04
6450.00000  6500.00000  3.672022413292e-04
6500.00000  6550.00000  3.302558145835e-04
6550.00000  6600.00000  3.566461194018e-04
6600.00000  6650.00000  3.340258581290e-04
6650.00000  6700.00000  3.506140497291e-04
6700.00000  6750.00000  3.754963371292e-04
6750.00000  6800.00000  3.694642674565e-04
6800.00000  6850.00000  3.362878842563e-04
6850.00000  6900.00000  3.830364242202e-04
6900.00000  6950.00000  3.626781890746e-04
6950.00000  7000.00000  3.506140497291e-04
7000.00000  7050.00000  3.837904329293e-04
7050.00000  7100.00000  4.840735912389e-04
7100.00000  7150.00000  1.756840292191e-04
7150.00000  7200.00000  1.455236808553e-04
7200.00000  7250.00000  1.417536373098e-04
7250.00000  7300.00000  1.598498463281e-04
7300.00000  7350.00000  1.673899334190e-04
7350.00000  7400.00000  1.636198898736e-04
7400.00000  7450.00000  1.771920466373e-04
7450.00000  7500.00000  1.839781250191e-04
7500.00000  7550.00000  1.734220030918e-04
7550.00000  7600.00000  1.696519595463e-04
7600.00000  7650.00000  1.877481685646e-04
7650.00000  7700.00000  1.681439421281e-04
7700.00000  7750.00000  1.824701076009e-04
7750.00000  7800.00000  1.802080814737e-04
7800.00000  7850.00000  1.960422643647e-04
7850.00000  7900.00000  1.779460553464e-04
7900.00000  7950.00000  1.960422643647e-04
7950.00000  8000.00000  2.005663166192e-04
8000.00000  8050.00000  2.058443775829e-04
8050.00000  8100.00000  1.907642034010e-04
8100.00000  8150.00000  1.945342469465e-04
8150.00000  8200.00000  1.847321337282e-04
8200.00000  8250.00000  1.877481685646e-04
8250.00000  8300.00000  2.028283427465e-04
8300.00000  8350.00000  1.824701076009e-04
8350.00000  8400.00000  1.900101946919e-04
8400.00000  8450.00000  2.118764472556e-04
8450.00000  8500.00000  1.960422643647e-04
8500.00000  8550.00000  2.179085169284e-04
8550.00000  8600.00000  1.741760118009e-04
8600.00000  8650.00000  1.862401511464e-04
8650.00000  8700.00000  1.824701076009e-04
8700.00000  8750.00000  1.862401511464e-04
8750.00000  8800.00000  1.704059682554e-04
8800.00000  8850.00000  1.839781250191e-04
8850.00000  8900.00000  1.960422643647e-04
8900.00000  8950.00000  1.869941598555e-04
8950.00000  9000.00000  1.945342469465e-04
9000.00000  9050.00000  1.771920466373e-04
9050.00000  9100.00000  1.854861424373e-04
9100.00000  9150.00000  1.967962730737e-04
9150.00000  9200.00000  1.854861424373e-04
9200.00000  9250.00000  1.892561859828e-04
9250.00000  9300.00000  1.628658811645e-04
9300.00000  9350.00000  1.907642034010e-04
9350.00000  9400.00000  1.885021772737e-04
9400.00000  9450.00000  2.058443775829e-04
9450.00000  9500.00000  1.869941598555e-04
9500.00000  9550.00000  1.704059682554e-04
9550.00000  9600.00000  1.839781250191e-04
9600.00000  9650.00000  1.983042904919e-04
9650.00000  9700.00000  1.696519595463e-04
9700.00000  9750.00000  1.666359247100e-04
9750.00000  9800.00000  2.005663166192e-04
9800.00000  9850.00000  1.915182121101e-04
9850.00000  9900.00000  1.862401511464e-04
9900.00000  9950.00000  1.787000640555e-04
9950.00000  10000.00000  1.787000640555e-04
