300.00000  350.00000  6.354525218708e-02
350.00000  400.00000  4.747609422939e-02
400.00000  450.00000  3.725725497374e-02
450.00000  500.00000  2.974337088367e-02
500.00000  550.00000  2.435106251842e-02
550.00000  600.00000  2.047144554788e-02
600.00000  650.00000  1.713317883425e-02
650.00000  700.00000  1.476733092980e-02
700.00000  750.00000  1.271472617335e-02
750.00000  800.00000  1.118084057482e-02
800.00000  850.00000  9.736760924672e-03
850.00000  900.00000  8.701837175402e-03
900.00000  950.00000  7.849039889470e-03
950.00000  1000.00000  6.941999810710e-03
1000.00000  1050.00000  6.342455299244e-03
1050.00000  1100.00000  5.774881705406e-03
1100.00000  1150.00000  5.263347023365e-03
1150.00000  1200.00000  4.842336737303e-03
1200.00000  1250.00000  4.426714808144e-03
1250.00000  1300.00000  4.119937688436e-03
1300.00000  1350.00000  3.821063492187e-03
1350.00000  1400.00000  3.537635919062e-03
1400.00000  1450.00000  3.263548164569e-03
1450.00000  1500.00000  3.022868222878e-03
1500.00000  1550.00000  2.841460207126e-03
1550.00000  1600.00000  2.714654207997e-03
1600.00000  1650.00000  2.541149115703e-03
1650.00000  1700.00000  2.377702289629e-03
1700.00000  1750.00000  2.268139032591e-03
1750.00000  1800.00000  2.087808688220e-03
1800.00000  1850.00000  2.027099867107e-03
1850.00000  1900.00000  1.924721085940e-03
1900.00000  1950.00000  1.816594724076e-03
1950.00000  2000.00000  1.739002384665e-03
2000.00000  2050.00000  1.643808079369e-03
2050.00000  2100.00000  1.617943966232e-03
2100.00000  2150.00000  1.487186505373e-03
2150.00000  2200.00000  1.445157321526e-03
2200.00000  2250.00000  1.313322189286e-03
2250.00000  2300.00000  1.319428993777e-03
2300.00000  2350.00000  1.251176472999e-03
2350.00000  2400.00000  1.195137561202e-03
2400.00000  2450.00000  1.145923901483e-03
2450.00000  2500.00000  1.066535443105e-03
2500.00000  2550.00000  1.037438315826e-03
2550.00000  2600.00000  1.024147035464e-03
2600.00000  2650.00000  9.961275795653e-04
2650.00000  2700.00000  9.364964298329e-04
2700.00000  2750.00000  9.235643732645e-04
2750.00000  2800.00000  8.635739997385e-04
2800.00000  2850.00000  8.463312576472e-04
2850.00000  2900.00000  8.136418924325e-04
2900.00000  2950.00000  7.841855413599e-04
2950.00000  3000.00000  7.953214789605e-04
3000.00000  3050.00000  7.479039382095e-04
3050.00000  3100.00000  7.317388674989e-04
3100.00000  3150.00000  6.760591794958e-04
3150.00000  3200.00000  6.771368508765e-04
3200.00000  3250.00000  6.440882618682e-04
3250.00000  3300.00000  6.451659332489e-04
3300.00000  3350.00000  5.966707211172e-04
3350.00000  3400.00000  5.855347835166e-04
3400.00000  3450.00000  5.697289365995e-04
3450.00000  3500.00000  5.797872028195e-04
3500.00000  3550.00000  5.611075655539e-04
3550.00000  3600.00000  5.140492485964e-04
3600.00000  3650.00000  5.366803475912e-04
3650.00000  3700.00000  4.889035830466e-04
3700.00000  3750.00000  5.011171920280e-04
3750.00000  3800.00000  4.759715264782e-04
3800.00000  3850.00000  4.659132602583e-04
3850.00000  3900.00000  4.547773226576e-04
3900.00000  3950.00000  4.289132095207e-04
3950.00000  4000.00000  4.238840764108e-04
4000.00000  4050.00000  4.263986429657e-04
4050.00000  4100.00000  4.267578667593e-04
4100.00000  4150.00000  4.016122012095e-04
4150.00000  4200.00000  3.847286829118e-04
4200.00000  4250.00000  3.915539349896e-04
4250.00000  4300.00000  3.725150739305e-04
4300.00000  4350.00000  3.771849832469e-04
4350.00000  4400.00000  3.513208701099e-04
4400.00000  4450.00000  3.552723318392e-04
4450.00000  4500.00000  3.326412328444e-04
4500.00000  4550.00000  3.347965756058e-04
4550.00000  4600.00000  3.297674424958e-04
4600.00000  4650.00000  3.096509100560e-04
4650.00000  4700.00000  3.128839241981e-04
4700.00000  4750.00000  2.974373010747e-04
4750.00000  4800.00000  3.053402245332e-04
4800.00000  4850.00000  2.791168876027e-04
4850.00000  4900.00000  2.934858393454e-04
4900.00000  4950.00000  2.669032786213e-04
4950.00000  5000.00000  2.733693069056e-04
5000.00000  5050.00000  2.766023210477e-04
5050.00000  5100.00000  2.683401737956e-04
5100.00000  5150.00000  2.374469275487e-04
5150.00000  5200.00000  2.471459699751e-04
5200.00000  5250.00000  2.579226837821e-04
5250.00000  5300.00000  2.521751030850e-04
5300.00000  5350.00000  2.410391654844e-04
5350.00000  5400.00000  2.288255565031e-04
5400.00000  5450.00000  2.202041854575e-04
5450.00000  5500.00000  2.277478851224e-04
5500.00000  5550.00000  2.259517661545e-04
5550.00000  5600.00000  1.954177437012e-04
5600.00000  5650.00000  2.295440040902e-04
5650.00000  5700.00000  1.979323102562e-04
5700.00000  5750.00000  2.176896189025e-04
5750.00000  5800.00000  2.112235906182e-04
5800.00000  5850.00000  1.878740440363e-04
5850.00000  5900.00000  1.957769674948e-04
5900.00000  5950.00000  1.839225823070e-04
5950.00000  6000.00000  1.979323102562e-04
6000.00000  6050.00000  1.846410298942e-04
6050.00000  6100.00000  1.875148202427e-04
6100.00000  6150.00000  1.742235398807e-04
6150.00000  6200.00000  1.778157778164e-04
6200.00000  6250.00000  1.684759591836e-04
6250.00000  6300.00000  1.551846788216e-04
6300.00000  6350.00000  1.656021688350e-04
6350.00000  6400.00000  2.076313526826e-04
6400.00000  6450.00000  1.533885598537e-04
6450.00000  6500.00000  1.526701122666e-04
6500.00000  6550.00000  1.454856363952e-04
6550.00000  6600.00000  1.541070074409e-04
6600.00000  6650.00000  1.576992453765e-04
6650.00000  6700.00000  1.555439026151e-04
6700.00000  6750.00000  1.408157270788e-04
6750.00000  6800.00000  1.515924408859e-04
6800.00000  6850.00000  1.451264126016e-04
6850.00000  6900.00000  1.451264126016e-04
6900.00000  6950.00000  1.390196081110e-04
6950.00000  7000.00000  1.530293360602e-04
7000.00000  7050.00000  1.375827129367e-04
7050.00000  7100.00000  1.365050415560e-04
7100.00000  7150.00000  1.368642653496e-04
7150.00000  7200.00000  1.289613418911e-04
7200.00000  7250.00000  1.228545374004e-04
7250.00000  7300.00000  1.408157270788e-04
7300.00000  7350.00000  1.145923901483e-04
7350.00000  7400.00000  1.350681463817e-04
7400.00000  7450.00000  1.214176422261e-04
7450.00000  7500.00000  1.178254042904e-04
7500.00000  7550.00000  1.063302428963e-04
7550.00000  7600.00000  1.181846280840e-04
7600.00000  7650.00000  1.153108377355e-04
7650.00000  7700.00000  1.163885091162e-04
7700.00000  7750.00000  1.077671380705e-04
7750.00000  7800.00000  1.027380049606e-04
7800.00000  7850.00000  1.160292853226e-04
7850.00000  7900.00000  1.070486904834e-04
7900.00000  7950.00000  9.699042426348e-05
7950.00000  8000.00000  1.153108377355e-04
8000.00000  8050.00000  1.038156763413e-04
8050.00000  8100.00000  1.074079142770e-04
8100.00000  8150.00000  9.663120046991e-05
8150.00000  8200.00000  1.020195573734e-04
8200.00000  8250.00000  1.041749001348e-04
8250.00000  8300.00000  9.806809564418e-05
8300.00000  8350.00000  9.303896253423e-05
8350.00000  8400.00000  9.483508150207e-05
8400.00000  8450.00000  9.699042426348e-05
8450.00000  8500.00000  9.267973874066e-05
8500.00000  8550.00000  8.333992010788e-05
8550.00000  8600.00000  9.160206735995e-05
8600.00000  8650.00000  8.046612975933e-05
8650.00000  8700.00000  9.663120046991e-05
8700.00000  8750.00000  7.687389182365e-05
8750.00000  8800.00000  8.657293424999e-05
8800.00000  8850.00000  8.477681528215e-05
8850.00000  8900.00000  8.405836769501e-05
8900.00000  8950.00000  7.579622044294e-05
8950.00000  9000.00000  8.693215804356e-05
9000.00000  9050.00000  7.400010147510e-05
9050.00000  9100.00000  7.795156320435e-05
9100.00000  9150.00000  8.765060563070e-05
9150.00000  9200.00000  7.148553492012e-05
9200.00000  9250.00000  8.657293424999e-05
9250.00000  9300.00000  7.400010147510e-05
9300.00000  9350.00000  7.902923458506e-05
9350.00000  9400.00000  7.364087768153e-05
9400.00000  9450.00000  7.543699664937e-05
9450.00000  9500.00000  6.358261146161e-05
9500.00000  9550.00000  8.082535355290e-05
9550.00000  9600.00000  6.645640181016e-05
9600.00000  9650.00000  6.933019215871e-05
9650.00000  9700.00000  6.286416387448e-05
9700.00000  9750.00000  5.891270214522e-05
9750.00000  9800.00000  6.322338766804e-05
9800.00000  9850.00000  6.430105904875e-05
9850.00000  9900.00000  6.825252077800e-05
9900.00000  9950.00000  7.076708733298e-05
9950.00000  10000.00000  7.292243009439e-05
