10001.00000  11001.00000  7.001220487203e-04
11001.00000  12001.00000  6.056238452763e-04
12001.00000  13001.00000  5.260654343020e-04
13001.00000  14001.00000  4.587861672729e-04
14001.00000  15001.00000  4.044085355419e-04
15001.00000  16001.00000  3.599004038093e-04
16001.00000  17001.00000  3.156231962883e-04
17001.00000  18001.00000  2.851311601791e-04
18001.00000  19001.00000  2.511853010796e-04
19001.00000  20001.00000  2.284141657831e-04
20001.00000  21001.00000  2.075205447284e-04
21001.00000  22001.00000  1.842674806425e-04
22001.00000  23001.00000  1.685244735239e-04
23001.00000  24001.00000  1.536750427023e-04
24001.00000  25001.00000  1.399701927553e-04
25001.00000  26001.00000  1.294280004884e-04
26001.00000  27001.00000  1.190263707850e-04
27001.00000  28001.00000  1.085946205323e-04
28001.00000  29001.00000  1.002010274512e-04
29001.00000  30001.00000  9.330342165373e-05
30001.00000  31001.00000  8.633553457446e-05
31001.00000  32001.00000  7.937768767830e-05
32001.00000  33001.00000  7.187767089412e-05
33001.00000  34001.00000  6.862465156605e-05
34001.00000  35001.00000  6.220897455790e-05
35001.00000  36001.00000  5.935756255427e-05
36001.00000  37001.00000  5.370493946259e-05
37001.00000  38001.00000  5.115473295230e-05
38001.00000  39001.00000  4.716878025710e-05
39001.00000  40001.00000  4.521094455039e-05
40001.00000  41001.00000  4.272097913877e-05
41001.00000  42001.00000  3.830329856978e-05
42001.00000  43001.00000  3.781132959733e-05
43001.00000  44001.00000  3.449806917058e-05
44001.00000  45001.00000  3.237959053409e-05
45001.00000  46001.00000  3.055227720782e-05
46001.00000  47001.00000  2.941773651624e-05
47001.00000  48001.00000  2.679724872418e-05
48001.00000  49001.00000  2.466872990458e-05
49001.00000  50001.00000  2.341370701566e-05
50001.00000  51001.00000  2.308238097298e-05
51001.00000  52001.00000  2.157635350628e-05
52001.00000  53001.00000  2.112454526627e-05
53001.00000  54001.00000  1.950807578534e-05
54001.00000  55001.00000  1.779120447330e-05
55001.00000  56001.00000  1.742975788130e-05
56001.00000  57001.00000  1.603417242882e-05
57001.00000  58001.00000  1.513055594880e-05
58001.00000  59001.00000  1.489963173724e-05
59001.00000  60001.00000  1.381529196121e-05
60001.00000  61001.00000  1.340364445365e-05
61001.00000  62001.00000  1.290163529808e-05
62001.00000  63001.00000  1.209842064917e-05
63001.00000  64001.00000  1.157633112738e-05
64001.00000  65001.00000  1.034138860469e-05
65001.00000  66001.00000  1.062251373180e-05
66001.00000  67001.00000  9.648615970003e-06
67001.00000  68001.00000  9.357450659774e-06
68001.00000  69001.00000  9.116486265102e-06
69001.00000  70001.00000  8.293191249971e-06
70001.00000  71001.00000  8.182749235746e-06
71001.00000  72001.00000  7.841383009961e-06
72001.00000  73001.00000  7.299213121948e-06
73001.00000  74001.00000  6.465877923706e-06
74001.00000  75001.00000  6.957846896162e-06
75001.00000  76001.00000  6.425717191261e-06
76001.00000  77001.00000  6.154632247255e-06
77001.00000  78001.00000  5.742984739690e-06
78001.00000  79001.00000  5.662663274799e-06
79001.00000  80001.00000  5.431739063238e-06
80001.00000  81001.00000  5.170694302343e-06
81001.00000  82001.00000  4.769086977889e-06
82001.00000  83001.00000  4.166675991208e-06
83001.00000  84001.00000  4.688765512998e-06
84001.00000  85001.00000  4.246997456099e-06
85001.00000  86001.00000  3.935751779647e-06
86001.00000  87001.00000  3.604425736973e-06
87001.00000  88001.00000  3.684747201864e-06
88001.00000  89001.00000  3.062255848960e-06
89001.00000  90001.00000  3.253019328076e-06
90001.00000  91001.00000  3.052215665849e-06
91001.00000  92001.00000  2.720889623175e-06
92001.00000  93001.00000  3.042175482738e-06
93001.00000  94001.00000  2.680728890729e-06
94001.00000  95001.00000  2.550206510282e-06
95001.00000  96001.00000  2.670688707618e-06
96001.00000  97001.00000  2.379523397389e-06
97001.00000  98001.00000  2.550206510282e-06
98001.00000  99001.00000  2.349402848055e-06
99001.00000  100001.00000  1.997996439158e-06
100001.00000  101001.00000  1.967875889824e-06
101001.00000  102001.00000  2.369483214277e-06
102001.00000  103001.00000  2.018076805380e-06
103001.00000  104001.00000  1.907634791156e-06
104001.00000  105001.00000  1.787152593819e-06
105001.00000  106001.00000  1.726911495151e-06
106001.00000  107001.00000  1.506027466702e-06
107001.00000  108001.00000  1.757032044485e-06
108001.00000  109001.00000  1.576308748481e-06
109001.00000  110001.00000  1.415665818700e-06
110001.00000  111001.00000  1.335344353809e-06
111001.00000  112001.00000  1.445786368034e-06
112001.00000  113001.00000  1.124500508471e-06
113001.00000  114001.00000  1.154621057805e-06
114001.00000  115001.00000  1.224902339584e-06
115001.00000  116001.00000  1.204821973361e-06
116001.00000  117001.00000  1.054219226691e-06
117001.00000  118001.00000  1.044179043580e-06
118001.00000  119001.00000  1.094379959137e-06
119001.00000  120001.00000  1.244982705807e-06
120001.00000  121001.00000  9.939781280232e-07
121001.00000  122001.00000  9.337370293551e-07
122001.00000  123001.00000  9.236968462438e-07
123001.00000  124001.00000  8.333351982417e-07
124001.00000  125001.00000  7.831342826849e-07
125001.00000  126001.00000  7.831342826849e-07
126001.00000  127001.00000  6.325315360148e-07
127001.00000  128001.00000  6.626520853488e-07
128001.00000  129001.00000  6.526119022374e-07
129001.00000  130001.00000  7.730940995736e-07
130001.00000  131001.00000  6.626520853488e-07
131001.00000  132001.00000  7.730940995736e-07
132001.00000  133001.00000  7.028128177942e-07
133001.00000  134001.00000  5.020091555673e-07
134001.00000  135001.00000  4.016073244538e-07
135001.00000  136001.00000  5.120493386786e-07
136001.00000  137001.00000  6.325315360148e-07
137001.00000  138001.00000  4.116475075652e-07
138001.00000  139001.00000  3.714867751198e-07
139001.00000  140001.00000  4.417680568992e-07
140001.00000  141001.00000  3.514064088971e-07
141001.00000  142001.00000  5.020091555673e-07
142001.00000  143001.00000  4.618484231219e-07
143001.00000  144001.00000  4.718886062332e-07
144001.00000  145001.00000  4.016073244538e-07
145001.00000  146001.00000  3.915671413425e-07
146001.00000  147001.00000  3.313260426744e-07
147001.00000  148001.00000  4.116475075652e-07
148001.00000  149001.00000  3.815269582311e-07
149001.00000  150001.00000  2.811251271177e-07
150001.00000  151001.00000  3.112456764517e-07
151001.00000  152001.00000  2.710849440063e-07
152001.00000  153001.00000  3.112456764517e-07
153001.00000  154001.00000  2.811251271177e-07
154001.00000  155001.00000  2.108438453383e-07
155001.00000  156001.00000  3.313260426744e-07
156001.00000  157001.00000  2.208840284496e-07
157001.00000  158001.00000  2.510045777836e-07
158001.00000  159001.00000  2.610447608950e-07
159001.00000  160001.00000  2.911653102290e-07
160001.00000  161001.00000  2.108438453383e-07
161001.00000  162001.00000  2.008036622269e-07
162001.00000  163001.00000  2.409643946723e-07
163001.00000  164001.00000  2.409643946723e-07
164001.00000  165001.00000  1.606429297815e-07
165001.00000  166001.00000  2.208840284496e-07
166001.00000  167001.00000  1.004018311135e-07
167001.00000  168001.00000  1.606429297815e-07
168001.00000  169001.00000  1.807232960042e-07
169001.00000  170001.00000  1.405625635588e-07
170001.00000  171001.00000  1.305223804475e-07
171001.00000  172001.00000  1.807232960042e-07
172001.00000  173001.00000  2.309242115609e-07
173001.00000  174001.00000  8.032146489076e-08
174001.00000  175001.00000  1.004018311135e-07
175001.00000  176001.00000  1.204821973361e-07
176001.00000  177001.00000  1.405625635588e-07
177001.00000  178001.00000  1.305223804475e-07
178001.00000  179001.00000  1.305223804475e-07
179001.00000  180001.00000  1.305223804475e-07
180001.00000  181001.00000  6.024109866807e-08
181001.00000  182001.00000  7.028128177942e-08
182001.00000  183001.00000  8.032146489076e-08
183001.00000  184001.00000  1.405625635588e-07
184001.00000  185001.00000  1.204821973361e-07
185001.00000  186001.00000  9.036164800211e-08
186001.00000  187001.00000  1.204821973361e-07
187001.00000  188001.00000  1.405625635588e-07
188001.00000  189001.00000  6.024109866807e-08
189001.00000  190001.00000  3.012054933404e-08
190001.00000  191001.00000  8.032146489076e-08
191001.00000  192001.00000  4.016073244538e-08
192001.00000  193001.00000  8.032146489076e-08
193001.00000  194001.00000  1.305223804475e-07
194001.00000  195001.00000  9.036164800211e-08
195001.00000  196001.00000  4.016073244538e-08
196001.00000  197001.00000  1.004018311135e-07
197001.00000  198001.00000  1.004018311135e-07
198001.00000  199001.00000  7.028128177942e-08
