300.00000  350.00000  3.086543457775e-06
350.00000  400.00000  8.102176576659e-06
400.00000  450.00000  3.472361389997e-06
450.00000  500.00000  3.279452423886e-06
500.00000  550.00000  3.742433942552e-05
550.00000  600.00000  4.051088288330e-06
600.00000  650.00000  1.273199176332e-05
650.00000  700.00000  3.858179322219e-06
700.00000  750.00000  6.944722779994e-06
750.00000  800.00000  4.629815186662e-06
800.00000  850.00000  2.314907593331e-05
850.00000  900.00000  4.243997254441e-06
900.00000  950.00000  6.558904847772e-06
950.00000  1000.00000  5.594360017217e-06
1000.00000  1050.00000  5.015633118884e-06
1050.00000  1100.00000  7.523449678326e-06
1100.00000  1150.00000  5.401451051106e-06
1150.00000  1200.00000  7.523449678326e-06
1200.00000  1250.00000  9.259630373325e-06
1250.00000  1300.00000  2.064125937387e-05
1300.00000  1350.00000  9.066721407214e-06
1350.00000  1400.00000  8.295085542770e-06
1400.00000  1450.00000  1.060999313610e-05
1450.00000  1500.00000  8.295085542770e-06
1500.00000  1550.00000  1.060999313610e-05
1550.00000  1600.00000  6.365995881661e-06
1600.00000  1650.00000  6.558904847772e-06
1650.00000  1700.00000  6.944722779994e-06
1700.00000  1750.00000  3.298743320497e-05
1750.00000  1800.00000  7.716358644437e-06
1800.00000  1850.00000  8.102176576659e-06
1850.00000  1900.00000  8.680903474992e-06
1900.00000  1950.00000  1.157453796666e-05
1950.00000  2000.00000  1.041708416999e-05
2000.00000  2050.00000  1.138162900054e-05
2050.00000  2100.00000  1.060999313610e-05
2100.00000  2150.00000  7.523449678326e-06
2150.00000  2200.00000  1.041708416999e-05
2200.00000  2250.00000  1.060999313610e-05
2250.00000  2300.00000  1.080290210221e-05
2300.00000  2350.00000  5.845141673161e-05
2350.00000  2400.00000  1.080290210221e-05
2400.00000  2450.00000  1.292490072943e-05
2450.00000  2500.00000  1.466108142443e-05
2500.00000  2550.00000  1.466108142443e-05
2550.00000  2600.00000  1.466108142443e-05
2600.00000  2650.00000  1.543271728887e-05
2650.00000  2700.00000  1.485399039054e-05
2700.00000  2750.00000  1.871216971276e-05
2750.00000  2800.00000  1.986962350943e-05
2800.00000  2850.00000  1.736180694998e-05
2850.00000  2900.00000  2.044835040776e-05
2900.00000  2950.00000  2.141289523831e-05
2950.00000  3000.00000  5.266414774828e-05
3000.00000  3050.00000  3.125125250997e-05
3050.00000  3100.00000  3.298743320497e-05
3100.00000  3150.00000  3.684561252719e-05
3150.00000  3200.00000  4.475488013774e-05
3200.00000  3250.00000  4.745560566329e-05
3250.00000  3300.00000  4.880596842607e-05
3300.00000  3350.00000  5.285705671440e-05
3350.00000  3400.00000  6.211668708772e-05
3400.00000  3450.00000  6.964013676605e-05
3450.00000  3500.00000  8.217921956326e-05
3500.00000  3550.00000  9.143884993658e-05
3550.00000  3600.00000  9.221048580103e-05
3600.00000  3650.00000  1.030133879032e-04
3650.00000  3700.00000  1.552917177193e-04
3700.00000  3750.00000  1.142021079377e-04
3750.00000  3800.00000  1.230759203788e-04
3800.00000  3850.00000  1.425597259560e-04
3850.00000  3900.00000  1.475753590749e-04
3900.00000  3950.00000  1.701457081098e-04
3950.00000  4000.00000  1.770904308898e-04
4000.00000  4050.00000  1.913656943820e-04
4050.00000  4100.00000  1.784407936526e-04
4100.00000  4150.00000  1.959955095687e-04
4150.00000  4200.00000  2.048693220098e-04
4200.00000  4250.00000  2.112353178915e-04
4250.00000  4300.00000  2.176013137731e-04
4300.00000  4350.00000  2.365063924520e-04
4350.00000  4400.00000  2.451872959270e-04
4400.00000  4450.00000  2.637065566736e-04
4450.00000  4500.00000  2.725803691147e-04
4500.00000  4550.00000  3.011308960992e-04
4550.00000  4600.00000  2.965010809125e-04
4600.00000  4650.00000  3.017096229975e-04
4650.00000  4700.00000  3.074968919808e-04
4700.00000  4750.00000  3.150203416592e-04
4750.00000  4800.00000  3.179139761508e-04
4800.00000  4850.00000  3.238941541003e-04
4850.00000  4900.00000  3.319963306769e-04
4900.00000  4950.00000  3.443425045080e-04
4950.00000  5000.00000  3.590035859324e-04
5000.00000  5050.00000  3.503226824575e-04
5050.00000  5100.00000  3.682632163058e-04
5100.00000  5150.00000  3.603539486952e-04
5150.00000  5200.00000  3.709639418313e-04
5200.00000  5250.00000  3.781015735774e-04
5250.00000  5300.00000  3.856250232558e-04
5300.00000  5350.00000  3.881328398152e-04
5350.00000  5400.00000  3.925697460357e-04
5400.00000  5450.00000  4.218919088846e-04
5450.00000  5500.00000  3.792590273741e-04
5500.00000  5550.00000  4.103173709180e-04
5550.00000  5600.00000  4.186124564607e-04
5600.00000  5650.00000  4.037584660702e-04
5650.00000  5700.00000  4.024081033074e-04
5700.00000  5750.00000  3.981641060530e-04
5750.00000  5800.00000  4.076166453924e-04
5800.00000  5850.00000  4.074237364263e-04
5850.00000  5900.00000  4.355884454785e-04
5900.00000  5950.00000  4.272933599357e-04
5950.00000  6000.00000  4.218919088846e-04
6000.00000  6050.00000  4.139826412741e-04
6050.00000  6100.00000  4.261359061390e-04
6100.00000  6150.00000  4.487062551740e-04
6150.00000  6200.00000  4.240139075118e-04
6200.00000  6250.00000  5.077363988040e-04
6250.00000  6300.00000  5.783410804006e-04
6300.00000  6350.00000  5.600147286200e-04
6350.00000  6400.00000  2.799494916202e-03
6400.00000  6450.00000  3.923768370696e-04
6450.00000  6500.00000  4.151400950707e-04
6500.00000  6550.00000  4.066521005618e-04
6550.00000  6600.00000  3.941130177646e-04
6600.00000  6650.00000  4.105102798841e-04
6650.00000  6700.00000  4.035655571041e-04
6700.00000  6750.00000  3.977782881207e-04
6750.00000  6800.00000  4.083882812568e-04
6800.00000  6850.00000  4.037584660702e-04
6850.00000  6900.00000  4.047230109007e-04
6900.00000  6950.00000  4.029868302057e-04
6950.00000  7000.00000  3.900619294763e-04
7000.00000  7050.00000  3.960421074257e-04
7050.00000  7100.00000  6.230959605383e-04
7100.00000  7150.00000  2.297545786381e-04
7150.00000  7200.00000  2.260893082820e-04
7200.00000  7250.00000  2.222311289598e-04
7250.00000  7300.00000  2.160580420442e-04
7300.00000  7350.00000  2.303333055365e-04
7350.00000  7400.00000  2.191445855020e-04
7400.00000  7450.00000  2.206878572309e-04
7450.00000  7500.00000  2.997805333364e-04
7500.00000  7550.00000  2.289829427737e-04
7550.00000  7600.00000  2.274396710448e-04
7600.00000  7650.00000  2.141289523831e-04
7650.00000  7700.00000  2.177942227392e-04
7700.00000  7750.00000  2.266680351803e-04
7750.00000  7800.00000  2.141289523831e-04
7800.00000  7850.00000  2.195304034342e-04
7850.00000  7900.00000  2.204949482648e-04
7900.00000  7950.00000  2.239673096548e-04
7950.00000  8000.00000  2.289829427737e-04
8000.00000  8050.00000  2.162509510104e-04
8050.00000  8100.00000  2.162509510104e-04
8100.00000  8150.00000  2.162509510104e-04
8150.00000  8200.00000  2.183729496376e-04
8200.00000  8250.00000  2.247389455192e-04
8250.00000  8300.00000  2.417149345370e-04
8300.00000  8350.00000  2.257034903498e-04
8350.00000  8400.00000  1.959955095687e-04
8400.00000  8450.00000  2.164438599765e-04
8450.00000  8500.00000  2.239673096548e-04
8500.00000  8550.00000  2.149005882476e-04
8550.00000  8600.00000  2.052551399420e-04
8600.00000  8650.00000  2.135502254848e-04
8650.00000  8700.00000  2.114282268576e-04
8700.00000  8750.00000  2.135502254848e-04
8750.00000  8800.00000  2.112353178915e-04
8800.00000  8850.00000  2.060267758065e-04
8850.00000  8900.00000  2.094991371965e-04
8900.00000  8950.00000  2.089204102981e-04
8950.00000  9000.00000  2.044835040776e-04
9000.00000  9050.00000  2.147076792815e-04
9050.00000  9100.00000  2.102707730609e-04
9100.00000  9150.00000  2.062196847726e-04
9150.00000  9200.00000  2.143218613492e-04
9200.00000  9250.00000  2.056409578743e-04
9250.00000  9300.00000  1.986962350943e-04
9300.00000  9350.00000  2.000465978570e-04
9350.00000  9400.00000  1.975387812976e-04
9400.00000  9450.00000  2.006253247554e-04
9450.00000  9500.00000  2.100778640948e-04
9500.00000  9550.00000  1.981175081959e-04
9550.00000  9600.00000  1.919444212804e-04
9600.00000  9650.00000  1.973458723315e-04
9650.00000  9700.00000  1.934876930093e-04
9700.00000  9750.00000  1.971529633654e-04
9750.00000  9800.00000  1.849996985004e-04
9800.00000  9850.00000  2.062196847726e-04
9850.00000  9900.00000  1.907869674837e-04
9900.00000  9950.00000  1.975387812976e-04
9950.00000  10000.00000  1.811415191782e-04
