300.00000  350.00000  4.673723230327e-01
350.00000  400.00000  3.500429673678e-01
400.00000  450.00000  2.719394842549e-01
450.00000  500.00000  2.179224846050e-01
500.00000  550.00000  1.781696701896e-01
550.00000  600.00000  1.484076443913e-01
600.00000  650.00000  1.251556068488e-01
650.00000  700.00000  1.075015987845e-01
700.00000  750.00000  9.331638204753e-02
750.00000  800.00000  8.147547434646e-02
800.00000  850.00000  7.177144690910e-02
850.00000  900.00000  6.405327703289e-02
900.00000  950.00000  5.733003744296e-02
950.00000  1000.00000  5.142341217724e-02
1000.00000  1050.00000  4.629300721167e-02
1050.00000  1100.00000  4.234785752861e-02
1100.00000  1150.00000  3.870984799245e-02
1150.00000  1200.00000  3.537206431078e-02
1200.00000  1250.00000  3.239127646335e-02
1250.00000  1300.00000  3.009027273252e-02
1300.00000  1350.00000  2.771903434724e-02
1350.00000  1400.00000  2.583907463295e-02
1400.00000  1450.00000  2.405445937184e-02
1450.00000  1500.00000  2.233316447276e-02
1500.00000  1550.00000  2.087679614589e-02
1550.00000  1600.00000  1.960711371400e-02
1600.00000  1650.00000  1.829230642639e-02
1650.00000  1700.00000  1.717983316921e-02
1700.00000  1750.00000  1.633738122601e-02
1750.00000  1800.00000  1.543779539292e-02
1800.00000  1850.00000  1.460516902314e-02
1850.00000  1900.00000  1.380565847488e-02
1900.00000  1950.00000  1.311277359373e-02
1950.00000  2000.00000  1.252978957083e-02
2000.00000  2050.00000  1.191769273780e-02
2050.00000  2100.00000  1.126301841994e-02
2100.00000  2150.00000  1.068804041983e-02
2150.00000  2200.00000  1.026190166152e-02
2200.00000  2250.00000  9.773898181676e-03
2250.00000  2300.00000  9.343392501844e-03
2300.00000  2350.00000  8.956556037211e-03
2350.00000  2400.00000  8.537695481432e-03
2400.00000  2450.00000  8.241108728209e-03
2450.00000  2500.00000  7.902308400294e-03
2500.00000  2550.00000  7.532211801487e-03
2550.00000  2600.00000  7.352076288793e-03
2600.00000  2650.00000  6.964875914033e-03
2650.00000  2700.00000  6.737795995001e-03
2700.00000  2750.00000  6.426652836711e-03
2750.00000  2800.00000  6.234508289838e-03
2800.00000  2850.00000  6.055464507524e-03
2850.00000  2900.00000  5.821106385959e-03
2900.00000  2950.00000  5.568188847934e-03
2950.00000  3000.00000  5.339289378269e-03
3000.00000  3050.00000  5.278880297244e-03
3050.00000  3100.00000  5.067084603532e-03
3100.00000  3150.00000  4.931710036416e-03
3150.00000  3200.00000  4.731195556630e-03
3200.00000  3250.00000  4.666783464212e-03
3250.00000  3300.00000  4.547420942670e-03
3300.00000  3350.00000  4.340719990730e-03
3350.00000  3400.00000  4.223904840074e-03
3400.00000  3450.00000  4.116551352711e-03
3450.00000  3500.00000  4.041585866620e-03
3500.00000  3550.00000  3.943694042550e-03
3550.00000  3600.00000  3.799585632395e-03
3600.00000  3650.00000  3.639465176668e-03
3650.00000  3700.00000  3.564135780450e-03
3700.00000  3750.00000  3.358162648764e-03
3750.00000  3800.00000  3.340331052558e-03
3800.00000  3850.00000  3.250809161401e-03
3850.00000  3900.00000  3.165290281637e-03
3900.00000  3950.00000  3.095783447446e-03
3950.00000  4000.00000  3.020454051229e-03
4000.00000  4050.00000  2.964047981598e-03
4050.00000  4100.00000  2.906914091713e-03
4100.00000  4150.00000  2.795193682830e-03
4150.00000  4200.00000  2.711130443573e-03
4200.00000  4250.00000  2.681653723314e-03
4250.00000  4300.00000  2.682745453694e-03
4300.00000  4350.00000  2.536817492906e-03
4350.00000  4400.00000  2.493876097961e-03
4400.00000  4450.00000  2.428008365036e-03
4450.00000  4500.00000  2.431647466303e-03
4500.00000  4550.00000  2.253695414369e-03
4550.00000  4600.00000  2.293361618174e-03
4600.00000  4650.00000  2.259517976395e-03
4650.00000  4700.00000  2.185644220685e-03
4700.00000  4750.00000  2.117956937127e-03
4750.00000  4800.00000  2.077562913068e-03
4800.00000  4850.00000  2.089208037121e-03
4850.00000  4900.00000  1.968753785199e-03
4900.00000  4950.00000  1.953105649753e-03
4950.00000  5000.00000  1.928359761140e-03
5000.00000  5050.00000  1.850482994036e-03
5050.00000  5100.00000  1.902886052274e-03
5100.00000  5150.00000  1.802446857318e-03
5150.00000  5200.00000  1.764964114272e-03
5200.00000  5250.00000  1.754046810473e-03
5250.00000  5300.00000  1.733667843380e-03
5300.00000  5350.00000  1.704555033248e-03
5350.00000  5400.00000  1.643054221843e-03
5400.00000  5450.00000  1.555715791446e-03
5450.00000  5500.00000  1.574275207906e-03
5500.00000  5550.00000  1.593198534492e-03
5550.00000  5600.00000  1.516413497768e-03
5600.00000  5650.00000  1.500401452195e-03
5650.00000  5700.00000  1.479294664849e-03
5700.00000  5750.00000  1.461826978770e-03
5750.00000  5800.00000  1.438172820537e-03
5800.00000  5850.00000  1.403601358505e-03
5850.00000  5900.00000  1.405056999011e-03
5900.00000  5950.00000  1.330819333174e-03
5950.00000  6000.00000  1.327908052161e-03
6000.00000  6050.00000  1.331183243301e-03
6050.00000  6100.00000  1.302070433168e-03
6100.00000  6150.00000  1.251123015437e-03
6150.00000  6200.00000  1.222374115431e-03
6200.00000  6250.00000  1.224921486318e-03
6250.00000  6300.00000  1.232563598977e-03
6300.00000  6350.00000  1.174701888839e-03
6350.00000  6400.00000  1.353017850900e-03
6400.00000  6450.00000  1.150319910354e-03
6450.00000  6500.00000  1.136855235667e-03
6500.00000  6550.00000  1.115748448321e-03
6550.00000  6600.00000  1.078629615403e-03
6600.00000  6650.00000  1.052064176157e-03
6650.00000  6700.00000  1.084816087556e-03
6700.00000  6750.00000  1.055703277424e-03
6750.00000  6800.00000  1.002572398932e-03
6800.00000  6850.00000  1.031685209064e-03
6850.00000  6900.00000  9.956581065256e-04
6900.00000  6950.00000  9.901994546258e-04
6950.00000  7000.00000  9.625422850001e-04
7000.00000  7050.00000  9.669092065199e-04
7050.00000  7100.00000  9.650896558867e-04
7100.00000  7150.00000  9.097753166352e-04
7150.00000  7200.00000  9.461663293007e-04
7200.00000  7250.00000  9.046805748621e-04
7250.00000  7300.00000  8.912159001759e-04
7300.00000  7350.00000  8.755677647298e-04
7350.00000  7400.00000  8.941271811891e-04
7400.00000  7450.00000  8.413602128243e-04
7450.00000  7500.00000  8.424519432042e-04
7500.00000  7550.00000  8.024218292723e-04
7550.00000  7600.00000  7.911406153460e-04
7600.00000  7650.00000  8.067887507921e-04
7650.00000  7700.00000  7.896849748394e-04
7700.00000  7750.00000  7.660308166069e-04
7750.00000  7800.00000  7.562052431872e-04
7800.00000  7850.00000  7.667586368602e-04
7850.00000  7900.00000  7.689420976201e-04
7900.00000  7950.00000  7.194503203952e-04
7950.00000  8000.00000  7.623917153403e-04
8000.00000  8050.00000  7.118082077354e-04
8050.00000  8100.00000  7.489270406541e-04
8100.00000  8150.00000  7.092608368488e-04
8150.00000  8200.00000  7.074412862156e-04
8200.00000  8250.00000  7.005269938091e-04
8250.00000  8300.00000  6.885179596296e-04
8300.00000  8350.00000  6.688668127902e-04
8350.00000  8400.00000  6.746893748167e-04
8400.00000  8450.00000  6.750532849434e-04
8450.00000  8500.00000  6.615886102572e-04
8500.00000  8550.00000  6.637720710171e-04
8550.00000  8600.00000  6.226502267052e-04
8600.00000  8650.00000  6.175554849320e-04
8650.00000  8700.00000  6.372066317713e-04
8700.00000  8750.00000  6.131885634122e-04
8750.00000  8800.00000  5.982682482193e-04
8800.00000  8850.00000  5.968126077127e-04
8850.00000  8900.00000  6.062742710057e-04
8900.00000  8950.00000  5.848035735331e-04
8950.00000  9000.00000  6.215584963252e-04
9000.00000  9050.00000  5.636967861872e-04
9050.00000  9100.00000  5.596937747940e-04
9100.00000  9150.00000  5.491403811210e-04
9150.00000  9200.00000  5.516877520076e-04
9200.00000  9250.00000  5.444095494745e-04
9250.00000  9300.00000  5.364035266881e-04
9300.00000  9350.00000  5.425899988413e-04
9350.00000  9400.00000  5.123854583290e-04
9400.00000  9450.00000  5.258501330152e-04
9450.00000  9500.00000  5.160245595955e-04
9500.00000  9550.00000  5.091102671891e-04
9550.00000  9600.00000  5.047433456692e-04
9600.00000  9650.00000  4.792696368034e-04
9650.00000  9700.00000  4.985568735161e-04
9700.00000  9750.00000  4.799974570568e-04
9750.00000  9800.00000  4.647132317373e-04
9800.00000  9850.00000  4.756305355369e-04
9850.00000  9900.00000  4.690801532571e-04
9900.00000  9950.00000  4.548876583176e-04
9950.00000  10000.00000  4.647132317373e-04
