300.00000  350.00000  4.137242535811e-01
350.00000  400.00000  3.101283680758e-01
400.00000  450.00000  2.408596625351e-01
450.00000  500.00000  1.919786236055e-01
500.00000  550.00000  1.572884731711e-01
550.00000  600.00000  1.309131268575e-01
600.00000  650.00000  1.108271104166e-01
650.00000  700.00000  9.525556299879e-02
700.00000  750.00000  8.208807602765e-02
750.00000  800.00000  7.174018022993e-02
800.00000  850.00000  6.349812255160e-02
850.00000  900.00000  5.587460007057e-02
900.00000  950.00000  5.029673802347e-02
950.00000  1000.00000  4.517135123154e-02
1000.00000  1050.00000  4.093682270715e-02
1050.00000  1100.00000  3.716924255216e-02
1100.00000  1150.00000  3.393945285196e-02
1150.00000  1200.00000  3.125735626366e-02
1200.00000  1250.00000  2.872989347468e-02
1250.00000  1300.00000  2.680649276879e-02
1300.00000  1350.00000  2.463324040684e-02
1350.00000  1400.00000  2.300158721395e-02
1400.00000  1450.00000  2.156303583452e-02
1450.00000  1500.00000  2.036214822547e-02
1500.00000  1550.00000  1.908622894532e-02
1550.00000  1600.00000  1.790895536474e-02
1600.00000  1650.00000  1.687146159784e-02
1650.00000  1700.00000  1.623883415774e-02
1700.00000  1750.00000  1.562106070329e-02
1750.00000  1800.00000  1.485208129236e-02
1800.00000  1850.00000  1.414137520975e-02
1850.00000  1900.00000  1.351865042675e-02
1900.00000  1950.00000  1.302504105747e-02
1950.00000  2000.00000  1.239165187452e-02
2000.00000  2050.00000  1.221835537528e-02
2050.00000  2100.00000  1.172207990601e-02
2100.00000  2150.00000  1.147717957851e-02
2150.00000  2200.00000  1.113668052285e-02
2200.00000  2250.00000  1.081751026710e-02
2250.00000  2300.00000  1.043663884019e-02
2300.00000  2350.00000  1.024886922672e-02
2350.00000  2400.00000  9.866474314106e-03
2400.00000  2450.00000  9.590723401023e-03
2450.00000  2500.00000  9.326398630748e-03
2500.00000  2550.00000  9.023224974927e-03
2550.00000  2600.00000  8.843453661426e-03
2600.00000  2650.00000  8.657588405093e-03
2650.00000  2700.00000  8.429065548947e-03
2700.00000  2750.00000  8.287762249564e-03
2750.00000  2800.00000  8.035625364949e-03
2800.00000  2850.00000  7.813577323061e-03
2850.00000  2900.00000  7.751114409047e-03
2900.00000  2950.00000  7.546205581370e-03
2950.00000  3000.00000  7.467365195999e-03
3000.00000  3050.00000  7.268931182579e-03
3050.00000  3100.00000  7.102109497593e-03
3100.00000  3150.00000  6.979849769554e-03
3150.00000  3200.00000  6.803506298895e-03
3200.00000  3250.00000  6.600501828352e-03
3250.00000  3300.00000  6.416540929154e-03
3300.00000  3350.00000  6.339985772345e-03
3350.00000  3400.00000  6.111843787626e-03
3400.00000  3450.00000  6.068043573532e-03
3450.00000  3500.00000  5.862373003000e-03
3500.00000  3550.00000  5.809051003233e-03
3550.00000  3600.00000  5.743160246377e-03
3600.00000  3650.00000  5.652893718200e-03
3650.00000  3700.00000  5.487595518921e-03
3700.00000  3750.00000  5.309728562554e-03
3750.00000  3800.00000  5.249170005675e-03
3800.00000  3850.00000  5.089204006373e-03
3850.00000  3900.00000  5.042356820863e-03
3900.00000  3950.00000  4.891150864379e-03
3950.00000  4000.00000  4.856872435958e-03
4000.00000  4050.00000  4.688908136690e-03
4050.00000  4100.00000  4.589881565694e-03
4100.00000  4150.00000  4.506851594627e-03
4150.00000  4200.00000  4.484380180439e-03
4200.00000  4250.00000  4.311845424049e-03
4250.00000  4300.00000  4.264998238539e-03
4300.00000  4350.00000  4.208248395930e-03
4350.00000  4400.00000  4.047139782347e-03
4400.00000  4450.00000  3.925641797162e-03
4450.00000  4500.00000  3.926403540016e-03
4500.00000  4550.00000  3.873843283103e-03
4550.00000  4600.00000  3.760343597883e-03
4600.00000  4650.00000  3.710449440958e-03
4650.00000  4700.00000  3.590094070055e-03
4700.00000  4750.00000  3.570288755855e-03
4750.00000  4800.00000  3.514300656099e-03
4800.00000  4850.00000  3.434317656448e-03
4850.00000  4900.00000  3.357381628213e-03
4900.00000  4950.00000  3.283111699965e-03
4950.00000  5000.00000  3.267495971462e-03
5000.00000  5050.00000  3.228266214490e-03
5050.00000  5100.00000  3.147902343412e-03
5100.00000  5150.00000  3.083154200837e-03
5150.00000  5200.00000  3.043543572439e-03
5200.00000  5250.00000  2.938803930038e-03
5250.00000  5300.00000  2.889671515967e-03
5300.00000  5350.00000  2.846252173299e-03
5350.00000  5400.00000  2.839396487615e-03
5400.00000  5450.00000  2.755604773695e-03
5450.00000  5500.00000  2.740750788045e-03
5500.00000  5550.00000  2.679430488313e-03
5550.00000  5600.00000  2.639058117060e-03
5600.00000  5650.00000  2.617729317153e-03
5650.00000  5700.00000  2.468046846377e-03
5700.00000  5750.00000  2.469189460658e-03
5750.00000  5800.00000  2.502706146226e-03
5800.00000  5850.00000  2.381969903896e-03
5850.00000  5900.00000  2.410916132341e-03
5900.00000  5950.00000  2.265042375834e-03
5950.00000  6000.00000  2.276468518642e-03
6000.00000  6050.00000  2.266184990115e-03
6050.00000  6100.00000  2.253616233027e-03
6100.00000  6150.00000  2.198770747552e-03
6150.00000  6200.00000  2.111170319363e-03
6200.00000  6250.00000  2.085651933760e-03
6250.00000  6300.00000  2.038043005396e-03
6300.00000  6350.00000  2.106218990813e-03
6350.00000  6400.00000  2.206007304663e-03
6400.00000  6450.00000  1.997670634143e-03
6450.00000  6500.00000  1.986625362763e-03
6500.00000  6550.00000  1.919211120200e-03
6550.00000  6600.00000  1.861699534737e-03
6600.00000  6650.00000  1.854843849052e-03
6650.00000  6700.00000  1.824755006326e-03
6700.00000  6750.00000  1.769147777997e-03
6750.00000  6800.00000  1.768766906570e-03
6800.00000  6850.00000  1.749723335225e-03
6850.00000  6900.00000  1.713540549669e-03
6900.00000  6950.00000  1.692592621188e-03
6950.00000  7000.00000  1.677357764112e-03
7000.00000  7050.00000  1.679642992674e-03
7050.00000  7100.00000  1.669359464147e-03
7100.00000  7150.00000  1.509393464845e-03
7150.00000  7200.00000  1.541005793278e-03
7200.00000  7250.00000  1.547099736109e-03
7250.00000  7300.00000  1.489588150645e-03
7300.00000  7350.00000  1.488826407792e-03
7350.00000  7400.00000  1.467878479312e-03
7400.00000  7450.00000  1.436647022305e-03
7450.00000  7500.00000  1.414175608117e-03
7500.00000  7550.00000  1.352855308385e-03
7550.00000  7600.00000  1.346761365554e-03
7600.00000  7650.00000  1.339524808443e-03
7650.00000  7700.00000  1.326956051355e-03
7700.00000  7750.00000  1.317815137109e-03
7750.00000  7800.00000  1.268682723038e-03
7800.00000  7850.00000  1.325051694220e-03
7850.00000  7900.00000  1.253066994534e-03
7900.00000  7950.00000  1.231357323200e-03
7950.00000  8000.00000  1.234785166043e-03
8000.00000  8050.00000  1.235166037469e-03
8050.00000  8100.00000  1.204696323317e-03
8100.00000  8150.00000  1.174607480591e-03
8150.00000  8200.00000  1.161657852076e-03
8200.00000  8250.00000  1.159372623514e-03
8250.00000  8300.00000  1.106812366601e-03
8300.00000  8350.00000  1.142233409303e-03
8350.00000  8400.00000  1.095005352367e-03
8400.00000  8450.00000  1.085483566694e-03
8450.00000  8500.00000  1.090054023817e-03
8500.00000  8550.00000  1.002453595627e-03
8550.00000  8600.00000  1.039017252611e-03
8600.00000  8650.00000  1.065678252494e-03
8650.00000  8700.00000  1.047015552576e-03
8700.00000  8750.00000  1.047015552576e-03
8750.00000  8800.00000  9.936935528084e-04
8800.00000  8850.00000  9.723647529015e-04
8850.00000  8900.00000  9.571298958251e-04
8900.00000  8950.00000  9.632238386556e-04
8950.00000  9000.00000  9.700795243400e-04
9000.00000  9050.00000  9.411332958949e-04
9050.00000  9100.00000  9.304688959414e-04
9100.00000  9150.00000  9.179001388533e-04
9150.00000  9200.00000  9.083783531806e-04
9200.00000  9250.00000  9.156149102919e-04
9250.00000  9300.00000  8.870495532736e-04
9300.00000  9350.00000  9.003800532155e-04
9350.00000  9400.00000  9.068548674729e-04
9400.00000  9450.00000  8.782895104547e-04
9450.00000  9500.00000  8.619120390976e-04
9500.00000  9550.00000  8.356319106408e-04
9550.00000  9600.00000  8.310614535178e-04
9600.00000  9650.00000  8.184926964298e-04
9650.00000  9700.00000  8.127796250261e-04
9700.00000  9750.00000  8.421067248982e-04
9750.00000  9800.00000  8.024960964996e-04
9800.00000  9850.00000  7.914508251192e-04
9850.00000  9900.00000  7.682176680777e-04
9900.00000  9950.00000  7.552680395627e-04
9950.00000  10000.00000  7.697411537853e-04
