300.00000  350.00000  3.604146897839e-04
350.00000  400.00000  3.288125666713e-04
400.00000  450.00000  2.475499643819e-04
450.00000  500.00000  2.091759577452e-04
500.00000  550.00000  1.550008895522e-04
550.00000  600.00000  1.008258213592e-04
600.00000  650.00000  8.728205431093e-05
650.00000  700.00000  7.975773928412e-05
700.00000  750.00000  6.621397223588e-05
750.00000  800.00000  6.546154073320e-05
800.00000  850.00000  7.674801327340e-05
850.00000  900.00000  5.793722570639e-05
900.00000  950.00000  5.417506819299e-05
950.00000  1000.00000  3.536428062598e-05
1000.00000  1050.00000  4.665075316619e-05
1050.00000  1100.00000  3.837400663670e-05
1100.00000  1150.00000  2.859239710186e-05
1150.00000  1200.00000  3.160212311258e-05
1200.00000  1250.00000  3.160212311258e-05
1250.00000  1300.00000  4.288859565278e-05
1300.00000  1350.00000  2.633510259381e-05
1350.00000  1400.00000  3.009726010722e-05
1400.00000  1450.00000  2.783996559918e-05
1450.00000  1500.00000  3.536428062598e-05
1500.00000  1550.00000  4.439345865814e-05
1550.00000  1600.00000  6.245181472247e-05
1600.00000  1650.00000  6.546154073320e-05
1650.00000  1700.00000  8.051017078680e-05
1700.00000  1750.00000  1.196366089262e-04
1750.00000  1800.00000  1.249036294449e-04
1800.00000  1850.00000  1.203890404289e-04
1850.00000  1900.00000  1.188841774235e-04
1900.00000  1950.00000  1.595154785682e-04
1950.00000  2000.00000  1.858505811621e-04
2000.00000  2050.00000  1.963846221996e-04
2050.00000  2100.00000  2.039089372264e-04
2100.00000  2150.00000  2.287391768148e-04
2150.00000  2200.00000  2.121856837559e-04
2200.00000  2250.00000  2.911909915373e-04
2250.00000  2300.00000  2.686180464569e-04
2300.00000  2350.00000  3.212882516445e-04
2350.00000  2400.00000  3.145163681204e-04
2400.00000  2450.00000  3.122590736124e-04
2450.00000  2500.00000  2.926958545427e-04
2500.00000  2550.00000  2.919434230400e-04
2550.00000  2600.00000  2.821618135052e-04
2600.00000  2650.00000  2.738850669757e-04
2650.00000  2700.00000  2.874288340239e-04
2700.00000  2750.00000  3.498806487464e-04
2750.00000  2800.00000  2.708753409649e-04
2800.00000  2850.00000  2.836666765105e-04
2850.00000  2900.00000  2.829142450078e-04
2900.00000  2950.00000  2.957055805534e-04
2950.00000  3000.00000  3.039823270829e-04
3000.00000  3050.00000  2.708753409649e-04
3050.00000  3100.00000  2.415305123604e-04
3100.00000  3150.00000  2.595888684247e-04
3150.00000  3200.00000  2.949531490507e-04
3200.00000  3250.00000  2.543218479060e-04
3250.00000  3300.00000  2.814093820025e-04
3300.00000  3350.00000  2.490548273872e-04
3350.00000  3400.00000  2.452926698738e-04
3400.00000  3450.00000  2.370159233443e-04
3450.00000  3500.00000  2.340061973336e-04
3500.00000  3550.00000  1.888603071728e-04
3550.00000  3600.00000  2.332537658309e-04
3600.00000  3650.00000  1.858505811621e-04
3650.00000  3700.00000  2.340061973336e-04
3700.00000  3750.00000  2.091759577452e-04
3750.00000  3800.00000  1.896127386755e-04
3800.00000  3850.00000  2.121856837559e-04
3850.00000  3900.00000  1.783262661353e-04
3900.00000  3950.00000  1.632776360816e-04
3950.00000  4000.00000  1.640300675843e-04
4000.00000  4050.00000  2.039089372264e-04
4050.00000  4100.00000  1.753165401245e-04
4100.00000  4150.00000  1.647824990870e-04
4150.00000  4200.00000  1.542484580495e-04
4200.00000  4250.00000  1.677922250977e-04
4250.00000  4300.00000  1.783262661353e-04
4300.00000  4350.00000  1.542484580495e-04
4350.00000  4400.00000  1.279133554557e-04
4400.00000  4450.00000  1.452192800173e-04
4450.00000  4500.00000  1.286657869584e-04
4500.00000  4550.00000  1.369425334878e-04
4550.00000  4600.00000  1.354376704825e-04
4600.00000  4650.00000  1.188841774235e-04
4650.00000  4700.00000  1.106074308940e-04
4700.00000  4750.00000  1.098549993913e-04
4750.00000  4800.00000  1.369425334878e-04
4800.00000  4850.00000  1.354376704825e-04
4850.00000  4900.00000  1.256560609476e-04
4900.00000  4950.00000  1.181317459208e-04
4950.00000  5000.00000  1.226463349369e-04
5000.00000  5050.00000  9.706366384577e-05
5050.00000  5100.00000  1.256560609476e-04
5100.00000  5150.00000  1.008258213592e-04
5150.00000  5200.00000  1.075977048833e-04
5200.00000  5250.00000  8.728205431093e-05
5250.00000  5300.00000  9.932095835381e-05
5300.00000  5350.00000  9.405393783505e-05
5350.00000  5400.00000  1.158744514128e-04
5400.00000  5450.00000  1.015782528619e-04
5450.00000  5500.00000  9.104421182433e-05
5500.00000  5550.00000  8.051017078680e-05
5550.00000  5600.00000  8.502475980289e-05
5600.00000  5650.00000  8.427232830021e-05
5650.00000  5700.00000  8.502475980289e-05
5700.00000  5750.00000  8.878691731629e-05
5750.00000  5800.00000  9.856852685113e-05
5800.00000  5850.00000  8.803448581361e-05
5850.00000  5900.00000  9.856852685113e-05
5900.00000  5950.00000  7.825287627876e-05
5950.00000  6000.00000  7.223342425732e-05
6000.00000  6050.00000  8.427232830021e-05
6050.00000  6100.00000  7.825287627876e-05
6100.00000  6150.00000  8.427232830021e-05
6150.00000  6200.00000  8.201503379217e-05
6200.00000  6250.00000  1.038355473699e-04
6250.00000  6300.00000  1.143695884074e-04
6300.00000  6350.00000  1.098549993913e-04
6350.00000  6400.00000  4.890804767423e-04
6400.00000  6450.00000  7.900530778144e-05
6450.00000  6500.00000  7.825287627876e-05
6500.00000  6550.00000  6.997612974928e-05
6550.00000  6600.00000  6.696640373856e-05
6600.00000  6650.00000  7.298585576000e-05
6650.00000  6700.00000  7.825287627876e-05
6700.00000  6750.00000  7.148099275464e-05
6750.00000  6800.00000  6.997612974928e-05
6800.00000  6850.00000  7.373828726268e-05
6850.00000  6900.00000  5.041291067959e-05
6900.00000  6950.00000  6.621397223588e-05
6950.00000  7000.00000  6.169938321979e-05
7000.00000  7050.00000  7.449071876536e-05
7050.00000  7100.00000  1.000733898565e-04
7100.00000  7150.00000  3.762157513402e-05
7150.00000  7200.00000  3.310698611794e-05
7200.00000  7250.00000  3.611671212866e-05
7250.00000  7300.00000  3.987886964206e-05
7300.00000  7350.00000  3.084969160990e-05
7350.00000  7400.00000  3.084969160990e-05
7400.00000  7450.00000  4.213616415010e-05
7450.00000  7500.00000  5.417506819299e-05
7500.00000  7550.00000  3.762157513402e-05
7550.00000  7600.00000  3.084969160990e-05
7600.00000  7650.00000  5.191777368495e-05
7650.00000  7700.00000  3.461184912330e-05
7700.00000  7750.00000  4.138373264742e-05
7750.00000  7800.00000  2.558267109113e-05
7800.00000  7850.00000  3.762157513402e-05
7850.00000  7900.00000  3.310698611794e-05
7900.00000  7950.00000  3.310698611794e-05
7950.00000  8000.00000  2.708753409649e-05
8000.00000  8050.00000  3.611671212866e-05
8050.00000  8100.00000  2.558267109113e-05
8100.00000  8150.00000  3.310698611794e-05
8150.00000  8200.00000  3.310698611794e-05
8200.00000  8250.00000  2.407780808577e-05
8250.00000  8300.00000  3.837400663670e-05
8300.00000  8350.00000  3.611671212866e-05
8350.00000  8400.00000  2.332537658309e-05
8400.00000  8450.00000  3.385941762062e-05
8450.00000  8500.00000  3.385941762062e-05
8500.00000  8550.00000  2.257294508041e-05
8550.00000  8600.00000  4.288859565278e-05
8600.00000  8650.00000  2.708753409649e-05
8650.00000  8700.00000  3.084969160990e-05
8700.00000  8750.00000  2.633510259381e-05
8750.00000  8800.00000  3.009726010722e-05
8800.00000  8850.00000  2.708753409649e-05
8850.00000  8900.00000  3.009726010722e-05
8900.00000  8950.00000  3.385941762062e-05
8950.00000  9000.00000  3.160212311258e-05
9000.00000  9050.00000  3.385941762062e-05
9050.00000  9100.00000  2.633510259381e-05
9100.00000  9150.00000  3.536428062598e-05
9150.00000  9200.00000  2.182051357773e-05
9200.00000  9250.00000  3.536428062598e-05
9250.00000  9300.00000  2.558267109113e-05
9300.00000  9350.00000  3.385941762062e-05
9350.00000  9400.00000  1.881078756701e-05
9400.00000  9450.00000  2.483023958845e-05
9450.00000  9500.00000  2.783996559918e-05
9500.00000  9550.00000  3.160212311258e-05
9550.00000  9600.00000  2.483023958845e-05
9600.00000  9650.00000  3.084969160990e-05
9650.00000  9700.00000  2.783996559918e-05
9700.00000  9750.00000  3.987886964206e-05
9750.00000  9800.00000  1.805835606433e-05
9800.00000  9850.00000  3.912643813938e-05
9850.00000  9900.00000  2.708753409649e-05
9900.00000  9950.00000  1.730592456165e-05
9950.00000  10000.00000  3.084969160990e-05
