300.00000  350.00000  0.000000000000e+00
350.00000  400.00000  0.000000000000e+00
400.00000  450.00000  0.000000000000e+00
450.00000  500.00000  2.007684420550e-07
500.00000  550.00000  1.405379094385e-06
550.00000  600.00000  0.000000000000e+00
600.00000  650.00000  1.405379094385e-06
650.00000  700.00000  0.000000000000e+00
700.00000  750.00000  0.000000000000e+00
750.00000  800.00000  2.007684420550e-07
800.00000  850.00000  4.216137283156e-06
850.00000  900.00000  0.000000000000e+00
900.00000  950.00000  0.000000000000e+00
950.00000  1000.00000  2.007684420550e-07
1000.00000  1050.00000  2.007684420550e-07
1050.00000  1100.00000  0.000000000000e+00
1100.00000  1150.00000  6.023053261651e-07
1150.00000  1200.00000  4.015368841101e-07
1200.00000  1250.00000  1.204610652330e-06
1250.00000  1300.00000  8.432274566312e-06
1300.00000  1350.00000  6.023053261651e-07
1350.00000  1400.00000  6.023053261651e-07
1400.00000  1450.00000  1.405379094385e-06
1450.00000  1500.00000  3.613831956991e-06
1500.00000  1550.00000  1.405379094385e-06
1550.00000  1600.00000  2.609989746716e-06
1600.00000  1650.00000  2.609989746716e-06
1650.00000  1700.00000  2.810758188771e-06
1700.00000  1750.00000  2.891065565593e-05
1750.00000  1800.00000  3.212295072881e-06
1800.00000  1850.00000  5.019211051376e-06
1850.00000  1900.00000  2.810758188771e-06
1900.00000  1950.00000  6.223821703706e-06
1950.00000  2000.00000  5.420747935486e-06
2000.00000  2050.00000  6.826127029871e-06
2050.00000  2100.00000  6.424590145761e-06
2100.00000  2150.00000  6.826127029871e-06
2150.00000  2200.00000  6.826127029871e-06
2200.00000  2250.00000  8.432274566312e-06
2250.00000  2300.00000  8.231506124257e-06
2300.00000  2350.00000  5.541209000719e-05
2350.00000  2400.00000  6.826127029871e-06
2400.00000  2450.00000  8.432274566312e-06
2450.00000  2500.00000  7.829969240147e-06
2500.00000  2550.00000  8.633043008367e-06
2550.00000  2600.00000  8.633043008367e-06
2600.00000  2650.00000  8.231506124257e-06
2650.00000  2700.00000  7.629200798092e-06
2700.00000  2750.00000  8.833811450422e-06
2750.00000  2800.00000  1.164456963919e-05
2800.00000  2850.00000  1.385302250180e-05
2850.00000  2900.00000  1.124303275508e-05
2900.00000  2950.00000  1.525840159618e-05
2950.00000  3000.00000  2.670220279332e-05
3000.00000  3050.00000  1.124303275508e-05
3050.00000  3100.00000  1.184533808125e-05
3100.00000  3150.00000  1.064072742892e-05
3150.00000  3200.00000  1.304994873358e-05
3200.00000  3250.00000  1.525840159618e-05
3250.00000  3300.00000  1.385302250180e-05
3300.00000  3350.00000  1.505763315413e-05
3350.00000  3400.00000  1.786839134290e-05
3400.00000  3450.00000  1.806915978495e-05
3450.00000  3500.00000  1.907300199523e-05
3500.00000  3550.00000  2.148222329989e-05
3550.00000  3600.00000  2.047838108961e-05
3600.00000  3650.00000  2.810758188771e-05
3650.00000  3700.00000  4.858596297732e-05
3700.00000  3750.00000  3.453217203347e-05
3750.00000  3800.00000  3.593755112785e-05
3800.00000  3850.00000  3.533524580169e-05
3850.00000  3900.00000  4.436982569416e-05
3900.00000  3950.00000  4.376752036800e-05
3950.00000  4000.00000  5.561285844925e-05
4000.00000  4050.00000  5.922669040624e-05
4050.00000  4100.00000  6.143514326884e-05
4100.00000  4150.00000  6.484820678378e-05
4150.00000  4200.00000  7.508739732859e-05
4200.00000  4250.00000  7.689431330708e-05
4250.00000  4300.00000  8.412197722106e-05
4300.00000  4350.00000  9.094810425093e-05
4350.00000  4400.00000  1.009865263537e-04
4400.00000  4450.00000  1.056042005210e-04
4450.00000  4500.00000  1.126310959929e-04
4500.00000  4550.00000  1.321056348722e-04
4550.00000  4600.00000  1.375263828077e-04
4600.00000  4650.00000  1.377271512498e-04
4650.00000  4700.00000  1.541901634983e-04
4700.00000  4750.00000  1.656339646954e-04
4750.00000  4800.00000  1.640278171590e-04
4800.00000  4850.00000  1.812939031757e-04
4850.00000  4900.00000  1.965523047719e-04
4900.00000  4950.00000  2.039807371279e-04
4950.00000  5000.00000  1.971546100981e-04
5000.00000  5050.00000  2.083976428531e-04
5050.00000  5100.00000  2.148222329989e-04
5100.00000  5150.00000  2.194399071662e-04
5150.00000  5200.00000  2.365052247408e-04
5200.00000  5250.00000  2.628058906501e-04
5250.00000  5300.00000  2.523659316632e-04
5300.00000  5350.00000  2.517636263370e-04
5350.00000  5400.00000  2.768596815939e-04
5400.00000  5450.00000  3.027588106190e-04
5450.00000  5500.00000  2.864965668125e-04
5500.00000  5550.00000  2.881027143490e-04
5550.00000  5600.00000  3.103880114171e-04
5600.00000  5650.00000  3.200248966357e-04
5650.00000  5700.00000  3.196233597516e-04
5700.00000  5750.00000  3.160095277946e-04
5750.00000  5800.00000  3.409048146095e-04
5800.00000  5850.00000  3.479317100814e-04
5850.00000  5900.00000  3.625878063514e-04
5900.00000  5950.00000  3.702170071495e-04
5950.00000  6000.00000  3.455224887767e-04
6000.00000  6050.00000  3.380940564207e-04
6050.00000  6100.00000  3.583716690683e-04
6100.00000  6150.00000  3.941084517541e-04
6150.00000  6200.00000  3.784485132738e-04
6200.00000  6250.00000  4.268337078090e-04
6250.00000  6300.00000  4.954965149918e-04
6300.00000  6350.00000  5.041295580002e-04
6350.00000  6400.00000  2.356820741284e-03
6400.00000  6450.00000  3.910969251232e-04
6450.00000  6500.00000  3.890892407027e-04
6500.00000  6550.00000  3.910969251232e-04
6550.00000  6600.00000  4.009345787839e-04
6600.00000  6650.00000  3.812592714625e-04
6650.00000  6700.00000  3.784485132738e-04
6700.00000  6750.00000  3.975215152690e-04
6750.00000  6800.00000  3.884869353765e-04
6800.00000  6850.00000  3.866800193980e-04
6850.00000  6900.00000  4.067568636035e-04
6900.00000  6950.00000  3.987261259213e-04
6950.00000  7000.00000  4.047491791830e-04
7000.00000  7050.00000  4.011353472260e-04
7050.00000  7100.00000  6.067222318903e-04
7100.00000  7150.00000  1.760739236823e-04
7150.00000  7200.00000  1.612170589702e-04
7200.00000  7250.00000  1.644293540431e-04
7250.00000  7300.00000  1.774793027767e-04
7300.00000  7350.00000  1.784831449869e-04
7350.00000  7400.00000  1.692477966524e-04
7400.00000  7450.00000  1.913323252785e-04
7450.00000  7500.00000  2.505590156847e-04
7500.00000  7550.00000  1.746685445879e-04
7550.00000  7600.00000  1.875177248794e-04
7600.00000  7650.00000  1.822977453860e-04
7650.00000  7700.00000  1.816954400598e-04
7700.00000  7750.00000  1.931392412570e-04
7750.00000  7800.00000  1.857108089009e-04
7800.00000  7850.00000  1.921353990467e-04
7850.00000  7900.00000  1.947453887934e-04
7900.00000  7950.00000  1.957492310037e-04
7950.00000  8000.00000  1.959499994457e-04
8000.00000  8050.00000  2.021738211494e-04
8050.00000  8100.00000  1.963515363298e-04
8100.00000  8150.00000  1.955484625616e-04
8150.00000  8200.00000  2.011699789392e-04
8200.00000  8250.00000  2.045830424541e-04
8250.00000  8300.00000  2.164283805353e-04
8300.00000  8350.00000  2.057876531064e-04
8350.00000  8400.00000  1.979576838663e-04
8400.00000  8450.00000  1.826992822701e-04
8450.00000  8500.00000  2.045830424541e-04
8500.00000  8550.00000  1.969538416560e-04
8550.00000  8600.00000  1.951469256775e-04
8600.00000  8650.00000  1.859115773430e-04
8650.00000  8700.00000  1.957492310037e-04
8700.00000  8750.00000  2.079961059690e-04
8750.00000  8800.00000  2.150230014410e-04
8800.00000  8850.00000  2.085984112952e-04
8850.00000  8900.00000  2.124130116942e-04
8900.00000  8950.00000  2.045830424541e-04
8950.00000  9000.00000  2.116099379260e-04
9000.00000  9050.00000  1.891238724159e-04
9050.00000  9100.00000  1.949461572354e-04
9100.00000  9150.00000  2.041815055700e-04
9150.00000  9200.00000  1.999653682868e-04
9200.00000  9250.00000  2.069922637588e-04
9250.00000  9300.00000  2.037799686859e-04
9300.00000  9350.00000  2.116099379260e-04
9350.00000  9400.00000  1.951469256775e-04
9400.00000  9450.00000  2.031776633597e-04
9450.00000  9500.00000  2.114091694840e-04
9500.00000  9550.00000  2.053861162223e-04
9550.00000  9600.00000  2.035792002438e-04
9600.00000  9650.00000  1.991622945186e-04
9650.00000  9700.00000  2.110076325999e-04
9700.00000  9750.00000  2.049845793382e-04
9750.00000  9800.00000  2.061891899905e-04
9800.00000  9850.00000  1.915330937205e-04
9850.00000  9900.00000  1.937415465831e-04
9900.00000  9950.00000  1.927377043728e-04
9950.00000  10000.00000  1.947453887934e-04
