10001.00000  11001.00000  1.954256406177e-04
11001.00000  12001.00000  1.750853026153e-04
12001.00000  13001.00000  1.570629518496e-04
13001.00000  14001.00000  1.376498087419e-04
14001.00000  15001.00000  1.225539168626e-04
15001.00000  16001.00000  1.087715510841e-04
16001.00000  17001.00000  9.850479928141e-05
17001.00000  18001.00000  8.605527616407e-05
18001.00000  19001.00000  7.719863326368e-05
19001.00000  20001.00000  6.959756678320e-05
20001.00000  21001.00000  6.292369519741e-05
21001.00000  22001.00000  5.713838538570e-05
22001.00000  23001.00000  5.096674436788e-05
23001.00000  24001.00000  4.778917019751e-05
24001.00000  25001.00000  4.372303425306e-05
25001.00000  26001.00000  4.082555020713e-05
26001.00000  27001.00000  3.785079991998e-05
27001.00000  28001.00000  3.458630122823e-05
28001.00000  29001.00000  3.181437482429e-05
29001.00000  30001.00000  2.963160350969e-05
30001.00000  31001.00000  2.779653028060e-05
31001.00000  32001.00000  2.574897488815e-05
32001.00000  33001.00000  2.486041311406e-05
33001.00000  34001.00000  2.335372141018e-05
34001.00000  35001.00000  2.139309053910e-05
35001.00000  36001.00000  1.955801731002e-05
36001.00000  37001.00000  1.904612846190e-05
37001.00000  38001.00000  1.748148707710e-05
38001.00000  39001.00000  1.774226064123e-05
39001.00000  40001.00000  1.680540746638e-05
40001.00000  41001.00000  1.515384156020e-05
41001.00000  42001.00000  1.477716863423e-05
42001.00000  43001.00000  1.408177246321e-05
43001.00000  44001.00000  1.285517088377e-05
44001.00000  45001.00000  1.296141196545e-05
45001.00000  46001.00000  1.133882089973e-05
46001.00000  47001.00000  1.174446866616e-05
47001.00000  48001.00000  1.114565529667e-05
48001.00000  49001.00000  9.977003398146e-06
49001.00000  50001.00000  9.609988752329e-06
50001.00000  51001.00000  9.300923787430e-06
51001.00000  52001.00000  8.489628254570e-06
52001.00000  53001.00000  8.692452137785e-06
53001.00000  54001.00000  8.170905009518e-06
54001.00000  55001.00000  7.900473165231e-06
55001.00000  56001.00000  7.659016161404e-06
56001.00000  57001.00000  6.789770947625e-06
57001.00000  58001.00000  7.282343235433e-06
58001.00000  59001.00000  6.268223819358e-06
59001.00000  60001.00000  6.712504706400e-06
60001.00000  61001.00000  6.924986869768e-06
61001.00000  62001.00000  5.949500574306e-06
62001.00000  63001.00000  5.794968091856e-06
63001.00000  64001.00000  5.370003765120e-06
64001.00000  65001.00000  5.002989119303e-06
65001.00000  66001.00000  5.138205041446e-06
66001.00000  67001.00000  4.587683072720e-06
67001.00000  68001.00000  4.693924154404e-06
68001.00000  69001.00000  4.761532115475e-06
69001.00000  70001.00000  4.201351866596e-06
70001.00000  71001.00000  3.921261742156e-06
71001.00000  72001.00000  4.008186263534e-06
72001.00000  73001.00000  3.892286901697e-06
73001.00000  74001.00000  3.757070979554e-06
74001.00000  75001.00000  3.843995500931e-06
75001.00000  76001.00000  3.448006014655e-06
76001.00000  77001.00000  3.370739773430e-06
77001.00000  78001.00000  3.380398053583e-06
78001.00000  79001.00000  3.206549010827e-06
79001.00000  80001.00000  3.312790092511e-06
80001.00000  81001.00000  3.419031174195e-06
81001.00000  82001.00000  2.820217804703e-06
82001.00000  83001.00000  2.771926403938e-06
83001.00000  84001.00000  2.627052201642e-06
84001.00000  85001.00000  2.511152839804e-06
85001.00000  86001.00000  2.646368761948e-06
86001.00000  87001.00000  2.414570038274e-06
87001.00000  88001.00000  2.404911758120e-06
88001.00000  89001.00000  2.298670676436e-06
89001.00000  90001.00000  2.269695835977e-06
90001.00000  91001.00000  2.163454754293e-06
91001.00000  92001.00000  1.921997750466e-06
92001.00000  93001.00000  2.211746155059e-06
93001.00000  94001.00000  1.757806987863e-06
94001.00000  95001.00000  1.786781828322e-06
95001.00000  96001.00000  2.066871952762e-06
96001.00000  97001.00000  1.728832147404e-06
97001.00000  98001.00000  1.603274505414e-06
98001.00000  99001.00000  1.574299664954e-06
99001.00000  100001.00000  1.583957945107e-06
100001.00000  101001.00000  1.912339470313e-06
101001.00000  102001.00000  1.255576419902e-06
102001.00000  103001.00000  1.468058583270e-06
103001.00000  104001.00000  1.294209540515e-06
104001.00000  105001.00000  1.342500941280e-06
105001.00000  106001.00000  1.371475781739e-06
106001.00000  107001.00000  1.284551260362e-06
107001.00000  108001.00000  1.468058583270e-06
108001.00000  109001.00000  1.255576419902e-06
109001.00000  110001.00000  1.284551260362e-06
110001.00000  111001.00000  1.072069096993e-06
111001.00000  112001.00000  1.120360497759e-06
112001.00000  113001.00000  1.139677058065e-06
113001.00000  114001.00000  1.004461135922e-06
114001.00000  115001.00000  1.062410816840e-06
115001.00000  116001.00000  8.499286534723e-07
116001.00000  117001.00000  1.033435976381e-06
117001.00000  118001.00000  1.062410816840e-06
118001.00000  119001.00000  1.062410816840e-06
119001.00000  120001.00000  8.982200542378e-07
120001.00000  121001.00000  7.726624122475e-07
121001.00000  122001.00000  8.789034939316e-07
122001.00000  123001.00000  7.243710114821e-07
123001.00000  124001.00000  7.823206924006e-07
124001.00000  125001.00000  6.374464901042e-07
125001.00000  126001.00000  7.533458519413e-07
126001.00000  127001.00000  7.147127313290e-07
127001.00000  128001.00000  5.891550893387e-07
128001.00000  129001.00000  6.664213305635e-07
129001.00000  130001.00000  5.601802488795e-07
130001.00000  131001.00000  4.635974473485e-07
131001.00000  132001.00000  6.374464901042e-07
132001.00000  133001.00000  6.277882099511e-07
133001.00000  134001.00000  6.953961710228e-07
134001.00000  135001.00000  5.022305679609e-07
135001.00000  136001.00000  6.277882099511e-07
136001.00000  137001.00000  3.863312061238e-07
137001.00000  138001.00000  4.829140076547e-07
138001.00000  139001.00000  5.215471282671e-07
139001.00000  140001.00000  3.670146458176e-07
140001.00000  141001.00000  4.732557275016e-07
141001.00000  142001.00000  5.312054084202e-07
142001.00000  143001.00000  4.635974473485e-07
143001.00000  144001.00000  3.380398053583e-07
144001.00000  145001.00000  3.670146458176e-07
145001.00000  146001.00000  4.153060465830e-07
146001.00000  147001.00000  5.118888481140e-07
147001.00000  148001.00000  3.959894862769e-07
148001.00000  149001.00000  3.090649648990e-07
149001.00000  150001.00000  3.863312061238e-07
150001.00000  151001.00000  3.670146458176e-07
151001.00000  152001.00000  3.766729259707e-07
152001.00000  153001.00000  3.670146458176e-07
153001.00000  154001.00000  2.221404435212e-07
154001.00000  155001.00000  3.766729259707e-07
155001.00000  156001.00000  3.670146458176e-07
156001.00000  157001.00000  3.670146458176e-07
157001.00000  158001.00000  2.994066847459e-07
158001.00000  159001.00000  2.414570038274e-07
159001.00000  160001.00000  2.221404435212e-07
160001.00000  161001.00000  2.511152839804e-07
161001.00000  162001.00000  2.124821633681e-07
162001.00000  163001.00000  1.738490427557e-07
163001.00000  164001.00000  2.221404435212e-07
164001.00000  165001.00000  2.124821633681e-07
165001.00000  166001.00000  2.317987236743e-07
166001.00000  167001.00000  1.738490427557e-07
167001.00000  168001.00000  2.317987236743e-07
168001.00000  169001.00000  2.028238832150e-07
169001.00000  170001.00000  1.352159221433e-07
170001.00000  171001.00000  2.511152839804e-07
171001.00000  172001.00000  1.448742022964e-07
172001.00000  173001.00000  1.738490427557e-07
173001.00000  174001.00000  1.255576419902e-07
174001.00000  175001.00000  1.738490427557e-07
175001.00000  176001.00000  1.545324824495e-07
176001.00000  177001.00000  1.545324824495e-07
177001.00000  178001.00000  1.255576419902e-07
178001.00000  179001.00000  1.255576419902e-07
179001.00000  180001.00000  1.545324824495e-07
180001.00000  181001.00000  1.641907626026e-07
181001.00000  182001.00000  1.158993618371e-07
182001.00000  183001.00000  1.062410816840e-07
183001.00000  184001.00000  7.726624122475e-08
184001.00000  185001.00000  1.255576419902e-07
185001.00000  186001.00000  1.545324824495e-07
186001.00000  187001.00000  1.158993618371e-07
187001.00000  188001.00000  1.062410816840e-07
188001.00000  189001.00000  1.352159221433e-07
189001.00000  190001.00000  8.692452137785e-08
190001.00000  191001.00000  3.863312061238e-08
191001.00000  192001.00000  7.726624122475e-08
192001.00000  193001.00000  3.863312061238e-08
193001.00000  194001.00000  8.692452137785e-08
194001.00000  195001.00000  9.658280153094e-09
195001.00000  196001.00000  3.863312061238e-08
196001.00000  197001.00000  2.897484045928e-08
197001.00000  198001.00000  9.658280153094e-09
198001.00000  199001.00000  0.000000000000e+00
