10001.00000  11001.00000  5.619424408810e-04
11001.00000  12001.00000  4.895071080680e-04
12001.00000  13001.00000  4.229988281661e-04
13001.00000  14001.00000  3.748595935465e-04
14001.00000  15001.00000  3.362421935223e-04
15001.00000  16001.00000  2.997354025835e-04
16001.00000  17001.00000  2.704567249510e-04
17001.00000  18001.00000  2.423249079631e-04
18001.00000  19001.00000  2.232523263190e-04
19001.00000  20001.00000  2.038327952362e-04
20001.00000  21001.00000  1.871503097254e-04
21001.00000  22001.00000  1.753636662940e-04
22001.00000  23001.00000  1.613700389331e-04
23001.00000  24001.00000  1.502965693479e-04
24001.00000  25001.00000  1.392809246692e-04
25001.00000  26001.00000  1.299711147308e-04
26001.00000  27001.00000  1.227333639401e-04
27001.00000  28001.00000  1.147728018188e-04
28001.00000  29001.00000  1.085469868910e-04
29001.00000  30001.00000  1.007213495515e-04
30001.00000  31001.00000  9.522798343873e-05
31001.00000  32001.00000  9.075619067327e-05
32001.00000  33001.00000  8.525318707611e-05
33001.00000  34001.00000  8.161021796976e-05
34001.00000  35001.00000  7.840093566178e-05
35001.00000  36001.00000  7.496999121242e-05
36001.00000  37001.00000  7.122100977758e-05
37001.00000  38001.00000  6.684559185619e-05
38001.00000  39001.00000  6.408927131541e-05
39001.00000  40001.00000  6.165098776010e-05
40001.00000  41001.00000  5.887539225050e-05
41001.00000  42001.00000  5.628290894466e-05
42001.00000  43001.00000  5.465417407965e-05
43001.00000  44001.00000  5.121359214588e-05
44001.00000  45001.00000  4.992216923516e-05
45001.00000  46001.00000  4.652013723902e-05
46001.00000  47001.00000  4.634666251967e-05
47001.00000  48001.00000  4.565276364227e-05
48001.00000  49001.00000  4.205798195796e-05
49001.00000  50001.00000  4.191341969184e-05
50001.00000  51001.00000  3.975462318437e-05
51001.00000  52001.00000  3.715250239412e-05
52001.00000  53001.00000  3.756691422368e-05
53001.00000  54001.00000  3.607310414039e-05
54001.00000  55001.00000  3.461784399473e-05
55001.00000  56001.00000  3.278672195715e-05
56001.00000  57001.00000  3.224702283028e-05
57001.00000  58001.00000  3.234339767436e-05
58001.00000  59001.00000  3.006895135400e-05
59001.00000  60001.00000  3.121581199859e-05
60001.00000  61001.00000  2.791979233094e-05
61001.00000  62001.00000  2.728371835999e-05
62001.00000  63001.00000  2.705241873419e-05
63001.00000  64001.00000  2.560679607294e-05
64001.00000  65001.00000  2.480688486705e-05
65001.00000  66001.00000  2.506709694607e-05
66001.00000  67001.00000  2.395878623911e-05
67001.00000  68001.00000  2.236860131174e-05
68001.00000  69001.00000  2.220476407680e-05
69001.00000  70001.00000  2.184817715369e-05
70001.00000  71001.00000  2.113500330747e-05
71001.00000  72001.00000  2.115427827629e-05
72001.00000  73001.00000  1.952554341128e-05
73001.00000  74001.00000  1.977611800590e-05
74001.00000  75001.00000  1.863889484571e-05
75001.00000  76001.00000  1.917859397258e-05
76001.00000  77001.00000  1.804137081240e-05
77001.00000  78001.00000  1.815702062530e-05
78001.00000  79001.00000  1.718363470006e-05
79001.00000  80001.00000  1.675958538609e-05
80001.00000  81001.00000  1.646082336943e-05
81001.00000  82001.00000  1.548743744419e-05
82001.00000  83001.00000  1.534287517807e-05
83001.00000  84001.00000  1.498628825496e-05
84001.00000  85001.00000  1.510193806786e-05
85001.00000  86001.00000  1.507302561463e-05
86001.00000  87001.00000  1.510193806786e-05
87001.00000  88001.00000  1.480317605120e-05
88001.00000  89001.00000  1.392616497004e-05
89001.00000  90001.00000  1.324190357705e-05
90001.00000  91001.00000  1.276002935663e-05
91001.00000  92001.00000  1.338646584317e-05
92001.00000  93001.00000  1.255764218406e-05
93001.00000  94001.00000  1.239380494912e-05
94001.00000  95001.00000  1.193120569752e-05
95001.00000  96001.00000  1.218178029213e-05
96001.00000  97001.00000  1.120839436689e-05
97001.00000  98001.00000  1.107346958517e-05
98001.00000  99001.00000  1.076507008411e-05
99001.00000  100001.00000  1.051449548949e-05
100001.00000  101001.00000  1.051449548949e-05
101001.00000  102001.00000  1.050485800508e-05
102001.00000  103001.00000  1.022537095724e-05
103001.00000  104001.00000  1.034102077014e-05
104001.00000  105001.00000  1.028319586369e-05
105001.00000  106001.00000  9.782046674457e-06
106001.00000  107001.00000  9.849509065316e-06
107001.00000  108001.00000  9.049597859424e-06
108001.00000  109001.00000  9.184522641141e-06
109001.00000  110001.00000  9.261622516407e-06
110001.00000  111001.00000  8.567723639007e-06
111001.00000  112001.00000  7.979837090099e-06
112001.00000  113001.00000  8.346061497616e-06
113001.00000  114001.00000  8.268961622349e-06
114001.00000  115001.00000  8.278599106757e-06
115001.00000  116001.00000  8.230411684716e-06
116001.00000  117001.00000  8.297874075574e-06
117001.00000  118001.00000  7.709987526666e-06
118001.00000  119001.00000  7.363038087966e-06
119001.00000  120001.00000  7.729262495483e-06
120001.00000  121001.00000  7.632887651399e-06
121001.00000  122001.00000  7.893099730424e-06
122001.00000  123001.00000  7.343763119149e-06
123001.00000  124001.00000  7.131738462166e-06
124001.00000  125001.00000  6.447477069174e-06
125001.00000  126001.00000  6.688414179383e-06
126001.00000  127001.00000  6.563126882074e-06
127001.00000  128001.00000  6.042702724024e-06
128001.00000  129001.00000  6.013790270799e-06
129001.00000  130001.00000  5.743940707366e-06
130001.00000  131001.00000  6.495664491216e-06
131001.00000  132001.00000  6.023427755208e-06
132001.00000  133001.00000  5.927052911124e-06
133001.00000  134001.00000  5.512641081566e-06
134001.00000  135001.00000  6.090890146066e-06
135001.00000  136001.00000  5.946327879941e-06
136001.00000  137001.00000  5.859590520266e-06
137001.00000  138001.00000  5.503003597158e-06
138001.00000  139001.00000  5.474091143933e-06
139001.00000  140001.00000  5.618653410058e-06
140001.00000  141001.00000  5.088591767599e-06
141001.00000  142001.00000  5.156054158458e-06
142001.00000  143001.00000  5.271703971358e-06
143001.00000  144001.00000  5.001854407924e-06
144001.00000  145001.00000  5.165691642866e-06
145001.00000  146001.00000  4.799467235350e-06
146001.00000  147001.00000  4.953666985883e-06
147001.00000  148001.00000  5.136779189641e-06
148001.00000  149001.00000  4.847654657391e-06
149001.00000  150001.00000  4.751279813308e-06
150001.00000  151001.00000  4.635630000408e-06
151001.00000  152001.00000  4.587442578366e-06
152001.00000  153001.00000  4.067018420316e-06
153001.00000  154001.00000  4.433242827833e-06
154001.00000  155001.00000  4.385055405791e-06
155001.00000  156001.00000  4.462155281058e-06
156001.00000  157001.00000  4.038105967091e-06
157001.00000  158001.00000  4.259768108483e-06
158001.00000  159001.00000  4.288680561708e-06
159001.00000  160001.00000  4.038105967091e-06
160001.00000  161001.00000  3.806806341291e-06
161001.00000  162001.00000  3.642969106350e-06
162001.00000  163001.00000  3.556231746675e-06
163001.00000  164001.00000  3.363482058508e-06
164001.00000  165001.00000  3.739343950433e-06
165001.00000  166001.00000  3.498406840225e-06
166001.00000  167001.00000  3.575506715491e-06
167001.00000  168001.00000  3.710431497208e-06
168001.00000  169001.00000  3.392394511733e-06
169001.00000  170001.00000  3.440581933775e-06
170001.00000  171001.00000  3.209282307975e-06
171001.00000  172001.00000  3.363482058508e-06
172001.00000  173001.00000  3.411669480550e-06
173001.00000  174001.00000  3.257469730016e-06
174001.00000  175001.00000  3.199644823566e-06
175001.00000  176001.00000  2.987620166583e-06
176001.00000  177001.00000  2.997257650991e-06
177001.00000  178001.00000  3.180369854750e-06
178001.00000  179001.00000  2.929795260133e-06
179001.00000  180001.00000  3.180369854750e-06
180001.00000  181001.00000  2.679220665516e-06
181001.00000  182001.00000  3.228557276791e-06
182001.00000  183001.00000  2.631033243475e-06
183001.00000  184001.00000  2.871970353683e-06
184001.00000  185001.00000  2.785232994008e-06
185001.00000  186001.00000  2.650308212291e-06
186001.00000  187001.00000  2.708133118741e-06
187001.00000  188001.00000  2.881607838091e-06
188001.00000  189001.00000  2.717770603150e-06
189001.00000  190001.00000  2.862332869275e-06
190001.00000  191001.00000  2.717770603150e-06
191001.00000  192001.00000  2.871970353683e-06
192001.00000  193001.00000  2.621395759066e-06
193001.00000  194001.00000  2.765958025191e-06
194001.00000  195001.00000  2.602120790250e-06
195001.00000  196001.00000  2.399733617675e-06
196001.00000  197001.00000  2.399733617675e-06
197001.00000  198001.00000  2.370821164450e-06
198001.00000  199001.00000  2.284083804775e-06
