10001.00000  11001.00000  3.482738717663e-04
11001.00000  12001.00000  3.279927018814e-04
12001.00000  13001.00000  3.083641438987e-04
13001.00000  14001.00000  2.806532385114e-04
14001.00000  15001.00000  2.563660355651e-04
15001.00000  16001.00000  2.337254226490e-04
16001.00000  17001.00000  2.104924389294e-04
17001.00000  18001.00000  1.925004307938e-04
18001.00000  19001.00000  1.733738819667e-04
19001.00000  20001.00000  1.572895086223e-04
20001.00000  21001.00000  1.431127700691e-04
21001.00000  22001.00000  1.327111403658e-04
22001.00000  23001.00000  1.190263707850e-04
23001.00000  24001.00000  1.108335813661e-04
24001.00000  25001.00000  1.021889837073e-04
25001.00000  26001.00000  9.355442623152e-05
26001.00000  27001.00000  8.573312358778e-05
27001.00000  28001.00000  7.920700456540e-05
28001.00000  29001.00000  7.290176957148e-05
29001.00000  30001.00000  6.807244149492e-05
30001.00000  31001.00000  6.202825126189e-05
31001.00000  32001.00000  5.768085197468e-05
32001.00000  33001.00000  5.543185095774e-05
33001.00000  34001.00000  4.967882603494e-05
34001.00000  35001.00000  4.817279856823e-05
35001.00000  36001.00000  4.435752898592e-05
36001.00000  37001.00000  4.118483112274e-05
37001.00000  38001.00000  3.866474516179e-05
38001.00000  39001.00000  3.545188656616e-05
39001.00000  40001.00000  3.509043997415e-05
40001.00000  41001.00000  3.232938961853e-05
41001.00000  42001.00000  2.993982603803e-05
42001.00000  43001.00000  2.790166886643e-05
43001.00000  44001.00000  2.655628432951e-05
44001.00000  45001.00000  2.429724312946e-05
45001.00000  46001.00000  2.521089979259e-05
46001.00000  47001.00000  2.159643387250e-05
47001.00000  48001.00000  2.081329958982e-05
48001.00000  49001.00000  1.956831688401e-05
49001.00000  50001.00000  1.805224923420e-05
50001.00000  51001.00000  1.681730671150e-05
51001.00000  52001.00000  1.623497609105e-05
52001.00000  53001.00000  1.505023448391e-05
53001.00000  54001.00000  1.547192217458e-05
54001.00000  55001.00000  1.415665818700e-05
55001.00000  56001.00000  1.387553305988e-05
56001.00000  57001.00000  1.226910376206e-05
57001.00000  58001.00000  1.181729552205e-05
58001.00000  59001.00000  1.108436215493e-05
59001.00000  60001.00000  1.065263428114e-05
60001.00000  61001.00000  9.698816885560e-06
61001.00000  62001.00000  9.658656153114e-06
62001.00000  63001.00000  9.267089011772e-06
63001.00000  64001.00000  8.935762969097e-06
64001.00000  65001.00000  8.664678025091e-06
65001.00000  66001.00000  8.002025939742e-06
66001.00000  67001.00000  7.660659713956e-06
67001.00000  68001.00000  6.465877923706e-06
68001.00000  69001.00000  7.560257882843e-06
69001.00000  70001.00000  6.757043233935e-06
70001.00000  71001.00000  5.803225838358e-06
71001.00000  72001.00000  5.803225838358e-06
72001.00000  73001.00000  5.732944556578e-06
73001.00000  74001.00000  5.120493386786e-06
74001.00000  75001.00000  5.120493386786e-06
75001.00000  76001.00000  4.939770090782e-06
76001.00000  77001.00000  5.030131738784e-06
77001.00000  78001.00000  4.377519836547e-06
78001.00000  79001.00000  4.357439470324e-06
79001.00000  80001.00000  4.327318920990e-06
80001.00000  81001.00000  3.905631230313e-06
81001.00000  82001.00000  3.744988300532e-06
82001.00000  83001.00000  3.534144455194e-06
83001.00000  84001.00000  3.433742624080e-06
84001.00000  85001.00000  3.333340792967e-06
85001.00000  86001.00000  3.092376398294e-06
86001.00000  87001.00000  2.520085960948e-06
87001.00000  88001.00000  2.650608341395e-06
88001.00000  89001.00000  2.801211088065e-06
89001.00000  90001.00000  2.510045777836e-06
90001.00000  91001.00000  2.570286876504e-06
91001.00000  92001.00000  2.249001016941e-06
92001.00000  93001.00000  2.379523397389e-06
93001.00000  94001.00000  2.399603763612e-06
94001.00000  95001.00000  1.827313326265e-06
95001.00000  96001.00000  2.249001016941e-06
96001.00000  97001.00000  2.018076805380e-06
97001.00000  98001.00000  1.706831128929e-06
98001.00000  99001.00000  1.807232960042e-06
99001.00000  100001.00000  1.626509664038e-06
100001.00000  101001.00000  1.797192776931e-06
101001.00000  102001.00000  1.526107832924e-06
102001.00000  103001.00000  1.465866734256e-06
103001.00000  104001.00000  1.355424720032e-06
104001.00000  105001.00000  1.355424720032e-06
105001.00000  106001.00000  1.415665818700e-06
106001.00000  107001.00000  1.365464903143e-06
107001.00000  108001.00000  1.335344353809e-06
108001.00000  109001.00000  1.164661240916e-06
109001.00000  110001.00000  1.375505086254e-06
110001.00000  111001.00000  1.004018311135e-06
111001.00000  112001.00000  9.939781280232e-07
112001.00000  113001.00000  9.638575786892e-07
113001.00000  114001.00000  9.839379449118e-07
114001.00000  115001.00000  9.839379449118e-07
115001.00000  116001.00000  1.074299592914e-06
116001.00000  117001.00000  8.032146489076e-07
117001.00000  118001.00000  8.433753813530e-07
118001.00000  119001.00000  7.831342826849e-07
119001.00000  120001.00000  7.228931840169e-07
120001.00000  121001.00000  8.333351982417e-07
121001.00000  122001.00000  8.132548320190e-07
122001.00000  123001.00000  6.325315360148e-07
123001.00000  124001.00000  6.526119022374e-07
124001.00000  125001.00000  5.722904373467e-07
125001.00000  126001.00000  5.622502542353e-07
126001.00000  127001.00000  6.626520853488e-07
127001.00000  128001.00000  4.919689724559e-07
128001.00000  129001.00000  4.919689724559e-07
129001.00000  130001.00000  5.421698880126e-07
130001.00000  131001.00000  6.124511697921e-07
131001.00000  132001.00000  5.220895217900e-07
132001.00000  133001.00000  3.714867751198e-07
133001.00000  134001.00000  3.714867751198e-07
134001.00000  135001.00000  4.216876906765e-07
135001.00000  136001.00000  4.518082400105e-07
136001.00000  137001.00000  4.819287893446e-07
137001.00000  138001.00000  4.317278737878e-07
138001.00000  139001.00000  4.016073244538e-07
139001.00000  140001.00000  2.911653102290e-07
140001.00000  141001.00000  3.514064088971e-07
141001.00000  142001.00000  4.116475075652e-07
142001.00000  143001.00000  3.514064088971e-07
143001.00000  144001.00000  2.208840284496e-07
144001.00000  145001.00000  2.710849440063e-07
145001.00000  146001.00000  3.815269582311e-07
146001.00000  147001.00000  3.313260426744e-07
147001.00000  148001.00000  2.409643946723e-07
148001.00000  149001.00000  3.212858595631e-07
149001.00000  150001.00000  3.915671413425e-07
150001.00000  151001.00000  1.706831128929e-07
151001.00000  152001.00000  1.907634791156e-07
152001.00000  153001.00000  1.807232960042e-07
153001.00000  154001.00000  1.907634791156e-07
154001.00000  155001.00000  2.008036622269e-07
155001.00000  156001.00000  2.008036622269e-07
156001.00000  157001.00000  2.309242115609e-07
157001.00000  158001.00000  2.008036622269e-07
158001.00000  159001.00000  1.807232960042e-07
159001.00000  160001.00000  2.208840284496e-07
160001.00000  161001.00000  2.108438453383e-07
161001.00000  162001.00000  2.008036622269e-07
162001.00000  163001.00000  2.208840284496e-07
163001.00000  164001.00000  1.706831128929e-07
164001.00000  165001.00000  1.706831128929e-07
165001.00000  166001.00000  1.104420142248e-07
166001.00000  167001.00000  1.305223804475e-07
167001.00000  168001.00000  1.506027466702e-07
168001.00000  169001.00000  1.004018311135e-07
169001.00000  170001.00000  1.004018311135e-07
170001.00000  171001.00000  4.016073244538e-08
171001.00000  172001.00000  1.204821973361e-07
172001.00000  173001.00000  1.204821973361e-07
173001.00000  174001.00000  1.907634791156e-07
174001.00000  175001.00000  8.032146489076e-08
175001.00000  176001.00000  1.204821973361e-07
176001.00000  177001.00000  9.036164800211e-08
177001.00000  178001.00000  1.104420142248e-07
178001.00000  179001.00000  9.036164800211e-08
179001.00000  180001.00000  9.036164800211e-08
180001.00000  181001.00000  1.104420142248e-07
181001.00000  182001.00000  9.036164800211e-08
182001.00000  183001.00000  5.020091555673e-08
183001.00000  184001.00000  1.104420142248e-07
184001.00000  185001.00000  7.028128177942e-08
185001.00000  186001.00000  6.024109866807e-08
186001.00000  187001.00000  8.032146489076e-08
187001.00000  188001.00000  5.020091555673e-08
188001.00000  189001.00000  8.032146489076e-08
189001.00000  190001.00000  1.305223804475e-07
190001.00000  191001.00000  4.016073244538e-08
191001.00000  192001.00000  8.032146489076e-08
192001.00000  193001.00000  5.020091555673e-08
193001.00000  194001.00000  6.024109866807e-08
194001.00000  195001.00000  4.016073244538e-08
195001.00000  196001.00000  1.004018311135e-07
196001.00000  197001.00000  6.024109866807e-08
197001.00000  198001.00000  2.008036622269e-08
198001.00000  199001.00000  5.020091555673e-08
