10001.00000  11001.00000  3.235818325418e-05
11001.00000  12001.00000  3.305733513613e-05
12001.00000  13001.00000  3.393575673140e-05
13001.00000  14001.00000  3.526235260996e-05
14001.00000  15001.00000  3.588979660658e-05
15001.00000  16001.00000  3.354136336209e-05
16001.00000  17001.00000  3.269879570949e-05
17001.00000  18001.00000  3.286013845148e-05
18001.00000  19001.00000  3.268086873816e-05
19001.00000  20001.00000  3.056548612099e-05
20001.00000  21001.00000  3.002767698103e-05
21001.00000  22001.00000  2.809156407718e-05
22001.00000  23001.00000  2.694423791193e-05
23001.00000  24001.00000  2.472129346677e-05
24001.00000  25001.00000  2.201432079564e-05
25001.00000  26001.00000  2.056223611776e-05
26001.00000  27001.00000  1.934320206718e-05
27001.00000  28001.00000  1.747879704866e-05
28001.00000  29001.00000  1.685135305204e-05
29001.00000  30001.00000  1.625976299809e-05
30001.00000  31001.00000  1.505865591884e-05
31001.00000  32001.00000  1.426986918024e-05
32001.00000  33001.00000  1.278193055969e-05
33001.00000  34001.00000  1.256680690370e-05
34001.00000  35001.00000  1.089959856983e-05
35001.00000  36001.00000  1.066654794251e-05
36001.00000  37001.00000  9.662637547925e-06
37001.00000  38001.00000  9.949469089236e-06
38001.00000  39001.00000  8.945558694647e-06
39001.00000  40001.00000  7.654816758746e-06
40001.00000  41001.00000  7.314204303439e-06
41001.00000  42001.00000  7.314204303439e-06
42001.00000  43001.00000  6.005535396206e-06
43001.00000  44001.00000  6.256512994853e-06
44001.00000  45001.00000  5.862119625550e-06
45001.00000  46001.00000  5.324310485591e-06
46001.00000  47001.00000  4.911990144956e-06
47001.00000  48001.00000  5.162967743604e-06
48001.00000  49001.00000  4.696866488973e-06
49001.00000  50001.00000  4.804428316965e-06
50001.00000  51001.00000  4.392107976330e-06
51001.00000  52001.00000  4.051495521022e-06
52001.00000  53001.00000  3.692956094383e-06
53001.00000  54001.00000  3.459905467068e-06
54001.00000  55001.00000  3.531613352396e-06
55001.00000  56001.00000  3.334416667744e-06
56001.00000  57001.00000  2.957950269773e-06
57001.00000  58001.00000  3.280635753748e-06
58001.00000  59001.00000  2.653191757130e-06
59001.00000  60001.00000  2.348433244486e-06
60001.00000  61001.00000  2.706972671126e-06
61001.00000  62001.00000  2.043674731843e-06
62001.00000  63001.00000  2.384287187150e-06
63001.00000  64001.00000  2.491849015142e-06
64001.00000  65001.00000  1.954039875183e-06
65001.00000  66001.00000  2.007820789179e-06
66001.00000  67001.00000  1.434157706557e-06
67001.00000  68001.00000  1.720989247868e-06
68001.00000  69001.00000  1.613427419876e-06
69001.00000  70001.00000  1.631354391208e-06
70001.00000  71001.00000  1.846478047192e-06
71001.00000  72001.00000  1.505865591884e-06
72001.00000  73001.00000  1.362449821229e-06
73001.00000  74001.00000  1.523792563216e-06
74001.00000  75001.00000  1.290741935901e-06
75001.00000  76001.00000  1.595500448544e-06
76001.00000  77001.00000  1.254887993237e-06
77001.00000  78001.00000  1.308668907233e-06
78001.00000  79001.00000  1.183180107909e-06
79001.00000  80001.00000  1.003910394590e-06
80001.00000  81001.00000  9.859834232577e-07
81001.00000  82001.00000  8.246406812700e-07
82001.00000  83001.00000  8.784215952659e-07
83001.00000  84001.00000  8.784215952659e-07
84001.00000  85001.00000  8.425676526020e-07
85001.00000  86001.00000  9.142755379298e-07
86001.00000  87001.00000  9.501294805937e-07
87001.00000  88001.00000  6.991518819463e-07
88001.00000  89001.00000  8.604946239340e-07
89001.00000  90001.00000  6.991518819463e-07
90001.00000  91001.00000  6.274439966185e-07
91001.00000  92001.00000  6.274439966185e-07
92001.00000  93001.00000  6.991518819463e-07
93001.00000  94001.00000  6.812249106144e-07
94001.00000  95001.00000  4.123203406350e-07
95001.00000  96001.00000  4.661012546309e-07
96001.00000  97001.00000  6.274439966185e-07
97001.00000  98001.00000  3.585394266391e-07
98001.00000  99001.00000  7.170788532783e-07
99001.00000  100001.00000  4.661012546309e-07
100001.00000  101001.00000  6.812249106144e-07
101001.00000  102001.00000  4.840282259629e-07
102001.00000  103001.00000  4.481742832989e-07
103001.00000  104001.00000  4.840282259629e-07
104001.00000  105001.00000  5.557361112907e-07
105001.00000  106001.00000  5.019551972948e-07
106001.00000  107001.00000  2.868315413113e-07
107001.00000  108001.00000  3.585394266391e-07
108001.00000  109001.00000  3.406124553072e-07
109001.00000  110001.00000  1.971966846515e-07
110001.00000  111001.00000  4.840282259629e-07
111001.00000  112001.00000  3.406124553072e-07
112001.00000  113001.00000  2.330506273154e-07
113001.00000  114001.00000  2.330506273154e-07
114001.00000  115001.00000  2.509775986474e-07
115001.00000  116001.00000  2.330506273154e-07
116001.00000  117001.00000  3.226854839752e-07
117001.00000  118001.00000  2.509775986474e-07
118001.00000  119001.00000  2.509775986474e-07
119001.00000  120001.00000  1.254887993237e-07
120001.00000  121001.00000  1.254887993237e-07
121001.00000  122001.00000  2.868315413113e-07
122001.00000  123001.00000  4.123203406350e-07
123001.00000  124001.00000  2.509775986474e-07
124001.00000  125001.00000  1.613427419876e-07
125001.00000  126001.00000  2.868315413113e-07
126001.00000  127001.00000  2.330506273154e-07
127001.00000  128001.00000  1.613427419876e-07
128001.00000  129001.00000  2.868315413113e-07
129001.00000  130001.00000  1.254887993237e-07
130001.00000  131001.00000  1.792697133196e-07
131001.00000  132001.00000  5.378091399587e-08
132001.00000  133001.00000  1.971966846515e-07
133001.00000  134001.00000  1.254887993237e-07
134001.00000  135001.00000  1.613427419876e-07
135001.00000  136001.00000  2.151236559835e-07
136001.00000  137001.00000  1.613427419876e-07
137001.00000  138001.00000  1.254887993237e-07
138001.00000  139001.00000  1.434157706557e-07
139001.00000  140001.00000  1.434157706557e-07
140001.00000  141001.00000  7.170788532783e-08
141001.00000  142001.00000  5.378091399587e-08
142001.00000  143001.00000  1.075618279917e-07
143001.00000  144001.00000  7.170788532783e-08
144001.00000  145001.00000  1.613427419876e-07
145001.00000  146001.00000  1.075618279917e-07
146001.00000  147001.00000  7.170788532783e-08
147001.00000  148001.00000  1.434157706557e-07
148001.00000  149001.00000  8.963485665979e-08
149001.00000  150001.00000  5.378091399587e-08
150001.00000  151001.00000  8.963485665979e-08
151001.00000  152001.00000  3.585394266391e-08
152001.00000  153001.00000  1.075618279917e-07
153001.00000  154001.00000  7.170788532783e-08
154001.00000  155001.00000  5.378091399587e-08
155001.00000  156001.00000  1.075618279917e-07
156001.00000  157001.00000  3.585394266391e-08
157001.00000  158001.00000  5.378091399587e-08
158001.00000  159001.00000  5.378091399587e-08
159001.00000  160001.00000  1.792697133196e-08
160001.00000  161001.00000  3.585394266391e-08
161001.00000  162001.00000  1.075618279917e-07
162001.00000  163001.00000  1.792697133196e-08
163001.00000  164001.00000  7.170788532783e-08
164001.00000  165001.00000  3.585394266391e-08
165001.00000  166001.00000  0.000000000000e+00
166001.00000  167001.00000  3.585394266391e-08
167001.00000  168001.00000  1.792697133196e-08
168001.00000  169001.00000  5.378091399587e-08
169001.00000  170001.00000  5.378091399587e-08
170001.00000  171001.00000  1.792697133196e-08
171001.00000  172001.00000  1.792697133196e-08
172001.00000  173001.00000  1.792697133196e-08
173001.00000  174001.00000  0.000000000000e+00
174001.00000  175001.00000  1.792697133196e-08
175001.00000  176001.00000  3.585394266391e-08
176001.00000  177001.00000  0.000000000000e+00
177001.00000  178001.00000  0.000000000000e+00
178001.00000  179001.00000  0.000000000000e+00
179001.00000  180001.00000  3.585394266391e-08
180001.00000  181001.00000  3.585394266391e-08
181001.00000  182001.00000  0.000000000000e+00
182001.00000  183001.00000  0.000000000000e+00
183001.00000  184001.00000  0.000000000000e+00
184001.00000  185001.00000  5.378091399587e-08
185001.00000  186001.00000  0.000000000000e+00
186001.00000  187001.00000  0.000000000000e+00
187001.00000  188001.00000  0.000000000000e+00
188001.00000  189001.00000  0.000000000000e+00
189001.00000  190001.00000  0.000000000000e+00
190001.00000  191001.00000  0.000000000000e+00
191001.00000  192001.00000  0.000000000000e+00
192001.00000  193001.00000  0.000000000000e+00
193001.00000  194001.00000  0.000000000000e+00
194001.00000  195001.00000  0.000000000000e+00
195001.00000  196001.00000  0.000000000000e+00
196001.00000  197001.00000  0.000000000000e+00
197001.00000  198001.00000  0.000000000000e+00
198001.00000  199001.00000  0.000000000000e+00
