300.00000  350.00000  1.738053192104e+00
350.00000  400.00000  1.227420373358e+00
400.00000  450.00000  9.061232106367e-01
450.00000  500.00000  6.929327646175e-01
500.00000  550.00000  5.443191407369e-01
550.00000  600.00000  4.359346880719e-01
600.00000  650.00000  3.570905855856e-01
650.00000  700.00000  2.968162627529e-01
700.00000  750.00000  2.491227368645e-01
750.00000  800.00000  2.120008370693e-01
800.00000  850.00000  1.821610778905e-01
850.00000  900.00000  1.578334945948e-01
900.00000  950.00000  1.382169874980e-01
950.00000  1000.00000  1.218032737279e-01
1000.00000  1050.00000  1.069243320983e-01
1050.00000  1100.00000  9.581970982251e-02
1100.00000  1150.00000  8.559565503526e-02
1150.00000  1200.00000  7.719293810718e-02
1200.00000  1250.00000  6.990196773483e-02
1250.00000  1300.00000  6.322025052912e-02
1300.00000  1350.00000  5.773295850386e-02
1350.00000  1400.00000  5.296489024318e-02
1400.00000  1450.00000  4.821849502005e-02
1450.00000  1500.00000  4.458063553227e-02
1500.00000  1550.00000  4.075333764222e-02
1550.00000  1600.00000  3.782185863750e-02
1600.00000  1650.00000  3.505252606185e-02
1650.00000  1700.00000  3.263076479208e-02
1700.00000  1750.00000  3.077571331894e-02
1750.00000  1800.00000  2.841174681596e-02
1800.00000  1850.00000  2.646197614168e-02
1850.00000  1900.00000  2.479234954535e-02
1900.00000  1950.00000  2.315001492223e-02
1950.00000  2000.00000  2.185605431007e-02
2000.00000  2050.00000  2.053640713489e-02
2050.00000  2100.00000  1.938773614482e-02
2100.00000  2150.00000  1.838676289211e-02
2150.00000  2200.00000  1.728143797714e-02
2200.00000  2250.00000  1.659753323672e-02
2250.00000  2300.00000  1.538865936456e-02
2300.00000  2350.00000  1.453779196451e-02
2350.00000  2400.00000  1.386030886484e-02
2400.00000  2450.00000  1.304315507875e-02
2450.00000  2500.00000  1.241383428475e-02
2500.00000  2550.00000  1.205823592794e-02
2550.00000  2600.00000  1.126596599977e-02
2600.00000  2650.00000  1.100267872881e-02
2650.00000  2700.00000  1.061657757841e-02
2700.00000  2750.00000  9.746445256092e-03
2750.00000  2800.00000  9.574666365892e-03
2800.00000  2850.00000  9.113913641712e-03
2850.00000  2900.00000  8.567271472432e-03
2900.00000  2950.00000  8.254216485620e-03
2950.00000  3000.00000  7.862496399557e-03
3000.00000  3050.00000  7.549441412745e-03
3050.00000  3100.00000  7.416995072170e-03
3100.00000  3150.00000  7.081464342715e-03
3150.00000  3200.00000  6.744328203071e-03
3200.00000  3250.00000  6.567733082305e-03
3250.00000  3300.00000  6.442511087580e-03
3300.00000  3350.00000  6.066042398311e-03
3350.00000  3400.00000  5.763422577725e-03
3400.00000  3450.00000  5.685560183569e-03
3450.00000  3500.00000  5.535454330918e-03
3500.00000  3550.00000  5.219991228823e-03
3550.00000  3600.00000  5.050620453906e-03
3600.00000  3650.00000  4.839509014082e-03
3650.00000  3700.00000  4.682178815581e-03
3700.00000  3750.00000  4.600302895953e-03
3750.00000  3800.00000  4.369123828769e-03
3800.00000  3850.00000  4.226242321967e-03
3850.00000  3900.00000  4.157209683850e-03
3900.00000  3950.00000  3.983022678367e-03
3950.00000  4000.00000  3.817665428922e-03
4000.00000  4050.00000  3.711708356463e-03
4050.00000  4100.00000  3.686021793442e-03
4100.00000  4150.00000  3.588091771927e-03
4150.00000  4200.00000  3.352096474176e-03
4200.00000  4250.00000  3.350491063987e-03
4250.00000  4300.00000  3.225269069262e-03
4300.00000  4350.00000  3.085598382838e-03
4350.00000  4400.00000  3.134563393596e-03
4400.00000  4450.00000  3.034225256797e-03
4450.00000  4500.00000  2.889738339807e-03
4500.00000  4550.00000  2.914622197733e-03
4550.00000  4600.00000  2.786189382630e-03
4600.00000  4650.00000  2.682640425454e-03
4650.00000  4700.00000  2.595948275260e-03
4700.00000  4750.00000  2.504439894499e-03
4750.00000  4800.00000  2.428182910532e-03
4800.00000  4850.00000  2.291723044485e-03
4850.00000  4900.00000  2.337477234866e-03
4900.00000  4950.00000  2.286104108825e-03
4950.00000  5000.00000  2.209847124858e-03
5000.00000  5050.00000  2.277274352786e-03
5050.00000  5100.00000  2.079006194472e-03
5100.00000  5150.00000  2.034857414280e-03
5150.00000  5200.00000  1.989905928995e-03
5200.00000  5250.00000  2.018000607298e-03
5250.00000  5300.00000  1.911240829744e-03
5300.00000  5350.00000  1.885554266724e-03
5350.00000  5400.00000  1.835786550872e-03
5400.00000  5450.00000  1.767556617848e-03
5450.00000  5500.00000  1.770767438226e-03
5500.00000  5550.00000  1.703340210297e-03
5550.00000  5600.00000  1.637518392557e-03
5600.00000  5650.00000  1.685680698221e-03
5650.00000  5700.00000  1.629491341613e-03
5700.00000  5750.00000  1.564472228968e-03
5750.00000  5800.00000  1.485807129717e-03
5800.00000  5850.00000  1.433631298582e-03
5850.00000  5900.00000  1.448882695375e-03
5900.00000  5950.00000  1.400720389712e-03
5950.00000  6000.00000  1.386271698013e-03
6000.00000  6050.00000  1.375033826691e-03
6050.00000  6100.00000  1.298776842724e-03
6100.00000  6150.00000  1.325266110839e-03
6150.00000  6200.00000  1.259444293099e-03
6200.00000  6250.00000  1.258641588005e-03
6250.00000  6300.00000  1.240982075928e-03
6300.00000  6350.00000  1.242587486117e-03
6350.00000  6400.00000  1.289947086686e-03
6400.00000  6450.00000  1.160711566489e-03
6450.00000  6500.00000  1.139038528940e-03
6500.00000  6550.00000  1.148670990073e-03
6550.00000  6600.00000  1.098903274221e-03
6600.00000  6650.00000  1.097297864032e-03
6650.00000  6700.00000  1.047530148180e-03
6700.00000  6750.00000  1.031476046292e-03
6750.00000  6800.00000  1.009803008744e-03
6800.00000  6850.00000  9.552190623250e-04
6850.00000  6900.00000  9.825110355342e-04
6900.00000  6950.00000  9.648515234576e-04
6950.00000  7000.00000  9.528109470418e-04
7000.00000  7050.00000  9.142811025110e-04
7050.00000  7100.00000  9.231108585493e-04
7100.00000  7150.00000  9.215054483605e-04
7150.00000  7200.00000  8.251808370337e-04
7200.00000  7250.00000  8.701323223195e-04
7250.00000  7300.00000  8.428403491103e-04
7300.00000  7350.00000  8.131402606178e-04
7350.00000  7400.00000  8.027050943907e-04
7400.00000  7450.00000  8.019023892963e-04
7450.00000  7500.00000  7.762158262758e-04
7500.00000  7550.00000  7.272508155180e-04
7550.00000  7600.00000  7.641752498600e-04
7600.00000  7650.00000  7.031696626863e-04
7650.00000  7700.00000  7.770185313702e-04
7700.00000  7750.00000  7.007615474031e-04
7750.00000  7800.00000  7.272508155180e-04
7800.00000  7850.00000  6.951426117424e-04
7850.00000  7900.00000  6.710614589106e-04
7900.00000  7950.00000  6.646398181555e-04
7950.00000  8000.00000  6.325316143799e-04
8000.00000  8050.00000  6.782858047602e-04
8050.00000  8100.00000  6.140693972089e-04
8100.00000  8150.00000  6.341370245687e-04
8150.00000  8200.00000  6.534019468340e-04
8200.00000  8250.00000  5.795530781501e-04
8250.00000  8300.00000  6.036342309818e-04
8300.00000  8350.00000  5.779476679613e-04
8350.00000  8400.00000  5.972125902267e-04
8400.00000  8450.00000  5.354042979586e-04
8450.00000  8500.00000  6.196883328696e-04
8500.00000  8550.00000  5.795530781501e-04
8550.00000  8600.00000  5.771449628669e-04
8600.00000  8650.00000  5.683152068286e-04
8650.00000  8700.00000  5.570773355072e-04
8700.00000  8750.00000  5.313907724867e-04
8750.00000  8800.00000  5.024933890886e-04
8800.00000  8850.00000  5.185474909764e-04
8850.00000  8900.00000  5.065069145605e-04
8900.00000  8950.00000  5.370097081474e-04
8950.00000  9000.00000  5.097177349381e-04
9000.00000  9050.00000  4.928609279559e-04
9050.00000  9100.00000  4.832284668232e-04
9100.00000  9150.00000  5.024933890886e-04
9150.00000  9200.00000  4.583446088971e-04
9200.00000  9250.00000  4.535283783308e-04
9250.00000  9300.00000  4.615554292747e-04
9300.00000  9350.00000  4.463040324812e-04
9350.00000  9400.00000  4.511202630476e-04
9400.00000  9450.00000  4.334607509710e-04
9450.00000  9500.00000  4.182093541776e-04
9500.00000  9550.00000  4.149985338000e-04
9550.00000  9600.00000  4.109850083280e-04
9600.00000  9650.00000  4.230255847439e-04
9650.00000  9700.00000  3.997471370066e-04
9700.00000  9750.00000  3.917200860627e-04
9750.00000  9800.00000  3.997471370066e-04
9800.00000  9850.00000  3.981417268178e-04
9850.00000  9900.00000  3.676389332309e-04
9900.00000  9950.00000  3.572037670039e-04
9950.00000  10000.00000  3.716524587029e-04
