300.00000  350.00000  5.267630232526e-06
350.00000  400.00000  1.354533488364e-05
400.00000  450.00000  9.030223255759e-06
450.00000  500.00000  5.267630232526e-06
500.00000  550.00000  4.665615348809e-05
550.00000  600.00000  3.762593023233e-06
600.00000  650.00000  1.881296511616e-05
650.00000  700.00000  7.525186046466e-06
700.00000  750.00000  1.429785348828e-05
750.00000  800.00000  3.010074418586e-06
800.00000  850.00000  3.762593023233e-05
850.00000  900.00000  4.515111627879e-06
900.00000  950.00000  5.267630232526e-06
950.00000  1000.00000  6.772667441819e-06
1000.00000  1050.00000  8.277704651112e-06
1050.00000  1100.00000  6.772667441819e-06
1100.00000  1150.00000  8.277704651112e-06
1150.00000  1200.00000  5.267630232526e-06
1200.00000  1250.00000  1.128777906970e-05
1250.00000  1300.00000  4.665615348809e-05
1300.00000  1350.00000  1.806044651152e-05
1350.00000  1400.00000  2.031800232546e-05
1400.00000  1450.00000  3.687341162768e-05
1450.00000  1500.00000  7.299430465072e-05
1500.00000  1550.00000  1.030950488366e-04
1550.00000  1600.00000  1.693166860455e-04
1600.00000  1650.00000  2.001699488360e-04
1650.00000  1700.00000  2.919772186029e-04
1700.00000  1750.00000  4.131327139510e-04
1750.00000  1800.00000  4.688190906948e-04
1800.00000  1850.00000  6.155602186009e-04
1850.00000  1900.00000  6.366307395310e-04
1900.00000  1950.00000  7.532711232512e-04
1950.00000  2000.00000  8.992597325526e-04
2000.00000  2050.00000  9.955821139474e-04
2050.00000  2100.00000  1.152105983714e-03
2100.00000  2150.00000  1.322927706969e-03
2150.00000  2200.00000  1.462143648828e-03
2200.00000  2250.00000  1.685641674408e-03
2250.00000  2300.00000  1.818837467431e-03
2300.00000  2350.00000  2.047603123243e-03
2350.00000  2400.00000  2.065663569755e-03
2400.00000  2450.00000  2.155213283708e-03
2450.00000  2500.00000  2.138657874406e-03
2500.00000  2550.00000  2.106299574406e-03
2550.00000  2600.00000  2.217672327893e-03
2600.00000  2650.00000  2.322272413939e-03
2650.00000  2700.00000  2.402791904636e-03
2700.00000  2750.00000  2.508144509287e-03
2750.00000  2800.00000  2.514917176729e-03
2800.00000  2850.00000  2.599951779054e-03
2850.00000  2900.00000  2.648112969751e-03
2900.00000  2950.00000  2.684986381379e-03
2950.00000  3000.00000  2.743682832541e-03
3000.00000  3050.00000  2.723364830216e-03
3050.00000  3100.00000  2.821192248820e-03
3100.00000  3150.00000  2.863333290680e-03
3150.00000  3200.00000  2.868600920913e-03
3200.00000  3250.00000  2.730137497658e-03
3250.00000  3300.00000  2.719602237193e-03
3300.00000  3350.00000  2.797111653471e-03
3350.00000  3400.00000  2.754218093006e-03
3400.00000  3450.00000  2.752713055797e-03
3450.00000  3500.00000  2.725622386030e-03
3500.00000  3550.00000  2.736157646495e-03
3550.00000  3600.00000  2.668430972077e-03
3600.00000  3650.00000  2.584148888356e-03
3650.00000  3700.00000  2.593179111612e-03
3700.00000  3750.00000  2.686491418588e-03
3750.00000  3800.00000  2.569098516263e-03
3800.00000  3850.00000  2.589416518589e-03
3850.00000  3900.00000  2.572861109287e-03
3900.00000  3950.00000  2.508144509287e-03
3950.00000  4000.00000  2.552543106961e-03
4000.00000  4050.00000  2.376453753474e-03
4050.00000  4100.00000  2.425367462776e-03
4100.00000  4150.00000  2.395266718590e-03
4150.00000  4200.00000  2.329045081381e-03
4200.00000  4250.00000  2.377206272078e-03
4250.00000  4300.00000  2.232722699986e-03
4300.00000  4350.00000  2.261318406963e-03
4350.00000  4400.00000  2.260565888358e-03
4400.00000  4450.00000  2.156718320917e-03
4450.00000  4500.00000  2.138657874406e-03
4500.00000  4550.00000  2.053623272080e-03
4550.00000  4600.00000  2.077703867429e-03
4600.00000  4650.00000  1.958805927895e-03
4650.00000  4700.00000  2.040077937197e-03
4700.00000  4750.00000  2.010729711616e-03
4750.00000  4800.00000  1.906129625570e-03
4800.00000  4850.00000  1.916664886035e-03
4850.00000  4900.00000  1.885811623244e-03
4900.00000  4950.00000  1.881296511616e-03
4950.00000  5000.00000  1.843670581384e-03
5000.00000  5050.00000  1.775943906966e-03
5050.00000  5100.00000  1.721762567431e-03
5100.00000  5150.00000  1.675106413943e-03
5150.00000  5200.00000  1.690156786036e-03
5200.00000  5250.00000  1.711227306966e-03
5250.00000  5300.00000  1.629202779060e-03
5300.00000  5350.00000  1.637480483711e-03
5350.00000  5400.00000  1.555455955804e-03
5400.00000  5450.00000  1.544920695339e-03
5450.00000  5500.00000  1.549435806967e-03
5500.00000  5550.00000  1.526860248828e-03
5550.00000  5600.00000  1.465906241851e-03
5600.00000  5650.00000  1.434300460456e-03
5650.00000  5700.00000  1.464401204642e-03
5700.00000  5750.00000  1.372593934875e-03
5750.00000  5800.00000  1.389901862782e-03
5800.00000  5850.00000  1.347008302317e-03
5850.00000  5900.00000  1.321422669759e-03
5900.00000  5950.00000  1.332710448829e-03
5950.00000  6000.00000  1.317660076736e-03
6000.00000  6050.00000  1.198009618597e-03
6050.00000  6100.00000  1.224347769760e-03
6100.00000  6150.00000  1.269498886039e-03
6150.00000  6200.00000  1.190484432551e-03
6200.00000  6250.00000  1.182959246504e-03
6250.00000  6300.00000  1.151353465109e-03
6300.00000  6350.00000  1.210049916272e-03
6350.00000  6400.00000  1.268746367434e-03
6400.00000  6450.00000  1.118995165109e-03
6450.00000  6500.00000  1.103192274412e-03
6500.00000  6550.00000  1.061051232552e-03
6550.00000  6600.00000  1.072339011621e-03
6600.00000  6650.00000  1.085884346505e-03
6650.00000  6700.00000  1.036218118598e-03
6700.00000  6750.00000  9.970871511567e-04
6750.00000  6800.00000  9.820367790638e-04
6800.00000  6850.00000  9.865518906916e-04
6850.00000  6900.00000  9.857993720870e-04
6900.00000  6950.00000  1.012137523250e-03
6950.00000  7000.00000  9.451633674361e-04
7000.00000  7050.00000  9.075374372037e-04
7050.00000  7100.00000  9.045273627852e-04
7100.00000  7150.00000  8.458309116227e-04
7150.00000  7200.00000  7.999272767393e-04
7200.00000  7250.00000  8.029373511579e-04
7250.00000  7300.00000  7.886394976696e-04
7300.00000  7350.00000  7.848769046464e-04
7350.00000  7400.00000  7.638063837163e-04
7400.00000  7450.00000  7.276854906932e-04
7450.00000  7500.00000  7.133876372049e-04
7500.00000  7550.00000  7.036048953445e-04
7550.00000  7600.00000  7.216653418560e-04
7600.00000  7650.00000  7.013473395306e-04
7650.00000  7700.00000  6.712465953447e-04
7700.00000  7750.00000  6.719991139494e-04
7750.00000  7800.00000  6.674840023215e-04
7800.00000  7850.00000  6.900595604609e-04
7850.00000  7900.00000  6.306105906938e-04
7900.00000  7950.00000  6.283530348799e-04
7950.00000  8000.00000  6.336206651124e-04
8000.00000  8050.00000  6.253429604613e-04
8050.00000  8100.00000  5.892220674383e-04
8100.00000  8150.00000  6.200753302288e-04
8150.00000  8200.00000  6.584537790657e-04
8200.00000  8250.00000  6.012623651126e-04
8250.00000  8300.00000  5.839544372057e-04
8300.00000  8350.00000  5.982522906940e-04
8350.00000  8400.00000  5.847069558104e-04
8400.00000  8450.00000  5.816968813918e-04
8450.00000  8500.00000  5.583688046477e-04
8500.00000  8550.00000  5.786868069732e-04
8550.00000  8600.00000  5.741716953453e-04
8600.00000  8650.00000  5.553587302292e-04
8650.00000  8700.00000  5.372982837176e-04
8700.00000  8750.00000  5.335356906944e-04
8750.00000  8800.00000  4.876320558110e-04
8800.00000  8850.00000  5.214953930201e-04
8850.00000  8900.00000  4.853744999970e-04
8900.00000  8950.00000  5.184853186015e-04
8950.00000  9000.00000  4.966622790667e-04
9000.00000  9050.00000  5.079500581364e-04
9050.00000  9100.00000  4.597888674390e-04
9100.00000  9150.00000  4.823644255784e-04
9150.00000  9200.00000  4.808593883691e-04
9200.00000  9250.00000  4.921471674388e-04
9250.00000  9300.00000  4.688190906948e-04
9300.00000  9350.00000  4.447384953461e-04
9350.00000  9400.00000  4.748392395320e-04
9400.00000  9450.00000  4.184003441835e-04
9450.00000  9500.00000  4.507586441833e-04
9500.00000  9550.00000  4.372133092996e-04
9550.00000  9600.00000  4.244204930207e-04
9600.00000  9650.00000  4.289356046485e-04
9650.00000  9700.00000  3.980823418580e-04
9700.00000  9750.00000  4.078650837184e-04
9750.00000  9800.00000  3.935672302301e-04
9800.00000  9850.00000  4.123801953463e-04
9850.00000  9900.00000  4.033499720906e-04
9900.00000  9950.00000  4.010924162766e-04
9950.00000  10000.00000  3.890521186023e-04
