300.00000  350.00000  7.747973582225e-02
350.00000  400.00000  6.152504995596e-02
400.00000  450.00000  5.022995699813e-02
450.00000  500.00000  4.199546857642e-02
500.00000  550.00000  3.570852787918e-02
550.00000  600.00000  3.070620840637e-02
600.00000  650.00000  2.692253931697e-02
650.00000  700.00000  2.371350038855e-02
700.00000  750.00000  2.128384258503e-02
750.00000  800.00000  1.902414014938e-02
800.00000  850.00000  1.719646627018e-02
850.00000  900.00000  1.562141244076e-02
900.00000  950.00000  1.425191409770e-02
950.00000  1000.00000  1.308334523689e-02
1000.00000  1050.00000  1.206119946226e-02
1050.00000  1100.00000  1.119211408403e-02
1100.00000  1150.00000  1.039463120398e-02
1150.00000  1200.00000  9.630334875059e-03
1200.00000  1250.00000  9.022115901726e-03
1250.00000  1300.00000  8.500181961316e-03
1300.00000  1350.00000  7.934401547299e-03
1350.00000  1400.00000  7.463152521333e-03
1400.00000  1450.00000  7.046208760844e-03
1450.00000  1500.00000  6.739484576210e-03
1500.00000  1550.00000  6.329580387171e-03
1550.00000  1600.00000  6.013000802506e-03
1600.00000  1650.00000  5.652775874847e-03
1650.00000  1700.00000  5.418056449622e-03
1700.00000  1750.00000  5.252123694000e-03
1750.00000  1800.00000  4.953645864494e-03
1800.00000  1850.00000  4.698008855530e-03
1850.00000  1900.00000  4.513572083524e-03
1900.00000  1950.00000  4.333560185001e-03
1950.00000  2000.00000  4.175069262056e-03
2000.00000  2050.00000  4.031462004463e-03
2050.00000  2100.00000  3.803581020076e-03
2100.00000  2150.00000  3.690947876866e-03
2150.00000  2200.00000  3.568660464238e-03
2200.00000  2250.00000  3.395889267778e-03
2250.00000  2300.00000  3.216078499868e-03
2300.00000  2350.00000  3.277423336795e-03
2350.00000  2400.00000  3.003282311447e-03
2400.00000  2450.00000  2.964061841936e-03
2450.00000  2500.00000  2.868122539595e-03
2500.00000  2550.00000  2.759109747417e-03
2550.00000  2600.00000  2.661561400173e-03
2600.00000  2650.00000  2.584729506054e-03
2650.00000  2700.00000  2.485169852681e-03
2700.00000  2750.00000  2.424629538206e-03
2750.00000  2800.00000  2.394862207501e-03
2800.00000  2850.00000  2.313404309286e-03
2850.00000  2900.00000  2.296710468418e-03
2900.00000  2950.00000  2.185485239498e-03
2950.00000  3000.00000  2.157125823082e-03
3000.00000  3050.00000  2.040671198228e-03
3050.00000  3100.00000  2.006478994039e-03
3100.00000  3150.00000  1.961023475530e-03
3150.00000  3200.00000  1.877755401799e-03
3200.00000  3250.00000  1.841954152708e-03
3250.00000  3300.00000  1.794688458682e-03
3300.00000  3350.00000  1.753255552430e-03
3350.00000  3400.00000  1.724896136014e-03
3400.00000  3450.00000  1.647863111283e-03
3450.00000  3500.00000  1.639013364317e-03
3500.00000  3550.00000  1.614073168320e-03
3550.00000  3600.00000  1.575657221261e-03
3600.00000  3650.00000  1.510088641464e-03
3650.00000  3700.00000  1.512703339432e-03
3700.00000  3750.00000  1.463627469890e-03
3750.00000  3800.00000  1.454375461698e-03
3800.00000  3850.00000  1.411132379930e-03
3850.00000  3900.00000  1.368492690000e-03
3900.00000  3950.00000  1.319416820459e-03
3950.00000  4000.00000  1.332691440909e-03
4000.00000  4050.00000  1.267525122337e-03
4050.00000  4100.00000  1.255457285565e-03
4100.00000  4150.00000  1.209599505829e-03
4150.00000  4200.00000  1.214225509925e-03
4200.00000  4250.00000  1.187475138413e-03
4250.00000  4300.00000  1.170580166931e-03
4300.00000  4350.00000  1.159115721998e-03
4350.00000  4400.00000  1.121102036164e-03
4400.00000  4450.00000  1.120699774939e-03
4450.00000  4500.00000  1.073031819687e-03
4500.00000  4550.00000  1.076451040106e-03
4550.00000  4600.00000  1.022145774630e-03
4600.00000  4650.00000  1.012692635825e-03
4650.00000  4700.00000  1.030995521596e-03
4700.00000  4750.00000  9.889592235055e-04
4750.00000  4800.00000  9.700529458953e-04
4800.00000  4850.00000  9.722653826369e-04
4850.00000  4900.00000  9.573817172842e-04
4900.00000  4950.00000  9.314358682233e-04
4950.00000  5000.00000  8.986515783247e-04
5000.00000  5050.00000  9.179601171607e-04
5050.00000  5100.00000  8.759238190699e-04
5100.00000  5150.00000  8.674763333291e-04
5150.00000  5200.00000  8.721023374252e-04
5200.00000  5250.00000  8.383123944623e-04
5250.00000  5300.00000  8.224230760451e-04
5300.00000  5350.00000  8.186015944005e-04
5350.00000  5400.00000  7.974828800487e-04
5400.00000  5450.00000  7.860184351148e-04
5450.00000  5500.00000  7.936613984040e-04
5500.00000  5550.00000  7.655031126016e-04
5550.00000  5600.00000  7.644974595372e-04
5600.00000  5650.00000  7.636929370857e-04
5650.00000  5700.00000  7.178351573502e-04
5700.00000  5750.00000  7.188408104146e-04
5750.00000  5800.00000  7.184385491889e-04
5800.00000  5850.00000  7.224611614464e-04
5850.00000  5900.00000  7.081808879322e-04
5900.00000  5950.00000  6.848497368388e-04
5950.00000  6000.00000  6.747932061950e-04
6000.00000  6050.00000  6.611163245195e-04
6050.00000  6100.00000  6.508586632629e-04
6100.00000  6150.00000  6.635298918740e-04
6150.00000  6200.00000  6.357738672973e-04
6200.00000  6250.00000  6.683570265830e-04
6250.00000  6300.00000  6.560880591977e-04
6300.00000  6350.00000  6.735864225178e-04
6350.00000  6400.00000  1.229913697730e-03
6400.00000  6450.00000  5.961511365610e-04
6450.00000  6500.00000  5.947432222708e-04
6500.00000  6550.00000  5.866979977559e-04
6550.00000  6600.00000  5.653781527911e-04
6600.00000  6650.00000  5.698030262744e-04
6650.00000  6700.00000  5.796584263052e-04
6700.00000  6750.00000  5.573329282761e-04
6750.00000  6800.00000  5.510978792770e-04
6800.00000  6850.00000  5.466730057938e-04
6850.00000  6900.00000  5.555227527603e-04
6900.00000  6950.00000  5.358119526985e-04
6950.00000  7000.00000  5.390300425045e-04
7000.00000  7050.00000  5.426503935363e-04
7050.00000  7100.00000  5.716132017902e-04
7100.00000  7150.00000  4.881439974472e-04
7150.00000  7200.00000  4.784897280292e-04
7200.00000  7250.00000  4.642094545151e-04
7250.00000  7300.00000  4.660196300310e-04
7300.00000  7350.00000  4.607902340962e-04
7350.00000  7400.00000  4.497280503881e-04
7400.00000  7450.00000  4.543540544842e-04
7450.00000  7500.00000  4.794953810936e-04
7500.00000  7550.00000  4.342409931967e-04
7550.00000  7600.00000  4.294138584877e-04
7600.00000  7650.00000  4.354477768740e-04
7650.00000  7700.00000  4.173460217153e-04
7700.00000  7750.00000  4.119154951676e-04
7750.00000  7800.00000  4.099041890389e-04
7800.00000  7850.00000  4.245867237787e-04
7850.00000  7900.00000  4.095019278131e-04
7900.00000  7950.00000  4.002499196209e-04
7950.00000  8000.00000  4.032668788140e-04
8000.00000  8050.00000  4.010544420724e-04
8050.00000  8100.00000  3.940148706218e-04
8100.00000  8150.00000  3.883832134613e-04
8150.00000  8200.00000  3.897911277514e-04
8200.00000  8250.00000  3.928080869445e-04
8250.00000  8300.00000  3.863719073325e-04
8300.00000  8350.00000  3.692758052382e-04
8350.00000  8400.00000  3.716893725927e-04
8400.00000  8450.00000  3.763153766888e-04
8450.00000  8500.00000  3.704825889154e-04
8500.00000  8550.00000  3.608283194974e-04
8550.00000  8600.00000  3.636441480777e-04
8600.00000  8650.00000  3.499672664022e-04
8650.00000  8700.00000  3.489616133378e-04
8700.00000  8750.00000  3.539898786597e-04
8750.00000  8800.00000  3.344802092108e-04
8800.00000  8850.00000  3.656554542064e-04
8850.00000  8900.00000  3.453412623061e-04
8900.00000  8950.00000  3.429276949516e-04
8950.00000  9000.00000  3.260327234701e-04
9000.00000  9050.00000  3.376982990168e-04
9050.00000  9100.00000  3.240214173413e-04
9100.00000  9150.00000  3.107467968916e-04
9150.00000  9200.00000  3.282451602117e-04
9200.00000  9250.00000  3.083332295371e-04
9250.00000  9300.00000  3.103445356659e-04
9300.00000  9350.00000  3.189931520195e-04
9350.00000  9400.00000  3.055174009569e-04
9400.00000  9450.00000  2.974721764419e-04
9450.00000  9500.00000  2.968687846032e-04
9500.00000  9550.00000  2.944552172487e-04
9550.00000  9600.00000  2.835941641535e-04
9600.00000  9650.00000  3.025004417637e-04
9650.00000  9700.00000  2.932484335715e-04
9700.00000  9750.00000  2.916393886685e-04
9750.00000  9800.00000  2.882201682496e-04
9800.00000  9850.00000  2.892258213140e-04
9850.00000  9900.00000  2.948574784745e-04
9900.00000  9950.00000  2.805772049604e-04
9950.00000  10000.00000  2.739398947355e-04
