300.00000  350.00000  2.396835576010e+00
350.00000  400.00000  1.695988811579e+00
400.00000  450.00000  1.251136221531e+00
450.00000  500.00000  9.570827590941e-01
500.00000  550.00000  7.518410193487e-01
550.00000  600.00000  6.033802938603e-01
600.00000  650.00000  4.934358967590e-01
650.00000  700.00000  4.093638515871e-01
700.00000  750.00000  3.440707634174e-01
750.00000  800.00000  2.928177607979e-01
800.00000  850.00000  2.513641220568e-01
850.00000  900.00000  2.180259719665e-01
900.00000  950.00000  1.912604971304e-01
950.00000  1000.00000  1.679208096171e-01
1000.00000  1050.00000  1.487283399334e-01
1050.00000  1100.00000  1.321499474938e-01
1100.00000  1150.00000  1.183379790759e-01
1150.00000  1200.00000  1.067805817502e-01
1200.00000  1250.00000  9.589947514541e-02
1250.00000  1300.00000  8.758891813410e-02
1300.00000  1350.00000  7.981439608036e-02
1350.00000  1400.00000  7.269681912499e-02
1400.00000  1450.00000  6.648606822566e-02
1450.00000  1500.00000  6.113619752886e-02
1500.00000  1550.00000  5.657869128813e-02
1550.00000  1600.00000  5.215902260792e-02
1600.00000  1650.00000  4.843821454155e-02
1650.00000  1700.00000  4.484718335966e-02
1700.00000  1750.00000  4.174221094379e-02
1750.00000  1800.00000  3.905558761511e-02
1800.00000  1850.00000  3.668897312576e-02
1850.00000  1900.00000  3.389997921120e-02
1900.00000  1950.00000  3.191302256398e-02
1950.00000  2000.00000  3.001956975898e-02
2000.00000  2050.00000  2.809709852018e-02
2050.00000  2100.00000  2.658733389534e-02
2100.00000  2150.00000  2.515495176060e-02
2150.00000  2200.00000  2.380962492725e-02
2200.00000  2250.00000  2.254651698965e-02
2250.00000  2300.00000  2.139787065200e-02
2300.00000  2350.00000  1.992679727221e-02
2350.00000  2400.00000  1.911911753164e-02
2400.00000  2450.00000  1.817279416294e-02
2450.00000  2500.00000  1.729821081112e-02
2500.00000  2550.00000  1.630352338610e-02
2550.00000  2600.00000  1.570219695250e-02
2600.00000  2650.00000  1.501703948794e-02
2650.00000  2700.00000  1.406991005163e-02
2700.00000  2750.00000  1.367493692501e-02
2750.00000  2800.00000  1.310182285759e-02
2800.00000  2850.00000  1.246905978738e-02
2850.00000  2900.00000  1.204023182133e-02
2900.00000  2950.00000  1.138409279056e-02
2950.00000  3000.00000  1.100846528646e-02
3000.00000  3050.00000  1.051192764156e-02
3050.00000  3100.00000  1.018547026138e-02
3100.00000  3150.00000  9.746969484065e-03
3150.00000  3200.00000  9.505955270062e-03
3200.00000  3250.00000  9.024732909659e-03
3250.00000  3300.00000  8.616056633739e-03
3300.00000  3350.00000  8.405672988739e-03
3350.00000  3400.00000  8.067124594486e-03
3400.00000  3450.00000  7.683436414333e-03
3450.00000  3500.00000  7.460155687647e-03
3500.00000  3550.00000  7.208662594773e-03
3550.00000  3600.00000  6.864471727283e-03
3600.00000  3650.00000  6.763713276612e-03
3650.00000  3700.00000  6.386473637302e-03
3700.00000  3750.00000  6.317957890846e-03
3750.00000  3800.00000  6.069689068393e-03
3800.00000  3850.00000  5.809329231861e-03
3850.00000  3900.00000  5.623933682627e-03
3900.00000  3950.00000  5.497381068585e-03
3950.00000  4000.00000  5.332943277090e-03
4000.00000  4050.00000  5.270876071477e-03
4050.00000  4100.00000  5.087092657454e-03
4100.00000  4150.00000  4.794490116707e-03
4150.00000  4200.00000  4.770308088546e-03
4200.00000  4250.00000  4.626021987186e-03
4250.00000  4300.00000  4.492214764695e-03
4300.00000  4350.00000  4.326164837990e-03
4350.00000  4400.00000  4.240721671822e-03
4400.00000  4450.00000  4.002931728239e-03
4450.00000  4500.00000  3.979555767684e-03
4500.00000  4550.00000  3.830433260691e-03
4550.00000  4600.00000  3.743377959312e-03
4600.00000  4650.00000  3.641813441036e-03
4650.00000  4700.00000  3.715971660730e-03
4700.00000  4750.00000  3.445939012933e-03
4750.00000  4800.00000  3.422563052377e-03
4800.00000  4850.00000  3.269410207358e-03
4850.00000  4900.00000  3.314549993258e-03
4900.00000  4950.00000  3.090463198967e-03
4950.00000  5000.00000  2.973583396189e-03
5000.00000  5050.00000  2.938922489158e-03
5050.00000  5100.00000  2.855897525806e-03
5100.00000  5150.00000  2.817206280748e-03
5150.00000  5200.00000  2.706775018813e-03
5200.00000  5250.00000  2.747078399082e-03
5250.00000  5300.00000  2.615689379407e-03
5300.00000  5350.00000  2.619719717434e-03
5350.00000  5400.00000  2.451251587913e-03
5400.00000  5450.00000  2.385960111878e-03
5450.00000  5500.00000  2.391602585116e-03
5500.00000  5550.00000  2.344044596399e-03
5550.00000  5600.00000  2.257795362625e-03
5600.00000  5650.00000  2.315026162606e-03
5650.00000  5700.00000  2.197340292223e-03
5700.00000  5750.00000  2.156230844350e-03
5750.00000  5800.00000  2.090133300710e-03
5800.00000  5850.00000  2.095775773947e-03
5850.00000  5900.00000  1.973253497932e-03
5900.00000  5950.00000  1.982120241591e-03
5950.00000  6000.00000  1.850731221917e-03
6000.00000  6050.00000  1.958744281035e-03
6050.00000  6100.00000  1.807203571227e-03
6100.00000  6150.00000  1.779797272644e-03
6150.00000  6200.00000  1.757227379694e-03
6200.00000  6250.00000  1.752390974062e-03
6250.00000  6300.00000  1.757227379694e-03
6300.00000  6350.00000  1.603268467070e-03
6350.00000  6400.00000  1.766900190959e-03
6400.00000  6450.00000  1.637929374100e-03
6450.00000  6500.00000  1.558934748775e-03
6500.00000  6550.00000  1.511376760058e-03
6550.00000  6600.00000  1.506540354426e-03
6600.00000  6650.00000  1.501703948794e-03
6650.00000  6700.00000  1.480746191054e-03
6700.00000  6750.00000  1.392078754464e-03
6750.00000  6800.00000  1.297768844637e-03
6800.00000  6850.00000  1.431576067127e-03
6850.00000  6900.00000  1.327593346035e-03
6900.00000  6950.00000  1.342908630537e-03
6950.00000  7000.00000  1.267944343238e-03
7000.00000  7050.00000  1.248598720709e-03
7050.00000  7100.00000  1.254241193947e-03
7100.00000  7150.00000  1.211519610863e-03
7150.00000  7200.00000  1.249404788315e-03
7200.00000  7250.00000  1.167991960173e-03
7250.00000  7300.00000  1.122852174273e-03
7300.00000  7350.00000  1.130106782721e-03
7350.00000  7400.00000  1.096251943295e-03
7400.00000  7450.00000  1.096251943295e-03
7450.00000  7500.00000  1.041439346131e-03
7500.00000  7550.00000  1.090609470058e-03
7550.00000  7600.00000  1.058366765843e-03
7600.00000  7650.00000  1.001942033468e-03
7650.00000  7700.00000  1.014033047548e-03
7700.00000  7750.00000  9.938813574142e-04
7750.00000  7800.00000  9.769539377016e-04
7800.00000  7850.00000  9.616386531996e-04
7850.00000  7900.00000  9.406808954602e-04
7900.00000  7950.00000  9.463233686977e-04
7950.00000  8000.00000  9.213352729314e-04
8000.00000  8050.00000  8.826440278739e-04
8050.00000  8100.00000  8.657166081613e-04
8100.00000  8150.00000  8.246071602877e-04
8150.00000  8200.00000  8.979593123759e-04
8200.00000  8250.00000  8.278314307092e-04
8250.00000  8300.00000  8.471770532379e-04
8300.00000  8350.00000  7.867219828356e-04
8350.00000  8400.00000  8.246071602877e-04
8400.00000  8450.00000  7.641520898854e-04
8450.00000  8500.00000  7.536732110156e-04
8500.00000  8550.00000  7.593156842532e-04
8550.00000  8600.00000  8.020372673375e-04
8600.00000  8650.00000  7.625399546747e-04
8650.00000  8700.00000  7.206244391957e-04
8700.00000  8750.00000  6.891878025865e-04
8750.00000  8800.00000  7.085334251152e-04
8800.00000  8850.00000  6.859635321650e-04
8850.00000  8900.00000  7.117576955367e-04
8900.00000  8950.00000  6.762907209007e-04
8950.00000  9000.00000  6.416298138700e-04
9000.00000  9050.00000  6.883817349811e-04
9050.00000  9100.00000  6.367934082378e-04
9100.00000  9150.00000  6.061628392340e-04
9150.00000  9200.00000  6.424358814754e-04
9200.00000  9250.00000  6.118053124715e-04
9250.00000  9300.00000  6.134174476823e-04
9300.00000  9350.00000  5.989082307857e-04
9350.00000  9400.00000  5.852050814945e-04
9400.00000  9450.00000  5.577987829121e-04
9450.00000  9500.00000  5.884293519160e-04
9500.00000  9550.00000  5.843990138891e-04
9550.00000  9600.00000  5.819808110730e-04
9600.00000  9650.00000  5.650533913604e-04
9650.00000  9700.00000  5.626351885443e-04
9700.00000  9750.00000  5.626351885443e-04
9750.00000  9800.00000  5.094347265903e-04
9800.00000  9850.00000  5.610230533336e-04
9850.00000  9900.00000  5.320046195405e-04
9900.00000  9950.00000  5.126589970117e-04
9950.00000  10000.00000  5.311985519351e-04
