300.00000  350.00000  5.265847398607e-05
350.00000  400.00000  5.989398949560e-05
400.00000  450.00000  6.029596257947e-05
450.00000  500.00000  7.195318201150e-05
500.00000  550.00000  7.195318201150e-05
550.00000  600.00000  5.225650090220e-05
600.00000  650.00000  7.074726275991e-05
650.00000  700.00000  9.265479583045e-05
700.00000  750.00000  1.073268133915e-04
750.00000  800.00000  1.372738081393e-04
800.00000  850.00000  1.839026858674e-04
850.00000  900.00000  1.845056454932e-04
900.00000  950.00000  2.027954208089e-04
950.00000  1000.00000  2.456055542404e-04
1000.00000  1050.00000  2.801752394526e-04
1050.00000  1100.00000  3.322307538129e-04
1100.00000  1150.00000  3.629816947284e-04
1150.00000  1200.00000  3.700162236960e-04
1200.00000  1250.00000  3.961444741471e-04
1250.00000  1300.00000  4.142332629209e-04
1300.00000  1350.00000  3.519274349222e-04
1350.00000  1400.00000  3.832813354635e-04
1400.00000  1450.00000  3.792616046248e-04
1450.00000  1500.00000  4.055908416179e-04
1500.00000  1550.00000  3.943355952697e-04
1550.00000  1600.00000  3.873010663021e-04
1600.00000  1650.00000  3.854921874247e-04
1650.00000  1700.00000  3.971494068568e-04
1700.00000  1750.00000  4.170470745080e-04
1750.00000  1800.00000  3.820754162119e-04
1800.00000  1850.00000  3.573540715543e-04
1850.00000  1900.00000  3.535353272576e-04
1900.00000  1950.00000  3.555451926769e-04
1950.00000  2000.00000  3.712221429476e-04
2000.00000  2050.00000  3.818744296700e-04
2050.00000  2100.00000  3.738349679927e-04
2100.00000  2150.00000  3.901148778891e-04
2150.00000  2200.00000  3.682073448186e-04
2200.00000  2250.00000  3.897129048053e-04
2250.00000  2300.00000  3.917227702246e-04
2300.00000  2350.00000  4.540285982234e-04
2350.00000  2400.00000  3.891099451795e-04
2400.00000  2450.00000  3.862961335924e-04
2450.00000  2500.00000  3.678053717347e-04
2500.00000  2550.00000  3.694132640702e-04
2550.00000  2600.00000  3.655945197735e-04
2600.00000  2650.00000  3.561481523027e-04
2650.00000  2700.00000  3.386623231547e-04
2700.00000  2750.00000  3.458978386642e-04
2750.00000  2800.00000  3.507215156706e-04
2800.00000  2850.00000  3.515254618383e-04
2850.00000  2900.00000  3.412751481998e-04
2900.00000  2950.00000  3.489126367932e-04
2950.00000  3000.00000  3.603688696833e-04
3000.00000  3050.00000  3.324317403548e-04
3050.00000  3100.00000  3.260001710130e-04
3100.00000  3150.00000  3.241912921356e-04
3150.00000  3200.00000  3.167547900841e-04
3200.00000  3250.00000  3.016807994393e-04
3250.00000  3300.00000  3.159508439164e-04
3300.00000  3350.00000  2.771604413236e-04
3350.00000  3400.00000  2.876117415041e-04
3400.00000  3450.00000  2.898225934653e-04
3450.00000  3500.00000  2.719347912334e-04
3500.00000  3550.00000  2.749495893624e-04
3550.00000  3600.00000  2.693219661883e-04
3600.00000  3650.00000  2.550519217111e-04
3650.00000  3700.00000  2.693219661883e-04
3700.00000  3750.00000  2.490223254532e-04
3750.00000  3800.00000  2.309335366794e-04
3800.00000  3850.00000  2.301295905116e-04
3850.00000  3900.00000  2.433947022791e-04
3900.00000  3950.00000  2.186733576215e-04
3950.00000  4000.00000  2.162615191184e-04
4000.00000  4050.00000  2.052072593121e-04
4050.00000  4100.00000  1.951579322155e-04
4100.00000  4150.00000  2.050062727702e-04
4150.00000  4200.00000  1.832997262416e-04
4200.00000  4250.00000  1.897312955834e-04
4250.00000  4300.00000  1.830987396996e-04
4300.00000  4350.00000  1.714415202676e-04
4350.00000  4400.00000  1.762651972740e-04
4400.00000  4450.00000  1.670198163451e-04
4450.00000  4500.00000  1.666178432613e-04
4500.00000  4550.00000  1.668188298032e-04
4550.00000  4600.00000  1.623971258807e-04
4600.00000  4650.00000  1.465191890681e-04
4650.00000  4700.00000  1.541566776615e-04
4700.00000  4750.00000  1.481270814036e-04
4750.00000  4800.00000  1.437053774811e-04
4800.00000  4850.00000  1.481270814036e-04
4850.00000  4900.00000  1.380777543070e-04
4900.00000  4950.00000  1.195869924493e-04
4950.00000  5000.00000  1.270234945007e-04
5000.00000  5050.00000  1.246116559976e-04
5050.00000  5100.00000  1.288323733781e-04
5100.00000  5150.00000  1.181800866558e-04
5150.00000  5200.00000  1.294353330039e-04
5200.00000  5250.00000  1.151652885268e-04
5250.00000  5300.00000  1.157682481526e-04
5300.00000  5350.00000  1.141603558171e-04
5350.00000  5400.00000  1.023021498432e-04
5400.00000  5450.00000  1.069248403076e-04
5450.00000  5500.00000  1.053169479721e-04
5500.00000  5550.00000  1.111455576882e-04
5550.00000  5600.00000  9.908636517226e-05
5600.00000  5650.00000  1.031060960109e-04
5650.00000  5700.00000  9.767945937874e-05
5700.00000  5750.00000  9.205183620465e-05
5750.00000  5800.00000  9.164986312079e-05
5800.00000  5850.00000  8.099757639842e-05
5850.00000  5900.00000  8.300744181773e-05
5900.00000  5950.00000  7.657587247592e-05
5950.00000  6000.00000  8.742914574023e-05
6000.00000  6050.00000  7.516896668240e-05
6050.00000  6100.00000  7.737981864365e-05
6100.00000  6150.00000  7.456600705661e-05
6150.00000  6200.00000  6.913937042446e-05
6200.00000  6250.00000  8.220349565001e-05
6250.00000  6300.00000  7.496798014047e-05
6300.00000  6350.00000  6.692851846321e-05
6350.00000  6400.00000  3.328337134387e-04
6400.00000  6450.00000  7.054627621798e-05
6450.00000  6500.00000  6.310977416651e-05
6500.00000  6550.00000  5.989398949560e-05
6550.00000  6600.00000  6.511963958582e-05
6600.00000  6650.00000  6.009497603754e-05
6650.00000  6700.00000  6.491865304389e-05
6700.00000  6750.00000  5.265847398607e-05
6750.00000  6800.00000  5.386439323766e-05
6800.00000  6850.00000  5.507031248925e-05
6850.00000  6900.00000  5.105058165062e-05
6900.00000  6950.00000  4.984466239903e-05
6950.00000  7000.00000  5.446735286345e-05
7000.00000  7050.00000  5.245748744414e-05
7050.00000  7100.00000  7.818376481137e-05
7100.00000  7150.00000  5.105058165062e-05
7150.00000  7200.00000  4.843775660550e-05
7200.00000  7250.00000  4.542295847653e-05
7250.00000  7300.00000  4.441802576687e-05
7300.00000  7350.00000  4.321210651528e-05
7350.00000  7400.00000  4.301111997335e-05
7400.00000  7450.00000  5.044762202482e-05
7450.00000  7500.00000  4.984466239903e-05
7500.00000  7550.00000  4.059928147017e-05
7550.00000  7600.00000  4.100125455404e-05
7600.00000  7650.00000  3.858941605086e-05
7650.00000  7700.00000  4.140322763790e-05
7700.00000  7750.00000  3.678053717347e-05
7750.00000  7800.00000  3.376573904450e-05
7800.00000  7850.00000  3.336376596064e-05
7850.00000  7900.00000  4.080026801211e-05
7900.00000  7950.00000  4.080026801211e-05
7950.00000  8000.00000  2.934403512201e-05
8000.00000  8050.00000  2.974600820587e-05
8050.00000  8100.00000  3.718251025734e-05
8100.00000  8150.00000  3.396672558643e-05
8150.00000  8200.00000  3.155488708325e-05
8200.00000  8250.00000  3.235883325098e-05
8250.00000  8300.00000  3.235883325098e-05
8300.00000  8350.00000  3.617757754768e-05
8350.00000  8400.00000  3.276080633484e-05
8400.00000  8450.00000  2.532430428338e-05
8450.00000  8500.00000  3.195686016712e-05
8500.00000  8550.00000  3.054995437360e-05
8550.00000  8600.00000  2.632923699303e-05
8600.00000  8650.00000  2.833910241235e-05
8650.00000  8700.00000  2.653022353497e-05
8700.00000  8750.00000  2.271147923827e-05
8750.00000  8800.00000  2.934403512201e-05
8800.00000  8850.00000  2.813811587042e-05
8850.00000  8900.00000  2.653022353497e-05
8900.00000  8950.00000  2.833910241235e-05
8950.00000  9000.00000  2.773614278655e-05
9000.00000  9050.00000  2.472134465758e-05
9050.00000  9100.00000  2.673121007690e-05
9100.00000  9150.00000  2.492233119951e-05
9150.00000  9200.00000  2.391739848986e-05
9200.00000  9250.00000  2.150555998668e-05
9250.00000  9300.00000  2.251049269633e-05
9300.00000  9350.00000  2.894206203814e-05
9350.00000  9400.00000  2.391739848986e-05
9400.00000  9450.00000  2.713318316076e-05
9450.00000  9500.00000  2.009865419316e-05
9500.00000  9550.00000  2.009865419316e-05
9550.00000  9600.00000  2.210851961247e-05
9600.00000  9650.00000  2.090260036088e-05
9650.00000  9700.00000  2.230950615440e-05
9700.00000  9750.00000  2.190753307054e-05
9750.00000  9800.00000  2.130457344474e-05
9800.00000  9850.00000  2.391739848986e-05
9850.00000  9900.00000  1.989766765122e-05
9900.00000  9950.00000  2.170654652861e-05
9950.00000  10000.00000  2.009865419316e-05
