300.00000  350.00000  8.219820549333e-02
350.00000  400.00000  6.179229134431e-02
400.00000  450.00000  4.800196332540e-02
450.00000  500.00000  3.837894274662e-02
500.00000  550.00000  3.156824858509e-02
550.00000  600.00000  2.629609862391e-02
600.00000  650.00000  2.233236544141e-02
650.00000  700.00000  1.952619627959e-02
700.00000  750.00000  1.726378973785e-02
750.00000  800.00000  1.563327153453e-02
800.00000  850.00000  1.434255686520e-02
850.00000  900.00000  1.311495406402e-02
900.00000  950.00000  1.212709939611e-02
950.00000  1000.00000  1.148174206145e-02
1000.00000  1050.00000  1.089949659493e-02
1050.00000  1100.00000  1.041576721528e-02
1100.00000  1150.00000  9.960515141991e-03
1150.00000  1200.00000  9.613784695639e-03
1200.00000  1250.00000  9.332475088221e-03
1250.00000  1300.00000  8.836816026177e-03
1300.00000  1350.00000  8.340387307204e-03
1350.00000  1400.00000  7.998274802424e-03
1400.00000  1450.00000  7.644232615250e-03
1450.00000  1500.00000  7.369080263261e-03
1500.00000  1550.00000  7.047748495554e-03
1550.00000  1600.00000  6.878423971253e-03
1600.00000  1650.00000  6.458576116680e-03
1650.00000  1700.00000  6.208052786408e-03
1700.00000  1750.00000  6.082213878575e-03
1750.00000  1800.00000  5.750491742332e-03
1800.00000  1850.00000  5.493811156630e-03
1850.00000  1900.00000  5.180945615138e-03
1900.00000  1950.00000  5.041637711055e-03
1950.00000  2000.00000  4.837678624965e-03
2000.00000  2050.00000  4.648343020520e-03
2050.00000  2100.00000  4.476709525433e-03
2100.00000  2150.00000  4.256202815378e-03
2150.00000  2200.00000  4.131518392938e-03
2200.00000  2250.00000  3.991056003461e-03
2250.00000  2300.00000  3.824425278411e-03
2300.00000  2350.00000  3.724754706152e-03
2350.00000  2400.00000  3.582753002818e-03
2400.00000  2450.00000  3.448063040306e-03
2450.00000  2500.00000  3.297210282293e-03
2500.00000  2550.00000  3.154054093566e-03
2550.00000  2600.00000  3.063619404450e-03
2600.00000  2650.00000  2.988193025444e-03
2650.00000  2700.00000  2.876977599255e-03
2700.00000  2750.00000  2.751523519887e-03
2750.00000  2800.00000  2.669939885451e-03
2800.00000  2850.00000  2.558724459263e-03
2850.00000  2900.00000  2.467135284755e-03
2900.00000  2950.00000  2.384781993390e-03
2950.00000  3000.00000  2.328981866064e-03
3000.00000  3050.00000  2.240086490806e-03
3050.00000  3100.00000  2.221229896054e-03
3100.00000  3150.00000  2.140415918547e-03
3150.00000  3200.00000  2.083461305828e-03
3200.00000  3250.00000  2.002262499856e-03
3250.00000  3300.00000  1.994950759034e-03
3300.00000  3350.00000  1.915291266920e-03
3350.00000  3400.00000  1.873344964309e-03
3400.00000  3450.00000  1.817160008518e-03
3450.00000  3500.00000  1.741348801047e-03
3500.00000  3550.00000  1.688627301436e-03
3550.00000  3600.00000  1.673618991327e-03
3600.00000  3650.00000  1.634366487966e-03
3650.00000  3700.00000  1.605119524678e-03
3700.00000  3750.00000  1.483128901489e-03
3750.00000  3800.00000  1.491595127704e-03
3800.00000  3850.00000  1.454266766665e-03
3850.00000  3900.00000  1.447339854307e-03
3900.00000  3950.00000  1.393848697767e-03
3950.00000  4000.00000  1.358444479049e-03
4000.00000  4050.00000  1.323040260332e-03
4050.00000  4100.00000  1.280324300792e-03
4100.00000  4150.00000  1.225678658859e-03
4150.00000  4200.00000  1.157948849138e-03
4200.00000  4250.00000  1.237223512788e-03
4250.00000  4300.00000  1.189504783213e-03
4300.00000  4350.00000  1.150637108316e-03
4350.00000  4400.00000  1.131395685100e-03
4400.00000  4450.00000  1.063281046916e-03
4450.00000  4500.00000  1.098685265633e-03
4500.00000  4550.00000  1.093297667133e-03
4550.00000  4600.00000  1.047503079879e-03
4600.00000  4650.00000  9.913181240880e-04
4650.00000  4700.00000  1.020180258912e-03
4700.00000  4750.00000  9.763098139795e-04
4750.00000  4800.00000  9.451387083696e-04
4800.00000  4850.00000  9.647649600499e-04
4850.00000  4900.00000  9.020379203658e-04
4900.00000  4950.00000  8.816420117568e-04
4950.00000  5000.00000  9.128131173667e-04
5000.00000  5050.00000  8.839509825427e-04
5050.00000  5100.00000  8.635550739338e-04
5100.00000  5150.00000  8.446984791821e-04
5150.00000  5200.00000  8.389260522173e-04
5200.00000  5250.00000  8.119880597149e-04
5250.00000  5300.00000  7.885135233914e-04
5300.00000  5350.00000  7.896680087844e-04
5350.00000  5400.00000  7.465672207805e-04
5400.00000  5450.00000  7.323285676007e-04
5450.00000  5500.00000  7.250168267786e-04
5500.00000  5550.00000  7.500306769594e-04
5550.00000  5600.00000  7.261713121716e-04
5600.00000  5650.00000  7.215533705998e-04
5650.00000  5700.00000  6.969243488833e-04
5700.00000  5750.00000  6.680622140593e-04
5750.00000  5800.00000  6.592111593799e-04
5800.00000  5850.00000  6.515145900935e-04
5850.00000  5900.00000  6.626746155588e-04
5900.00000  5950.00000  6.511297616292e-04
5950.00000  6000.00000  6.276552253057e-04
6000.00000  6050.00000  6.034110320536e-04
6050.00000  6100.00000  6.249614260555e-04
6100.00000  6150.00000  5.853240942305e-04
6150.00000  6200.00000  6.118772582686e-04
6200.00000  6250.00000  5.914813496596e-04
6250.00000  6300.00000  5.737792403009e-04
6300.00000  6350.00000  6.138014005902e-04
6350.00000  6400.00000  1.219906231894e-03
6400.00000  6450.00000  5.441474485483e-04
6450.00000  6500.00000  5.202880837605e-04
6500.00000  6550.00000  4.945045766510e-04
6550.00000  6600.00000  4.948894051153e-04
6600.00000  6650.00000  5.275998245825e-04
6650.00000  6700.00000  5.110522006168e-04
6700.00000  6750.00000  5.095128867595e-04
6750.00000  6800.00000  4.971983759013e-04
6800.00000  6850.00000  4.802659234712e-04
6850.00000  6900.00000  4.895018066149e-04
6900.00000  6950.00000  4.706452118632e-04
6950.00000  7000.00000  4.648727848984e-04
7000.00000  7050.00000  4.544824163618e-04
7050.00000  7100.00000  5.399143354408e-04
7100.00000  7150.00000  4.183085407157e-04
7150.00000  7200.00000  4.036850590715e-04
7200.00000  7250.00000  4.056092013931e-04
7250.00000  7300.00000  3.986822890354e-04
7300.00000  7350.00000  3.925250336063e-04
7350.00000  7400.00000  3.959884897851e-04
7400.00000  7450.00000  3.994519459640e-04
7450.00000  7500.00000  4.094574860363e-04
7500.00000  7550.00000  3.875222635701e-04
7550.00000  7600.00000  3.598146141391e-04
7600.00000  7650.00000  3.748229242476e-04
7650.00000  7700.00000  3.717442965330e-04
7700.00000  7750.00000  3.421125047804e-04
7750.00000  7800.00000  3.459607894236e-04
7800.00000  7850.00000  3.752077527119e-04
7850.00000  7900.00000  3.486545886738e-04
7900.00000  7950.00000  3.525028733170e-04
7950.00000  8000.00000  3.555815010316e-04
8000.00000  8050.00000  3.297979939221e-04
8050.00000  8100.00000  3.367249062799e-04
8100.00000  8150.00000  3.097869137775e-04
8150.00000  8200.00000  3.097869137775e-04
8200.00000  8250.00000  2.974724029193e-04
8250.00000  8300.00000  3.105565707061e-04
8300.00000  8350.00000  3.028600014197e-04
8350.00000  8400.00000  3.043993152770e-04
8400.00000  8450.00000  3.009358590981e-04
8450.00000  8500.00000  2.920848044188e-04
8500.00000  8550.00000  3.136351984207e-04
8550.00000  8600.00000  2.986268883122e-04
8600.00000  8650.00000  2.805399504892e-04
8650.00000  8700.00000  2.866972059183e-04
8700.00000  8750.00000  2.743826950601e-04
8750.00000  8800.00000  2.874668628469e-04
8800.00000  8850.00000  2.628378411305e-04
8850.00000  8900.00000  2.728433812028e-04
8900.00000  8950.00000  2.636074980591e-04
8950.00000  9000.00000  2.716888958098e-04
9000.00000  9050.00000  2.651468119164e-04
9050.00000  9100.00000  2.516778156652e-04
9100.00000  9150.00000  2.447509033074e-04
9150.00000  9200.00000  2.582198995586e-04
9200.00000  9250.00000  2.528323010582e-04
9250.00000  9300.00000  2.239701662342e-04
9300.00000  9350.00000  2.435964179145e-04
9350.00000  9400.00000  2.416722755929e-04
9400.00000  9450.00000  2.412874471286e-04
9450.00000  9500.00000  2.401329617356e-04
9500.00000  9550.00000  2.235853377698e-04
9550.00000  9600.00000  2.432115894502e-04
9600.00000  9650.00000  2.285881078060e-04
9650.00000  9700.00000  2.282032793417e-04
9700.00000  9750.00000  2.124253123046e-04
9750.00000  9800.00000  2.239701662342e-04
9800.00000  9850.00000  2.370543340210e-04
9850.00000  9900.00000  2.047287430182e-04
9900.00000  9950.00000  2.151191115548e-04
9950.00000  10000.00000  2.051135714825e-04
