300.00000  350.00000  4.752196907873e-05
350.00000  400.00000  9.949912275859e-05
400.00000  450.00000  5.643233828099e-05
450.00000  500.00000  6.311511518269e-05
500.00000  550.00000  4.017091448687e-04
550.00000  600.00000  4.900703061244e-05
600.00000  650.00000  1.128646765620e-04
650.00000  700.00000  6.014499211527e-05
700.00000  750.00000  9.207381509004e-05
750.00000  800.00000  5.123462291301e-05
800.00000  850.00000  1.722671379104e-04
850.00000  900.00000  5.346221521357e-05
900.00000  950.00000  4.306678447760e-05
950.00000  1000.00000  5.420474598043e-05
1000.00000  1050.00000  4.603690754502e-05
1050.00000  1100.00000  4.380931524446e-05
1100.00000  1150.00000  4.306678447760e-05
1150.00000  1200.00000  4.529437677817e-05
1200.00000  1250.00000  5.568980751414e-05
1250.00000  1300.00000  1.254876995985e-04
1300.00000  1350.00000  4.826449984559e-05
1350.00000  1400.00000  4.677943831188e-05
1400.00000  1450.00000  5.123462291301e-05
1450.00000  1500.00000  6.608523825011e-05
1500.00000  1550.00000  4.677943831188e-05
1550.00000  1600.00000  5.197715367986e-05
1600.00000  1650.00000  4.380931524446e-05
1650.00000  1700.00000  5.717486904785e-05
1700.00000  1750.00000  1.574165225733e-04
1750.00000  1800.00000  6.163005364898e-05
1800.00000  1850.00000  5.568980751414e-05
1850.00000  1900.00000  5.197715367986e-05
1900.00000  1950.00000  5.420474598043e-05
1950.00000  2000.00000  6.534270748326e-05
2000.00000  2050.00000  4.529437677817e-05
2050.00000  2100.00000  5.049209214615e-05
2100.00000  2150.00000  5.865993058156e-05
2150.00000  2200.00000  4.083919217703e-05
2200.00000  2250.00000  4.752196907873e-05
2250.00000  2300.00000  5.940246134841e-05
2300.00000  2350.00000  1.292003534328e-04
2350.00000  2400.00000  4.677943831188e-05
2400.00000  2450.00000  5.643233828099e-05
2450.00000  2500.00000  6.163005364898e-05
2500.00000  2550.00000  4.677943831188e-05
2550.00000  2600.00000  4.677943831188e-05
2600.00000  2650.00000  5.271968444672e-05
2650.00000  2700.00000  5.717486904785e-05
2700.00000  2750.00000  4.158172294389e-05
2750.00000  2800.00000  3.564147680905e-05
2800.00000  2850.00000  4.232425371075e-05
2850.00000  2900.00000  3.564147680905e-05
2900.00000  2950.00000  4.974956137930e-05
2950.00000  3000.00000  5.271968444672e-05
3000.00000  3050.00000  3.861159987647e-05
3050.00000  3100.00000  3.341388450848e-05
3100.00000  3150.00000  5.049209214615e-05
3150.00000  3200.00000  3.192882297477e-05
3200.00000  3250.00000  3.712653834276e-05
3250.00000  3300.00000  4.009666141018e-05
3300.00000  3350.00000  2.970123067421e-05
3350.00000  3400.00000  2.598857683993e-05
3400.00000  3450.00000  3.341388450848e-05
3450.00000  3500.00000  3.044376144106e-05
3500.00000  3550.00000  2.895869990735e-05
3550.00000  3600.00000  3.341388450848e-05
3600.00000  3650.00000  3.861159987647e-05
3650.00000  3700.00000  3.118629220792e-05
3700.00000  3750.00000  2.524604607308e-05
3750.00000  3800.00000  3.341388450848e-05
3800.00000  3850.00000  3.192882297477e-05
3850.00000  3900.00000  3.489894604219e-05
3900.00000  3950.00000  2.821616914050e-05
3950.00000  4000.00000  2.673110760679e-05
4000.00000  4050.00000  2.895869990735e-05
4050.00000  4100.00000  1.930579993823e-05
4100.00000  4150.00000  2.301845377251e-05
4150.00000  4200.00000  1.707820763767e-05
4200.00000  4250.00000  2.673110760679e-05
4250.00000  4300.00000  2.524604607308e-05
4300.00000  4350.00000  2.524604607308e-05
4350.00000  4400.00000  3.192882297477e-05
4400.00000  4450.00000  2.301845377251e-05
4450.00000  4500.00000  2.153339223880e-05
4500.00000  4550.00000  2.450351530622e-05
4550.00000  4600.00000  2.524604607308e-05
4600.00000  4650.00000  1.930579993823e-05
4650.00000  4700.00000  2.301845377251e-05
4700.00000  4750.00000  2.524604607308e-05
4750.00000  4800.00000  1.188049226968e-05
4800.00000  4850.00000  1.856326917138e-05
4850.00000  4900.00000  1.485061533710e-05
4900.00000  4950.00000  1.633567687081e-05
4950.00000  5000.00000  1.856326917138e-05
5000.00000  5050.00000  1.336555380339e-05
5050.00000  5100.00000  1.410808457025e-05
5100.00000  5150.00000  1.336555380339e-05
5150.00000  5200.00000  1.633567687081e-05
5200.00000  5250.00000  1.707820763767e-05
5250.00000  5300.00000  1.113796150283e-05
5300.00000  5350.00000  1.188049226968e-05
5350.00000  5400.00000  1.188049226968e-05
5400.00000  5450.00000  1.113796150283e-05
5450.00000  5500.00000  1.485061533710e-05
5500.00000  5550.00000  1.485061533710e-05
5550.00000  5600.00000  1.262302303654e-05
5600.00000  5650.00000  1.856326917138e-05
5650.00000  5700.00000  1.410808457025e-05
5700.00000  5750.00000  1.188049226968e-05
5750.00000  5800.00000  1.633567687081e-05
5800.00000  5850.00000  1.113796150283e-05
5850.00000  5900.00000  8.910369202262e-06
5900.00000  5950.00000  6.682776901697e-06
5950.00000  6000.00000  6.682776901697e-06
6000.00000  6050.00000  5.940246134841e-06
6050.00000  6100.00000  9.652899969117e-06
6100.00000  6150.00000  5.940246134841e-06
6150.00000  6200.00000  8.167838435407e-06
6200.00000  6250.00000  1.188049226968e-05
6250.00000  6300.00000  1.633567687081e-05
6300.00000  6350.00000  1.188049226968e-05
6350.00000  6400.00000  1.150922688626e-04
6400.00000  6450.00000  8.910369202262e-06
6450.00000  6500.00000  5.197715367986e-06
6500.00000  6550.00000  9.652899969117e-06
6550.00000  6600.00000  6.682776901697e-06
6600.00000  6650.00000  8.167838435407e-06
6650.00000  6700.00000  1.262302303654e-05
6700.00000  6750.00000  9.652899969117e-06
6750.00000  6800.00000  1.039543073597e-05
6800.00000  6850.00000  1.262302303654e-05
6850.00000  6900.00000  8.167838435407e-06
6900.00000  6950.00000  1.336555380339e-05
6950.00000  7000.00000  6.682776901697e-06
7000.00000  7050.00000  7.425307668552e-06
7050.00000  7100.00000  1.782073840452e-05
7100.00000  7150.00000  1.188049226968e-05
7150.00000  7200.00000  8.167838435407e-06
7200.00000  7250.00000  7.425307668552e-06
7250.00000  7300.00000  4.455184601131e-06
7300.00000  7350.00000  5.940246134841e-06
7350.00000  7400.00000  5.197715367986e-06
7400.00000  7450.00000  5.197715367986e-06
7450.00000  7500.00000  1.188049226968e-05
7500.00000  7550.00000  1.039543073597e-05
7550.00000  7600.00000  6.682776901697e-06
7600.00000  7650.00000  2.970123067421e-06
7650.00000  7700.00000  5.197715367986e-06
7700.00000  7750.00000  4.455184601131e-06
7750.00000  7800.00000  4.455184601131e-06
7800.00000  7850.00000  3.712653834276e-06
7850.00000  7900.00000  2.227592300566e-06
7900.00000  7950.00000  5.940246134841e-06
7950.00000  8000.00000  2.970123067421e-06
8000.00000  8050.00000  3.712653834276e-06
8050.00000  8100.00000  6.682776901697e-06
8100.00000  8150.00000  5.940246134841e-06
8150.00000  8200.00000  5.197715367986e-06
8200.00000  8250.00000  5.940246134841e-06
8250.00000  8300.00000  5.197715367986e-06
8300.00000  8350.00000  3.712653834276e-06
8350.00000  8400.00000  7.425307668552e-06
8400.00000  8450.00000  1.485061533710e-06
8450.00000  8500.00000  8.167838435407e-06
8500.00000  8550.00000  4.455184601131e-06
8550.00000  8600.00000  2.227592300566e-06
8600.00000  8650.00000  4.455184601131e-06
8650.00000  8700.00000  3.712653834276e-06
8700.00000  8750.00000  3.712653834276e-06
8750.00000  8800.00000  2.970123067421e-06
8800.00000  8850.00000  2.970123067421e-06
8850.00000  8900.00000  6.682776901697e-06
8900.00000  8950.00000  4.455184601131e-06
8950.00000  9000.00000  3.712653834276e-06
9000.00000  9050.00000  4.455184601131e-06
9050.00000  9100.00000  2.227592300566e-06
9100.00000  9150.00000  2.227592300566e-06
9150.00000  9200.00000  1.485061533710e-06
9200.00000  9250.00000  2.970123067421e-06
9250.00000  9300.00000  3.712653834276e-06
9300.00000  9350.00000  2.970123067421e-06
9350.00000  9400.00000  2.227592300566e-06
9400.00000  9450.00000  1.485061533710e-06
9450.00000  9500.00000  5.197715367986e-06
9500.00000  9550.00000  6.682776901697e-06
9550.00000  9600.00000  2.227592300566e-06
9600.00000  9650.00000  1.485061533710e-06
9650.00000  9700.00000  2.970123067421e-06
9700.00000  9750.00000  3.712653834276e-06
9750.00000  9800.00000  5.197715367986e-06
9800.00000  9850.00000  2.227592300566e-06
9850.00000  9900.00000  3.712653834276e-06
9900.00000  9950.00000  7.425307668552e-07
9950.00000  10000.00000  2.970123067421e-06
