300.00000  350.00000  5.031214388015e-04
350.00000  400.00000  3.974361661539e-04
400.00000  450.00000  3.282197551945e-04
450.00000  500.00000  3.014263057909e-04
500.00000  550.00000  3.818066540018e-04
550.00000  600.00000  1.949967706598e-04
600.00000  650.00000  3.148230304927e-04
650.00000  700.00000  4.807935642985e-04
700.00000  750.00000  6.482526230712e-04
750.00000  800.00000  8.819510428696e-04
800.00000  850.00000  1.181144561210e-03
850.00000  900.00000  1.100019950516e-03
900.00000  950.00000  1.155839636773e-03
950.00000  1000.00000  1.290551146275e-03
1000.00000  1050.00000  1.388049531605e-03
1050.00000  1100.00000  1.333718370314e-03
1100.00000  1150.00000  1.417820030942e-03
1150.00000  1200.00000  1.431216755644e-03
1200.00000  1250.00000  1.342649520115e-03
1250.00000  1300.00000  1.235475722501e-03
1300.00000  1350.00000  1.134256024754e-03
1350.00000  1400.00000  1.004754352636e-03
1400.00000  1450.00000  1.008475665053e-03
1450.00000  1500.00000  9.988002527687e-04
1500.00000  1550.00000  9.191641670413e-04
1550.00000  1600.00000  8.075247945261e-04
1600.00000  1650.00000  7.874297074734e-04
1650.00000  1700.00000  7.345870711496e-04
1700.00000  1750.00000  6.973739469779e-04
1750.00000  1800.00000  6.668591851571e-04
1800.00000  1850.00000  5.760591621781e-04
1850.00000  1900.00000  5.477771878076e-04
1900.00000  1950.00000  5.336362006223e-04
1950.00000  2000.00000  5.038657012850e-04
2000.00000  2050.00000  5.180066884702e-04
2050.00000  2100.00000  4.353935528090e-04
2100.00000  2150.00000  4.644197896630e-04
2150.00000  2200.00000  4.592099522789e-04
2200.00000  2250.00000  4.279509279747e-04
2250.00000  2300.00000  4.130656783060e-04
2300.00000  2350.00000  4.577214273120e-04
2350.00000  2400.00000  3.981804286373e-04
2400.00000  2450.00000  4.286951904581e-04
2450.00000  2500.00000  3.684099292999e-04
2500.00000  2550.00000  3.743640291674e-04
2550.00000  2600.00000  3.542689421147e-04
2600.00000  2650.00000  3.289640176779e-04
2650.00000  2700.00000  3.408722174129e-04
2700.00000  2750.00000  3.617115669490e-04
2750.00000  2800.00000  2.969607308903e-04
2800.00000  2850.00000  3.192886053933e-04
2850.00000  2900.00000  3.073804056583e-04
2900.00000  2950.00000  3.096131931086e-04
2950.00000  3000.00000  3.304525426448e-04
3000.00000  3050.00000  2.954722059234e-04
3050.00000  3100.00000  3.230099178105e-04
3100.00000  3150.00000  2.872853186056e-04
3150.00000  3200.00000  2.917508935062e-04
3200.00000  3250.00000  2.962164684068e-04
3250.00000  3300.00000  2.753771188707e-04
3300.00000  3350.00000  2.701672814866e-04
3350.00000  3400.00000  2.709115439701e-04
3400.00000  3450.00000  2.411410446327e-04
3450.00000  3500.00000  2.731443314204e-04
3500.00000  3550.00000  2.552820318179e-04
3550.00000  3600.00000  2.456066195333e-04
3600.00000  3650.00000  2.374197322155e-04
3650.00000  3700.00000  2.820754812216e-04
3700.00000  3750.00000  2.590033442351e-04
3750.00000  3800.00000  2.657017065860e-04
3800.00000  3850.00000  2.255115324806e-04
3850.00000  3900.00000  2.336984197983e-04
3900.00000  3950.00000  2.463508820167e-04
3950.00000  4000.00000  2.344426822818e-04
4000.00000  4050.00000  2.322098948315e-04
4050.00000  4100.00000  2.284885824143e-04
4100.00000  4150.00000  2.106262828119e-04
4150.00000  4200.00000  2.255115324806e-04
4200.00000  4250.00000  2.292328448977e-04
4250.00000  4300.00000  2.121148077788e-04
4300.00000  4350.00000  2.106262828119e-04
4350.00000  4400.00000  1.927639832095e-04
4400.00000  4450.00000  1.979738205935e-04
4450.00000  4500.00000  2.069049703947e-04
4500.00000  4550.00000  2.024393954941e-04
4550.00000  4600.00000  1.719246336733e-04
4600.00000  4650.00000  1.845770958917e-04
4650.00000  4700.00000  1.816000459580e-04
4700.00000  4750.00000  1.734131586402e-04
4750.00000  4800.00000  2.031836579775e-04
4800.00000  4850.00000  1.689475837396e-04
4850.00000  4900.00000  1.808557834745e-04
4900.00000  4950.00000  1.778787335408e-04
4950.00000  5000.00000  1.667147962893e-04
5000.00000  5050.00000  1.808557834745e-04
5050.00000  5100.00000  1.704361087064e-04
5100.00000  5150.00000  1.823443084414e-04
5150.00000  5200.00000  1.689475837396e-04
5200.00000  5250.00000  1.592721714549e-04
5250.00000  5300.00000  1.525738091040e-04
5300.00000  5350.00000  1.615049589052e-04
5350.00000  5400.00000  1.659705338058e-04
5400.00000  5450.00000  1.763902085739e-04
5450.00000  5500.00000  1.525738091040e-04
5500.00000  5550.00000  1.428983968194e-04
5550.00000  5600.00000  1.436426593028e-04
5600.00000  5650.00000  1.622492213887e-04
5650.00000  5700.00000  1.592721714549e-04
5700.00000  5750.00000  1.354557719850e-04
5750.00000  5800.00000  1.473639717200e-04
5800.00000  5850.00000  1.466197092365e-04
5850.00000  5900.00000  1.421541343359e-04
5900.00000  5950.00000  1.451311842697e-04
5950.00000  6000.00000  1.414098718525e-04
6000.00000  6050.00000  1.458754467531e-04
6050.00000  6100.00000  1.220590472832e-04
6100.00000  6150.00000  1.295016721176e-04
6150.00000  6200.00000  1.481082342034e-04
6200.00000  6250.00000  1.555508590378e-04
6250.00000  6300.00000  1.734131586402e-04
6300.00000  6350.00000  1.682033212561e-04
6350.00000  6400.00000  1.026337964656e-03
6400.00000  6450.00000  1.324787220513e-04
6450.00000  6500.00000  1.190819973495e-04
6500.00000  6550.00000  1.354557719850e-04
6550.00000  6600.00000  1.280131471507e-04
6600.00000  6650.00000  1.287574096341e-04
6650.00000  6700.00000  1.146164224489e-04
6700.00000  6750.00000  1.153606849323e-04
6750.00000  6800.00000  1.324787220513e-04
6800.00000  6850.00000  1.012196977471e-04
6850.00000  6900.00000  1.123836349986e-04
6900.00000  6950.00000  1.183377348660e-04
6950.00000  7000.00000  1.153606849323e-04
7000.00000  7050.00000  1.041967476808e-04
7050.00000  7100.00000  2.165803826794e-04
7100.00000  7150.00000  7.070493592625e-05
7150.00000  7200.00000  5.730821122444e-05
7200.00000  7250.00000  7.070493592625e-05
7250.00000  7300.00000  6.623936102565e-05
7300.00000  7350.00000  6.177378612504e-05
7350.00000  7400.00000  6.921641095938e-05
7400.00000  7450.00000  6.921641095938e-05
7450.00000  7500.00000  8.633444807837e-05
7500.00000  7550.00000  6.698362350908e-05
7550.00000  7600.00000  6.326231109191e-05
7600.00000  7650.00000  7.517051082686e-05
7650.00000  7700.00000  6.623936102565e-05
7700.00000  7750.00000  5.135411135696e-05
7750.00000  7800.00000  5.433116129070e-05
7800.00000  7850.00000  5.805247370787e-05
7850.00000  7900.00000  6.475083605878e-05
7900.00000  7950.00000  6.177378612504e-05
7950.00000  8000.00000  6.326231109191e-05
8000.00000  8050.00000  6.475083605878e-05
8050.00000  8100.00000  6.251804860847e-05
8100.00000  8150.00000  5.730821122444e-05
8150.00000  8200.00000  4.540001148949e-05
8200.00000  8250.00000  6.921641095938e-05
8250.00000  8300.00000  6.698362350908e-05
8300.00000  8350.00000  5.954099867474e-05
8350.00000  8400.00000  4.986558639009e-05
8400.00000  8450.00000  5.879673619130e-05
8450.00000  8500.00000  5.060984887353e-05
8500.00000  8550.00000  5.581968625757e-05
8550.00000  8600.00000  6.251804860847e-05
8600.00000  8650.00000  5.433116129070e-05
8650.00000  8700.00000  5.060984887353e-05
8700.00000  8750.00000  6.251804860847e-05
8750.00000  8800.00000  6.251804860847e-05
8800.00000  8850.00000  5.060984887353e-05
8850.00000  8900.00000  4.540001148949e-05
8900.00000  8950.00000  3.349181175454e-05
8950.00000  9000.00000  5.135411135696e-05
9000.00000  9050.00000  5.656394874100e-05
9050.00000  9100.00000  4.316722403919e-05
9100.00000  9150.00000  5.433116129070e-05
9150.00000  9200.00000  5.730821122444e-05
9200.00000  9250.00000  5.433116129070e-05
9250.00000  9300.00000  5.730821122444e-05
9300.00000  9350.00000  4.912132390666e-05
9350.00000  9400.00000  4.986558639009e-05
9400.00000  9450.00000  3.870164913858e-05
9450.00000  9500.00000  5.954099867474e-05
9500.00000  9550.00000  3.944591162201e-05
9550.00000  9600.00000  4.391148652262e-05
9600.00000  9650.00000  3.721312417171e-05
9650.00000  9700.00000  4.019017410545e-05
9700.00000  9750.00000  4.688853645636e-05
9750.00000  9800.00000  5.433116129070e-05
9800.00000  9850.00000  3.498033672141e-05
9850.00000  9900.00000  3.870164913858e-05
9900.00000  9950.00000  4.465574900605e-05
9950.00000  10000.00000  3.572459920484e-05
