300.00000  350.00000  1.278613347167e+00
350.00000  400.00000  9.043589368627e-01
400.00000  450.00000  6.687330668773e-01
450.00000  500.00000  5.102581392943e-01
500.00000  550.00000  4.018641676052e-01
550.00000  600.00000  3.224504823479e-01
600.00000  650.00000  2.645224882424e-01
650.00000  700.00000  2.205389431501e-01
700.00000  750.00000  1.845038746762e-01
750.00000  800.00000  1.575819734328e-01
800.00000  850.00000  1.351966642939e-01
850.00000  900.00000  1.172975982693e-01
900.00000  950.00000  1.029096338864e-01
950.00000  1000.00000  9.089103374937e-02
1000.00000  1050.00000  7.987719213785e-02
1050.00000  1100.00000  7.200127729942e-02
1100.00000  1150.00000  6.431120946902e-02
1150.00000  1200.00000  5.809977301328e-02
1200.00000  1250.00000  5.256138408864e-02
1250.00000  1300.00000  4.754795742971e-02
1300.00000  1350.00000  4.341045511541e-02
1350.00000  1400.00000  3.965501278575e-02
1400.00000  1450.00000  3.634752838383e-02
1450.00000  1500.00000  3.337767838693e-02
1500.00000  1550.00000  3.084097779123e-02
1550.00000  1600.00000  2.861303497382e-02
1600.00000  1650.00000  2.651318591094e-02
1650.00000  1700.00000  2.483612028068e-02
1700.00000  1750.00000  2.303392260119e-02
1750.00000  1800.00000  2.156343591612e-02
1800.00000  1850.00000  2.028471964969e-02
1850.00000  1900.00000  1.884236916504e-02
1900.00000  1950.00000  1.754366138779e-02
1950.00000  2000.00000  1.671068177011e-02
2000.00000  2050.00000  1.564372743315e-02
2050.00000  2100.00000  1.466784553440e-02
2100.00000  2150.00000  1.396147881861e-02
2150.00000  2200.00000  1.304038846804e-02
2200.00000  2250.00000  1.246729849108e-02
2250.00000  2300.00000  1.190235320371e-02
2300.00000  2350.00000  1.134777388492e-02
2350.00000  2400.00000  1.059994329482e-02
2400.00000  2450.00000  1.006905761849e-02
2450.00000  2500.00000  9.704027439365e-03
2500.00000  2550.00000  9.127975757096e-03
2550.00000  2600.00000  8.860681853112e-03
2600.00000  2650.00000  8.411243072729e-03
2650.00000  2700.00000  7.988459640112e-03
2700.00000  2750.00000  7.652306087734e-03
2750.00000  2800.00000  7.318373814336e-03
2800.00000  2850.00000  6.917062745197e-03
2850.00000  2900.00000  6.914101039890e-03
2900.00000  2950.00000  6.434304780107e-03
2950.00000  3000.00000  6.131470412436e-03
3000.00000  3050.00000  5.936738288481e-03
3050.00000  3100.00000  5.687214616341e-03
3100.00000  3150.00000  5.515435708518e-03
3150.00000  3200.00000  5.339954669060e-03
3200.00000  3250.00000  5.138558708164e-03
3250.00000  3300.00000  4.957154258092e-03
3300.00000  3350.00000  4.800183876805e-03
3350.00000  3400.00000  4.626183690001e-03
3400.00000  3450.00000  4.409979202568e-03
3450.00000  3500.00000  4.273000332106e-03
3500.00000  3550.00000  4.035323481195e-03
3550.00000  3600.00000  3.940548911361e-03
3600.00000  3650.00000  3.889459494810e-03
3650.00000  3700.00000  3.718421013314e-03
3700.00000  3750.00000  3.590327258773e-03
3750.00000  3800.00000  3.445203698716e-03
3800.00000  3850.00000  3.303782270292e-03
3850.00000  3900.00000  3.343765291941e-03
3900.00000  3950.00000  3.117935262259e-03
3950.00000  4000.00000  3.106088441030e-03
4000.00000  4050.00000  2.976513833836e-03
4050.00000  4100.00000  2.872113721753e-03
4100.00000  4150.00000  2.813620041934e-03
4150.00000  4200.00000  2.730692293330e-03
4200.00000  4250.00000  2.704036945564e-03
4250.00000  4300.00000  2.608521949404e-03
4300.00000  4350.00000  2.480428194863e-03
4350.00000  4400.00000  2.500419705687e-03
4400.00000  4450.00000  2.454513273424e-03
4450.00000  4500.00000  2.377508935434e-03
4500.00000  4550.00000  2.222759833128e-03
4550.00000  4600.00000  2.262742854776e-03
4600.00000  4650.00000  2.136870379216e-03
4650.00000  4700.00000  2.048759646324e-03
4700.00000  4750.00000  2.042836235709e-03
4750.00000  4800.00000  2.005814919368e-03
4800.00000  4850.00000  1.947321239549e-03
4850.00000  4900.00000  1.872538180540e-03
4900.00000  4950.00000  1.799235974184e-03
4950.00000  5000.00000  1.814044500721e-03
5000.00000  5050.00000  1.669661366990e-03
5050.00000  5100.00000  1.685210319853e-03
5100.00000  5150.00000  1.669661366990e-03
5150.00000  5200.00000  1.588214471039e-03
5200.00000  5250.00000  1.524537806932e-03
5250.00000  5300.00000  1.565261254908e-03
5300.00000  5350.00000  1.539346333469e-03
5350.00000  5400.00000  1.471967537728e-03
5400.00000  5450.00000  1.473448390381e-03
5450.00000  5500.00000  1.474188816708e-03
5500.00000  5550.00000  1.416435563216e-03
5550.00000  5600.00000  1.420137694850e-03
5600.00000  5650.00000  1.308333319499e-03
5650.00000  5700.00000  1.265388592544e-03
5700.00000  5750.00000  1.287601382348e-03
5750.00000  5800.00000  1.243916229066e-03
5800.00000  5850.00000  1.206894912724e-03
5850.00000  5900.00000  1.221703439261e-03
5900.00000  5950.00000  1.152843790866e-03
5950.00000  6000.00000  1.166911891076e-03
6000.00000  6050.00000  1.175797006998e-03
6050.00000  6100.00000  1.120265032486e-03
6100.00000  6150.00000  1.124707590447e-03
6150.00000  6200.00000  1.068435189608e-03
6200.00000  6250.00000  1.004018099174e-03
6250.00000  6300.00000  1.051405384091e-03
6300.00000  6350.00000  1.041779841842e-03
6350.00000  6400.00000  1.155805496173e-03
6400.00000  6450.00000  9.943925569256e-04
6450.00000  6500.00000  9.714393407941e-04
6500.00000  6550.00000  9.744010461014e-04
6550.00000  6600.00000  8.870307395361e-04
6600.00000  6650.00000  8.951754291311e-04
6650.00000  6700.00000  8.774051972873e-04
6700.00000  6750.00000  9.107243819944e-04
6750.00000  6800.00000  8.840690342288e-04
6800.00000  6850.00000  8.226136491023e-04
6850.00000  6900.00000  7.996604329707e-04
6900.00000  6950.00000  8.041029909317e-04
6950.00000  7000.00000  8.270562070632e-04
7000.00000  7050.00000  7.855923327611e-04
7050.00000  7100.00000  8.352008966583e-04
7100.00000  7150.00000  7.841114801074e-04
7150.00000  7200.00000  7.656008219368e-04
7200.00000  7250.00000  7.345029162102e-04
7250.00000  7300.00000  7.448688847857e-04
7300.00000  7350.00000  7.063667157908e-04
7350.00000  7400.00000  6.856347786397e-04
7400.00000  7450.00000  7.056262894640e-04
7450.00000  7500.00000  6.589794308740e-04
7500.00000  7550.00000  6.278815251474e-04
7550.00000  7600.00000  6.360262147425e-04
7600.00000  7650.00000  6.537964465863e-04
7650.00000  7700.00000  6.138134249377e-04
7700.00000  7750.00000  6.264006724937e-04
7750.00000  7800.00000  6.056687353426e-04
7800.00000  7850.00000  6.152942775914e-04
7850.00000  7900.00000  5.627240083868e-04
7900.00000  7950.00000  5.893793561525e-04
7950.00000  8000.00000  5.516176134844e-04
8000.00000  8050.00000  5.945623404403e-04
8050.00000  8100.00000  5.804942402306e-04
8100.00000  8150.00000  5.323665289870e-04
8150.00000  8200.00000  5.382899396016e-04
8200.00000  8250.00000  5.182984287773e-04
8250.00000  8300.00000  5.123750181627e-04
8300.00000  8350.00000  5.182984287773e-04
8350.00000  8400.00000  4.960856389726e-04
8400.00000  8450.00000  5.294048236797e-04
8450.00000  8500.00000  5.086728865286e-04
8500.00000  8550.00000  4.827579650897e-04
8550.00000  8600.00000  5.108941655091e-04
8600.00000  8650.00000  4.642473069191e-04
8650.00000  8700.00000  4.797962597824e-04
8700.00000  8750.00000  4.716515701874e-04
8750.00000  8800.00000  4.701707175337e-04
8800.00000  8850.00000  4.672090122264e-04
8850.00000  8900.00000  4.709111438605e-04
8900.00000  8950.00000  4.612856016118e-04
8950.00000  9000.00000  4.501792067094e-04
9000.00000  9050.00000  4.242642852706e-04
9050.00000  9100.00000  4.435153697680e-04
9100.00000  9150.00000  4.235238589438e-04
9150.00000  9200.00000  3.857621162757e-04
9200.00000  9250.00000  3.813195583147e-04
9250.00000  9300.00000  3.731748687197e-04
9300.00000  9350.00000  3.650301791246e-04
9350.00000  9400.00000  3.442982419735e-04
9400.00000  9450.00000  4.116770377146e-04
9450.00000  9500.00000  3.805791319879e-04
9500.00000  9550.00000  3.820599846416e-04
9550.00000  9600.00000  3.924259532171e-04
9600.00000  9650.00000  3.391152576857e-04
9650.00000  9700.00000  3.679918844319e-04
9700.00000  9750.00000  3.405961103394e-04
9750.00000  9800.00000  3.687323107587e-04
9800.00000  9850.00000  3.487407999345e-04
9850.00000  9900.00000  3.450386683003e-04
9900.00000  9950.00000  3.220854521688e-04
9950.00000  10000.00000  3.420769629930e-04
