300.00000  350.00000  2.991083559294e-04
350.00000  400.00000  2.715784823737e-04
400.00000  450.00000  1.882448110700e-04
450.00000  500.00000  1.547625324212e-04
500.00000  550.00000  7.038719022617e-04
550.00000  600.00000  9.598253212660e-05
600.00000  650.00000  2.053579757127e-04
650.00000  700.00000  8.705392448691e-05
700.00000  750.00000  1.309529120487e-04
750.00000  800.00000  7.366101302739e-05
800.00000  850.00000  2.663701279172e-04
850.00000  900.00000  8.556582321363e-05
900.00000  950.00000  7.812531684723e-05
950.00000  1000.00000  6.994075984419e-05
1000.00000  1050.00000  8.333367130371e-05
1050.00000  1100.00000  6.250025347778e-05
1100.00000  1150.00000  6.696455729762e-05
1150.00000  1200.00000  6.324430411442e-05
1200.00000  1250.00000  6.398835475106e-05
1250.00000  1300.00000  1.257445575922e-04
1300.00000  1350.00000  5.133949392818e-05
1350.00000  1400.00000  6.324430411442e-05
1400.00000  1450.00000  6.845265857091e-05
1450.00000  1500.00000  7.886936748387e-05
1500.00000  1550.00000  4.985139265490e-05
1550.00000  1600.00000  5.729189902130e-05
1600.00000  1650.00000  5.208354456482e-05
1650.00000  1700.00000  6.398835475106e-05
1700.00000  1750.00000  1.569946843311e-04
1750.00000  1800.00000  5.282759520146e-05
1800.00000  1850.00000  6.175620284114e-05
1850.00000  1900.00000  4.836329138162e-05
1900.00000  1950.00000  5.133949392818e-05
1950.00000  2000.00000  4.761924074498e-05
2000.00000  2050.00000  5.059544329154e-05
2050.00000  2100.00000  5.580379774802e-05
2100.00000  2150.00000  4.761924074498e-05
2150.00000  2200.00000  4.761924074498e-05
2200.00000  2250.00000  5.357164583810e-05
2250.00000  2300.00000  5.431569647474e-05
2300.00000  2350.00000  1.354172158685e-04
2350.00000  2400.00000  6.175620284114e-05
2400.00000  2450.00000  3.794658246865e-05
2450.00000  2500.00000  6.101215220450e-05
2500.00000  2550.00000  4.092278501522e-05
2550.00000  2600.00000  5.357164583810e-05
2600.00000  2650.00000  4.613113947170e-05
2650.00000  2700.00000  4.092278501522e-05
2700.00000  2750.00000  4.687519010834e-05
2750.00000  2800.00000  4.538708883506e-05
2800.00000  2850.00000  5.431569647474e-05
2850.00000  2900.00000  5.654784838466e-05
2900.00000  2950.00000  4.761924074498e-05
2950.00000  3000.00000  7.812531684723e-05
3000.00000  3050.00000  4.538708883506e-05
3050.00000  3100.00000  4.761924074498e-05
3100.00000  3150.00000  4.613113947170e-05
3150.00000  3200.00000  4.389898756178e-05
3200.00000  3250.00000  5.282759520146e-05
3250.00000  3300.00000  4.836329138162e-05
3300.00000  3350.00000  4.166683565186e-05
3350.00000  3400.00000  5.208354456482e-05
3400.00000  3450.00000  4.985139265490e-05
3450.00000  3500.00000  5.580379774802e-05
3500.00000  3550.00000  6.175620284114e-05
3550.00000  3600.00000  5.878000029458e-05
3600.00000  3650.00000  6.250025347778e-05
3650.00000  3700.00000  9.003012703347e-05
3700.00000  3750.00000  5.878000029458e-05
3750.00000  3800.00000  6.696455729762e-05
3800.00000  3850.00000  5.431569647474e-05
3850.00000  3900.00000  5.059544329154e-05
3900.00000  3950.00000  7.663721557395e-05
3950.00000  4000.00000  6.175620284114e-05
4000.00000  4050.00000  7.886936748387e-05
4050.00000  4100.00000  6.696455729762e-05
4100.00000  4150.00000  5.505974711138e-05
4150.00000  4200.00000  6.175620284114e-05
4200.00000  4250.00000  6.547645602434e-05
4250.00000  4300.00000  6.845265857091e-05
4300.00000  4350.00000  7.366101302739e-05
4350.00000  4400.00000  6.101215220450e-05
4400.00000  4450.00000  6.994075984419e-05
4450.00000  4500.00000  6.250025347778e-05
4500.00000  4550.00000  7.068481048083e-05
4550.00000  4600.00000  7.142886111747e-05
4600.00000  4650.00000  6.696455729762e-05
4650.00000  4700.00000  6.919670920755e-05
4700.00000  4750.00000  7.886936748387e-05
4750.00000  4800.00000  7.663721557395e-05
4800.00000  4850.00000  8.779797512355e-05
4850.00000  4900.00000  8.928607639683e-05
4900.00000  4950.00000  7.440506366403e-05
4950.00000  5000.00000  9.077417767011e-05
5000.00000  5050.00000  6.547645602434e-05
5050.00000  5100.00000  8.854202576019e-05
5100.00000  5150.00000  7.217291175411e-05
5150.00000  5200.00000  6.547645602434e-05
5200.00000  5250.00000  8.705392448691e-05
5250.00000  5300.00000  8.035746875715e-05
5300.00000  5350.00000  9.598253212660e-05
5350.00000  5400.00000  7.812531684723e-05
5400.00000  5450.00000  8.184557003043e-05
5450.00000  5500.00000  9.598253212660e-05
5500.00000  5550.00000  7.886936748387e-05
5550.00000  5600.00000  8.779797512355e-05
5600.00000  5650.00000  7.142886111747e-05
5650.00000  5700.00000  8.333367130371e-05
5700.00000  5750.00000  8.482177257699e-05
5750.00000  5800.00000  8.035746875715e-05
5800.00000  5850.00000  7.663721557395e-05
5850.00000  5900.00000  7.961341812051e-05
5900.00000  5950.00000  8.333367130371e-05
5950.00000  6000.00000  9.226227894339e-05
6000.00000  6050.00000  7.961341812051e-05
6050.00000  6100.00000  8.482177257699e-05
6100.00000  6150.00000  7.663721557395e-05
6150.00000  6200.00000  7.812531684723e-05
6200.00000  6250.00000  1.049111397663e-04
6250.00000  6300.00000  1.450898741449e-04
6300.00000  6350.00000  1.197921524991e-04
6350.00000  6400.00000  8.400331687669e-04
6400.00000  6450.00000  6.250025347778e-05
6450.00000  6500.00000  6.845265857091e-05
6500.00000  6550.00000  6.101215220450e-05
6550.00000  6600.00000  8.630987385027e-05
6600.00000  6650.00000  8.110151939379e-05
6650.00000  6700.00000  6.919670920755e-05
6700.00000  6750.00000  7.440506366403e-05
6750.00000  6800.00000  7.217291175411e-05
6800.00000  6850.00000  7.366101302739e-05
6850.00000  6900.00000  6.473240538770e-05
6900.00000  6950.00000  8.110151939379e-05
6950.00000  7000.00000  7.217291175411e-05
7000.00000  7050.00000  6.622050666098e-05
7050.00000  7100.00000  1.473220260548e-04
7100.00000  7150.00000  4.389898756178e-05
7150.00000  7200.00000  4.910734201826e-05
7200.00000  7250.00000  3.199417737553e-05
7250.00000  7300.00000  4.687519010834e-05
7300.00000  7350.00000  4.389898756178e-05
7350.00000  7400.00000  4.166683565186e-05
7400.00000  7450.00000  3.794658246865e-05
7450.00000  7500.00000  6.101215220450e-05
7500.00000  7550.00000  3.720253183201e-05
7550.00000  7600.00000  4.687519010834e-05
7600.00000  7650.00000  3.571443055873e-05
7650.00000  7700.00000  4.241088628850e-05
7700.00000  7750.00000  2.752987355569e-05
7750.00000  7800.00000  4.315493692514e-05
7800.00000  7850.00000  4.613113947170e-05
7850.00000  7900.00000  4.613113947170e-05
7900.00000  7950.00000  4.687519010834e-05
7950.00000  8000.00000  5.208354456482e-05
8000.00000  8050.00000  3.422632928545e-05
8050.00000  8100.00000  3.794658246865e-05
8100.00000  8150.00000  4.092278501522e-05
8150.00000  8200.00000  4.761924074498e-05
8200.00000  8250.00000  4.241088628850e-05
8250.00000  8300.00000  4.389898756178e-05
8300.00000  8350.00000  4.389898756178e-05
8350.00000  8400.00000  3.273822801217e-05
8400.00000  8450.00000  4.464303819842e-05
8450.00000  8500.00000  3.348227864881e-05
8500.00000  8550.00000  4.613113947170e-05
8550.00000  8600.00000  2.827392419233e-05
8600.00000  8650.00000  4.017873437857e-05
8650.00000  8700.00000  3.273822801217e-05
8700.00000  8750.00000  3.720253183201e-05
8750.00000  8800.00000  3.199417737553e-05
8800.00000  8850.00000  2.752987355569e-05
8850.00000  8900.00000  4.538708883506e-05
8900.00000  8950.00000  4.092278501522e-05
8950.00000  9000.00000  3.720253183201e-05
9000.00000  9050.00000  4.315493692514e-05
9050.00000  9100.00000  3.273822801217e-05
9100.00000  9150.00000  3.199417737553e-05
9150.00000  9200.00000  3.869063310529e-05
9200.00000  9250.00000  3.050607610225e-05
9250.00000  9300.00000  3.869063310529e-05
9300.00000  9350.00000  3.794658246865e-05
9350.00000  9400.00000  3.943468374193e-05
9400.00000  9450.00000  3.794658246865e-05
9450.00000  9500.00000  3.125012673889e-05
9500.00000  9550.00000  3.571443055873e-05
9550.00000  9600.00000  3.050607610225e-05
9600.00000  9650.00000  3.720253183201e-05
9650.00000  9700.00000  3.199417737553e-05
9700.00000  9750.00000  3.794658246865e-05
9750.00000  9800.00000  3.422632928545e-05
9800.00000  9850.00000  2.752987355569e-05
9850.00000  9900.00000  3.199417737553e-05
9900.00000  9950.00000  3.273822801217e-05
9950.00000  10000.00000  3.869063310529e-05
