10001.00000  11001.00000  4.948806383748e-04
11001.00000  12001.00000  4.053660018453e-04
12001.00000  13001.00000  3.409870598563e-04
13001.00000  14001.00000  2.935063872444e-04
14001.00000  15001.00000  2.499327176889e-04
15001.00000  16001.00000  2.161554252552e-04
16001.00000  17001.00000  1.901728926139e-04
17001.00000  18001.00000  1.653451392011e-04
18001.00000  19001.00000  1.512760789338e-04
19001.00000  20001.00000  1.285076818119e-04
20001.00000  21001.00000  1.159013419007e-04
21001.00000  22001.00000  1.044882738590e-04
22001.00000  23001.00000  9.390279759773e-05
23001.00000  24001.00000  8.183535465988e-05
24001.00000  25001.00000  7.328998836896e-05
25001.00000  26001.00000  6.426346406617e-05
26001.00000  27001.00000  5.950962290883e-05
27001.00000  28001.00000  5.708458652898e-05
28001.00000  29001.00000  4.986721635084e-05
29001.00000  30001.00000  4.393934964452e-05
30001.00000  31001.00000  3.941646433289e-05
31001.00000  32001.00000  3.766504916966e-05
32001.00000  33001.00000  3.439317468890e-05
33001.00000  34001.00000  3.152547293812e-05
34001.00000  35001.00000  2.910043655826e-05
35001.00000  36001.00000  2.654067593508e-05
36001.00000  37001.00000  2.382694474810e-05
37001.00000  38001.00000  2.207552958487e-05
38001.00000  39001.00000  1.963124688454e-05
39001.00000  40001.00000  1.947727632074e-05
40001.00000  41001.00000  1.813003388749e-05
41001.00000  42001.00000  1.641711136521e-05
42001.00000  43001.00000  1.516610053433e-05
43001.00000  44001.00000  1.522383949576e-05
44001.00000  45001.00000  1.314523688445e-05
45001.00000  46001.00000  1.179799445120e-05
46001.00000  47001.00000  1.035452041557e-05
47001.00000  48001.00000  1.083567842745e-05
48001.00000  49001.00000  9.392204391821e-06
49001.00000  50001.00000  8.526119970444e-06
50001.00000  51001.00000  8.506873649969e-06
51001.00000  52001.00000  8.622351572819e-06
52001.00000  53001.00000  7.044153293866e-06
53001.00000  54001.00000  7.178877537191e-06
54001.00000  55001.00000  6.351285756764e-06
55001.00000  56001.00000  5.793142462988e-06
56001.00000  57001.00000  5.581432937762e-06
57001.00000  58001.00000  4.984797003036e-06
58001.00000  59001.00000  5.234999169212e-06
59001.00000  60001.00000  4.465146350210e-06
60001.00000  61001.00000  4.907811721136e-06
61001.00000  62001.00000  4.272683145459e-06
62001.00000  63001.00000  3.387352403607e-06
63001.00000  64001.00000  4.099466261184e-06
64001.00000  65001.00000  3.464337685508e-06
65001.00000  66001.00000  3.387352403607e-06
66001.00000  67001.00000  2.752223827931e-06
67001.00000  68001.00000  2.848455430306e-06
68001.00000  69001.00000  2.771470148406e-06
69001.00000  70001.00000  2.732977507456e-06
70001.00000  71001.00000  2.886948071256e-06
71001.00000  72001.00000  2.155587893205e-06
72001.00000  73001.00000  2.502021661756e-06
73001.00000  74001.00000  2.232573175105e-06
74001.00000  75001.00000  2.309558457005e-06
75001.00000  76001.00000  1.847646765604e-06
76001.00000  77001.00000  1.462720356103e-06
77001.00000  78001.00000  1.770661483704e-06
78001.00000  79001.00000  1.674429881329e-06
79001.00000  80001.00000  1.385735074203e-06
80001.00000  81001.00000  1.404981394678e-06
81001.00000  82001.00000  1.308749792303e-06
82001.00000  83001.00000  1.289503471828e-06
83001.00000  84001.00000  1.289503471828e-06
84001.00000  85001.00000  1.231764510403e-06
85001.00000  86001.00000  1.501212997053e-06
86001.00000  87001.00000  1.097040267077e-06
87001.00000  88001.00000  1.039301305652e-06
88001.00000  89001.00000  9.430697032771e-07
89001.00000  90001.00000  8.275917804268e-07
90001.00000  91001.00000  9.815623442272e-07
91001.00000  92001.00000  1.000808664702e-06
92001.00000  93001.00000  1.058547626127e-06
93001.00000  94001.00000  9.623160237521e-07
94001.00000  95001.00000  6.543748961514e-07
95001.00000  96001.00000  5.966359347263e-07
96001.00000  97001.00000  5.196506528262e-07
97001.00000  98001.00000  5.004043323511e-07
98001.00000  99001.00000  5.966359347263e-07
99001.00000  100001.00000  7.890991394767e-07
100001.00000  101001.00000  5.196506528262e-07
101001.00000  102001.00000  4.811580118761e-07
102001.00000  103001.00000  5.196506528262e-07
103001.00000  104001.00000  4.234190504509e-07
104001.00000  105001.00000  4.619116914010e-07
105001.00000  106001.00000  5.004043323511e-07
106001.00000  107001.00000  3.079411276007e-07
107001.00000  108001.00000  4.619116914010e-07
108001.00000  109001.00000  3.271874480757e-07
109001.00000  110001.00000  2.886948071256e-07
110001.00000  111001.00000  3.271874480757e-07
111001.00000  112001.00000  3.656800890258e-07
112001.00000  113001.00000  4.426653709260e-07
113001.00000  114001.00000  3.079411276007e-07
114001.00000  115001.00000  3.079411276007e-07
115001.00000  116001.00000  2.694484866506e-07
116001.00000  117001.00000  3.464337685508e-07
117001.00000  118001.00000  3.271874480757e-07
118001.00000  119001.00000  1.154779228503e-07
119001.00000  120001.00000  1.924632047504e-07
120001.00000  121001.00000  1.924632047504e-07
121001.00000  122001.00000  3.079411276007e-07
122001.00000  123001.00000  2.309558457005e-07
123001.00000  124001.00000  1.732168842754e-07
124001.00000  125001.00000  1.347242433253e-07
125001.00000  126001.00000  2.502021661756e-07
126001.00000  127001.00000  5.773896142513e-08
127001.00000  128001.00000  1.347242433253e-07
128001.00000  129001.00000  1.924632047504e-07
129001.00000  130001.00000  1.732168842754e-07
130001.00000  131001.00000  2.117095252255e-07
131001.00000  132001.00000  1.347242433253e-07
132001.00000  133001.00000  1.539705638003e-07
133001.00000  134001.00000  2.117095252255e-07
134001.00000  135001.00000  2.309558457005e-07
135001.00000  136001.00000  2.309558457005e-07
136001.00000  137001.00000  1.347242433253e-07
137001.00000  138001.00000  1.154779228503e-07
138001.00000  139001.00000  9.623160237521e-08
139001.00000  140001.00000  1.539705638003e-07
140001.00000  141001.00000  7.698528190017e-08
141001.00000  142001.00000  1.154779228503e-07
142001.00000  143001.00000  1.732168842754e-07
143001.00000  144001.00000  3.849264095009e-08
144001.00000  145001.00000  5.773896142513e-08
145001.00000  146001.00000  9.623160237521e-08
146001.00000  147001.00000  5.773896142513e-08
147001.00000  148001.00000  3.849264095009e-08
148001.00000  149001.00000  9.623160237521e-08
149001.00000  150001.00000  1.924632047504e-08
150001.00000  151001.00000  9.623160237521e-08
151001.00000  152001.00000  2.309558457005e-07
152001.00000  153001.00000  3.849264095009e-08
153001.00000  154001.00000  5.773896142513e-08
154001.00000  155001.00000  1.924632047504e-08
155001.00000  156001.00000  3.849264095009e-08
156001.00000  157001.00000  1.924632047504e-08
157001.00000  158001.00000  7.698528190017e-08
158001.00000  159001.00000  1.924632047504e-08
159001.00000  160001.00000  9.623160237521e-08
160001.00000  161001.00000  0.000000000000e+00
161001.00000  162001.00000  5.773896142513e-08
162001.00000  163001.00000  0.000000000000e+00
163001.00000  164001.00000  3.849264095009e-08
164001.00000  165001.00000  1.924632047504e-08
165001.00000  166001.00000  3.849264095009e-08
166001.00000  167001.00000  3.849264095009e-08
167001.00000  168001.00000  0.000000000000e+00
168001.00000  169001.00000  5.773896142513e-08
169001.00000  170001.00000  1.924632047504e-08
170001.00000  171001.00000  3.849264095009e-08
171001.00000  172001.00000  0.000000000000e+00
172001.00000  173001.00000  1.924632047504e-08
173001.00000  174001.00000  1.924632047504e-08
174001.00000  175001.00000  0.000000000000e+00
175001.00000  176001.00000  3.849264095009e-08
176001.00000  177001.00000  3.849264095009e-08
177001.00000  178001.00000  1.924632047504e-08
178001.00000  179001.00000  3.849264095009e-08
179001.00000  180001.00000  0.000000000000e+00
180001.00000  181001.00000  1.924632047504e-08
181001.00000  182001.00000  9.623160237521e-08
182001.00000  183001.00000  0.000000000000e+00
183001.00000  184001.00000  3.849264095009e-08
184001.00000  185001.00000  0.000000000000e+00
185001.00000  186001.00000  0.000000000000e+00
186001.00000  187001.00000  1.924632047504e-08
187001.00000  188001.00000  0.000000000000e+00
188001.00000  189001.00000  1.924632047504e-08
189001.00000  190001.00000  3.849264095009e-08
190001.00000  191001.00000  3.849264095009e-08
191001.00000  192001.00000  0.000000000000e+00
192001.00000  193001.00000  1.924632047504e-08
193001.00000  194001.00000  0.000000000000e+00
194001.00000  195001.00000  0.000000000000e+00
195001.00000  196001.00000  3.849264095009e-08
196001.00000  197001.00000  0.000000000000e+00
197001.00000  198001.00000  1.924632047504e-08
198001.00000  199001.00000  0.000000000000e+00
