300.00000  350.00000  7.790671988609e-05
350.00000  400.00000  1.283605956218e-04
400.00000  450.00000  7.790671988609e-05
450.00000  500.00000  8.013262616855e-05
500.00000  550.00000  5.624123207015e-04
550.00000  600.00000  5.787356334395e-05
600.00000  650.00000  1.491357209248e-04
650.00000  700.00000  6.603521971297e-05
700.00000  750.00000  9.719790766741e-05
750.00000  800.00000  7.493884484281e-05
800.00000  850.00000  2.530113474396e-04
850.00000  900.00000  6.677718847379e-05
900.00000  950.00000  5.935750086559e-05
950.00000  1000.00000  5.193781325740e-05
1000.00000  1050.00000  7.716475112527e-05
1050.00000  1100.00000  5.713159458313e-05
1100.00000  1150.00000  7.197096979953e-05
1150.00000  1200.00000  6.751915723461e-05
1200.00000  1250.00000  8.013262616855e-05
1250.00000  1300.00000  1.780725025968e-04
1300.00000  1350.00000  6.974506351707e-05
1350.00000  1400.00000  8.013262616855e-05
1400.00000  1450.00000  8.087459492937e-05
1450.00000  1500.00000  1.038756265148e-04
1500.00000  1550.00000  7.716475112527e-05
1550.00000  1600.00000  8.755231377675e-05
1600.00000  1650.00000  1.016497202323e-04
1650.00000  1700.00000  7.642278236445e-05
1700.00000  1750.00000  2.648828476127e-04
1750.00000  1800.00000  8.087459492937e-05
1800.00000  1850.00000  1.127792516446e-04
1850.00000  1900.00000  9.868184518905e-05
1900.00000  1950.00000  9.126215758085e-05
1950.00000  2000.00000  1.105533453622e-04
2000.00000  2050.00000  9.942381394987e-05
2050.00000  2100.00000  8.384246997265e-05
2100.00000  2150.00000  1.194569704920e-04
2150.00000  2200.00000  1.068435015581e-04
2200.00000  2250.00000  1.046175952756e-04
2250.00000  2300.00000  8.681034501593e-05
2300.00000  2350.00000  2.389139409840e-04
2350.00000  2400.00000  9.868184518905e-05
2400.00000  2450.00000  9.200412634167e-05
2450.00000  2500.00000  9.423003262413e-05
2500.00000  2550.00000  9.200412634167e-05
2550.00000  2600.00000  1.016497202323e-04
2600.00000  2650.00000  9.497200138495e-05
2650.00000  2700.00000  9.497200138495e-05
2700.00000  2750.00000  8.532640749429e-05
2750.00000  2800.00000  9.200412634167e-05
2800.00000  2850.00000  8.310050121183e-05
2850.00000  2900.00000  8.681034501593e-05
2900.00000  2950.00000  8.310050121183e-05
2950.00000  3000.00000  1.023916889932e-04
3000.00000  3050.00000  8.755231377675e-05
3050.00000  3100.00000  8.829428253757e-05
3100.00000  3150.00000  7.493884484281e-05
3150.00000  3200.00000  8.087459492937e-05
3200.00000  3250.00000  7.493884484281e-05
3250.00000  3300.00000  7.419687608199e-05
3300.00000  3350.00000  6.974506351707e-05
3350.00000  3400.00000  7.048703227789e-05
3400.00000  3450.00000  7.048703227789e-05
3450.00000  3500.00000  7.122900103871e-05
3500.00000  3550.00000  5.935750086559e-05
3550.00000  3600.00000  6.529325095215e-05
3600.00000  3650.00000  6.455128219133e-05
3650.00000  3700.00000  8.829428253757e-05
3700.00000  3750.00000  5.713159458313e-05
3750.00000  3800.00000  5.861553210477e-05
3800.00000  3850.00000  6.084143838723e-05
3850.00000  3900.00000  5.935750086559e-05
3900.00000  3950.00000  5.935750086559e-05
3950.00000  4000.00000  5.713159458313e-05
4000.00000  4050.00000  4.674403193166e-05
4050.00000  4100.00000  4.822796945330e-05
4100.00000  4150.00000  5.713159458313e-05
4150.00000  4200.00000  5.193781325740e-05
4200.00000  4250.00000  6.380931343051e-05
4250.00000  4300.00000  4.451812564920e-05
4300.00000  4350.00000  5.045387573576e-05
4350.00000  4400.00000  3.784040680182e-05
4400.00000  4450.00000  4.303418812756e-05
4450.00000  4500.00000  4.971190697494e-05
4500.00000  4550.00000  4.526009441002e-05
4550.00000  4600.00000  3.487253175854e-05
4600.00000  4650.00000  2.671087538952e-05
4650.00000  4700.00000  3.487253175854e-05
4700.00000  4750.00000  3.709843804100e-05
4750.00000  4800.00000  4.303418812756e-05
4800.00000  4850.00000  2.893678167198e-05
4850.00000  4900.00000  3.561450051936e-05
4900.00000  4950.00000  4.080828184510e-05
4950.00000  5000.00000  2.967875043280e-05
5000.00000  5050.00000  3.635646928018e-05
5050.00000  5100.00000  2.967875043280e-05
5100.00000  5150.00000  2.819481291116e-05
5150.00000  5200.00000  2.819481291116e-05
5200.00000  5250.00000  3.042071919362e-05
5250.00000  5300.00000  3.413056299772e-05
5300.00000  5350.00000  3.709843804100e-05
5350.00000  5400.00000  2.893678167198e-05
5400.00000  5450.00000  2.596890662870e-05
5450.00000  5500.00000  2.596890662870e-05
5500.00000  5550.00000  2.151709406378e-05
5550.00000  5600.00000  2.745284415034e-05
5600.00000  5650.00000  3.784040680182e-05
5650.00000  5700.00000  2.671087538952e-05
5700.00000  5750.00000  2.300103158542e-05
5750.00000  5800.00000  2.003315654214e-05
5800.00000  5850.00000  2.671087538952e-05
5850.00000  5900.00000  2.151709406378e-05
5900.00000  5950.00000  2.819481291116e-05
5950.00000  6000.00000  2.003315654214e-05
6000.00000  6050.00000  2.596890662870e-05
6050.00000  6100.00000  1.780725025968e-05
6100.00000  6150.00000  2.374300034624e-05
6150.00000  6200.00000  1.558134397722e-05
6200.00000  6250.00000  2.077512530296e-05
6250.00000  6300.00000  2.522693786788e-05
6300.00000  6350.00000  1.929118778132e-05
6350.00000  6400.00000  2.077512530296e-04
6400.00000  6450.00000  1.632331273804e-05
6450.00000  6500.00000  2.151709406378e-05
6500.00000  6550.00000  2.300103158542e-05
6550.00000  6600.00000  1.558134397722e-05
6600.00000  6650.00000  1.112953141230e-05
6650.00000  6700.00000  1.187150017312e-05
6700.00000  6750.00000  1.038756265148e-05
6750.00000  6800.00000  1.632331273804e-05
6800.00000  6850.00000  2.300103158542e-05
6850.00000  6900.00000  1.558134397722e-05
6900.00000  6950.00000  1.854921902050e-05
6950.00000  7000.00000  8.161656369019e-06
7000.00000  7050.00000  1.854921902050e-05
7050.00000  7100.00000  3.858237556264e-05
7100.00000  7150.00000  1.483937521640e-05
7150.00000  7200.00000  1.187150017312e-05
7200.00000  7250.00000  1.409740645558e-05
7250.00000  7300.00000  1.632331273804e-05
7300.00000  7350.00000  1.483937521640e-05
7350.00000  7400.00000  1.261346893394e-05
7400.00000  7450.00000  1.112953141230e-05
7450.00000  7500.00000  2.300103158542e-05
7500.00000  7550.00000  9.645593890659e-06
7550.00000  7600.00000  1.335543769476e-05
7600.00000  7650.00000  1.632331273804e-05
7650.00000  7700.00000  1.558134397722e-05
7700.00000  7750.00000  8.903625129839e-06
7750.00000  7800.00000  1.261346893394e-05
7800.00000  7850.00000  9.645593890659e-06
7850.00000  7900.00000  8.903625129839e-06
7900.00000  7950.00000  1.409740645558e-05
7950.00000  8000.00000  1.038756265148e-05
8000.00000  8050.00000  9.645593890659e-06
8050.00000  8100.00000  9.645593890659e-06
8100.00000  8150.00000  9.645593890659e-06
8150.00000  8200.00000  1.261346893394e-05
8200.00000  8250.00000  9.645593890659e-06
8250.00000  8300.00000  1.187150017312e-05
8300.00000  8350.00000  1.187150017312e-05
8350.00000  8400.00000  9.645593890659e-06
8400.00000  8450.00000  5.935750086559e-06
8450.00000  8500.00000  1.112953141230e-05
8500.00000  8550.00000  6.677718847379e-06
8550.00000  8600.00000  8.161656369019e-06
8600.00000  8650.00000  1.112953141230e-05
8650.00000  8700.00000  5.935750086559e-06
8700.00000  8750.00000  5.935750086559e-06
8750.00000  8800.00000  6.677718847379e-06
8800.00000  8850.00000  1.038756265148e-05
8850.00000  8900.00000  1.038756265148e-05
8900.00000  8950.00000  1.112953141230e-05
8950.00000  9000.00000  9.645593890659e-06
9000.00000  9050.00000  8.161656369019e-06
9050.00000  9100.00000  8.161656369019e-06
9100.00000  9150.00000  8.161656369019e-06
9150.00000  9200.00000  7.419687608199e-06
9200.00000  9250.00000  8.903625129839e-06
9250.00000  9300.00000  7.419687608199e-06
9300.00000  9350.00000  6.677718847379e-06
9350.00000  9400.00000  6.677718847379e-06
9400.00000  9450.00000  5.935750086559e-06
9450.00000  9500.00000  8.161656369019e-06
9500.00000  9550.00000  7.419687608199e-06
9550.00000  9600.00000  5.193781325740e-06
9600.00000  9650.00000  6.677718847379e-06
9650.00000  9700.00000  3.709843804100e-06
9700.00000  9750.00000  2.967875043280e-06
9750.00000  9800.00000  7.419687608199e-06
9800.00000  9850.00000  7.419687608199e-06
9850.00000  9900.00000  1.038756265148e-05
9900.00000  9950.00000  8.903625129839e-06
9950.00000  10000.00000  8.903625129839e-06
