300.00000  350.00000  1.118447770760e-05
350.00000  400.00000  8.787803913116e-06
400.00000  450.00000  4.793347588972e-06
450.00000  500.00000  1.597782529657e-06
500.00000  550.00000  9.586695177945e-06
550.00000  600.00000  2.396673794486e-06
600.00000  650.00000  5.592238853801e-06
650.00000  700.00000  2.396673794486e-06
700.00000  750.00000  0.000000000000e+00
750.00000  800.00000  0.000000000000e+00
800.00000  850.00000  4.793347588972e-06
850.00000  900.00000  2.396673794486e-06
900.00000  950.00000  3.195565059315e-06
950.00000  1000.00000  1.597782529657e-06
1000.00000  1050.00000  0.000000000000e+00
1050.00000  1100.00000  1.597782529657e-06
1100.00000  1150.00000  7.988912648287e-07
1150.00000  1200.00000  7.988912648287e-07
1200.00000  1250.00000  2.396673794486e-06
1250.00000  1300.00000  7.190021383458e-06
1300.00000  1350.00000  3.195565059315e-06
1350.00000  1400.00000  2.396673794486e-06
1400.00000  1450.00000  3.195565059315e-06
1450.00000  1500.00000  3.994456324144e-06
1500.00000  1550.00000  2.396673794486e-06
1550.00000  1600.00000  0.000000000000e+00
1600.00000  1650.00000  3.195565059315e-06
1650.00000  1700.00000  2.396673794486e-06
1700.00000  1750.00000  1.997228162072e-05
1750.00000  1800.00000  5.592238853801e-06
1800.00000  1850.00000  3.195565059315e-06
1850.00000  1900.00000  3.994456324144e-06
1900.00000  1950.00000  5.592238853801e-06
1950.00000  2000.00000  1.597782529657e-06
2000.00000  2050.00000  2.396673794486e-06
2050.00000  2100.00000  6.391130118630e-06
2100.00000  2150.00000  1.597782529657e-06
2150.00000  2200.00000  6.391130118630e-06
2200.00000  2250.00000  7.190021383458e-06
2250.00000  2300.00000  6.391130118630e-06
2300.00000  2350.00000  3.994456324144e-05
2350.00000  2400.00000  6.391130118630e-06
2400.00000  2450.00000  3.994456324144e-06
2450.00000  2500.00000  6.391130118630e-06
2500.00000  2550.00000  7.190021383458e-06
2550.00000  2600.00000  1.038558644277e-05
2600.00000  2650.00000  8.787803913116e-06
2650.00000  2700.00000  2.396673794486e-06
2700.00000  2750.00000  4.793347588972e-06
2750.00000  2800.00000  8.787803913116e-06
2800.00000  2850.00000  4.793347588972e-06
2850.00000  2900.00000  9.586695177945e-06
2900.00000  2950.00000  6.391130118630e-06
2950.00000  3000.00000  2.157006415038e-05
3000.00000  3050.00000  1.038558644277e-05
3050.00000  3100.00000  7.988912648287e-06
3100.00000  3150.00000  1.198336897243e-05
3150.00000  3200.00000  1.358115150209e-05
3200.00000  3250.00000  5.592238853801e-06
3250.00000  3300.00000  1.358115150209e-05
3300.00000  3350.00000  1.118447770760e-05
3350.00000  3400.00000  7.988912648287e-06
3400.00000  3450.00000  8.787803913116e-06
3450.00000  3500.00000  1.038558644277e-05
3500.00000  3550.00000  1.757560782623e-05
3550.00000  3600.00000  2.077117288555e-05
3600.00000  3650.00000  2.316784668003e-05
3650.00000  3700.00000  3.515121565246e-05
3700.00000  3750.00000  2.636341173935e-05
3750.00000  3800.00000  1.677671656140e-05
3800.00000  3850.00000  1.837449909106e-05
3850.00000  3900.00000  2.955897679866e-05
3900.00000  3950.00000  2.636341173935e-05
3950.00000  4000.00000  2.316784668003e-05
4000.00000  4050.00000  2.077117288555e-05
4050.00000  4100.00000  2.316784668003e-05
4100.00000  4150.00000  2.955897679866e-05
4150.00000  4200.00000  3.515121565246e-05
4200.00000  4250.00000  4.314012830075e-05
4250.00000  4300.00000  4.314012830075e-05
4300.00000  4350.00000  5.192793221387e-05
4350.00000  4400.00000  5.272682347870e-05
4400.00000  4450.00000  4.234123703592e-05
4450.00000  4500.00000  5.991684486215e-05
4500.00000  4550.00000  5.192793221387e-05
4550.00000  4600.00000  6.870464877527e-05
4600.00000  4650.00000  6.311240992147e-05
4650.00000  4700.00000  7.269910509941e-05
4700.00000  4750.00000  5.991684486215e-05
4750.00000  4800.00000  7.589467015873e-05
4800.00000  4850.00000  8.388358280702e-05
4850.00000  4900.00000  8.787803913116e-05
4900.00000  4950.00000  9.906251683876e-05
4950.00000  5000.00000  9.666584304427e-05
5000.00000  5050.00000  9.586695177945e-05
5050.00000  5100.00000  9.267138672013e-05
5100.00000  5150.00000  1.094481032815e-04
5150.00000  5200.00000  1.118447770760e-04
5200.00000  5250.00000  1.086492120167e-04
5250.00000  5300.00000  9.746473430910e-05
5300.00000  5350.00000  1.214314722540e-04
5350.00000  5400.00000  1.182359071947e-04
5400.00000  5450.00000  1.238281460485e-04
5450.00000  5500.00000  1.222303635188e-04
5500.00000  5550.00000  1.310181674319e-04
5550.00000  5600.00000  1.461971014637e-04
5600.00000  5650.00000  1.254259285781e-04
5650.00000  5700.00000  1.541860141119e-04
5700.00000  5750.00000  1.469959927285e-04
5750.00000  5800.00000  1.549849053768e-04
5800.00000  5850.00000  1.549849053768e-04
5850.00000  5900.00000  1.493926665230e-04
5900.00000  5950.00000  1.757560782623e-04
5950.00000  6000.00000  1.517893403175e-04
6000.00000  6050.00000  1.669682743492e-04
6050.00000  6100.00000  1.717616219382e-04
6100.00000  6150.00000  1.589793617009e-04
6150.00000  6200.00000  1.629738180251e-04
6200.00000  6250.00000  1.733594044678e-04
6250.00000  6300.00000  1.781527520568e-04
6300.00000  6350.00000  1.717616219382e-04
6350.00000  6400.00000  4.050378712682e-04
6400.00000  6450.00000  1.637727092899e-04
6450.00000  6500.00000  1.781527520568e-04
6500.00000  6550.00000  1.725605132030e-04
6550.00000  6600.00000  1.765549695271e-04
6600.00000  6650.00000  1.981250336775e-04
6650.00000  6700.00000  1.645716005547e-04
6700.00000  6750.00000  1.789516433216e-04
6750.00000  6800.00000  1.797505345865e-04
6800.00000  6850.00000  1.813483171161e-04
6850.00000  6900.00000  1.661693830844e-04
6900.00000  6950.00000  1.853427734403e-04
6950.00000  7000.00000  1.917339035589e-04
7000.00000  7050.00000  1.765549695271e-04
7050.00000  7100.00000  2.172984240334e-04
7100.00000  7150.00000  8.468247407184e-05
7150.00000  7200.00000  7.110132256976e-05
7200.00000  7250.00000  6.550908371595e-05
7250.00000  7300.00000  7.909023521804e-05
7300.00000  7350.00000  5.512349727318e-05
7350.00000  7400.00000  7.349799636424e-05
7400.00000  7450.00000  7.749245268839e-05
7450.00000  7500.00000  8.468247407184e-05
7500.00000  7550.00000  7.988912648287e-05
7550.00000  7600.00000  7.909023521804e-05
7600.00000  7650.00000  7.988912648287e-05
7650.00000  7700.00000  8.308469154219e-05
7700.00000  7750.00000  7.988912648287e-05
7750.00000  7800.00000  8.548136533667e-05
7800.00000  7850.00000  8.947582166082e-05
7850.00000  7900.00000  8.707914786633e-05
7900.00000  7950.00000  7.749245268839e-05
7950.00000  8000.00000  9.826362557393e-05
8000.00000  8050.00000  7.988912648287e-05
8050.00000  8100.00000  8.707914786633e-05
8100.00000  8150.00000  9.027471292565e-05
8150.00000  8200.00000  8.308469154219e-05
8200.00000  8250.00000  9.187249545530e-05
8250.00000  8300.00000  8.947582166082e-05
8300.00000  8350.00000  7.589467015873e-05
8350.00000  8400.00000  8.867693039599e-05
8400.00000  8450.00000  8.548136533667e-05
8450.00000  8500.00000  9.027471292565e-05
8500.00000  8550.00000  8.787803913116e-05
8550.00000  8600.00000  9.347027798496e-05
8600.00000  8650.00000  9.426916924979e-05
8650.00000  8700.00000  9.906251683876e-05
8700.00000  8750.00000  8.068801774770e-05
8750.00000  8800.00000  7.749245268839e-05
8800.00000  8850.00000  7.349799636424e-05
8850.00000  8900.00000  1.070514294870e-04
8900.00000  8950.00000  8.228580027736e-05
8950.00000  9000.00000  7.909023521804e-05
9000.00000  9050.00000  1.014591906332e-04
9050.00000  9100.00000  9.267138672013e-05
9100.00000  9150.00000  7.749245268839e-05
9150.00000  9200.00000  9.826362557393e-05
9200.00000  9250.00000  9.187249545530e-05
9250.00000  9300.00000  8.947582166082e-05
9300.00000  9350.00000  9.187249545530e-05
9350.00000  9400.00000  8.468247407184e-05
9400.00000  9450.00000  8.628025660150e-05
9450.00000  9500.00000  9.586695177945e-05
9500.00000  9550.00000  1.038558644277e-04
9550.00000  9600.00000  8.068801774770e-05
9600.00000  9650.00000  1.062525382222e-04
9650.00000  9700.00000  9.267138672013e-05
9700.00000  9750.00000  9.746473430910e-05
9750.00000  9800.00000  8.787803913116e-05
9800.00000  9850.00000  8.707914786633e-05
9850.00000  9900.00000  8.707914786633e-05
9900.00000  9950.00000  1.030569731629e-04
9950.00000  10000.00000  1.014591906332e-04
