300.00000  350.00000  0.000000000000e+00
350.00000  400.00000  0.000000000000e+00
400.00000  450.00000  0.000000000000e+00
450.00000  500.00000  0.000000000000e+00
500.00000  550.00000  2.704321193895e-06
550.00000  600.00000  0.000000000000e+00
600.00000  650.00000  7.726631982557e-07
650.00000  700.00000  1.931657995639e-07
700.00000  750.00000  5.794973986918e-07
750.00000  800.00000  0.000000000000e+00
800.00000  850.00000  3.670150191715e-06
850.00000  900.00000  5.794973986918e-07
900.00000  950.00000  3.863315991279e-07
950.00000  1000.00000  7.726631982557e-07
1000.00000  1050.00000  9.658289978196e-07
1050.00000  1100.00000  3.863315991279e-07
1100.00000  1150.00000  1.738492196075e-06
1150.00000  1200.00000  9.658289978196e-07
1200.00000  1250.00000  1.931657995639e-06
1250.00000  1300.00000  1.139678217427e-05
1300.00000  1350.00000  2.124823795203e-06
1350.00000  1400.00000  3.090652793023e-06
1400.00000  1450.00000  3.476984392151e-06
1450.00000  1500.00000  6.567637185174e-06
1500.00000  1550.00000  4.249647590406e-06
1550.00000  1600.00000  3.863315991279e-06
1600.00000  1650.00000  3.476984392151e-06
1650.00000  1700.00000  5.022310788662e-06
1700.00000  1750.00000  3.013386473197e-05
1750.00000  1800.00000  5.794973986918e-06
1800.00000  1850.00000  7.533466182993e-06
1850.00000  1900.00000  4.829144989098e-06
1900.00000  1950.00000  5.022310788662e-06
1950.00000  2000.00000  7.726631982557e-06
2000.00000  2050.00000  4.056481790843e-06
2050.00000  2100.00000  8.692460980377e-06
2100.00000  2150.00000  9.851455777760e-06
2150.00000  2200.00000  1.043095317645e-05
2200.00000  2250.00000  1.294210857078e-05
2250.00000  2300.00000  1.101045057514e-05
2300.00000  2350.00000  5.234793168182e-05
2350.00000  2400.00000  1.062411897602e-05
2400.00000  2450.00000  1.274894277122e-05
2450.00000  2500.00000  1.506693236599e-05
2500.00000  2550.00000  1.216944537253e-05
2550.00000  2600.00000  1.487376656642e-05
2600.00000  2650.00000  1.468060076686e-05
2650.00000  2700.00000  1.777125355988e-05
2700.00000  2750.00000  1.526009816555e-05
2750.00000  2800.00000  1.622592716337e-05
2800.00000  2850.00000  1.815758515901e-05
2850.00000  2900.00000  1.603276136381e-05
2900.00000  2950.00000  2.433889074506e-05
2950.00000  3000.00000  4.906411308924e-05
3000.00000  3050.00000  1.989607735508e-05
3050.00000  3100.00000  2.356622754680e-05
3100.00000  3150.00000  2.395255914593e-05
3150.00000  3200.00000  3.438351232238e-05
3200.00000  3250.00000  3.013386473197e-05
3250.00000  3300.00000  3.380401492369e-05
3300.00000  3350.00000  3.476984392151e-05
3350.00000  3400.00000  4.191697850537e-05
3400.00000  3450.00000  4.095114950755e-05
3450.00000  3500.00000  4.558712869709e-05
3500.00000  3550.00000  4.945044468837e-05
3550.00000  3600.00000  5.176843428313e-05
3600.00000  3650.00000  6.644903504999e-05
3650.00000  3700.00000  1.097181741523e-04
3700.00000  3750.00000  7.475516443124e-05
3750.00000  3800.00000  8.055013841816e-05
3800.00000  3850.00000  9.426491018720e-05
3850.00000  3900.00000  1.048890291632e-04
3900.00000  3950.00000  1.054685265619e-04
3950.00000  4000.00000  1.193764641305e-04
4000.00000  4050.00000  1.369545518908e-04
4050.00000  4100.00000  1.301937489061e-04
4100.00000  4150.00000  1.386930440869e-04
4150.00000  4200.00000  1.508624894594e-04
4200.00000  4250.00000  1.614866084354e-04
4250.00000  4300.00000  1.591686188407e-04
4300.00000  4350.00000  1.831211779866e-04
4350.00000  4400.00000  1.900751467709e-04
4400.00000  4450.00000  1.867913281783e-04
4450.00000  4500.00000  2.161525297120e-04
4500.00000  4550.00000  2.232996642959e-04
4550.00000  4600.00000  2.292878040824e-04
4600.00000  4650.00000  2.370144360649e-04
4650.00000  4700.00000  2.397187572588e-04
4700.00000  4750.00000  2.685004613939e-04
4750.00000  4800.00000  2.688867929930e-04
4800.00000  4850.00000  2.715911141869e-04
4850.00000  4900.00000  2.849195543568e-04
4900.00000  4950.00000  3.048156317119e-04
4950.00000  5000.00000  2.986343261258e-04
5000.00000  5050.00000  3.135080926923e-04
5050.00000  5100.00000  3.216210562739e-04
5100.00000  5150.00000  3.386196466356e-04
5150.00000  5200.00000  3.339836674460e-04
5200.00000  5250.00000  3.432556258251e-04
5250.00000  5300.00000  3.558114027968e-04
5300.00000  5350.00000  3.666286875723e-04
5350.00000  5400.00000  3.755143143523e-04
5400.00000  5450.00000  4.243852616420e-04
5450.00000  5500.00000  3.641175321780e-04
5500.00000  5550.00000  3.830477805353e-04
5550.00000  5600.00000  3.836272779340e-04
5600.00000  5650.00000  3.944445627095e-04
5650.00000  5700.00000  4.068071738816e-04
5700.00000  5750.00000  4.010121998947e-04
5750.00000  5800.00000  4.139543084655e-04
5800.00000  5850.00000  4.100909924742e-04
5850.00000  5900.00000  4.516216393805e-04
5900.00000  5950.00000  4.073866712803e-04
5950.00000  6000.00000  4.268964170363e-04
6000.00000  6050.00000  4.342367174197e-04
6050.00000  6100.00000  4.187834534546e-04
6100.00000  6150.00000  4.448608363957e-04
6150.00000  6200.00000  4.543259605744e-04
6200.00000  6250.00000  5.105372082475e-04
6250.00000  6300.00000  5.887693570709e-04
6300.00000  6350.00000  6.076996054281e-04
6350.00000  6400.00000  3.096061435411e-03
6400.00000  6450.00000  4.191697850537e-04
6450.00000  6500.00000  4.433155099992e-04
6500.00000  6550.00000  4.251579248402e-04
6550.00000  6600.00000  4.278622460341e-04
6600.00000  6650.00000  4.381000334110e-04
6650.00000  6700.00000  4.359752096158e-04
6700.00000  6750.00000  4.315323962258e-04
6750.00000  6800.00000  4.263169196376e-04
6800.00000  6850.00000  4.301802356289e-04
6850.00000  6900.00000  4.574166133674e-04
6900.00000  6950.00000  4.545191263739e-04
6950.00000  7000.00000  4.375205360123e-04
7000.00000  7050.00000  4.205219456507e-04
7050.00000  7100.00000  7.205084323735e-04
7100.00000  7150.00000  2.267766486881e-04
7150.00000  7200.00000  2.159593639125e-04
7200.00000  7250.00000  2.327647884745e-04
7250.00000  7300.00000  2.321852910758e-04
7300.00000  7350.00000  2.267766486881e-04
7350.00000  7400.00000  2.364349386662e-04
7400.00000  7450.00000  2.271629802872e-04
7450.00000  7500.00000  3.289613566574e-04
7500.00000  7550.00000  2.319921252763e-04
7550.00000  7600.00000  2.198226799038e-04
7600.00000  7650.00000  2.354691096684e-04
7650.00000  7700.00000  2.269698144876e-04
7700.00000  7750.00000  2.279356434854e-04
7750.00000  7800.00000  2.306399646793e-04
7800.00000  7850.00000  2.379802650628e-04
7850.00000  7900.00000  2.350827780693e-04
7900.00000  7950.00000  2.385597624615e-04
7950.00000  8000.00000  2.433889074506e-04
8000.00000  8050.00000  2.333442858732e-04
8050.00000  8100.00000  2.466727260431e-04
8100.00000  8150.00000  2.374007676641e-04
8150.00000  8200.00000  2.360486070671e-04
8200.00000  8250.00000  2.302536330802e-04
8250.00000  8300.00000  2.522745342305e-04
8300.00000  8350.00000  2.358554412676e-04
8350.00000  8400.00000  2.271629802872e-04
8400.00000  8450.00000  2.275493118863e-04
8450.00000  8500.00000  2.414572494549e-04
8500.00000  8550.00000  2.424230784527e-04
8550.00000  8600.00000  2.271629802872e-04
8600.00000  8650.00000  2.424230784527e-04
8650.00000  8700.00000  2.234928300955e-04
8700.00000  8750.00000  2.310262962785e-04
8750.00000  8800.00000  2.171183587099e-04
8800.00000  8850.00000  2.308331304789e-04
8850.00000  8900.00000  2.221406694985e-04
8900.00000  8950.00000  2.422299126532e-04
8950.00000  9000.00000  2.248449906924e-04
9000.00000  9050.00000  2.298673014811e-04
9050.00000  9100.00000  2.337306174724e-04
9100.00000  9150.00000  2.358554412676e-04
9150.00000  9200.00000  2.287083066837e-04
9200.00000  9250.00000  2.310262962785e-04
9250.00000  9300.00000  2.246518248928e-04
9300.00000  9350.00000  2.372076018645e-04
9350.00000  9400.00000  2.312194620780e-04
9400.00000  9450.00000  2.310262962785e-04
9450.00000  9500.00000  2.283219750846e-04
9500.00000  9550.00000  2.287083066837e-04
9550.00000  9600.00000  2.285151408841e-04
9600.00000  9650.00000  2.211748405007e-04
9650.00000  9700.00000  2.209816747011e-04
9700.00000  9750.00000  2.254244880911e-04
9750.00000  9800.00000  2.279356434854e-04
9800.00000  9850.00000  2.182773535072e-04
9850.00000  9900.00000  2.190500167055e-04
9900.00000  9950.00000  2.161525297120e-04
9950.00000  10000.00000  2.138345401173e-04
