300.00000  350.00000  4.430045652701e-05
350.00000  400.00000  6.466437605959e-05
400.00000  450.00000  4.858759748124e-05
450.00000  500.00000  5.466104716639e-05
500.00000  550.00000  2.740197593243e-04
550.00000  600.00000  3.036724842577e-05
600.00000  650.00000  8.109841638412e-05
650.00000  700.00000  3.465438938000e-05
700.00000  750.00000  6.037723510536e-05
750.00000  800.00000  4.215688604990e-05
800.00000  850.00000  1.539798126060e-04
850.00000  900.00000  4.287140954227e-05
900.00000  950.00000  3.501165112618e-05
950.00000  1000.00000  3.429712763381e-05
1000.00000  1050.00000  3.644069811093e-05
1050.00000  1100.00000  3.822700684185e-05
1100.00000  1150.00000  4.572950351175e-05
1150.00000  1200.00000  4.394319478082e-05
1200.00000  1250.00000  4.037057731897e-05
1250.00000  1300.00000  1.239698259264e-04
1300.00000  1350.00000  3.786974509567e-05
1350.00000  1400.00000  4.751581224268e-05
1400.00000  1450.00000  4.251414779608e-05
1450.00000  1500.00000  5.751914113587e-05
1500.00000  1550.00000  4.215688604990e-05
1550.00000  1600.00000  5.430378542020e-05
1600.00000  1650.00000  4.430045652701e-05
1650.00000  1700.00000  4.823033573505e-05
1700.00000  1750.00000  1.532652891136e-04
1750.00000  1800.00000  5.358926192783e-05
1800.00000  1850.00000  6.252080558247e-05
1850.00000  1900.00000  5.501830891258e-05
1900.00000  1950.00000  5.501830891258e-05
1950.00000  2000.00000  4.715855049649e-05
2000.00000  2050.00000  5.751914113587e-05
2050.00000  2100.00000  5.894818812062e-05
2100.00000  2150.00000  5.323200018165e-05
2150.00000  2200.00000  5.859092637443e-05
2200.00000  2250.00000  5.966271161299e-05
2250.00000  2300.00000  5.823366462825e-05
2300.00000  2350.00000  1.922068194478e-04
2350.00000  2400.00000  6.109175859773e-05
2400.00000  2450.00000  5.216021494309e-05
2450.00000  2500.00000  6.573616129814e-05
2500.00000  2550.00000  6.073449685154e-05
2550.00000  2600.00000  5.894818812062e-05
2600.00000  2650.00000  6.502163780577e-05
2650.00000  2700.00000  5.680461764350e-05
2700.00000  2750.00000  5.323200018165e-05
2750.00000  2800.00000  6.001997335917e-05
2800.00000  2850.00000  6.787973177526e-05
2850.00000  2900.00000  7.073782574474e-05
2900.00000  2950.00000  7.038056399855e-05
2950.00000  3000.00000  1.078930473480e-04
3000.00000  3050.00000  6.180628209010e-05
3050.00000  3100.00000  6.502163780577e-05
3100.00000  3150.00000  6.752247002907e-05
3150.00000  3200.00000  7.145234923711e-05
3200.00000  3250.00000  7.038056399855e-05
3250.00000  3300.00000  7.109508749093e-05
3300.00000  3350.00000  6.394985256721e-05
3350.00000  3400.00000  6.966604050618e-05
3400.00000  3450.00000  6.787973177526e-05
3450.00000  3500.00000  6.716520828288e-05
3500.00000  3550.00000  6.966604050618e-05
3550.00000  3600.00000  7.609675193752e-05
3600.00000  3650.00000  8.145567813031e-05
3650.00000  3700.00000  1.146810205256e-04
3700.00000  3750.00000  7.573949019134e-05
3750.00000  3800.00000  7.752579892227e-05
3800.00000  3850.00000  7.288139622185e-05
3850.00000  3900.00000  7.538222844515e-05
3900.00000  3950.00000  7.252413447567e-05
3950.00000  4000.00000  7.931210765319e-05
4000.00000  4050.00000  8.288472511505e-05
4050.00000  4100.00000  8.145567813031e-05
4100.00000  4150.00000  6.895151701381e-05
4150.00000  4200.00000  7.824032241464e-05
4200.00000  4250.00000  7.038056399855e-05
4250.00000  4300.00000  8.252746336886e-05
4300.00000  4350.00000  8.145567813031e-05
4350.00000  4400.00000  7.931210765319e-05
4400.00000  4450.00000  7.895484590701e-05
4450.00000  4500.00000  8.681460432309e-05
4500.00000  4550.00000  8.074115463794e-05
4550.00000  4600.00000  7.681127542989e-05
4600.00000  4650.00000  7.681127542989e-05
4650.00000  4700.00000  8.538555733835e-05
4700.00000  4750.00000  9.395983924680e-05
4750.00000  4800.00000  8.217020162268e-05
4800.00000  4850.00000  8.502829559216e-05
4850.00000  4900.00000  8.181293987649e-05
4900.00000  4950.00000  8.502829559216e-05
4950.00000  5000.00000  9.824698020103e-05
5000.00000  5050.00000  8.359924860742e-05
5050.00000  5100.00000  8.431377209979e-05
5100.00000  5150.00000  8.324198686123e-05
5150.00000  5200.00000  8.324198686123e-05
5200.00000  5250.00000  9.145900702350e-05
5250.00000  5300.00000  8.788638956165e-05
5300.00000  5350.00000  9.253079226206e-05
5350.00000  5400.00000  8.574281908453e-05
5400.00000  5450.00000  1.061067386171e-04
5450.00000  5500.00000  9.217353051587e-05
5500.00000  5550.00000  8.860091305402e-05
5550.00000  5600.00000  8.967269829257e-05
5600.00000  5650.00000  8.538555733835e-05
5650.00000  5700.00000  8.717186606928e-05
5700.00000  5750.00000  9.431710099299e-05
5750.00000  5800.00000  9.074448353113e-05
5800.00000  5850.00000  8.217020162268e-05
5850.00000  5900.00000  1.114656648099e-04
5900.00000  5950.00000  8.752912781546e-05
5950.00000  6000.00000  9.253079226206e-05
6000.00000  6050.00000  1.032486446476e-04
6050.00000  6100.00000  9.788971845484e-05
6100.00000  6150.00000  9.717519496247e-05
6150.00000  6200.00000  1.014623359167e-04
6200.00000  6250.00000  1.311150608501e-04
6250.00000  6300.00000  1.789881348390e-04
6300.00000  6350.00000  1.671984972148e-04
6350.00000  6400.00000  1.346876783120e-03
6400.00000  6450.00000  9.931876543958e-05
6450.00000  6500.00000  8.395651035361e-05
6500.00000  6550.00000  9.503162448536e-05
6550.00000  6600.00000  8.895817480020e-05
6600.00000  6650.00000  8.145567813031e-05
6650.00000  6700.00000  8.681460432309e-05
6700.00000  6750.00000  1.021768594091e-04
6750.00000  6800.00000  9.717519496247e-05
6800.00000  6850.00000  9.681793321629e-05
6850.00000  6900.00000  9.217353051587e-05
6900.00000  6950.00000  9.538888623154e-05
6950.00000  7000.00000  8.431377209979e-05
7000.00000  7050.00000  8.538555733835e-05
7050.00000  7100.00000  2.311483497821e-04
7100.00000  7150.00000  5.573283240495e-05
7150.00000  7200.00000  4.965938271979e-05
7200.00000  7250.00000  5.466104716639e-05
7250.00000  7300.00000  6.930877876000e-05
7300.00000  7350.00000  6.073449685154e-05
7350.00000  7400.00000  5.287473843546e-05
7400.00000  7450.00000  5.751914113587e-05
7450.00000  7500.00000  9.860424194721e-05
7500.00000  7550.00000  4.680128875031e-05
7550.00000  7600.00000  5.144569145072e-05
7600.00000  7650.00000  4.680128875031e-05
7650.00000  7700.00000  5.180295319691e-05
7700.00000  7750.00000  5.001664446598e-05
7750.00000  7800.00000  5.323200018165e-05
7800.00000  7850.00000  5.966271161299e-05
7850.00000  7900.00000  5.966271161299e-05
7900.00000  7950.00000  5.358926192783e-05
7950.00000  8000.00000  5.751914113587e-05
8000.00000  8050.00000  4.751581224268e-05
8050.00000  8100.00000  4.644402700412e-05
8100.00000  8150.00000  5.144569145072e-05
8150.00000  8200.00000  4.715855049649e-05
8200.00000  8250.00000  4.715855049649e-05
8250.00000  8300.00000  5.966271161299e-05
8300.00000  8350.00000  4.537224176557e-05
8350.00000  8400.00000  4.965938271979e-05
8400.00000  8450.00000  5.537557065876e-05
8450.00000  8500.00000  4.572950351175e-05
8500.00000  8550.00000  4.751581224268e-05
8550.00000  8600.00000  4.930212097361e-05
8600.00000  8650.00000  4.823033573505e-05
8650.00000  8700.00000  5.144569145072e-05
8700.00000  8750.00000  5.287473843546e-05
8750.00000  8800.00000  5.287473843546e-05
8800.00000  8850.00000  5.680461764350e-05
8850.00000  8900.00000  4.858759748124e-05
8900.00000  8950.00000  5.287473843546e-05
8950.00000  9000.00000  4.930212097361e-05
9000.00000  9050.00000  4.858759748124e-05
9050.00000  9100.00000  5.073116795835e-05
9100.00000  9150.00000  5.144569145072e-05
9150.00000  9200.00000  5.251747668928e-05
9200.00000  9250.00000  5.001664446598e-05
9250.00000  9300.00000  4.930212097361e-05
9300.00000  9350.00000  5.108842970453e-05
9350.00000  9400.00000  4.394319478082e-05
9400.00000  9450.00000  5.144569145072e-05
9450.00000  9500.00000  5.108842970453e-05
9500.00000  9550.00000  5.287473843546e-05
9550.00000  9600.00000  4.965938271979e-05
9600.00000  9650.00000  5.680461764350e-05
9650.00000  9700.00000  5.251747668928e-05
9700.00000  9750.00000  5.144569145072e-05
9750.00000  9800.00000  5.609009415113e-05
9800.00000  9850.00000  5.716187938969e-05
9850.00000  9900.00000  5.216021494309e-05
9900.00000  9950.00000  5.073116795835e-05
9950.00000  10000.00000  4.608676525794e-05
