10001.00000  11001.00000  2.979784817946e-04
11001.00000  12001.00000  2.731421506861e-04
12001.00000  13001.00000  2.579164831971e-04
13001.00000  14001.00000  2.372866140318e-04
14001.00000  15001.00000  2.282508654842e-04
15001.00000  16001.00000  2.151715475972e-04
16001.00000  17001.00000  2.090391201630e-04
17001.00000  18001.00000  1.997829875046e-04
18001.00000  19001.00000  1.892620416878e-04
19001.00000  20001.00000  1.814623605449e-04
20001.00000  21001.00000  1.740651199524e-04
21001.00000  22001.00000  1.639082870145e-04
22001.00000  23001.00000  1.536939625695e-04
23001.00000  24001.00000  1.450319088187e-04
24001.00000  25001.00000  1.384203854912e-04
25001.00000  26001.00000  1.294804561223e-04
26001.00000  27001.00000  1.216520292258e-04
27001.00000  28001.00000  1.142452067154e-04
28001.00000  29001.00000  1.069150395480e-04
29001.00000  30001.00000  1.027564871942e-04
30001.00000  31001.00000  9.730437592848e-05
31001.00000  32001.00000  9.017542903623e-05
32001.00000  33001.00000  8.645764490425e-05
33001.00000  34001.00000  8.157086679263e-05
34001.00000  35001.00000  7.870587335072e-05
35001.00000  36001.00000  7.335916318153e-05
36001.00000  37001.00000  7.023545795724e-05
37001.00000  38001.00000  6.658474725032e-05
38001.00000  39001.00000  6.285738120047e-05
39001.00000  40001.00000  5.859342775014e-05
40001.00000  41001.00000  5.661955266976e-05
41001.00000  42001.00000  5.282511319485e-05
42001.00000  43001.00000  5.064043592142e-05
43001.00000  44001.00000  4.921273015940e-05
44001.00000  45001.00000  4.696097946090e-05
45001.00000  46001.00000  4.469006492668e-05
46001.00000  47001.00000  4.217002052794e-05
47001.00000  48001.00000  4.102977230190e-05
48001.00000  49001.00000  3.940084626469e-05
49001.00000  50001.00000  3.816477885998e-05
50001.00000  51001.00000  3.605675692948e-05
51001.00000  52001.00000  3.598968350442e-05
52001.00000  53001.00000  3.421702869922e-05
53001.00000  54001.00000  3.266475800494e-05
54001.00000  55001.00000  3.130412566798e-05
55001.00000  56001.00000  2.967519963077e-05
56001.00000  57001.00000  2.834331304741e-05
57001.00000  58001.00000  2.775881605759e-05
58001.00000  59001.00000  2.624487303477e-05
59001.00000  60001.00000  2.528668124818e-05
60001.00000  61001.00000  2.464469275116e-05
61001.00000  62001.00000  2.461594699756e-05
62001.00000  63001.00000  2.388772123975e-05
63001.00000  64001.00000  2.340862534646e-05
64001.00000  65001.00000  2.175095355565e-05
65001.00000  66001.00000  2.114729273010e-05
66001.00000  67001.00000  1.993038916113e-05
67001.00000  68001.00000  1.981540614674e-05
68001.00000  69001.00000  1.913508997825e-05
69001.00000  70001.00000  1.800442367008e-05
70001.00000  71001.00000  1.836853654898e-05
71001.00000  72001.00000  1.789902257355e-05
72001.00000  73001.00000  1.630842420781e-05
73001.00000  74001.00000  1.640424338647e-05
74001.00000  75001.00000  1.586765598597e-05
75001.00000  76001.00000  1.545563351774e-05
76001.00000  77001.00000  1.466033433487e-05
77001.00000  78001.00000  1.488071844578e-05
78001.00000  79001.00000  1.398960008425e-05
79001.00000  80001.00000  1.387461706986e-05
80001.00000  81001.00000  1.328053816217e-05
81001.00000  82001.00000  1.276311459741e-05
82001.00000  83001.00000  1.240858363637e-05
83001.00000  84001.00000  1.215945377186e-05
84001.00000  85001.00000  1.193906966094e-05
85001.00000  86001.00000  1.121084390313e-05
86001.00000  87001.00000  1.131624499966e-05
87001.00000  88001.00000  1.095213212075e-05
88001.00000  89001.00000  1.052094581679e-05
89001.00000  90001.00000  1.014725102002e-05
90001.00000  91001.00000  9.907703073368e-06
91001.00000  92001.00000  9.869375401904e-06
92001.00000  93001.00000  9.399861426473e-06
93001.00000  94001.00000  9.476516769401e-06
94001.00000  95001.00000  9.074076219032e-06
95001.00000  96001.00000  9.859793484038e-06
96001.00000  97001.00000  9.035748547568e-06
97001.00000  98001.00000  8.297940871892e-06
98001.00000  99001.00000  8.192539775367e-06
99001.00000  100001.00000  8.048811007378e-06
100001.00000  101001.00000  8.010483335914e-06
101001.00000  102001.00000  7.655952374875e-06
102001.00000  103001.00000  7.742189635668e-06
103001.00000  104001.00000  8.010483335914e-06
104001.00000  105001.00000  7.550551278350e-06
105001.00000  106001.00000  7.368494838897e-06
106001.00000  107001.00000  7.243929906640e-06
107001.00000  108001.00000  7.387658674629e-06
108001.00000  109001.00000  6.467794559500e-06
109001.00000  110001.00000  6.669014834685e-06
110001.00000  111001.00000  6.266574284316e-06
111001.00000  112001.00000  6.180337023522e-06
112001.00000  113001.00000  6.132427434193e-06
113001.00000  114001.00000  6.477376477366e-06
114001.00000  115001.00000  5.950370994740e-06
115001.00000  116001.00000  5.615003869433e-06
116001.00000  117001.00000  5.806642226751e-06
117001.00000  118001.00000  5.701241130226e-06
118001.00000  119001.00000  5.471275101444e-06
119001.00000  120001.00000  5.624585787299e-06
120001.00000  121001.00000  5.385037840650e-06
121001.00000  122001.00000  5.097580304673e-06
122001.00000  123001.00000  5.040088797477e-06
123001.00000  124001.00000  5.183817565466e-06
124001.00000  125001.00000  4.455591807656e-06
125001.00000  126001.00000  4.752631261499e-06
126001.00000  127001.00000  4.771795097231e-06
127001.00000  128001.00000  4.838868522293e-06
128001.00000  129001.00000  4.771795097231e-06
129001.00000  130001.00000  4.311863039667e-06
130001.00000  131001.00000  4.666394000706e-06
131001.00000  132001.00000  4.493919479119e-06
132001.00000  133001.00000  4.216043861007e-06
133001.00000  134001.00000  4.235207696739e-06
134001.00000  135001.00000  4.168134271678e-06
135001.00000  136001.00000  4.005241667957e-06
136001.00000  137001.00000  3.919004407164e-06
137001.00000  138001.00000  4.283117286069e-06
138001.00000  139001.00000  3.593219199722e-06
139001.00000  140001.00000  4.129806600214e-06
140001.00000  141001.00000  3.861512899968e-06
141001.00000  142001.00000  3.641128789052e-06
142001.00000  143001.00000  3.784857557041e-06
143001.00000  144001.00000  3.765693721309e-06
144001.00000  145001.00000  3.602801117588e-06
145001.00000  146001.00000  3.372835088806e-06
146001.00000  147001.00000  3.487818103197e-06
147001.00000  148001.00000  2.970394538437e-06
148001.00000  149001.00000  3.094959470694e-06
149001.00000  150001.00000  3.344089335208e-06
150001.00000  151001.00000  3.286597828013e-06
151001.00000  152001.00000  3.075795634962e-06
152001.00000  153001.00000  3.248270156549e-06
153001.00000  154001.00000  2.769174263253e-06
154001.00000  155001.00000  2.778756181119e-06
155001.00000  156001.00000  2.759592345387e-06
156001.00000  157001.00000  2.826665770448e-06
157001.00000  158001.00000  2.912903031242e-06
158001.00000  159001.00000  2.845829606180e-06
159001.00000  160001.00000  2.644609330996e-06
160001.00000  161001.00000  2.491298645141e-06
161001.00000  162001.00000  2.529626316604e-06
162001.00000  163001.00000  2.462552891543e-06
163001.00000  164001.00000  2.520044398739e-06
164001.00000  165001.00000  2.309242205688e-06
165001.00000  166001.00000  2.596699741666e-06
166001.00000  167001.00000  2.376315630750e-06
167001.00000  168001.00000  2.050530423308e-06
168001.00000  169001.00000  2.155931519833e-06
169001.00000  170001.00000  2.002620833979e-06
170001.00000  171001.00000  2.136767684102e-06
171001.00000  172001.00000  2.117603848370e-06
172001.00000  173001.00000  1.945129326783e-06
173001.00000  174001.00000  2.136767684102e-06
174001.00000  175001.00000  2.098440012638e-06
175001.00000  176001.00000  1.878055901722e-06
176001.00000  177001.00000  1.906801655319e-06
177001.00000  178001.00000  1.945129326783e-06
178001.00000  179001.00000  1.993038916113e-06
179001.00000  180001.00000  1.878055901722e-06
180001.00000  181001.00000  1.791818640928e-06
181001.00000  182001.00000  1.820564394526e-06
182001.00000  183001.00000  1.849310148124e-06
183001.00000  184001.00000  1.743909051599e-06
184001.00000  185001.00000  1.782236723062e-06
185001.00000  186001.00000  1.533106858548e-06
186001.00000  187001.00000  1.619344119342e-06
187001.00000  188001.00000  1.638507955073e-06
188001.00000  189001.00000  1.533106858548e-06
189001.00000  190001.00000  1.418123844157e-06
190001.00000  191001.00000  1.494779187084e-06
191001.00000  192001.00000  1.523524940682e-06
192001.00000  193001.00000  1.341468501230e-06
193001.00000  194001.00000  1.398960008425e-06
194001.00000  195001.00000  1.657671790805e-06
195001.00000  196001.00000  1.504361104950e-06
196001.00000  197001.00000  1.322304665498e-06
197001.00000  198001.00000  1.351050419096e-06
198001.00000  199001.00000  1.504361104950e-06
