300.00000  350.00000  6.298444020435e-02
350.00000  400.00000  4.759398737829e-02
400.00000  450.00000  3.686197483260e-02
450.00000  500.00000  2.954141567945e-02
500.00000  550.00000  2.410401021463e-02
550.00000  600.00000  2.007352582767e-02
600.00000  650.00000  1.688340993025e-02
650.00000  700.00000  1.455936623148e-02
700.00000  750.00000  1.266086171688e-02
750.00000  800.00000  1.105366590553e-02
800.00000  850.00000  9.689941338821e-03
850.00000  900.00000  8.718198336048e-03
900.00000  950.00000  7.719323640324e-03
950.00000  1000.00000  6.980698999348e-03
1000.00000  1050.00000  6.270991031121e-03
1050.00000  1100.00000  5.747277957988e-03
1100.00000  1150.00000  5.245698634367e-03
1150.00000  1200.00000  4.792670761289e-03
1200.00000  1250.00000  4.471731393364e-03
1250.00000  1300.00000  4.095457651658e-03
1300.00000  1350.00000  3.798437013044e-03
1350.00000  1400.00000  3.563890667408e-03
1400.00000  1450.00000  3.292216741945e-03
1450.00000  1500.00000  3.044818541753e-03
1500.00000  1550.00000  2.817769111274e-03
1550.00000  1600.00000  2.649267018214e-03
1600.00000  1650.00000  2.487190852432e-03
1650.00000  1700.00000  2.377950088711e-03
1700.00000  1750.00000  2.225155817886e-03
1750.00000  1800.00000  2.106990155168e-03
1800.00000  1850.00000  2.007031286403e-03
1850.00000  1900.00000  1.919567276235e-03
1900.00000  1950.00000  1.806756552915e-03
1950.00000  2000.00000  1.628615568939e-03
2000.00000  2050.00000  1.589703009312e-03
2050.00000  2100.00000  1.554360409285e-03
2100.00000  2150.00000  1.424770875851e-03
2150.00000  2200.00000  1.369436502071e-03
2200.00000  2250.00000  1.306962209093e-03
2250.00000  2300.00000  1.268049649467e-03
2300.00000  2350.00000  1.233778037320e-03
2350.00000  2400.00000  1.153096950388e-03
2400.00000  2450.00000  1.075985823056e-03
2450.00000  2500.00000  1.067417920019e-03
2500.00000  2550.00000  1.034931287671e-03
2550.00000  2600.00000  1.029933344232e-03
2600.00000  2650.00000  9.674590512546e-04
2650.00000  2700.00000  8.924898996814e-04
2700.00000  2750.00000  8.703561501693e-04
2750.00000  2800.00000  8.203767157871e-04
2800.00000  2850.00000  7.985999622349e-04
2850.00000  2900.00000  7.707542773648e-04
2900.00000  2950.00000  7.925310309171e-04
2950.00000  3000.00000  7.657563339266e-04
3000.00000  3050.00000  7.354116773375e-04
3050.00000  3100.00000  6.936431500324e-04
3100.00000  3150.00000  6.536596025266e-04
3150.00000  3200.00000  6.765073439585e-04
3200.00000  3250.00000  6.408077479712e-04
3250.00000  3300.00000  6.315258530145e-04
3300.00000  3350.00000  5.961832529872e-04
3350.00000  3400.00000  5.968972449069e-04
3400.00000  3450.00000  5.426338590063e-04
3450.00000  3500.00000  5.608406529598e-04
3500.00000  3550.00000  5.444188388056e-04
3550.00000  3600.00000  5.247840610126e-04
3600.00000  3650.00000  5.126461983770e-04
3650.00000  3700.00000  5.094332347381e-04
3700.00000  3750.00000  4.558838407572e-04
3750.00000  3800.00000  4.780175902693e-04
3800.00000  3850.00000  4.519568851986e-04
3850.00000  3900.00000  4.605247882356e-04
3900.00000  3950.00000  4.341070872050e-04
3950.00000  4000.00000  3.966225114184e-04
4000.00000  4050.00000  4.269671680076e-04
4050.00000  4100.00000  3.884116043413e-04
4100.00000  4150.00000  3.773447295853e-04
4150.00000  4200.00000  3.691338225082e-04
4200.00000  4250.00000  3.555679760331e-04
4250.00000  4300.00000  3.470000729961e-04
4300.00000  4350.00000  3.516410204745e-04
4350.00000  4400.00000  3.609229154311e-04
4400.00000  4450.00000  3.423591255178e-04
4450.00000  4500.00000  3.337912224808e-04
4500.00000  4550.00000  3.555679760331e-04
4550.00000  4600.00000  3.173694083267e-04
4600.00000  4650.00000  3.291502750025e-04
4650.00000  4700.00000  3.120144689286e-04
4700.00000  4750.00000  2.948786628547e-04
4750.00000  4800.00000  3.005905982127e-04
4800.00000  4850.00000  2.802418285000e-04
4850.00000  4900.00000  2.877387436573e-04
4900.00000  4950.00000  2.963066466942e-04
4950.00000  5000.00000  2.820268082993e-04
5000.00000  5050.00000  2.559661032286e-04
5050.00000  5100.00000  2.520391476700e-04
5100.00000  5150.00000  2.588220709076e-04
5150.00000  5200.00000  2.584650749477e-04
5200.00000  5250.00000  2.363313254356e-04
5250.00000  5300.00000  2.295484021980e-04
5300.00000  5350.00000  2.338323537165e-04
5350.00000  5400.00000  2.274064264388e-04
5400.00000  5450.00000  2.231224749203e-04
5450.00000  5500.00000  2.316903779573e-04
5500.00000  5550.00000  2.163395516828e-04
5550.00000  5600.00000  2.231224749203e-04
5600.00000  5650.00000  2.252644506796e-04
5650.00000  5700.00000  2.224084830006e-04
5700.00000  5750.00000  2.116986042044e-04
5750.00000  5800.00000  2.038446930872e-04
5800.00000  5850.00000  1.949197940904e-04
5850.00000  5900.00000  2.027737052076e-04
5900.00000  5950.00000  1.859948950936e-04
5950.00000  6000.00000  1.759990082172e-04
6000.00000  6050.00000  1.795689678159e-04
6050.00000  6100.00000  1.699300768993e-04
6100.00000  6150.00000  1.685020930598e-04
6150.00000  6200.00000  1.781409839764e-04
6200.00000  6250.00000  1.759990082172e-04
6250.00000  6300.00000  1.731430405382e-04
6300.00000  6350.00000  1.617191698223e-04
6350.00000  6400.00000  2.402582809942e-04
6400.00000  6450.00000  1.563642304242e-04
6450.00000  6500.00000  1.542222546649e-04
6500.00000  6550.00000  1.520802789057e-04
6550.00000  6600.00000  1.527942708255e-04
6600.00000  6650.00000  1.463683435477e-04
6650.00000  6700.00000  1.470823354675e-04
6700.00000  6750.00000  1.588632021433e-04
6750.00000  6800.00000  1.602911859828e-04
6800.00000  6850.00000  1.499383031465e-04
6850.00000  6900.00000  1.417273960694e-04
6900.00000  6950.00000  1.399424162700e-04
6950.00000  7000.00000  1.345874768720e-04
7000.00000  7050.00000  1.442263677885e-04
7050.00000  7100.00000  1.431553799089e-04
7100.00000  7150.00000  1.356584647516e-04
7150.00000  7200.00000  1.260195738350e-04
7200.00000  7250.00000  1.253055819153e-04
7250.00000  7300.00000  1.120967314000e-04
7300.00000  7350.00000  1.238775980758e-04
7350.00000  7400.00000  1.278045536344e-04
7400.00000  7450.00000  1.281615495942e-04
7450.00000  7500.00000  1.253055819153e-04
7500.00000  7550.00000  1.210216303968e-04
7550.00000  7600.00000  1.078127798815e-04
7600.00000  7650.00000  1.145957031191e-04
7650.00000  7700.00000  1.174516707981e-04
7700.00000  7750.00000  1.092407637210e-04
7750.00000  7800.00000  1.106687475605e-04
7800.00000  7850.00000  1.138817111993e-04
7850.00000  7900.00000  1.006728606841e-04
7900.00000  7950.00000  1.095977596809e-04
7950.00000  8000.00000  1.063847960420e-04
8000.00000  8050.00000  1.028148364433e-04
8050.00000  8100.00000  9.960187280444e-05
8100.00000  8150.00000  1.070987879618e-04
8150.00000  8200.00000  9.960187280444e-05
8200.00000  8250.00000  1.013868526038e-04
8250.00000  8300.00000  8.782100612865e-05
8300.00000  8350.00000  9.817388896495e-05
8350.00000  8400.00000  8.567903036941e-05
8400.00000  8450.00000  9.031997784775e-05
8450.00000  8500.00000  1.120967314000e-04
8500.00000  8550.00000  7.961009905158e-05
8550.00000  8600.00000  9.103396976750e-05
8600.00000  8650.00000  9.817388896495e-05
8650.00000  8700.00000  9.174796168725e-05
8700.00000  8750.00000  8.532203440954e-05
8750.00000  8800.00000  8.889199400826e-05
8800.00000  8850.00000  8.960598592801e-05
8850.00000  8900.00000  9.210495764712e-05
8900.00000  8950.00000  7.604013945285e-05
8950.00000  9000.00000  8.282306269043e-05
9000.00000  9050.00000  8.782100612865e-05
9050.00000  9100.00000  7.961009905158e-05
9100.00000  9150.00000  7.853911117196e-05
9150.00000  9200.00000  7.282717581400e-05
9200.00000  9250.00000  7.604013945285e-05
9250.00000  9300.00000  7.139919197451e-05
9300.00000  9350.00000  7.853911117196e-05
9350.00000  9400.00000  6.890022025540e-05
9400.00000  9450.00000  7.639713541273e-05
9450.00000  9500.00000  7.068520005476e-05
9500.00000  9550.00000  7.461215561336e-05
9550.00000  9600.00000  7.247017985413e-05
9600.00000  9650.00000  7.282717581400e-05
9650.00000  9700.00000  7.175618793438e-05
9700.00000  9750.00000  7.604013945285e-05
9750.00000  9800.00000  6.390227681719e-05
9800.00000  9850.00000  5.854733741910e-05
9850.00000  9900.00000  7.175618793438e-05
9900.00000  9950.00000  6.497326469680e-05
9950.00000  10000.00000  6.497326469680e-05
