300.00000  350.00000  2.005198486135e-05
350.00000  400.00000  3.586220369434e-05
400.00000  450.00000  1.773829430043e-05
450.00000  500.00000  2.583621126366e-05
500.00000  550.00000  1.434488147774e-04
550.00000  600.00000  1.773829430043e-05
600.00000  650.00000  3.663343388131e-05
650.00000  700.00000  2.198006032879e-05
700.00000  750.00000  2.930674710505e-05
750.00000  800.00000  2.082321504833e-05
800.00000  850.00000  8.097916963238e-05
850.00000  900.00000  1.581021883299e-05
900.00000  950.00000  1.619583392648e-05
950.00000  1000.00000  1.889513958089e-05
1000.00000  1050.00000  1.850952448740e-05
1050.00000  1100.00000  2.583621126366e-05
1100.00000  1150.00000  1.928075467438e-05
1150.00000  1200.00000  1.889513958089e-05
1200.00000  1250.00000  2.737867163761e-05
1250.00000  1300.00000  6.054156967754e-05
1300.00000  1350.00000  2.583621126366e-05
1350.00000  1400.00000  2.275129051576e-05
1400.00000  1450.00000  2.120883014181e-05
1450.00000  1500.00000  2.660744145064e-05
1500.00000  1550.00000  1.850952448740e-05
1550.00000  1600.00000  1.850952448740e-05
1600.00000  1650.00000  2.583621126366e-05
1650.00000  1700.00000  2.699305654413e-05
1700.00000  1750.00000  7.095317720170e-05
1750.00000  1800.00000  1.966636976786e-05
1800.00000  1850.00000  2.969236219854e-05
1850.00000  1900.00000  2.159444523530e-05
1900.00000  1950.00000  2.699305654413e-05
1950.00000  2000.00000  2.506498107669e-05
2000.00000  2050.00000  1.696706411345e-05
2050.00000  2100.00000  1.619583392648e-05
2100.00000  2150.00000  2.429375088971e-05
2150.00000  2200.00000  2.467936598320e-05
2200.00000  2250.00000  2.043759995484e-05
2250.00000  2300.00000  2.583621126366e-05
2300.00000  2350.00000  6.478333570590e-05
2350.00000  2400.00000  3.162043766598e-05
2400.00000  2450.00000  2.930674710505e-05
2450.00000  2500.00000  2.776428673110e-05
2500.00000  2550.00000  2.583621126366e-05
2550.00000  2600.00000  2.699305654413e-05
2600.00000  2650.00000  2.853551691808e-05
2650.00000  2700.00000  2.583621126366e-05
2700.00000  2750.00000  2.352252070274e-05
2750.00000  2800.00000  2.892113201156e-05
2800.00000  2850.00000  2.622182635715e-05
2850.00000  2900.00000  2.275129051576e-05
2900.00000  2950.00000  2.082321504833e-05
2950.00000  3000.00000  4.473135084455e-05
3000.00000  3050.00000  2.853551691808e-05
3050.00000  3100.00000  2.930674710505e-05
3100.00000  3150.00000  2.622182635715e-05
3150.00000  3200.00000  3.007797729203e-05
3200.00000  3250.00000  2.892113201156e-05
3250.00000  3300.00000  2.737867163761e-05
3300.00000  3350.00000  3.123482257249e-05
3350.00000  3400.00000  2.737867163761e-05
3400.00000  3450.00000  3.123482257249e-05
3450.00000  3500.00000  3.007797729203e-05
3500.00000  3550.00000  2.275129051576e-05
3550.00000  3600.00000  3.393412822690e-05
3600.00000  3650.00000  3.316289803993e-05
3650.00000  3700.00000  4.318889047060e-05
3700.00000  3750.00000  3.123482257249e-05
3750.00000  3800.00000  2.699305654413e-05
3800.00000  3850.00000  2.776428673110e-05
3850.00000  3900.00000  2.892113201156e-05
3900.00000  3950.00000  2.853551691808e-05
3950.00000  4000.00000  2.622182635715e-05
4000.00000  4050.00000  2.969236219854e-05
4050.00000  4100.00000  3.354851313341e-05
4100.00000  4150.00000  2.699305654413e-05
4150.00000  4200.00000  3.084920747900e-05
4200.00000  4250.00000  3.200605275946e-05
4250.00000  4300.00000  3.509097350736e-05
4300.00000  4350.00000  3.547658860085e-05
4350.00000  4400.00000  2.545059617018e-05
4400.00000  4450.00000  2.930674710505e-05
4450.00000  4500.00000  3.624781878783e-05
4500.00000  4550.00000  3.316289803993e-05
4550.00000  4600.00000  2.892113201156e-05
4600.00000  4650.00000  3.239166785295e-05
4650.00000  4700.00000  4.010396972270e-05
4700.00000  4750.00000  3.894712444224e-05
4750.00000  4800.00000  3.663343388131e-05
4800.00000  4850.00000  2.892113201156e-05
4850.00000  4900.00000  3.354851313341e-05
4900.00000  4950.00000  3.239166785295e-05
4950.00000  5000.00000  3.663343388131e-05
5000.00000  5050.00000  3.084920747900e-05
5050.00000  5100.00000  4.280327537711e-05
5100.00000  5150.00000  2.969236219854e-05
5150.00000  5200.00000  3.547658860085e-05
5200.00000  5250.00000  3.509097350736e-05
5250.00000  5300.00000  4.588819612501e-05
5300.00000  5350.00000  4.588819612501e-05
5350.00000  5400.00000  3.817589425526e-05
5400.00000  5450.00000  4.627381121850e-05
5450.00000  5500.00000  3.586220369434e-05
5500.00000  5550.00000  3.431974332039e-05
5550.00000  5600.00000  4.048958481619e-05
5600.00000  5650.00000  4.280327537711e-05
5650.00000  5700.00000  4.550258103153e-05
5700.00000  5750.00000  4.318889047060e-05
5750.00000  5800.00000  4.241766028363e-05
5800.00000  5850.00000  3.509097350736e-05
5850.00000  5900.00000  4.241766028363e-05
5900.00000  5950.00000  4.704504140548e-05
5950.00000  6000.00000  4.511696593804e-05
6000.00000  6050.00000  4.280327537711e-05
6050.00000  6100.00000  5.090119234035e-05
6100.00000  6150.00000  4.935873196640e-05
6150.00000  6200.00000  5.167242252733e-05
6200.00000  6250.00000  6.786825645380e-05
6250.00000  6300.00000  8.560655075423e-05
6300.00000  6350.00000  9.409008281095e-05
6350.00000  6400.00000  6.925647079036e-04
6400.00000  6450.00000  3.701904897480e-05
6450.00000  6500.00000  3.779027916178e-05
6500.00000  6550.00000  4.126081500316e-05
6550.00000  6600.00000  4.010396972270e-05
6600.00000  6650.00000  3.933273953573e-05
6650.00000  6700.00000  4.241766028363e-05
6700.00000  6750.00000  4.280327537711e-05
6750.00000  6800.00000  4.048958481619e-05
6800.00000  6850.00000  4.203204519014e-05
6850.00000  6900.00000  5.090119234035e-05
6900.00000  6950.00000  5.128680743384e-05
6950.00000  7000.00000  5.861349421010e-05
7000.00000  7050.00000  3.971835462921e-05
7050.00000  7100.00000  1.021879997742e-04
7100.00000  7150.00000  2.082321504833e-05
7150.00000  7200.00000  1.619583392648e-05
7200.00000  7250.00000  2.120883014181e-05
7250.00000  7300.00000  1.619583392648e-05
7300.00000  7350.00000  1.773829430043e-05
7350.00000  7400.00000  2.236567542228e-05
7400.00000  7450.00000  2.159444523530e-05
7450.00000  7500.00000  4.550258103153e-05
7500.00000  7550.00000  2.352252070274e-05
7550.00000  7600.00000  2.352252070274e-05
7600.00000  7650.00000  2.236567542228e-05
7650.00000  7700.00000  2.159444523530e-05
7700.00000  7750.00000  2.583621126366e-05
7750.00000  7800.00000  2.043759995484e-05
7800.00000  7850.00000  1.889513958089e-05
7850.00000  7900.00000  2.043759995484e-05
7900.00000  7950.00000  1.696706411345e-05
7950.00000  8000.00000  1.966636976786e-05
8000.00000  8050.00000  2.159444523530e-05
8050.00000  8100.00000  2.583621126366e-05
8100.00000  8150.00000  2.236567542228e-05
8150.00000  8200.00000  2.236567542228e-05
8200.00000  8250.00000  2.313690560925e-05
8250.00000  8300.00000  1.928075467438e-05
8300.00000  8350.00000  2.275129051576e-05
8350.00000  8400.00000  1.812390939391e-05
8400.00000  8450.00000  1.966636976786e-05
8450.00000  8500.00000  2.583621126366e-05
8500.00000  8550.00000  2.506498107669e-05
8550.00000  8600.00000  2.352252070274e-05
8600.00000  8650.00000  1.966636976786e-05
8650.00000  8700.00000  2.043759995484e-05
8700.00000  8750.00000  2.545059617018e-05
8750.00000  8800.00000  2.198006032879e-05
8800.00000  8850.00000  2.467936598320e-05
8850.00000  8900.00000  2.545059617018e-05
8900.00000  8950.00000  2.545059617018e-05
8950.00000  9000.00000  2.082321504833e-05
9000.00000  9050.00000  2.313690560925e-05
9050.00000  9100.00000  2.159444523530e-05
9100.00000  9150.00000  2.275129051576e-05
9150.00000  9200.00000  2.275129051576e-05
9200.00000  9250.00000  2.236567542228e-05
9250.00000  9300.00000  2.583621126366e-05
9300.00000  9350.00000  2.545059617018e-05
9350.00000  9400.00000  2.545059617018e-05
9400.00000  9450.00000  2.622182635715e-05
9450.00000  9500.00000  2.545059617018e-05
9500.00000  9550.00000  2.390813579623e-05
9550.00000  9600.00000  2.583621126366e-05
9600.00000  9650.00000  2.814990182459e-05
9650.00000  9700.00000  2.699305654413e-05
9700.00000  9750.00000  2.506498107669e-05
9750.00000  9800.00000  2.506498107669e-05
9800.00000  9850.00000  2.969236219854e-05
9850.00000  9900.00000  2.892113201156e-05
9900.00000  9950.00000  2.236567542228e-05
9950.00000  10000.00000  2.660744145064e-05
