300.00000  350.00000  2.306463631762e-05
350.00000  400.00000  3.645700579237e-05
400.00000  450.00000  3.050484158137e-05
450.00000  500.00000  2.529669789674e-05
500.00000  550.00000  1.681486389607e-04
550.00000  600.00000  2.157659526487e-05
600.00000  650.00000  5.728958053086e-05
650.00000  700.00000  2.455267737037e-05
700.00000  750.00000  4.315319052974e-05
750.00000  800.00000  2.232061579125e-05
800.00000  850.00000  1.086269968507e-04
850.00000  900.00000  2.083257473850e-05
900.00000  950.00000  2.752875947587e-05
950.00000  1000.00000  3.348092368687e-05
1000.00000  1050.00000  4.761731368799e-05
1050.00000  1100.00000  4.240917000337e-05
1100.00000  1150.00000  6.175370368911e-05
1150.00000  1200.00000  1.205313252727e-04
1200.00000  1250.00000  1.636845158025e-04
1250.00000  1300.00000  3.482016063434e-04
1300.00000  1350.00000  3.110005800247e-04
1350.00000  1400.00000  4.114433510853e-04
1400.00000  1450.00000  5.542952921493e-04
1450.00000  1500.00000  7.127716642671e-04
1500.00000  1550.00000  8.355350511189e-04
1550.00000  1600.00000  1.052789044820e-03
1600.00000  1650.00000  1.182992636936e-03
1650.00000  1700.00000  1.313196229052e-03
1700.00000  1750.00000  1.596668049600e-03
1750.00000  1800.00000  1.571371351704e-03
1800.00000  1850.00000  1.505897545383e-03
1850.00000  1900.00000  1.529706202227e-03
1900.00000  1950.00000  1.668838040659e-03
1950.00000  2000.00000  1.709759169609e-03
2000.00000  2050.00000  1.822850289618e-03
2050.00000  2100.00000  1.832522556461e-03
2100.00000  2150.00000  1.876419767517e-03
2150.00000  2200.00000  1.919572958047e-03
2200.00000  2250.00000  1.918084916994e-03
2250.00000  2300.00000  1.803505755933e-03
2300.00000  2350.00000  2.059448817006e-03
2350.00000  2400.00000  1.799785653301e-03
2400.00000  2450.00000  1.848891008041e-03
2450.00000  2500.00000  1.722407518558e-03
2500.00000  2550.00000  1.639077219604e-03
2550.00000  2600.00000  1.519289914857e-03
2600.00000  2650.00000  1.537146407490e-03
2650.00000  2700.00000  1.517801873805e-03
2700.00000  2750.00000  1.485064970644e-03
2750.00000  2800.00000  1.398014569058e-03
2800.00000  2850.00000  1.370485809582e-03
2850.00000  2900.00000  1.335516844843e-03
2900.00000  2950.00000  1.259626751153e-03
2950.00000  3000.00000  1.263346853784e-03
3000.00000  3050.00000  1.207545314306e-03
3050.00000  3100.00000  1.183736657462e-03
3100.00000  3150.00000  1.084037906928e-03
3150.00000  3200.00000  1.068413475874e-03
3200.00000  3250.00000  9.880592590258e-04
3250.00000  3300.00000  9.962434848159e-04
3300.00000  3350.00000  9.463941095488e-04
3350.00000  3400.00000  9.047289600718e-04
3400.00000  3450.00000  8.697599953322e-04
3450.00000  3500.00000  8.340470100662e-04
3500.00000  3550.00000  8.266068048024e-04
3550.00000  3600.00000  7.931258811156e-04
3600.00000  3650.00000  7.551808342705e-04
3650.00000  3700.00000  7.477406290067e-04
3700.00000  3750.00000  6.502739400516e-04
3750.00000  3800.00000  6.465538374197e-04
3800.00000  3850.00000  6.286973447867e-04
3850.00000  3900.00000  5.862881747834e-04
3900.00000  3950.00000  5.743838463614e-04
3950.00000  4000.00000  5.661996205713e-04
4000.00000  4050.00000  5.438790047800e-04
4050.00000  4100.00000  5.275105531998e-04
4100.00000  4150.00000  4.650128289843e-04
4150.00000  4200.00000  5.029578758294e-04
4200.00000  4250.00000  4.278118026655e-04
4250.00000  4300.00000  4.508764389832e-04
4300.00000  4350.00000  4.300438642447e-04
4350.00000  4400.00000  4.278118026655e-04
4400.00000  4450.00000  3.556418116072e-04
4450.00000  4500.00000  3.779624273984e-04
4500.00000  4550.00000  3.415054216061e-04
4550.00000  4600.00000  3.563858321335e-04
4600.00000  4650.00000  3.377853189742e-04
4650.00000  4700.00000  3.013283131818e-04
4700.00000  4750.00000  3.020723337082e-04
4750.00000  4800.00000  2.834718205488e-04
4800.00000  4850.00000  2.931440873917e-04
4850.00000  4900.00000  2.752875947587e-04
4900.00000  4950.00000  2.514789379147e-04
4950.00000  5000.00000  2.842158410752e-04
5000.00000  5050.00000  2.410626505454e-04
5050.00000  5100.00000  2.432947121246e-04
5100.00000  5150.00000  2.365985273872e-04
5150.00000  5200.00000  2.380865684399e-04
5200.00000  5250.00000  2.224621373861e-04
5250.00000  5300.00000  2.343664658081e-04
5300.00000  5350.00000  2.083257473850e-04
5350.00000  5400.00000  2.098137884377e-04
5400.00000  5450.00000  1.867491521201e-04
5450.00000  5500.00000  1.852611110673e-04
5500.00000  5550.00000  1.778209058036e-04
5550.00000  5600.00000  1.681486389607e-04
5600.00000  5650.00000  1.889812136992e-04
5650.00000  5700.00000  1.562443105387e-04
5700.00000  5750.00000  1.398758589585e-04
5750.00000  5800.00000  1.450840026431e-04
5800.00000  5850.00000  1.525242079068e-04
5850.00000  5900.00000  1.480600847486e-04
5900.00000  5950.00000  1.413639000112e-04
5950.00000  6000.00000  1.160672021145e-04
6000.00000  6050.00000  1.339236947475e-04
6050.00000  6100.00000  1.287155510628e-04
6100.00000  6150.00000  1.391318384321e-04
6150.00000  6200.00000  1.078829763244e-04
6200.00000  6250.00000  1.041628736925e-04
6250.00000  6300.00000  1.168112226408e-04
6300.00000  6350.00000  1.138351405354e-04
6350.00000  6400.00000  4.032591252952e-04
6400.00000  6450.00000  1.108590584299e-04
6450.00000  6500.00000  1.063949352716e-04
6500.00000  6550.00000  1.093710173771e-04
6550.00000  6600.00000  8.258627842761e-05
6600.00000  6650.00000  1.026748326397e-04
6650.00000  6700.00000  1.011867915870e-04
6700.00000  6750.00000  7.812215526936e-05
6750.00000  6800.00000  8.853844263861e-05
6800.00000  6850.00000  6.919390895286e-05
6850.00000  6900.00000  9.151452474411e-05
6900.00000  6950.00000  9.225854527048e-05
6950.00000  7000.00000  8.109823737486e-05
7000.00000  7050.00000  6.547380632099e-05
7050.00000  7100.00000  1.041628736925e-04
7100.00000  7150.00000  6.770586790011e-05
7150.00000  7200.00000  6.324174474186e-05
7200.00000  7250.00000  5.803360105724e-05
7250.00000  7300.00000  5.505751895174e-05
7300.00000  7350.00000  5.728958053086e-05
7350.00000  7400.00000  6.547380632099e-05
7400.00000  7450.00000  6.696184737374e-05
7450.00000  7500.00000  6.398576526824e-05
7500.00000  7550.00000  5.877762158361e-05
7550.00000  7600.00000  5.877762158361e-05
7600.00000  7650.00000  3.943308789787e-05
7650.00000  7700.00000  5.208143684624e-05
7700.00000  7750.00000  5.728958053086e-05
7750.00000  7800.00000  5.803360105724e-05
7800.00000  7850.00000  5.431349842536e-05
7850.00000  7900.00000  4.389721105612e-05
7900.00000  7950.00000  4.538525210887e-05
7950.00000  8000.00000  4.836133421436e-05
8000.00000  8050.00000  3.794504684512e-05
8050.00000  8100.00000  4.761731368799e-05
8100.00000  8150.00000  4.612927263524e-05
8150.00000  8200.00000  3.571298526599e-05
8200.00000  8250.00000  3.868906737149e-05
8250.00000  8300.00000  4.910535474074e-05
8300.00000  8350.00000  4.240917000337e-05
8350.00000  8400.00000  3.868906737149e-05
8400.00000  8450.00000  4.538525210887e-05
8450.00000  8500.00000  4.315319052974e-05
8500.00000  8550.00000  3.124886210774e-05
8550.00000  8600.00000  2.827278000224e-05
8600.00000  8650.00000  4.166514947699e-05
8650.00000  8700.00000  2.901680052862e-05
8700.00000  8750.00000  3.422494421324e-05
8750.00000  8800.00000  3.794504684512e-05
8800.00000  8850.00000  3.720102631874e-05
8850.00000  8900.00000  3.496896473962e-05
8900.00000  8950.00000  3.868906737149e-05
8950.00000  9000.00000  4.017710842424e-05
9000.00000  9050.00000  2.008855421212e-05
9050.00000  9100.00000  2.380865684399e-05
9100.00000  9150.00000  2.901680052862e-05
9150.00000  9200.00000  2.529669789674e-05
9200.00000  9250.00000  3.124886210774e-05
9250.00000  9300.00000  2.827278000224e-05
9300.00000  9350.00000  2.901680052862e-05
9350.00000  9400.00000  3.273690316049e-05
9400.00000  9450.00000  3.422494421324e-05
9450.00000  9500.00000  2.529669789674e-05
9500.00000  9550.00000  2.380865684399e-05
9550.00000  9600.00000  1.860051315937e-05
9600.00000  9650.00000  3.199288263412e-05
9650.00000  9700.00000  2.752875947587e-05
9700.00000  9750.00000  1.636845158025e-05
9750.00000  9800.00000  1.785649263300e-05
9800.00000  9850.00000  2.529669789674e-05
9850.00000  9900.00000  2.380865684399e-05
9900.00000  9950.00000  1.636845158025e-05
9950.00000  10000.00000  1.562443105387e-05
