300.00000  350.00000  9.528432831155e-01
350.00000  400.00000  6.733633467302e-01
400.00000  450.00000  4.981288866168e-01
450.00000  500.00000  3.810074132758e-01
500.00000  550.00000  2.999429317275e-01
550.00000  600.00000  2.401116953462e-01
600.00000  650.00000  1.963349553106e-01
650.00000  700.00000  1.628497129324e-01
700.00000  750.00000  1.374089687232e-01
750.00000  800.00000  1.168087234122e-01
800.00000  850.00000  1.008449770458e-01
850.00000  900.00000  8.757523006628e-02
900.00000  950.00000  7.625848264218e-02
950.00000  1000.00000  6.740473465745e-02
1000.00000  1050.00000  5.986648637329e-02
1050.00000  1100.00000  5.322973788394e-02
1100.00000  1150.00000  4.746148919690e-02
1150.00000  1200.00000  4.312649018362e-02
1200.00000  1250.00000  3.883874115959e-02
1250.00000  1300.00000  3.524699197714e-02
1300.00000  1350.00000  3.231899264361e-02
1350.00000  1400.00000  2.942099330324e-02
1400.00000  1450.00000  2.685749388674e-02
1450.00000  1500.00000  2.471699437396e-02
1500.00000  1550.00000  2.290049478743e-02
1550.00000  1600.00000  2.093474523487e-02
1600.00000  1650.00000  1.967924552064e-02
1650.00000  1700.00000  1.812449587453e-02
1700.00000  1750.00000  1.705949611695e-02
1750.00000  1800.00000  1.598024636260e-02
1800.00000  1850.00000  1.464974666545e-02
1850.00000  1900.00000  1.405049680185e-02
1900.00000  1950.00000  1.302224703590e-02
1950.00000  2000.00000  1.227449720610e-02
2000.00000  2050.00000  1.169924733704e-02
2050.00000  2100.00000  1.083824753302e-02
2100.00000  2150.00000  1.036949763971e-02
2150.00000  2200.00000  9.674247797965e-03
2200.00000  2250.00000  9.248247894930e-03
2250.00000  2300.00000  8.816997993090e-03
2300.00000  2350.00000  8.373748093982e-03
2350.00000  2400.00000  7.721248242503e-03
2400.00000  2450.00000  7.511248290303e-03
2450.00000  2500.00000  7.168498368319e-03
2500.00000  2550.00000  6.773248458285e-03
2550.00000  2600.00000  6.359248552519e-03
2600.00000  2650.00000  6.164248596904e-03
2650.00000  2700.00000  5.744998692333e-03
2700.00000  2750.00000  5.708998700528e-03
2750.00000  2800.00000  5.404498769837e-03
2800.00000  2850.00000  5.175748821905e-03
2850.00000  2900.00000  4.986748864925e-03
2900.00000  2950.00000  4.781998911530e-03
2950.00000  3000.00000  4.604248951989e-03
3000.00000  3050.00000  4.444498988351e-03
3050.00000  3100.00000  4.319999016689e-03
3100.00000  3150.00000  4.143749056807e-03
3150.00000  3200.00000  3.982499093510e-03
3200.00000  3250.00000  3.758999144383e-03
3250.00000  3300.00000  3.643499170673e-03
3300.00000  3350.00000  3.456749213181e-03
3350.00000  3400.00000  3.346499238276e-03
3400.00000  3450.00000  3.199499271736e-03
3450.00000  3500.00000  3.144749284198e-03
3500.00000  3550.00000  3.116999290514e-03
3550.00000  3600.00000  2.878499344801e-03
3600.00000  3650.00000  2.881499344118e-03
3650.00000  3700.00000  2.800499362555e-03
3700.00000  3750.00000  2.639999399088e-03
3750.00000  3800.00000  2.558249417696e-03
3800.00000  3850.00000  2.494499432206e-03
3850.00000  3900.00000  2.481749435109e-03
3900.00000  3950.00000  2.309999474202e-03
3950.00000  4000.00000  2.231249492127e-03
4000.00000  4050.00000  2.214749495883e-03
4050.00000  4100.00000  2.150249510564e-03
4100.00000  4150.00000  2.081249526270e-03
4150.00000  4200.00000  2.036249536512e-03
4200.00000  4250.00000  1.969499551706e-03
4250.00000  4300.00000  1.967999552047e-03
4300.00000  4350.00000  1.866749575094e-03
4350.00000  4400.00000  1.783499594043e-03
4400.00000  4450.00000  1.766999597799e-03
4450.00000  4500.00000  1.706999611456e-03
4500.00000  4550.00000  1.619999631259e-03
4550.00000  4600.00000  1.675499618626e-03
4600.00000  4650.00000  1.547249647818e-03
4650.00000  4700.00000  1.566749643379e-03
4700.00000  4750.00000  1.466999666084e-03
4750.00000  4800.00000  1.498499658914e-03
4800.00000  4850.00000  1.401749680936e-03
4850.00000  4900.00000  1.380749685716e-03
4900.00000  4950.00000  1.337249695618e-03
4950.00000  5000.00000  1.292999705690e-03
5000.00000  5050.00000  1.220249722249e-03
5050.00000  5100.00000  1.277249709275e-03
5100.00000  5150.00000  1.271999710470e-03
5150.00000  5200.00000  1.203749726005e-03
5200.00000  5250.00000  1.195499727882e-03
5250.00000  5300.00000  1.114499746320e-03
5300.00000  5350.00000  1.092749751270e-03
5350.00000  5400.00000  1.067999756904e-03
5400.00000  5450.00000  1.085249752977e-03
5450.00000  5500.00000  1.051499760659e-03
5500.00000  5550.00000  1.055249759806e-03
5550.00000  5600.00000  1.019249768000e-03
5600.00000  5650.00000  9.434997852422e-04
5650.00000  5700.00000  9.457497847301e-04
5700.00000  5750.00000  9.494997838765e-04
5750.00000  5800.00000  9.322497878029e-04
5800.00000  5850.00000  8.992497953143e-04
5850.00000  5900.00000  8.797497997529e-04
5900.00000  5950.00000  8.587498045329e-04
5950.00000  6000.00000  8.572498048743e-04
6000.00000  6050.00000  8.047498168242e-04
6050.00000  6100.00000  8.084998159707e-04
6100.00000  6150.00000  8.227498127271e-04
6150.00000  6200.00000  7.979998183607e-04
6200.00000  6250.00000  7.289998340663e-04
6250.00000  6300.00000  7.259998347492e-04
6300.00000  6350.00000  7.199998361149e-04
6350.00000  6400.00000  8.452498076057e-04
6400.00000  6450.00000  7.379998320178e-04
6450.00000  6500.00000  7.267498345785e-04
6500.00000  6550.00000  6.952498417484e-04
6550.00000  6600.00000  7.034998398706e-04
6600.00000  6650.00000  6.959998415777e-04
6650.00000  6700.00000  6.644998487477e-04
6700.00000  6750.00000  6.329998559177e-04
6750.00000  6800.00000  6.457498530155e-04
6800.00000  6850.00000  5.699998702576e-04
6850.00000  6900.00000  6.209998586491e-04
6900.00000  6950.00000  6.037498625755e-04
6950.00000  7000.00000  5.654998712819e-04
7000.00000  7050.00000  5.819998675262e-04
7050.00000  7100.00000  5.647498714526e-04
7100.00000  7150.00000  5.549998736719e-04
7150.00000  7200.00000  5.092498840854e-04
7200.00000  7250.00000  5.279998798176e-04
7250.00000  7300.00000  5.287498796469e-04
7300.00000  7350.00000  5.174998822076e-04
7350.00000  7400.00000  5.212498813540e-04
7400.00000  7450.00000  4.987498864754e-04
7450.00000  7500.00000  5.054998849390e-04
7500.00000  7550.00000  4.882498888654e-04
7550.00000  7600.00000  4.679998934747e-04
7600.00000  7650.00000  4.949998873290e-04
7650.00000  7700.00000  4.702498929625e-04
7700.00000  7750.00000  4.484998979132e-04
7750.00000  7800.00000  4.499998975718e-04
7800.00000  7850.00000  4.687498933040e-04
7850.00000  7900.00000  4.462498984254e-04
7900.00000  7950.00000  4.394998999618e-04
7950.00000  8000.00000  3.922499107168e-04
8000.00000  8050.00000  3.944999102046e-04
8050.00000  8100.00000  4.147499055953e-04
8100.00000  8150.00000  3.914999108875e-04
8150.00000  8200.00000  3.907499110582e-04
8200.00000  8250.00000  4.049999078146e-04
8250.00000  8300.00000  3.779999139603e-04
8300.00000  8350.00000  3.772499141310e-04
8350.00000  8400.00000  3.622499175453e-04
8400.00000  8450.00000  3.614999177160e-04
8450.00000  8500.00000  3.914999108875e-04
8500.00000  8550.00000  3.689999160089e-04
8550.00000  8600.00000  3.134999286417e-04
8600.00000  8650.00000  3.112499291538e-04
8650.00000  8700.00000  3.599999180574e-04
8700.00000  8750.00000  3.262499257396e-04
8750.00000  8800.00000  3.262499257396e-04
8800.00000  8850.00000  3.157499281296e-04
8850.00000  8900.00000  3.239999262517e-04
8900.00000  8950.00000  3.299999248860e-04
8950.00000  9000.00000  3.089999296660e-04
9000.00000  9050.00000  2.842499352995e-04
9050.00000  9100.00000  2.999999317145e-04
9100.00000  9150.00000  3.202499271053e-04
9150.00000  9200.00000  2.834999354702e-04
9200.00000  9250.00000  2.827499356410e-04
9250.00000  9300.00000  3.007499315438e-04
9300.00000  9350.00000  3.112499291538e-04
9350.00000  9400.00000  2.534999422988e-04
9400.00000  9450.00000  2.699999385431e-04
9450.00000  9500.00000  2.677499390552e-04
9500.00000  9550.00000  2.872499346167e-04
9550.00000  9600.00000  2.609999405916e-04
9600.00000  9650.00000  2.602499407624e-04
9650.00000  9700.00000  2.804999361531e-04
9700.00000  9750.00000  2.497499431524e-04
9750.00000  9800.00000  2.834999354702e-04
9800.00000  9850.00000  2.497499431524e-04
9850.00000  9900.00000  2.287499479323e-04
9900.00000  9950.00000  2.369999460545e-04
9950.00000  10000.00000  2.384999457131e-04
