10001.00000  11001.00000  1.441912388418e-04
11001.00000  12001.00000  1.133923808449e-04
12001.00000  13001.00000  9.686616435869e-05
13001.00000  14001.00000  8.263108243083e-05
14001.00000  15001.00000  6.963546673944e-05
15001.00000  16001.00000  5.844271102835e-05
16001.00000  17001.00000  5.183222443388e-05
17001.00000  18001.00000  4.743775323188e-05
18001.00000  19001.00000  3.789761916941e-05
19001.00000  20001.00000  3.553136544526e-05
20001.00000  21001.00000  2.922135551418e-05
21001.00000  22001.00000  2.816968719233e-05
22001.00000  23001.00000  2.385033515617e-05
23001.00000  24001.00000  2.125872393448e-05
24001.00000  25001.00000  2.155920059786e-05
25001.00000  26001.00000  1.844175521524e-05
26001.00000  27001.00000  1.585014399355e-05
27001.00000  28001.00000  1.491115442047e-05
28001.00000  29001.00000  1.389704568155e-05
29001.00000  30001.00000  1.141811320862e-05
30001.00000  31001.00000  1.111763654524e-05
31001.00000  32001.00000  1.081715988185e-05
32001.00000  33001.00000  1.044156405262e-05
33001.00000  34001.00000  9.840610725853e-06
34001.00000  35001.00000  8.864061569853e-06
35001.00000  36001.00000  7.549476167544e-06
36001.00000  37001.00000  7.324118670005e-06
37001.00000  38001.00000  5.220782026312e-06
38001.00000  39001.00000  6.385129096928e-06
39001.00000  40001.00000  5.971973684774e-06
40001.00000  41001.00000  5.032984111696e-06
41001.00000  42001.00000  4.582269116619e-06
42001.00000  43001.00000  4.995424528773e-06
43001.00000  44001.00000  4.732507448311e-06
44001.00000  45001.00000  4.657388282465e-06
45001.00000  46001.00000  4.356911619080e-06
46001.00000  47001.00000  3.455481628926e-06
47001.00000  48001.00000  3.230124131387e-06
48001.00000  49001.00000  3.755958292310e-06
49001.00000  50001.00000  2.779409136310e-06
50001.00000  51001.00000  3.117445382618e-06
51001.00000  52001.00000  2.478932472925e-06
52001.00000  53001.00000  2.779409136310e-06
53001.00000  54001.00000  2.591611221694e-06
54001.00000  55001.00000  2.478932472925e-06
55001.00000  56001.00000  2.216015392463e-06
56001.00000  57001.00000  1.577502482770e-06
57001.00000  58001.00000  1.840419563232e-06
58001.00000  59001.00000  1.990657894925e-06
59001.00000  60001.00000  1.539942899847e-06
60001.00000  61001.00000  1.840419563232e-06
61001.00000  62001.00000  1.765300397386e-06
62001.00000  63001.00000  1.539942899847e-06
63001.00000  64001.00000  1.577502482770e-06
64001.00000  65001.00000  1.389704568155e-06
65001.00000  66001.00000  1.352144985232e-06
66001.00000  67001.00000  1.953098312001e-06
67001.00000  68001.00000  1.014108738924e-06
68001.00000  69001.00000  1.577502482770e-06
69001.00000  70001.00000  1.164347070616e-06
70001.00000  71001.00000  1.314585402309e-06
71001.00000  72001.00000  6.760724926159e-07
72001.00000  73001.00000  9.389895730776e-07
73001.00000  74001.00000  8.638704072314e-07
74001.00000  75001.00000  8.638704072314e-07
75001.00000  76001.00000  8.263108243083e-07
76001.00000  77001.00000  9.389895730776e-07
77001.00000  78001.00000  7.511916584621e-07
78001.00000  79001.00000  9.389895730776e-07
79001.00000  80001.00000  7.136320755390e-07
80001.00000  81001.00000  7.511916584621e-07
81001.00000  82001.00000  6.009533267697e-07
82001.00000  83001.00000  7.136320755390e-07
83001.00000  84001.00000  8.638704072314e-07
84001.00000  85001.00000  5.258341609235e-07
85001.00000  86001.00000  4.131554121542e-07
86001.00000  87001.00000  4.882745780004e-07
87001.00000  88001.00000  6.385129096928e-07
88001.00000  89001.00000  4.507149950773e-07
89001.00000  90001.00000  7.511916584621e-07
90001.00000  91001.00000  4.507149950773e-07
91001.00000  92001.00000  3.755958292310e-07
92001.00000  93001.00000  4.507149950773e-07
93001.00000  94001.00000  6.009533267697e-07
94001.00000  95001.00000  2.253574975386e-07
95001.00000  96001.00000  3.380362463079e-07
96001.00000  97001.00000  2.253574975386e-07
97001.00000  98001.00000  3.004766633848e-07
98001.00000  99001.00000  5.258341609235e-07
99001.00000  100001.00000  4.507149950773e-07
100001.00000  101001.00000  4.131554121542e-07
101001.00000  102001.00000  1.877979146155e-07
102001.00000  103001.00000  3.755958292310e-07
103001.00000  104001.00000  2.629170804617e-07
104001.00000  105001.00000  3.004766633848e-07
105001.00000  106001.00000  1.877979146155e-07
106001.00000  107001.00000  3.004766633848e-07
107001.00000  108001.00000  1.877979146155e-07
108001.00000  109001.00000  1.126787487693e-07
109001.00000  110001.00000  3.380362463079e-07
110001.00000  111001.00000  5.258341609235e-07
111001.00000  112001.00000  2.629170804617e-07
112001.00000  113001.00000  1.126787487693e-07
113001.00000  114001.00000  4.131554121542e-07
114001.00000  115001.00000  3.004766633848e-07
115001.00000  116001.00000  3.755958292310e-07
116001.00000  117001.00000  1.502383316924e-07
117001.00000  118001.00000  1.126787487693e-07
118001.00000  119001.00000  3.755958292310e-07
119001.00000  120001.00000  3.380362463079e-07
120001.00000  121001.00000  1.502383316924e-07
121001.00000  122001.00000  1.877979146155e-07
122001.00000  123001.00000  1.877979146155e-07
123001.00000  124001.00000  1.126787487693e-07
124001.00000  125001.00000  2.253574975386e-07
125001.00000  126001.00000  1.502383316924e-07
126001.00000  127001.00000  2.629170804617e-07
127001.00000  128001.00000  2.629170804617e-07
128001.00000  129001.00000  1.126787487693e-07
129001.00000  130001.00000  1.126787487693e-07
130001.00000  131001.00000  7.511916584621e-08
131001.00000  132001.00000  1.877979146155e-07
132001.00000  133001.00000  1.126787487693e-07
133001.00000  134001.00000  1.126787487693e-07
134001.00000  135001.00000  2.629170804617e-07
135001.00000  136001.00000  3.755958292310e-08
136001.00000  137001.00000  1.502383316924e-07
137001.00000  138001.00000  1.502383316924e-07
138001.00000  139001.00000  1.502383316924e-07
139001.00000  140001.00000  3.755958292310e-08
140001.00000  141001.00000  7.511916584621e-08
141001.00000  142001.00000  1.502383316924e-07
142001.00000  143001.00000  1.502383316924e-07
143001.00000  144001.00000  7.511916584621e-08
144001.00000  145001.00000  2.253574975386e-07
145001.00000  146001.00000  1.502383316924e-07
146001.00000  147001.00000  0.000000000000e+00
147001.00000  148001.00000  3.755958292310e-08
148001.00000  149001.00000  7.511916584621e-08
149001.00000  150001.00000  7.511916584621e-08
150001.00000  151001.00000  0.000000000000e+00
151001.00000  152001.00000  3.755958292310e-08
152001.00000  153001.00000  1.502383316924e-07
153001.00000  154001.00000  1.502383316924e-07
154001.00000  155001.00000  3.755958292310e-08
155001.00000  156001.00000  3.755958292310e-08
156001.00000  157001.00000  3.755958292310e-08
157001.00000  158001.00000  7.511916584621e-08
158001.00000  159001.00000  7.511916584621e-08
159001.00000  160001.00000  3.755958292310e-08
160001.00000  161001.00000  1.126787487693e-07
161001.00000  162001.00000  1.126787487693e-07
162001.00000  163001.00000  3.755958292310e-08
163001.00000  164001.00000  3.755958292310e-08
164001.00000  165001.00000  7.511916584621e-08
165001.00000  166001.00000  3.755958292310e-08
166001.00000  167001.00000  0.000000000000e+00
167001.00000  168001.00000  7.511916584621e-08
168001.00000  169001.00000  7.511916584621e-08
169001.00000  170001.00000  7.511916584621e-08
170001.00000  171001.00000  3.755958292310e-08
171001.00000  172001.00000  3.755958292310e-08
172001.00000  173001.00000  7.511916584621e-08
173001.00000  174001.00000  1.126787487693e-07
174001.00000  175001.00000  3.755958292310e-08
175001.00000  176001.00000  1.126787487693e-07
176001.00000  177001.00000  0.000000000000e+00
177001.00000  178001.00000  1.126787487693e-07
178001.00000  179001.00000  0.000000000000e+00
179001.00000  180001.00000  0.000000000000e+00
180001.00000  181001.00000  0.000000000000e+00
181001.00000  182001.00000  3.755958292310e-08
182001.00000  183001.00000  3.755958292310e-08
183001.00000  184001.00000  3.755958292310e-08
184001.00000  185001.00000  7.511916584621e-08
185001.00000  186001.00000  1.126787487693e-07
186001.00000  187001.00000  3.755958292310e-08
187001.00000  188001.00000  3.755958292310e-08
188001.00000  189001.00000  0.000000000000e+00
189001.00000  190001.00000  0.000000000000e+00
190001.00000  191001.00000  7.511916584621e-08
191001.00000  192001.00000  3.755958292310e-08
192001.00000  193001.00000  1.126787487693e-07
193001.00000  194001.00000  0.000000000000e+00
194001.00000  195001.00000  3.755958292310e-08
195001.00000  196001.00000  0.000000000000e+00
196001.00000  197001.00000  0.000000000000e+00
197001.00000  198001.00000  0.000000000000e+00
198001.00000  199001.00000  3.755958292310e-08
