10001.00000  11001.00000  5.474536703465e-04
11001.00000  12001.00000  4.454640590055e-04
12001.00000  13001.00000  3.578503418269e-04
13001.00000  14001.00000  2.947246963317e-04
14001.00000  15001.00000  2.502763936459e-04
15001.00000  16001.00000  2.128462440158e-04
16001.00000  17001.00000  1.814909472994e-04
17001.00000  18001.00000  1.559463794570e-04
18001.00000  19001.00000  1.392311009428e-04
19001.00000  20001.00000  1.188558178780e-04
20001.00000  21001.00000  1.075362161753e-04
21001.00000  22001.00000  9.508465430238e-05
22001.00000  23001.00000  8.402917663944e-05
23001.00000  24001.00000  7.504895928866e-05
24001.00000  25001.00000  6.693657806842e-05
25001.00000  26001.00000  6.150316925114e-05
26001.00000  27001.00000  5.501326427495e-05
27001.00000  28001.00000  4.769325517389e-05
28001.00000  29001.00000  4.358046655526e-05
29001.00000  30001.00000  4.188252629986e-05
30001.00000  31001.00000  3.735468561879e-05
31001.00000  32001.00000  3.260045290367e-05
32001.00000  33001.00000  3.301550496610e-05
33001.00000  34001.00000  2.977055247801e-05
34001.00000  35001.00000  2.494085575154e-05
35001.00000  36001.00000  2.671426001829e-05
36001.00000  37001.00000  2.350703953587e-05
37001.00000  38001.00000  2.018662303642e-05
38001.00000  39001.00000  1.999796300804e-05
39001.00000  40001.00000  1.901693086048e-05
40001.00000  41001.00000  1.863961080372e-05
41001.00000  42001.00000  1.614929842913e-05
42001.00000  43001.00000  1.611156642346e-05
43001.00000  44001.00000  1.407403811698e-05
44001.00000  45001.00000  1.430043015103e-05
45001.00000  46001.00000  1.448909017941e-05
46001.00000  47001.00000  1.241382986725e-05
47001.00000  48001.00000  1.271568591266e-05
48001.00000  49001.00000  1.101774565726e-05
49001.00000  50001.00000  1.033856955510e-05
50001.00000  51001.00000  1.101774565726e-05
51001.00000  52001.00000  1.037630156078e-05
52001.00000  53001.00000  8.112381220242e-06
53001.00000  54001.00000  7.735061163487e-06
54001.00000  55001.00000  9.093413367807e-06
55001.00000  56001.00000  8.074649214567e-06
56001.00000  57001.00000  7.885989186189e-06
57001.00000  58001.00000  6.791761021598e-06
58001.00000  59001.00000  6.112584919438e-06
59001.00000  60001.00000  6.263512942141e-06
60001.00000  61001.00000  5.395676811603e-06
61001.00000  62001.00000  5.999388902412e-06
62001.00000  63001.00000  5.357944805928e-06
63001.00000  64001.00000  4.301448647012e-06
64001.00000  65001.00000  4.490108675390e-06
65001.00000  66001.00000  5.093820766199e-06
66001.00000  67001.00000  5.093820766199e-06
67001.00000  68001.00000  3.735468561879e-06
68001.00000  69001.00000  4.565572686741e-06
69001.00000  70001.00000  3.886396584581e-06
70001.00000  71001.00000  3.622272544852e-06
71001.00000  72001.00000  3.244952488097e-06
72001.00000  73001.00000  3.207220482421e-06
73001.00000  74001.00000  3.131756471070e-06
74001.00000  75001.00000  3.169488476746e-06
75001.00000  76001.00000  3.395880510799e-06
76001.00000  77001.00000  3.471344522150e-06
77001.00000  78001.00000  3.094024465395e-06
78001.00000  79001.00000  1.886600283777e-06
79001.00000  80001.00000  2.263920340533e-06
80001.00000  81001.00000  2.226188334857e-06
81001.00000  82001.00000  2.867632431342e-06
82001.00000  83001.00000  2.565776385937e-06
83001.00000  84001.00000  2.112992317831e-06
84001.00000  85001.00000  1.924332289453e-06
85001.00000  86001.00000  2.490312374586e-06
86001.00000  87001.00000  2.565776385937e-06
87001.00000  88001.00000  2.452580368910e-06
88001.00000  89001.00000  1.660208249724e-06
89001.00000  90001.00000  2.075260312155e-06
90001.00000  91001.00000  1.697940255400e-06
91001.00000  92001.00000  1.811136272426e-06
92001.00000  93001.00000  1.320620198644e-06
93001.00000  94001.00000  1.584744238373e-06
94001.00000  95001.00000  1.697940255400e-06
95001.00000  96001.00000  1.697940255400e-06
96001.00000  97001.00000  1.848868278102e-06
97001.00000  98001.00000  1.433816215671e-06
98001.00000  99001.00000  9.810321475642e-07
99001.00000  100001.00000  1.547012232697e-06
100001.00000  101001.00000  1.320620198644e-06
101001.00000  102001.00000  1.094228164591e-06
102001.00000  103001.00000  1.018764153240e-06
103001.00000  104001.00000  1.358352204320e-06
104001.00000  105001.00000  1.018764153240e-06
105001.00000  106001.00000  1.094228164591e-06
106001.00000  107001.00000  7.923721191865e-07
107001.00000  108001.00000  1.169692175942e-06
108001.00000  109001.00000  9.810321475642e-07
109001.00000  110001.00000  1.169692175942e-06
110001.00000  111001.00000  1.056496158915e-06
111001.00000  112001.00000  7.169081078354e-07
112001.00000  113001.00000  9.810321475642e-07
113001.00000  114001.00000  7.923721191865e-07
114001.00000  115001.00000  1.018764153240e-06
115001.00000  116001.00000  4.905160737821e-07
116001.00000  117001.00000  8.678361305376e-07
117001.00000  118001.00000  7.546401135109e-07
118001.00000  119001.00000  7.546401135109e-07
119001.00000  120001.00000  7.923721191865e-07
120001.00000  121001.00000  5.282480794576e-07
121001.00000  122001.00000  1.018764153240e-06
122001.00000  123001.00000  6.037120908087e-07
123001.00000  124001.00000  6.414440964843e-07
124001.00000  125001.00000  9.055681362131e-07
125001.00000  126001.00000  5.659800851332e-07
126001.00000  127001.00000  4.527840681066e-07
127001.00000  128001.00000  3.773200567555e-07
128001.00000  129001.00000  5.659800851332e-07
129001.00000  130001.00000  4.527840681066e-07
130001.00000  131001.00000  6.791761021598e-07
131001.00000  132001.00000  5.282480794576e-07
132001.00000  133001.00000  4.527840681066e-07
133001.00000  134001.00000  4.150520624310e-07
134001.00000  135001.00000  4.527840681066e-07
135001.00000  136001.00000  3.773200567555e-07
136001.00000  137001.00000  7.546401135109e-07
137001.00000  138001.00000  5.282480794576e-07
138001.00000  139001.00000  4.150520624310e-07
139001.00000  140001.00000  3.773200567555e-07
140001.00000  141001.00000  3.395880510799e-07
141001.00000  142001.00000  5.282480794576e-07
142001.00000  143001.00000  3.395880510799e-07
143001.00000  144001.00000  5.659800851332e-07
144001.00000  145001.00000  4.527840681066e-07
145001.00000  146001.00000  3.395880510799e-07
146001.00000  147001.00000  5.282480794576e-07
147001.00000  148001.00000  3.773200567555e-07
148001.00000  149001.00000  3.773200567555e-07
149001.00000  150001.00000  2.263920340533e-07
150001.00000  151001.00000  2.263920340533e-07
151001.00000  152001.00000  1.509280227022e-07
152001.00000  153001.00000  4.150520624310e-07
153001.00000  154001.00000  3.773200567555e-07
154001.00000  155001.00000  3.773200567555e-07
155001.00000  156001.00000  2.263920340533e-07
156001.00000  157001.00000  3.395880510799e-07
157001.00000  158001.00000  2.641240397288e-07
158001.00000  159001.00000  1.886600283777e-07
159001.00000  160001.00000  2.641240397288e-07
160001.00000  161001.00000  2.263920340533e-07
161001.00000  162001.00000  1.509280227022e-07
162001.00000  163001.00000  1.131960170266e-07
163001.00000  164001.00000  3.395880510799e-07
164001.00000  165001.00000  3.018560454044e-07
165001.00000  166001.00000  1.131960170266e-07
166001.00000  167001.00000  2.641240397288e-07
167001.00000  168001.00000  1.509280227022e-07
168001.00000  169001.00000  3.018560454044e-07
169001.00000  170001.00000  3.773200567555e-07
170001.00000  171001.00000  1.509280227022e-07
171001.00000  172001.00000  2.641240397288e-07
172001.00000  173001.00000  1.509280227022e-07
173001.00000  174001.00000  4.527840681066e-07
174001.00000  175001.00000  2.263920340533e-07
175001.00000  176001.00000  1.131960170266e-07
176001.00000  177001.00000  2.641240397288e-07
177001.00000  178001.00000  1.886600283777e-07
178001.00000  179001.00000  1.886600283777e-07
179001.00000  180001.00000  3.773200567555e-08
180001.00000  181001.00000  3.773200567555e-08
181001.00000  182001.00000  3.773200567555e-08
182001.00000  183001.00000  1.886600283777e-07
183001.00000  184001.00000  3.018560454044e-07
184001.00000  185001.00000  1.886600283777e-07
185001.00000  186001.00000  1.886600283777e-07
186001.00000  187001.00000  1.886600283777e-07
187001.00000  188001.00000  2.641240397288e-07
188001.00000  189001.00000  2.263920340533e-07
189001.00000  190001.00000  3.773200567555e-08
190001.00000  191001.00000  2.263920340533e-07
191001.00000  192001.00000  1.131960170266e-07
192001.00000  193001.00000  1.509280227022e-07
193001.00000  194001.00000  7.546401135109e-08
194001.00000  195001.00000  1.886600283777e-07
195001.00000  196001.00000  1.509280227022e-07
196001.00000  197001.00000  3.773200567555e-08
197001.00000  198001.00000  7.546401135109e-08
198001.00000  199001.00000  1.131960170266e-07
