300.00000  350.00000  7.721710138282e-07
350.00000  400.00000  0.000000000000e+00
400.00000  450.00000  0.000000000000e+00
450.00000  500.00000  0.000000000000e+00
500.00000  550.00000  5.791282603711e-06
550.00000  600.00000  7.721710138282e-07
600.00000  650.00000  1.158256520742e-06
650.00000  700.00000  0.000000000000e+00
700.00000  750.00000  1.544342027656e-06
750.00000  800.00000  3.860855069141e-07
800.00000  850.00000  6.949539124453e-06
850.00000  900.00000  3.860855069141e-07
900.00000  950.00000  3.860855069141e-07
950.00000  1000.00000  3.860855069141e-07
1000.00000  1050.00000  3.860855069141e-07
1050.00000  1100.00000  7.721710138282e-07
1100.00000  1150.00000  1.158256520742e-06
1150.00000  1200.00000  1.930427534570e-06
1200.00000  1250.00000  7.721710138282e-07
1250.00000  1300.00000  4.246940576055e-06
1300.00000  1350.00000  7.721710138282e-07
1350.00000  1400.00000  1.544342027656e-06
1400.00000  1450.00000  0.000000000000e+00
1450.00000  1500.00000  3.088684055313e-06
1500.00000  1550.00000  1.158256520742e-06
1550.00000  1600.00000  1.158256520742e-06
1600.00000  1650.00000  1.930427534570e-06
1650.00000  1700.00000  2.316513041484e-06
1700.00000  1750.00000  2.007644635953e-05
1750.00000  1800.00000  7.721710138282e-07
1800.00000  1850.00000  1.158256520742e-06
1850.00000  1900.00000  2.316513041484e-06
1900.00000  1950.00000  1.544342027656e-06
1950.00000  2000.00000  7.721710138282e-07
2000.00000  2050.00000  2.316513041484e-06
2050.00000  2100.00000  3.088684055313e-06
2100.00000  2150.00000  1.930427534570e-06
2150.00000  2200.00000  4.633026082969e-06
2200.00000  2250.00000  4.633026082969e-06
2250.00000  2300.00000  4.633026082969e-06
2300.00000  2350.00000  2.586772896324e-05
2350.00000  2400.00000  1.544342027656e-06
2400.00000  2450.00000  3.474769562227e-06
2450.00000  2500.00000  3.088684055313e-06
2500.00000  2550.00000  6.563453617539e-06
2550.00000  2600.00000  4.246940576055e-06
2600.00000  2650.00000  4.633026082969e-06
2650.00000  2700.00000  6.563453617539e-06
2700.00000  2750.00000  5.405197096797e-06
2750.00000  2800.00000  3.474769562227e-06
2800.00000  2850.00000  6.177368110625e-06
2850.00000  2900.00000  5.791282603711e-06
2900.00000  2950.00000  1.042430868668e-05
2950.00000  3000.00000  1.737384781113e-05
3000.00000  3050.00000  4.633026082969e-06
3050.00000  3100.00000  4.246940576055e-06
3100.00000  3150.00000  7.721710138282e-06
3150.00000  3200.00000  1.235473622125e-05
3200.00000  3250.00000  1.119647970051e-05
3250.00000  3300.00000  7.335624631368e-06
3300.00000  3350.00000  1.119647970051e-05
3350.00000  3400.00000  1.158256520742e-05
3400.00000  3450.00000  7.335624631368e-06
3450.00000  3500.00000  1.119647970051e-05
3500.00000  3550.00000  1.235473622125e-05
3550.00000  3600.00000  1.505733476965e-05
3600.00000  3650.00000  1.312690723508e-05
3650.00000  3700.00000  2.393730142867e-05
3700.00000  3750.00000  1.235473622125e-05
3750.00000  3800.00000  2.162078838719e-05
3800.00000  3850.00000  2.046253186645e-05
3850.00000  3900.00000  2.162078838719e-05
3900.00000  3950.00000  2.084861737336e-05
3950.00000  4000.00000  2.972858403238e-05
4000.00000  4050.00000  3.938072170524e-05
4050.00000  4100.00000  3.243118258078e-05
4100.00000  4150.00000  3.320335359461e-05
4150.00000  4200.00000  3.513378112918e-05
4200.00000  4250.00000  3.783637967758e-05
4250.00000  4300.00000  4.208332025364e-05
4300.00000  4350.00000  4.787460285735e-05
4350.00000  4400.00000  4.980503039192e-05
4400.00000  4450.00000  5.096328691266e-05
4450.00000  4500.00000  5.521022748871e-05
4500.00000  4550.00000  6.370410864082e-05
4550.00000  4600.00000  5.752674053020e-05
4600.00000  4650.00000  6.486236516157e-05
4650.00000  4700.00000  6.949539124453e-05
4700.00000  4750.00000  7.026756225836e-05
4750.00000  4800.00000  8.262229847961e-05
4800.00000  4850.00000  7.335624631368e-05
4850.00000  4900.00000  8.841358108333e-05
4900.00000  4950.00000  9.343269267321e-05
4950.00000  5000.00000  8.493881152110e-05
5000.00000  5050.00000  9.652137672852e-05
5050.00000  5100.00000  1.026987448391e-04
5100.00000  5150.00000  8.802749557641e-05
5150.00000  5200.00000  1.057874288945e-04
5200.00000  5250.00000  1.077178564290e-04
5250.00000  5300.00000  1.154395665673e-04
5300.00000  5350.00000  1.081039419359e-04
5350.00000  5400.00000  1.119647970051e-04
5400.00000  5450.00000  1.185282506226e-04
5450.00000  5500.00000  1.285664738024e-04
5500.00000  5550.00000  1.440098940790e-04
5550.00000  5600.00000  1.366742694476e-04
5600.00000  5650.00000  1.324273288715e-04
5650.00000  5700.00000  1.436238085720e-04
5700.00000  5750.00000  1.285664738024e-04
5750.00000  5800.00000  1.463264071204e-04
5800.00000  5850.00000  1.436238085720e-04
5850.00000  5900.00000  1.409212100236e-04
5900.00000  5950.00000  1.640863404385e-04
5950.00000  6000.00000  1.482568346550e-04
6000.00000  6050.00000  1.648585114523e-04
6050.00000  6100.00000  1.567507158071e-04
6100.00000  6150.00000  1.424655520513e-04
6150.00000  6200.00000  1.536620317518e-04
6200.00000  6250.00000  1.413072955306e-04
6250.00000  6300.00000  1.625419984108e-04
6300.00000  6350.00000  1.567507158071e-04
6350.00000  6400.00000  4.602139242416e-04
6400.00000  6450.00000  1.467124926274e-04
6450.00000  6500.00000  1.582950578348e-04
6500.00000  6550.00000  1.594533143555e-04
6550.00000  6600.00000  1.633141694247e-04
6600.00000  6650.00000  1.482568346550e-04
6650.00000  6700.00000  1.598393998624e-04
6700.00000  6750.00000  1.528898607380e-04
6750.00000  6800.00000  1.416933810375e-04
6800.00000  6850.00000  1.579089723279e-04
6850.00000  6900.00000  1.501872621896e-04
6900.00000  6950.00000  1.598393998624e-04
6950.00000  7000.00000  1.463264071204e-04
7000.00000  7050.00000  1.463264071204e-04
7050.00000  7100.00000  1.860932143326e-04
7100.00000  7150.00000  7.258407529985e-05
7150.00000  7200.00000  7.103973327219e-05
7200.00000  7250.00000  7.219798979293e-05
7250.00000  7300.00000  6.409019414774e-05
7300.00000  7350.00000  6.409019414774e-05
7350.00000  7400.00000  6.602062168231e-05
7400.00000  7450.00000  6.949539124453e-05
7450.00000  7500.00000  8.107795645196e-05
7500.00000  7550.00000  7.219798979293e-05
7550.00000  7600.00000  6.138759559934e-05
7600.00000  7650.00000  6.447627965465e-05
7650.00000  7700.00000  6.756496370996e-05
7700.00000  7750.00000  7.181190428602e-05
7750.00000  7800.00000  7.490058834133e-05
7800.00000  7850.00000  7.528667384825e-05
7850.00000  7900.00000  6.293193762700e-05
7900.00000  7950.00000  6.910930573762e-05
7950.00000  8000.00000  7.528667384825e-05
8000.00000  8050.00000  6.563453617539e-05
8050.00000  8100.00000  6.640670718922e-05
8100.00000  8150.00000  6.409019414774e-05
8150.00000  8200.00000  7.644493036899e-05
8200.00000  8250.00000  7.567275935516e-05
8250.00000  8300.00000  6.795104921688e-05
8300.00000  8350.00000  7.451450283442e-05
8350.00000  8400.00000  7.258407529985e-05
8400.00000  8450.00000  6.602062168231e-05
8450.00000  8500.00000  7.837535790356e-05
8500.00000  8550.00000  6.833713472379e-05
8550.00000  8600.00000  6.679279269614e-05
8600.00000  8650.00000  6.524845066848e-05
8650.00000  8700.00000  6.833713472379e-05
8700.00000  8750.00000  6.563453617539e-05
8750.00000  8800.00000  6.795104921688e-05
8800.00000  8850.00000  7.065364776528e-05
8850.00000  8900.00000  7.026756225836e-05
8900.00000  8950.00000  6.795104921688e-05
8950.00000  9000.00000  7.605884486207e-05
9000.00000  9050.00000  6.254585212008e-05
9050.00000  9100.00000  6.640670718922e-05
9100.00000  9150.00000  6.254585212008e-05
9150.00000  9200.00000  6.833713472379e-05
9200.00000  9250.00000  6.409019414774e-05
9250.00000  9300.00000  6.370410864082e-05
9300.00000  9350.00000  6.370410864082e-05
9350.00000  9400.00000  6.563453617539e-05
9400.00000  9450.00000  6.679279269614e-05
9450.00000  9500.00000  6.100151009243e-05
9500.00000  9550.00000  6.486236516157e-05
9550.00000  9600.00000  6.293193762700e-05
9600.00000  9650.00000  6.602062168231e-05
9650.00000  9700.00000  6.022933907860e-05
9700.00000  9750.00000  6.949539124453e-05
9750.00000  9800.00000  6.717887820305e-05
9800.00000  9850.00000  5.636848400946e-05
9850.00000  9900.00000  5.945716806477e-05
9900.00000  9950.00000  5.984325357168e-05
9950.00000  10000.00000  5.907108255785e-05
