10001.00000  11001.00000  4.456658419297e-05
11001.00000  12001.00000  4.430376524659e-05
12001.00000  13001.00000  4.047411774223e-05
13001.00000  14001.00000  4.051166330599e-05
14001.00000  15001.00000  3.837156617120e-05
15001.00000  16001.00000  3.484228317698e-05
16001.00000  17001.00000  3.146318243783e-05
17001.00000  18001.00000  3.063718003493e-05
18001.00000  19001.00000  2.767108049724e-05
19001.00000  20001.00000  2.568116561752e-05
20001.00000  21001.00000  2.365370517403e-05
21001.00000  22001.00000  2.162624473054e-05
22001.00000  23001.00000  1.967387541459e-05
23001.00000  24001.00000  1.697059482327e-05
24001.00000  25001.00000  1.670777587689e-05
25001.00000  26001.00000  1.524349888993e-05
26001.00000  27001.00000  1.347885739282e-05
27001.00000  28001.00000  1.190194371455e-05
28001.00000  29001.00000  1.216476266093e-05
29001.00000  30001.00000  9.912028834831e-06
30001.00000  31001.00000  9.386390942075e-06
31001.00000  32001.00000  8.447751847867e-06
32001.00000  33001.00000  8.109841773952e-06
33001.00000  34001.00000  7.471567189891e-06
34001.00000  35001.00000  6.945929297135e-06
35001.00000  36001.00000  6.044835766696e-06
36001.00000  37001.00000  7.434021626123e-06
37001.00000  38001.00000  5.331470055098e-06
38001.00000  39001.00000  5.218833363793e-06
39001.00000  40001.00000  4.655649907269e-06
40001.00000  41001.00000  4.430376524659e-06
41001.00000  42001.00000  4.317739833354e-06
42001.00000  43001.00000  3.454191866683e-06
43001.00000  44001.00000  3.979829759440e-06
44001.00000  45001.00000  3.717010813062e-06
45001.00000  46001.00000  2.891008410159e-06
46001.00000  47001.00000  3.266464047842e-06
47001.00000  48001.00000  3.153827356537e-06
48001.00000  49001.00000  3.003645101464e-06
49001.00000  50001.00000  2.478007208708e-06
50001.00000  51001.00000  2.891008410159e-06
51001.00000  52001.00000  2.365370517403e-06
52001.00000  53001.00000  2.027460443488e-06
53001.00000  54001.00000  2.290279389866e-06
54001.00000  55001.00000  2.065006007256e-06
55001.00000  56001.00000  1.652004805805e-06
56001.00000  57001.00000  1.989914879720e-06
57001.00000  58001.00000  1.389185859427e-06
58001.00000  59001.00000  1.351640295659e-06
59001.00000  60001.00000  1.239003604354e-06
60001.00000  61001.00000  1.351640295659e-06
61001.00000  62001.00000  9.761846579757e-07
62001.00000  63001.00000  1.088821349281e-06
63001.00000  64001.00000  1.013730221744e-06
64001.00000  65001.00000  1.201458040586e-06
65001.00000  66001.00000  1.727095933342e-06
66001.00000  67001.00000  1.163912476817e-06
67001.00000  68001.00000  1.088821349281e-06
68001.00000  69001.00000  9.761846579757e-07
69001.00000  70001.00000  8.635479666709e-07
70001.00000  71001.00000  9.761846579757e-07
71001.00000  72001.00000  7.884568391343e-07
72001.00000  73001.00000  8.260024029026e-07
73001.00000  74001.00000  8.635479666709e-07
74001.00000  75001.00000  7.884568391343e-07
75001.00000  76001.00000  6.758201478294e-07
76001.00000  77001.00000  7.884568391343e-07
77001.00000  78001.00000  5.256378927562e-07
78001.00000  79001.00000  6.758201478294e-07
79001.00000  80001.00000  4.880923289879e-07
80001.00000  81001.00000  5.256378927562e-07
81001.00000  82001.00000  7.884568391343e-07
82001.00000  83001.00000  5.256378927562e-07
83001.00000  84001.00000  4.130012014513e-07
84001.00000  85001.00000  3.003645101464e-07
85001.00000  86001.00000  7.509112753660e-07
86001.00000  87001.00000  3.379100739147e-07
87001.00000  88001.00000  4.880923289879e-07
88001.00000  89001.00000  4.130012014513e-07
89001.00000  90001.00000  3.379100739147e-07
90001.00000  91001.00000  3.003645101464e-07
91001.00000  92001.00000  4.130012014513e-07
92001.00000  93001.00000  2.628189463781e-07
93001.00000  94001.00000  4.505467652196e-07
94001.00000  95001.00000  4.880923289879e-07
95001.00000  96001.00000  2.252733826098e-07
96001.00000  97001.00000  4.505467652196e-07
97001.00000  98001.00000  3.003645101464e-07
98001.00000  99001.00000  3.003645101464e-07
99001.00000  100001.00000  7.509112753660e-08
100001.00000  101001.00000  3.379100739147e-07
101001.00000  102001.00000  1.877278188415e-07
102001.00000  103001.00000  1.126366913049e-07
103001.00000  104001.00000  2.628189463781e-07
104001.00000  105001.00000  3.379100739147e-07
105001.00000  106001.00000  1.877278188415e-07
106001.00000  107001.00000  1.501822550732e-07
107001.00000  108001.00000  3.379100739147e-07
108001.00000  109001.00000  3.754556376830e-07
109001.00000  110001.00000  1.501822550732e-07
110001.00000  111001.00000  2.252733826098e-07
111001.00000  112001.00000  2.252733826098e-07
112001.00000  113001.00000  1.126366913049e-07
113001.00000  114001.00000  1.877278188415e-07
114001.00000  115001.00000  1.877278188415e-07
115001.00000  116001.00000  1.877278188415e-07
116001.00000  117001.00000  1.126366913049e-07
117001.00000  118001.00000  2.252733826098e-07
118001.00000  119001.00000  7.509112753660e-08
119001.00000  120001.00000  1.877278188415e-07
120001.00000  121001.00000  7.509112753660e-08
121001.00000  122001.00000  7.509112753660e-08
122001.00000  123001.00000  1.126366913049e-07
123001.00000  124001.00000  1.126366913049e-07
124001.00000  125001.00000  1.501822550732e-07
125001.00000  126001.00000  1.501822550732e-07
126001.00000  127001.00000  1.501822550732e-07
127001.00000  128001.00000  1.126366913049e-07
128001.00000  129001.00000  1.501822550732e-07
129001.00000  130001.00000  1.126366913049e-07
130001.00000  131001.00000  0.000000000000e+00
131001.00000  132001.00000  1.501822550732e-07
132001.00000  133001.00000  3.754556376830e-08
133001.00000  134001.00000  7.509112753660e-08
134001.00000  135001.00000  1.126366913049e-07
135001.00000  136001.00000  0.000000000000e+00
136001.00000  137001.00000  1.877278188415e-07
137001.00000  138001.00000  1.126366913049e-07
138001.00000  139001.00000  1.126366913049e-07
139001.00000  140001.00000  1.126366913049e-07
140001.00000  141001.00000  1.501822550732e-07
141001.00000  142001.00000  7.509112753660e-08
142001.00000  143001.00000  0.000000000000e+00
143001.00000  144001.00000  7.509112753660e-08
144001.00000  145001.00000  3.754556376830e-08
145001.00000  146001.00000  1.126366913049e-07
146001.00000  147001.00000  3.754556376830e-08
147001.00000  148001.00000  3.754556376830e-08
148001.00000  149001.00000  1.877278188415e-07
149001.00000  150001.00000  3.754556376830e-08
150001.00000  151001.00000  3.754556376830e-08
151001.00000  152001.00000  1.877278188415e-07
152001.00000  153001.00000  0.000000000000e+00
153001.00000  154001.00000  3.754556376830e-08
154001.00000  155001.00000  3.754556376830e-08
155001.00000  156001.00000  3.754556376830e-08
156001.00000  157001.00000  0.000000000000e+00
157001.00000  158001.00000  3.754556376830e-08
158001.00000  159001.00000  3.754556376830e-08
159001.00000  160001.00000  0.000000000000e+00
160001.00000  161001.00000  7.509112753660e-08
161001.00000  162001.00000  3.754556376830e-08
162001.00000  163001.00000  3.754556376830e-08
163001.00000  164001.00000  1.126366913049e-07
164001.00000  165001.00000  3.754556376830e-08
165001.00000  166001.00000  3.754556376830e-08
166001.00000  167001.00000  0.000000000000e+00
167001.00000  168001.00000  3.754556376830e-08
168001.00000  169001.00000  3.754556376830e-08
169001.00000  170001.00000  0.000000000000e+00
170001.00000  171001.00000  0.000000000000e+00
171001.00000  172001.00000  7.509112753660e-08
172001.00000  173001.00000  7.509112753660e-08
173001.00000  174001.00000  7.509112753660e-08
174001.00000  175001.00000  7.509112753660e-08
175001.00000  176001.00000  7.509112753660e-08
176001.00000  177001.00000  3.754556376830e-08
177001.00000  178001.00000  3.754556376830e-08
178001.00000  179001.00000  3.754556376830e-08
179001.00000  180001.00000  0.000000000000e+00
180001.00000  181001.00000  3.754556376830e-08
181001.00000  182001.00000  7.509112753660e-08
182001.00000  183001.00000  0.000000000000e+00
183001.00000  184001.00000  3.754556376830e-08
184001.00000  185001.00000  3.754556376830e-08
185001.00000  186001.00000  0.000000000000e+00
186001.00000  187001.00000  3.754556376830e-08
187001.00000  188001.00000  3.754556376830e-08
188001.00000  189001.00000  0.000000000000e+00
189001.00000  190001.00000  0.000000000000e+00
190001.00000  191001.00000  0.000000000000e+00
191001.00000  192001.00000  0.000000000000e+00
192001.00000  193001.00000  0.000000000000e+00
193001.00000  194001.00000  0.000000000000e+00
194001.00000  195001.00000  7.509112753660e-08
195001.00000  196001.00000  3.754556376830e-08
196001.00000  197001.00000  7.509112753660e-08
197001.00000  198001.00000  0.000000000000e+00
198001.00000  199001.00000  0.000000000000e+00
