300.00000  350.00000  2.210291689877e+00
350.00000  400.00000  1.564866378934e+00
400.00000  450.00000  1.156615139847e+00
450.00000  500.00000  8.836232216529e-01
500.00000  550.00000  6.949216143370e-01
550.00000  600.00000  5.576093614327e-01
600.00000  650.00000  4.568377971065e-01
650.00000  700.00000  3.785253840495e-01
700.00000  750.00000  3.195600724920e-01
750.00000  800.00000  2.724492235526e-01
800.00000  850.00000  2.347308200473e-01
850.00000  900.00000  2.031674595020e-01
900.00000  950.00000  1.778522181763e-01
950.00000  1000.00000  1.568800352123e-01
1000.00000  1050.00000  1.390731956828e-01
1050.00000  1100.00000  1.235564825035e-01
1100.00000  1150.00000  1.105580826328e-01
1150.00000  1200.00000  9.980927590253e-02
1200.00000  1250.00000  9.006028834577e-02
1250.00000  1300.00000  8.194839209339e-02
1300.00000  1350.00000  7.414424798902e-02
1350.00000  1400.00000  6.882313828854e-02
1400.00000  1450.00000  6.259303382895e-02
1450.00000  1500.00000  5.778234232516e-02
1500.00000  1550.00000  5.310225783052e-02
1550.00000  1600.00000  4.950080708388e-02
1600.00000  1650.00000  4.571995935341e-02
1650.00000  1700.00000  4.227163406578e-02
1700.00000  1750.00000  3.983663902158e-02
1750.00000  1800.00000  3.669381403696e-02
1800.00000  1850.00000  3.447199365138e-02
1850.00000  1900.00000  3.213532917154e-02
1900.00000  1950.00000  3.048097372227e-02
1950.00000  2000.00000  2.867949773395e-02
2000.00000  2050.00000  2.692756233532e-02
2050.00000  2100.00000  2.544885079491e-02
2100.00000  2150.00000  2.393410973474e-02
2150.00000  2200.00000  2.249818324905e-02
2200.00000  2250.00000  2.159819586989e-02
2250.00000  2300.00000  2.025009133864e-02
2300.00000  2350.00000  1.912416884594e-02
2350.00000  2400.00000  1.833001818109e-02
2400.00000  2450.00000  1.769800035519e-02
2450.00000  2500.00000  1.655031002764e-02
2500.00000  2550.00000  1.569986323815e-02
2550.00000  2600.00000  1.509862062705e-02
2600.00000  2650.00000  1.438703761167e-02
2650.00000  2700.00000  1.378579500057e-02
2700.00000  2750.00000  1.307796506016e-02
2750.00000  2800.00000  1.257655424341e-02
2800.00000  2850.00000  1.189724767282e-02
2850.00000  2900.00000  1.162252258460e-02
2900.00000  2950.00000  1.113462283777e-02
2950.00000  3000.00000  1.058217020135e-02
3000.00000  3050.00000  1.023988976357e-02
3050.00000  3100.00000  9.744483866787e-03
3100.00000  3150.00000  9.387941744100e-03
3150.00000  3200.00000  9.104209275940e-03
3200.00000  3250.00000  8.728151163380e-03
3250.00000  3300.00000  8.387371955590e-03
3300.00000  3350.00000  8.124656707295e-03
3350.00000  3400.00000  7.763610894637e-03
3400.00000  3450.00000  7.461863666594e-03
3450.00000  3500.00000  7.332007272437e-03
3500.00000  3550.00000  7.024255124433e-03
3550.00000  3600.00000  6.727762201356e-03
3600.00000  3650.00000  6.539357837579e-03
3650.00000  3700.00000  6.370469463674e-03
3700.00000  3750.00000  6.101749295417e-03
3750.00000  3800.00000  6.019181645953e-03
3800.00000  3850.00000  5.780486077501e-03
3850.00000  3900.00000  5.592832328719e-03
3900.00000  3950.00000  5.344378765331e-03
3950.00000  4000.00000  5.360892295223e-03
4000.00000  4050.00000  5.149218866597e-03
4050.00000  4100.00000  5.022364932419e-03
4100.00000  4150.00000  4.920281293082e-03
4150.00000  4200.00000  4.639551284903e-03
4200.00000  4250.00000  4.587758850239e-03
4250.00000  4300.00000  4.450396306130e-03
4300.00000  4350.00000  4.263493172342e-03
4350.00000  4400.00000  4.100609718399e-03
4400.00000  4450.00000  4.004530999022e-03
4450.00000  4500.00000  3.831889550142e-03
4500.00000  4550.00000  3.812373560269e-03
4550.00000  4600.00000  3.680265321126e-03
4600.00000  4650.00000  3.635979036413e-03
4650.00000  4700.00000  3.585687831739e-03
4700.00000  4750.00000  3.362755178185e-03
4750.00000  4800.00000  3.422053762801e-03
4800.00000  4850.00000  3.337234268351e-03
4850.00000  4900.00000  3.184859424340e-03
4900.00000  4950.00000  3.088030089968e-03
4950.00000  5000.00000  3.071516560075e-03
5000.00000  5050.00000  2.977689685683e-03
5050.00000  5100.00000  2.940909550922e-03
5100.00000  5150.00000  2.910884951117e-03
5150.00000  5200.00000  2.789285321906e-03
5200.00000  5250.00000  2.714223822393e-03
5250.00000  5300.00000  2.632406787923e-03
5300.00000  5350.00000  2.608387108079e-03
5350.00000  5400.00000  2.558846518401e-03
5400.00000  5450.00000  2.457513494058e-03
5450.00000  5500.00000  2.350175549754e-03
5500.00000  5550.00000  2.322402794934e-03
5550.00000  5600.00000  2.322402794934e-03
5600.00000  5650.00000  2.215815465626e-03
5650.00000  5700.00000  2.173781025898e-03
5700.00000  5750.00000  2.164023030962e-03
5750.00000  5800.00000  2.213563620640e-03
5800.00000  5850.00000  2.028912331838e-03
5850.00000  5900.00000  1.998137117038e-03
5900.00000  5950.00000  2.022907411877e-03
5950.00000  6000.00000  1.891549787729e-03
6000.00000  6050.00000  1.889297942744e-03
6050.00000  6100.00000  1.921574387535e-03
6100.00000  6150.00000  1.859273342939e-03
6150.00000  6200.00000  1.781959998440e-03
6200.00000  6250.00000  1.760942778577e-03
6250.00000  6300.00000  1.754187243620e-03
6300.00000  6350.00000  1.664113444205e-03
6350.00000  6400.00000  1.708399728917e-03
6400.00000  6450.00000  1.610819779550e-03
6450.00000  6500.00000  1.607066704575e-03
6500.00000  6550.00000  1.613071624536e-03
6550.00000  6600.00000  1.605565474585e-03
6600.00000  6650.00000  1.459946165529e-03
6650.00000  6700.00000  1.552271809930e-03
6700.00000  6750.00000  1.493723840310e-03
6750.00000  6800.00000  1.417911725802e-03
6800.00000  6850.00000  1.374376056084e-03
6850.00000  6900.00000  1.425417875753e-03
6900.00000  6950.00000  1.366869906133e-03
6950.00000  7000.00000  1.295561481596e-03
7000.00000  7050.00000  1.288805946639e-03
7050.00000  7100.00000  1.276796106717e-03
7100.00000  7150.00000  1.252025811878e-03
7150.00000  7200.00000  1.262534421810e-03
7200.00000  7250.00000  1.183719847321e-03
7250.00000  7300.00000  1.207739527165e-03
7300.00000  7350.00000  1.198732147224e-03
7350.00000  7400.00000  1.169458162414e-03
7400.00000  7450.00000  1.165705087438e-03
7450.00000  7500.00000  1.105655887828e-03
7500.00000  7550.00000  1.104905272832e-03
7550.00000  7600.00000  1.083137437974e-03
7600.00000  7650.00000  1.084638667964e-03
7650.00000  7700.00000  1.067374523076e-03
7700.00000  7750.00000  9.667921137283e-04
7750.00000  7800.00000  1.035098078285e-03
7800.00000  7850.00000  1.027591928334e-03
7850.00000  7900.00000  9.405205888988e-04
7900.00000  7950.00000  1.029093158324e-03
7950.00000  8000.00000  9.390193589085e-04
8000.00000  8050.00000  9.412712038939e-04
8050.00000  8100.00000  9.375181289182e-04
8100.00000  8150.00000  9.149996790643e-04
8150.00000  8200.00000  9.382687439134e-04
8200.00000  8250.00000  8.744664693273e-04
8250.00000  8300.00000  9.052416841276e-04
8300.00000  8350.00000  8.872269242445e-04
8350.00000  8400.00000  8.046592747801e-04
8400.00000  8450.00000  8.414394095415e-04
8450.00000  8500.00000  8.391875645561e-04
8500.00000  8550.00000  8.151678847119e-04
8550.00000  8600.00000  8.099135797460e-04
8600.00000  8650.00000  8.414394095415e-04
8650.00000  8700.00000  8.016568147996e-04
8700.00000  8750.00000  7.596223750723e-04
8750.00000  8800.00000  7.453606901648e-04
8800.00000  8850.00000  7.408570001940e-04
8850.00000  8900.00000  7.025756354423e-04
8900.00000  8950.00000  7.401063851989e-04
8950.00000  9000.00000  7.010744054521e-04
9000.00000  9050.00000  7.310990052573e-04
9050.00000  9100.00000  6.883139505348e-04
9100.00000  9150.00000  7.205903953255e-04
9150.00000  9200.00000  7.138348603693e-04
9200.00000  9250.00000  6.823090305738e-04
9250.00000  9300.00000  6.335190558903e-04
9300.00000  9350.00000  6.515338157734e-04
9350.00000  9400.00000  6.087487610510e-04
9400.00000  9450.00000  6.185067559877e-04
9450.00000  9500.00000  5.914846161630e-04
9500.00000  9550.00000  6.372721308660e-04
9550.00000  9600.00000  6.019932260948e-04
9600.00000  9650.00000  5.989907661143e-04
9650.00000  9700.00000  6.117512210315e-04
9700.00000  9750.00000  5.907340011679e-04
9750.00000  9800.00000  6.237610609536e-04
9800.00000  9850.00000  5.899833861727e-04
9850.00000  9900.00000  5.757217012652e-04
9900.00000  9950.00000  5.742204712750e-04
9950.00000  10000.00000  5.742204712750e-04
