300.00000  350.00000  1.781202325000e-01
350.00000  400.00000  1.262531530901e-01
400.00000  450.00000  9.347709704186e-02
450.00000  500.00000  7.137354659156e-02
500.00000  550.00000  5.591858897790e-02
550.00000  600.00000  4.489552934891e-02
600.00000  650.00000  3.687977579098e-02
650.00000  700.00000  3.061679238854e-02
700.00000  750.00000  2.558969841064e-02
750.00000  800.00000  2.192528999619e-02
800.00000  850.00000  1.904328834477e-02
850.00000  900.00000  1.657747637282e-02
900.00000  950.00000  1.431752166168e-02
950.00000  1000.00000  1.253193368200e-02
1000.00000  1050.00000  1.128634808213e-02
1050.00000  1100.00000  1.018247581399e-02
1100.00000  1150.00000  9.042056423453e-03
1150.00000  1200.00000  8.017245277216e-03
1200.00000  1250.00000  7.304949320407e-03
1250.00000  1300.00000  6.735858414601e-03
1300.00000  1350.00000  6.015358001744e-03
1350.00000  1400.00000  5.561875340237e-03
1400.00000  1450.00000  5.109884398010e-03
1450.00000  1500.00000  4.672810648596e-03
1500.00000  1550.00000  4.291676372230e-03
1550.00000  1600.00000  3.898608341614e-03
1600.00000  1650.00000  3.826259956472e-03
1650.00000  1700.00000  3.475705925372e-03
1700.00000  1750.00000  3.223605366837e-03
1750.00000  1800.00000  2.951366598004e-03
1800.00000  1850.00000  2.870813756815e-03
1850.00000  1900.00000  2.599320847623e-03
1900.00000  1950.00000  2.560536146310e-03
1950.00000  2000.00000  2.277109482867e-03
2000.00000  2050.00000  2.151805063240e-03
2050.00000  2100.00000  2.137633730068e-03
2100.00000  2150.00000  1.968323591643e-03
2150.00000  2200.00000  1.913129978236e-03
2200.00000  2250.00000  1.722189910233e-03
2250.00000  2300.00000  1.587935174918e-03
2300.00000  2350.00000  1.592410332762e-03
2350.00000  2400.00000  1.491719281276e-03
2400.00000  2450.00000  1.382823773743e-03
2450.00000  2500.00000  1.408183001524e-03
2500.00000  2550.00000  1.270944827647e-03
2550.00000  2600.00000  1.278403424053e-03
2600.00000  2650.00000  1.176220653286e-03
2650.00000  2700.00000  1.124756338082e-03
2700.00000  2750.00000  1.052407952940e-03
2750.00000  2800.00000  1.006910514861e-03
2800.00000  2850.00000  9.658882346260e-04
2850.00000  2900.00000  9.271035333129e-04
2900.00000  2950.00000  9.502251821726e-04
2950.00000  3000.00000  8.323793589519e-04
3000.00000  3050.00000  8.323793589519e-04
3050.00000  3100.00000  8.144787275765e-04
3100.00000  3150.00000  7.287048689032e-04
3150.00000  3200.00000  7.175169742936e-04
3200.00000  3250.00000  7.167711146530e-04
3250.00000  3300.00000  6.861908693868e-04
3300.00000  3350.00000  6.936494657932e-04
3350.00000  3400.00000  6.593399223239e-04
3400.00000  3450.00000  6.257762384952e-04
3450.00000  3500.00000  6.041463089167e-04
3500.00000  3550.00000  5.981794317916e-04
3550.00000  3600.00000  5.787870811350e-04
3600.00000  3650.00000  5.295603448529e-04
3650.00000  3700.00000  5.131514327588e-04
3700.00000  3750.00000  5.079304152744e-04
3750.00000  3800.00000  4.713832928831e-04
3800.00000  3850.00000  4.199189776791e-04
3850.00000  3900.00000  4.810794682114e-04
3900.00000  3950.00000  4.579578193516e-04
3950.00000  4000.00000  4.422947668983e-04
4000.00000  4050.00000  4.154438198353e-04
4050.00000  4100.00000  4.281234337261e-04
4100.00000  4150.00000  3.975431884600e-04
4150.00000  4200.00000  3.505540310998e-04
4200.00000  4250.00000  3.796425570847e-04
4250.00000  4300.00000  3.617419257094e-04
4300.00000  4350.00000  3.565209082249e-04
4350.00000  4400.00000  3.595043467874e-04
4400.00000  4450.00000  3.214655051149e-04
4450.00000  4500.00000  3.214655051149e-04
4500.00000  4550.00000  3.259406629587e-04
4550.00000  4600.00000  2.968521369739e-04
4600.00000  4650.00000  2.975979966145e-04
4650.00000  4700.00000  2.886476809269e-04
4700.00000  4750.00000  2.968521369739e-04
4750.00000  4800.00000  2.849183827237e-04
4800.00000  4850.00000  2.834266634424e-04
4850.00000  4900.00000  2.535922778169e-04
4900.00000  4950.00000  2.588132953013e-04
4950.00000  5000.00000  2.476254006918e-04
5000.00000  5050.00000  2.714929091922e-04
5050.00000  5100.00000  2.558298567388e-04
5100.00000  5150.00000  2.371833657228e-04
5150.00000  5200.00000  2.603050145826e-04
5200.00000  5250.00000  2.118241379412e-04
5250.00000  5300.00000  2.207744536288e-04
5300.00000  5350.00000  2.080948397380e-04
5350.00000  5400.00000  2.185368747069e-04
5400.00000  5450.00000  2.289789096758e-04
5450.00000  5500.00000  2.028738222535e-04
5500.00000  5550.00000  1.991445240503e-04
5550.00000  5600.00000  2.013821029722e-04
5600.00000  5650.00000  2.036196818941e-04
5650.00000  5700.00000  1.887024890814e-04
5700.00000  5750.00000  1.983986644097e-04
5750.00000  5800.00000  1.790063137531e-04
5800.00000  5850.00000  1.730394366280e-04
5850.00000  5900.00000  1.700559980654e-04
5900.00000  5950.00000  1.700559980654e-04
5950.00000  6000.00000  1.782604541124e-04
6000.00000  6050.00000  1.663266998622e-04
6050.00000  6100.00000  1.730394366280e-04
6100.00000  6150.00000  1.745311559093e-04
6150.00000  6200.00000  1.596139630965e-04
6200.00000  6250.00000  1.282878581897e-04
6250.00000  6300.00000  1.514095070495e-04
6300.00000  6350.00000  1.424591913618e-04
6350.00000  6400.00000  2.222661729101e-04
6400.00000  6450.00000  1.170999635801e-04
6450.00000  6500.00000  1.514095070495e-04
6500.00000  6550.00000  1.260502792678e-04
6550.00000  6600.00000  1.446967702837e-04
6600.00000  6650.00000  1.633432612997e-04
6650.00000  6700.00000  1.267961389084e-04
6700.00000  6750.00000  1.297795774710e-04
6750.00000  6800.00000  1.275419985491e-04
6800.00000  6850.00000  1.111330864550e-04
6850.00000  6900.00000  1.096413671738e-04
6900.00000  6950.00000  1.156082442989e-04
6950.00000  7000.00000  1.088955075331e-04
7000.00000  7050.00000  1.126248057363e-04
7050.00000  7100.00000  1.335088756742e-04
7100.00000  7150.00000  1.088955075331e-04
7150.00000  7200.00000  1.021827707674e-04
7200.00000  7250.00000  9.323245507973e-05
7250.00000  7300.00000  1.036744900487e-04
7300.00000  7350.00000  8.950315687654e-05
7350.00000  7400.00000  8.875729723591e-05
7400.00000  7450.00000  9.472417436101e-05
7450.00000  7500.00000  7.831526226698e-05
7500.00000  7550.00000  8.726557795463e-05
7550.00000  7600.00000  8.726557795463e-05
7600.00000  7650.00000  9.770761292356e-05
7650.00000  7700.00000  9.696175328292e-05
7700.00000  7750.00000  9.845347256420e-05
7750.00000  7800.00000  8.577385867335e-05
7800.00000  7850.00000  7.309424478251e-05
7850.00000  7900.00000  7.831526226698e-05
7900.00000  7950.00000  7.533182370442e-05
7950.00000  8000.00000  8.279042011080e-05
8000.00000  8050.00000  7.234838514187e-05
8050.00000  8100.00000  6.712736765741e-05
8100.00000  8150.00000  7.309424478251e-05
8150.00000  8200.00000  7.085666586060e-05
8200.00000  8250.00000  8.055284118889e-05
8250.00000  8300.00000  8.353627975144e-05
8300.00000  8350.00000  7.607768334506e-05
8350.00000  8400.00000  8.129870082953e-05
8400.00000  8450.00000  6.861908693868e-05
8450.00000  8500.00000  7.607768334506e-05
8500.00000  8550.00000  6.638150801677e-05
8550.00000  8600.00000  8.428213939208e-05
8600.00000  8650.00000  6.936494657932e-05
8650.00000  8700.00000  7.234838514187e-05
8700.00000  8750.00000  7.160252550123e-05
8750.00000  8800.00000  7.906112190761e-05
8800.00000  8850.00000  7.831526226698e-05
8850.00000  8900.00000  7.831526226698e-05
8900.00000  8950.00000  7.160252550123e-05
8950.00000  9000.00000  6.339806945422e-05
9000.00000  9050.00000  5.519361340720e-05
9050.00000  9100.00000  6.414392909486e-05
9100.00000  9150.00000  6.265220981358e-05
9150.00000  9200.00000  6.563564837613e-05
9200.00000  9250.00000  5.892291161039e-05
9250.00000  9300.00000  5.295603448529e-05
9300.00000  9350.00000  5.817705196975e-05
9350.00000  9400.00000  6.638150801677e-05
9400.00000  9450.00000  4.848087664146e-05
9450.00000  9500.00000  5.444775376656e-05
9500.00000  9550.00000  5.444775376656e-05
9550.00000  9600.00000  4.773501700082e-05
9600.00000  9650.00000  5.221017484465e-05
9650.00000  9700.00000  5.071845556337e-05
9700.00000  9750.00000  4.848087664146e-05
9750.00000  9800.00000  4.698915736019e-05
9800.00000  9850.00000  5.519361340720e-05
9850.00000  9900.00000  6.041463089167e-05
9900.00000  9950.00000  5.146431520401e-05
9950.00000  10000.00000  4.922673628210e-05
