300.00000  350.00000  3.091762783022e-06
350.00000  400.00000  9.275288349065e-06
400.00000  450.00000  8.309112479371e-06
450.00000  500.00000  9.854993870882e-06
500.00000  550.00000  8.077230270644e-05
550.00000  600.00000  1.236705113209e-05
600.00000  650.00000  2.685968917750e-05
650.00000  700.00000  1.371969734966e-05
700.00000  750.00000  3.188380369991e-05
750.00000  800.00000  2.937174643871e-05
800.00000  850.00000  7.574818818403e-05
850.00000  900.00000  3.439586096112e-05
900.00000  950.00000  3.381615543930e-05
950.00000  1000.00000  3.806732926595e-05
1000.00000  1050.00000  5.236673213743e-05
1050.00000  1100.00000  5.777731700772e-05
1100.00000  1150.00000  6.956466261799e-05
1150.00000  1200.00000  9.507170557792e-05
1200.00000  1250.00000  1.031875828833e-04
1250.00000  1300.00000  1.615446054129e-04
1300.00000  1350.00000  1.327525644960e-04
1350.00000  1400.00000  1.601919591953e-04
1400.00000  1450.00000  1.936216442867e-04
1450.00000  1500.00000  2.258919183345e-04
1500.00000  1550.00000  2.541042537296e-04
1550.00000  1600.00000  2.985483437355e-04
1600.00000  1650.00000  3.225095053040e-04
1650.00000  1700.00000  3.901418161826e-04
1700.00000  1750.00000  4.966143970229e-04
1750.00000  1800.00000  4.653102988448e-04
1800.00000  1850.00000  4.761314685853e-04
1850.00000  1900.00000  4.859864624562e-04
1900.00000  1950.00000  5.254064379398e-04
1950.00000  2000.00000  5.779664052511e-04
2000.00000  2050.00000  6.264684339098e-04
2050.00000  2100.00000  6.622169410885e-04
2100.00000  2150.00000  6.917819227011e-04
2150.00000  2200.00000  7.414433624034e-04
2200.00000  2250.00000  7.530374728397e-04
2250.00000  2300.00000  7.727474605815e-04
2300.00000  2350.00000  8.796065117697e-04
2350.00000  2400.00000  8.156456691959e-04
2400.00000  2450.00000  8.309112479371e-04
2450.00000  2500.00000  7.965153869760e-04
2500.00000  2550.00000  7.957424462802e-04
2550.00000  2600.00000  7.922642131493e-04
2600.00000  2650.00000  8.025056773681e-04
2650.00000  2700.00000  7.907183317578e-04
2700.00000  2750.00000  7.733271661033e-04
2750.00000  2800.00000  7.930371538451e-04
2800.00000  2850.00000  7.797039268433e-04
2850.00000  2900.00000  7.634721722324e-04
2900.00000  2950.00000  7.543901190573e-04
2950.00000  3000.00000  7.802836323651e-04
3000.00000  3050.00000  7.431824789688e-04
3050.00000  3100.00000  7.458877714040e-04
3100.00000  3150.00000  7.205739636180e-04
3150.00000  3200.00000  7.136174973562e-04
3200.00000  3250.00000  6.697531128721e-04
3250.00000  3300.00000  6.602845893491e-04
3300.00000  3350.00000  6.566131210442e-04
3350.00000  3400.00000  6.338113705195e-04
3400.00000  3450.00000  6.517822416958e-04
3450.00000  3500.00000  6.282075504752e-04
3500.00000  3550.00000  6.129419717341e-04
3550.00000  3600.00000  5.905266915571e-04
3600.00000  3650.00000  5.764205238596e-04
3650.00000  3700.00000  5.903334563832e-04
3700.00000  3750.00000  5.534255381609e-04
3750.00000  3800.00000  5.478217181167e-04
3800.00000  3850.00000  5.248267324179e-04
3850.00000  3900.00000  5.184499716780e-04
3900.00000  3950.00000  5.012520411974e-04
3950.00000  4000.00000  4.836676403690e-04
4000.00000  4050.00000  4.680155912799e-04
4050.00000  4100.00000  4.502379552775e-04
4100.00000  4150.00000  4.587403029308e-04
4150.00000  4200.00000  4.206729736649e-04
4200.00000  4250.00000  4.318806137533e-04
4250.00000  4300.00000  4.096585687504e-04
4300.00000  4350.00000  4.071465114892e-04
4350.00000  4400.00000  3.855041720080e-04
4400.00000  4450.00000  3.795138816159e-04
4450.00000  4500.00000  3.810597630074e-04
4500.00000  4550.00000  3.609633049178e-04
4550.00000  4600.00000  3.642483028747e-04
4600.00000  4650.00000  3.542000738299e-04
4650.00000  4700.00000  3.373886136972e-04
4700.00000  4750.00000  3.325577343488e-04
4750.00000  4800.00000  3.327509695227e-04
4800.00000  4850.00000  3.172921556076e-04
4850.00000  4900.00000  3.182583314773e-04
4900.00000  4950.00000  3.132342169549e-04
4950.00000  5000.00000  3.049251044755e-04
5000.00000  5050.00000  2.962295216483e-04
5050.00000  5100.00000  2.815436484289e-04
5100.00000  5150.00000  2.935242292131e-04
5150.00000  5200.00000  2.678239510793e-04
5200.00000  5250.00000  2.608674848175e-04
5250.00000  5300.00000  2.589351330781e-04
5300.00000  5350.00000  2.610607199914e-04
5350.00000  5400.00000  2.595148385999e-04
5400.00000  5450.00000  2.508192557726e-04
5450.00000  5500.00000  2.421236729454e-04
5500.00000  5550.00000  2.461816115981e-04
5550.00000  5600.00000  2.305295625091e-04
5600.00000  5650.00000  2.235730962473e-04
5650.00000  5700.00000  2.179692762030e-04
5700.00000  5750.00000  2.173895706812e-04
5750.00000  5800.00000  2.193219224206e-04
5800.00000  5850.00000  2.096601637237e-04
5850.00000  5900.00000  2.133316320285e-04
5900.00000  5950.00000  1.998051698528e-04
5950.00000  6000.00000  1.907231166777e-04
6000.00000  6050.00000  1.969066422437e-04
6050.00000  6100.00000  1.957472312001e-04
6100.00000  6150.00000  1.831869448940e-04
6150.00000  6200.00000  1.795154765892e-04
6200.00000  6250.00000  1.965201718958e-04
6250.00000  6300.00000  1.972931125916e-04
6300.00000  6350.00000  1.943945849825e-04
6350.00000  6400.00000  9.903302664366e-04
6400.00000  6450.00000  1.729454806753e-04
6450.00000  6500.00000  1.671484254571e-04
6500.00000  6550.00000  1.530422577596e-04
6550.00000  6600.00000  1.598054888474e-04
6600.00000  6650.00000  1.532354929335e-04
6650.00000  6700.00000  1.470519673675e-04
6700.00000  6750.00000  1.542016688032e-04
6750.00000  6800.00000  1.437669694105e-04
6800.00000  6850.00000  1.505302004984e-04
6850.00000  6900.00000  1.542016688032e-04
6900.00000  6950.00000  1.505302004984e-04
6950.00000  7000.00000  1.397090307578e-04
7000.00000  7050.00000  1.364240328008e-04
7050.00000  7100.00000  2.316889735527e-04
7100.00000  7150.00000  1.136222822760e-04
7150.00000  7200.00000  1.056996401446e-04
7200.00000  7250.00000  1.130425767542e-04
7250.00000  7300.00000  1.132358119282e-04
7300.00000  7350.00000  1.095643436233e-04
7350.00000  7400.00000  1.190328671463e-04
7400.00000  7450.00000  1.118831657106e-04
7450.00000  7500.00000  1.366172679748e-04
7500.00000  7550.00000  1.066658160142e-04
7550.00000  7600.00000  9.932287940457e-05
7600.00000  7650.00000  1.010619959700e-04
7650.00000  7700.00000  9.835670353488e-05
7700.00000  7750.00000  9.565141109973e-05
7750.00000  7800.00000  9.255964831671e-05
7800.00000  7850.00000  9.333258901247e-05
7850.00000  7900.00000  9.893640905669e-05
7900.00000  7950.00000  9.217317796883e-05
7950.00000  8000.00000  8.637612275067e-05
8000.00000  8050.00000  9.410552970822e-05
8050.00000  8100.00000  9.004759105551e-05
8100.00000  8150.00000  8.483024135916e-05
8150.00000  8200.00000  9.507170557792e-05
8200.00000  8250.00000  8.811523931612e-05
8250.00000  8300.00000  8.096553788038e-05
8300.00000  8350.00000  8.212494892401e-05
8350.00000  8400.00000  8.772876896824e-05
8400.00000  8450.00000  7.864671579311e-05
8450.00000  8500.00000  8.463700618522e-05
8500.00000  8550.00000  8.405730066340e-05
8550.00000  8600.00000  8.193171375008e-05
8600.00000  8650.00000  7.922642131493e-05
8650.00000  8700.00000  8.212494892401e-05
8700.00000  8750.00000  7.613465853191e-05
8750.00000  8800.00000  7.980612683675e-05
8800.00000  8850.00000  7.169024953132e-05
8850.00000  8900.00000  7.072407366162e-05
8900.00000  8950.00000  7.304289574889e-05
8950.00000  9000.00000  7.594142335797e-05
9000.00000  9050.00000  7.284966057495e-05
9050.00000  9100.00000  7.342936609677e-05
9100.00000  9150.00000  7.420230679252e-05
9150.00000  9200.00000  7.342936609677e-05
9200.00000  9250.00000  7.342936609677e-05
9250.00000  9300.00000  7.053083848768e-05
9300.00000  9350.00000  7.014436813980e-05
9350.00000  9400.00000  6.705260535678e-05
9400.00000  9450.00000  6.280143153013e-05
9450.00000  9500.00000  6.917819227011e-05
9500.00000  9550.00000  6.125555013862e-05
9550.00000  9600.00000  6.318790187801e-05
9600.00000  9650.00000  6.589319431315e-05
9650.00000  9700.00000  6.840525157436e-05
9700.00000  9750.00000  6.550672396527e-05
9750.00000  9800.00000  6.376760739982e-05
9800.00000  9850.00000  6.009613909498e-05
9850.00000  9900.00000  6.357437222588e-05
9900.00000  9950.00000  6.685937018284e-05
9950.00000  10000.00000  6.434731292164e-05
