10001.00000  11001.00000  4.498694842622e-04
11001.00000  12001.00000  3.604299976204e-04
12001.00000  13001.00000  3.016448744500e-04
13001.00000  14001.00000  2.514325817420e-04
14001.00000  15001.00000  2.166588062302e-04
15001.00000  16001.00000  1.810314588542e-04
16001.00000  17001.00000  1.524182454929e-04
17001.00000  18001.00000  1.360519327921e-04
18001.00000  19001.00000  1.157517671518e-04
19001.00000  20001.00000  1.033935310307e-04
20001.00000  21001.00000  8.955082210236e-05
21001.00000  22001.00000  7.889972970974e-05
22001.00000  23001.00000  7.214537843638e-05
23001.00000  24001.00000  6.565080990430e-05
24001.00000  25001.00000  5.600173665663e-05
25001.00000  26001.00000  5.306990286215e-05
26001.00000  27001.00000  4.694645253190e-05
27001.00000  28001.00000  4.464551968054e-05
28001.00000  29001.00000  3.881896391176e-05
29001.00000  30001.00000  3.703759654296e-05
30001.00000  31001.00000  3.347486180536e-05
31001.00000  32001.00000  3.132237623472e-05
32001.00000  33001.00000  2.775964149713e-05
33001.00000  34001.00000  2.590405048796e-05
34001.00000  35001.00000  2.393712401824e-05
35001.00000  36001.00000  2.415979493934e-05
36001.00000  37001.00000  2.126507296504e-05
37001.00000  38001.00000  1.952081741643e-05
38001.00000  39001.00000  1.937237013569e-05
39001.00000  40001.00000  1.692299000360e-05
40001.00000  41001.00000  1.640342452103e-05
41001.00000  42001.00000  1.662609544213e-05
42001.00000  43001.00000  1.532718173571e-05
43001.00000  44001.00000  1.291491342380e-05
44001.00000  45001.00000  1.324891980545e-05
45001.00000  46001.00000  1.143044061646e-05
46001.00000  47001.00000  1.139332879628e-05
47001.00000  48001.00000  1.031708601096e-05
48001.00000  49001.00000  9.871744168764e-06
49001.00000  50001.00000  9.871744168764e-06
50001.00000  51001.00000  9.166619585281e-06
51001.00000  52001.00000  9.723296888031e-06
52001.00000  53001.00000  8.795501383448e-06
53001.00000  54001.00000  7.645034957765e-06
54001.00000  55001.00000  7.645034957765e-06
55001.00000  56001.00000  7.682146777948e-06
56001.00000  57001.00000  7.793482238498e-06
57001.00000  58001.00000  6.605903992631e-06
58001.00000  59001.00000  6.271897610982e-06
59001.00000  60001.00000  5.492549387132e-06
60001.00000  61001.00000  6.791463093548e-06
61001.00000  62001.00000  5.752332128415e-06
62001.00000  63001.00000  5.455437566948e-06
63001.00000  64001.00000  5.640996667865e-06
64001.00000  65001.00000  5.047207544932e-06
65001.00000  66001.00000  4.713201163282e-06
66001.00000  67001.00000  3.896741119249e-06
67001.00000  68001.00000  4.490530242182e-06
68001.00000  69001.00000  4.230747500899e-06
69001.00000  70001.00000  3.599846557782e-06
70001.00000  71001.00000  4.304971141265e-06
71001.00000  72001.00000  3.265840176132e-06
72001.00000  73001.00000  3.970964759616e-06
73001.00000  74001.00000  3.080281075216e-06
74001.00000  75001.00000  3.228728355949e-06
75001.00000  76001.00000  3.822517478882e-06
76001.00000  77001.00000  3.377175636682e-06
77001.00000  78001.00000  2.820498333933e-06
78001.00000  79001.00000  3.414287456866e-06
79001.00000  80001.00000  2.857610154116e-06
80001.00000  81001.00000  3.228728355949e-06
81001.00000  82001.00000  2.597827412833e-06
82001.00000  83001.00000  2.672051053199e-06
83001.00000  84001.00000  2.338044671549e-06
84001.00000  85001.00000  2.189597390816e-06
85001.00000  86001.00000  1.707143728433e-06
86001.00000  87001.00000  2.560715592649e-06
87001.00000  88001.00000  2.004038289899e-06
88001.00000  89001.00000  2.226709210999e-06
89001.00000  90001.00000  2.263821031183e-06
90001.00000  91001.00000  1.966926469716e-06
91001.00000  92001.00000  1.744255548616e-06
92001.00000  93001.00000  1.595808267883e-06
93001.00000  94001.00000  1.595808267883e-06
94001.00000  95001.00000  1.558696447700e-06
95001.00000  96001.00000  1.670031908250e-06
96001.00000  97001.00000  2.189597390816e-06
97001.00000  98001.00000  1.558696447700e-06
98001.00000  99001.00000  1.410249166966e-06
99001.00000  100001.00000  1.595808267883e-06
100001.00000  101001.00000  1.447360987150e-06
101001.00000  102001.00000  1.447360987150e-06
102001.00000  103001.00000  1.410249166966e-06
103001.00000  104001.00000  1.298913706416e-06
104001.00000  105001.00000  1.224690066050e-06
105001.00000  106001.00000  1.187578245866e-06
106001.00000  107001.00000  1.039130965133e-06
107001.00000  108001.00000  1.336025526600e-06
108001.00000  109001.00000  9.277955045831e-07
109001.00000  110001.00000  1.187578245866e-06
110001.00000  111001.00000  1.224690066050e-06
111001.00000  112001.00000  1.336025526600e-06
112001.00000  113001.00000  1.076242785316e-06
113001.00000  114001.00000  7.793482238498e-07
114001.00000  115001.00000  9.649073247664e-07
115001.00000  116001.00000  7.051245834831e-07
116001.00000  117001.00000  8.535718642164e-07
117001.00000  118001.00000  1.113354605500e-06
118001.00000  119001.00000  5.937891229332e-07
119001.00000  120001.00000  5.937891229332e-07
120001.00000  121001.00000  9.649073247664e-07
121001.00000  122001.00000  9.649073247664e-07
122001.00000  123001.00000  8.906836843997e-07
123001.00000  124001.00000  6.680127632998e-07
124001.00000  125001.00000  7.051245834831e-07
125001.00000  126001.00000  5.566773027498e-07
126001.00000  127001.00000  3.711182018332e-07
127001.00000  128001.00000  6.309009431165e-07
128001.00000  129001.00000  7.422364036665e-07
129001.00000  130001.00000  6.309009431165e-07
130001.00000  131001.00000  5.195654825665e-07
131001.00000  132001.00000  7.422364036665e-07
132001.00000  133001.00000  4.453418421999e-07
133001.00000  134001.00000  4.453418421999e-07
134001.00000  135001.00000  4.082300220166e-07
135001.00000  136001.00000  4.824536623832e-07
136001.00000  137001.00000  5.195654825665e-07
137001.00000  138001.00000  7.051245834831e-07
138001.00000  139001.00000  7.051245834831e-07
139001.00000  140001.00000  7.422364036665e-07
140001.00000  141001.00000  7.422364036665e-07
141001.00000  142001.00000  1.002019144950e-06
142001.00000  143001.00000  4.453418421999e-07
143001.00000  144001.00000  7.051245834831e-07
144001.00000  145001.00000  4.453418421999e-07
145001.00000  146001.00000  4.453418421999e-07
146001.00000  147001.00000  4.824536623832e-07
147001.00000  148001.00000  4.453418421999e-07
148001.00000  149001.00000  4.453418421999e-07
149001.00000  150001.00000  3.711182018332e-07
150001.00000  151001.00000  4.453418421999e-07
151001.00000  152001.00000  3.340063816499e-07
152001.00000  153001.00000  2.968945614666e-07
153001.00000  154001.00000  1.855591009166e-07
154001.00000  155001.00000  2.968945614666e-07
155001.00000  156001.00000  3.711182018332e-07
156001.00000  157001.00000  2.968945614666e-07
157001.00000  158001.00000  1.855591009166e-07
158001.00000  159001.00000  4.453418421999e-07
159001.00000  160001.00000  4.453418421999e-07
160001.00000  161001.00000  3.711182018332e-07
161001.00000  162001.00000  3.711182018332e-07
162001.00000  163001.00000  2.597827412833e-07
163001.00000  164001.00000  7.422364036665e-07
164001.00000  165001.00000  2.968945614666e-07
165001.00000  166001.00000  3.340063816499e-07
166001.00000  167001.00000  4.453418421999e-07
167001.00000  168001.00000  2.968945614666e-07
168001.00000  169001.00000  1.484472807333e-07
169001.00000  170001.00000  1.855591009166e-07
170001.00000  171001.00000  4.453418421999e-07
171001.00000  172001.00000  1.855591009166e-07
172001.00000  173001.00000  2.597827412833e-07
173001.00000  174001.00000  4.453418421999e-07
174001.00000  175001.00000  3.340063816499e-07
175001.00000  176001.00000  3.340063816499e-07
176001.00000  177001.00000  2.597827412833e-07
177001.00000  178001.00000  3.711182018332e-07
178001.00000  179001.00000  3.340063816499e-07
179001.00000  180001.00000  2.968945614666e-07
180001.00000  181001.00000  1.855591009166e-07
181001.00000  182001.00000  2.968945614666e-07
182001.00000  183001.00000  1.484472807333e-07
183001.00000  184001.00000  3.711182018332e-07
184001.00000  185001.00000  2.968945614666e-07
185001.00000  186001.00000  1.855591009166e-07
186001.00000  187001.00000  2.226709210999e-07
187001.00000  188001.00000  1.113354605500e-07
188001.00000  189001.00000  2.597827412833e-07
189001.00000  190001.00000  3.711182018332e-07
190001.00000  191001.00000  1.855591009166e-07
191001.00000  192001.00000  1.113354605500e-07
192001.00000  193001.00000  2.226709210999e-07
193001.00000  194001.00000  4.082300220166e-07
194001.00000  195001.00000  3.340063816499e-07
195001.00000  196001.00000  1.113354605500e-07
196001.00000  197001.00000  2.597827412833e-07
197001.00000  198001.00000  1.484472807333e-07
198001.00000  199001.00000  2.226709210999e-07
