10001.00000  11001.00000  1.137007174195e-05
11001.00000  12001.00000  1.166877701653e-05
12001.00000  13001.00000  1.308521815727e-05
13001.00000  14001.00000  1.419331836940e-05
14001.00000  15001.00000  1.809575824694e-05
15001.00000  16001.00000  2.065884221589e-05
16001.00000  17001.00000  2.420476289473e-05
17001.00000  18001.00000  2.498525087024e-05
18001.00000  19001.00000  2.900331859600e-05
19001.00000  20001.00000  2.961036479917e-05
20001.00000  21001.00000  2.872388462946e-05
21001.00000  22001.00000  2.956218652908e-05
22001.00000  23001.00000  2.787594707582e-05
23001.00000  24001.00000  2.750015656910e-05
24001.00000  25001.00000  2.642096331901e-05
25001.00000  26001.00000  2.519723525865e-05
26001.00000  27001.00000  2.395423589025e-05
27001.00000  28001.00000  2.260524432765e-05
28001.00000  29001.00000  2.017705951496e-05
29001.00000  30001.00000  1.957964896580e-05
30001.00000  31001.00000  1.837519221348e-05
31001.00000  32001.00000  1.664077449013e-05
32001.00000  33001.00000  1.663113883611e-05
33001.00000  34001.00000  1.536886815967e-05
34001.00000  35001.00000  1.390424874885e-05
35001.00000  36001.00000  1.340319473988e-05
36001.00000  37001.00000  1.223728060363e-05
37001.00000  38001.00000  1.138934304999e-05
38001.00000  39001.00000  1.127371520177e-05
39001.00000  40001.00000  9.741646212809e-06
40001.00000  41001.00000  9.587475748512e-06
41001.00000  42001.00000  8.450468574316e-06
42001.00000  43001.00000  8.305933764037e-06
43001.00000  44001.00000  7.910871949274e-06
44001.00000  45001.00000  7.641073636753e-06
45001.00000  46001.00000  7.419453594326e-06
46001.00000  47001.00000  6.696779542930e-06
47001.00000  48001.00000  6.378802960316e-06
48001.00000  49001.00000  6.243903804056e-06
49001.00000  50001.00000  5.521229752660e-06
50001.00000  51001.00000  5.713942833033e-06
51001.00000  52001.00000  5.155074899953e-06
52001.00000  53001.00000  4.914183549488e-06
53001.00000  54001.00000  4.509486080707e-06
54001.00000  55001.00000  4.480579118651e-06
55001.00000  56001.00000  4.056610341833e-06
56001.00000  57001.00000  3.969889455665e-06
57001.00000  58001.00000  3.497742408753e-06
58001.00000  59001.00000  3.555556332865e-06
59001.00000  60001.00000  3.892804223516e-06
60001.00000  61001.00000  3.449564138660e-06
61001.00000  62001.00000  3.324300636419e-06
62001.00000  63001.00000  3.006324053805e-06
63001.00000  64001.00000  2.909967513619e-06
64001.00000  65001.00000  3.112316248009e-06
65001.00000  66001.00000  2.726890087265e-06
66001.00000  67001.00000  2.775068357358e-06
67001.00000  68001.00000  2.563083968949e-06
68001.00000  69001.00000  2.177657808205e-06
69001.00000  70001.00000  2.264378694372e-06
70001.00000  71001.00000  1.715146415312e-06
71001.00000  72001.00000  2.302921310447e-06
72001.00000  73001.00000  2.013851689888e-06
73001.00000  74001.00000  2.245107386335e-06
74001.00000  75001.00000  1.821138609516e-06
75001.00000  76001.00000  1.840409917553e-06
76001.00000  77001.00000  1.869316879609e-06
77001.00000  78001.00000  1.493526372884e-06
78001.00000  79001.00000  1.589882913070e-06
79001.00000  80001.00000  1.628425529144e-06
80001.00000  81001.00000  1.493526372884e-06
81001.00000  82001.00000  1.406805486716e-06
82001.00000  83001.00000  1.310448946530e-06
83001.00000  84001.00000  1.185185444288e-06
84001.00000  85001.00000  1.445348102791e-06
85001.00000  86001.00000  1.271906330456e-06
86001.00000  87001.00000  1.127371520177e-06
87001.00000  88001.00000  1.175549790270e-06
88001.00000  89001.00000  1.050286288028e-06
89001.00000  90001.00000  1.021379325972e-06
90001.00000  91001.00000  1.059921942047e-06
91001.00000  92001.00000  1.059921942047e-06
92001.00000  93001.00000  1.050286288028e-06
93001.00000  94001.00000  9.346584398046e-07
94001.00000  95001.00000  1.021379325972e-06
95001.00000  96001.00000  9.539297478419e-07
96001.00000  97001.00000  9.250227857860e-07
97001.00000  98001.00000  9.250227857860e-07
98001.00000  99001.00000  8.575732076558e-07
99001.00000  100001.00000  9.732010558791e-07
100001.00000  101001.00000  7.997592835442e-07
101001.00000  102001.00000  7.515810134512e-07
102001.00000  103001.00000  8.093949375628e-07
103001.00000  104001.00000  8.190305915814e-07
104001.00000  105001.00000  7.323097054140e-07
105001.00000  106001.00000  6.552244732651e-07
106001.00000  107001.00000  6.552244732651e-07
107001.00000  108001.00000  6.937670893395e-07
108001.00000  109001.00000  5.299609710233e-07
109001.00000  110001.00000  7.034027433581e-07
110001.00000  111001.00000  6.070462031721e-07
111001.00000  112001.00000  5.588679330791e-07
112001.00000  113001.00000  6.744957813023e-07
113001.00000  114001.00000  5.010540089674e-07
114001.00000  115001.00000  5.781392411163e-07
115001.00000  116001.00000  6.455888192465e-07
116001.00000  117001.00000  4.528757388744e-07
117001.00000  118001.00000  5.877748951349e-07
118001.00000  119001.00000  4.528757388744e-07
119001.00000  120001.00000  4.817827009302e-07
120001.00000  121001.00000  5.010540089674e-07
121001.00000  122001.00000  3.854261607442e-07
122001.00000  123001.00000  4.143331228000e-07
123001.00000  124001.00000  4.432400848558e-07
124001.00000  125001.00000  3.468835446698e-07
125001.00000  126001.00000  3.276122366326e-07
126001.00000  127001.00000  3.565191986884e-07
127001.00000  128001.00000  3.854261607442e-07
128001.00000  129001.00000  3.276122366326e-07
129001.00000  130001.00000  4.914183549488e-07
130001.00000  131001.00000  3.854261607442e-07
131001.00000  132001.00000  3.372478906512e-07
132001.00000  133001.00000  3.276122366326e-07
133001.00000  134001.00000  3.854261607442e-07
134001.00000  135001.00000  3.083409285953e-07
135001.00000  136001.00000  3.276122366326e-07
136001.00000  137001.00000  3.179765826140e-07
137001.00000  138001.00000  3.276122366326e-07
138001.00000  139001.00000  2.312556964465e-07
139001.00000  140001.00000  2.312556964465e-07
140001.00000  141001.00000  2.023487343907e-07
141001.00000  142001.00000  3.179765826140e-07
142001.00000  143001.00000  2.697983125209e-07
143001.00000  144001.00000  2.987052745767e-07
144001.00000  145001.00000  2.505270044837e-07
145001.00000  146001.00000  2.601626585023e-07
146001.00000  147001.00000  2.601626585023e-07
147001.00000  148001.00000  1.927130803721e-07
148001.00000  149001.00000  2.312556964465e-07
149001.00000  150001.00000  2.601626585023e-07
150001.00000  151001.00000  2.794339665395e-07
151001.00000  152001.00000  1.348991562605e-07
152001.00000  153001.00000  1.830774263535e-07
153001.00000  154001.00000  1.638061183163e-07
154001.00000  155001.00000  1.541704642977e-07
155001.00000  156001.00000  1.348991562605e-07
156001.00000  157001.00000  1.927130803721e-07
157001.00000  158001.00000  1.541704642977e-07
158001.00000  159001.00000  1.445348102791e-07
159001.00000  160001.00000  1.252635022419e-07
160001.00000  161001.00000  8.672088616744e-08
161001.00000  162001.00000  1.252635022419e-07
162001.00000  163001.00000  9.635654018605e-08
163001.00000  164001.00000  1.252635022419e-07
164001.00000  165001.00000  1.638061183163e-07
165001.00000  166001.00000  1.252635022419e-07
166001.00000  167001.00000  8.672088616744e-08
167001.00000  168001.00000  8.672088616744e-08
168001.00000  169001.00000  7.708523214884e-08
169001.00000  170001.00000  1.348991562605e-07
170001.00000  171001.00000  9.635654018605e-08
171001.00000  172001.00000  9.635654018605e-08
172001.00000  173001.00000  8.672088616744e-08
173001.00000  174001.00000  7.708523214884e-08
174001.00000  175001.00000  5.781392411163e-08
175001.00000  176001.00000  9.635654018605e-08
176001.00000  177001.00000  8.672088616744e-08
177001.00000  178001.00000  5.781392411163e-08
178001.00000  179001.00000  7.708523214884e-08
179001.00000  180001.00000  4.817827009302e-08
180001.00000  181001.00000  8.672088616744e-08
181001.00000  182001.00000  1.252635022419e-07
182001.00000  183001.00000  1.059921942047e-07
183001.00000  184001.00000  9.635654018605e-08
184001.00000  185001.00000  4.817827009302e-08
185001.00000  186001.00000  1.156278482233e-07
186001.00000  187001.00000  5.781392411163e-08
187001.00000  188001.00000  4.817827009302e-08
188001.00000  189001.00000  5.781392411163e-08
189001.00000  190001.00000  1.252635022419e-07
190001.00000  191001.00000  2.890696205581e-08
191001.00000  192001.00000  7.708523214884e-08
192001.00000  193001.00000  5.781392411163e-08
193001.00000  194001.00000  5.781392411163e-08
194001.00000  195001.00000  3.854261607442e-08
195001.00000  196001.00000  2.890696205581e-08
196001.00000  197001.00000  5.781392411163e-08
197001.00000  198001.00000  8.672088616744e-08
198001.00000  199001.00000  6.744957813023e-08
