300.00000  350.00000  2.808321792258e-06
350.00000  400.00000  7.221398894376e-06
400.00000  450.00000  3.811293860921e-06
450.00000  500.00000  4.613671515852e-06
500.00000  550.00000  4.593612074478e-05
550.00000  600.00000  4.814265929584e-06
600.00000  650.00000  1.524517544368e-05
650.00000  700.00000  6.619615653178e-06
700.00000  750.00000  8.224370963040e-06
750.00000  800.00000  6.017832411980e-06
800.00000  850.00000  2.768202909511e-05
850.00000  900.00000  5.014860343317e-06
900.00000  950.00000  7.622587721842e-06
950.00000  1000.00000  4.814265929584e-06
1000.00000  1050.00000  6.017832411980e-06
1050.00000  1100.00000  9.628531859169e-06
1100.00000  1150.00000  6.619615653178e-06
1150.00000  1200.00000  9.227343031703e-06
1200.00000  1250.00000  7.221398894376e-06
1250.00000  1300.00000  2.246657433806e-05
1300.00000  1350.00000  8.826154204238e-06
1350.00000  1400.00000  7.221398894376e-06
1400.00000  1450.00000  1.103269275530e-05
1450.00000  1500.00000  1.183507041023e-05
1500.00000  1550.00000  5.616643584515e-06
1550.00000  1600.00000  7.020804480644e-06
1600.00000  1650.00000  9.829126272901e-06
1650.00000  1700.00000  8.625559790505e-06
1700.00000  1750.00000  3.470283357575e-05
1750.00000  1800.00000  1.183507041023e-05
1800.00000  1850.00000  7.421993308109e-06
1850.00000  1900.00000  9.427937445436e-06
1900.00000  1950.00000  7.823182135574e-06
1950.00000  2000.00000  8.625559790505e-06
2000.00000  2050.00000  1.002972068663e-05
2050.00000  2100.00000  1.083209834156e-05
2100.00000  2150.00000  1.223625923769e-05
2150.00000  2200.00000  1.243685365143e-05
2200.00000  2250.00000  1.023031510037e-05
2250.00000  2300.00000  8.826154204238e-06
2300.00000  2350.00000  5.957654087861e-05
2350.00000  2400.00000  1.163447599650e-05
2400.00000  2450.00000  1.444279778875e-05
2450.00000  2500.00000  1.564636427115e-05
2500.00000  2550.00000  1.283804247889e-05
2550.00000  2600.00000  1.624814751235e-05
2600.00000  2650.00000  1.444279778875e-05
2650.00000  2700.00000  1.745171399474e-05
2700.00000  2750.00000  1.985884695954e-05
2750.00000  2800.00000  1.905646930460e-05
2800.00000  2850.00000  2.046063020073e-05
2850.00000  2900.00000  2.527489613032e-05
2900.00000  2950.00000  2.687965144018e-05
2950.00000  3000.00000  5.897475763741e-05
3000.00000  3050.00000  3.189451178350e-05
3050.00000  3100.00000  3.089153971483e-05
3100.00000  3150.00000  4.473255426239e-05
3150.00000  3200.00000  4.493314867612e-05
3200.00000  3250.00000  4.794206488211e-05
3250.00000  3300.00000  5.355870846663e-05
3300.00000  3350.00000  5.636703025888e-05
3350.00000  3400.00000  6.298664591206e-05
3400.00000  3450.00000  7.141161128883e-05
3450.00000  3500.00000  7.281577218496e-05
3500.00000  3550.00000  9.367759121316e-05
3550.00000  3600.00000  9.608472417795e-05
3600.00000  3650.00000  1.067162281058e-04
3650.00000  3700.00000  1.582689924351e-04
3700.00000  3750.00000  1.267756694791e-04
3750.00000  3800.00000  1.347994460284e-04
3800.00000  3850.00000  1.474368940935e-04
3850.00000  3900.00000  1.532541320918e-04
3900.00000  3950.00000  1.604755309861e-04
3950.00000  4000.00000  1.835438885654e-04
4000.00000  4050.00000  1.771248673260e-04
4050.00000  4100.00000  1.893611265636e-04
4100.00000  4150.00000  2.076152182133e-04
4150.00000  4200.00000  2.060104629035e-04
4200.00000  4250.00000  2.254681210355e-04
4250.00000  4300.00000  2.363002193771e-04
4300.00000  4350.00000  2.417162685479e-04
4350.00000  4400.00000  2.425186462028e-04
4400.00000  4450.00000  2.601709546113e-04
4450.00000  4500.00000  2.655870037821e-04
4500.00000  4550.00000  2.826375289493e-04
4550.00000  4600.00000  3.099183692170e-04
4600.00000  4650.00000  3.008916205990e-04
4650.00000  4700.00000  3.147326351466e-04
4700.00000  4750.00000  3.219540340410e-04
4750.00000  4800.00000  3.319837547276e-04
4800.00000  4850.00000  3.434176363103e-04
4850.00000  4900.00000  3.440194195515e-04
4900.00000  4950.00000  3.420134754142e-04
4950.00000  5000.00000  3.570580564442e-04
5000.00000  5050.00000  3.668871827171e-04
5050.00000  5100.00000  3.636776720973e-04
5100.00000  5150.00000  3.612705391326e-04
5150.00000  5200.00000  3.735067983702e-04
5200.00000  5250.00000  3.727044207153e-04
5250.00000  5300.00000  3.741085816114e-04
5300.00000  5350.00000  3.875484073315e-04
5350.00000  5400.00000  3.991828833280e-04
5400.00000  5450.00000  4.266643180094e-04
5450.00000  5500.00000  4.056019045675e-04
5500.00000  5550.00000  3.959733727083e-04
5550.00000  5600.00000  3.919614844337e-04
5600.00000  5650.00000  3.961739671220e-04
5650.00000  5700.00000  4.047995269125e-04
5700.00000  5750.00000  3.889525682277e-04
5750.00000  5800.00000  4.160328140816e-04
5800.00000  5850.00000  4.027935827752e-04
5850.00000  5900.00000  4.302750174566e-04
5900.00000  5950.00000  4.172363805640e-04
5950.00000  6000.00000  3.957727782946e-04
6000.00000  6050.00000  4.184399470464e-04
6050.00000  6100.00000  4.146286531854e-04
6100.00000  6150.00000  4.298738286291e-04
6150.00000  6200.00000  4.322809615939e-04
6200.00000  6250.00000  4.685885504795e-04
6250.00000  6300.00000  5.516346377649e-04
6300.00000  6350.00000  5.448144276980e-04
6350.00000  6400.00000  2.527690207445e-03
6400.00000  6450.00000  3.995840721555e-04
6450.00000  6500.00000  4.009882330516e-04
6500.00000  6550.00000  3.953715894671e-04
6550.00000  6600.00000  3.945692118122e-04
6600.00000  6650.00000  4.064042822224e-04
6650.00000  6700.00000  3.883507849865e-04
6700.00000  6750.00000  3.969763447770e-04
6750.00000  6800.00000  3.779198754724e-04
6800.00000  6850.00000  3.863448408491e-04
6850.00000  6900.00000  4.116197369795e-04
6900.00000  6950.00000  4.090120096009e-04
6950.00000  7000.00000  3.624741056150e-04
7000.00000  7050.00000  3.642794553385e-04
7050.00000  7100.00000  5.995767026470e-04
7100.00000  7150.00000  2.210550439334e-04
7150.00000  7200.00000  2.019985746288e-04
7200.00000  7250.00000  2.134324562116e-04
7250.00000  7300.00000  2.090193791095e-04
7300.00000  7350.00000  2.092199735232e-04
7350.00000  7400.00000  2.200520718647e-04
7400.00000  7450.00000  2.080164070408e-04
7450.00000  7500.00000  2.862482283965e-04
7500.00000  7550.00000  1.971843086992e-04
7550.00000  7600.00000  2.009956025601e-04
7600.00000  7650.00000  2.186479109686e-04
7650.00000  7700.00000  2.164413724176e-04
7700.00000  7750.00000  2.094205679369e-04
7750.00000  7800.00000  2.274740651729e-04
7800.00000  7850.00000  2.158395891764e-04
7850.00000  7900.00000  2.144354282802e-04
7900.00000  7950.00000  2.116271064880e-04
7950.00000  8000.00000  2.132318617978e-04
8000.00000  8050.00000  1.975854975267e-04
8050.00000  8100.00000  2.180461277274e-04
8100.00000  8150.00000  2.088187846957e-04
8150.00000  8200.00000  1.989896584228e-04
8200.00000  8250.00000  1.987890640091e-04
8250.00000  8300.00000  2.122288897292e-04
8300.00000  8350.00000  2.044057075936e-04
8350.00000  8400.00000  1.985884695954e-04
8400.00000  8450.00000  1.857504271165e-04
8450.00000  8500.00000  2.044057075936e-04
8500.00000  8550.00000  1.999926304915e-04
8550.00000  8600.00000  1.965825254580e-04
8600.00000  8650.00000  1.911664762872e-04
8650.00000  8700.00000  2.052080852485e-04
8700.00000  8750.00000  1.939747980795e-04
8750.00000  8800.00000  1.979866863542e-04
8800.00000  8850.00000  2.056092740760e-04
8850.00000  8900.00000  2.058098684897e-04
8900.00000  8950.00000  1.859510215302e-04
8950.00000  9000.00000  1.937742036658e-04
9000.00000  9050.00000  1.921694483559e-04
9050.00000  9100.00000  1.981872807679e-04
9100.00000  9150.00000  1.899629098048e-04
9150.00000  9200.00000  1.887593433225e-04
9200.00000  9250.00000  1.837444829791e-04
9250.00000  9300.00000  1.879569656675e-04
9300.00000  9350.00000  1.869539935989e-04
9350.00000  9400.00000  1.735141678788e-04
9400.00000  9450.00000  1.865528047714e-04
9450.00000  9500.00000  1.833432941517e-04
9500.00000  9550.00000  1.783284338084e-04
9550.00000  9600.00000  1.785290282221e-04
9600.00000  9650.00000  1.823403220830e-04
9650.00000  9700.00000  1.693016851904e-04
9700.00000  9750.00000  1.833432941517e-04
9750.00000  9800.00000  1.757207064298e-04
9800.00000  9850.00000  1.805349723594e-04
9850.00000  9900.00000  1.779272449809e-04
9900.00000  9950.00000  1.747177343612e-04
9950.00000  10000.00000  1.713076293277e-04
