10001.00000  11001.00000  7.560843531971e-04
11001.00000  12001.00000  6.302200899408e-04
12001.00000  13001.00000  5.391203918284e-04
13001.00000  14001.00000  4.545817414293e-04
14001.00000  15001.00000  3.958378950538e-04
15001.00000  16001.00000  3.429001265177e-04
16001.00000  17001.00000  2.960200924457e-04
17001.00000  18001.00000  2.662347333746e-04
18001.00000  19001.00000  2.376537310071e-04
19001.00000  20001.00000  2.085514399171e-04
20001.00000  21001.00000  1.896412421242e-04
21001.00000  22001.00000  1.732655860507e-04
22001.00000  23001.00000  1.569618318700e-04
23001.00000  24001.00000  1.402086908596e-04
24001.00000  25001.00000  1.247677593919e-04
25001.00000  26001.00000  1.176674474830e-04
26001.00000  27001.00000  1.078348636496e-04
27001.00000  28001.00000  1.014895216145e-04
28001.00000  29001.00000  9.336460773395e-05
29001.00000  30001.00000  8.696533927934e-05
30001.00000  31001.00000  8.128508975220e-05
31001.00000  32001.00000  7.393312121867e-05
32001.00000  33001.00000  7.102109456235e-05
33001.00000  34001.00000  6.523299219610e-05
34001.00000  35001.00000  6.108065788987e-05
35001.00000  36001.00000  5.541838383592e-05
36001.00000  37001.00000  5.187721561806e-05
37001.00000  38001.00000  5.043917776309e-05
38001.00000  39001.00000  4.653850008148e-05
39001.00000  40001.00000  4.517236411926e-05
40001.00000  41001.00000  4.193677894558e-05
41001.00000  42001.00000  3.985162405587e-05
42001.00000  43001.00000  3.774849369297e-05
43001.00000  44001.00000  3.537573123227e-05
44001.00000  45001.00000  3.402757074324e-05
45001.00000  46001.00000  3.214014605859e-05
46001.00000  47001.00000  3.093578935505e-05
47001.00000  48001.00000  2.946180055371e-05
48001.00000  49001.00000  2.786198344005e-05
49001.00000  50001.00000  2.565100023803e-05
50001.00000  51001.00000  2.604646064815e-05
51001.00000  52001.00000  2.352989440195e-05
52001.00000  53001.00000  2.300860567953e-05
53001.00000  54001.00000  2.196602823467e-05
54001.00000  55001.00000  2.052799037970e-05
55001.00000  56001.00000  2.076167153114e-05
56001.00000  57001.00000  1.923375631023e-05
57001.00000  58001.00000  1.874841853418e-05
58001.00000  59001.00000  1.824510528494e-05
59001.00000  60001.00000  1.759798825020e-05
60001.00000  61001.00000  1.520725031631e-05
61001.00000  62001.00000  1.610602397567e-05
62001.00000  63001.00000  1.558473525324e-05
63001.00000  64001.00000  1.461405970114e-05
64001.00000  65001.00000  1.358945772947e-05
65001.00000  66001.00000  1.445228044245e-05
66001.00000  67001.00000  1.342767847079e-05
67001.00000  68001.00000  1.272663501649e-05
68001.00000  69001.00000  1.229522366000e-05
69001.00000  70001.00000  1.134252358108e-05
70001.00000  71001.00000  1.109086695646e-05
71001.00000  72001.00000  1.051565181447e-05
72001.00000  73001.00000  1.031792160941e-05
73001.00000  74001.00000  1.015614235073e-05
74001.00000  75001.00000  9.832583833360e-06
75001.00000  76001.00000  9.401172476869e-06
76001.00000  77001.00000  9.203442271811e-06
77001.00000  78001.00000  8.610251656635e-06
78001.00000  79001.00000  8.933810174004e-06
79001.00000  80001.00000  8.394545978390e-06
80001.00000  81001.00000  7.855281782776e-06
81001.00000  82001.00000  7.981110095086e-06
82001.00000  83001.00000  7.423870426285e-06
83001.00000  84001.00000  7.909208202337e-06
84001.00000  85001.00000  6.543072240115e-06
85001.00000  86001.00000  6.561047713303e-06
86001.00000  87001.00000  6.614974132864e-06
87001.00000  88001.00000  6.039758990876e-06
88001.00000  89001.00000  5.985832571314e-06
89001.00000  90001.00000  6.021783517689e-06
90001.00000  91001.00000  5.320740063391e-06
91001.00000  92001.00000  5.338715536578e-06
92001.00000  93001.00000  5.985832571314e-06
93001.00000  94001.00000  5.608347634385e-06
94001.00000  95001.00000  5.698225000320e-06
95001.00000  96001.00000  4.943255126461e-06
96001.00000  97001.00000  5.194911751081e-06
97001.00000  98001.00000  5.158960804706e-06
98001.00000  99001.00000  4.727549448215e-06
99001.00000  100001.00000  4.206260725788e-06
100001.00000  101001.00000  4.853377760525e-06
101001.00000  102001.00000  4.403990930847e-06
102001.00000  103001.00000  4.673623028654e-06
103001.00000  104001.00000  4.278162618537e-06
104001.00000  105001.00000  4.709573975028e-06
105001.00000  106001.00000  4.080432413479e-06
106001.00000  107001.00000  3.613070110613e-06
107001.00000  108001.00000  3.487241798303e-06
108001.00000  109001.00000  3.666996530175e-06
109001.00000  110001.00000  3.595094637426e-06
110001.00000  111001.00000  3.631045583800e-06
111001.00000  112001.00000  3.055830441812e-06
112001.00000  113001.00000  3.199634227309e-06
113001.00000  114001.00000  3.433315378742e-06
114001.00000  115001.00000  3.055830441812e-06
115001.00000  116001.00000  2.965953075877e-06
116001.00000  117001.00000  2.912026656315e-06
117001.00000  118001.00000  2.822149290379e-06
118001.00000  119001.00000  2.750247397631e-06
119001.00000  120001.00000  2.552517192573e-06
120001.00000  121001.00000  2.642394558508e-06
121001.00000  122001.00000  2.714296451257e-06
122001.00000  123001.00000  2.822149290379e-06
123001.00000  124001.00000  2.372762460701e-06
124001.00000  125001.00000  2.031228470146e-06
125001.00000  126001.00000  2.534541719385e-06
126001.00000  127001.00000  2.264909621578e-06
127001.00000  128001.00000  2.498590773011e-06
128001.00000  129001.00000  2.139081309269e-06
129001.00000  130001.00000  2.067179416520e-06
130001.00000  131001.00000  2.264909621578e-06
131001.00000  132001.00000  2.049203943333e-06
132001.00000  133001.00000  2.318836041140e-06
133001.00000  134001.00000  2.013252996959e-06
134001.00000  135001.00000  1.779571845526e-06
135001.00000  136001.00000  1.743620899152e-06
136001.00000  137001.00000  1.851473738274e-06
137001.00000  138001.00000  1.833498265087e-06
138001.00000  139001.00000  1.815522791900e-06
139001.00000  140001.00000  1.869449211462e-06
140001.00000  141001.00000  1.348160489035e-06
141001.00000  142001.00000  2.067179416520e-06
142001.00000  143001.00000  1.887424684649e-06
143001.00000  144001.00000  1.635768060029e-06
144001.00000  145001.00000  1.689694479590e-06
145001.00000  146001.00000  1.617792586842e-06
146001.00000  147001.00000  1.527915220906e-06
147001.00000  148001.00000  1.204356703538e-06
148001.00000  149001.00000  1.312209542661e-06
149001.00000  150001.00000  1.402086908596e-06
150001.00000  151001.00000  1.527915220906e-06
151001.00000  152001.00000  1.186381230351e-06
152001.00000  153001.00000  1.725645425965e-06
153001.00000  154001.00000  1.276258596286e-06
154001.00000  155001.00000  1.348160489035e-06
155001.00000  156001.00000  1.509939747719e-06
156001.00000  157001.00000  1.366135962222e-06
157001.00000  158001.00000  1.078528391228e-06
158001.00000  159001.00000  1.096503864415e-06
159001.00000  160001.00000  1.114479337602e-06
160001.00000  161001.00000  1.006626498479e-06
161001.00000  162001.00000  1.060552918041e-06
162001.00000  163001.00000  1.168405757163e-06
163001.00000  164001.00000  1.150430283976e-06
164001.00000  165001.00000  1.150430283976e-06
165001.00000  166001.00000  8.987736593565e-07
166001.00000  167001.00000  9.167491325436e-07
167001.00000  168001.00000  8.268717666080e-07
168001.00000  169001.00000  7.909208202337e-07
169001.00000  170001.00000  1.168405757163e-06
170001.00000  171001.00000  1.078528391228e-06
171001.00000  172001.00000  1.060552918041e-06
172001.00000  173001.00000  9.347246057308e-07
173001.00000  174001.00000  8.987736593565e-07
174001.00000  175001.00000  1.168405757163e-06
175001.00000  176001.00000  8.987736593565e-07
176001.00000  177001.00000  9.527000789179e-07
177001.00000  178001.00000  6.471170347367e-07
178001.00000  179001.00000  8.448472397951e-07
179001.00000  180001.00000  8.268717666080e-07
180001.00000  181001.00000  9.167491325436e-07
181001.00000  182001.00000  9.527000789179e-07
182001.00000  183001.00000  6.830679811110e-07
183001.00000  184001.00000  7.369944006723e-07
184001.00000  185001.00000  7.010434542981e-07
185001.00000  186001.00000  4.853377760525e-07
186001.00000  187001.00000  7.909208202337e-07
187001.00000  188001.00000  6.830679811110e-07
188001.00000  189001.00000  6.111660883624e-07
189001.00000  190001.00000  7.010434542981e-07
190001.00000  191001.00000  9.167491325436e-07
191001.00000  192001.00000  6.111660883624e-07
192001.00000  193001.00000  6.111660883624e-07
193001.00000  194001.00000  7.729453470466e-07
194001.00000  195001.00000  7.010434542981e-07
195001.00000  196001.00000  6.291415615496e-07
196001.00000  197001.00000  5.931906151753e-07
197001.00000  198001.00000  5.931906151753e-07
198001.00000  199001.00000  5.033132492396e-07
