10001.00000  11001.00000  1.527876792785e-04
11001.00000  12001.00000  1.454014593633e-04
12001.00000  13001.00000  1.370171016216e-04
13001.00000  14001.00000  1.320990043317e-04
14001.00000  15001.00000  1.231520598152e-04
15001.00000  16001.00000  1.116825487920e-04
16001.00000  17001.00000  1.053307626241e-04
17001.00000  18001.00000  9.752713961785e-05
18001.00000  19001.00000  8.979610845350e-05
19001.00000  20001.00000  8.139360275140e-05
20001.00000  21001.00000  7.589477072606e-05
21001.00000  22001.00000  6.972446416296e-05
22001.00000  23001.00000  6.360860148131e-05
23001.00000  24001.00000  5.914420320330e-05
24001.00000  25001.00000  5.585942235648e-05
25001.00000  26001.00000  5.242945782582e-05
26001.00000  27001.00000  4.656766659088e-05
27001.00000  28001.00000  4.498879402915e-05
28001.00000  29001.00000  4.150438561705e-05
29001.00000  30001.00000  3.660443628753e-05
30001.00000  31001.00000  3.582407398690e-05
31001.00000  32001.00000  3.219448189097e-05
32001.00000  33001.00000  3.244855333768e-05
33001.00000  34001.00000  2.974450722621e-05
34001.00000  35001.00000  2.655046618178e-05
35001.00000  36001.00000  2.589713960452e-05
36001.00000  37001.00000  2.417308335894e-05
37001.00000  38001.00000  2.275754244153e-05
38001.00000  39001.00000  2.272124652057e-05
39001.00000  40001.00000  1.927313402943e-05
40001.00000  41001.00000  1.961794527854e-05
41001.00000  42001.00000  1.758537370482e-05
42001.00000  43001.00000  1.793018495393e-05
43001.00000  44001.00000  1.589761338021e-05
44001.00000  45001.00000  1.589761338021e-05
45001.00000  46001.00000  1.417355713464e-05
46001.00000  47001.00000  1.411911325320e-05
47001.00000  48001.00000  1.250394477051e-05
48001.00000  49001.00000  1.190506207468e-05
49001.00000  50001.00000  1.286690398010e-05
50001.00000  51001.00000  1.156025082556e-05
51001.00000  52001.00000  9.709158856633e-06
52001.00000  53001.00000  1.067100076206e-05
53001.00000  54001.00000  1.012656194767e-05
54001.00000  55001.00000  8.983240437446e-06
55001.00000  56001.00000  9.999526224308e-06
56001.00000  57001.00000  8.856204714088e-06
57001.00000  58001.00000  8.529541425454e-06
58001.00000  59001.00000  7.966954650583e-06
59001.00000  60001.00000  8.493245504494e-06
60001.00000  61001.00000  7.676587282908e-06
61001.00000  62001.00000  6.805485179883e-06
62001.00000  63001.00000  7.168444389477e-06
63001.00000  64001.00000  6.587709654127e-06
64001.00000  65001.00000  6.388082088850e-06
65001.00000  66001.00000  6.279194325972e-06
66001.00000  67001.00000  5.734755511582e-06
67001.00000  68001.00000  6.242898405013e-06
68001.00000  69001.00000  5.771051432541e-06
69001.00000  70001.00000  5.244760578630e-06
70001.00000  71001.00000  5.480684064866e-06
71001.00000  72001.00000  5.244760578630e-06
72001.00000  73001.00000  4.228474791767e-06
73001.00000  74001.00000  4.645877882800e-06
74001.00000  75001.00000  4.718469724719e-06
75001.00000  76001.00000  4.627729922321e-06
76001.00000  77001.00000  4.246622752247e-06
77001.00000  78001.00000  3.702183937856e-06
78001.00000  79001.00000  3.992551305531e-06
79001.00000  80001.00000  3.665888016897e-06
80001.00000  81001.00000  3.684035977377e-06
81001.00000  82001.00000  3.992551305531e-06
82001.00000  83001.00000  3.502556372580e-06
83001.00000  84001.00000  3.121449202506e-06
84001.00000  85001.00000  3.030709400108e-06
85001.00000  86001.00000  2.903673676750e-06
86001.00000  87001.00000  3.067005321067e-06
87001.00000  88001.00000  2.685898150994e-06
88001.00000  89001.00000  3.157745123466e-06
89001.00000  90001.00000  2.849229795311e-06
90001.00000  91001.00000  2.722194071953e-06
91001.00000  92001.00000  2.939969597710e-06
92001.00000  93001.00000  2.558862427636e-06
93001.00000  94001.00000  2.159607297083e-06
94001.00000  95001.00000  2.214051178522e-06
95001.00000  96001.00000  2.286643020441e-06
96001.00000  97001.00000  2.304790980920e-06
97001.00000  98001.00000  2.032571573725e-06
98001.00000  99001.00000  2.195903218042e-06
99001.00000  100001.00000  1.669612364131e-06
100001.00000  101001.00000  1.905535850367e-06
101001.00000  102001.00000  2.014423613245e-06
102001.00000  103001.00000  2.232199139002e-06
103001.00000  104001.00000  1.796648087489e-06
104001.00000  105001.00000  2.050719534205e-06
105001.00000  106001.00000  1.488132759334e-06
106001.00000  107001.00000  1.615168482692e-06
107001.00000  108001.00000  1.469984798855e-06
108001.00000  109001.00000  1.578872561733e-06
109001.00000  110001.00000  1.433688877895e-06
110001.00000  111001.00000  1.669612364131e-06
111001.00000  112001.00000  1.633316443172e-06
112001.00000  113001.00000  1.687760324611e-06
113001.00000  114001.00000  1.724056245570e-06
114001.00000  115001.00000  1.724056245570e-06
115001.00000  116001.00000  1.542576640774e-06
116001.00000  117001.00000  1.252209273098e-06
117001.00000  118001.00000  1.379244996456e-06
118001.00000  119001.00000  1.506280719814e-06
119001.00000  120001.00000  1.415540917416e-06
120001.00000  121001.00000  1.306653154538e-06
121001.00000  122001.00000  1.107025589261e-06
122001.00000  123001.00000  1.107025589261e-06
123001.00000  124001.00000  9.799898659032e-07
124001.00000  125001.00000  1.143321510220e-06
125001.00000  126001.00000  9.618419054235e-07
126001.00000  127001.00000  8.711021030250e-07
127001.00000  128001.00000  1.125173549741e-06
128001.00000  129001.00000  1.197765391659e-06
129001.00000  130001.00000  1.070729668302e-06
130001.00000  131001.00000  8.348061820657e-07
131001.00000  132001.00000  7.985102611063e-07
132001.00000  133001.00000  7.622143401469e-07
133001.00000  134001.00000  9.255459844641e-07
134001.00000  135001.00000  7.440663796672e-07
135001.00000  136001.00000  7.077704587078e-07
136001.00000  137001.00000  9.436939449438e-07
137001.00000  138001.00000  9.436939449438e-07
138001.00000  139001.00000  8.529541425454e-07
139001.00000  140001.00000  7.259184191875e-07
140001.00000  141001.00000  8.529541425454e-07
141001.00000  142001.00000  7.259184191875e-07
142001.00000  143001.00000  7.803623006266e-07
143001.00000  144001.00000  6.533265772688e-07
144001.00000  145001.00000  5.988826958297e-07
145001.00000  146001.00000  5.444388143907e-07
146001.00000  147001.00000  6.896224982282e-07
147001.00000  148001.00000  6.714745377485e-07
148001.00000  149001.00000  5.807347353500e-07
149001.00000  150001.00000  4.899949329516e-07
150001.00000  151001.00000  4.899949329516e-07
151001.00000  152001.00000  7.440663796672e-07
152001.00000  153001.00000  6.533265772688e-07
153001.00000  154001.00000  4.174030910328e-07
154001.00000  155001.00000  6.351786167891e-07
155001.00000  156001.00000  6.896224982282e-07
156001.00000  157001.00000  4.536990119922e-07
157001.00000  158001.00000  4.899949329516e-07
158001.00000  159001.00000  4.718469724719e-07
159001.00000  160001.00000  4.536990119922e-07
160001.00000  161001.00000  5.262908539110e-07
161001.00000  162001.00000  5.081428934313e-07
162001.00000  163001.00000  4.355510515125e-07
163001.00000  164001.00000  5.262908539110e-07
164001.00000  165001.00000  5.807347353500e-07
165001.00000  166001.00000  3.266632886344e-07
166001.00000  167001.00000  3.629592095938e-07
167001.00000  168001.00000  4.355510515125e-07
168001.00000  169001.00000  3.448112491141e-07
169001.00000  170001.00000  3.811071700735e-07
170001.00000  171001.00000  4.536990119922e-07
171001.00000  172001.00000  4.174030910328e-07
172001.00000  173001.00000  2.722194071953e-07
173001.00000  174001.00000  3.629592095938e-07
174001.00000  175001.00000  3.266632886344e-07
175001.00000  176001.00000  2.177755257563e-07
176001.00000  177001.00000  2.903673676750e-07
177001.00000  178001.00000  2.722194071953e-07
178001.00000  179001.00000  3.629592095938e-07
179001.00000  180001.00000  2.903673676750e-07
180001.00000  181001.00000  4.899949329516e-07
181001.00000  182001.00000  2.540714467156e-07
182001.00000  183001.00000  4.536990119922e-07
183001.00000  184001.00000  3.811071700735e-07
184001.00000  185001.00000  4.174030910328e-07
185001.00000  186001.00000  2.903673676750e-07
186001.00000  187001.00000  2.177755257563e-07
187001.00000  188001.00000  2.540714467156e-07
188001.00000  189001.00000  3.085153281547e-07
189001.00000  190001.00000  3.085153281547e-07
190001.00000  191001.00000  2.722194071953e-07
191001.00000  192001.00000  3.266632886344e-07
192001.00000  193001.00000  2.722194071953e-07
193001.00000  194001.00000  1.814796047969e-07
194001.00000  195001.00000  2.903673676750e-07
195001.00000  196001.00000  2.177755257563e-07
196001.00000  197001.00000  2.540714467156e-07
197001.00000  198001.00000  2.903673676750e-07
198001.00000  199001.00000  3.629592095938e-07
