300.00000  350.00000  9.415583574805e-04
350.00000  400.00000  9.653013578267e-04
400.00000  450.00000  9.808827018039e-04
450.00000  500.00000  1.012045389758e-03
500.00000  550.00000  1.186408048551e-03
550.00000  600.00000  7.278713543644e-04
600.00000  650.00000  8.599417937903e-04
650.00000  700.00000  1.032820515061e-03
700.00000  750.00000  1.014271296041e-03
750.00000  800.00000  1.233152080483e-03
800.00000  850.00000  1.459452552533e-03
850.00000  900.00000  1.420870176970e-03
900.00000  950.00000  1.484679490401e-03
950.00000  1000.00000  1.708012087407e-03
1000.00000  1050.00000  1.948409965913e-03
1050.00000  1100.00000  2.197711469549e-03
1100.00000  1150.00000  2.536049224483e-03
1150.00000  1200.00000  2.898871948523e-03
1200.00000  1250.00000  3.260210735043e-03
1250.00000  1300.00000  3.810009586810e-03
1300.00000  1350.00000  3.818171243179e-03
1350.00000  1400.00000  4.129056153963e-03
1400.00000  1450.00000  4.374647813794e-03
1450.00000  1500.00000  4.873992789826e-03
1500.00000  1550.00000  5.339207202860e-03
1550.00000  1600.00000  5.614477613124e-03
1600.00000  1650.00000  6.015882712728e-03
1650.00000  1700.00000  6.470709563111e-03
1700.00000  1750.00000  6.868404818910e-03
1750.00000  1800.00000  6.889179944213e-03
1800.00000  1850.00000  6.930730194819e-03
1850.00000  1900.00000  6.730398629398e-03
1900.00000  1950.00000  7.061316696723e-03
1950.00000  2000.00000  7.159998541912e-03
2000.00000  2050.00000  7.383331138919e-03
2050.00000  2100.00000  7.470141483935e-03
2100.00000  2150.00000  7.539144578691e-03
2150.00000  2200.00000  7.539886547452e-03
2200.00000  2250.00000  7.605921767165e-03
2250.00000  2300.00000  7.736508269069e-03
2300.00000  2350.00000  7.687538330855e-03
2350.00000  2400.00000  7.519853390910e-03
2400.00000  2450.00000  7.412267920591e-03
2450.00000  2500.00000  7.214162261452e-03
2500.00000  2550.00000  6.851339537411e-03
2550.00000  2600.00000  6.749689817179e-03
2600.00000  2650.00000  6.823144724500e-03
2650.00000  2700.00000  6.852823474933e-03
2700.00000  2750.00000  6.538970689106e-03
2750.00000  2800.00000  6.566423533256e-03
2800.00000  2850.00000  6.393544811985e-03
2850.00000  2900.00000  6.333445342359e-03
2900.00000  2950.00000  6.144243308350e-03
2950.00000  3000.00000  6.144243308350e-03
3000.00000  3050.00000  5.953557336819e-03
3050.00000  3100.00000  5.835584303849e-03
3100.00000  3150.00000  5.802937678373e-03
3150.00000  3200.00000  5.587766737735e-03
3200.00000  3250.00000  5.474987486090e-03
3250.00000  3300.00000  5.221976138651e-03
3300.00000  3350.00000  5.271688045626e-03
3350.00000  3400.00000  5.160392731503e-03
3400.00000  3450.00000  5.038709854728e-03
3450.00000  3500.00000  4.971932666254e-03
3500.00000  3550.00000  4.869540977261e-03
3550.00000  3600.00000  4.674403193166e-03
3600.00000  3650.00000  4.543074722500e-03
3650.00000  3700.00000  4.477039502787e-03
3700.00000  3750.00000  4.295999125147e-03
3750.00000  3800.00000  4.235157686760e-03
3800.00000  3850.00000  4.196575311198e-03
3850.00000  3900.00000  4.156508998113e-03
3900.00000  3950.00000  3.962855151539e-03
3950.00000  4000.00000  3.991791933211e-03
4000.00000  4050.00000  3.792202336551e-03
4050.00000  4100.00000  3.654196147038e-03
4100.00000  4150.00000  3.632679052974e-03
4150.00000  4200.00000  3.522125707612e-03
4200.00000  4250.00000  3.436057331357e-03
4250.00000  4300.00000  3.345537142537e-03
4300.00000  4350.00000  3.306212798214e-03
4350.00000  4400.00000  3.237209703457e-03
4400.00000  4450.00000  3.107365170314e-03
4450.00000  4500.00000  3.125914389334e-03
4500.00000  4550.00000  3.052459482013e-03
4550.00000  4600.00000  2.924098886391e-03
4600.00000  4650.00000  3.010167262646e-03
4650.00000  4700.00000  2.854353822874e-03
4700.00000  4750.00000  2.760865759011e-03
4750.00000  4800.00000  2.714121727079e-03
4800.00000  4850.00000  2.654764226214e-03
4850.00000  4900.00000  2.643634694801e-03
4900.00000  4950.00000  2.544210880852e-03
4950.00000  5000.00000  2.504144567767e-03
5000.00000  5050.00000  2.417334222751e-03
5050.00000  5100.00000  2.398785003731e-03
5100.00000  5150.00000  2.352782940560e-03
5150.00000  5200.00000  2.391365316123e-03
5200.00000  5250.00000  2.274876220674e-03
5250.00000  5300.00000  2.223680376177e-03
5300.00000  5350.00000  2.193259656984e-03
5350.00000  5400.00000  2.059705280036e-03
5400.00000  5450.00000  2.130192312314e-03
5450.00000  5500.00000  1.980314622628e-03
5500.00000  5550.00000  2.012961248104e-03
5550.00000  5600.00000  1.963991309890e-03
5600.00000  5650.00000  1.955087684761e-03
5650.00000  5700.00000  1.900181996460e-03
5700.00000  5750.00000  1.782208963489e-03
5750.00000  5800.00000  1.748078400492e-03
5800.00000  5850.00000  1.787402744815e-03
5850.00000  5900.00000  1.760691869426e-03
5900.00000  5950.00000  1.701334368560e-03
5950.00000  6000.00000  1.654590336628e-03
6000.00000  6050.00000  1.697624524756e-03
6050.00000  6100.00000  1.622685679913e-03
6100.00000  6150.00000  1.593748898241e-03
6150.00000  6200.00000  1.576683616742e-03
6200.00000  6250.00000  1.577425585503e-03
6250.00000  6300.00000  1.518068084638e-03
6300.00000  6350.00000  1.473549958988e-03
6350.00000  6400.00000  1.727303275189e-03
6400.00000  6450.00000  1.375610082560e-03
6450.00000  6500.00000  1.351125113453e-03
6500.00000  6550.00000  1.364480551148e-03
6550.00000  6600.00000  1.376352051321e-03
6600.00000  6650.00000  1.345931332127e-03
6650.00000  6700.00000  1.281380049936e-03
6700.00000  6750.00000  1.248733424460e-03
6750.00000  6800.00000  1.296219425152e-03
6800.00000  6850.00000  1.258379018351e-03
6850.00000  6900.00000  1.200505455007e-03
6900.00000  6950.00000  1.224248455353e-03
6950.00000  7000.00000  1.196795611203e-03
7000.00000  7050.00000  1.173794579617e-03
7050.00000  7100.00000  1.160439141922e-03
7100.00000  7150.00000  1.114437078752e-03
7150.00000  7200.00000  1.052111702843e-03
7200.00000  7250.00000  1.036530358865e-03
7250.00000  7300.00000  9.875604206513e-04
7300.00000  7350.00000  1.026884764975e-03
7350.00000  7400.00000  9.986899520636e-04
7400.00000  7450.00000  9.905282956946e-04
7450.00000  7500.00000  1.010561452237e-03
7500.00000  7550.00000  9.653013578267e-04
7550.00000  7600.00000  9.319127635898e-04
7600.00000  7650.00000  9.155894508518e-04
7650.00000  7700.00000  9.326547323507e-04
7700.00000  7750.00000  9.237511072208e-04
7750.00000  7800.00000  8.740392002459e-04
7800.00000  7850.00000  9.348806386331e-04
7850.00000  7900.00000  7.976164178814e-04
7900.00000  7950.00000  7.983583866422e-04
7950.00000  8000.00000  8.228433557493e-04
8000.00000  8050.00000  8.451024185739e-04
8050.00000  8100.00000  8.013262616855e-04
8100.00000  8150.00000  8.005842929247e-04
8150.00000  8200.00000  7.812931051434e-04
8200.00000  8250.00000  7.976164178814e-04
8250.00000  8300.00000  7.857449177083e-04
8300.00000  8350.00000  7.657117611662e-04
8350.00000  8400.00000  7.456786046240e-04
8400.00000  8450.00000  7.671956986878e-04
8450.00000  8500.00000  6.944827601275e-04
8500.00000  8550.00000  7.271293856035e-04
8550.00000  8600.00000  7.397428545375e-04
8600.00000  8650.00000  6.900309475625e-04
8650.00000  8700.00000  6.596102283689e-04
8700.00000  8750.00000  7.063542603006e-04
8750.00000  8800.00000  6.878050412801e-04
8800.00000  8850.00000  6.722236973029e-04
8850.00000  8900.00000  6.521905407607e-04
8900.00000  8950.00000  6.751915723461e-04
8950.00000  9000.00000  6.165760402414e-04
9000.00000  9050.00000  6.277055716537e-04
9050.00000  9100.00000  6.380931343051e-04
9100.00000  9150.00000  5.972848524600e-04
9150.00000  9200.00000  5.928330398951e-04
9200.00000  9250.00000  5.987687899817e-04
9250.00000  9300.00000  5.965428836992e-04
9300.00000  9350.00000  5.727998833530e-04
9350.00000  9400.00000  5.698320083097e-04
9400.00000  9450.00000  5.698320083097e-04
9450.00000  9500.00000  5.468309767243e-04
9500.00000  9550.00000  5.868972898086e-04
9550.00000  9600.00000  5.208620700956e-04
9600.00000  9650.00000  5.497988517676e-04
9650.00000  9700.00000  5.438631016810e-04
9700.00000  9750.00000  5.290237264646e-04
9750.00000  9800.00000  5.490568830067e-04
9800.00000  9850.00000  5.097325386833e-04
9850.00000  9900.00000  4.748600069248e-04
9900.00000  9950.00000  5.023128510751e-04
9950.00000  10000.00000  4.978610385102e-04
