300.00000  350.00000  1.920336657140e-05
350.00000  400.00000  3.768207780048e-05
400.00000  450.00000  2.862388602152e-05
450.00000  500.00000  2.101500492719e-05
500.00000  550.00000  2.021788405064e-04
550.00000  600.00000  2.355129862530e-05
600.00000  650.00000  6.485665313736e-05
650.00000  700.00000  2.355129862530e-05
700.00000  750.00000  4.166768218322e-05
750.00000  800.00000  3.116017971963e-05
800.00000  850.00000  1.257277018920e-04
850.00000  900.00000  2.934854136384e-05
900.00000  950.00000  2.572526465225e-05
950.00000  1000.00000  2.355129862530e-05
1000.00000  1050.00000  2.934854136384e-05
1050.00000  1100.00000  2.572526465225e-05
1100.00000  1150.00000  3.007319670615e-05
1150.00000  1200.00000  3.079785204847e-05
1200.00000  1250.00000  3.333414574658e-05
1250.00000  1300.00000  8.043674299718e-05
1300.00000  1350.00000  3.116017971963e-05
1350.00000  1400.00000  3.478345643121e-05
1400.00000  1450.00000  2.898621369268e-05
1450.00000  1500.00000  4.239233752554e-05
1500.00000  1550.00000  3.876906081395e-05
1550.00000  1600.00000  3.442112876005e-05
1600.00000  1650.00000  3.442112876005e-05
1650.00000  1700.00000  3.152250739079e-05
1700.00000  1750.00000  1.206551144958e-04
1750.00000  1800.00000  3.550811177353e-05
1800.00000  1850.00000  3.768207780048e-05
1850.00000  1900.00000  3.405880108890e-05
1900.00000  1950.00000  3.804440547164e-05
1950.00000  2000.00000  4.203000985438e-05
2000.00000  2050.00000  3.985604382743e-05
2050.00000  2100.00000  3.043552437731e-05
2100.00000  2150.00000  4.021837149859e-05
2150.00000  2200.00000  4.275466519670e-05
2200.00000  2250.00000  3.949371615627e-05
2250.00000  2300.00000  3.405880108890e-05
2300.00000  2350.00000  1.159448547707e-04
2350.00000  2400.00000  4.203000985438e-05
2400.00000  2450.00000  4.311699286786e-05
2450.00000  2500.00000  4.021837149859e-05
2500.00000  2550.00000  4.058069916975e-05
2550.00000  2600.00000  4.311699286786e-05
2600.00000  2650.00000  4.420397588133e-05
2650.00000  2700.00000  4.166768218322e-05
2700.00000  2750.00000  3.333414574658e-05
2750.00000  2800.00000  3.333414574658e-05
2800.00000  2850.00000  4.094302684091e-05
2850.00000  2900.00000  4.347932053901e-05
2900.00000  2950.00000  3.804440547164e-05
2950.00000  3000.00000  5.289983998913e-05
3000.00000  3050.00000  3.840673314280e-05
3050.00000  3100.00000  3.587043944469e-05
3100.00000  3150.00000  3.478345643121e-05
3150.00000  3200.00000  3.405880108890e-05
3200.00000  3250.00000  3.949371615627e-05
3250.00000  3300.00000  3.442112876005e-05
3300.00000  3350.00000  3.405880108890e-05
3350.00000  3400.00000  3.297181807542e-05
3400.00000  3450.00000  3.079785204847e-05
3450.00000  3500.00000  2.826155835036e-05
3500.00000  3550.00000  3.623276711585e-05
3550.00000  3600.00000  2.862388602152e-05
3600.00000  3650.00000  3.043552437731e-05
3650.00000  3700.00000  3.623276711585e-05
3700.00000  3750.00000  2.934854136384e-05
3750.00000  3800.00000  2.644991999457e-05
3800.00000  3850.00000  2.500060930993e-05
3850.00000  3900.00000  2.862388602152e-05
3900.00000  3950.00000  2.608759232341e-05
3950.00000  4000.00000  2.608759232341e-05
4000.00000  4050.00000  2.536293698109e-05
4050.00000  4100.00000  2.210198794067e-05
4100.00000  4150.00000  2.029034958487e-05
4150.00000  4200.00000  1.992802191372e-05
4200.00000  4250.00000  2.065267725603e-05
4250.00000  4300.00000  2.210198794067e-05
4300.00000  4350.00000  1.956569424256e-05
4350.00000  4400.00000  2.753690300804e-05
4400.00000  4450.00000  2.210198794067e-05
4450.00000  4500.00000  2.210198794067e-05
4500.00000  4550.00000  2.536293698109e-05
4550.00000  4600.00000  1.558008985981e-05
4600.00000  4650.00000  1.847871122908e-05
4650.00000  4700.00000  2.210198794067e-05
4700.00000  4750.00000  2.210198794067e-05
4750.00000  4800.00000  2.246431561182e-05
4800.00000  4850.00000  1.847871122908e-05
4850.00000  4900.00000  2.355129862530e-05
4900.00000  4950.00000  1.992802191372e-05
4950.00000  5000.00000  1.521776218866e-05
5000.00000  5050.00000  1.666707287329e-05
5050.00000  5100.00000  1.485543451750e-05
5100.00000  5150.00000  1.884103890024e-05
5150.00000  5200.00000  1.558008985981e-05
5200.00000  5250.00000  1.231914081939e-05
5250.00000  5300.00000  1.847871122908e-05
5300.00000  5350.00000  1.775405588676e-05
5350.00000  5400.00000  1.884103890024e-05
5400.00000  5450.00000  1.630474520213e-05
5450.00000  5500.00000  1.630474520213e-05
5500.00000  5550.00000  1.884103890024e-05
5550.00000  5600.00000  1.231914081939e-05
5600.00000  5650.00000  1.521776218866e-05
5650.00000  5700.00000  1.449310684634e-05
5700.00000  5750.00000  1.485543451750e-05
5750.00000  5800.00000  1.159448547707e-05
5800.00000  5850.00000  1.014517479244e-05
5850.00000  5900.00000  1.558008985981e-05
5900.00000  5950.00000  1.159448547707e-05
5950.00000  6000.00000  1.485543451750e-05
6000.00000  6050.00000  9.782847121278e-06
6050.00000  6100.00000  1.014517479244e-05
6100.00000  6150.00000  1.086983013475e-05
6150.00000  6200.00000  1.050750246360e-05
6200.00000  6250.00000  9.420519450120e-06
6250.00000  6300.00000  1.702940054445e-05
6300.00000  6350.00000  1.123215780591e-05
6350.00000  6400.00000  1.471050344903e-04
6400.00000  6450.00000  1.050750246360e-05
6450.00000  6500.00000  1.014517479244e-05
6500.00000  6550.00000  9.420519450120e-06
6550.00000  6600.00000  8.695864107803e-06
6600.00000  6650.00000  1.086983013475e-05
6650.00000  6700.00000  9.782847121278e-06
6700.00000  6750.00000  9.058191778961e-06
6750.00000  6800.00000  1.304379616170e-05
6800.00000  6850.00000  1.340612383286e-05
6850.00000  6900.00000  8.333536436645e-06
6900.00000  6950.00000  1.231914081939e-05
6950.00000  7000.00000  8.695864107803e-06
7000.00000  7050.00000  1.195681314823e-05
7050.00000  7100.00000  2.898621369268e-05
7100.00000  7150.00000  6.521898080852e-06
7150.00000  7200.00000  8.333536436645e-06
7200.00000  7250.00000  5.434915067377e-06
7250.00000  7300.00000  7.608881094328e-06
7300.00000  7350.00000  6.884225752011e-06
7350.00000  7400.00000  9.420519450120e-06
7400.00000  7450.00000  7.246553423169e-06
7450.00000  7500.00000  1.304379616170e-05
7500.00000  7550.00000  6.884225752011e-06
7550.00000  7600.00000  7.971208765486e-06
7600.00000  7650.00000  5.072587396218e-06
7650.00000  7700.00000  8.695864107803e-06
7700.00000  7750.00000  5.797242738535e-06
7750.00000  7800.00000  7.246553423169e-06
7800.00000  7850.00000  6.521898080852e-06
7850.00000  7900.00000  8.333536436645e-06
7900.00000  7950.00000  7.608881094328e-06
7950.00000  8000.00000  5.797242738535e-06
8000.00000  8050.00000  6.884225752011e-06
8050.00000  8100.00000  6.521898080852e-06
8100.00000  8150.00000  4.710259725060e-06
8150.00000  8200.00000  8.333536436645e-06
8200.00000  8250.00000  7.246553423169e-06
8250.00000  8300.00000  6.159570409694e-06
8300.00000  8350.00000  5.434915067377e-06
8350.00000  8400.00000  8.333536436645e-06
8400.00000  8450.00000  5.434915067377e-06
8450.00000  8500.00000  7.246553423169e-06
8500.00000  8550.00000  5.797242738535e-06
8550.00000  8600.00000  6.159570409694e-06
8600.00000  8650.00000  3.985604382743e-06
8650.00000  8700.00000  6.159570409694e-06
8700.00000  8750.00000  5.434915067377e-06
8750.00000  8800.00000  7.246553423169e-06
8800.00000  8850.00000  4.710259725060e-06
8850.00000  8900.00000  7.971208765486e-06
8900.00000  8950.00000  3.985604382743e-06
8950.00000  9000.00000  4.710259725060e-06
9000.00000  9050.00000  2.173966026951e-06
9050.00000  9100.00000  6.159570409694e-06
9100.00000  9150.00000  6.884225752011e-06
9150.00000  9200.00000  2.898621369268e-06
9200.00000  9250.00000  2.536293698109e-06
9250.00000  9300.00000  5.797242738535e-06
9300.00000  9350.00000  3.985604382743e-06
9350.00000  9400.00000  3.623276711585e-06
9400.00000  9450.00000  6.521898080852e-06
9450.00000  9500.00000  2.536293698109e-06
9500.00000  9550.00000  5.434915067377e-06
9550.00000  9600.00000  3.985604382743e-06
9600.00000  9650.00000  5.434915067377e-06
9650.00000  9700.00000  3.260949040426e-06
9700.00000  9750.00000  4.710259725060e-06
9750.00000  9800.00000  6.521898080852e-06
9800.00000  9850.00000  4.347932053901e-06
9850.00000  9900.00000  3.260949040426e-06
9900.00000  9950.00000  3.623276711585e-06
9950.00000  10000.00000  4.347932053901e-06
