300.00000  350.00000  2.425803359432e-02
350.00000  400.00000  1.940234969148e-02
400.00000  450.00000  1.577083018448e-02
450.00000  500.00000  1.328152771228e-02
500.00000  550.00000  1.120579702031e-02
550.00000  600.00000  9.614887907698e-03
600.00000  650.00000  8.381842517067e-03
650.00000  700.00000  7.519376818234e-03
700.00000  750.00000  6.658324004936e-03
750.00000  800.00000  5.965606411116e-03
800.00000  850.00000  5.420838116908e-03
850.00000  900.00000  4.929355791456e-03
900.00000  950.00000  4.452204162146e-03
950.00000  1000.00000  4.130873623288e-03
1000.00000  1050.00000  3.830534526667e-03
1050.00000  1100.00000  3.541094832745e-03
1100.00000  1150.00000  3.229048970261e-03
1150.00000  1200.00000  3.043355442780e-03
1200.00000  1250.00000  2.870377885116e-03
1250.00000  1300.00000  2.642095950789e-03
1300.00000  1350.00000  2.500000034108e-03
1350.00000  1400.00000  2.343977102865e-03
1400.00000  1450.00000  2.227111285027e-03
1450.00000  1500.00000  2.124374322540e-03
1500.00000  1550.00000  2.026077857450e-03
1550.00000  1600.00000  1.904973383006e-03
1600.00000  1650.00000  1.802034579728e-03
1650.00000  1700.00000  1.714031994965e-03
1700.00000  1750.00000  1.634708564205e-03
1750.00000  1800.00000  1.553972247908e-03
1800.00000  1850.00000  1.477272747427e-03
1850.00000  1900.00000  1.418940758903e-03
1900.00000  1950.00000  1.347489118981e-03
1950.00000  2000.00000  1.325488472791e-03
2000.00000  2050.00000  1.261908623707e-03
2050.00000  2100.00000  1.184199919273e-03
2100.00000  2150.00000  1.140198626891e-03
2150.00000  2200.00000  1.097004697673e-03
2200.00000  2250.00000  1.036250619660e-03
2250.00000  2300.00000  1.048764748686e-03
2300.00000  2350.00000  1.025754898541e-03
2350.00000  2400.00000  9.411836072214e-04
2400.00000  2450.00000  9.345228611269e-04
2450.00000  2500.00000  9.117148517733e-04
2500.00000  2550.00000  8.604472909253e-04
2550.00000  2600.00000  8.596399277623e-04
2600.00000  2650.00000  7.954545563070e-04
2650.00000  2700.00000  7.962619194699e-04
2700.00000  2750.00000  7.524624678793e-04
2750.00000  2800.00000  7.439851546682e-04
2800.00000  2850.00000  7.219845084776e-04
2850.00000  2900.00000  7.036169965202e-04
2900.00000  2950.00000  6.575972962314e-04
2950.00000  3000.00000  6.563862514870e-04
3000.00000  3050.00000  6.404408290185e-04
3050.00000  3100.00000  6.154125709667e-04
3100.00000  3150.00000  5.922008800316e-04
3150.00000  3200.00000  6.119812775242e-04
3200.00000  3250.00000  5.911916760779e-04
3250.00000  3300.00000  5.649523732817e-04
3300.00000  3350.00000  5.500161547669e-04
3350.00000  3400.00000  5.580897863965e-04
3400.00000  3450.00000  5.431535678818e-04
3450.00000  3500.00000  5.046019768504e-04
3500.00000  3550.00000  5.080332702930e-04
3550.00000  3600.00000  4.680687937264e-04
3600.00000  3650.00000  4.652430226561e-04
3650.00000  3700.00000  4.595914805153e-04
3700.00000  3750.00000  4.511141673043e-04
3750.00000  3800.00000  4.361779487895e-04
3800.00000  3850.00000  4.295172026951e-04
3850.00000  3900.00000  3.986355617118e-04
3900.00000  3950.00000  4.145809841803e-04
3950.00000  4000.00000  4.117552131099e-04
4000.00000  4050.00000  3.931858603618e-04
4050.00000  4100.00000  3.802680497545e-04
4100.00000  4150.00000  3.879379998026e-04
4150.00000  4200.00000  3.633134233323e-04
4200.00000  4250.00000  3.564508364471e-04
4250.00000  4300.00000  3.564508364471e-04
4300.00000  4350.00000  3.433311850490e-04
4350.00000  4400.00000  3.354593942101e-04
4400.00000  4450.00000  3.366704389546e-04
4450.00000  4500.00000  3.376796429083e-04
4500.00000  4550.00000  3.185047677880e-04
4550.00000  4600.00000  3.170918822528e-04
4600.00000  4650.00000  3.053851163899e-04
4650.00000  4700.00000  2.958985992251e-04
4700.00000  4750.00000  2.896415347121e-04
4750.00000  4800.00000  2.819715846640e-04
4800.00000  4850.00000  2.864120820603e-04
4850.00000  4900.00000  2.862102412695e-04
4900.00000  4950.00000  2.882286491769e-04
4950.00000  5000.00000  2.753108385696e-04
5000.00000  5050.00000  2.698611372196e-04
5050.00000  5100.00000  2.609801424270e-04
5100.00000  5150.00000  2.700629780103e-04
5150.00000  5200.00000  2.668335253585e-04
5200.00000  5250.00000  2.397868593993e-04
5250.00000  5300.00000  2.551267594956e-04
5300.00000  5350.00000  2.373647699104e-04
5350.00000  5400.00000  2.486678541919e-04
5400.00000  5450.00000  2.319150685604e-04
5450.00000  5500.00000  2.315113869790e-04
5500.00000  5550.00000  2.204101434883e-04
5550.00000  5600.00000  2.335297948864e-04
5600.00000  5650.00000  2.240432777216e-04
5650.00000  5700.00000  2.111254671142e-04
5700.00000  5750.00000  2.198046211160e-04
5750.00000  5800.00000  2.179880539994e-04
5800.00000  5850.00000  2.159696460920e-04
5850.00000  5900.00000  2.018407907402e-04
5900.00000  5950.00000  2.133457158123e-04
5950.00000  6000.00000  2.040610394383e-04
6000.00000  6050.00000  2.026481539031e-04
6050.00000  6100.00000  1.939689999013e-04
6100.00000  6150.00000  1.925561143661e-04
6150.00000  6200.00000  1.931616367383e-04
6200.00000  6250.00000  1.923542735754e-04
6250.00000  6300.00000  1.943726814828e-04
6300.00000  6350.00000  1.925561143661e-04
6350.00000  6400.00000  2.113273079049e-04
6400.00000  6450.00000  1.756014879439e-04
6450.00000  6500.00000  1.679315378958e-04
6500.00000  6550.00000  1.780235774328e-04
6550.00000  6600.00000  1.756014879439e-04
6600.00000  6650.00000  1.768125326884e-04
6650.00000  6700.00000  1.675278563143e-04
6700.00000  6750.00000  1.715646721291e-04
6750.00000  6800.00000  1.525916377996e-04
6800.00000  6850.00000  1.523897970088e-04
6850.00000  6900.00000  1.604634286384e-04
6900.00000  6950.00000  1.550137272884e-04
6950.00000  7000.00000  1.542063641255e-04
7000.00000  7050.00000  1.457290509144e-04
7050.00000  7100.00000  1.604634286384e-04
7100.00000  7150.00000  1.447198469607e-04
7150.00000  7200.00000  1.362425337496e-04
7200.00000  7250.00000  1.465364140774e-04
7250.00000  7300.00000  1.511787522644e-04
7300.00000  7350.00000  1.422977574718e-04
7350.00000  7400.00000  1.328112403070e-04
7400.00000  7450.00000  1.332149218885e-04
7450.00000  7500.00000  1.293799468644e-04
7500.00000  7550.00000  1.334167626792e-04
7550.00000  7600.00000  1.374535784940e-04
7600.00000  7650.00000  1.410867127274e-04
7650.00000  7700.00000  1.313983547718e-04
7700.00000  7750.00000  1.249394494682e-04
7750.00000  7800.00000  1.247376086774e-04
7800.00000  7850.00000  1.204989520719e-04
7850.00000  7900.00000  1.237284047237e-04
7900.00000  7950.00000  1.299854692367e-04
7950.00000  8000.00000  1.154529323034e-04
8000.00000  8050.00000  1.227192007700e-04
8050.00000  8100.00000  1.233247231422e-04
8100.00000  8150.00000  1.172694994200e-04
8150.00000  8200.00000  1.112142756978e-04
8200.00000  8250.00000  1.116179572793e-04
8250.00000  8300.00000  1.140400467682e-04
8300.00000  8350.00000  1.142418875589e-04
8350.00000  8400.00000  1.033424848590e-04
8400.00000  8450.00000  1.110124349071e-04
8450.00000  8500.00000  1.073793006738e-04
8500.00000  8550.00000  1.067737783015e-04
8550.00000  8600.00000  1.007185545793e-04
8600.00000  8650.00000  1.021314401145e-04
8650.00000  8700.00000  1.031406440682e-04
8700.00000  8750.00000  1.001130322071e-04
8750.00000  8800.00000  1.043516888127e-04
8800.00000  8850.00000  9.708542034602e-05
8850.00000  8900.00000  1.007185545793e-04
8900.00000  8950.00000  1.027369624867e-04
8950.00000  9000.00000  9.062651504233e-05
9000.00000  9050.00000  9.890198746268e-05
9050.00000  9100.00000  9.829646509046e-05
9100.00000  9150.00000  9.688357955528e-05
9150.00000  9200.00000  9.304860453121e-05
9200.00000  9250.00000  9.304860453121e-05
9250.00000  9300.00000  9.466333085714e-05
9300.00000  9350.00000  8.961731108863e-05
9350.00000  9400.00000  9.224124136825e-05
9400.00000  9450.00000  9.163571899603e-05
9450.00000  9500.00000  8.901178871641e-05
9500.00000  9550.00000  8.537865448309e-05
9550.00000  9600.00000  8.719522159975e-05
9600.00000  9650.00000  9.002099267011e-05
9650.00000  9700.00000  8.356208736643e-05
9700.00000  9750.00000  9.405780848491e-05
9750.00000  9800.00000  8.174552024977e-05
9800.00000  9850.00000  8.053447550532e-05
9850.00000  9900.00000  8.800258476271e-05
9900.00000  9950.00000  8.295656499421e-05
9950.00000  10000.00000  7.488293336460e-05
