300.00000  350.00000  4.283951518471e-05
350.00000  400.00000  4.748046266305e-05
400.00000  450.00000  3.212963638853e-05
450.00000  500.00000  2.820268082993e-05
500.00000  550.00000  1.617191698223e-04
550.00000  600.00000  1.999177375286e-05
600.00000  650.00000  5.926132933884e-05
650.00000  700.00000  2.070576567261e-05
700.00000  750.00000  4.069753942547e-05
750.00000  800.00000  2.391872931146e-05
800.00000  850.00000  8.853499804839e-05
850.00000  900.00000  2.213374951210e-05
900.00000  950.00000  1.677881011401e-05
950.00000  1000.00000  2.070576567261e-05
1000.00000  1050.00000  2.141975759235e-05
1050.00000  1100.00000  2.570370911082e-05
1100.00000  1150.00000  2.998766062929e-05
1150.00000  1200.00000  2.677469699044e-05
1200.00000  1250.00000  2.677469699044e-05
1250.00000  1300.00000  7.354116773375e-05
1300.00000  1350.00000  2.391872931146e-05
1350.00000  1400.00000  2.748868891019e-05
1400.00000  1450.00000  2.427572527133e-05
1450.00000  1500.00000  2.748868891019e-05
1500.00000  1550.00000  3.712757982675e-05
1550.00000  1600.00000  3.962655154585e-05
1600.00000  1650.00000  3.034465658917e-05
1650.00000  1700.00000  3.712757982675e-05
1700.00000  1750.00000  1.117397354401e-04
1750.00000  1800.00000  3.141564446878e-05
1800.00000  1850.00000  3.498560406751e-05
1850.00000  1900.00000  3.605659194713e-05
1900.00000  1950.00000  3.141564446878e-05
1950.00000  2000.00000  3.427161214776e-05
2000.00000  2050.00000  4.141153134522e-05
2050.00000  2100.00000  3.141564446878e-05
2100.00000  2150.00000  3.391461618789e-05
2150.00000  2200.00000  3.320062426815e-05
2200.00000  2250.00000  4.105453538534e-05
2250.00000  2300.00000  3.784157174649e-05
2300.00000  2350.00000  1.213786263567e-04
2350.00000  2400.00000  3.855556366624e-05
2400.00000  2450.00000  4.105453538534e-05
2450.00000  2500.00000  4.426749902420e-05
2500.00000  2550.00000  3.998354750573e-05
2550.00000  2600.00000  4.355350710445e-05
2600.00000  2650.00000  4.569548286369e-05
2650.00000  2700.00000  4.319651114458e-05
2700.00000  2750.00000  3.534260002738e-05
2750.00000  2800.00000  3.855556366624e-05
2800.00000  2850.00000  4.105453538534e-05
2850.00000  2900.00000  4.819445458279e-05
2900.00000  2950.00000  4.748046266305e-05
2950.00000  3000.00000  7.818211521209e-05
3000.00000  3050.00000  4.034054346560e-05
3050.00000  3100.00000  4.712346670318e-05
3100.00000  3150.00000  3.784157174649e-05
3150.00000  3200.00000  5.105042226177e-05
3200.00000  3250.00000  4.212552326496e-05
3250.00000  3300.00000  3.677058386687e-05
3300.00000  3350.00000  4.855145054267e-05
3350.00000  3400.00000  4.712346670318e-05
3400.00000  3450.00000  5.105042226177e-05
3450.00000  3500.00000  4.426749902420e-05
3500.00000  3550.00000  4.783745862292e-05
3550.00000  3600.00000  4.748046266305e-05
3600.00000  3650.00000  5.783334549935e-05
3650.00000  3700.00000  7.604013945285e-05
3700.00000  3750.00000  5.819034145923e-05
3750.00000  3800.00000  4.819445458279e-05
3800.00000  3850.00000  5.497737782037e-05
3850.00000  3900.00000  5.247840610126e-05
3900.00000  3950.00000  5.140741822165e-05
3950.00000  4000.00000  5.212141014139e-05
4000.00000  4050.00000  5.783334549935e-05
4050.00000  4100.00000  5.319239802101e-05
4100.00000  4150.00000  4.748046266305e-05
4150.00000  4200.00000  4.962243842228e-05
4200.00000  4250.00000  4.248251922483e-05
4250.00000  4300.00000  5.390638994075e-05
4300.00000  4350.00000  5.640536165986e-05
4350.00000  4400.00000  5.533437378025e-05
4400.00000  4450.00000  5.069342630190e-05
4450.00000  4500.00000  4.890844650254e-05
4500.00000  4550.00000  5.604836569999e-05
4550.00000  4600.00000  5.783334549935e-05
4600.00000  4650.00000  6.568725661655e-05
4650.00000  4700.00000  5.140741822165e-05
4700.00000  4750.00000  5.390638994075e-05
4750.00000  4800.00000  5.676235761974e-05
4800.00000  4850.00000  5.640536165986e-05
4850.00000  4900.00000  5.069342630190e-05
4900.00000  4950.00000  5.319239802101e-05
4950.00000  5000.00000  5.533437378025e-05
5000.00000  5050.00000  5.926132933884e-05
5050.00000  5100.00000  6.247429297770e-05
5100.00000  5150.00000  5.462038186050e-05
5150.00000  5200.00000  6.140330509808e-05
5200.00000  5250.00000  5.819034145923e-05
5250.00000  5300.00000  5.212141014139e-05
5300.00000  5350.00000  5.783334549935e-05
5350.00000  5400.00000  6.176030105795e-05
5400.00000  5450.00000  7.318417177387e-05
5450.00000  5500.00000  5.390638994075e-05
5500.00000  5550.00000  5.961832529872e-05
5550.00000  5600.00000  5.997532125859e-05
5600.00000  5650.00000  4.212552326496e-05
5650.00000  5700.00000  6.390227681719e-05
5700.00000  5750.00000  5.354939398088e-05
5750.00000  5800.00000  5.283540206114e-05
5800.00000  5850.00000  5.961832529872e-05
5850.00000  5900.00000  6.711524045604e-05
5900.00000  5950.00000  5.997532125859e-05
5950.00000  6000.00000  6.390227681719e-05
6000.00000  6050.00000  5.819034145923e-05
6050.00000  6100.00000  6.461626873693e-05
6100.00000  6150.00000  5.462038186050e-05
6150.00000  6200.00000  6.176030105795e-05
6200.00000  6250.00000  6.461626873693e-05
6250.00000  6300.00000  7.675413137260e-05
6300.00000  6350.00000  7.604013945285e-05
6350.00000  6400.00000  6.790063156776e-04
6400.00000  6450.00000  6.176030105795e-05
6450.00000  6500.00000  6.283128893757e-05
6500.00000  6550.00000  6.140330509808e-05
6550.00000  6600.00000  5.854733741910e-05
6600.00000  6650.00000  5.533437378025e-05
6650.00000  6700.00000  5.033643034203e-05
6700.00000  6750.00000  5.105042226177e-05
6750.00000  6800.00000  5.997532125859e-05
6800.00000  6850.00000  5.640536165986e-05
6850.00000  6900.00000  6.854322429553e-05
6900.00000  6950.00000  5.247840610126e-05
6950.00000  7000.00000  5.283540206114e-05
7000.00000  7050.00000  5.176441418152e-05
7050.00000  7100.00000  1.210216303968e-04
7100.00000  7150.00000  3.641358790700e-05
7150.00000  7200.00000  4.105453538534e-05
7200.00000  7250.00000  3.391461618789e-05
7250.00000  7300.00000  3.677058386687e-05
7300.00000  7350.00000  3.284362830827e-05
7350.00000  7400.00000  3.212963638853e-05
7400.00000  7450.00000  2.927366870955e-05
7450.00000  7500.00000  6.140330509808e-05
7500.00000  7550.00000  3.284362830827e-05
7550.00000  7600.00000  4.212552326496e-05
7600.00000  7650.00000  4.141153134522e-05
7650.00000  7700.00000  3.105864850891e-05
7700.00000  7750.00000  3.355762022802e-05
7750.00000  7800.00000  3.391461618789e-05
7800.00000  7850.00000  3.141564446878e-05
7850.00000  7900.00000  3.070165254904e-05
7900.00000  7950.00000  3.677058386687e-05
7950.00000  8000.00000  3.355762022802e-05
8000.00000  8050.00000  3.105864850891e-05
8050.00000  8100.00000  3.427161214776e-05
8100.00000  8150.00000  3.855556366624e-05
8150.00000  8200.00000  3.427161214776e-05
8200.00000  8250.00000  3.534260002738e-05
8250.00000  8300.00000  3.498560406751e-05
8300.00000  8350.00000  2.641770103057e-05
8350.00000  8400.00000  3.427161214776e-05
8400.00000  8450.00000  3.427161214776e-05
8450.00000  8500.00000  2.963066466942e-05
8500.00000  8550.00000  3.391461618789e-05
8550.00000  8600.00000  3.248663234840e-05
8600.00000  8650.00000  2.891667274968e-05
8650.00000  8700.00000  3.070165254904e-05
8700.00000  8750.00000  2.855967678980e-05
8750.00000  8800.00000  3.284362830827e-05
8800.00000  8850.00000  3.391461618789e-05
8850.00000  8900.00000  2.963066466942e-05
8900.00000  8950.00000  2.498971719108e-05
8950.00000  9000.00000  3.320062426815e-05
9000.00000  9050.00000  3.034465658917e-05
9050.00000  9100.00000  3.177264042866e-05
9100.00000  9150.00000  3.427161214776e-05
9150.00000  9200.00000  2.677469699044e-05
9200.00000  9250.00000  3.391461618789e-05
9250.00000  9300.00000  3.391461618789e-05
9300.00000  9350.00000  3.141564446878e-05
9350.00000  9400.00000  3.105864850891e-05
9400.00000  9450.00000  3.105864850891e-05
9450.00000  9500.00000  3.355762022802e-05
9500.00000  9550.00000  3.248663234840e-05
9550.00000  9600.00000  2.748868891019e-05
9600.00000  9650.00000  2.641770103057e-05
9650.00000  9700.00000  3.070165254904e-05
9700.00000  9750.00000  2.498971719108e-05
9750.00000  9800.00000  3.498560406751e-05
9800.00000  9850.00000  2.284774143184e-05
9850.00000  9900.00000  2.713169295031e-05
9900.00000  9950.00000  2.820268082993e-05
9950.00000  10000.00000  3.212963638853e-05
