300.00000  350.00000  1.305990745404e+00
350.00000  400.00000  9.234485790626e-01
400.00000  450.00000  6.805540750071e-01
450.00000  500.00000  5.221520966207e-01
500.00000  550.00000  4.094752719922e-01
550.00000  600.00000  3.292653289672e-01
600.00000  650.00000  2.695272629416e-01
650.00000  700.00000  2.237477750955e-01
700.00000  750.00000  1.880932936525e-01
750.00000  800.00000  1.604259231708e-01
800.00000  850.00000  1.387073807040e-01
850.00000  900.00000  1.201817205574e-01
900.00000  950.00000  1.051658915788e-01
950.00000  1000.00000  9.270150082391e-02
1000.00000  1050.00000  8.204673706125e-02
1050.00000  1100.00000  7.270957493678e-02
1100.00000  1150.00000  6.517147484292e-02
1150.00000  1200.00000  5.926566131458e-02
1200.00000  1250.00000  5.335531994556e-02
1250.00000  1300.00000  4.857165626602e-02
1300.00000  1350.00000  4.391552676565e-02
1350.00000  1400.00000  4.031212022364e-02
1400.00000  1450.00000  3.721205863734e-02
1450.00000  1500.00000  3.405087120184e-02
1500.00000  1550.00000  3.122927181742e-02
1550.00000  1600.00000  2.919853527196e-02
1600.00000  1650.00000  2.715496984458e-02
1650.00000  1700.00000  2.517856738729e-02
1700.00000  1750.00000  2.341044560134e-02
1750.00000  1800.00000  2.191399425624e-02
1800.00000  1850.00000  2.040094082865e-02
1850.00000  1900.00000  1.911050623455e-02
1900.00000  1950.00000  1.782988196192e-02
1950.00000  2000.00000  1.691374886412e-02
2000.00000  2050.00000  1.585197022441e-02
2050.00000  2100.00000  1.532372214495e-02
2100.00000  2150.00000  1.433740751659e-02
2150.00000  2200.00000  1.342504761936e-02
2200.00000  2250.00000  1.262060125836e-02
2250.00000  2300.00000  1.213083982469e-02
2300.00000  2350.00000  1.131431922187e-02
2350.00000  2400.00000  1.064646272141e-02
2400.00000  2450.00000  1.039214900316e-02
2450.00000  2500.00000  9.759005947923e-03
2500.00000  2550.00000  9.412626135822e-03
2550.00000  2600.00000  8.979462710666e-03
2600.00000  2650.00000  8.572711689484e-03
2650.00000  2700.00000  8.098043058086e-03
2700.00000  2750.00000  7.721477641444e-03
2750.00000  2800.00000  7.316235900488e-03
2800.00000  2850.00000  7.128330512224e-03
2850.00000  2900.00000  6.907220958965e-03
2900.00000  2950.00000  6.597818512426e-03
2950.00000  3000.00000  6.377463599281e-03
3000.00000  3050.00000  6.141261243752e-03
3050.00000  3100.00000  5.823557755964e-03
3100.00000  3150.00000  5.625842046224e-03
3150.00000  3200.00000  5.434918097506e-03
3200.00000  3250.00000  5.239466308106e-03
3250.00000  3300.00000  4.972323707923e-03
3300.00000  3350.00000  4.785172959773e-03
3350.00000  3400.00000  4.742158473303e-03
3400.00000  3450.00000  4.416153944266e-03
3450.00000  3500.00000  4.358046655526e-03
3500.00000  3550.00000  4.206363992710e-03
3550.00000  3600.00000  4.187497989872e-03
3600.00000  3650.00000  3.894697625830e-03
3650.00000  3700.00000  3.878095543333e-03
3700.00000  3750.00000  3.796594411073e-03
3750.00000  3800.00000  3.561901335772e-03
3800.00000  3850.00000  3.487946604647e-03
3850.00000  3900.00000  3.359657785351e-03
3900.00000  3950.00000  3.276647372864e-03
3950.00000  4000.00000  3.122700789708e-03
4000.00000  4050.00000  3.035162536541e-03
4050.00000  4100.00000  2.935550041557e-03
4100.00000  4150.00000  2.844238587823e-03
4150.00000  4200.00000  2.718213688866e-03
4200.00000  4250.00000  2.749908573634e-03
4250.00000  4300.00000  2.617091913656e-03
4300.00000  4350.00000  2.488803094359e-03
4350.00000  4400.00000  2.503141256516e-03
4400.00000  4450.00000  2.336365791430e-03
4450.00000  4500.00000  2.323536909500e-03
4500.00000  4550.00000  2.238262576673e-03
4550.00000  4600.00000  2.195248090203e-03
4600.00000  4650.00000  2.222415134290e-03
4650.00000  4700.00000  2.071487111587e-03
4700.00000  4750.00000  2.100918076014e-03
4750.00000  4800.00000  2.008097342053e-03
4800.00000  4850.00000  1.992249899669e-03
4850.00000  4900.00000  1.960555014901e-03
4900.00000  4950.00000  1.853396118783e-03
4950.00000  5000.00000  1.805099151518e-03
5000.00000  5050.00000  1.854905399010e-03
5050.00000  5100.00000  1.767367145843e-03
5100.00000  5150.00000  1.754538263913e-03
5150.00000  5200.00000  1.705486656535e-03
5200.00000  5250.00000  1.589272079054e-03
5250.00000  5300.00000  1.562859675081e-03
5300.00000  5350.00000  1.554558633832e-03
5350.00000  5400.00000  1.545502952470e-03
5400.00000  5450.00000  1.448909017941e-03
5450.00000  5500.00000  1.497205985206e-03
5500.00000  5550.00000  1.464001820211e-03
5550.00000  5600.00000  1.415704852946e-03
5600.00000  5650.00000  1.400612050676e-03
5650.00000  5700.00000  1.342504761936e-03
5700.00000  5750.00000  1.252702588428e-03
5750.00000  5800.00000  1.254211868655e-03
5800.00000  5850.00000  1.280624272628e-03
5850.00000  5900.00000  1.226290184455e-03
5900.00000  5950.00000  1.214215942639e-03
5950.00000  6000.00000  1.196859220028e-03
6000.00000  6050.00000  1.168182895715e-03
6050.00000  6100.00000  1.205160261277e-03
6100.00000  6150.00000  1.104038486066e-03
6150.00000  6200.00000  1.085927123342e-03
6200.00000  6250.00000  1.061778639710e-03
6250.00000  6300.00000  1.038384796191e-03
6300.00000  6350.00000  1.010463111991e-03
6350.00000  6400.00000  1.321374838758e-03
6400.00000  6450.00000  1.018764153240e-03
6450.00000  6500.00000  9.983888701750e-04
6500.00000  6550.00000  9.719764662021e-04
6550.00000  6600.00000  9.266980593914e-04
6600.00000  6650.00000  9.523558232508e-04
6650.00000  6700.00000  8.950031746240e-04
6700.00000  6750.00000  8.836835729213e-04
6750.00000  6800.00000  8.965124548510e-04
6800.00000  6850.00000  8.859474932618e-04
6850.00000  6900.00000  8.210484434999e-04
6900.00000  6950.00000  8.965124548510e-04
6950.00000  7000.00000  8.119927621378e-04
7000.00000  7050.00000  8.127474022513e-04
7050.00000  7100.00000  8.323680452025e-04
7100.00000  7150.00000  8.097288417972e-04
7150.00000  7200.00000  7.372833909002e-04
7200.00000  7250.00000  7.463390722623e-04
7250.00000  7300.00000  7.206813084029e-04
7300.00000  7350.00000  7.629411547595e-04
7350.00000  7400.00000  6.950235445436e-04
7400.00000  7450.00000  6.603100993221e-04
7450.00000  7500.00000  6.844585829544e-04
7500.00000  7550.00000  6.927596242030e-04
7550.00000  7600.00000  6.701204207977e-04
7600.00000  7650.00000  6.678565004572e-04
7650.00000  7700.00000  6.346523354627e-04
7700.00000  7750.00000  6.520090580734e-04
7750.00000  7800.00000  6.323884151222e-04
7800.00000  7850.00000  6.429533767113e-04
7850.00000  7900.00000  5.705079258143e-04
7900.00000  7950.00000  6.044667309222e-04
7950.00000  8000.00000  5.878646484250e-04
8000.00000  8050.00000  5.516419229765e-04
8050.00000  8100.00000  5.878646484250e-04
8100.00000  8150.00000  5.644708049062e-04
8150.00000  8200.00000  5.652254450197e-04
8200.00000  8250.00000  5.667347252467e-04
8250.00000  8300.00000  5.327759201387e-04
8300.00000  8350.00000  5.124006370739e-04
8350.00000  8400.00000  5.252295190036e-04
8400.00000  8450.00000  5.146645574144e-04
8450.00000  8500.00000  5.335305602522e-04
8500.00000  8550.00000  4.678768703768e-04
8550.00000  8600.00000  4.701407907173e-04
8600.00000  8650.00000  4.912707138956e-04
8650.00000  8700.00000  4.942892743497e-04
8700.00000  8750.00000  4.822150325335e-04
8750.00000  8800.00000  4.475015873120e-04
8800.00000  8850.00000  4.761779116254e-04
8850.00000  8900.00000  4.701407907173e-04
8900.00000  8950.00000  3.999592601608e-04
8950.00000  9000.00000  4.467469471985e-04
9000.00000  9050.00000  4.059963810689e-04
9050.00000  9100.00000  4.278809443607e-04
9100.00000  9150.00000  4.218438234526e-04
9150.00000  9200.00000  4.316541449282e-04
9200.00000  9250.00000  4.037324607283e-04
9250.00000  9300.00000  3.976953398203e-04
9300.00000  9350.00000  4.173159827715e-04
9350.00000  9400.00000  3.682643753933e-04
9400.00000  9450.00000  3.848664578906e-04
9450.00000  9500.00000  3.954314194797e-04
9500.00000  9550.00000  3.856210980041e-04
9550.00000  9600.00000  4.052417409554e-04
9600.00000  9650.00000  3.818478974365e-04
9650.00000  9700.00000  3.554354934636e-04
9700.00000  9750.00000  3.267591691502e-04
9750.00000  9800.00000  3.576994138042e-04
9800.00000  9850.00000  3.410973313069e-04
9850.00000  9900.00000  3.682643753933e-04
9900.00000  9950.00000  3.380787708529e-04
9950.00000  10000.00000  3.576994138042e-04
