300.00000  350.00000  3.368911938220e-05
350.00000  400.00000  4.104651327026e-05
400.00000  450.00000  3.794866321213e-05
450.00000  500.00000  3.717420069760e-05
500.00000  550.00000  4.104651327026e-05
550.00000  600.00000  2.149133477830e-05
600.00000  650.00000  1.994240974923e-05
650.00000  700.00000  2.613810986550e-05
700.00000  750.00000  2.768703489456e-05
750.00000  800.00000  2.420195357916e-05
800.00000  850.00000  3.891674135530e-05
850.00000  900.00000  2.284664417873e-05
900.00000  950.00000  2.304025980736e-05
950.00000  1000.00000  2.788065052320e-05
1000.00000  1050.00000  2.633172549413e-05
1050.00000  1100.00000  2.478280046506e-05
1100.00000  1150.00000  2.613810986550e-05
1150.00000  1200.00000  2.923595992363e-05
1200.00000  1250.00000  2.942957555226e-05
1250.00000  1300.00000  4.278905392796e-05
1300.00000  1350.00000  2.981680680953e-05
1350.00000  1400.00000  3.485081315400e-05
1400.00000  1450.00000  3.639973818306e-05
1450.00000  1500.00000  4.143374452753e-05
1500.00000  1550.00000  4.685498212926e-05
1550.00000  1600.00000  4.491882584293e-05
1600.00000  1650.00000  5.150175721646e-05
1650.00000  1700.00000  5.518045416050e-05
1700.00000  1750.00000  1.010673581466e-04
1750.00000  1800.00000  5.595491667503e-05
1800.00000  1850.00000  6.679739187850e-05
1850.00000  1900.00000  6.970162630799e-05
1900.00000  1950.00000  7.628455768153e-05
1950.00000  2000.00000  8.248025779779e-05
2000.00000  2050.00000  7.860794522513e-05
2050.00000  2100.00000  9.041849857176e-05
2100.00000  2150.00000  9.796950808846e-05
2150.00000  2200.00000  1.124906802360e-04
2200.00000  2250.00000  1.202353053813e-04
2250.00000  2300.00000  1.237203866967e-04
2300.00000  2350.00000  2.052325663513e-04
2350.00000  2400.00000  1.392096369874e-04
2400.00000  2450.00000  1.502457278195e-04
2450.00000  2500.00000  1.496648809336e-04
2500.00000  2550.00000  1.425011026741e-04
2550.00000  2600.00000  1.715434469691e-04
2600.00000  2650.00000  1.674775187678e-04
2650.00000  2700.00000  1.880007754030e-04
2700.00000  2750.00000  2.077495695236e-04
2750.00000  2800.00000  2.137516540112e-04
2800.00000  2850.00000  2.222707416711e-04
2850.00000  2900.00000  2.323387543600e-04
2900.00000  2950.00000  2.460854639929e-04
2950.00000  3000.00000  2.942957555226e-04
3000.00000  3050.00000  2.776448114602e-04
3050.00000  3100.00000  2.898425960641e-04
3100.00000  3150.00000  3.070743870124e-04
3150.00000  3200.00000  3.264359498758e-04
3200.00000  3250.00000  3.318571874775e-04
3250.00000  3300.00000  3.444422033387e-04
3300.00000  3350.00000  3.659335381170e-04
3350.00000  3400.00000  3.717420069760e-04
3400.00000  3450.00000  3.851014853517e-04
3450.00000  3500.00000  4.280841549083e-04
3500.00000  3550.00000  4.333117768814e-04
3550.00000  3600.00000  4.590626554896e-04
3600.00000  3650.00000  4.753263682948e-04
3650.00000  3700.00000  5.388322944865e-04
3700.00000  3750.00000  5.034006344466e-04
3750.00000  3800.00000  5.248919692249e-04
3800.00000  3850.00000  5.500620009473e-04
3850.00000  3900.00000  5.521917728622e-04
3900.00000  3950.00000  5.823958109290e-04
3950.00000  4000.00000  5.895595891885e-04
4000.00000  4050.00000  6.298316399442e-04
4050.00000  4100.00000  6.215061679130e-04
4100.00000  4150.00000  6.478378934071e-04
4150.00000  4200.00000  6.480315090357e-04
4200.00000  4250.00000  6.792036252457e-04
4250.00000  4300.00000  6.842376315902e-04
4300.00000  4350.00000  7.202501385159e-04
4350.00000  4400.00000  7.475499421532e-04
4400.00000  4450.00000  7.359330044352e-04
4450.00000  4500.00000  7.527775641263e-04
4500.00000  4550.00000  7.787220583632e-04
4550.00000  4600.00000  8.007942400274e-04
4600.00000  4650.00000  7.920815367389e-04
4650.00000  4700.00000  8.071835557723e-04
4700.00000  4750.00000  8.379684407250e-04
4750.00000  4800.00000  8.461002971276e-04
4800.00000  4850.00000  8.552002316734e-04
4850.00000  4900.00000  8.557810785593e-04
4900.00000  4950.00000  9.016679825454e-04
4950.00000  5000.00000  8.952786668005e-04
5000.00000  5050.00000  9.010871356595e-04
5050.00000  5100.00000  9.367124113280e-04
5100.00000  5150.00000  9.221912391805e-04
5150.00000  5200.00000  9.169636172074e-04
5200.00000  5250.00000  9.380677207284e-04
5250.00000  5300.00000  9.218040079232e-04
5300.00000  5350.00000  9.370996425853e-04
5350.00000  5400.00000  9.374868738425e-04
5400.00000  5450.00000  9.723376869965e-04
5450.00000  5500.00000  9.645930618512e-04
5500.00000  5550.00000  9.858907810009e-04
5550.00000  5600.00000  9.715632244820e-04
5600.00000  5650.00000  1.009899118951e-03
5650.00000  5700.00000  9.942162530321e-04
5700.00000  5750.00000  9.971204874616e-04
5750.00000  5800.00000  9.965396405757e-04
5800.00000  5850.00000  9.951843311753e-04
5850.00000  5900.00000  1.001380031292e-03
5900.00000  5950.00000  1.001186415663e-03
5950.00000  6000.00000  1.010673581466e-03
6000.00000  6050.00000  1.007188500151e-03
6050.00000  6100.00000  1.008156578294e-03
6100.00000  6150.00000  1.033326610016e-03
6150.00000  6200.00000  1.018418206611e-03
6200.00000  6250.00000  1.042039313305e-03
6250.00000  6300.00000  1.106513317639e-03
6300.00000  6350.00000  1.122002567930e-03
6350.00000  6400.00000  3.039184522657e-03
6400.00000  6450.00000  1.018999053497e-03
6450.00000  6500.00000  1.029067066186e-03
6500.00000  6550.00000  1.018418206611e-03
6550.00000  6600.00000  1.024420291099e-03
6600.00000  6650.00000  9.940226374035e-04
6650.00000  6700.00000  9.951843311753e-04
6700.00000  6750.00000  1.016288434696e-03
6750.00000  6800.00000  1.017450128468e-03
6800.00000  6850.00000  9.787270027414e-04
6850.00000  6900.00000  1.011254428352e-03
6900.00000  6950.00000  1.014352278410e-03
6950.00000  7000.00000  9.684653744239e-04
7000.00000  7050.00000  9.628505211935e-04
7050.00000  7100.00000  1.180474487777e-03
7100.00000  7150.00000  6.910141785923e-04
7150.00000  7200.00000  6.629399124405e-04
7200.00000  7250.00000  6.757185439303e-04
7250.00000  7300.00000  6.536463622661e-04
7300.00000  7350.00000  6.668122250132e-04
7350.00000  7400.00000  6.633271436978e-04
7400.00000  7450.00000  6.865610191338e-04
7450.00000  7500.00000  7.614902674148e-04
7500.00000  7550.00000  6.654569156127e-04
7550.00000  7600.00000  6.505485122080e-04
7600.00000  7650.00000  6.584867529819e-04
7650.00000  7700.00000  6.733951563867e-04
7700.00000  7750.00000  6.780419314739e-04
7750.00000  7800.00000  6.695228438140e-04
7800.00000  7850.00000  6.766866220735e-04
7850.00000  7900.00000  6.670058406418e-04
7900.00000  7950.00000  6.604229092683e-04
7950.00000  8000.00000  6.639079905837e-04
8000.00000  8050.00000  6.704909219572e-04
8050.00000  8100.00000  6.515165903511e-04
8100.00000  8150.00000  6.759121595589e-04
8150.00000  8200.00000  6.716526157290e-04
8200.00000  8250.00000  6.735887720153e-04
8250.00000  8300.00000  6.718462313576e-04
8300.00000  8350.00000  6.664249937559e-04
8350.00000  8400.00000  6.532591310088e-04
8400.00000  8450.00000  6.555825185524e-04
8450.00000  8500.00000  6.590675998678e-04
8500.00000  8550.00000  6.489995871789e-04
8550.00000  8600.00000  6.762993908162e-04
8600.00000  8650.00000  6.608101405255e-04
8650.00000  8700.00000  6.218933991702e-04
8700.00000  8750.00000  6.548080560379e-04
8750.00000  8800.00000  6.338975681455e-04
8800.00000  8850.00000  6.294444086869e-04
8850.00000  8900.00000  6.168593928258e-04
8900.00000  8950.00000  6.453208902349e-04
8950.00000  9000.00000  6.460953527494e-04
9000.00000  9050.00000  6.333167212596e-04
9050.00000  9100.00000  6.398996526331e-04
9100.00000  9150.00000  6.499676653221e-04
9150.00000  9200.00000  6.271210211433e-04
9200.00000  9250.00000  6.319614118592e-04
9250.00000  9300.00000  6.371890338323e-04
9300.00000  9350.00000  6.280890992865e-04
9350.00000  9400.00000  6.352528775459e-04
9400.00000  9450.00000  6.275082524006e-04
9450.00000  9500.00000  6.044679925932e-04
9500.00000  9550.00000  6.323486431164e-04
9550.00000  9600.00000  6.464825840067e-04
9600.00000  9650.00000  6.244104023425e-04
9650.00000  9700.00000  6.172466240830e-04
9700.00000  9750.00000  6.277018680292e-04
9750.00000  9800.00000  6.203444741412e-04
9800.00000  9850.00000  6.253784804856e-04
9850.00000  9900.00000  6.098892301950e-04
9900.00000  9950.00000  6.189891647407e-04
9950.00000  10000.00000  6.108573083381e-04
