300.00000  350.00000  5.707785133866e-01
350.00000  400.00000  4.040522393348e-01
400.00000  450.00000  2.991202365305e-01
450.00000  500.00000  2.284397616296e-01
500.00000  550.00000  1.800421155870e-01
550.00000  600.00000  1.445563927316e-01
600.00000  650.00000  1.180795450279e-01
650.00000  700.00000  9.806090290870e-02
700.00000  750.00000  8.267161385438e-02
750.00000  800.00000  7.066027898346e-02
800.00000  850.00000  6.083833115745e-02
850.00000  900.00000  5.257371296161e-02
900.00000  950.00000  4.638029829408e-02
950.00000  1000.00000  4.017416767856e-02
1000.00000  1050.00000  3.595696092789e-02
1050.00000  1100.00000  3.201800903909e-02
1100.00000  1150.00000  2.871859453445e-02
1150.00000  1200.00000  2.587695415740e-02
1200.00000  1250.00000  2.338836833628e-02
1250.00000  1300.00000  2.106284584819e-02
1300.00000  1350.00000  1.923848131026e-02
1350.00000  1400.00000  1.769311963113e-02
1400.00000  1450.00000  1.618440980210e-02
1450.00000  1500.00000  1.502426654735e-02
1500.00000  1550.00000  1.385290333849e-02
1550.00000  1600.00000  1.281468358504e-02
1600.00000  1650.00000  1.182059565109e-02
1650.00000  1700.00000  1.112944647804e-02
1700.00000  1750.00000  1.029019391078e-02
1750.00000  1800.00000  9.608768697960e-03
1800.00000  1850.00000  9.044031007865e-03
1850.00000  1900.00000  8.420949556409e-03
1900.00000  1950.00000  7.805348074359e-03
1950.00000  2000.00000  7.418633656108e-03
2000.00000  2050.00000  7.055855139955e-03
2050.00000  2100.00000  6.529265293826e-03
2100.00000  2150.00000  6.213610584926e-03
2150.00000  2200.00000  5.831384148318e-03
2200.00000  2250.00000  5.608481060042e-03
2250.00000  2300.00000  5.242710556127e-03
2300.00000  2350.00000  5.110315097654e-03
2350.00000  2400.00000  4.755764547846e-03
2400.00000  2450.00000  4.600929181158e-03
2450.00000  2500.00000  4.437865848124e-03
2500.00000  2550.00000  4.035443494122e-03
2550.00000  2600.00000  3.870136170267e-03
2600.00000  2650.00000  3.647233081991e-03
2650.00000  2700.00000  3.570937394057e-03
2700.00000  2750.00000  3.493145712243e-03
2750.00000  2800.00000  3.232094780000e-03
2800.00000  2850.00000  3.035371584643e-03
2850.00000  2900.00000  3.000963725379e-03
2900.00000  2950.00000  2.937383985434e-03
2950.00000  3000.00000  2.882032211836e-03
3000.00000  3050.00000  2.647909169452e-03
3050.00000  3100.00000  2.604525346902e-03
3100.00000  3150.00000  2.460161937381e-03
3150.00000  3200.00000  2.321782503384e-03
3200.00000  3250.00000  2.258950760380e-03
3250.00000  3300.00000  2.232022870521e-03
3300.00000  3350.00000  2.126555301907e-03
3350.00000  3400.00000  2.059235577260e-03
3400.00000  3450.00000  2.013607763888e-03
3450.00000  3500.00000  1.939556066776e-03
3500.00000  3550.00000  1.801176632780e-03
3550.00000  3600.00000  1.796688651137e-03
3600.00000  3650.00000  1.719644966263e-03
3650.00000  3700.00000  1.688229094761e-03
3700.00000  3750.00000  1.686733100880e-03
3750.00000  3800.00000  1.591737489433e-03
3800.00000  3850.00000  1.543117688299e-03
3850.00000  3900.00000  1.436154125804e-03
3900.00000  3950.00000  1.427178162518e-03
3950.00000  4000.00000  1.412218223708e-03
4000.00000  4050.00000  1.314230624499e-03
4050.00000  4100.00000  1.302262673451e-03
4100.00000  4150.00000  1.283562749938e-03
4150.00000  4200.00000  1.248406893733e-03
4200.00000  4250.00000  1.216991022231e-03
4250.00000  4300.00000  1.119751419963e-03
4300.00000  4350.00000  1.148175303703e-03
4350.00000  4400.00000  1.091327536223e-03
4400.00000  4450.00000  1.068887628008e-03
4450.00000  4500.00000  9.836159767879e-04
4500.00000  4550.00000  1.010543866647e-03
4550.00000  4600.00000  1.006803881944e-03
4600.00000  4650.00000  9.454681328212e-04
4650.00000  4700.00000  9.342481787134e-04
4700.00000  4750.00000  9.118082704977e-04
4750.00000  4800.00000  9.073202888546e-04
4800.00000  4850.00000  8.774004112336e-04
4850.00000  4900.00000  8.474805336127e-04
4900.00000  4950.00000  8.504725213748e-04
4950.00000  5000.00000  8.063407018839e-04
5000.00000  5050.00000  7.853967875493e-04
5050.00000  5100.00000  7.547289129878e-04
5100.00000  5150.00000  7.450049527610e-04
5150.00000  5200.00000  7.562249068689e-04
5200.00000  5250.00000  7.143370781996e-04
5250.00000  5300.00000  6.851651975192e-04
5300.00000  5350.00000  7.203210537238e-04
5350.00000  5400.00000  6.702052587087e-04
5400.00000  5450.00000  6.664652740061e-04
5450.00000  5500.00000  6.021375371211e-04
5500.00000  5550.00000  6.649692801251e-04
5550.00000  5600.00000  5.647376900950e-04
5600.00000  5650.00000  5.677296778571e-04
5650.00000  5700.00000  5.662336839760e-04
5700.00000  5750.00000  5.669816809165e-04
5750.00000  5800.00000  5.849336074891e-04
5800.00000  5850.00000  5.669816809165e-04
5850.00000  5900.00000  5.206058706041e-04
5900.00000  5950.00000  5.445417727008e-04
5950.00000  6000.00000  4.787180419348e-04
6000.00000  6050.00000  4.861980113400e-04
6050.00000  6100.00000  4.652540970054e-04
6100.00000  6150.00000  4.899379960427e-04
6150.00000  6200.00000  4.443101826707e-04
6200.00000  6250.00000  4.390742040871e-04
6250.00000  6300.00000  4.540341428975e-04
6300.00000  6350.00000  4.622621092433e-04
6350.00000  6400.00000  4.839540205185e-04
6400.00000  6450.00000  4.278542499792e-04
6450.00000  6500.00000  4.398222010276e-04
6500.00000  6550.00000  3.949423845962e-04
6550.00000  6600.00000  3.971863754178e-04
6600.00000  6650.00000  3.889584090720e-04
6650.00000  6700.00000  3.829744335478e-04
6700.00000  6750.00000  3.852184243694e-04
6750.00000  6800.00000  3.665185008563e-04
6800.00000  6850.00000  3.852184243694e-04
6850.00000  6900.00000  3.530545559269e-04
6900.00000  6950.00000  3.784864519047e-04
6950.00000  7000.00000  3.605345253322e-04
7000.00000  7050.00000  3.403386079380e-04
7050.00000  7100.00000  3.478185773433e-04
7100.00000  7150.00000  3.448265895812e-04
7150.00000  7200.00000  3.605345253322e-04
7200.00000  7250.00000  3.388426140570e-04
7250.00000  7300.00000  3.171507027818e-04
7300.00000  7350.00000  3.171507027818e-04
7350.00000  7400.00000  3.029387609119e-04
7400.00000  7450.00000  3.149067119602e-04
7450.00000  7500.00000  3.201426905439e-04
7500.00000  7550.00000  2.849868343393e-04
7550.00000  7600.00000  2.647909169452e-04
7600.00000  7650.00000  2.640429200047e-04
7650.00000  7700.00000  2.700268955289e-04
7700.00000  7750.00000  2.775068649341e-04
7750.00000  7800.00000  2.692788985883e-04
7800.00000  7850.00000  2.595549383615e-04
7850.00000  7900.00000  3.036867578524e-04
7900.00000  7950.00000  2.475869873132e-04
7950.00000  8000.00000  2.513269720158e-04
8000.00000  8050.00000  2.775068649341e-04
8050.00000  8100.00000  2.445949995511e-04
8100.00000  8150.00000  2.550669567184e-04
8150.00000  8200.00000  2.535709628373e-04
8200.00000  8250.00000  2.617989291831e-04
8250.00000  8300.00000  2.408550148485e-04
8300.00000  8350.00000  2.229030882759e-04
8350.00000  8400.00000  2.154231188707e-04
8400.00000  8450.00000  2.004631800602e-04
8450.00000  8500.00000  2.460909934321e-04
8500.00000  8550.00000  2.139271249896e-04
8550.00000  8600.00000  1.922352137144e-04
8600.00000  8650.00000  2.154231188707e-04
8650.00000  8700.00000  2.064471555844e-04
8700.00000  8750.00000  2.079431494654e-04
8750.00000  8800.00000  2.056991586439e-04
8800.00000  8850.00000  2.064471555844e-04
8850.00000  8900.00000  2.109351372275e-04
8900.00000  8950.00000  2.176671096922e-04
8950.00000  9000.00000  1.967231953576e-04
9000.00000  9050.00000  1.795192657256e-04
9050.00000  9100.00000  1.795192657256e-04
9100.00000  9150.00000  2.116831341680e-04
9150.00000  9200.00000  1.795192657256e-04
9200.00000  9250.00000  1.757792810229e-04
9250.00000  9300.00000  1.772752749040e-04
9300.00000  9350.00000  1.712912993798e-04
9350.00000  9400.00000  1.840072473687e-04
9400.00000  9450.00000  1.802672626661e-04
9450.00000  9500.00000  1.712912993798e-04
9500.00000  9550.00000  1.630633330340e-04
9550.00000  9600.00000  1.653073238556e-04
9600.00000  9650.00000  1.675513146772e-04
9650.00000  9700.00000  1.540873697478e-04
9700.00000  9750.00000  1.503473850452e-04
9750.00000  9800.00000  1.660553207961e-04
9800.00000  9850.00000  1.391274309373e-04
9850.00000  9900.00000  1.533393728072e-04
9900.00000  9950.00000  1.473553972831e-04
9950.00000  10000.00000  1.570793575099e-04
