300.00000  350.00000  9.288386972689e-06
350.00000  400.00000  1.528713689255e-05
400.00000  450.00000  9.868911158482e-06
450.00000  500.00000  1.490012076869e-05
500.00000  550.00000  1.010112083280e-04
550.00000  600.00000  8.127338601103e-06
600.00000  650.00000  3.115479797089e-05
650.00000  700.00000  1.393258045903e-05
700.00000  750.00000  2.380149161751e-05
750.00000  800.00000  1.548064495448e-05
800.00000  850.00000  5.824592664123e-05
850.00000  900.00000  1.470661270676e-05
900.00000  950.00000  1.296504014938e-05
950.00000  1000.00000  1.044943534427e-05
1000.00000  1050.00000  1.490012076869e-05
1050.00000  1100.00000  1.683520138800e-05
1100.00000  1150.00000  1.760923363572e-05
1150.00000  1200.00000  1.335205627324e-05
1200.00000  1250.00000  1.915729813117e-05
1250.00000  1300.00000  3.773407207655e-05
1300.00000  1350.00000  1.490012076869e-05
1350.00000  1400.00000  1.335205627324e-05
1400.00000  1450.00000  1.741572557379e-05
1450.00000  1500.00000  1.799624975958e-05
1500.00000  1550.00000  1.161048371586e-05
1550.00000  1600.00000  1.431959658289e-05
1600.00000  1650.00000  1.412608852096e-05
1650.00000  1700.00000  1.335205627324e-05
1700.00000  1750.00000  3.541197533338e-05
1750.00000  1800.00000  1.083645146814e-05
1800.00000  1850.00000  1.161048371586e-05
1850.00000  1900.00000  1.451310464483e-05
1900.00000  1950.00000  1.354556433517e-05
1950.00000  2000.00000  1.238451596358e-05
2000.00000  2050.00000  9.288386972689e-06
2050.00000  2100.00000  1.025592728234e-05
2100.00000  2150.00000  1.199749983972e-05
2150.00000  2200.00000  1.083645146814e-05
2200.00000  2250.00000  1.161048371586e-05
2250.00000  2300.00000  1.064294340621e-05
2300.00000  2350.00000  3.018725766124e-05
2350.00000  2400.00000  7.933830539171e-06
2400.00000  2450.00000  8.901370848827e-06
2450.00000  2500.00000  1.102995953007e-05
2500.00000  2550.00000  8.514354724965e-06
2550.00000  2600.00000  8.320846663034e-06
2600.00000  2650.00000  9.868911158482e-06
2650.00000  2700.00000  7.933830539171e-06
2700.00000  2750.00000  9.481895034620e-06
2750.00000  2800.00000  7.546814415309e-06
2800.00000  2850.00000  7.740322477240e-06
2850.00000  2900.00000  7.740322477240e-06
2900.00000  2950.00000  8.514354724965e-06
2950.00000  3000.00000  1.393258045903e-05
3000.00000  3050.00000  8.901370848827e-06
3050.00000  3100.00000  9.288386972689e-06
3100.00000  3150.00000  7.740322477240e-06
3150.00000  3200.00000  7.740322477240e-06
3200.00000  3250.00000  7.740322477240e-06
3250.00000  3300.00000  7.933830539171e-06
3300.00000  3350.00000  6.192257981792e-06
3350.00000  3400.00000  7.546814415309e-06
3400.00000  3450.00000  8.901370848827e-06
3450.00000  3500.00000  5.998749919861e-06
3500.00000  3550.00000  1.006241922041e-05
3550.00000  3600.00000  8.127338601103e-06
3600.00000  3650.00000  7.740322477240e-06
3650.00000  3700.00000  1.006241922041e-05
3700.00000  3750.00000  6.385766043723e-06
3750.00000  3800.00000  9.481895034620e-06
3800.00000  3850.00000  5.805241857930e-06
3850.00000  3900.00000  6.966290229516e-06
3900.00000  3950.00000  4.837701548275e-06
3950.00000  4000.00000  7.740322477240e-06
4000.00000  4050.00000  5.418225734068e-06
4050.00000  4100.00000  6.192257981792e-06
4100.00000  4150.00000  8.707862786896e-06
4150.00000  4200.00000  7.353306353378e-06
4200.00000  4250.00000  7.353306353378e-06
4250.00000  4300.00000  6.385766043723e-06
4300.00000  4350.00000  4.644193486344e-06
4350.00000  4400.00000  8.901370848827e-06
4400.00000  4450.00000  5.998749919861e-06
4450.00000  4500.00000  7.546814415309e-06
4500.00000  4550.00000  7.546814415309e-06
4550.00000  4600.00000  5.998749919861e-06
4600.00000  4650.00000  7.353306353378e-06
4650.00000  4700.00000  5.224717672137e-06
4700.00000  4750.00000  7.159798291447e-06
4750.00000  4800.00000  6.579274105654e-06
4800.00000  4850.00000  4.837701548275e-06
4850.00000  4900.00000  6.966290229516e-06
4900.00000  4950.00000  5.224717672137e-06
4950.00000  5000.00000  7.353306353378e-06
5000.00000  5050.00000  6.385766043723e-06
5050.00000  5100.00000  6.966290229516e-06
5100.00000  5150.00000  9.288386972689e-06
5150.00000  5200.00000  7.933830539171e-06
5200.00000  5250.00000  7.159798291447e-06
5250.00000  5300.00000  7.159798291447e-06
5300.00000  5350.00000  5.805241857930e-06
5350.00000  5400.00000  9.481895034620e-06
5400.00000  5450.00000  1.064294340621e-05
5450.00000  5500.00000  9.094878910758e-06
5500.00000  5550.00000  7.353306353378e-06
5550.00000  5600.00000  7.933830539171e-06
5600.00000  5650.00000  6.385766043723e-06
5650.00000  5700.00000  5.805241857930e-06
5700.00000  5750.00000  6.579274105654e-06
5750.00000  5800.00000  6.966290229516e-06
5800.00000  5850.00000  7.353306353378e-06
5850.00000  5900.00000  8.320846663034e-06
5900.00000  5950.00000  8.707862786896e-06
5950.00000  6000.00000  8.514354724965e-06
6000.00000  6050.00000  6.966290229516e-06
6050.00000  6100.00000  8.320846663034e-06
6100.00000  6150.00000  1.044943534427e-05
6150.00000  6200.00000  1.102995953007e-05
6200.00000  6250.00000  1.548064495448e-05
6250.00000  6300.00000  2.322096743172e-05
6300.00000  6350.00000  1.741572557379e-05
6350.00000  6400.00000  1.662234251987e-04
6400.00000  6450.00000  8.514354724965e-06
6450.00000  6500.00000  7.353306353378e-06
6500.00000  6550.00000  7.353306353378e-06
6550.00000  6600.00000  8.707862786896e-06
6600.00000  6650.00000  7.933830539171e-06
6650.00000  6700.00000  8.127338601103e-06
6700.00000  6750.00000  8.707862786896e-06
6750.00000  6800.00000  6.192257981792e-06
6800.00000  6850.00000  7.546814415309e-06
6850.00000  6900.00000  1.006241922041e-05
6900.00000  6950.00000  8.707862786896e-06
6950.00000  7000.00000  7.933830539171e-06
7000.00000  7050.00000  7.546814415309e-06
7050.00000  7100.00000  2.283395130786e-05
7100.00000  7150.00000  3.676653176689e-06
7150.00000  7200.00000  4.257177362482e-06
7200.00000  7250.00000  4.450685424413e-06
7250.00000  7300.00000  5.418225734068e-06
7300.00000  7350.00000  6.579274105654e-06
7350.00000  7400.00000  5.031209610206e-06
7400.00000  7450.00000  5.418225734068e-06
7450.00000  7500.00000  1.335205627324e-05
7500.00000  7550.00000  7.740322477240e-06
7550.00000  7600.00000  5.611733795999e-06
7600.00000  7650.00000  6.192257981792e-06
7650.00000  7700.00000  5.224717672137e-06
7700.00000  7750.00000  5.031209610206e-06
7750.00000  7800.00000  3.483145114758e-06
7800.00000  7850.00000  4.837701548275e-06
7850.00000  7900.00000  3.289637052827e-06
7900.00000  7950.00000  4.450685424413e-06
7950.00000  8000.00000  5.224717672137e-06
8000.00000  8050.00000  5.418225734068e-06
8050.00000  8100.00000  4.837701548275e-06
8100.00000  8150.00000  5.418225734068e-06
8150.00000  8200.00000  5.031209610206e-06
8200.00000  8250.00000  3.676653176689e-06
8250.00000  8300.00000  5.224717672137e-06
8300.00000  8350.00000  4.450685424413e-06
8350.00000  8400.00000  3.676653176689e-06
8400.00000  8450.00000  4.837701548275e-06
8450.00000  8500.00000  6.385766043723e-06
8500.00000  8550.00000  7.740322477240e-06
8550.00000  8600.00000  6.772782167585e-06
8600.00000  8650.00000  4.257177362482e-06
8650.00000  8700.00000  5.224717672137e-06
8700.00000  8750.00000  5.418225734068e-06
8750.00000  8800.00000  5.805241857930e-06
8800.00000  8850.00000  7.933830539171e-06
8850.00000  8900.00000  6.192257981792e-06
8900.00000  8950.00000  4.644193486344e-06
8950.00000  9000.00000  3.870161238620e-06
9000.00000  9050.00000  5.998749919861e-06
9050.00000  9100.00000  5.224717672137e-06
9100.00000  9150.00000  5.805241857930e-06
9150.00000  9200.00000  6.192257981792e-06
9200.00000  9250.00000  5.031209610206e-06
9250.00000  9300.00000  7.740322477240e-06
9300.00000  9350.00000  5.805241857930e-06
9350.00000  9400.00000  7.740322477240e-06
9400.00000  9450.00000  4.644193486344e-06
9450.00000  9500.00000  6.385766043723e-06
9500.00000  9550.00000  6.772782167585e-06
9550.00000  9600.00000  5.418225734068e-06
9600.00000  9650.00000  5.805241857930e-06
9650.00000  9700.00000  4.837701548275e-06
9700.00000  9750.00000  6.579274105654e-06
9750.00000  9800.00000  6.966290229516e-06
9800.00000  9850.00000  7.546814415309e-06
9850.00000  9900.00000  5.998749919861e-06
9900.00000  9950.00000  5.418225734068e-06
9950.00000  10000.00000  4.837701548275e-06
