300.00000  350.00000  1.484472807333e-06
350.00000  400.00000  5.937891229332e-06
400.00000  450.00000  5.937891229332e-06
450.00000  500.00000  1.484472807333e-05
500.00000  550.00000  8.016153159598e-05
550.00000  600.00000  7.422364036665e-06
600.00000  650.00000  3.933852939432e-05
650.00000  700.00000  5.195654825665e-06
700.00000  750.00000  1.929814649533e-05
750.00000  800.00000  5.937891229332e-06
800.00000  850.00000  6.605903992631e-05
850.00000  900.00000  1.632920088066e-05
900.00000  950.00000  1.781367368799e-05
950.00000  1000.00000  1.484472807333e-05
1000.00000  1050.00000  2.078261930266e-05
1050.00000  1100.00000  1.781367368799e-05
1100.00000  1150.00000  2.152485570633e-05
1150.00000  1200.00000  4.601865702732e-05
1200.00000  1250.00000  5.789443948598e-05
1250.00000  1300.00000  1.900125193386e-04
1300.00000  1350.00000  1.313758434490e-04
1350.00000  1400.00000  2.167330298706e-04
1400.00000  1450.00000  3.065436347142e-04
1450.00000  1500.00000  4.728045891355e-04
1500.00000  1550.00000  6.605903992631e-04
1550.00000  1600.00000  8.973638120327e-04
1600.00000  1650.00000  1.052491220399e-03
1650.00000  1700.00000  1.290749105976e-03
1700.00000  1750.00000  1.668547435442e-03
1750.00000  1800.00000  1.843715226707e-03
1800.00000  1850.00000  2.052283656138e-03
1850.00000  1900.00000  2.000327107881e-03
1900.00000  1950.00000  2.326168889091e-03
1950.00000  2000.00000  2.533995082117e-03
2000.00000  2050.00000  2.800457951034e-03
2050.00000  2100.00000  2.983790342739e-03
2100.00000  2150.00000  3.239119665600e-03
2150.00000  2200.00000  3.436554548976e-03
2200.00000  2250.00000  3.445461385820e-03
2250.00000  2300.00000  3.631762723140e-03
2300.00000  2350.00000  4.091949293413e-03
2350.00000  2400.00000  3.913812556533e-03
2400.00000  2450.00000  4.015498943836e-03
2450.00000  2500.00000  4.011787761817e-03
2500.00000  2550.00000  3.908616901708e-03
2550.00000  2600.00000  3.905647956093e-03
2600.00000  2650.00000  3.928657284607e-03
2650.00000  2700.00000  4.088238111395e-03
2700.00000  2750.00000  3.944986485487e-03
2750.00000  2800.00000  4.092691529817e-03
2800.00000  2850.00000  4.153554914917e-03
2850.00000  2900.00000  4.195120153523e-03
2900.00000  2950.00000  3.991747378918e-03
2950.00000  3000.00000  4.058548655248e-03
3000.00000  3050.00000  4.028116962698e-03
3050.00000  3100.00000  3.984325014882e-03
3100.00000  3150.00000  3.961315686368e-03
3150.00000  3200.00000  4.011045525414e-03
3200.00000  3250.00000  3.830682079323e-03
3250.00000  3300.00000  3.792085786332e-03
3300.00000  3350.00000  3.797281441158e-03
3350.00000  3400.00000  3.734191346846e-03
3400.00000  3450.00000  3.610980103837e-03
3450.00000  3500.00000  3.588713011727e-03
3500.00000  3550.00000  3.521911735397e-03
3550.00000  3600.00000  3.491480042847e-03
3600.00000  3650.00000  3.441750203801e-03
3650.00000  3700.00000  3.412060747655e-03
3700.00000  3750.00000  3.371979981857e-03
3750.00000  3800.00000  3.291818450261e-03
3800.00000  3850.00000  3.285138322628e-03
3850.00000  3900.00000  3.240604138408e-03
3900.00000  3950.00000  3.102548167326e-03
3950.00000  4000.00000  3.050591619069e-03
4000.00000  4050.00000  3.093641330482e-03
4050.00000  4100.00000  2.887299610263e-03
4100.00000  4150.00000  2.922184721235e-03
4150.00000  4200.00000  2.764830603658e-03
4200.00000  4250.00000  2.746274693566e-03
4250.00000  4300.00000  2.791551114190e-03
4300.00000  4350.00000  2.698771563731e-03
4350.00000  4400.00000  2.590405048796e-03
4400.00000  4450.00000  2.577044793530e-03
4450.00000  4500.00000  2.496883261934e-03
4500.00000  4550.00000  2.485007479475e-03
4550.00000  4600.00000  2.433050931219e-03
4600.00000  4650.00000  2.381836619366e-03
4650.00000  4700.00000  2.395196874632e-03
4700.00000  4750.00000  2.300190614962e-03
4750.00000  4800.00000  2.202215409678e-03
4800.00000  4850.00000  2.228193683807e-03
4850.00000  4900.00000  2.142094260981e-03
4900.00000  4950.00000  2.145063206596e-03
4950.00000  5000.00000  2.075292984651e-03
5000.00000  5050.00000  2.064901675000e-03
5050.00000  5100.00000  1.996615925863e-03
5100.00000  5150.00000  1.993646980248e-03
5150.00000  5200.00000  1.909774266634e-03
5200.00000  5250.00000  1.860044427588e-03
5250.00000  5300.00000  1.816252479772e-03
5300.00000  5350.00000  1.834066153460e-03
5350.00000  5400.00000  1.767264877130e-03
5400.00000  5450.00000  1.815510243368e-03
5450.00000  5500.00000  1.701948073607e-03
5500.00000  5550.00000  1.670031908250e-03
5550.00000  5600.00000  1.748708967038e-03
5600.00000  5650.00000  1.662609544213e-03
5650.00000  5700.00000  1.561665393314e-03
5700.00000  5750.00000  1.535687119186e-03
5750.00000  5800.00000  1.585416958232e-03
5800.00000  5850.00000  1.516388972691e-03
5850.00000  5900.00000  1.491895171370e-03
5900.00000  5950.00000  1.531975937168e-03
5950.00000  6000.00000  1.376848528801e-03
6000.00000  6050.00000  1.434742968287e-03
6050.00000  6100.00000  1.392435493278e-03
6100.00000  6150.00000  1.354581436691e-03
6150.00000  6200.00000  1.298171470013e-03
6200.00000  6250.00000  1.373879583187e-03
6250.00000  6300.00000  1.293718051591e-03
6300.00000  6350.00000  1.267739777462e-03
6350.00000  6400.00000  1.653702707369e-03
6400.00000  6450.00000  1.226916775261e-03
6450.00000  6500.00000  1.203165210343e-03
6500.00000  6550.00000  1.204649683151e-03
6550.00000  6600.00000  1.157146553316e-03
6600.00000  6650.00000  1.192773900692e-03
6650.00000  6700.00000  1.119292496729e-03
6700.00000  6750.00000  1.154177607701e-03
6750.00000  6800.00000  1.123745915151e-03
6800.00000  6850.00000  1.085891858564e-03
6850.00000  6900.00000  9.990501993351e-04
6900.00000  6950.00000  9.953390173167e-04
6950.00000  7000.00000  1.034677546711e-03
7000.00000  7050.00000  1.036162019518e-03
7050.00000  7100.00000  1.053975693206e-03
7100.00000  7150.00000  9.263110317757e-04
7150.00000  7200.00000  8.624787010604e-04
7200.00000  7250.00000  9.025594668584e-04
7250.00000  7300.00000  9.010749940511e-04
7300.00000  7350.00000  8.802923747484e-04
7350.00000  7400.00000  8.327892449138e-04
7400.00000  7450.00000  8.454072637761e-04
7450.00000  7500.00000  9.018172304547e-04
7500.00000  7550.00000  8.684165922898e-04
7550.00000  7600.00000  7.897395335011e-04
7600.00000  7650.00000  8.075532071891e-04
7650.00000  7700.00000  7.838016422718e-04
7700.00000  7750.00000  8.134910984184e-04
7750.00000  7800.00000  7.496587677031e-04
7800.00000  7850.00000  8.327892449138e-04
7850.00000  7900.00000  7.526277133178e-04
7900.00000  7950.00000  7.095780019051e-04
7950.00000  8000.00000  7.006711650611e-04
8000.00000  8050.00000  7.318450940151e-04
8050.00000  8100.00000  7.080935290978e-04
8100.00000  8150.00000  7.132891839235e-04
8150.00000  8200.00000  7.058668198868e-04
8200.00000  8250.00000  7.414941672628e-04
8250.00000  8300.00000  6.398077799605e-04
8300.00000  8350.00000  6.613326356668e-04
8350.00000  8400.00000  6.791463093548e-04
8400.00000  8450.00000  6.412922527678e-04
8450.00000  8500.00000  6.323854159238e-04
8500.00000  8550.00000  6.286742339055e-04
8550.00000  8600.00000  6.234785790798e-04
8600.00000  8650.00000  5.967580685478e-04
8650.00000  8700.00000  5.975003049515e-04
8700.00000  8750.00000  6.323854159238e-04
8750.00000  8800.00000  5.915624137222e-04
8800.00000  8850.00000  5.685530852085e-04
8850.00000  8900.00000  5.462859930985e-04
8900.00000  8950.00000  5.871089953002e-04
8950.00000  9000.00000  5.173387733555e-04
9000.00000  9050.00000  5.529661207315e-04
9050.00000  9100.00000  5.269878466032e-04
9100.00000  9150.00000  5.321835014288e-04
9150.00000  9200.00000  5.047207544932e-04
9200.00000  9250.00000  5.366369198508e-04
9250.00000  9300.00000  5.010095724749e-04
9300.00000  9350.00000  5.084319365115e-04
9350.00000  9400.00000  5.010095724749e-04
9400.00000  9450.00000  4.987828632639e-04
9450.00000  9500.00000  4.683511707135e-04
9500.00000  9550.00000  5.136275913372e-04
9550.00000  9600.00000  5.054629908969e-04
9600.00000  9650.00000  4.490530242182e-04
9650.00000  9700.00000  4.646399886952e-04
9700.00000  9750.00000  4.661244615025e-04
9750.00000  9800.00000  4.876493172089e-04
9800.00000  9850.00000  4.735468255392e-04
9850.00000  9900.00000  4.245592228972e-04
9900.00000  9950.00000  4.282704049155e-04
9950.00000  10000.00000  4.416306601815e-04
