300.00000  350.00000  0.000000000000e+00
350.00000  400.00000  0.000000000000e+00
400.00000  450.00000  0.000000000000e+00
450.00000  500.00000  0.000000000000e+00
500.00000  550.00000  1.936120974671e-06
550.00000  600.00000  0.000000000000e+00
600.00000  650.00000  7.744483898684e-07
650.00000  700.00000  0.000000000000e+00
700.00000  750.00000  3.872241949342e-07
750.00000  800.00000  3.872241949342e-07
800.00000  850.00000  3.872241949342e-06
850.00000  900.00000  0.000000000000e+00
900.00000  950.00000  0.000000000000e+00
950.00000  1000.00000  1.936120974671e-07
1000.00000  1050.00000  9.680604873355e-07
1050.00000  1100.00000  0.000000000000e+00
1100.00000  1150.00000  3.872241949342e-07
1150.00000  1200.00000  3.872241949342e-07
1200.00000  1250.00000  1.161672584803e-06
1250.00000  1300.00000  9.680604873355e-06
1300.00000  1350.00000  1.161672584803e-06
1350.00000  1400.00000  3.097793559474e-06
1400.00000  1450.00000  1.355284682270e-06
1450.00000  1500.00000  3.291405656941e-06
1500.00000  1550.00000  2.129733072138e-06
1550.00000  1600.00000  2.516957267072e-06
1600.00000  1650.00000  1.742508877204e-06
1650.00000  1700.00000  2.323345169605e-06
1700.00000  1750.00000  2.633124525553e-05
1750.00000  1800.00000  4.840302436678e-06
1800.00000  1850.00000  3.678629851875e-06
1850.00000  1900.00000  4.646690339210e-06
1900.00000  1950.00000  6.001975021480e-06
1950.00000  2000.00000  3.872241949342e-06
2000.00000  2050.00000  5.808362924013e-06
2050.00000  2100.00000  6.582811313881e-06
2100.00000  2150.00000  7.357259703750e-06
2150.00000  2200.00000  7.938095996151e-06
2200.00000  2250.00000  7.938095996151e-06
2250.00000  2300.00000  8.131708093618e-06
2300.00000  2350.00000  4.298188563770e-05
2350.00000  2400.00000  9.874216970822e-06
2400.00000  2450.00000  9.293380678421e-06
2450.00000  2500.00000  1.045505326322e-05
2500.00000  2550.00000  8.518932288552e-06
2550.00000  2600.00000  9.680604873355e-06
2600.00000  2650.00000  8.131708093618e-06
2650.00000  2700.00000  9.099768580954e-06
2700.00000  2750.00000  1.084227745816e-05
2750.00000  2800.00000  1.006782906829e-05
2800.00000  2850.00000  9.680604873355e-06
2850.00000  2900.00000  1.006782906829e-05
2900.00000  2950.00000  1.181033794549e-05
2950.00000  3000.00000  3.117154769220e-05
3000.00000  3050.00000  1.471451940750e-05
3050.00000  3100.00000  1.665064038217e-05
3100.00000  3150.00000  1.510174360243e-05
3150.00000  3200.00000  1.936120974671e-05
3200.00000  3250.00000  1.684425247964e-05
3250.00000  3300.00000  1.490813150497e-05
3300.00000  3350.00000  1.800592506444e-05
3350.00000  3400.00000  1.665064038217e-05
3400.00000  3450.00000  1.839314925937e-05
3450.00000  3500.00000  2.381428798845e-05
3500.00000  3550.00000  2.497596057326e-05
3550.00000  3600.00000  2.788014203526e-05
3600.00000  3650.00000  3.039709930233e-05
3650.00000  3700.00000  6.505366474895e-05
3700.00000  3750.00000  3.562462593395e-05
3750.00000  3800.00000  4.162660095543e-05
3800.00000  3850.00000  4.607967919717e-05
3850.00000  3900.00000  4.472439451490e-05
3900.00000  3950.00000  5.246887841358e-05
3950.00000  4000.00000  5.789001714266e-05
4000.00000  4050.00000  6.621533733375e-05
4050.00000  4100.00000  6.544088894388e-05
4100.00000  4150.00000  6.970035508816e-05
4150.00000  4200.00000  7.608955430457e-05
4200.00000  4250.00000  8.325320191085e-05
4250.00000  4300.00000  9.293380678421e-05
4300.00000  4350.00000  1.059058173145e-04
4350.00000  4400.00000  1.014527390728e-04
4400.00000  4450.00000  1.130694649208e-04
4450.00000  4500.00000  1.285584327182e-04
4500.00000  4550.00000  1.252670270612e-04
4550.00000  4600.00000  1.374645892016e-04
4600.00000  4650.00000  1.498557634395e-04
4650.00000  4700.00000  1.570194110458e-04
4700.00000  4750.00000  1.663127917242e-04
4750.00000  4800.00000  1.717339304533e-04
4800.00000  4850.00000  1.810273111317e-04
4850.00000  4900.00000  2.025182539506e-04
4900.00000  4950.00000  2.040671507303e-04
4950.00000  5000.00000  2.094882894594e-04
5000.00000  5050.00000  2.305920080833e-04
5050.00000  5100.00000  2.284622750112e-04
5100.00000  5150.00000  2.350450863251e-04
5150.00000  5200.00000  2.414342855415e-04
5200.00000  5250.00000  2.551807444616e-04
5250.00000  5300.00000  2.666038582122e-04
5300.00000  5350.00000  2.675719186995e-04
5350.00000  5400.00000  2.842225590817e-04
5400.00000  5450.00000  3.132643737018e-04
5450.00000  5500.00000  2.892564736158e-04
5500.00000  5550.00000  3.072623986803e-04
5550.00000  5600.00000  2.909989824931e-04
5600.00000  5650.00000  3.196535729182e-04
5650.00000  5700.00000  3.320447471561e-04
5700.00000  5750.00000  3.326255834485e-04
5750.00000  5800.00000  3.244938753549e-04
5800.00000  5850.00000  3.411445157370e-04
5850.00000  5900.00000  3.893539280063e-04
5900.00000  5950.00000  3.583759924116e-04
5950.00000  6000.00000  3.465656544661e-04
6000.00000  6050.00000  3.548909746572e-04
6050.00000  6100.00000  3.514059569028e-04
6100.00000  6150.00000  3.982600844898e-04
6150.00000  6200.00000  3.974856361000e-04
6200.00000  6250.00000  4.371761160807e-04
6250.00000  6300.00000  5.196548696017e-04
6300.00000  6350.00000  5.283674139877e-04
6350.00000  6400.00000  2.637190379599e-03
6400.00000  6450.00000  3.819966683026e-04
6450.00000  6500.00000  3.874178070317e-04
6500.00000  6550.00000  3.916772731759e-04
6550.00000  6600.00000  3.868369707393e-04
6600.00000  6650.00000  3.736713481115e-04
6650.00000  6700.00000  3.945814546379e-04
6700.00000  6750.00000  3.856752981545e-04
6750.00000  6800.00000  3.759946932811e-04
6800.00000  6850.00000  3.988409207822e-04
6850.00000  6900.00000  4.056173441936e-04
6900.00000  6950.00000  4.133618280923e-04
6950.00000  7000.00000  4.079406893632e-04
7000.00000  7050.00000  3.907092126886e-04
7050.00000  7100.00000  6.344668433997e-04
7100.00000  7150.00000  1.990332361962e-04
7150.00000  7200.00000  1.672808522116e-04
7200.00000  7250.00000  1.750253361103e-04
7250.00000  7300.00000  1.787039659621e-04
7300.00000  7350.00000  1.872228982507e-04
7350.00000  7400.00000  1.779295175723e-04
7400.00000  7450.00000  1.825762079115e-04
7450.00000  7500.00000  2.698952638691e-04
7500.00000  7550.00000  1.847059409836e-04
7550.00000  7600.00000  1.905143039076e-04
7600.00000  7650.00000  1.936120974671e-04
7650.00000  7700.00000  1.982587878063e-04
7700.00000  7750.00000  2.007757450734e-04
7750.00000  7800.00000  1.980651757088e-04
7800.00000  7850.00000  1.982587878063e-04
7850.00000  7900.00000  1.957418305392e-04
7900.00000  7950.00000  1.980651757088e-04
7950.00000  8000.00000  2.034863144379e-04
8000.00000  8050.00000  2.133605314087e-04
8050.00000  8100.00000  2.065841079974e-04
8100.00000  8150.00000  2.129733072138e-04
8150.00000  8200.00000  2.009693571708e-04
8200.00000  8250.00000  1.965162789291e-04
8250.00000  8300.00000  2.267197661340e-04
8300.00000  8350.00000  2.232347483796e-04
8350.00000  8400.00000  2.027118660481e-04
8400.00000  8450.00000  2.083266168746e-04
8450.00000  8500.00000  2.108435741417e-04
8500.00000  8550.00000  2.069713321923e-04
8550.00000  8600.00000  2.094882894594e-04
8600.00000  8650.00000  2.143285918961e-04
8650.00000  8700.00000  2.197497306252e-04
8700.00000  8750.00000  2.040671507303e-04
8750.00000  8800.00000  2.172327733581e-04
8800.00000  8850.00000  2.089074531670e-04
8850.00000  8900.00000  2.154902644809e-04
8900.00000  8950.00000  2.042607628278e-04
8950.00000  9000.00000  2.127796951163e-04
9000.00000  9050.00000  2.118116346290e-04
9050.00000  9100.00000  2.089074531670e-04
9100.00000  9150.00000  2.114244104341e-04
9150.00000  9200.00000  2.222666878922e-04
9200.00000  9250.00000  2.216858515998e-04
9250.00000  9300.00000  2.209114032100e-04
9300.00000  9350.00000  2.085202289721e-04
9350.00000  9400.00000  2.195561185277e-04
9400.00000  9450.00000  2.141349797986e-04
9450.00000  9500.00000  2.149094281885e-04
9500.00000  9550.00000  2.178136096505e-04
9550.00000  9600.00000  2.195561185277e-04
9600.00000  9650.00000  2.098755136543e-04
9650.00000  9700.00000  1.992268482936e-04
9700.00000  9750.00000  2.042607628278e-04
9750.00000  9800.00000  2.091010652645e-04
9800.00000  9850.00000  2.032927023405e-04
9850.00000  9900.00000  2.044543749253e-04
9900.00000  9950.00000  2.098755136543e-04
9950.00000  10000.00000  2.036799265354e-04
