300.00000  350.00000  3.461033916490e-06
350.00000  400.00000  1.422869499001e-05
400.00000  450.00000  5.383830536762e-06
450.00000  500.00000  9.998542425416e-06
500.00000  550.00000  8.844864453252e-05
550.00000  600.00000  6.537508508926e-06
600.00000  650.00000  2.538091538759e-05
650.00000  700.00000  9.613983101361e-06
700.00000  750.00000  1.345957634191e-05
750.00000  800.00000  1.115222039758e-05
800.00000  850.00000  4.153240699788e-05
850.00000  900.00000  8.460305129198e-06
900.00000  950.00000  8.460305129198e-06
950.00000  1000.00000  8.844864453252e-06
1000.00000  1050.00000  7.306627157035e-06
1050.00000  1100.00000  7.691186481089e-06
1100.00000  1150.00000  8.844864453252e-06
1150.00000  1200.00000  6.152949184871e-06
1200.00000  1250.00000  1.999708485083e-05
1250.00000  1300.00000  4.230152564599e-05
1300.00000  1350.00000  2.422723741543e-05
1350.00000  1400.00000  3.922505105355e-05
1400.00000  1450.00000  8.998688182874e-05
1450.00000  1500.00000  1.257508989658e-04
1500.00000  1550.00000  1.803583229815e-04
1550.00000  1600.00000  2.549628318481e-04
1600.00000  1650.00000  3.530254594820e-04
1650.00000  1700.00000  4.995425619467e-04
1700.00000  1750.00000  6.875920714094e-04
1750.00000  1800.00000  7.552745124429e-04
1800.00000  1850.00000  9.129438353053e-04
1850.00000  1900.00000  8.844864453252e-04
1900.00000  1950.00000  1.144448548386e-03
1950.00000  2000.00000  1.284043583018e-03
2000.00000  2050.00000  1.468247499240e-03
2050.00000  2100.00000  1.697060297052e-03
2100.00000  2150.00000  1.895492908264e-03
2150.00000  2200.00000  2.079312265162e-03
2200.00000  2250.00000  2.212754350609e-03
2250.00000  2300.00000  2.420800944923e-03
2300.00000  2350.00000  2.740369743212e-03
2350.00000  2400.00000  2.776902878997e-03
2400.00000  2450.00000  2.883425811760e-03
2450.00000  2500.00000  2.893808913510e-03
2500.00000  2550.00000  2.834971336929e-03
2550.00000  2600.00000  2.896116269454e-03
2600.00000  2650.00000  3.023020846392e-03
2650.00000  2700.00000  3.123775389294e-03
2700.00000  2750.00000  3.216838745716e-03
2750.00000  2800.00000  3.245680695020e-03
2800.00000  2850.00000  3.340666848061e-03
2850.00000  2900.00000  3.422577984085e-03
2900.00000  2950.00000  3.478339086073e-03
2950.00000  3000.00000  3.547175205078e-03
3000.00000  3050.00000  3.511026628617e-03
3050.00000  3100.00000  3.551789916967e-03
3100.00000  3150.00000  3.643315036092e-03
3150.00000  3200.00000  3.552943594939e-03
3200.00000  3250.00000  3.467571424999e-03
3250.00000  3300.00000  3.589476730724e-03
3300.00000  3350.00000  3.546406086430e-03
3350.00000  3400.00000  3.531792832116e-03
3400.00000  3450.00000  3.522178849015e-03
3450.00000  3500.00000  3.536022984681e-03
3500.00000  3550.00000  3.507565594701e-03
3550.00000  3600.00000  3.558327425476e-03
3600.00000  3650.00000  3.446805221500e-03
3650.00000  3700.00000  3.526793560903e-03
3700.00000  3750.00000  3.462572153786e-03
3750.00000  3800.00000  3.416425034900e-03
3800.00000  3850.00000  3.392197797484e-03
3850.00000  3900.00000  3.337974932793e-03
3900.00000  3950.00000  3.276830000268e-03
3950.00000  4000.00000  3.181843847227e-03
4000.00000  4050.00000  3.179151931958e-03
4050.00000  4100.00000  3.076474592436e-03
4100.00000  4150.00000  3.083781219593e-03
4150.00000  4200.00000  3.073398117843e-03
4200.00000  4250.00000  3.033788507466e-03
4250.00000  4300.00000  2.972643574941e-03
4300.00000  4350.00000  3.009561270050e-03
4350.00000  4400.00000  2.831125743689e-03
4400.00000  4450.00000  2.862275048937e-03
4450.00000  4500.00000  2.842662523411e-03
4500.00000  4550.00000  2.778056556969e-03
4550.00000  4600.00000  2.747291811045e-03
4600.00000  4650.00000  2.746907251721e-03
4650.00000  4700.00000  2.679993929335e-03
4700.00000  4750.00000  2.567702606712e-03
4750.00000  4800.00000  2.580008505081e-03
4800.00000  4850.00000  2.569240844008e-03
4850.00000  4900.00000  2.520786369177e-03
4900.00000  4950.00000  2.450412012875e-03
4950.00000  5000.00000  2.451950250171e-03
5000.00000  5050.00000  2.473870131642e-03
5050.00000  5100.00000  2.440798029774e-03
5100.00000  5150.00000  2.386190605758e-03
5150.00000  5200.00000  2.370423673472e-03
5200.00000  5250.00000  2.346965554704e-03
5250.00000  5300.00000  2.264285300033e-03
5300.00000  5350.00000  2.257747791524e-03
5350.00000  5400.00000  2.197371977647e-03
5400.00000  5450.00000  2.151993977409e-03
5450.00000  5500.00000  2.135842485798e-03
5500.00000  5550.00000  2.092002722856e-03
5550.00000  5600.00000  2.066237248145e-03
5600.00000  5650.00000  2.025858519119e-03
5650.00000  5700.00000  2.037779858165e-03
5700.00000  5750.00000  1.922796620272e-03
5750.00000  5800.00000  1.933948840670e-03
5800.00000  5850.00000  1.914336315143e-03
5850.00000  5900.00000  1.855883297887e-03
5900.00000  5950.00000  1.884725247191e-03
5950.00000  6000.00000  1.807813382380e-03
6000.00000  6050.00000  1.825503111286e-03
6050.00000  6100.00000  1.773587602539e-03
6100.00000  6150.00000  1.708597076774e-03
6150.00000  6200.00000  1.722441212440e-03
6200.00000  6250.00000  1.677447771526e-03
6250.00000  6300.00000  1.683600720710e-03
6300.00000  6350.00000  1.715903703931e-03
6350.00000  6400.00000  2.078158587190e-03
6400.00000  6450.00000  1.664757313832e-03
6450.00000  6500.00000  1.553619669180e-03
6500.00000  6550.00000  1.558234381069e-03
6550.00000  6600.00000  1.536699058922e-03
6600.00000  6650.00000  1.512856380830e-03
6650.00000  6700.00000  1.469785736536e-03
6700.00000  6750.00000  1.453634244926e-03
6750.00000  6800.00000  1.449404092361e-03
6800.00000  6850.00000  1.420562143057e-03
6850.00000  6900.00000  1.433637160075e-03
6900.00000  6950.00000  1.401718736178e-03
6950.00000  7000.00000  1.329806142580e-03
7000.00000  7050.00000  1.367492956338e-03
7050.00000  7100.00000  1.414793753196e-03
7100.00000  7150.00000  1.195979497809e-03
7150.00000  7200.00000  1.221360413197e-03
7200.00000  7250.00000  1.185596396060e-03
7250.00000  7300.00000  1.154062531487e-03
7300.00000  7350.00000  1.189057429976e-03
7350.00000  7400.00000  1.149447819599e-03
7400.00000  7450.00000  1.129450734748e-03
7450.00000  7500.00000  1.107146293953e-03
7500.00000  7550.00000  1.120990429619e-03
7550.00000  7600.00000  1.083688175185e-03
7600.00000  7650.00000  1.100993344768e-03
7650.00000  7700.00000  1.031003547790e-03
7700.00000  7750.00000  1.033310903734e-03
7750.00000  7800.00000  1.031388107114e-03
7800.00000  7850.00000  1.035618259679e-03
7850.00000  7900.00000  1.042155768188e-03
7900.00000  7950.00000  9.983160052454e-04
7950.00000  8000.00000  1.015236615504e-03
8000.00000  8050.00000  9.483232931183e-04
8050.00000  8100.00000  9.537071236550e-04
8100.00000  8150.00000  9.387093100169e-04
8150.00000  8200.00000  9.252497336750e-04
8200.00000  8250.00000  9.425549032575e-04
8250.00000  8300.00000  9.294798862396e-04
8300.00000  8350.00000  9.175585471939e-04
8350.00000  8400.00000  8.744879028998e-04
8400.00000  8450.00000  8.702577503352e-04
8450.00000  8500.00000  9.071754454445e-04
8500.00000  8550.00000  8.544908180490e-04
8550.00000  8600.00000  8.864092419455e-04
8600.00000  8650.00000  8.471841908920e-04
8650.00000  8700.00000  8.452613942717e-04
8700.00000  8750.00000  8.517989027806e-04
8750.00000  8800.00000  8.271871060411e-04
8800.00000  8850.00000  8.260334280690e-04
8850.00000  8900.00000  8.133429703752e-04
8900.00000  8950.00000  7.987297160611e-04
8950.00000  9000.00000  7.745024786457e-04
9000.00000  9050.00000  7.656576141924e-04
9050.00000  9100.00000  7.568127497392e-04
9100.00000  9150.00000  7.468142073138e-04
9150.00000  9200.00000  7.583509870354e-04
9200.00000  9250.00000  7.868083770154e-04
9250.00000  9300.00000  7.248943258426e-04
9300.00000  9350.00000  7.079737155843e-04
9350.00000  9400.00000  7.133575461210e-04
9400.00000  9450.00000  7.252788851667e-04
9450.00000  9500.00000  6.806700035764e-04
9500.00000  9550.00000  7.037435630197e-04
9550.00000  9600.00000  6.933604612702e-04
9600.00000  9650.00000  6.952832578905e-04
9650.00000  9700.00000  7.079737155843e-04
9700.00000  9750.00000  6.556736475128e-04
9750.00000  9800.00000  6.679795458826e-04
9800.00000  9850.00000  6.806700035764e-04
9850.00000  9900.00000  6.472133423836e-04
9900.00000  9950.00000  6.422140711709e-04
9950.00000  10000.00000  6.425986304950e-04
