10001.00000  11001.00000  5.439155175571e-04
11001.00000  12001.00000  4.465333471646e-04
12001.00000  13001.00000  3.696375284694e-04
13001.00000  14001.00000  3.142840589817e-04
14001.00000  15001.00000  2.619065824772e-04
15001.00000  16001.00000  2.255610681726e-04
16001.00000  17001.00000  1.954747391100e-04
17001.00000  18001.00000  1.699195993639e-04
18001.00000  19001.00000  1.494716475760e-04
19001.00000  20001.00000  1.313084904011e-04
20001.00000  21001.00000  1.155453275675e-04
21001.00000  22001.00000  1.021821590751e-04
22001.00000  23001.00000  9.135338460717e-05
23001.00000  24001.00000  8.457580058735e-05
24001.00000  25001.00000  7.514862281473e-05
25001.00000  26001.00000  6.687344232593e-05
26001.00000  27001.00000  6.019185807976e-05
27001.00000  28001.00000  5.506547016674e-05
28001.00000  29001.00000  4.965108293278e-05
29001.00000  30001.00000  4.510069366167e-05
30001.00000  31001.00000  4.101110330410e-05
31001.00000  32001.00000  3.649911394246e-05
32001.00000  33001.00000  3.486711779038e-05
33001.00000  34001.00000  3.175672512406e-05
34001.00000  35001.00000  2.720633585296e-05
35001.00000  36001.00000  2.578553920291e-05
36001.00000  37001.00000  2.520954056100e-05
37001.00000  38001.00000  2.292474594808e-05
38001.00000  39001.00000  2.096635056558e-05
39001.00000  40001.00000  1.929595450404e-05
40001.00000  41001.00000  1.864315604320e-05
41001.00000  42001.00000  1.537916373904e-05
42001.00000  43001.00000  1.505276450862e-05
43001.00000  44001.00000  1.449596582144e-05
44001.00000  45001.00000  1.251837048421e-05
45001.00000  46001.00000  1.230717098218e-05
46001.00000  47001.00000  1.186557202338e-05
47001.00000  48001.00000  1.171197238553e-05
48001.00000  49001.00000  1.065597487536e-05
49001.00000  50001.00000  9.926376595609e-06
50001.00000  51001.00000  8.755179357055e-06
51001.00000  52001.00000  8.582379764482e-06
52001.00000  53001.00000  7.891181394188e-06
53001.00000  54001.00000  7.603182073232e-06
54001.00000  55001.00000  7.391982571198e-06
55001.00000  56001.00000  6.451184789409e-06
56001.00000  57001.00000  6.489584698870e-06
57001.00000  58001.00000  5.644786690733e-06
58001.00000  59001.00000  5.452787143429e-06
59001.00000  60001.00000  5.279987550856e-06
60001.00000  61001.00000  4.319989814337e-06
61001.00000  62001.00000  4.607989135292e-06
62001.00000  63001.00000  4.550389271101e-06
63001.00000  64001.00000  3.686391308234e-06
64001.00000  65001.00000  3.955190674459e-06
65001.00000  66001.00000  3.379192032548e-06
66001.00000  67001.00000  3.571191579852e-06
67001.00000  68001.00000  3.302392213626e-06
68001.00000  69001.00000  3.129592621053e-06
69001.00000  70001.00000  3.129592621053e-06
70001.00000  71001.00000  2.937593073749e-06
71001.00000  72001.00000  2.841593300097e-06
72001.00000  73001.00000  2.822393345367e-06
73001.00000  74001.00000  2.438394250759e-06
74001.00000  75001.00000  2.188794839264e-06
75001.00000  76001.00000  2.361594431837e-06
76001.00000  77001.00000  2.303994567646e-06
77001.00000  78001.00000  2.399994341298e-06
78001.00000  79001.00000  1.881595563578e-06
79001.00000  80001.00000  1.497596468970e-06
80001.00000  81001.00000  1.631996152083e-06
81001.00000  82001.00000  1.747195880465e-06
82001.00000  83001.00000  1.439996604779e-06
83001.00000  84001.00000  1.382396740588e-06
84001.00000  85001.00000  1.555196333161e-06
85001.00000  86001.00000  1.324796876397e-06
86001.00000  87001.00000  1.305596921666e-06
87001.00000  88001.00000  1.324796876397e-06
88001.00000  89001.00000  9.023978723281e-07
89001.00000  90001.00000  1.324796876397e-06
90001.00000  91001.00000  1.017597600710e-06
91001.00000  92001.00000  1.055997510171e-06
92001.00000  93001.00000  8.639979628673e-07
93001.00000  94001.00000  9.407977817889e-07
94001.00000  95001.00000  7.871981439458e-07
95001.00000  96001.00000  7.295982797546e-07
96001.00000  97001.00000  8.831979175977e-07
97001.00000  98001.00000  7.871981439458e-07
98001.00000  99001.00000  6.527984608331e-07
99001.00000  100001.00000  6.335985061027e-07
100001.00000  101001.00000  6.335985061027e-07
101001.00000  102001.00000  6.335985061027e-07
102001.00000  103001.00000  4.415989587989e-07
103001.00000  104001.00000  5.183987777204e-07
104001.00000  105001.00000  8.447980081369e-07
105001.00000  106001.00000  4.031990493381e-07
106001.00000  107001.00000  8.255980534065e-07
107001.00000  108001.00000  4.991988229900e-07
108001.00000  109001.00000  4.415989587989e-07
109001.00000  110001.00000  7.295982797546e-07
110001.00000  111001.00000  3.455991851469e-07
111001.00000  112001.00000  4.415989587989e-07
112001.00000  113001.00000  3.839990946077e-07
113001.00000  114001.00000  4.031990493381e-07
114001.00000  115001.00000  3.263992304165e-07
115001.00000  116001.00000  2.687993662254e-07
116001.00000  117001.00000  3.455991851469e-07
117001.00000  118001.00000  3.263992304165e-07
118001.00000  119001.00000  2.879993209558e-07
119001.00000  120001.00000  3.071992756862e-07
120001.00000  121001.00000  1.535996378431e-07
121001.00000  122001.00000  1.535996378431e-07
122001.00000  123001.00000  2.111995020342e-07
123001.00000  124001.00000  2.687993662254e-07
124001.00000  125001.00000  2.495994114950e-07
125001.00000  126001.00000  2.879993209558e-07
126001.00000  127001.00000  1.343996831127e-07
127001.00000  128001.00000  1.343996831127e-07
128001.00000  129001.00000  2.687993662254e-07
129001.00000  130001.00000  1.535996378431e-07
130001.00000  131001.00000  1.919995473038e-07
131001.00000  132001.00000  1.919995473038e-07
132001.00000  133001.00000  2.111995020342e-07
133001.00000  134001.00000  2.303994567646e-07
134001.00000  135001.00000  5.759986419115e-08
135001.00000  136001.00000  5.759986419115e-08
136001.00000  137001.00000  2.303994567646e-07
137001.00000  138001.00000  5.759986419115e-08
138001.00000  139001.00000  3.839990946077e-08
139001.00000  140001.00000  1.151997283823e-07
140001.00000  141001.00000  5.759986419115e-08
141001.00000  142001.00000  1.919995473038e-07
142001.00000  143001.00000  7.679981892154e-08
143001.00000  144001.00000  1.151997283823e-07
144001.00000  145001.00000  5.759986419115e-08
145001.00000  146001.00000  7.679981892154e-08
146001.00000  147001.00000  7.679981892154e-08
147001.00000  148001.00000  9.599977365192e-08
148001.00000  149001.00000  9.599977365192e-08
149001.00000  150001.00000  0.000000000000e+00
150001.00000  151001.00000  3.839990946077e-08
151001.00000  152001.00000  1.535996378431e-07
152001.00000  153001.00000  7.679981892154e-08
153001.00000  154001.00000  3.839990946077e-08
154001.00000  155001.00000  3.839990946077e-08
155001.00000  156001.00000  9.599977365192e-08
156001.00000  157001.00000  7.679981892154e-08
157001.00000  158001.00000  1.919995473038e-08
158001.00000  159001.00000  7.679981892154e-08
159001.00000  160001.00000  1.343996831127e-07
160001.00000  161001.00000  7.679981892154e-08
161001.00000  162001.00000  3.839990946077e-08
162001.00000  163001.00000  5.759986419115e-08
163001.00000  164001.00000  3.839990946077e-08
164001.00000  165001.00000  1.151997283823e-07
165001.00000  166001.00000  1.919995473038e-08
166001.00000  167001.00000  7.679981892154e-08
167001.00000  168001.00000  3.839990946077e-08
168001.00000  169001.00000  5.759986419115e-08
169001.00000  170001.00000  1.919995473038e-08
170001.00000  171001.00000  3.839990946077e-08
171001.00000  172001.00000  3.839990946077e-08
172001.00000  173001.00000  0.000000000000e+00
173001.00000  174001.00000  0.000000000000e+00
174001.00000  175001.00000  5.759986419115e-08
175001.00000  176001.00000  0.000000000000e+00
176001.00000  177001.00000  0.000000000000e+00
177001.00000  178001.00000  1.919995473038e-08
178001.00000  179001.00000  3.839990946077e-08
179001.00000  180001.00000  5.759986419115e-08
180001.00000  181001.00000  3.839990946077e-08
181001.00000  182001.00000  3.839990946077e-08
182001.00000  183001.00000  0.000000000000e+00
183001.00000  184001.00000  5.759986419115e-08
184001.00000  185001.00000  1.919995473038e-08
185001.00000  186001.00000  3.839990946077e-08
186001.00000  187001.00000  0.000000000000e+00
187001.00000  188001.00000  0.000000000000e+00
188001.00000  189001.00000  0.000000000000e+00
189001.00000  190001.00000  1.919995473038e-08
190001.00000  191001.00000  0.000000000000e+00
191001.00000  192001.00000  3.839990946077e-08
192001.00000  193001.00000  1.919995473038e-08
193001.00000  194001.00000  1.919995473038e-08
194001.00000  195001.00000  3.839990946077e-08
195001.00000  196001.00000  0.000000000000e+00
196001.00000  197001.00000  1.919995473038e-08
197001.00000  198001.00000  0.000000000000e+00
198001.00000  199001.00000  0.000000000000e+00
