10001.00000  11001.00000  9.485238365550e-04
11001.00000  12001.00000  8.185635203224e-04
12001.00000  13001.00000  7.202068167875e-04
13001.00000  14001.00000  6.343524290065e-04
14001.00000  15001.00000  5.626718412339e-04
15001.00000  16001.00000  5.024984080693e-04
16001.00000  17001.00000  4.548755994521e-04
17001.00000  18001.00000  4.146826832728e-04
18001.00000  19001.00000  3.757457957241e-04
19001.00000  20001.00000  3.434272128828e-04
20001.00000  21001.00000  3.165675237053e-04
21001.00000  22001.00000  2.911860836085e-04
22001.00000  23001.00000  2.683553478076e-04
23001.00000  24001.00000  2.517661081249e-04
24001.00000  25001.00000  2.328580463550e-04
25001.00000  26001.00000  2.171383649551e-04
26001.00000  27001.00000  2.048292843752e-04
27001.00000  28001.00000  1.921144099300e-04
28001.00000  29001.00000  1.811193285329e-04
29001.00000  30001.00000  1.727812307774e-04
30001.00000  31001.00000  1.609455763737e-04
31001.00000  32001.00000  1.508297150180e-04
32001.00000  33001.00000  1.429553816800e-04
33001.00000  34001.00000  1.398732806556e-04
34001.00000  35001.00000  1.293516254347e-04
35001.00000  36001.00000  1.223854974142e-04
36001.00000  37001.00000  1.182116176571e-04
37001.00000  38001.00000  1.113034601888e-04
38001.00000  39001.00000  1.073614626404e-04
39001.00000  40001.00000  1.012648929027e-04
40001.00000  41001.00000  9.862723277839e-05
41001.00000  42001.00000  9.361278001468e-05
42001.00000  43001.00000  9.074323768169e-05
43001.00000  44001.00000  8.564182908970e-05
44001.00000  45001.00000  8.269499268713e-05
45001.00000  46001.00000  7.897521558881e-05
46001.00000  47001.00000  7.666605526024e-05
47001.00000  48001.00000  7.454046834691e-05
48001.00000  49001.00000  7.032794155505e-05
49001.00000  50001.00000  6.758400208512e-05
50001.00000  51001.00000  6.574826793270e-05
51001.00000  52001.00000  6.358403398458e-05
52001.00000  53001.00000  6.217341721483e-05
53001.00000  54001.00000  6.039565361459e-05
54001.00000  55001.00000  5.892706629265e-05
55001.00000  56001.00000  5.615414154663e-05
56001.00000  57001.00000  5.435705442900e-05
57001.00000  58001.00000  5.296576117664e-05
58001.00000  59001.00000  4.929429287180e-05
59001.00000  60001.00000  4.913004297395e-05
60001.00000  61001.00000  4.693682374975e-05
61001.00000  62001.00000  4.515906014951e-05
62001.00000  63001.00000  4.378709041454e-05
63001.00000  64001.00000  4.227019429912e-05
64001.00000  65001.00000  4.084991577067e-05
65001.00000  66001.00000  4.048276894019e-05
66001.00000  67001.00000  3.923640206828e-05
67001.00000  68001.00000  3.832819675077e-05
68001.00000  69001.00000  3.785477057462e-05
69001.00000  70001.00000  3.643449204617e-05
70001.00000  71001.00000  3.544899265908e-05
71001.00000  72001.00000  3.570019838520e-05
72001.00000  73001.00000  3.364224378275e-05
73001.00000  74001.00000  3.303355298485e-05
74001.00000  75001.00000  3.077270144976e-05
75001.00000  76001.00000  3.147800983464e-05
76001.00000  77001.00000  3.043453989537e-05
77001.00000  78001.00000  2.937174643871e-05
78001.00000  79001.00000  2.821233539507e-05
79001.00000  80001.00000  2.692732148838e-05
80001.00000  81001.00000  2.647321882962e-05
81001.00000  82001.00000  2.692732148838e-05
82001.00000  83001.00000  2.626066013829e-05
83001.00000  84001.00000  2.473410226417e-05
84001.00000  85001.00000  2.485004336854e-05
85001.00000  86001.00000  2.504327854248e-05
86001.00000  87001.00000  2.370029408360e-05
87001.00000  88001.00000  2.295633866394e-05
88001.00000  89001.00000  2.278242700739e-05
89001.00000  90001.00000  2.210610389861e-05
90001.00000  91001.00000  2.200948631164e-05
91001.00000  92001.00000  2.105297220064e-05
92001.00000  93001.00000  2.049259019622e-05
93001.00000  94001.00000  2.127519265067e-05
94001.00000  95001.00000  1.972931125916e-05
95001.00000  96001.00000  2.024138447010e-05
96001.00000  97001.00000  1.933317915258e-05
97001.00000  98001.00000  1.891772352861e-05
98001.00000  99001.00000  1.887907649383e-05
99001.00000  100001.00000  1.908197342646e-05
100001.00000  101001.00000  1.766169489801e-05
101001.00000  102001.00000  1.784526831325e-05
102001.00000  103001.00000  1.693706299574e-05
103001.00000  104001.00000  1.673416606310e-05
104001.00000  105001.00000  1.598054888474e-05
105001.00000  106001.00000  1.603851943693e-05
106001.00000  107001.00000  1.554576974338e-05
107001.00000  108001.00000  1.461824090847e-05
108001.00000  109001.00000  1.519794643029e-05
109001.00000  110001.00000  1.471485849544e-05
110001.00000  111001.00000  1.494674070417e-05
111001.00000  112001.00000  1.494674070417e-05
112001.00000  113001.00000  1.327525644960e-05
113001.00000  114001.00000  1.423177056060e-05
114001.00000  115001.00000  1.448297628672e-05
115001.00000  116001.00000  1.357477096920e-05
116001.00000  117001.00000  1.341052107136e-05
117001.00000  118001.00000  1.269555092778e-05
118001.00000  119001.00000  1.246366871906e-05
119001.00000  120001.00000  1.265690389300e-05
120001.00000  121001.00000  1.205787485378e-05
121001.00000  122001.00000  1.145884581457e-05
122001.00000  123001.00000  1.191294847333e-05
123001.00000  124001.00000  1.137188998630e-05
124001.00000  125001.00000  1.116899305367e-05
125001.00000  126001.00000  1.043469939270e-05
126001.00000  127001.00000  1.096609612103e-05
127001.00000  128001.00000  1.081150798188e-05
128001.00000  129001.00000  1.078252270579e-05
129001.00000  130001.00000  1.064725808403e-05
130001.00000  131001.00000  9.748714525215e-06
131001.00000  132001.00000  1.059894929055e-05
132001.00000  133001.00000  1.024146421876e-05
133001.00000  134001.00000  9.226979555580e-06
134001.00000  135001.00000  9.739052766518e-06
135001.00000  136001.00000  9.207656038187e-06
136001.00000  137001.00000  9.333258901247e-06
137001.00000  138001.00000  8.869494483794e-06
138001.00000  139001.00000  8.879156242490e-06
139001.00000  140001.00000  8.830847449006e-06
140001.00000  141001.00000  8.705244585945e-06
141001.00000  142001.00000  8.676259309855e-06
142001.00000  143001.00000  8.299450720674e-06
143001.00000  144001.00000  8.115877305432e-06
144001.00000  145001.00000  7.970950924978e-06
145001.00000  146001.00000  8.183509616311e-06
146001.00000  147001.00000  7.941965648887e-06
147001.00000  148001.00000  7.951627407584e-06
148001.00000  149001.00000  7.855009820615e-06
149001.00000  150001.00000  7.584480577100e-06
150001.00000  151001.00000  7.613465853191e-06
151001.00000  152001.00000  7.188348470525e-06
152001.00000  153001.00000  7.265642540101e-06
153001.00000  154001.00000  6.502363603043e-06
154001.00000  155001.00000  6.772892846557e-06
155001.00000  156001.00000  6.763231087860e-06
156001.00000  157001.00000  6.917819227011e-06
157001.00000  158001.00000  6.473378326952e-06
158001.00000  159001.00000  6.415407774770e-06
159001.00000  160001.00000  6.086907979074e-06
160001.00000  161001.00000  6.144878531256e-06
161001.00000  162001.00000  6.772892846557e-06
162001.00000  163001.00000  5.912996322529e-06
163001.00000  164001.00000  6.357437222588e-06
164001.00000  165001.00000  5.970966874711e-06
165001.00000  166001.00000  5.912996322529e-06
166001.00000  167001.00000  6.318790187801e-06
167001.00000  168001.00000  5.806716976863e-06
168001.00000  169001.00000  5.835702252953e-06
169001.00000  170001.00000  5.826040494257e-06
170001.00000  171001.00000  5.855025770347e-06
171001.00000  172001.00000  5.700437631196e-06
172001.00000  173001.00000  5.420246628985e-06
173001.00000  174001.00000  5.497540698560e-06
174001.00000  175001.00000  4.995129246319e-06
175001.00000  176001.00000  5.304305524622e-06
176001.00000  177001.00000  5.004791005016e-06
177001.00000  178001.00000  5.140055626774e-06
178001.00000  179001.00000  5.478217181167e-06
179001.00000  180001.00000  4.840541107168e-06
180001.00000  181001.00000  4.782570554987e-06
181001.00000  182001.00000  5.033776281107e-06
182001.00000  183001.00000  5.111070350683e-06
183001.00000  184001.00000  4.512041311472e-06
184001.00000  185001.00000  4.685952968017e-06
185001.00000  186001.00000  4.405761965806e-06
186001.00000  187001.00000  4.666629450623e-06
187001.00000  188001.00000  4.251173826655e-06
188001.00000  189001.00000  4.357453172321e-06
189001.00000  190001.00000  4.492717794078e-06
190001.00000  191001.00000  3.980644583140e-06
191001.00000  192001.00000  4.260835585352e-06
192001.00000  193001.00000  4.425085483200e-06
193001.00000  194001.00000  4.115909204898e-06
194001.00000  195001.00000  3.903350513565e-06
195001.00000  196001.00000  4.183541515776e-06
196001.00000  197001.00000  3.990306341837e-06
197001.00000  198001.00000  4.096585687504e-06
198001.00000  199001.00000  3.758424133111e-06
