300.00000  350.00000  7.785380028831e-01
350.00000  400.00000  5.832549862394e-01
400.00000  450.00000  4.527613558406e-01
450.00000  500.00000  3.631785695015e-01
500.00000  550.00000  2.964143199940e-01
550.00000  600.00000  2.473051478503e-01
600.00000  650.00000  2.090902566985e-01
650.00000  700.00000  1.793468282311e-01
700.00000  750.00000  1.549634875435e-01
750.00000  800.00000  1.360864545985e-01
800.00000  850.00000  1.195650288288e-01
850.00000  900.00000  1.064645781784e-01
900.00000  950.00000  9.545839780181e-02
950.00000  1000.00000  8.552437798353e-02
1000.00000  1050.00000  7.728815426115e-02
1050.00000  1100.00000  7.063282216567e-02
1100.00000  1150.00000  6.454806968044e-02
1150.00000  1200.00000  5.907214994975e-02
1200.00000  1250.00000  5.418897520265e-02
1250.00000  1300.00000  5.015165970231e-02
1300.00000  1350.00000  4.623804128540e-02
1350.00000  1400.00000  4.329076164449e-02
1400.00000  1450.00000  3.985512877827e-02
1450.00000  1500.00000  3.747985877170e-02
1500.00000  1550.00000  3.496373139267e-02
1550.00000  1600.00000  3.269178062630e-02
1600.00000  1650.00000  3.089960294072e-02
1650.00000  1700.00000  2.882785554637e-02
1700.00000  1750.00000  2.731739260570e-02
1750.00000  1800.00000  2.568466260570e-02
1800.00000  1850.00000  2.421459784546e-02
1850.00000  1900.00000  2.310454164883e-02
1900.00000  1950.00000  2.214571049928e-02
1950.00000  2000.00000  2.094270273707e-02
2000.00000  2050.00000  1.981655876947e-02
2050.00000  2100.00000  1.888597059561e-02
2100.00000  2150.00000  1.799971316842e-02
2150.00000  2200.00000  1.713240356036e-02
2200.00000  2250.00000  1.651928073356e-02
2250.00000  2300.00000  1.554185927089e-02
2300.00000  2350.00000  1.516612044233e-02
2350.00000  2400.00000  1.442679798996e-02
2400.00000  2450.00000  1.385192830745e-02
2450.00000  2500.00000  1.331638428730e-02
2500.00000  2550.00000  1.273293446028e-02
2550.00000  2600.00000  1.229248704185e-02
2600.00000  2650.00000  1.176909822643e-02
2650.00000  2700.00000  1.117492321877e-02
2700.00000  2750.00000  1.101261548502e-02
2750.00000  2800.00000  1.054785765713e-02
2800.00000  2850.00000  1.015138347933e-02
2850.00000  2900.00000  9.652662579393e-03
2900.00000  2950.00000  9.567933652307e-03
2950.00000  3000.00000  9.157874245693e-03
3000.00000  3050.00000  8.826466163801e-03
3050.00000  3100.00000  8.482187865136e-03
3100.00000  3150.00000  8.313802529029e-03
3150.00000  3200.00000  8.026367687776e-03
3200.00000  3250.00000  7.773610930604e-03
3250.00000  3300.00000  7.560537341815e-03
3300.00000  3350.00000  7.383571861193e-03
3350.00000  3400.00000  7.185156019283e-03
3400.00000  3450.00000  6.873053262549e-03
3450.00000  3500.00000  6.682145047090e-03
3500.00000  3550.00000  6.482656687116e-03
3550.00000  3600.00000  6.277090724777e-03
3600.00000  3650.00000  6.128010713829e-03
3650.00000  3700.00000  5.966060486108e-03
3700.00000  3750.00000  5.819125511288e-03
3750.00000  3800.00000  5.682200705069e-03
3800.00000  3850.00000  5.470557140365e-03
3850.00000  3900.00000  5.384398189194e-03
3900.00000  3950.00000  5.230313093945e-03
3950.00000  4000.00000  5.162386949868e-03
4000.00000  4050.00000  5.024032119563e-03
4050.00000  4100.00000  4.805595940452e-03
4100.00000  4150.00000  4.741959868632e-03
4150.00000  4200.00000  4.623267869508e-03
4200.00000  4250.00000  4.539253954465e-03
4250.00000  4300.00000  4.388028907388e-03
4300.00000  4350.00000  4.246099016868e-03
4350.00000  4400.00000  4.176027836662e-03
4400.00000  4450.00000  4.065915982053e-03
4450.00000  4500.00000  4.033382934100e-03
4500.00000  4550.00000  3.974751946581e-03
4550.00000  4600.00000  3.884660429173e-03
4600.00000  4650.00000  3.819594333268e-03
4650.00000  4700.00000  3.769185984242e-03
4700.00000  4750.00000  3.612240840822e-03
4750.00000  4800.00000  3.549677287066e-03
4800.00000  4850.00000  3.483896179118e-03
4850.00000  4900.00000  3.397379721925e-03
4900.00000  4950.00000  3.311578276775e-03
4950.00000  5000.00000  3.239004554418e-03
5000.00000  5050.00000  3.171435916363e-03
5050.00000  5100.00000  3.114592458951e-03
5100.00000  5150.00000  3.079199362826e-03
5150.00000  5200.00000  2.996615471869e-03
5200.00000  5250.00000  2.988750339397e-03
5250.00000  5300.00000  2.884716087153e-03
5300.00000  5350.00000  2.846820448878e-03
5350.00000  5400.00000  2.808209798560e-03
5400.00000  5450.00000  2.725983413625e-03
5450.00000  5500.00000  2.676290076642e-03
5500.00000  5550.00000  2.626239233638e-03
5550.00000  5600.00000  2.634819378153e-03
5600.00000  5650.00000  2.520059945264e-03
5650.00000  5700.00000  2.491459463548e-03
5700.00000  5750.00000  2.483594331076e-03
5750.00000  5800.00000  2.422818307428e-03
5800.00000  5850.00000  2.368477392166e-03
5850.00000  5900.00000  2.346669524857e-03
5900.00000  5950.00000  2.312348946797e-03
5950.00000  6000.00000  2.243350284655e-03
6000.00000  6050.00000  2.240490236483e-03
6050.00000  6100.00000  2.174351622514e-03
6100.00000  6150.00000  2.157191333484e-03
6150.00000  6200.00000  2.126088309617e-03
6200.00000  6250.00000  2.074964948548e-03
6250.00000  6300.00000  2.050654539089e-03
6300.00000  6350.00000  2.018478997157e-03
6350.00000  6400.00000  2.142533586604e-03
6400.00000  6450.00000  1.976293286625e-03
6450.00000  6500.00000  1.890134335454e-03
6500.00000  6550.00000  1.915159756956e-03
6550.00000  6600.00000  1.855098745351e-03
6600.00000  6650.00000  1.827928287720e-03
6650.00000  6700.00000  1.761789673750e-03
6700.00000  6750.00000  1.743914372677e-03
6750.00000  6800.00000  1.754639553321e-03
6800.00000  6850.00000  1.721748999346e-03
6850.00000  6900.00000  1.710308806660e-03
6900.00000  6950.00000  1.689930963437e-03
6950.00000  7000.00000  1.674558204514e-03
7000.00000  7050.00000  1.602341988179e-03
7050.00000  7100.00000  1.628797433767e-03
7100.00000  7150.00000  1.560871289690e-03
7150.00000  7200.00000  1.565161361947e-03
7200.00000  7250.00000  1.505457856364e-03
7250.00000  7300.00000  1.533343326038e-03
7300.00000  7350.00000  1.505815362385e-03
7350.00000  7400.00000  1.465417181960e-03
7400.00000  7450.00000  1.442179290566e-03
7450.00000  7500.00000  1.445754350780e-03
7500.00000  7550.00000  1.402138616162e-03
7550.00000  7600.00000  1.428236555729e-03
7600.00000  7650.00000  1.352445279179e-03
7650.00000  7700.00000  1.353875303265e-03
7700.00000  7750.00000  1.351372761115e-03
7750.00000  7800.00000  1.298461869939e-03
7800.00000  7850.00000  1.311332086712e-03
7850.00000  7900.00000  1.308829544561e-03
7900.00000  7950.00000  1.260923737686e-03
7950.00000  8000.00000  1.277726520694e-03
8000.00000  8050.00000  1.220525557261e-03
8050.00000  8100.00000  1.224100617476e-03
8100.00000  8150.00000  1.197287665866e-03
8150.00000  8200.00000  1.196930159845e-03
8200.00000  8250.00000  1.196215147802e-03
8250.00000  8300.00000  1.199432701995e-03
8300.00000  8350.00000  1.139371690390e-03
8350.00000  8400.00000  1.135796630175e-03
8400.00000  8450.00000  1.092180895557e-03
8450.00000  8500.00000  1.126858979639e-03
8500.00000  8550.00000  1.074663100506e-03
8550.00000  8600.00000  1.078238160720e-03
8600.00000  8650.00000  1.072875570398e-03
8650.00000  8700.00000  1.045347606746e-03
8700.00000  8750.00000  1.060005353626e-03
8750.00000  8800.00000  1.023897245459e-03
8800.00000  8850.00000  1.038912498360e-03
8850.00000  8900.00000  9.956542697633e-04
8900.00000  8950.00000  1.003519402235e-03
8950.00000  9000.00000  9.974417998706e-04
9000.00000  9050.00000  9.913641975058e-04
9050.00000  9100.00000  9.874316312697e-04
9100.00000  9150.00000  9.398833304157e-04
9150.00000  9200.00000  9.302306678363e-04
9200.00000  9250.00000  9.252255835359e-04
9250.00000  9300.00000  9.162879329994e-04
9300.00000  9350.00000  9.220080293427e-04
9350.00000  9400.00000  8.901899934329e-04
9400.00000  9450.00000  8.530093672011e-04
9450.00000  9500.00000  8.944800656904e-04
9500.00000  9550.00000  8.833973790252e-04
9550.00000  9600.00000  8.619470177376e-04
9600.00000  9650.00000  8.555119093514e-04
9650.00000  9700.00000  8.358490781711e-04
9700.00000  9750.00000  8.401391504286e-04
9750.00000  9800.00000  8.358490781711e-04
9800.00000  9850.00000  8.190462951625e-04
9850.00000  9900.00000  8.229788613986e-04
9900.00000  9950.00000  8.422841865574e-04
9950.00000  10000.00000  8.065335844115e-04
