10001.00000  11001.00000  3.105002148366e-05
11001.00000  12001.00000  2.772323346755e-05
12001.00000  13001.00000  2.570787493026e-05
13001.00000  14001.00000  2.369251639297e-05
14001.00000  15001.00000  2.168680071949e-05
15001.00000  16001.00000  1.988358518612e-05
16001.00000  17001.00000  1.767536937253e-05
17001.00000  18001.00000  1.606501111546e-05
18001.00000  19001.00000  1.498501036820e-05
19001.00000  20001.00000  1.426179558209e-05
20001.00000  21001.00000  1.240072286583e-05
21001.00000  22001.00000  1.197643685798e-05
22001.00000  23001.00000  1.146536507580e-05
23001.00000  24001.00000  1.019250705224e-05
24001.00000  25001.00000  9.450006538505e-06
25001.00000  26001.00000  9.180006351691e-06
26001.00000  27001.00000  8.071077012989e-06
27001.00000  28001.00000  8.312148608359e-06
28001.00000  29001.00000  6.807861853250e-06
29001.00000  30001.00000  6.615004576954e-06
30001.00000  31001.00000  6.615004576954e-06
31001.00000  32001.00000  6.402861573028e-06
32001.00000  33001.00000  5.814646880325e-06
33001.00000  34001.00000  5.882146927029e-06
34001.00000  35001.00000  5.660361059288e-06
35001.00000  36001.00000  5.457860919177e-06
36001.00000  37001.00000  4.879289090289e-06
37001.00000  38001.00000  4.464645946253e-06
38001.00000  39001.00000  4.609288903475e-06
39001.00000  40001.00000  4.252502942327e-06
40001.00000  41001.00000  3.905359844994e-06
41001.00000  42001.00000  3.886074117365e-06
42001.00000  43001.00000  3.510002428588e-06
43001.00000  44001.00000  3.587145339106e-06
44001.00000  45001.00000  3.259287969403e-06
45001.00000  46001.00000  3.114645012181e-06
46001.00000  47001.00000  3.124287875996e-06
47001.00000  48001.00000  3.124287875996e-06
48001.00000  49001.00000  2.931430599700e-06
49001.00000  50001.00000  2.873573416811e-06
50001.00000  51001.00000  2.642144685256e-06
51001.00000  52001.00000  2.478216000404e-06
52001.00000  53001.00000  2.642144685256e-06
53001.00000  54001.00000  2.256430132663e-06
54001.00000  55001.00000  2.246787268849e-06
55001.00000  56001.00000  2.140715766886e-06
56001.00000  57001.00000  2.410715953700e-06
57001.00000  58001.00000  1.899644171516e-06
58001.00000  59001.00000  2.063572856367e-06
59001.00000  60001.00000  2.102144311627e-06
60001.00000  61001.00000  1.629643984701e-06
61001.00000  62001.00000  1.812858397183e-06
62001.00000  63001.00000  1.861072716257e-06
63001.00000  64001.00000  1.735715486664e-06
64001.00000  65001.00000  1.600715393257e-06
65001.00000  66001.00000  1.581429665627e-06
66001.00000  67001.00000  1.745358350479e-06
67001.00000  68001.00000  1.407858116961e-06
68001.00000  69001.00000  1.485001027479e-06
69001.00000  70001.00000  1.648929712331e-06
70001.00000  71001.00000  1.475358163665e-06
71001.00000  72001.00000  1.272858023554e-06
72001.00000  73001.00000  1.513929618924e-06
73001.00000  74001.00000  1.186072249221e-06
74001.00000  75001.00000  1.378929525517e-06
75001.00000  76001.00000  1.388572389331e-06
76001.00000  77001.00000  1.041429291999e-06
77001.00000  78001.00000  1.022143564369e-06
78001.00000  79001.00000  9.257149262209e-07
79001.00000  80001.00000  1.012500700554e-06
80001.00000  81001.00000  9.739292452949e-07
81001.00000  82001.00000  9.835721091097e-07
82001.00000  83001.00000  9.932149729245e-07
83001.00000  84001.00000  8.678577433321e-07
84001.00000  85001.00000  9.932149729245e-07
85001.00000  86001.00000  9.642863814801e-07
86001.00000  87001.00000  9.064291985913e-07
87001.00000  88001.00000  8.100005604433e-07
88001.00000  89001.00000  1.070357883443e-06
89001.00000  90001.00000  8.389291518877e-07
90001.00000  91001.00000  6.942861946657e-07
91001.00000  92001.00000  8.582148795173e-07
92001.00000  93001.00000  6.750004670361e-07
93001.00000  94001.00000  8.003576966285e-07
94001.00000  95001.00000  6.653576032213e-07
95001.00000  96001.00000  6.942861946657e-07
96001.00000  97001.00000  5.882146927029e-07
97001.00000  98001.00000  6.460718755917e-07
98001.00000  99001.00000  6.171432841473e-07
99001.00000  100001.00000  5.400003736289e-07
100001.00000  101001.00000  5.592861012585e-07
101001.00000  102001.00000  7.135719222953e-07
102001.00000  103001.00000  5.592861012585e-07
103001.00000  104001.00000  5.496432374437e-07
104001.00000  105001.00000  5.014289183697e-07
105001.00000  106001.00000  4.917860545549e-07
106001.00000  107001.00000  4.435717354809e-07
107001.00000  108001.00000  5.014289183697e-07
108001.00000  109001.00000  4.725003269253e-07
109001.00000  110001.00000  4.628574631105e-07
110001.00000  111001.00000  5.014289183697e-07
111001.00000  112001.00000  4.725003269253e-07
112001.00000  113001.00000  4.339288716661e-07
113001.00000  114001.00000  4.339288716661e-07
114001.00000  115001.00000  4.725003269253e-07
115001.00000  116001.00000  4.725003269253e-07
116001.00000  117001.00000  5.110717821845e-07
117001.00000  118001.00000  4.917860545549e-07
118001.00000  119001.00000  4.532145992957e-07
119001.00000  120001.00000  3.085716420736e-07
120001.00000  121001.00000  3.567859611476e-07
121001.00000  122001.00000  3.471430973328e-07
122001.00000  123001.00000  3.471430973328e-07
123001.00000  124001.00000  4.628574631105e-07
124001.00000  125001.00000  3.471430973328e-07
125001.00000  126001.00000  3.278573697032e-07
126001.00000  127001.00000  2.892859144440e-07
127001.00000  128001.00000  3.182145058884e-07
128001.00000  129001.00000  2.989287782588e-07
129001.00000  130001.00000  3.760716887772e-07
130001.00000  131001.00000  3.182145058884e-07
131001.00000  132001.00000  2.796430506292e-07
132001.00000  133001.00000  2.121430039256e-07
133001.00000  134001.00000  2.989287782588e-07
134001.00000  135001.00000  2.121430039256e-07
135001.00000  136001.00000  2.217858677404e-07
136001.00000  137001.00000  3.182145058884e-07
137001.00000  138001.00000  2.892859144440e-07
138001.00000  139001.00000  1.735715486664e-07
139001.00000  140001.00000  1.350000934072e-07
140001.00000  141001.00000  2.314287315552e-07
141001.00000  142001.00000  1.832144124812e-07
142001.00000  143001.00000  2.121430039256e-07
143001.00000  144001.00000  2.314287315552e-07
144001.00000  145001.00000  2.700001868144e-07
145001.00000  146001.00000  1.832144124812e-07
146001.00000  147001.00000  2.314287315552e-07
147001.00000  148001.00000  2.700001868144e-07
148001.00000  149001.00000  1.832144124812e-07
149001.00000  150001.00000  1.928572762960e-07
150001.00000  151001.00000  1.060715019628e-07
151001.00000  152001.00000  1.735715486664e-07
152001.00000  153001.00000  1.735715486664e-07
153001.00000  154001.00000  1.350000934072e-07
154001.00000  155001.00000  1.735715486664e-07
155001.00000  156001.00000  1.542858210368e-07
156001.00000  157001.00000  1.350000934072e-07
157001.00000  158001.00000  1.253572295924e-07
158001.00000  159001.00000  1.350000934072e-07
159001.00000  160001.00000  1.350000934072e-07
160001.00000  161001.00000  1.157143657776e-07
161001.00000  162001.00000  9.642863814801e-08
162001.00000  163001.00000  2.025001401108e-07
163001.00000  164001.00000  6.750004670361e-08
164001.00000  165001.00000  1.832144124812e-07
165001.00000  166001.00000  1.446429572220e-07
166001.00000  167001.00000  1.350000934072e-07
167001.00000  168001.00000  7.714291051841e-08
168001.00000  169001.00000  6.750004670361e-08
169001.00000  170001.00000  9.642863814801e-08
170001.00000  171001.00000  1.060715019628e-07
171001.00000  172001.00000  8.678577433321e-08
172001.00000  173001.00000  4.821431907401e-08
173001.00000  174001.00000  1.253572295924e-07
174001.00000  175001.00000  4.821431907401e-08
175001.00000  176001.00000  4.821431907401e-08
176001.00000  177001.00000  5.785718288881e-08
177001.00000  178001.00000  5.785718288881e-08
178001.00000  179001.00000  1.928572762960e-08
179001.00000  180001.00000  8.678577433321e-08
180001.00000  181001.00000  5.785718288881e-08
181001.00000  182001.00000  7.714291051841e-08
182001.00000  183001.00000  4.821431907401e-08
183001.00000  184001.00000  4.821431907401e-08
184001.00000  185001.00000  5.785718288881e-08
185001.00000  186001.00000  2.892859144440e-08
186001.00000  187001.00000  3.857145525920e-08
187001.00000  188001.00000  5.785718288881e-08
188001.00000  189001.00000  1.928572762960e-08
189001.00000  190001.00000  5.785718288881e-08
190001.00000  191001.00000  5.785718288881e-08
191001.00000  192001.00000  0.000000000000e+00
192001.00000  193001.00000  3.857145525920e-08
193001.00000  194001.00000  0.000000000000e+00
194001.00000  195001.00000  1.928572762960e-08
195001.00000  196001.00000  0.000000000000e+00
196001.00000  197001.00000  1.928572762960e-08
197001.00000  198001.00000  0.000000000000e+00
198001.00000  199001.00000  0.000000000000e+00
