300.00000  350.00000  2.285818437513e-06
350.00000  400.00000  1.523878958342e-06
400.00000  450.00000  1.523878958342e-06
450.00000  500.00000  1.523878958342e-06
500.00000  550.00000  6.857455312540e-06
550.00000  600.00000  1.523878958342e-06
600.00000  650.00000  1.904848697928e-06
650.00000  700.00000  3.809697395856e-07
700.00000  750.00000  1.142909218757e-06
750.00000  800.00000  1.904848697928e-06
800.00000  850.00000  4.190667135441e-06
850.00000  900.00000  1.142909218757e-06
900.00000  950.00000  7.619394791711e-07
950.00000  1000.00000  7.619394791711e-07
1000.00000  1050.00000  1.904848697928e-06
1050.00000  1100.00000  3.809697395856e-07
1100.00000  1150.00000  1.142909218757e-06
1150.00000  1200.00000  1.523878958342e-06
1200.00000  1250.00000  1.142909218757e-06
1250.00000  1300.00000  8.762304010468e-06
1300.00000  1350.00000  1.904848697928e-06
1350.00000  1400.00000  1.523878958342e-06
1400.00000  1450.00000  7.619394791711e-07
1450.00000  1500.00000  1.904848697928e-06
1500.00000  1550.00000  1.142909218757e-06
1550.00000  1600.00000  1.142909218757e-06
1600.00000  1650.00000  1.904848697928e-06
1650.00000  1700.00000  1.142909218757e-06
1700.00000  1750.00000  1.676266854177e-05
1750.00000  1800.00000  2.285818437513e-06
1800.00000  1850.00000  3.809697395856e-06
1850.00000  1900.00000  3.428727656270e-06
1900.00000  1950.00000  1.904848697928e-06
1950.00000  2000.00000  3.428727656270e-06
2000.00000  2050.00000  4.190667135441e-06
2050.00000  2100.00000  3.428727656270e-06
2100.00000  2150.00000  2.285818437513e-06
2150.00000  2200.00000  3.047757916685e-06
2200.00000  2250.00000  6.095515833369e-06
2250.00000  2300.00000  1.904848697928e-06
2300.00000  2350.00000  3.581115552104e-05
2350.00000  2400.00000  5.714546093784e-06
2400.00000  2450.00000  5.333576354198e-06
2450.00000  2500.00000  4.952606614612e-06
2500.00000  2550.00000  4.571636875027e-06
2550.00000  2600.00000  5.333576354198e-06
2600.00000  2650.00000  7.238425052126e-06
2650.00000  2700.00000  4.952606614612e-06
2700.00000  2750.00000  6.857455312540e-06
2750.00000  2800.00000  8.000364531297e-06
2800.00000  2850.00000  7.238425052126e-06
2850.00000  2900.00000  6.095515833369e-06
2900.00000  2950.00000  5.333576354198e-06
2950.00000  3000.00000  2.438206333348e-05
3000.00000  3050.00000  8.000364531297e-06
3050.00000  3100.00000  8.381334270883e-06
3100.00000  3150.00000  8.000364531297e-06
3150.00000  3200.00000  1.409588036467e-05
3200.00000  3250.00000  8.381334270883e-06
3250.00000  3300.00000  8.762304010468e-06
3300.00000  3350.00000  1.181006192715e-05
3350.00000  3400.00000  9.905213229225e-06
3400.00000  3450.00000  1.409588036467e-05
3450.00000  3500.00000  1.523878958342e-05
3500.00000  3550.00000  1.295297114591e-05
3550.00000  3600.00000  1.828654750011e-05
3600.00000  3650.00000  1.333394088550e-05
3650.00000  3700.00000  3.238242786477e-05
3700.00000  3750.00000  2.057236593762e-05
3750.00000  3800.00000  2.095333567721e-05
3800.00000  3850.00000  1.790557776052e-05
3850.00000  3900.00000  2.323915411472e-05
3900.00000  3950.00000  2.552497255223e-05
3950.00000  4000.00000  2.247721463555e-05
4000.00000  4050.00000  2.857273046892e-05
4050.00000  4100.00000  3.085854890643e-05
4100.00000  4150.00000  3.657309500022e-05
4150.00000  4200.00000  4.152570161483e-05
4200.00000  4250.00000  4.076376213566e-05
4250.00000  4300.00000  4.571636875027e-05
4300.00000  4350.00000  5.828837015659e-05
4350.00000  4400.00000  3.923988317731e-05
4400.00000  4450.00000  4.647830822944e-05
4450.00000  4500.00000  5.257382406281e-05
4500.00000  4550.00000  7.162231104209e-05
4550.00000  4600.00000  5.943127937535e-05
4600.00000  4650.00000  6.895552286499e-05
4650.00000  4700.00000  7.619394791711e-05
4700.00000  4750.00000  7.505103869836e-05
4750.00000  4800.00000  8.495625192758e-05
4800.00000  4850.00000  8.838497958385e-05
4850.00000  4900.00000  8.914691906302e-05
4900.00000  4950.00000  9.600437437556e-05
4950.00000  5000.00000  9.714728359432e-05
5000.00000  5050.00000  1.032427994277e-04
5050.00000  5100.00000  1.120051034382e-04
5100.00000  5150.00000  1.112431639590e-04
5150.00000  5200.00000  1.074334665631e-04
5200.00000  5250.00000  1.295297114591e-04
5250.00000  5300.00000  1.238151653653e-04
5300.00000  5350.00000  1.375300759904e-04
5350.00000  5400.00000  1.436255918238e-04
5400.00000  5450.00000  1.421017128654e-04
5450.00000  5500.00000  1.360061970320e-04
5500.00000  5550.00000  1.546737142717e-04
5550.00000  5600.00000  1.501020773967e-04
5600.00000  5650.00000  1.630550485426e-04
5650.00000  5700.00000  1.661028064593e-04
5700.00000  5750.00000  1.523878958342e-04
5750.00000  5800.00000  1.706744433343e-04
5800.00000  5850.00000  1.588643814072e-04
5850.00000  5900.00000  1.912468092720e-04
5900.00000  5950.00000  1.798177170844e-04
5950.00000  6000.00000  1.828654750011e-04
6000.00000  6050.00000  1.668647459385e-04
6050.00000  6100.00000  1.935326277095e-04
6100.00000  6150.00000  1.775318986469e-04
6150.00000  6200.00000  2.000091132824e-04
6200.00000  6250.00000  1.984852343241e-04
6250.00000  6300.00000  2.186766305221e-04
6300.00000  6350.00000  2.221053581784e-04
6350.00000  6400.00000  5.230714524510e-04
6400.00000  6450.00000  1.901039000532e-04
6450.00000  6500.00000  2.110572357304e-04
6500.00000  6550.00000  2.118191752096e-04
6550.00000  6600.00000  2.061046291158e-04
6600.00000  6650.00000  1.958184461470e-04
6650.00000  6700.00000  2.251531160951e-04
6700.00000  6750.00000  2.160098423450e-04
6750.00000  6800.00000  2.270579647930e-04
6800.00000  6850.00000  2.167717818242e-04
6850.00000  6900.00000  2.015329922408e-04
6900.00000  6950.00000  2.057236593762e-04
6950.00000  7000.00000  2.262960253138e-04
7000.00000  7050.00000  2.320105714076e-04
7050.00000  7100.00000  2.731553032829e-04
7100.00000  7150.00000  1.036237691673e-04
7150.00000  7200.00000  8.267043349007e-05
7200.00000  7250.00000  9.143273750054e-05
7250.00000  7300.00000  9.295661645888e-05
7300.00000  7350.00000  8.419431244841e-05
7350.00000  7400.00000  9.943310203183e-05
7400.00000  7450.00000  9.562340463598e-05
7450.00000  7500.00000  1.127670429173e-04
7500.00000  7550.00000  1.070524968235e-04
7550.00000  7600.00000  1.131480126569e-04
7600.00000  7650.00000  1.074334665631e-04
7650.00000  7700.00000  1.139099521361e-04
7700.00000  7750.00000  8.724207036510e-05
7750.00000  7800.00000  1.070524968235e-04
7800.00000  7850.00000  1.127670429173e-04
7850.00000  7900.00000  1.142909218757e-04
7900.00000  7950.00000  1.241961351049e-04
7950.00000  8000.00000  1.108621942194e-04
8000.00000  8050.00000  1.188625587507e-04
8050.00000  8100.00000  1.154338310944e-04
8100.00000  8150.00000  1.142909218757e-04
8150.00000  8200.00000  1.215293469278e-04
8200.00000  8250.00000  1.230532258861e-04
8250.00000  8300.00000  1.360061970320e-04
8300.00000  8350.00000  1.264819535424e-04
8350.00000  8400.00000  1.169577100528e-04
8400.00000  8450.00000  1.196244982299e-04
8450.00000  8500.00000  1.150528613548e-04
8500.00000  8550.00000  1.253390443237e-04
8550.00000  8600.00000  1.253390443237e-04
8600.00000  8650.00000  1.207674074486e-04
8650.00000  8700.00000  1.158148008340e-04
8700.00000  8750.00000  1.120051034382e-04
8750.00000  8800.00000  1.192435284903e-04
8800.00000  8850.00000  1.181006192715e-04
8850.00000  8900.00000  1.310535904174e-04
8900.00000  8950.00000  1.192435284903e-04
8950.00000  9000.00000  1.325774693758e-04
9000.00000  9050.00000  1.165767403132e-04
9050.00000  9100.00000  1.283868022403e-04
9100.00000  9150.00000  1.184815890111e-04
9150.00000  9200.00000  1.241961351049e-04
9200.00000  9250.00000  1.253390443237e-04
9250.00000  9300.00000  1.253390443237e-04
9300.00000  9350.00000  1.310535904174e-04
9350.00000  9400.00000  1.268629232820e-04
9400.00000  9450.00000  1.241961351049e-04
9450.00000  9500.00000  1.276248627612e-04
9500.00000  9550.00000  1.348632878133e-04
9550.00000  9600.00000  1.264819535424e-04
9600.00000  9650.00000  1.249580745841e-04
9650.00000  9700.00000  1.249580745841e-04
9700.00000  9750.00000  1.219103166674e-04
9750.00000  9800.00000  1.318155298966e-04
9800.00000  9850.00000  1.291487417195e-04
9850.00000  9900.00000  1.306726206779e-04
9900.00000  9950.00000  1.333394088550e-04
9950.00000  10000.00000  1.219103166674e-04
