10001.00000  11001.00000  3.414281952885e-04
11001.00000  12001.00000  2.665913148145e-04
12001.00000  13001.00000  2.036913588843e-04
13001.00000  14001.00000  1.756375766228e-04
14001.00000  15001.00000  1.430421362015e-04
15001.00000  16001.00000  1.209367203794e-04
16001.00000  17001.00000  9.469156304883e-05
17001.00000  18001.00000  8.452307177066e-05
18001.00000  19001.00000  6.937081401625e-05
19001.00000  20001.00000  5.851906443085e-05
20001.00000  21001.00000  5.249031466119e-05
21001.00000  22001.00000  4.642137322640e-05
22001.00000  23001.00000  4.163856507580e-05
23001.00000  24001.00000  3.560981530614e-05
24001.00000  25001.00000  3.159064879303e-05
25001.00000  26001.00000  2.692841563782e-05
26001.00000  27001.00000  2.439634073457e-05
27001.00000  28001.00000  2.126139085434e-05
28001.00000  29001.00000  2.001544923528e-05
29001.00000  30001.00000  1.772452432281e-05
30001.00000  31001.00000  1.551398274060e-05
31001.00000  32001.00000  1.414746612614e-05
32001.00000  33001.00000  1.298190783734e-05
33001.00000  34001.00000  1.125366623670e-05
34001.00000  35001.00000  1.020868294329e-05
35001.00000  36001.00000  9.284274645280e-06
36001.00000  37001.00000  9.645999631459e-06
37001.00000  38001.00000  7.957949695954e-06
38001.00000  39001.00000  7.475649714381e-06
39001.00000  40001.00000  6.953158067677e-06
40001.00000  41001.00000  6.229708095318e-06
41001.00000  42001.00000  6.591433081497e-06
42001.00000  43001.00000  5.224916467041e-06
43001.00000  44001.00000  4.903383145992e-06
44001.00000  45001.00000  4.179933173632e-06
45001.00000  46001.00000  4.501466494681e-06
46001.00000  47001.00000  4.501466494681e-06
47001.00000  48001.00000  2.572266568389e-06
48001.00000  49001.00000  3.657441526928e-06
49001.00000  50001.00000  3.416291536142e-06
50001.00000  51001.00000  3.376099871011e-06
51001.00000  52001.00000  2.612458233520e-06
52001.00000  53001.00000  2.089966586816e-06
53001.00000  54001.00000  1.969391591423e-06
54001.00000  55001.00000  2.130158251947e-06
55001.00000  56001.00000  2.170349917078e-06
56001.00000  57001.00000  1.567474940112e-06
57001.00000  58001.00000  2.009583256554e-06
58001.00000  59001.00000  1.808624930899e-06
59001.00000  60001.00000  8.842166328838e-07
60001.00000  61001.00000  1.205749953932e-06
61001.00000  62001.00000  1.205749953932e-06
62001.00000  63001.00000  1.286133284195e-06
63001.00000  64001.00000  1.085174958539e-06
64001.00000  65001.00000  1.044983293408e-06
65001.00000  66001.00000  1.165558288801e-06
66001.00000  67001.00000  9.645999631459e-07
67001.00000  68001.00000  1.004791628277e-06
68001.00000  69001.00000  1.085174958539e-06
69001.00000  70001.00000  1.085174958539e-06
70001.00000  71001.00000  5.224916467041e-07
71001.00000  72001.00000  7.234499723595e-07
72001.00000  73001.00000  7.234499723595e-07
73001.00000  74001.00000  7.234499723595e-07
74001.00000  75001.00000  8.842166328838e-07
75001.00000  76001.00000  5.224916467041e-07
76001.00000  77001.00000  3.215333210486e-07
77001.00000  78001.00000  5.224916467041e-07
78001.00000  79001.00000  5.626833118351e-07
79001.00000  80001.00000  3.617249861797e-07
80001.00000  81001.00000  5.626833118351e-07
81001.00000  82001.00000  3.617249861797e-07
82001.00000  83001.00000  3.617249861797e-07
83001.00000  84001.00000  4.019166513108e-07
84001.00000  85001.00000  3.617249861797e-07
85001.00000  86001.00000  4.421083164419e-07
86001.00000  87001.00000  3.617249861797e-07
87001.00000  88001.00000  2.009583256554e-07
88001.00000  89001.00000  4.019166513108e-07
89001.00000  90001.00000  4.019166513108e-07
90001.00000  91001.00000  4.019166513108e-07
91001.00000  92001.00000  2.009583256554e-07
92001.00000  93001.00000  2.009583256554e-07
93001.00000  94001.00000  1.205749953932e-07
94001.00000  95001.00000  2.009583256554e-07
95001.00000  96001.00000  1.607666605243e-07
96001.00000  97001.00000  2.411499907865e-07
97001.00000  98001.00000  2.411499907865e-07
98001.00000  99001.00000  1.205749953932e-07
99001.00000  100001.00000  2.009583256554e-07
100001.00000  101001.00000  8.038333026216e-08
101001.00000  102001.00000  2.411499907865e-07
102001.00000  103001.00000  3.215333210486e-07
103001.00000  104001.00000  8.038333026216e-08
104001.00000  105001.00000  1.205749953932e-07
105001.00000  106001.00000  2.009583256554e-07
106001.00000  107001.00000  1.205749953932e-07
107001.00000  108001.00000  1.607666605243e-07
108001.00000  109001.00000  8.038333026216e-08
109001.00000  110001.00000  1.205749953932e-07
110001.00000  111001.00000  2.411499907865e-07
111001.00000  112001.00000  8.038333026216e-08
112001.00000  113001.00000  4.019166513108e-08
113001.00000  114001.00000  1.205749953932e-07
114001.00000  115001.00000  4.019166513108e-08
115001.00000  116001.00000  4.019166513108e-08
116001.00000  117001.00000  4.019166513108e-08
117001.00000  118001.00000  4.019166513108e-08
118001.00000  119001.00000  8.038333026216e-08
119001.00000  120001.00000  1.205749953932e-07
120001.00000  121001.00000  1.205749953932e-07
121001.00000  122001.00000  8.038333026216e-08
122001.00000  123001.00000  8.038333026216e-08
123001.00000  124001.00000  4.019166513108e-08
124001.00000  125001.00000  8.038333026216e-08
125001.00000  126001.00000  0.000000000000e+00
126001.00000  127001.00000  8.038333026216e-08
127001.00000  128001.00000  4.019166513108e-08
128001.00000  129001.00000  4.019166513108e-08
129001.00000  130001.00000  0.000000000000e+00
130001.00000  131001.00000  4.019166513108e-08
131001.00000  132001.00000  8.038333026216e-08
132001.00000  133001.00000  0.000000000000e+00
133001.00000  134001.00000  8.038333026216e-08
134001.00000  135001.00000  4.019166513108e-08
135001.00000  136001.00000  4.019166513108e-08
136001.00000  137001.00000  4.019166513108e-08
137001.00000  138001.00000  0.000000000000e+00
138001.00000  139001.00000  1.205749953932e-07
139001.00000  140001.00000  0.000000000000e+00
140001.00000  141001.00000  0.000000000000e+00
141001.00000  142001.00000  0.000000000000e+00
142001.00000  143001.00000  0.000000000000e+00
143001.00000  144001.00000  4.019166513108e-08
144001.00000  145001.00000  0.000000000000e+00
145001.00000  146001.00000  4.019166513108e-08
146001.00000  147001.00000  0.000000000000e+00
147001.00000  148001.00000  4.019166513108e-08
148001.00000  149001.00000  0.000000000000e+00
149001.00000  150001.00000  0.000000000000e+00
150001.00000  151001.00000  4.019166513108e-08
151001.00000  152001.00000  8.038333026216e-08
152001.00000  153001.00000  8.038333026216e-08
153001.00000  154001.00000  4.019166513108e-08
154001.00000  155001.00000  0.000000000000e+00
155001.00000  156001.00000  0.000000000000e+00
156001.00000  157001.00000  4.019166513108e-08
157001.00000  158001.00000  0.000000000000e+00
158001.00000  159001.00000  4.019166513108e-08
159001.00000  160001.00000  0.000000000000e+00
160001.00000  161001.00000  0.000000000000e+00
161001.00000  162001.00000  0.000000000000e+00
162001.00000  163001.00000  0.000000000000e+00
163001.00000  164001.00000  4.019166513108e-08
164001.00000  165001.00000  0.000000000000e+00
165001.00000  166001.00000  4.019166513108e-08
166001.00000  167001.00000  4.019166513108e-08
167001.00000  168001.00000  0.000000000000e+00
168001.00000  169001.00000  0.000000000000e+00
169001.00000  170001.00000  0.000000000000e+00
170001.00000  171001.00000  0.000000000000e+00
171001.00000  172001.00000  0.000000000000e+00
172001.00000  173001.00000  0.000000000000e+00
173001.00000  174001.00000  4.019166513108e-08
174001.00000  175001.00000  0.000000000000e+00
175001.00000  176001.00000  0.000000000000e+00
176001.00000  177001.00000  0.000000000000e+00
177001.00000  178001.00000  0.000000000000e+00
178001.00000  179001.00000  0.000000000000e+00
179001.00000  180001.00000  0.000000000000e+00
180001.00000  181001.00000  0.000000000000e+00
181001.00000  182001.00000  0.000000000000e+00
182001.00000  183001.00000  0.000000000000e+00
183001.00000  184001.00000  0.000000000000e+00
184001.00000  185001.00000  0.000000000000e+00
185001.00000  186001.00000  0.000000000000e+00
186001.00000  187001.00000  0.000000000000e+00
187001.00000  188001.00000  0.000000000000e+00
188001.00000  189001.00000  0.000000000000e+00
189001.00000  190001.00000  0.000000000000e+00
190001.00000  191001.00000  0.000000000000e+00
191001.00000  192001.00000  0.000000000000e+00
192001.00000  193001.00000  0.000000000000e+00
193001.00000  194001.00000  0.000000000000e+00
194001.00000  195001.00000  0.000000000000e+00
195001.00000  196001.00000  4.019166513108e-08
196001.00000  197001.00000  0.000000000000e+00
197001.00000  198001.00000  0.000000000000e+00
198001.00000  199001.00000  0.000000000000e+00
