300.00000  350.00000  5.727871819972e-06
350.00000  400.00000  1.217172761744e-05
400.00000  450.00000  6.801847786216e-06
450.00000  500.00000  1.360369557243e-05
500.00000  550.00000  9.271992508579e-05
550.00000  600.00000  7.159839774965e-06
600.00000  650.00000  2.684939915612e-05
650.00000  700.00000  1.181373562869e-05
700.00000  750.00000  1.503566352743e-05
750.00000  800.00000  8.233815741209e-06
800.00000  850.00000  4.618096654852e-05
850.00000  900.00000  5.727871819972e-06
900.00000  950.00000  8.591807729958e-06
950.00000  1000.00000  7.875823752461e-06
1000.00000  1050.00000  8.949799718706e-06
1050.00000  1100.00000  7.517831763713e-06
1100.00000  1150.00000  6.443855797468e-06
1150.00000  1200.00000  5.727871819972e-06
1200.00000  1250.00000  9.307791707454e-06
1250.00000  1300.00000  2.470144722363e-05
1300.00000  1350.00000  5.727871819972e-06
1350.00000  1400.00000  6.801847786216e-06
1400.00000  1450.00000  5.727871819972e-06
1450.00000  1500.00000  6.801847786216e-06
1500.00000  1550.00000  7.517831763713e-06
1550.00000  1600.00000  6.801847786216e-06
1600.00000  1650.00000  7.875823752461e-06
1650.00000  1700.00000  8.591807729958e-06
1700.00000  1750.00000  1.646763148242e-05
1750.00000  1800.00000  5.727871819972e-06
1800.00000  1850.00000  5.369879831224e-06
1850.00000  1900.00000  5.011887842475e-06
1900.00000  1950.00000  2.863935909986e-06
1950.00000  2000.00000  3.221927898734e-06
2000.00000  2050.00000  4.653895853727e-06
2050.00000  2100.00000  4.295903864979e-06
2100.00000  2150.00000  2.505943921238e-06
2150.00000  2200.00000  3.937911876231e-06
2200.00000  2250.00000  3.937911876231e-06
2250.00000  2300.00000  4.295903864979e-06
2300.00000  2350.00000  1.002377568495e-05
2350.00000  2400.00000  3.221927898734e-06
2400.00000  2450.00000  2.863935909986e-06
2450.00000  2500.00000  2.147951932489e-06
2500.00000  2550.00000  3.937911876231e-06
2550.00000  2600.00000  3.221927898734e-06
2600.00000  2650.00000  1.789959943741e-06
2650.00000  2700.00000  1.789959943741e-06
2700.00000  2750.00000  3.221927898734e-06
2750.00000  2800.00000  1.789959943741e-06
2800.00000  2850.00000  4.295903864979e-06
2850.00000  2900.00000  2.147951932489e-06
2900.00000  2950.00000  2.505943921238e-06
2950.00000  3000.00000  5.369879831224e-06
3000.00000  3050.00000  1.431967954993e-06
3050.00000  3100.00000  1.431967954993e-06
3100.00000  3150.00000  4.653895853727e-06
3150.00000  3200.00000  3.937911876231e-06
3200.00000  3250.00000  4.653895853727e-06
3250.00000  3300.00000  5.727871819972e-06
3300.00000  3350.00000  3.579919887482e-06
3350.00000  3400.00000  5.727871819972e-06
3400.00000  3450.00000  4.653895853727e-06
3450.00000  3500.00000  8.233815741209e-06
3500.00000  3550.00000  8.233815741209e-06
3550.00000  3600.00000  1.073975966245e-05
3600.00000  3650.00000  1.503566352743e-05
3650.00000  3700.00000  2.899735108861e-05
3700.00000  3750.00000  1.718361545992e-05
3750.00000  3800.00000  2.362747125738e-05
3800.00000  3850.00000  2.291148727989e-05
3850.00000  3900.00000  2.505943921238e-05
3900.00000  3950.00000  3.365124694233e-05
3950.00000  4000.00000  4.081108671730e-05
4000.00000  4050.00000  4.295903864979e-05
4050.00000  4100.00000  5.334080632349e-05
4100.00000  4150.00000  4.940289444726e-05
4150.00000  4200.00000  6.157462206470e-05
4200.00000  4250.00000  5.620474223347e-05
4250.00000  4300.00000  6.443855797468e-05
4300.00000  4350.00000  8.198016542335e-05
4350.00000  4400.00000  8.627606928832e-05
4400.00000  4450.00000  8.842402122081e-05
4450.00000  4500.00000  1.020277167932e-04
4500.00000  4550.00000  1.070396046357e-04
4550.00000  4600.00000  1.195693242419e-04
4600.00000  4650.00000  1.267291640169e-04
4650.00000  4700.00000  1.317410518594e-04
4700.00000  4750.00000  1.353209717468e-04
4750.00000  4800.00000  1.482086833418e-04
4800.00000  4850.00000  1.568004910717e-04
4850.00000  4900.00000  1.632443468692e-04
4900.00000  4950.00000  1.743420985204e-04
4950.00000  5000.00000  1.832918982391e-04
5000.00000  5050.00000  1.793539863629e-04
5050.00000  5100.00000  1.925996899466e-04
5100.00000  5150.00000  1.922416979578e-04
5150.00000  5200.00000  1.900937460253e-04
5200.00000  5250.00000  2.205230650689e-04
5250.00000  5300.00000  2.194490891027e-04
5300.00000  5350.00000  2.330527846751e-04
5350.00000  5400.00000  2.341267606413e-04
5400.00000  5450.00000  2.505943921238e-04
5450.00000  5500.00000  2.391386484838e-04
5500.00000  5550.00000  2.659880476399e-04
5550.00000  5600.00000  2.684939915612e-04
5600.00000  5650.00000  2.835296550886e-04
5650.00000  5700.00000  2.756538313361e-04
5700.00000  5750.00000  2.806657191786e-04
5750.00000  5800.00000  2.931954387848e-04
5800.00000  5850.00000  2.960593746948e-04
5850.00000  5900.00000  3.053671664022e-04
5900.00000  5950.00000  3.182548779972e-04
5950.00000  6000.00000  3.193288539634e-04
6000.00000  6050.00000  3.039351984473e-04
6050.00000  6100.00000  2.838876470774e-04
6100.00000  6150.00000  3.325745575471e-04
6150.00000  6200.00000  3.311425895921e-04
6200.00000  6250.00000  3.687317484107e-04
6250.00000  6300.00000  4.242205066667e-04
6300.00000  6350.00000  4.385401862166e-04
6350.00000  6400.00000  1.679340419218e-03
6400.00000  6450.00000  3.261307017496e-04
6450.00000  6500.00000  3.297106216371e-04
6500.00000  6550.00000  3.361544774346e-04
6550.00000  6600.00000  3.300686136259e-04
6600.00000  6650.00000  3.340065255021e-04
6650.00000  6700.00000  3.329325495359e-04
6700.00000  6750.00000  3.218347978847e-04
6750.00000  6800.00000  3.433143172096e-04
6800.00000  6850.00000  3.168229100422e-04
6850.00000  6900.00000  3.440303011871e-04
6900.00000  6950.00000  3.483262050520e-04
6950.00000  7000.00000  3.050091744135e-04
7000.00000  7050.00000  3.132429901547e-04
7050.00000  7100.00000  4.875850886751e-04
7100.00000  7150.00000  1.446287634543e-04
7150.00000  7200.00000  1.424808115218e-04
7200.00000  7250.00000  1.299510919156e-04
7250.00000  7300.00000  1.353209717468e-04
7300.00000  7350.00000  1.396168756118e-04
7350.00000  7400.00000  1.414068355556e-04
7400.00000  7450.00000  1.474926993643e-04
7450.00000  7500.00000  1.772060344304e-04
7500.00000  7550.00000  1.492826593080e-04
7550.00000  7600.00000  1.392588836231e-04
7600.00000  7650.00000  1.460607314093e-04
7650.00000  7700.00000  1.464187233980e-04
7700.00000  7750.00000  1.449867554430e-04
7750.00000  7800.00000  1.457027394205e-04
7800.00000  7850.00000  1.517886032293e-04
7850.00000  7900.00000  1.435547874880e-04
7900.00000  7950.00000  1.557265151055e-04
7950.00000  8000.00000  1.371109316906e-04
8000.00000  8050.00000  1.435547874880e-04
8050.00000  8100.00000  1.725521385766e-04
8100.00000  8150.00000  1.557265151055e-04
8150.00000  8200.00000  1.603804109592e-04
8200.00000  8250.00000  1.632443468692e-04
8250.00000  8300.00000  1.711201706217e-04
8300.00000  8350.00000  1.457027394205e-04
8350.00000  8400.00000  1.625283628917e-04
8400.00000  8450.00000  1.596644269817e-04
8450.00000  8500.00000  1.600224189705e-04
8500.00000  8550.00000  1.754160744866e-04
8550.00000  8600.00000  1.589484430042e-04
8600.00000  8650.00000  1.507146272630e-04
8650.00000  8700.00000  1.575164750492e-04
8700.00000  8750.00000  1.789959943741e-04
8750.00000  8800.00000  1.499986432855e-04
8800.00000  8850.00000  1.636023388579e-04
8850.00000  8900.00000  1.639603308467e-04
8900.00000  8950.00000  1.578744670380e-04
8950.00000  9000.00000  1.578744670380e-04
9000.00000  9050.00000  1.496406512968e-04
9050.00000  9100.00000  1.593064349930e-04
9100.00000  9150.00000  1.628863548804e-04
9150.00000  9200.00000  1.535785631730e-04
9200.00000  9250.00000  1.736261145429e-04
9250.00000  9300.00000  1.764900504529e-04
9300.00000  9350.00000  1.707621786329e-04
9350.00000  9400.00000  1.474926993643e-04
9400.00000  9450.00000  1.689722186892e-04
9450.00000  9500.00000  1.499986432855e-04
9500.00000  9550.00000  1.389008916343e-04
9550.00000  9600.00000  1.557265151055e-04
9600.00000  9650.00000  1.535785631730e-04
9650.00000  9700.00000  1.442707714655e-04
9700.00000  9750.00000  1.406908515781e-04
9750.00000  9800.00000  1.596644269817e-04
9800.00000  9850.00000  1.528625791955e-04
9850.00000  9900.00000  1.399748676006e-04
9900.00000  9950.00000  1.636023388579e-04
9950.00000  10000.00000  1.424808115218e-04
