300.00000  350.00000  2.018640795019e-01
350.00000  400.00000  1.513423682566e-01
400.00000  450.00000  1.176155319437e-01
450.00000  500.00000  9.409628111129e-02
500.00000  550.00000  7.738779920137e-02
550.00000  600.00000  6.445776253075e-02
600.00000  650.00000  5.409952475505e-02
650.00000  700.00000  4.622419388026e-02
700.00000  750.00000  4.018060927558e-02
750.00000  800.00000  3.505307630393e-02
800.00000  850.00000  3.126142221412e-02
850.00000  900.00000  2.768289471236e-02
900.00000  950.00000  2.471554429390e-02
950.00000  1000.00000  2.231653144355e-02
1000.00000  1050.00000  2.003961121149e-02
1050.00000  1100.00000  1.820572296562e-02
1100.00000  1150.00000  1.661744794015e-02
1150.00000  1200.00000  1.532797853309e-02
1200.00000  1250.00000  1.413204206751e-02
1250.00000  1300.00000  1.318743075769e-02
1300.00000  1350.00000  1.200434614667e-02
1350.00000  1400.00000  1.123930380467e-02
1400.00000  1450.00000  1.048425734954e-02
1450.00000  1500.00000  9.659596682231e-03
1500.00000  1550.00000  9.080549235318e-03
1550.00000  1600.00000  8.488649933849e-03
1600.00000  1650.00000  8.074177624437e-03
1650.00000  1700.00000  7.473353423972e-03
1700.00000  1750.00000  7.164551918682e-03
1750.00000  1800.00000  6.684035356694e-03
1800.00000  1850.00000  6.329538368540e-03
1850.00000  1900.00000  6.089280087546e-03
1900.00000  1950.00000  5.677663745813e-03
1950.00000  2000.00000  5.449900323414e-03
2000.00000  2050.00000  5.178583393911e-03
2050.00000  2100.00000  4.902625516930e-03
2100.00000  2150.00000  4.732338444071e-03
2150.00000  2200.00000  4.455666575169e-03
2200.00000  2250.00000  4.321436094257e-03
2250.00000  2300.00000  4.062614023350e-03
2300.00000  2350.00000  3.932310497996e-03
2350.00000  2400.00000  3.717755926113e-03
2400.00000  2450.00000  3.575671534083e-03
2450.00000  2500.00000  3.373968816755e-03
2500.00000  2550.00000  3.289360774266e-03
2550.00000  2600.00000  3.157272269113e-03
2600.00000  2650.00000  3.031252695278e-03
2650.00000  2700.00000  2.952356588146e-03
2700.00000  2750.00000  2.851683727462e-03
2750.00000  2800.00000  2.719952218269e-03
2800.00000  2850.00000  2.626776272742e-03
2850.00000  2900.00000  2.523604440339e-03
2900.00000  2950.00000  2.435069442291e-03
2950.00000  3000.00000  2.436497426130e-03
3000.00000  3050.00000  2.305479908857e-03
3050.00000  3100.00000  2.267638337110e-03
3100.00000  3150.00000  2.228011785565e-03
3150.00000  3200.00000  2.075931506659e-03
3200.00000  3250.00000  2.027737052076e-03
3250.00000  3300.00000  1.974901650015e-03
3300.00000  3350.00000  1.950625924744e-03
3350.00000  3400.00000  1.844241128702e-03
3400.00000  3450.00000  1.774983912486e-03
3450.00000  3500.00000  1.697158793234e-03
3500.00000  3550.00000  1.696801797274e-03
3550.00000  3600.00000  1.609337787105e-03
3600.00000  3650.00000  1.588632021433e-03
3650.00000  3700.00000  1.591487989112e-03
3700.00000  3750.00000  1.542936538569e-03
3750.00000  3800.00000  1.498669039545e-03
3800.00000  3850.00000  1.453330552641e-03
3850.00000  3900.00000  1.415488980895e-03
3900.00000  3950.00000  1.378361401068e-03
3950.00000  4000.00000  1.326953982846e-03
4000.00000  4050.00000  1.314459124251e-03
4050.00000  4100.00000  1.350515716198e-03
4100.00000  4150.00000  1.239846968637e-03
4150.00000  4200.00000  1.244487916116e-03
4200.00000  4250.00000  1.212715275687e-03
4250.00000  4300.00000  1.156309914027e-03
4300.00000  4350.00000  1.144172051392e-03
4350.00000  4400.00000  1.061348988701e-03
4400.00000  4450.00000  1.066346932139e-03
4450.00000  4500.00000  1.082411750334e-03
4500.00000  4550.00000  1.052067093744e-03
4550.00000  4600.00000  9.985176997635e-04
4600.00000  4650.00000  9.913777805661e-04
4650.00000  4700.00000  9.724569946928e-04
4700.00000  4750.00000  9.603191320572e-04
4750.00000  4800.00000  9.292604835482e-04
4800.00000  4850.00000  9.278324997088e-04
4850.00000  4900.00000  8.625022390521e-04
4900.00000  4950.00000  8.832080047247e-04
4950.00000  5000.00000  8.467944168177e-04
5000.00000  5050.00000  8.082388531515e-04
5050.00000  5100.00000  8.146647804292e-04
5100.00000  5150.00000  8.332285703425e-04
5150.00000  5200.00000  7.932450228368e-04
5200.00000  5250.00000  7.889610713183e-04
5250.00000  5300.00000  7.596874026088e-04
5300.00000  5350.00000  7.564744389699e-04
5350.00000  5400.00000  7.732532490839e-04
5400.00000  5450.00000  7.150629076247e-04
5450.00000  5500.00000  7.239878066215e-04
5500.00000  5550.00000  6.947141379120e-04
5550.00000  5600.00000  6.818622833566e-04
5600.00000  5650.00000  6.632984934432e-04
5650.00000  5700.00000  6.925721621527e-04
5700.00000  5750.00000  6.508036348477e-04
5750.00000  5800.00000  6.475906712088e-04
5800.00000  5850.00000  6.518746227273e-04
5850.00000  5900.00000  6.072501277432e-04
5900.00000  5950.00000  6.243859338171e-04
5950.00000  6000.00000  6.001102085458e-04
6000.00000  6050.00000  6.300978691750e-04
6050.00000  6100.00000  5.826174065120e-04
6100.00000  6150.00000  5.690515600368e-04
6150.00000  6200.00000  5.558427095216e-04
6200.00000  6250.00000  5.840453903515e-04
6250.00000  6300.00000  5.515587580031e-04
6300.00000  6350.00000  5.408488792069e-04
6350.00000  6400.00000  7.796791763616e-04
6400.00000  6450.00000  5.187151296948e-04
6450.00000  6500.00000  5.151451700961e-04
6500.00000  6550.00000  5.012223276611e-04
6550.00000  6600.00000  4.890844650254e-04
6600.00000  6650.00000  5.187151296948e-04
6650.00000  6700.00000  4.833725296674e-04
6700.00000  6750.00000  4.976523680623e-04
6750.00000  6800.00000  4.565978326770e-04
6800.00000  6850.00000  4.508858973190e-04
6850.00000  6900.00000  4.565978326770e-04
6900.00000  6950.00000  4.444599700413e-04
6950.00000  7000.00000  4.398190225630e-04
7000.00000  7050.00000  4.173282770910e-04
7050.00000  7100.00000  4.605247882356e-04
7100.00000  7150.00000  4.251821882082e-04
7150.00000  7200.00000  3.869836205018e-04
7200.00000  7250.00000  3.991214831375e-04
7250.00000  7300.00000  3.730607780668e-04
7300.00000  7350.00000  4.044764225356e-04
7350.00000  7400.00000  3.684198305885e-04
7400.00000  7450.00000  3.727037821069e-04
7450.00000  7500.00000  3.919815639401e-04
7500.00000  7550.00000  3.823426730235e-04
7550.00000  7600.00000  3.580669477522e-04
7600.00000  7650.00000  3.634218871503e-04
7650.00000  7700.00000  3.409311416783e-04
7700.00000  7750.00000  3.619939033108e-04
7750.00000  7800.00000  3.502130366350e-04
7800.00000  7850.00000  3.302212628821e-04
7850.00000  7900.00000  3.491420487554e-04
7900.00000  7950.00000  3.327202346012e-04
7950.00000  8000.00000  3.177264042866e-04
8000.00000  8050.00000  3.184403962063e-04
8050.00000  8100.00000  3.359331982401e-04
8100.00000  8150.00000  3.170124123668e-04
8150.00000  8200.00000  3.248663234840e-04
8200.00000  8250.00000  3.302212628821e-04
8250.00000  8300.00000  2.920226951757e-04
8300.00000  8350.00000  3.155844285273e-04
8350.00000  8400.00000  3.095154972095e-04
8400.00000  8450.00000  3.098724931694e-04
8450.00000  8500.00000  2.977346305337e-04
8500.00000  8550.00000  3.034465658917e-04
8550.00000  8600.00000  2.827408002191e-04
8600.00000  8650.00000  2.905947113363e-04
8650.00000  8700.00000  2.684609618242e-04
8700.00000  8750.00000  2.830977961789e-04
8750.00000  8800.00000  2.805988244598e-04
8800.00000  8850.00000  2.670329779847e-04
8850.00000  8900.00000  2.702459416235e-04
8900.00000  8950.00000  2.681039658643e-04
8950.00000  9000.00000  2.634630183859e-04
9000.00000  9050.00000  2.531101355496e-04
9050.00000  9100.00000  2.566800951484e-04
9100.00000  9150.00000  2.602500547471e-04
9150.00000  9200.00000  2.613210426267e-04
9200.00000  9250.00000  2.306193900777e-04
9250.00000  9300.00000  2.598930587872e-04
9300.00000  9350.00000  2.470412042318e-04
9350.00000  9400.00000  2.345463456363e-04
9400.00000  9450.00000  2.413292688738e-04
9450.00000  9500.00000  2.277634223987e-04
9500.00000  9550.00000  2.291914062382e-04
9550.00000  9600.00000  2.484691880713e-04
9600.00000  9650.00000  2.266924345191e-04
9650.00000  9700.00000  2.391872931146e-04
9700.00000  9750.00000  2.406152769541e-04
9750.00000  9800.00000  2.341893496764e-04
9800.00000  9850.00000  2.224084830006e-04
9850.00000  9900.00000  2.045586850070e-04
9900.00000  9950.00000  2.181245314821e-04
9950.00000  10000.00000  1.856378991337e-04
