300.00000  350.00000  1.586380406478e+00
350.00000  400.00000  1.122014063737e+00
400.00000  450.00000  8.299937086973e-01
450.00000  500.00000  6.343365464691e-01
500.00000  550.00000  4.994911438777e-01
550.00000  600.00000  4.001229775849e-01
600.00000  650.00000  3.279754192203e-01
650.00000  700.00000  2.718788710585e-01
700.00000  750.00000  2.290902745908e-01
750.00000  800.00000  1.961743144545e-01
800.00000  850.00000  1.681330890768e-01
850.00000  900.00000  1.452656118684e-01
900.00000  950.00000  1.272328031054e-01
950.00000  1000.00000  1.126175024548e-01
1000.00000  1050.00000  9.978886258019e-02
1050.00000  1100.00000  8.929445642716e-02
1100.00000  1150.00000  7.989148632129e-02
1150.00000  1200.00000  7.218243089637e-02
1200.00000  1250.00000  6.499349557278e-02
1250.00000  1300.00000  5.888635070247e-02
1300.00000  1350.00000  5.370889268947e-02
1350.00000  1400.00000  4.927637131233e-02
1400.00000  1450.00000  4.520964053428e-02
1450.00000  1500.00000  4.142263197906e-02
1500.00000  1550.00000  3.849259734258e-02
1550.00000  1600.00000  3.565827667625e-02
1600.00000  1650.00000  3.304283679435e-02
1650.00000  1700.00000  3.053720828907e-02
1700.00000  1750.00000  2.895533089100e-02
1750.00000  1800.00000  2.664409820104e-02
1800.00000  1850.00000  2.513048192897e-02
1850.00000  1900.00000  2.351966774923e-02
1900.00000  1950.00000  2.212699238517e-02
1950.00000  2000.00000  2.085822580417e-02
2000.00000  2050.00000  1.944700122109e-02
2050.00000  2100.00000  1.840676101842e-02
2100.00000  2150.00000  1.747039644227e-02
2150.00000  2200.00000  1.649470752179e-02
2200.00000  2250.00000  1.549824347601e-02
2250.00000  2300.00000  1.463533380717e-02
2300.00000  2350.00000  1.417086136290e-02
2350.00000  2400.00000  1.337769675758e-02
2400.00000  2450.00000  1.269508549763e-02
2450.00000  2500.00000  1.185517686038e-02
2500.00000  2550.00000  1.168007223283e-02
2550.00000  2600.00000  1.100117081668e-02
2600.00000  2650.00000  1.037940099511e-02
2650.00000  2700.00000  1.008929120963e-02
2700.00000  2750.00000  9.575106858381e-03
2750.00000  2800.00000  9.134377414454e-03
2800.00000  2850.00000  8.820524628627e-03
2850.00000  2900.00000  8.556383749775e-03
2900.00000  2950.00000  8.157204556454e-03
2950.00000  3000.00000  7.754315519329e-03
3000.00000  3050.00000  7.542112453735e-03
3050.00000  3100.00000  7.163708385716e-03
3100.00000  3150.00000  7.123642072632e-03
3150.00000  3200.00000  6.647298128186e-03
3200.00000  3250.00000  6.372769686682e-03
3250.00000  3300.00000  6.002527275033e-03
3300.00000  3350.00000  6.042593588118e-03
3350.00000  3400.00000  5.647866207361e-03
3400.00000  3450.00000  5.543990580847e-03
3450.00000  3500.00000  5.394112891161e-03
3500.00000  3550.00000  5.150747137612e-03
3550.00000  3600.00000  5.025354417033e-03
3600.00000  3650.00000  4.922220759279e-03
3650.00000  3700.00000  4.722631162619e-03
3700.00000  3750.00000  4.556430160195e-03
3750.00000  3800.00000  4.422875783248e-03
3800.00000  3850.00000  4.265578405954e-03
3850.00000  3900.00000  4.198059248719e-03
3900.00000  3950.00000  3.985856183125e-03
3950.00000  4000.00000  3.844140149808e-03
4000.00000  4050.00000  3.854527712460e-03
4050.00000  4100.00000  3.709101835339e-03
4100.00000  4150.00000  3.544384770437e-03
4150.00000  4200.00000  3.466478050551e-03
4200.00000  4250.00000  3.234241828414e-03
4250.00000  4300.00000  3.332181704842e-03
4300.00000  4350.00000  3.034652231754e-03
4350.00000  4400.00000  3.124430451813e-03
4400.00000  4450.00000  3.004231512560e-03
4450.00000  4500.00000  2.896646042241e-03
4500.00000  4550.00000  2.889226354633e-03
4550.00000  4600.00000  2.828384916246e-03
4600.00000  4650.00000  2.656990132496e-03
4650.00000  4700.00000  2.628053350824e-03
4700.00000  4750.00000  2.588729006501e-03
4750.00000  4800.00000  2.445529035662e-03
4800.00000  4850.00000  2.414366347708e-03
4850.00000  4900.00000  2.421786035316e-03
4900.00000  4950.00000  2.383203659754e-03
4950.00000  5000.00000  2.238519751394e-03
5000.00000  5050.00000  2.254101095371e-03
5050.00000  5100.00000  2.082706311622e-03
5100.00000  5150.00000  2.131676249836e-03
5150.00000  5200.00000  2.089384030469e-03
5200.00000  5250.00000  2.012219279344e-03
5250.00000  5300.00000  1.951377840956e-03
5300.00000  5350.00000  1.902407902742e-03
5350.00000  5400.00000  1.911311527872e-03
5400.00000  5450.00000  1.895730183895e-03
5450.00000  5500.00000  1.841566464355e-03
5500.00000  5550.00000  1.794080463663e-03
5550.00000  5600.00000  1.662010024237e-03
5600.00000  5650.00000  1.601168585849e-03
5650.00000  5700.00000  1.633815211325e-03
5700.00000  5750.00000  1.660526086715e-03
5750.00000  5800.00000  1.555908491439e-03
5800.00000  5850.00000  1.486163427922e-03
5850.00000  5900.00000  1.520293990920e-03
5900.00000  5950.00000  1.446097114838e-03
5950.00000  6000.00000  1.429031833339e-03
6000.00000  6050.00000  1.404546864232e-03
6050.00000  6100.00000  1.345931332127e-03
6100.00000  6150.00000  1.319962425499e-03
6150.00000  6200.00000  1.282863987458e-03
6200.00000  6250.00000  1.266540674720e-03
6250.00000  6300.00000  1.305123050282e-03
6300.00000  6350.00000  1.291767612587e-03
6350.00000  6400.00000  1.388223551494e-03
6400.00000  6450.00000  1.213860892701e-03
6450.00000  6500.00000  1.200505455007e-03
6500.00000  6550.00000  1.178988360943e-03
6550.00000  6600.00000  1.152277485553e-03
6600.00000  6650.00000  1.111469203708e-03
6650.00000  6700.00000  1.098855734774e-03
6700.00000  6750.00000  1.043950046474e-03
6750.00000  6800.00000  1.035046421344e-03
6800.00000  6850.00000  1.084016359558e-03
6850.00000  6900.00000  1.073628796906e-03
6900.00000  6950.00000  9.719790766741e-04
6950.00000  7000.00000  9.400744199589e-04
7000.00000  7050.00000  9.957220770203e-04
7050.00000  7100.00000  9.994319208244e-04
7100.00000  7150.00000  8.970402318313e-04
7150.00000  7200.00000  9.371065449156e-04
7200.00000  7250.00000  8.822008566149e-04
7250.00000  7300.00000  9.029759819179e-04
7300.00000  7350.00000  8.918464505056e-04
7350.00000  7400.00000  8.807169190933e-04
7400.00000  7450.00000  8.747811690067e-04
7450.00000  7500.00000  8.228433557493e-04
7500.00000  7550.00000  8.161656369019e-04
7550.00000  7600.00000  8.072620117721e-04
7600.00000  7650.00000  8.399086372482e-04
7650.00000  7700.00000  8.206174494668e-04
7700.00000  7750.00000  7.627438861229e-04
7750.00000  7800.00000  7.694216049703e-04
7800.00000  7850.00000  7.197096979953e-04
7850.00000  7900.00000  7.345490732117e-04
7900.00000  7950.00000  7.449366358632e-04
7950.00000  8000.00000  6.722236973029e-04
8000.00000  8050.00000  7.070962290614e-04
8050.00000  8100.00000  7.152578854304e-04
8100.00000  8150.00000  6.766755098678e-04
8150.00000  8200.00000  6.484806969566e-04
8200.00000  8250.00000  6.299314779361e-04
8250.00000  8300.00000  6.069304463507e-04
8300.00000  8350.00000  6.789014161502e-04
8350.00000  8400.00000  6.366091967835e-04
8400.00000  8450.00000  6.677718847379e-04
8450.00000  8500.00000  6.143501339589e-04
8500.00000  8550.00000  5.690900395489e-04
8550.00000  8600.00000  5.794776022004e-04
8600.00000  8650.00000  6.269636028928e-04
8650.00000  8700.00000  5.817035084828e-04
8700.00000  8750.00000  5.742838208746e-04
8750.00000  8800.00000  5.497988517676e-04
8800.00000  8850.00000  5.824454772436e-04
8850.00000  8900.00000  5.245719138997e-04
8900.00000  8950.00000  5.609283831799e-04
8950.00000  9000.00000  5.854133522869e-04
9000.00000  9050.00000  5.564765706149e-04
9050.00000  9100.00000  5.334755390295e-04
9100.00000  9150.00000  5.171522262915e-04
9150.00000  9200.00000  5.119584449658e-04
9200.00000  9250.00000  4.748600069248e-04
9250.00000  9300.00000  5.371853828336e-04
9300.00000  9350.00000  5.052807261184e-04
9350.00000  9400.00000  4.570527566651e-04
9400.00000  9450.00000  4.681822880774e-04
9450.00000  9500.00000  4.370196001229e-04
9500.00000  9550.00000  4.793118194897e-04
9550.00000  9600.00000  4.726341006423e-04
9600.00000  9650.00000  4.770859132072e-04
9650.00000  9700.00000  4.770859132072e-04
9700.00000  9750.00000  4.533429128610e-04
9750.00000  9800.00000  4.303418812756e-04
9800.00000  9850.00000  4.436973189703e-04
9850.00000  9900.00000  4.281159749931e-04
9900.00000  9950.00000  4.236641624282e-04
9950.00000  10000.00000  4.236641624282e-04
