300.00000  350.00000  1.609670011969e+00
350.00000  400.00000  1.139407507555e+00
400.00000  450.00000  8.411956870207e-01
450.00000  500.00000  6.434369710140e-01
500.00000  550.00000  5.050208936425e-01
550.00000  600.00000  4.065111219351e-01
600.00000  650.00000  3.327012831495e-01
650.00000  700.00000  2.760246237102e-01
700.00000  750.00000  2.329866000220e-01
750.00000  800.00000  1.976077264834e-01
800.00000  850.00000  1.703259478314e-01
850.00000  900.00000  1.478059731023e-01
900.00000  950.00000  1.294701359109e-01
950.00000  1000.00000  1.139279804973e-01
1000.00000  1050.00000  1.004651235944e-01
1050.00000  1100.00000  9.011595611575e-02
1100.00000  1150.00000  8.049469335416e-02
1150.00000  1200.00000  7.234576624317e-02
1200.00000  1250.00000  6.561584017501e-02
1250.00000  1300.00000  5.921493605325e-02
1300.00000  1350.00000  5.458008352054e-02
1350.00000  1400.00000  4.942240159354e-02
1400.00000  1450.00000  4.568071594274e-02
1450.00000  1500.00000  4.203142686593e-02
1500.00000  1550.00000  3.860599290334e-02
1550.00000  1600.00000  3.587390884152e-02
1600.00000  1650.00000  3.315534622954e-02
1650.00000  1700.00000  3.107604771892e-02
1700.00000  1750.00000  2.891787408416e-02
1750.00000  1800.00000  2.688139349807e-02
1800.00000  1850.00000  2.507552875112e-02
1850.00000  1900.00000  2.350779175991e-02
1900.00000  1950.00000  2.208653714210e-02
1950.00000  2000.00000  2.088763525520e-02
2000.00000  2050.00000  1.944534727095e-02
2050.00000  2100.00000  1.862805074654e-02
2100.00000  2150.00000  1.723383902844e-02
2150.00000  2200.00000  1.655401057753e-02
2200.00000  2250.00000  1.564807343742e-02
2250.00000  2300.00000  1.506740228543e-02
2300.00000  2350.00000  1.413066628733e-02
2350.00000  2400.00000  1.319242790591e-02
2400.00000  2450.00000  1.273870814420e-02
2450.00000  2500.00000  1.193868902794e-02
2500.00000  2550.00000  1.142862989184e-02
2550.00000  2600.00000  1.096063748862e-02
2600.00000  2650.00000  1.051893679344e-02
2650.00000  2700.00000  1.012756593939e-02
2700.00000  2750.00000  9.603985353438e-03
2750.00000  2800.00000  9.219375224305e-03
2800.00000  2850.00000  8.753636396059e-03
2850.00000  2900.00000  8.445647816089e-03
2900.00000  2950.00000  8.038501937203e-03
2950.00000  3000.00000  7.678681132800e-03
3000.00000  3050.00000  7.671920407873e-03
3050.00000  3100.00000  7.206181579627e-03
3100.00000  3150.00000  6.995847915257e-03
3150.00000  3200.00000  6.809552383959e-03
3200.00000  3250.00000  6.355081430589e-03
3250.00000  3300.00000  6.213857398798e-03
3300.00000  3350.00000  5.833754419617e-03
3350.00000  3400.00000  5.666989871438e-03
3400.00000  3450.00000  5.475435998530e-03
3450.00000  3500.00000  5.471680040238e-03
3500.00000  3550.00000  5.293647617182e-03
3550.00000  3600.00000  5.026974578428e-03
3600.00000  3650.00000  4.770067031234e-03
3650.00000  3700.00000  4.679924032219e-03
3700.00000  3750.00000  4.549216683646e-03
3750.00000  3800.00000  4.422265293366e-03
3800.00000  3850.00000  4.144324379735e-03
3850.00000  3900.00000  4.125544588274e-03
3900.00000  3950.00000  3.957277656778e-03
3950.00000  4000.00000  3.952019315169e-03
4000.00000  4050.00000  3.699618917926e-03
4050.00000  4100.00000  3.713140367778e-03
4100.00000  4150.00000  3.608724727252e-03
4150.00000  4200.00000  3.445716137366e-03
4200.00000  4250.00000  3.352568371716e-03
4250.00000  4300.00000  3.253411072799e-03
4300.00000  4350.00000  3.290970655722e-03
4350.00000  4400.00000  3.112938232667e-03
4400.00000  4450.00000  2.994249950630e-03
4450.00000  4500.00000  3.010776167116e-03
4500.00000  4550.00000  2.792179394504e-03
4550.00000  4600.00000  2.814715144257e-03
4600.00000  4650.00000  2.724572145242e-03
4650.00000  4700.00000  2.666730387540e-03
4700.00000  4750.00000  2.715557845340e-03
4750.00000  4800.00000  2.469918173023e-03
4800.00000  4850.00000  2.476678897950e-03
4850.00000  4900.00000  2.442124081660e-03
4900.00000  4950.00000  2.348225124353e-03
4950.00000  5000.00000  2.364000149180e-03
5000.00000  5050.00000  2.230288033974e-03
5050.00000  5100.00000  2.210757050854e-03
5100.00000  5150.00000  2.154417676469e-03
5150.00000  5200.00000  2.038734161066e-03
5200.00000  5250.00000  2.076293743989e-03
5250.00000  5300.00000  1.975634061755e-03
5300.00000  5350.00000  1.953098312001e-03
5350.00000  5400.00000  1.915538729078e-03
5400.00000  5450.00000  1.862955312986e-03
5450.00000  5500.00000  1.799855213675e-03
5500.00000  5550.00000  1.765300397386e-03
5550.00000  5600.00000  1.738257497681e-03
5600.00000  5650.00000  1.720228897878e-03
5650.00000  5700.00000  1.706707448026e-03
5700.00000  5750.00000  1.716472939586e-03
5750.00000  5800.00000  1.578253674429e-03
5800.00000  5850.00000  1.595531082573e-03
5850.00000  5900.00000  1.551961966383e-03
5900.00000  5950.00000  1.534684558238e-03
5950.00000  6000.00000  1.505388083558e-03
6000.00000  6050.00000  1.486608292096e-03
6050.00000  6100.00000  1.439283217613e-03
6100.00000  6150.00000  1.373929543327e-03
6150.00000  6200.00000  1.388953376496e-03
6200.00000  6250.00000  1.352896176890e-03
6250.00000  6300.00000  1.391958143130e-03
6300.00000  6350.00000  1.372427160010e-03
6350.00000  6400.00000  2.210757050854e-03
6400.00000  6450.00000  1.252236494656e-03
6450.00000  6500.00000  1.242471003096e-03
6500.00000  6550.00000  1.232705511536e-03
6550.00000  6600.00000  1.163595878958e-03
6600.00000  6650.00000  1.130543445985e-03
6650.00000  6700.00000  1.134299404278e-03
6700.00000  6750.00000  1.115519612816e-03
6750.00000  6800.00000  1.081715988185e-03
6800.00000  6850.00000  1.111763654524e-03
6850.00000  6900.00000  1.077208838235e-03
6900.00000  6950.00000  1.056175471798e-03
6950.00000  7000.00000  1.003592055705e-03
7000.00000  7050.00000  1.044156405262e-03
7050.00000  7100.00000  1.134299404278e-03
7100.00000  7150.00000  9.442479146869e-04
7150.00000  7200.00000  9.592717478561e-04
7200.00000  7250.00000  9.472526813207e-04
7250.00000  7300.00000  9.164538233238e-04
7300.00000  7350.00000  9.066883317637e-04
7350.00000  7400.00000  9.239657399084e-04
7400.00000  7450.00000  8.864061569853e-04
7450.00000  7500.00000  8.691287488406e-04
7500.00000  7550.00000  8.203012910406e-04
7550.00000  7600.00000  8.097846078221e-04
7600.00000  7650.00000  8.601144489391e-04
7650.00000  7700.00000  8.067798411883e-04
7700.00000  7750.00000  7.977655412867e-04
7750.00000  7800.00000  7.609571500221e-04
7800.00000  7850.00000  7.925071996775e-04
7850.00000  7900.00000  7.579523833883e-04
7900.00000  7950.00000  7.579523833883e-04
7950.00000  8000.00000  7.414261669021e-04
8000.00000  8050.00000  7.361678252929e-04
8050.00000  8100.00000  7.241487587575e-04
8100.00000  8150.00000  7.241487587575e-04
8150.00000  8200.00000  6.723165343236e-04
8200.00000  8250.00000  6.400152930097e-04
8250.00000  8300.00000  6.775748759328e-04
8300.00000  8350.00000  6.715653426651e-04
8350.00000  8400.00000  6.452736346189e-04
8400.00000  8450.00000  6.520343595451e-04
8450.00000  8500.00000  6.047092850620e-04
8500.00000  8550.00000  6.325033764251e-04
8550.00000  8600.00000  5.979485601358e-04
8600.00000  8650.00000  6.219866932066e-04
8650.00000  8700.00000  6.159771599389e-04
8700.00000  8750.00000  5.776663853574e-04
8750.00000  8800.00000  5.859294936004e-04
8800.00000  8850.00000  5.919390268681e-04
8850.00000  8900.00000  5.566330189204e-04
8900.00000  8950.00000  5.754128103820e-04
8950.00000  9000.00000  5.633937438466e-04
9000.00000  9050.00000  5.348484608250e-04
9050.00000  9100.00000  5.280877358989e-04
9100.00000  9150.00000  5.543794439450e-04
9150.00000  9200.00000  5.438627607266e-04
9200.00000  9250.00000  5.258341609235e-04
9250.00000  9300.00000  5.063031778035e-04
9300.00000  9350.00000  5.190734359973e-04
9350.00000  9400.00000  5.618913605296e-04
9400.00000  9450.00000  5.055519861450e-04
9450.00000  9500.00000  4.770067031234e-04
9500.00000  9550.00000  4.612316782957e-04
9550.00000  9600.00000  4.747531281480e-04
9600.00000  9650.00000  4.657388282465e-04
9650.00000  9700.00000  4.649876365880e-04
9700.00000  9750.00000  4.364423535665e-04
9750.00000  9800.00000  4.537197617111e-04
9800.00000  9850.00000  4.574757200034e-04
9850.00000  9900.00000  4.514661867357e-04
9900.00000  9950.00000  4.499638034188e-04
9950.00000  10000.00000  4.702459781973e-04
