300.00000  350.00000  9.449778427644e-05
350.00000  400.00000  9.758973631820e-05
400.00000  450.00000  8.850712719552e-05
450.00000  500.00000  7.555957802063e-05
500.00000  550.00000  1.230983406628e-04
550.00000  600.00000  4.869824465780e-05
600.00000  650.00000  6.203228783791e-05
650.00000  700.00000  4.579953961864e-05
700.00000  750.00000  5.082396168651e-05
750.00000  800.00000  4.309408158210e-05
800.00000  850.00000  8.174348210416e-05
850.00000  900.00000  4.232109357166e-05
900.00000  950.00000  4.019537654294e-05
950.00000  1000.00000  3.710342450118e-05
1000.00000  1050.00000  4.348057558732e-05
1050.00000  1100.00000  3.710342450118e-05
1100.00000  1150.00000  4.290083457949e-05
1150.00000  1200.00000  4.425356359776e-05
1200.00000  1250.00000  5.005097367607e-05
1250.00000  1300.00000  7.246762597886e-05
1300.00000  1350.00000  4.232109357166e-05
1350.00000  1400.00000  5.217669070478e-05
1400.00000  1450.00000  4.927798566563e-05
1450.00000  1500.00000  5.352941972305e-05
1500.00000  1550.00000  5.314292571783e-05
1550.00000  1600.00000  5.932682980136e-05
1600.00000  1650.00000  6.763645091361e-05
1650.00000  1700.00000  6.724995690838e-05
1700.00000  1750.00000  1.493799330178e-04
1750.00000  1800.00000  7.710555404151e-05
1800.00000  1850.00000  7.865153006239e-05
1850.00000  1900.00000  7.575282502324e-05
1900.00000  1950.00000  7.942451807283e-05
1950.00000  2000.00000  9.295180825555e-05
2000.00000  2050.00000  1.031938993939e-04
2050.00000  2100.00000  1.053196164226e-04
2100.00000  2150.00000  1.161414485688e-04
2150.00000  2200.00000  1.151752135557e-04
2200.00000  2250.00000  1.346931608194e-04
2250.00000  2300.00000  1.441622639473e-04
2300.00000  2350.00000  2.485156453568e-04
2350.00000  2400.00000  1.578828011326e-04
2400.00000  2450.00000  1.602017651639e-04
2450.00000  2500.00000  1.830049114720e-04
2500.00000  2550.00000  1.714100913153e-04
2550.00000  2600.00000  1.772075013936e-04
2600.00000  2650.00000  1.886090745477e-04
2650.00000  2700.00000  1.996241536964e-04
2700.00000  2750.00000  1.963389546521e-04
2750.00000  2800.00000  2.191421009601e-04
2800.00000  2850.00000  2.123784558687e-04
2850.00000  2900.00000  2.514143503960e-04
2900.00000  2950.00000  2.678403456179e-04
2950.00000  3000.00000  3.115141682078e-04
3000.00000  3050.00000  2.939286909703e-04
3050.00000  3100.00000  3.086154631686e-04
3100.00000  3150.00000  3.093884511791e-04
3150.00000  3200.00000  3.428201826307e-04
3200.00000  3250.00000  3.360565375393e-04
3250.00000  3300.00000  3.617583888865e-04
3300.00000  3350.00000  3.702612570013e-04
3350.00000  3400.00000  3.880399812415e-04
3400.00000  3450.00000  3.961563553511e-04
3450.00000  3500.00000  4.322935448392e-04
3500.00000  3550.00000  4.481397990533e-04
3550.00000  3600.00000  4.659185232934e-04
3600.00000  3650.00000  4.881419285936e-04
3650.00000  3700.00000  5.561648735124e-04
3700.00000  3750.00000  5.227331420609e-04
3750.00000  3800.00000  5.445700533558e-04
3800.00000  3850.00000  5.594500725568e-04
3850.00000  3900.00000  5.752963267709e-04
3900.00000  3950.00000  6.075685762068e-04
3950.00000  4000.00000  6.158781973190e-04
4000.00000  4050.00000  6.178106673451e-04
4050.00000  4100.00000  6.336569215592e-04
4100.00000  4150.00000  6.431260246871e-04
4150.00000  4200.00000  6.477639527497e-04
4200.00000  4250.00000  6.804226961909e-04
4250.00000  4300.00000  6.982014204310e-04
4300.00000  4350.00000  7.190720967129e-04
4350.00000  4400.00000  7.447739480601e-04
4400.00000  4450.00000  7.584944852454e-04
4450.00000  4500.00000  7.459334300758e-04
4500.00000  4550.00000  7.739542454543e-04
4550.00000  4600.00000  7.780124325091e-04
4600.00000  4650.00000  7.872882886344e-04
4650.00000  4700.00000  8.044872718667e-04
4700.00000  4750.00000  8.137631279920e-04
4750.00000  4800.00000  8.243917131355e-04
4800.00000  4850.00000  8.272904181747e-04
4850.00000  4900.00000  8.464218714331e-04
4900.00000  4950.00000  8.655533246915e-04
4950.00000  5000.00000  8.703844997568e-04
5000.00000  5050.00000  8.777278858560e-04
5050.00000  5100.00000  9.040094782110e-04
5100.00000  5150.00000  8.916416700439e-04
5150.00000  5200.00000  9.358952336417e-04
5200.00000  5250.00000  9.107731233023e-04
5250.00000  5300.00000  9.105798762997e-04
5300.00000  5350.00000  9.459440777774e-04
5350.00000  5400.00000  9.256531425033e-04
5400.00000  5450.00000  9.793758092290e-04
5450.00000  5500.00000  9.349289986286e-04
5500.00000  5550.00000  9.463305717826e-04
5550.00000  5600.00000  9.372479626600e-04
5600.00000  5650.00000  9.631430610097e-04
5650.00000  5700.00000  9.281653535373e-04
5700.00000  5750.00000  9.702932001063e-04
5750.00000  5800.00000  9.455575837722e-04
5800.00000  5850.00000  9.867191953282e-04
5850.00000  5900.00000  1.004111425563e-03
5900.00000  5950.00000  9.849799723047e-04
5950.00000  6000.00000  9.428521257357e-04
6000.00000  6050.00000  9.799555502368e-04
6050.00000  6100.00000  9.826610082734e-04
6100.00000  6150.00000  9.948355694378e-04
6150.00000  6200.00000  1.002178955537e-03
6200.00000  6250.00000  1.038316145025e-03
6250.00000  6300.00000  1.081603473610e-03
6300.00000  6350.00000  1.084115684644e-03
6350.00000  6400.00000  2.647483935761e-03
6400.00000  6450.00000  1.012421046675e-03
6450.00000  6500.00000  9.579253919393e-04
6500.00000  6550.00000  9.871056893334e-04
6550.00000  6600.00000  9.896179003673e-04
6600.00000  6650.00000  9.604376029732e-04
6650.00000  6700.00000  9.942558284300e-04
6700.00000  6750.00000  9.739648931559e-04
6750.00000  6800.00000  9.652687780385e-04
6800.00000  6850.00000  9.820812672655e-04
6850.00000  6900.00000  9.867191953282e-04
6900.00000  6950.00000  9.874921833386e-04
6950.00000  7000.00000  9.554131809053e-04
7000.00000  7050.00000  9.455575837722e-04
7050.00000  7100.00000  1.141510044419e-03
7100.00000  7150.00000  6.703738520551e-04
7150.00000  7200.00000  6.467977177367e-04
7200.00000  7250.00000  6.471842117419e-04
7250.00000  7300.00000  6.419665426714e-04
7300.00000  7350.00000  6.493099287706e-04
7350.00000  7400.00000  6.421597896740e-04
7400.00000  7450.00000  6.549140918463e-04
7450.00000  7500.00000  7.223572957573e-04
7500.00000  7550.00000  6.326906865461e-04
7550.00000  7600.00000  6.328839335487e-04
7600.00000  7650.00000  6.344299095696e-04
7650.00000  7700.00000  6.574263028802e-04
7700.00000  7750.00000  6.839011422379e-04
7750.00000  7800.00000  6.367488736009e-04
7800.00000  7850.00000  6.587790318985e-04
7850.00000  7900.00000  6.551073388489e-04
7900.00000  7950.00000  6.388745906297e-04
7950.00000  8000.00000  6.452517417158e-04
8000.00000  8050.00000  6.522086338098e-04
8050.00000  8100.00000  6.425462836792e-04
8100.00000  8150.00000  6.723063220812e-04
8150.00000  8200.00000  6.531748688228e-04
8200.00000  8250.00000  6.210958663895e-04
8250.00000  8300.00000  6.595520199090e-04
8300.00000  8350.00000  6.516288928019e-04
8350.00000  8400.00000  6.284392524887e-04
8400.00000  8450.00000  6.106605282485e-04
8450.00000  8500.00000  6.355893915853e-04
8500.00000  8550.00000  6.381016026192e-04
8550.00000  8600.00000  6.400340726453e-04
8600.00000  8650.00000  6.207093723843e-04
8650.00000  8700.00000  6.411935546610e-04
8700.00000  8750.00000  6.458314827236e-04
8750.00000  8800.00000  6.257337944522e-04
8800.00000  8850.00000  6.408070606558e-04
8850.00000  8900.00000  6.236080774234e-04
8900.00000  8950.00000  6.214823603947e-04
8950.00000  9000.00000  5.984859670841e-04
9000.00000  9050.00000  6.288257464939e-04
9050.00000  9100.00000  6.212891133921e-04
9100.00000  9150.00000  6.286324994913e-04
9150.00000  9200.00000  6.201296313765e-04
9200.00000  9250.00000  6.224485954078e-04
9250.00000  9300.00000  6.083415642172e-04
9300.00000  9350.00000  6.067955881963e-04
9350.00000  9400.00000  6.048631181702e-04
9400.00000  9450.00000  6.073753292042e-04
9450.00000  9500.00000  6.044766241650e-04
9500.00000  9550.00000  6.081483172146e-04
9550.00000  9600.00000  6.125929982747e-04
9600.00000  9650.00000  6.110470222538e-04
9650.00000  9700.00000  6.110470222538e-04
9700.00000  9750.00000  5.959737560502e-04
9750.00000  9800.00000  5.952007680397e-04
9800.00000  9850.00000  5.952007680397e-04
9850.00000  9900.00000  5.810937368492e-04
9900.00000  9950.00000  5.874708879353e-04
9950.00000  10000.00000  5.886303699510e-04
