10001.00000  11001.00000  2.494540957291e-05
11001.00000  12001.00000  2.151904154291e-05
12001.00000  13001.00000  1.939795657196e-05
13001.00000  14001.00000  1.704119549312e-05
14001.00000  15001.00000  1.515578663005e-05
15001.00000  16001.00000  1.250896264921e-05
16001.00000  17001.00000  1.201948150206e-05
17001.00000  18001.00000  9.590204697725e-06
18001.00000  19001.00000  9.010078893704e-06
19001.00000  20001.00000  8.357437364180e-06
20001.00000  21001.00000  6.979638579630e-06
21001.00000  22001.00000  6.580802089365e-06
22001.00000  23001.00000  6.308868118730e-06
23001.00000  24001.00000  5.746871246085e-06
24001.00000  25001.00000  5.021713991058e-06
25001.00000  26001.00000  4.677264294921e-06
26001.00000  27001.00000  4.405330324286e-06
27001.00000  28001.00000  3.390110167249e-06
28001.00000  29001.00000  3.915849177143e-06
29001.00000  30001.00000  3.462625892751e-06
30001.00000  31001.00000  2.864371157355e-06
31001.00000  32001.00000  2.936886882857e-06
32001.00000  33001.00000  2.519921461217e-06
33001.00000  34001.00000  2.266116421958e-06
34001.00000  35001.00000  2.048569245450e-06
35001.00000  36001.00000  1.885408863069e-06
36001.00000  37001.00000  2.121084970952e-06
37001.00000  38001.00000  2.084827108201e-06
38001.00000  39001.00000  1.849151000318e-06
39001.00000  40001.00000  1.613474892434e-06
40001.00000  41001.00000  1.323411990423e-06
41001.00000  42001.00000  1.540959166931e-06
42001.00000  43001.00000  1.323411990423e-06
43001.00000  44001.00000  1.105864813915e-06
44001.00000  45001.00000  1.432185578677e-06
45001.00000  46001.00000  1.196509470794e-06
46001.00000  47001.00000  9.608333629101e-07
47001.00000  48001.00000  1.051478019788e-06
48001.00000  49001.00000  1.015220157037e-06
49001.00000  50001.00000  8.701887060318e-07
50001.00000  51001.00000  5.801258040212e-07
51001.00000  52001.00000  9.427044315344e-07
52001.00000  53001.00000  5.801258040212e-07
53001.00000  54001.00000  5.801258040212e-07
54001.00000  55001.00000  7.976729805291e-07
55001.00000  56001.00000  8.158019119048e-07
56001.00000  57001.00000  7.432861864021e-07
57001.00000  58001.00000  6.888993922752e-07
58001.00000  59001.00000  6.345125981482e-07
59001.00000  60001.00000  5.801258040212e-07
60001.00000  61001.00000  6.526415295238e-07
61001.00000  62001.00000  5.076100785185e-07
62001.00000  63001.00000  5.982547353968e-07
63001.00000  64001.00000  4.532232843915e-07
64001.00000  65001.00000  3.444496961376e-07
65001.00000  66001.00000  3.263207647619e-07
66001.00000  67001.00000  3.807075588889e-07
67001.00000  68001.00000  4.713522157672e-07
68001.00000  69001.00000  3.263207647619e-07
69001.00000  70001.00000  3.625786275132e-07
70001.00000  71001.00000  5.257390098942e-07
71001.00000  72001.00000  2.356761078836e-07
72001.00000  73001.00000  4.169654216402e-07
73001.00000  74001.00000  3.988364902646e-07
74001.00000  75001.00000  3.263207647619e-07
75001.00000  76001.00000  2.538050392593e-07
76001.00000  77001.00000  3.081918333863e-07
77001.00000  78001.00000  3.081918333863e-07
78001.00000  79001.00000  1.450314510053e-07
79001.00000  80001.00000  1.631603823810e-07
80001.00000  81001.00000  3.081918333863e-07
81001.00000  82001.00000  1.812893137566e-07
82001.00000  83001.00000  2.900629020106e-07
83001.00000  84001.00000  2.900629020106e-07
84001.00000  85001.00000  1.994182451323e-07
85001.00000  86001.00000  1.450314510053e-07
86001.00000  87001.00000  2.538050392593e-07
87001.00000  88001.00000  2.356761078836e-07
88001.00000  89001.00000  3.625786275132e-07
89001.00000  90001.00000  4.169654216402e-07
90001.00000  91001.00000  2.356761078836e-07
91001.00000  92001.00000  1.269025196296e-07
92001.00000  93001.00000  2.175471765079e-07
93001.00000  94001.00000  1.450314510053e-07
94001.00000  95001.00000  2.175471765079e-07
95001.00000  96001.00000  2.175471765079e-07
96001.00000  97001.00000  2.538050392593e-07
97001.00000  98001.00000  1.631603823810e-07
98001.00000  99001.00000  7.251572550265e-08
99001.00000  100001.00000  1.812893137566e-07
100001.00000  101001.00000  9.064465687831e-08
101001.00000  102001.00000  1.450314510053e-07
102001.00000  103001.00000  7.251572550265e-08
103001.00000  104001.00000  1.269025196296e-07
104001.00000  105001.00000  1.631603823810e-07
105001.00000  106001.00000  7.251572550265e-08
106001.00000  107001.00000  1.450314510053e-07
107001.00000  108001.00000  1.269025196296e-07
108001.00000  109001.00000  5.438679412699e-08
109001.00000  110001.00000  1.269025196296e-07
110001.00000  111001.00000  1.269025196296e-07
111001.00000  112001.00000  1.269025196296e-07
112001.00000  113001.00000  7.251572550265e-08
113001.00000  114001.00000  7.251572550265e-08
114001.00000  115001.00000  7.251572550265e-08
115001.00000  116001.00000  5.438679412699e-08
116001.00000  117001.00000  1.812893137566e-08
117001.00000  118001.00000  3.625786275132e-08
118001.00000  119001.00000  5.438679412699e-08
119001.00000  120001.00000  7.251572550265e-08
120001.00000  121001.00000  1.087735882540e-07
121001.00000  122001.00000  3.625786275132e-08
122001.00000  123001.00000  5.438679412699e-08
123001.00000  124001.00000  1.269025196296e-07
124001.00000  125001.00000  9.064465687831e-08
125001.00000  126001.00000  5.438679412699e-08
126001.00000  127001.00000  5.438679412699e-08
127001.00000  128001.00000  3.625786275132e-08
128001.00000  129001.00000  9.064465687831e-08
129001.00000  130001.00000  9.064465687831e-08
130001.00000  131001.00000  9.064465687831e-08
131001.00000  132001.00000  1.812893137566e-08
132001.00000  133001.00000  1.087735882540e-07
133001.00000  134001.00000  1.812893137566e-08
134001.00000  135001.00000  5.438679412699e-08
135001.00000  136001.00000  3.625786275132e-08
136001.00000  137001.00000  9.064465687831e-08
137001.00000  138001.00000  1.269025196296e-07
138001.00000  139001.00000  3.625786275132e-08
139001.00000  140001.00000  3.625786275132e-08
140001.00000  141001.00000  1.812893137566e-08
141001.00000  142001.00000  5.438679412699e-08
142001.00000  143001.00000  0.000000000000e+00
143001.00000  144001.00000  1.812893137566e-08
144001.00000  145001.00000  5.438679412699e-08
145001.00000  146001.00000  1.812893137566e-08
146001.00000  147001.00000  1.812893137566e-08
147001.00000  148001.00000  1.812893137566e-08
148001.00000  149001.00000  0.000000000000e+00
149001.00000  150001.00000  1.812893137566e-08
150001.00000  151001.00000  3.625786275132e-08
151001.00000  152001.00000  1.812893137566e-08
152001.00000  153001.00000  3.625786275132e-08
153001.00000  154001.00000  0.000000000000e+00
154001.00000  155001.00000  5.438679412699e-08
155001.00000  156001.00000  0.000000000000e+00
156001.00000  157001.00000  1.812893137566e-08
157001.00000  158001.00000  1.812893137566e-08
158001.00000  159001.00000  0.000000000000e+00
159001.00000  160001.00000  5.438679412699e-08
160001.00000  161001.00000  0.000000000000e+00
161001.00000  162001.00000  1.812893137566e-08
162001.00000  163001.00000  3.625786275132e-08
163001.00000  164001.00000  0.000000000000e+00
164001.00000  165001.00000  3.625786275132e-08
165001.00000  166001.00000  5.438679412699e-08
166001.00000  167001.00000  0.000000000000e+00
167001.00000  168001.00000  0.000000000000e+00
168001.00000  169001.00000  3.625786275132e-08
169001.00000  170001.00000  0.000000000000e+00
170001.00000  171001.00000  0.000000000000e+00
171001.00000  172001.00000  0.000000000000e+00
172001.00000  173001.00000  1.812893137566e-08
173001.00000  174001.00000  0.000000000000e+00
174001.00000  175001.00000  1.812893137566e-08
175001.00000  176001.00000  0.000000000000e+00
176001.00000  177001.00000  0.000000000000e+00
177001.00000  178001.00000  0.000000000000e+00
178001.00000  179001.00000  0.000000000000e+00
179001.00000  180001.00000  0.000000000000e+00
180001.00000  181001.00000  0.000000000000e+00
181001.00000  182001.00000  3.625786275132e-08
182001.00000  183001.00000  0.000000000000e+00
183001.00000  184001.00000  1.812893137566e-08
184001.00000  185001.00000  0.000000000000e+00
185001.00000  186001.00000  0.000000000000e+00
186001.00000  187001.00000  0.000000000000e+00
187001.00000  188001.00000  0.000000000000e+00
188001.00000  189001.00000  0.000000000000e+00
189001.00000  190001.00000  0.000000000000e+00
190001.00000  191001.00000  0.000000000000e+00
191001.00000  192001.00000  0.000000000000e+00
192001.00000  193001.00000  0.000000000000e+00
193001.00000  194001.00000  0.000000000000e+00
194001.00000  195001.00000  1.812893137566e-08
195001.00000  196001.00000  0.000000000000e+00
196001.00000  197001.00000  0.000000000000e+00
197001.00000  198001.00000  0.000000000000e+00
198001.00000  199001.00000  0.000000000000e+00
