300.00000  350.00000  4.431809669564e-06
350.00000  400.00000  3.693174724636e-06
400.00000  450.00000  1.477269889855e-06
450.00000  500.00000  2.215904834782e-06
500.00000  550.00000  5.170444614491e-06
550.00000  600.00000  2.954539779709e-06
600.00000  650.00000  3.693174724636e-06
650.00000  700.00000  0.000000000000e+00
700.00000  750.00000  2.215904834782e-06
750.00000  800.00000  1.477269889855e-06
800.00000  850.00000  6.647714504345e-06
850.00000  900.00000  3.693174724636e-06
900.00000  950.00000  2.215904834782e-06
950.00000  1000.00000  7.386349449273e-07
1000.00000  1050.00000  2.215904834782e-06
1050.00000  1100.00000  2.215904834782e-06
1100.00000  1150.00000  1.477269889855e-06
1150.00000  1200.00000  7.386349449273e-07
1200.00000  1250.00000  1.477269889855e-06
1250.00000  1300.00000  4.431809669564e-06
1300.00000  1350.00000  1.477269889855e-06
1350.00000  1400.00000  1.477269889855e-06
1400.00000  1450.00000  0.000000000000e+00
1450.00000  1500.00000  3.693174724636e-06
1500.00000  1550.00000  7.386349449273e-07
1550.00000  1600.00000  5.909079559418e-06
1600.00000  1650.00000  2.954539779709e-06
1650.00000  1700.00000  4.431809669564e-06
1700.00000  1750.00000  2.437495318260e-05
1750.00000  1800.00000  5.170444614491e-06
1800.00000  1850.00000  3.693174724636e-06
1850.00000  1900.00000  7.386349449273e-07
1900.00000  1950.00000  2.954539779709e-06
1950.00000  2000.00000  5.170444614491e-06
2000.00000  2050.00000  2.954539779709e-06
2050.00000  2100.00000  2.954539779709e-06
2100.00000  2150.00000  3.693174724636e-06
2150.00000  2200.00000  6.647714504345e-06
2200.00000  2250.00000  2.954539779709e-06
2250.00000  2300.00000  7.386349449273e-06
2300.00000  2350.00000  3.102266768695e-05
2350.00000  2400.00000  3.693174724636e-06
2400.00000  2450.00000  5.909079559418e-06
2450.00000  2500.00000  9.602254284055e-06
2500.00000  2550.00000  4.431809669564e-06
2550.00000  2600.00000  8.124984394200e-06
2600.00000  2650.00000  5.170444614491e-06
2650.00000  2700.00000  5.909079559418e-06
2700.00000  2750.00000  5.909079559418e-06
2750.00000  2800.00000  5.170444614491e-06
2800.00000  2850.00000  8.863619339127e-06
2850.00000  2900.00000  7.386349449273e-06
2900.00000  2950.00000  1.181815911884e-05
2950.00000  3000.00000  1.551133384347e-05
3000.00000  3050.00000  6.647714504345e-06
3050.00000  3100.00000  9.602254284055e-06
3100.00000  3150.00000  1.255679406376e-05
3150.00000  3200.00000  1.329542900869e-05
3200.00000  3250.00000  8.863619339127e-06
3250.00000  3300.00000  8.124984394200e-06
3300.00000  3350.00000  1.181815911884e-05
3350.00000  3400.00000  1.034088922898e-05
3400.00000  3450.00000  1.329542900869e-05
3450.00000  3500.00000  1.255679406376e-05
3500.00000  3550.00000  1.551133384347e-05
3550.00000  3600.00000  1.477269889855e-05
3600.00000  3650.00000  1.846587362318e-05
3650.00000  3700.00000  2.659085801738e-05
3700.00000  3750.00000  1.477269889855e-05
3750.00000  3800.00000  1.920450856811e-05
3800.00000  3850.00000  2.732949296231e-05
3850.00000  3900.00000  2.437495318260e-05
3900.00000  3950.00000  2.732949296231e-05
3950.00000  4000.00000  2.806812790724e-05
4000.00000  4050.00000  2.511358812753e-05
4050.00000  4100.00000  3.471584241158e-05
4100.00000  4150.00000  2.659085801738e-05
4150.00000  4200.00000  3.840901713622e-05
4200.00000  4250.00000  3.471584241158e-05
4250.00000  4300.00000  4.062492197100e-05
4300.00000  4350.00000  4.653400153042e-05
4350.00000  4400.00000  5.170444614491e-05
4400.00000  4450.00000  4.801127142027e-05
4450.00000  4500.00000  6.130670042896e-05
4500.00000  4550.00000  5.096581119998e-05
4550.00000  4600.00000  5.170444614491e-05
4600.00000  4650.00000  7.534076438258e-05
4650.00000  4700.00000  5.687489075940e-05
4700.00000  4750.00000  8.051120899707e-05
4750.00000  4800.00000  6.869304987824e-05
4800.00000  4850.00000  8.124984394200e-05
4850.00000  4900.00000  8.124984394200e-05
4900.00000  4950.00000  9.085209822606e-05
4950.00000  5000.00000  7.755666921736e-05
5000.00000  5050.00000  9.159073317098e-05
5050.00000  5100.00000  1.152270514087e-04
5100.00000  5150.00000  1.034088922898e-04
5150.00000  5200.00000  1.011929874550e-04
5200.00000  5250.00000  1.019316224000e-04
5250.00000  5300.00000  1.270452105275e-04
5300.00000  5350.00000  1.277838454724e-04
5350.00000  5400.00000  1.152270514087e-04
5400.00000  5450.00000  1.455110841507e-04
5450.00000  5500.00000  1.152270514087e-04
5500.00000  5550.00000  1.624996878840e-04
5550.00000  5600.00000  1.440338142608e-04
5600.00000  5650.00000  1.189202261333e-04
5650.00000  5700.00000  1.462497190956e-04
5700.00000  5750.00000  1.728405771130e-04
5750.00000  5800.00000  1.536360685449e-04
5800.00000  5850.00000  1.477269889855e-04
5850.00000  5900.00000  1.551133384347e-04
5900.00000  5950.00000  1.602837830492e-04
5950.00000  6000.00000  1.617610529391e-04
6000.00000  6050.00000  1.691474023883e-04
6050.00000  6100.00000  1.750564819478e-04
6100.00000  6150.00000  1.780110217275e-04
6150.00000  6200.00000  1.595451481043e-04
6200.00000  6250.00000  1.654542276637e-04
6250.00000  6300.00000  1.957382604057e-04
6300.00000  6350.00000  1.684087674434e-04
6350.00000  6400.00000  4.106810293796e-04
6400.00000  6450.00000  1.853973711767e-04
6450.00000  6500.00000  1.750564819478e-04
6500.00000  6550.00000  1.920450856811e-04
6550.00000  6600.00000  1.595451481043e-04
6600.00000  6650.00000  1.957382604057e-04
6650.00000  6700.00000  1.735792120579e-04
6700.00000  6750.00000  1.905678157912e-04
6750.00000  6800.00000  1.861360061217e-04
6800.00000  6850.00000  2.023859749101e-04
6850.00000  6900.00000  1.824428313970e-04
6900.00000  6950.00000  1.721019421681e-04
6950.00000  7000.00000  1.861360061217e-04
7000.00000  7050.00000  1.935223555709e-04
7050.00000  7100.00000  2.201132135883e-04
7100.00000  7150.00000  9.823844767533e-05
7150.00000  7200.00000  7.977257405215e-05
7200.00000  7250.00000  6.573851009853e-05
7250.00000  7300.00000  8.198847888693e-05
7300.00000  7350.00000  8.863619339127e-05
7350.00000  7400.00000  8.863619339127e-05
7400.00000  7450.00000  8.124984394200e-05
7450.00000  7500.00000  9.897708262026e-05
7500.00000  7550.00000  7.977257405215e-05
7550.00000  7600.00000  8.642028855649e-05
7600.00000  7650.00000  1.004543525101e-04
7650.00000  7700.00000  9.676117778547e-05
7700.00000  7750.00000  8.863619339127e-05
7750.00000  7800.00000  9.823844767533e-05
7800.00000  7850.00000  8.420438372171e-05
7850.00000  7900.00000  9.971571756518e-05
7900.00000  7950.00000  1.004543525101e-04
7950.00000  8000.00000  1.004543525101e-04
8000.00000  8050.00000  1.078407019594e-04
8050.00000  8100.00000  9.676117778547e-05
8100.00000  8150.00000  9.971571756518e-05
8150.00000  8200.00000  8.937482833620e-05
8200.00000  8250.00000  8.272711383186e-05
8250.00000  8300.00000  9.971571756518e-05
8300.00000  8350.00000  9.971571756518e-05
8350.00000  8400.00000  8.494301866664e-05
8400.00000  8450.00000  9.306800306084e-05
8450.00000  8500.00000  9.528390789562e-05
8500.00000  8550.00000  8.863619339127e-05
8550.00000  8600.00000  1.078407019594e-04
8600.00000  8650.00000  8.051120899707e-05
8650.00000  8700.00000  7.977257405215e-05
8700.00000  8750.00000  9.380663800576e-05
8750.00000  8800.00000  9.085209822606e-05
8800.00000  8850.00000  1.189202261333e-04
8850.00000  8900.00000  9.454527295069e-05
8900.00000  8950.00000  1.004543525101e-04
8950.00000  9000.00000  1.063634320695e-04
9000.00000  9050.00000  9.676117778547e-05
9050.00000  9100.00000  1.100566067942e-04
9100.00000  9150.00000  9.306800306084e-05
9150.00000  9200.00000  1.034088922898e-04
9200.00000  9250.00000  1.093179718492e-04
9250.00000  9300.00000  1.063634320695e-04
9300.00000  9350.00000  1.004543525101e-04
9350.00000  9400.00000  1.130111465739e-04
9400.00000  9450.00000  9.676117778547e-05
9450.00000  9500.00000  9.749981273040e-05
9500.00000  9550.00000  1.078407019594e-04
9550.00000  9600.00000  9.011346328113e-05
9600.00000  9650.00000  1.122725116289e-04
9650.00000  9700.00000  1.071020670145e-04
9700.00000  9750.00000  8.863619339127e-05
9750.00000  9800.00000  1.041475272347e-04
9800.00000  9850.00000  9.897708262026e-05
9850.00000  9900.00000  1.167043212985e-04
9900.00000  9950.00000  1.107952417391e-04
9950.00000  10000.00000  9.232936811591e-05
