10001.00000  11001.00000  2.558853372862e-04
11001.00000  12001.00000  2.180920270125e-04
12001.00000  13001.00000  1.908959686961e-04
13001.00000  14001.00000  1.662498438332e-04
14001.00000  15001.00000  1.503103358574e-04
15001.00000  16001.00000  1.308319468528e-04
16001.00000  17001.00000  1.180338017627e-04
17001.00000  18001.00000  1.058561727982e-04
18001.00000  19001.00000  9.675203776821e-05
19001.00000  20001.00000  9.042083417440e-05
20001.00000  21001.00000  8.209234430138e-05
21001.00000  22001.00000  7.538301369354e-05
22001.00000  23001.00000  6.900333227742e-05
23001.00000  24001.00000  6.393255206369e-05
24001.00000  25001.00000  6.095601377380e-05
25001.00000  26001.00000  5.558467106175e-05
26001.00000  27001.00000  5.172583640579e-05
27001.00000  28001.00000  4.900138279192e-05
28001.00000  29001.00000  4.431842515668e-05
29001.00000  30001.00000  4.350399774186e-05
30001.00000  31001.00000  4.046928606519e-05
31001.00000  32001.00000  3.761879011331e-05
32001.00000  33001.00000  3.555363488286e-05
33001.00000  34001.00000  3.326548166978e-05
34001.00000  35001.00000  3.067676595838e-05
35001.00000  36001.00000  3.049255023359e-05
36001.00000  37001.00000  2.830135266514e-05
37001.00000  38001.00000  2.738996960569e-05
38001.00000  39001.00000  2.669188896441e-05
39001.00000  40001.00000  2.539268332648e-05
40001.00000  41001.00000  2.293970551755e-05
41001.00000  42001.00000  2.276518535723e-05
42001.00000  43001.00000  2.205740915149e-05
43001.00000  44001.00000  2.065155230447e-05
44001.00000  45001.00000  1.955595352024e-05
45001.00000  46001.00000  1.879000392773e-05
46001.00000  47001.00000  1.866396158972e-05
47001.00000  48001.00000  1.789801199721e-05
48001.00000  49001.00000  1.631763498987e-05
49001.00000  50001.00000  1.673454426174e-05
50001.00000  51001.00000  1.492147370731e-05
51001.00000  52001.00000  1.473725798253e-05
52001.00000  53001.00000  1.387435274540e-05
53001.00000  54001.00000  1.398100395448e-05
54001.00000  55001.00000  1.305022976611e-05
55001.00000  56001.00000  1.281753621902e-05
56001.00000  57001.00000  1.245880033392e-05
57001.00000  58001.00000  1.263332049424e-05
58001.00000  59001.00000  1.131472372738e-05
59001.00000  60001.00000  1.122746364722e-05
60001.00000  61001.00000  1.090751001997e-05
61001.00000  62001.00000  1.054877413486e-05
62001.00000  63001.00000  9.753737848965e-06
63001.00000  64001.00000  9.404697528326e-06
64001.00000  65001.00000  9.307741883704e-06
65001.00000  66001.00000  9.298046319242e-06
66001.00000  67001.00000  8.842354789519e-06
67001.00000  68001.00000  9.007179385376e-06
68001.00000  69001.00000  8.939310434141e-06
69001.00000  70001.00000  8.483618904418e-06
70001.00000  71001.00000  8.066709632544e-06
71001.00000  72001.00000  7.349237862342e-06
72001.00000  73001.00000  7.426802378039e-06
73001.00000  74001.00000  7.058370928476e-06
74001.00000  75001.00000  7.038979799551e-06
75001.00000  76001.00000  7.058370928476e-06
76001.00000  77001.00000  6.486332625206e-06
77001.00000  78001.00000  7.009893106165e-06
78001.00000  79001.00000  6.234247949189e-06
79001.00000  80001.00000  5.759165290542e-06
80001.00000  81001.00000  6.079118917794e-06
81001.00000  82001.00000  5.885207628551e-06
82001.00000  83001.00000  5.487689485601e-06
83001.00000  84001.00000  5.400429405441e-06
84001.00000  85001.00000  5.875512064088e-06
85001.00000  86001.00000  5.574949565760e-06
86001.00000  87001.00000  5.148344729424e-06
87001.00000  88001.00000  5.012606826953e-06
88001.00000  89001.00000  4.983520133567e-06
89001.00000  90001.00000  4.925346746794e-06
90001.00000  91001.00000  4.363004007986e-06
91001.00000  92001.00000  4.459959652608e-06
92001.00000  93001.00000  4.130310460894e-06
93001.00000  94001.00000  4.372699572449e-06
94001.00000  95001.00000  4.295135056751e-06
95001.00000  96001.00000  4.236961669978e-06
96001.00000  97001.00000  4.217570541054e-06
97001.00000  98001.00000  3.742487882406e-06
98001.00000  99001.00000  3.917008042726e-06
99001.00000  100001.00000  3.790965704717e-06
100001.00000  101001.00000  3.500098770851e-06
101001.00000  102001.00000  3.471012077465e-06
102001.00000  103001.00000  3.432229819616e-06
103001.00000  104001.00000  3.451620948540e-06
104001.00000  105001.00000  3.063798370053e-06
105001.00000  106001.00000  2.986233854355e-06
106001.00000  107001.00000  3.344969739456e-06
107001.00000  108001.00000  2.869887080809e-06
108001.00000  109001.00000  2.588715711405e-06
109001.00000  110001.00000  2.966842725431e-06
110001.00000  111001.00000  2.957147160969e-06
111001.00000  112001.00000  2.569324582481e-06
112001.00000  113001.00000  3.112276192364e-06
113001.00000  114001.00000  2.501455631246e-06
114001.00000  115001.00000  2.491760066783e-06
115001.00000  116001.00000  2.608106840330e-06
116001.00000  117001.00000  2.472368937859e-06
117001.00000  118001.00000  2.520846760170e-06
118001.00000  119001.00000  2.268762084153e-06
119001.00000  120001.00000  2.452977808935e-06
120001.00000  121001.00000  2.171806439531e-06
121001.00000  122001.00000  2.288153213077e-06
122001.00000  123001.00000  2.220284261842e-06
123001.00000  124001.00000  1.861548376741e-06
124001.00000  125001.00000  2.123328617220e-06
125001.00000  126001.00000  1.919721763514e-06
126001.00000  127001.00000  1.871243941203e-06
127001.00000  128001.00000  1.958504021363e-06
128001.00000  129001.00000  2.191197568455e-06
129001.00000  130001.00000  1.987590714749e-06
130001.00000  131001.00000  1.939112892438e-06
131001.00000  132001.00000  1.929417327976e-06
132001.00000  133001.00000  1.793679425506e-06
133001.00000  134001.00000  1.774288296581e-06
134001.00000  135001.00000  1.764592732119e-06
135001.00000  136001.00000  1.745201603195e-06
136001.00000  137001.00000  1.638550394110e-06
137001.00000  138001.00000  1.929417327976e-06
138001.00000  139001.00000  1.551290313951e-06
139001.00000  140001.00000  1.483421362715e-06
140001.00000  141001.00000  1.434943540404e-06
141001.00000  142001.00000  1.464030233791e-06
142001.00000  143001.00000  1.367074589169e-06
143001.00000  144001.00000  1.512508056102e-06
144001.00000  145001.00000  1.434943540404e-06
145001.00000  146001.00000  1.541594749489e-06
146001.00000  147001.00000  1.434943540404e-06
147001.00000  148001.00000  1.541594749489e-06
148001.00000  149001.00000  1.250727815623e-06
149001.00000  150001.00000  1.192554428850e-06
150001.00000  151001.00000  1.347683460245e-06
151001.00000  152001.00000  1.386465718093e-06
152001.00000  153001.00000  1.221641122236e-06
153001.00000  154001.00000  1.376770153631e-06
154001.00000  155001.00000  1.289510073472e-06
155001.00000  156001.00000  1.357379024707e-06
156001.00000  157001.00000  1.114989913152e-06
157001.00000  158001.00000  1.337987895782e-06
158001.00000  159001.00000  1.114989913152e-06
159001.00000  160001.00000  1.134381042076e-06
160001.00000  161001.00000  1.241032251161e-06
161001.00000  162001.00000  1.144076606539e-06
162001.00000  163001.00000  1.008338704068e-06
163001.00000  164001.00000  1.085903219766e-06
164001.00000  165001.00000  1.192554428850e-06
165001.00000  166001.00000  1.163467735463e-06
166001.00000  167001.00000  1.124685477614e-06
167001.00000  168001.00000  9.113830594460e-07
168001.00000  169001.00000  9.501653172948e-07
169001.00000  170001.00000  1.153772171001e-06
170001.00000  171001.00000  9.016874949839e-07
171001.00000  172001.00000  9.016874949839e-07
172001.00000  173001.00000  9.016874949839e-07
173001.00000  174001.00000  8.726008015973e-07
174001.00000  175001.00000  8.919919305217e-07
175001.00000  176001.00000  8.532096726729e-07
176001.00000  177001.00000  8.047318503619e-07
177001.00000  178001.00000  7.368628991266e-07
178001.00000  179001.00000  8.822963660595e-07
179001.00000  180001.00000  7.853407214376e-07
180001.00000  181001.00000  7.659495925132e-07
181001.00000  182001.00000  8.822963660595e-07
182001.00000  183001.00000  6.883850768156e-07
183001.00000  184001.00000  9.016874949839e-07
184001.00000  185001.00000  7.368628991266e-07
185001.00000  186001.00000  6.592983834291e-07
186001.00000  187001.00000  9.016874949839e-07
187001.00000  188001.00000  7.465584635888e-07
188001.00000  189001.00000  6.205161255803e-07
189001.00000  190001.00000  8.047318503619e-07
190001.00000  191001.00000  6.689939478912e-07
191001.00000  192001.00000  7.756451569754e-07
192001.00000  193001.00000  5.720383032693e-07
193001.00000  194001.00000  5.526471743449e-07
194001.00000  195001.00000  6.108205611181e-07
195001.00000  196001.00000  5.429516098828e-07
196001.00000  197001.00000  5.817338677315e-07
197001.00000  198001.00000  5.914294321937e-07
198001.00000  199001.00000  6.786895123534e-07
