10001.00000  11001.00000  4.455488651878e-04
11001.00000  12001.00000  3.626087246452e-04
12001.00000  13001.00000  3.051611628143e-04
13001.00000  14001.00000  2.623700485481e-04
14001.00000  15001.00000  2.250416297202e-04
15001.00000  16001.00000  1.971568902610e-04
16001.00000  17001.00000  1.734852100286e-04
17001.00000  18001.00000  1.557760797191e-04
18001.00000  19001.00000  1.348535991517e-04
19001.00000  20001.00000  1.239996160587e-04
20001.00000  21001.00000  1.084327192544e-04
21001.00000  22001.00000  1.024344654398e-04
22001.00000  23001.00000  9.163403818450e-05
23001.00000  24001.00000  8.342214308127e-05
24001.00000  25001.00000  7.546017522032e-05
25001.00000  26001.00000  6.831939686969e-05
26001.00000  27001.00000  6.349937148301e-05
27001.00000  28001.00000  5.784030464013e-05
28001.00000  29001.00000  5.387717265553e-05
29001.00000  30001.00000  5.194916250086e-05
30001.00000  31001.00000  4.859299667606e-05
31001.00000  32001.00000  4.557601782292e-05
32001.00000  33001.00000  4.250548313215e-05
33001.00000  34001.00000  3.900650174034e-05
34001.00000  35001.00000  3.672145266813e-05
35001.00000  36001.00000  3.548966840265e-05
36001.00000  37001.00000  3.163364809331e-05
37001.00000  38001.00000  3.054467939483e-05
38001.00000  39001.00000  2.824177837676e-05
39001.00000  40001.00000  2.808111086387e-05
40001.00000  41001.00000  2.700999411127e-05
41001.00000  42001.00000  2.586746957517e-05
42001.00000  43001.00000  2.292189850553e-05
43001.00000  44001.00000  2.406442304163e-05
44001.00000  45001.00000  2.011914300291e-05
45001.00000  46001.00000  2.061899748745e-05
46001.00000  47001.00000  1.969069630187e-05
47001.00000  48001.00000  1.824468868587e-05
48001.00000  49001.00000  1.767342641782e-05
49001.00000  50001.00000  1.690579274512e-05
50001.00000  51001.00000  1.651304993584e-05
51001.00000  52001.00000  1.526341372448e-05
52001.00000  53001.00000  1.478141118581e-05
53001.00000  54001.00000  1.435296448477e-05
54001.00000  55001.00000  1.365673859559e-05
55001.00000  56001.00000  1.254991795124e-05
56001.00000  57001.00000  1.283554908526e-05
57001.00000  58001.00000  1.229999070897e-05
58001.00000  59001.00000  1.146094925277e-05
59001.00000  60001.00000  1.158591287390e-05
60001.00000  61001.00000  1.047909222955e-05
61001.00000  62001.00000  1.113961422699e-05
62001.00000  63001.00000  9.443679368713e-06
63001.00000  64001.00000  8.943824884168e-06
64001.00000  65001.00000  9.068788505304e-06
65001.00000  66001.00000  8.551082074884e-06
66001.00000  67001.00000  9.068788505304e-06
67001.00000  68001.00000  8.194043157352e-06
68001.00000  69001.00000  8.354710670241e-06
69001.00000  70001.00000  7.122926404757e-06
70001.00000  71001.00000  7.158630296510e-06
71001.00000  72001.00000  7.015814729497e-06
72001.00000  73001.00000  7.051518621250e-06
73001.00000  74001.00000  6.408848569693e-06
74001.00000  75001.00000  6.373144677940e-06
75001.00000  76001.00000  6.390996623817e-06
76001.00000  77001.00000  6.462404407323e-06
77001.00000  78001.00000  6.230329110928e-06
78001.00000  79001.00000  5.944697976902e-06
79001.00000  80001.00000  6.283884948557e-06
80001.00000  81001.00000  5.498399329988e-06
81001.00000  82001.00000  5.248472087716e-06
82001.00000  83001.00000  4.837877332554e-06
83001.00000  84001.00000  5.123508466579e-06
84001.00000  85001.00000  5.373435708852e-06
85001.00000  86001.00000  5.069952628950e-06
86001.00000  87001.00000  4.784321494924e-06
87001.00000  88001.00000  3.927428092848e-06
88001.00000  89001.00000  4.373726739763e-06
89001.00000  90001.00000  4.552246198529e-06
90001.00000  91001.00000  4.052391713984e-06
91001.00000  92001.00000  3.820316417589e-06
92001.00000  93001.00000  4.123799497491e-06
93001.00000  94001.00000  3.784612525836e-06
94001.00000  95001.00000  3.284758041291e-06
95001.00000  96001.00000  3.713204742329e-06
96001.00000  97001.00000  4.016687822231e-06
97001.00000  98001.00000  3.409721662427e-06
98001.00000  99001.00000  2.874163286130e-06
99001.00000  100001.00000  3.963131984602e-06
100001.00000  101001.00000  3.534685283564e-06
101001.00000  102001.00000  2.963423015513e-06
102001.00000  103001.00000  2.945571069636e-06
103001.00000  104001.00000  3.409721662427e-06
104001.00000  105001.00000  2.499272422722e-06
105001.00000  106001.00000  3.284758041291e-06
106001.00000  107001.00000  2.642087989734e-06
107001.00000  108001.00000  2.927719123760e-06
108001.00000  109001.00000  2.927719123760e-06
109001.00000  110001.00000  3.034830799019e-06
110001.00000  111001.00000  2.659939935611e-06
111001.00000  112001.00000  3.052682744896e-06
112001.00000  113001.00000  2.302901018079e-06
113001.00000  114001.00000  2.659939935611e-06
114001.00000  115001.00000  2.267197126326e-06
115001.00000  116001.00000  2.267197126326e-06
116001.00000  117001.00000  2.302901018079e-06
117001.00000  118001.00000  1.981565992301e-06
118001.00000  119001.00000  2.177937396943e-06
119001.00000  120001.00000  2.177937396943e-06
120001.00000  121001.00000  1.945862100548e-06
121001.00000  122001.00000  2.195789342820e-06
122001.00000  123001.00000  1.928010154671e-06
123001.00000  124001.00000  2.070825721684e-06
124001.00000  125001.00000  2.231493234573e-06
125001.00000  126001.00000  1.606675128893e-06
126001.00000  127001.00000  1.803046533535e-06
127001.00000  128001.00000  2.035121829931e-06
128001.00000  129001.00000  1.856602371165e-06
129001.00000  130001.00000  1.749490695905e-06
130001.00000  131001.00000  1.606675128893e-06
131001.00000  132001.00000  1.856602371165e-06
132001.00000  133001.00000  1.785194587658e-06
133001.00000  134001.00000  1.499563453633e-06
134001.00000  135001.00000  1.374599832497e-06
135001.00000  136001.00000  1.481711507756e-06
136001.00000  137001.00000  1.570971237139e-06
137001.00000  138001.00000  1.535267345386e-06
138001.00000  139001.00000  1.374599832497e-06
139001.00000  140001.00000  1.303192048991e-06
140001.00000  141001.00000  1.428155670127e-06
141001.00000  142001.00000  1.071116752595e-06
142001.00000  143001.00000  1.196080373731e-06
143001.00000  144001.00000  1.249636211361e-06
144001.00000  145001.00000  1.142524536101e-06
145001.00000  146001.00000  1.428155670127e-06
146001.00000  147001.00000  1.267488157237e-06
147001.00000  148001.00000  1.124672590225e-06
148001.00000  149001.00000  1.142524536101e-06
149001.00000  150001.00000  1.213932319608e-06
150001.00000  151001.00000  1.053264806718e-06
151001.00000  152001.00000  1.231784265484e-06
152001.00000  153001.00000  1.303192048991e-06
153001.00000  154001.00000  1.142524536101e-06
154001.00000  155001.00000  1.017560914965e-06
155001.00000  156001.00000  8.390414561994e-07
156001.00000  157001.00000  8.033375644463e-07
157001.00000  158001.00000  8.390414561994e-07
158001.00000  159001.00000  9.640050773355e-07
159001.00000  160001.00000  9.461531314589e-07
160001.00000  161001.00000  1.142524536101e-06
161001.00000  162001.00000  9.104492397058e-07
162001.00000  163001.00000  1.035412860842e-06
163001.00000  164001.00000  9.283011855823e-07
164001.00000  165001.00000  9.283011855823e-07
165001.00000  166001.00000  8.211895103228e-07
166001.00000  167001.00000  1.053264806718e-06
167001.00000  168001.00000  9.461531314589e-07
168001.00000  169001.00000  7.497817268165e-07
169001.00000  170001.00000  8.568934020760e-07
170001.00000  171001.00000  7.854856185697e-07
171001.00000  172001.00000  7.140778350633e-07
172001.00000  173001.00000  7.676336726931e-07
173001.00000  174001.00000  6.783739433102e-07
174001.00000  175001.00000  6.783739433102e-07
175001.00000  176001.00000  1.088968698472e-06
176001.00000  177001.00000  7.497817268165e-07
177001.00000  178001.00000  9.283011855823e-07
178001.00000  179001.00000  7.854856185697e-07
179001.00000  180001.00000  9.104492397058e-07
180001.00000  181001.00000  7.676336726931e-07
181001.00000  182001.00000  6.605219974336e-07
182001.00000  183001.00000  5.712622680507e-07
183001.00000  184001.00000  5.891142139273e-07
184001.00000  185001.00000  9.104492397058e-07
185001.00000  186001.00000  6.248181056804e-07
186001.00000  187001.00000  6.069661598038e-07
187001.00000  188001.00000  6.962258891868e-07
188001.00000  189001.00000  5.891142139273e-07
189001.00000  190001.00000  6.783739433102e-07
190001.00000  191001.00000  4.998544845443e-07
191001.00000  192001.00000  3.748908634083e-07
192001.00000  193001.00000  4.820025386678e-07
193001.00000  194001.00000  6.248181056804e-07
194001.00000  195001.00000  7.497817268165e-07
195001.00000  196001.00000  4.284467010380e-07
196001.00000  197001.00000  4.641505927912e-07
197001.00000  198001.00000  5.177064304209e-07
198001.00000  199001.00000  6.248181056804e-07
