10001.00000  11001.00000  4.904691514145e-05
11001.00000  12001.00000  4.511427241832e-05
12001.00000  13001.00000  4.235079374802e-05
13001.00000  14001.00000  3.820557574257e-05
14001.00000  15001.00000  3.547108461077e-05
15001.00000  16001.00000  3.276558101746e-05
16001.00000  17001.00000  3.042725291182e-05
17001.00000  18001.00000  2.741254890786e-05
18001.00000  19001.00000  2.580857177754e-05
19001.00000  20001.00000  2.363450639007e-05
20001.00000  21001.00000  2.278420526074e-05
21001.00000  22001.00000  2.049418971927e-05
22001.00000  23001.00000  1.840708694729e-05
23001.00000  24001.00000  1.672580971431e-05
24001.00000  25001.00000  1.610740889299e-05
25001.00000  26001.00000  1.512183258400e-05
26001.00000  27001.00000  1.425220642901e-05
27001.00000  28001.00000  1.304439232485e-05
28001.00000  29001.00000  1.198151591320e-05
29001.00000  30001.00000  1.103458965554e-05
30001.00000  31001.00000  1.119885237371e-05
31001.00000  32001.00000  1.044517637272e-05
32001.00000  33001.00000  9.585212730559e-06
33001.00000  34001.00000  9.237362268562e-06
34001.00000  35001.00000  8.425711190572e-06
35001.00000  36001.00000  8.106848267075e-06
36001.00000  37001.00000  8.077860728576e-06
37001.00000  38001.00000  7.082621906753e-06
38001.00000  39001.00000  7.179247035086e-06
39001.00000  40001.00000  7.169584522252e-06
40001.00000  41001.00000  6.628483803592e-06
41001.00000  42001.00000  6.019745495099e-06
42001.00000  43001.00000  5.575269904770e-06
43001.00000  44001.00000  4.889231493612e-06
44001.00000  45001.00000  4.744293801113e-06
45001.00000  46001.00000  5.101806775942e-06
46001.00000  47001.00000  4.773281339613e-06
47001.00000  48001.00000  4.454418416116e-06
48001.00000  49001.00000  4.106567954120e-06
49001.00000  50001.00000  4.164543031120e-06
50001.00000  51001.00000  4.019605338621e-06
51001.00000  52001.00000  4.019605338621e-06
52001.00000  53001.00000  3.227279286297e-06
53001.00000  54001.00000  3.420529542961e-06
54001.00000  55001.00000  3.555804722627e-06
55001.00000  56001.00000  3.275591850463e-06
56001.00000  57001.00000  2.985716465466e-06
57001.00000  58001.00000  2.724828618969e-06
58001.00000  59001.00000  2.831116260135e-06
59001.00000  60001.00000  2.454278259639e-06
60001.00000  61001.00000  2.753816157469e-06
61001.00000  62001.00000  2.560565900804e-06
62001.00000  63001.00000  2.483265798139e-06
63001.00000  64001.00000  2.521915849472e-06
64001.00000  65001.00000  2.444615746806e-06
65001.00000  66001.00000  2.174065387475e-06
66001.00000  67001.00000  1.806889899813e-06
67001.00000  68001.00000  1.980815130811e-06
68001.00000  69001.00000  1.739252309980e-06
69001.00000  70001.00000  1.835877438313e-06
70001.00000  71001.00000  1.961490105145e-06
71001.00000  72001.00000  1.806889899813e-06
72001.00000  73001.00000  1.574989591816e-06
73001.00000  74001.00000  1.816552412646e-06
74001.00000  75001.00000  1.806889899813e-06
75001.00000  76001.00000  1.565327078982e-06
76001.00000  77001.00000  1.362414309485e-06
77001.00000  78001.00000  1.507352001983e-06
78001.00000  79001.00000  1.227139129819e-06
79001.00000  80001.00000  1.391401847984e-06
80001.00000  81001.00000  1.159501539987e-06
81001.00000  82001.00000  1.227139129819e-06
82001.00000  83001.00000  1.024226360322e-06
83001.00000  84001.00000  1.082201437321e-06
84001.00000  85001.00000  1.101526462988e-06
85001.00000  86001.00000  1.198151591320e-06
86001.00000  87001.00000  1.120851488654e-06
87001.00000  88001.00000  9.179387191563e-07
88001.00000  89001.00000  9.759137961557e-07
89001.00000  90001.00000  1.130514001487e-06
90001.00000  91001.00000  9.372637448228e-07
91001.00000  92001.00000  9.179387191563e-07
92001.00000  93001.00000  1.014563847489e-06
93001.00000  94001.00000  6.957009239922e-07
94001.00000  95001.00000  6.860384111589e-07
95001.00000  96001.00000  8.406386164905e-07
96001.00000  97001.00000  7.150259496586e-07
97001.00000  98001.00000  6.860384111589e-07
98001.00000  99001.00000  7.053634368254e-07
99001.00000  100001.00000  6.473883598260e-07
100001.00000  101001.00000  5.894132828267e-07
101001.00000  102001.00000  6.280633341596e-07
102001.00000  103001.00000  4.638006159948e-07
103001.00000  104001.00000  5.894132828267e-07
104001.00000  105001.00000  5.604257443270e-07
105001.00000  106001.00000  6.280633341596e-07
106001.00000  107001.00000  5.217756929941e-07
107001.00000  108001.00000  5.990757956599e-07
108001.00000  109001.00000  5.217756929941e-07
109001.00000  110001.00000  3.961630261622e-07
110001.00000  111001.00000  4.831256416612e-07
111001.00000  112001.00000  5.990757956599e-07
112001.00000  113001.00000  4.541381031615e-07
113001.00000  114001.00000  4.831256416612e-07
114001.00000  115001.00000  2.995378978300e-07
115001.00000  116001.00000  4.348130774951e-07
116001.00000  117001.00000  3.478504619961e-07
117001.00000  118001.00000  3.381879491629e-07
118001.00000  119001.00000  4.444755903283e-07
119001.00000  120001.00000  4.638006159948e-07
120001.00000  121001.00000  3.575129748293e-07
121001.00000  122001.00000  3.478504619961e-07
122001.00000  123001.00000  2.995378978300e-07
123001.00000  124001.00000  4.444755903283e-07
124001.00000  125001.00000  3.188629234964e-07
125001.00000  126001.00000  3.961630261622e-07
126001.00000  127001.00000  3.188629234964e-07
127001.00000  128001.00000  2.319003079974e-07
128001.00000  129001.00000  3.961630261622e-07
129001.00000  130001.00000  3.381879491629e-07
130001.00000  131001.00000  2.802128721635e-07
131001.00000  132001.00000  2.029127694977e-07
132001.00000  133001.00000  2.802128721635e-07
133001.00000  134001.00000  2.222377951642e-07
134001.00000  135001.00000  1.739252309980e-07
135001.00000  136001.00000  2.222377951642e-07
136001.00000  137001.00000  1.835877438313e-07
137001.00000  138001.00000  2.319003079974e-07
138001.00000  139001.00000  2.222377951642e-07
139001.00000  140001.00000  1.835877438313e-07
140001.00000  141001.00000  1.932502566645e-07
141001.00000  142001.00000  1.449376924984e-07
142001.00000  143001.00000  1.739252309980e-07
143001.00000  144001.00000  1.352751796651e-07
144001.00000  145001.00000  2.222377951642e-07
145001.00000  146001.00000  1.739252309980e-07
146001.00000  147001.00000  1.739252309980e-07
147001.00000  148001.00000  1.642627181648e-07
148001.00000  149001.00000  1.642627181648e-07
149001.00000  150001.00000  6.763758983257e-08
150001.00000  151001.00000  1.642627181648e-07
151001.00000  152001.00000  4.831256416612e-08
152001.00000  153001.00000  1.449376924984e-07
153001.00000  154001.00000  1.159501539987e-07
154001.00000  155001.00000  1.352751796651e-07
155001.00000  156001.00000  1.449376924984e-07
156001.00000  157001.00000  1.739252309980e-07
157001.00000  158001.00000  1.159501539987e-07
158001.00000  159001.00000  8.696261549902e-08
159001.00000  160001.00000  1.546002053316e-07
160001.00000  161001.00000  7.730010266579e-08
161001.00000  162001.00000  9.662512833224e-08
162001.00000  163001.00000  9.662512833224e-08
163001.00000  164001.00000  8.696261549902e-08
164001.00000  165001.00000  2.898753849967e-08
165001.00000  166001.00000  8.696261549902e-08
166001.00000  167001.00000  4.831256416612e-08
167001.00000  168001.00000  5.797507699935e-08
168001.00000  169001.00000  2.898753849967e-08
169001.00000  170001.00000  4.831256416612e-08
170001.00000  171001.00000  2.898753849967e-08
171001.00000  172001.00000  5.797507699935e-08
172001.00000  173001.00000  4.831256416612e-08
173001.00000  174001.00000  4.831256416612e-08
174001.00000  175001.00000  9.662512833224e-09
175001.00000  176001.00000  9.662512833224e-09
176001.00000  177001.00000  1.932502566645e-08
177001.00000  178001.00000  1.932502566645e-08
178001.00000  179001.00000  1.932502566645e-08
179001.00000  180001.00000  1.932502566645e-08
180001.00000  181001.00000  3.865005133290e-08
181001.00000  182001.00000  1.932502566645e-08
182001.00000  183001.00000  0.000000000000e+00
183001.00000  184001.00000  0.000000000000e+00
184001.00000  185001.00000  9.662512833224e-09
185001.00000  186001.00000  0.000000000000e+00
186001.00000  187001.00000  0.000000000000e+00
187001.00000  188001.00000  0.000000000000e+00
188001.00000  189001.00000  0.000000000000e+00
189001.00000  190001.00000  0.000000000000e+00
190001.00000  191001.00000  0.000000000000e+00
191001.00000  192001.00000  0.000000000000e+00
192001.00000  193001.00000  0.000000000000e+00
193001.00000  194001.00000  0.000000000000e+00
194001.00000  195001.00000  0.000000000000e+00
195001.00000  196001.00000  0.000000000000e+00
196001.00000  197001.00000  0.000000000000e+00
197001.00000  198001.00000  0.000000000000e+00
198001.00000  199001.00000  0.000000000000e+00
