300.00000  350.00000  1.992914184686e-01
350.00000  400.00000  1.403311163147e-01
400.00000  450.00000  1.047522057597e-01
450.00000  500.00000  8.079008710953e-02
500.00000  550.00000  6.397451259757e-02
550.00000  600.00000  5.119476600368e-02
600.00000  650.00000  4.250411815556e-02
650.00000  700.00000  3.661056390822e-02
700.00000  750.00000  3.182369234895e-02
750.00000  800.00000  2.879250722365e-02
800.00000  850.00000  2.651761779298e-02
850.00000  900.00000  2.375203651281e-02
900.00000  950.00000  2.210664320098e-02
950.00000  1000.00000  2.082439186951e-02
1000.00000  1050.00000  2.006209382810e-02
1050.00000  1100.00000  1.934931514764e-02
1100.00000  1150.00000  1.870331257514e-02
1150.00000  1200.00000  1.810007672347e-02
1200.00000  1250.00000  1.712844683801e-02
1250.00000  1300.00000  1.708342923714e-02
1300.00000  1350.00000  1.593473012159e-02
1350.00000  1400.00000  1.547329971266e-02
1400.00000  1450.00000  1.469974727103e-02
1450.00000  1500.00000  1.430884443680e-02
1500.00000  1550.00000  1.361932485013e-02
1550.00000  1600.00000  1.304460014568e-02
1600.00000  1650.00000  1.266345112497e-02
1650.00000  1700.00000  1.208047319369e-02
1700.00000  1750.00000  1.173683884038e-02
1750.00000  1800.00000  1.113960533549e-02
1800.00000  1850.00000  1.062715497891e-02
1850.00000  1900.00000  1.011995667577e-02
1900.00000  1950.00000  9.729804134887e-03
1950.00000  2000.00000  9.257869619091e-03
2000.00000  2050.00000  8.842207104383e-03
2050.00000  2100.00000  8.484317177460e-03
2100.00000  2150.00000  8.137681650754e-03
2150.00000  2200.00000  7.731022656221e-03
2200.00000  2250.00000  7.419650916864e-03
2250.00000  2300.00000  7.286848994295e-03
2300.00000  2350.00000  7.037001309462e-03
2350.00000  2400.00000  6.589076180797e-03
2400.00000  2450.00000  6.334726735877e-03
2450.00000  2500.00000  6.087880224435e-03
2500.00000  2550.00000  5.874796913646e-03
2550.00000  2600.00000  5.651959789335e-03
2600.00000  2650.00000  5.405113277894e-03
2650.00000  2700.00000  5.249052261541e-03
2700.00000  2750.00000  4.907668788271e-03
2750.00000  2800.00000  4.874655880965e-03
2800.00000  2850.00000  4.543776514565e-03
2850.00000  2900.00000  4.552029741391e-03
2900.00000  2950.00000  4.222650961686e-03
2950.00000  3000.00000  4.181384827554e-03
3000.00000  3050.00000  3.928535969330e-03
3050.00000  3100.00000  3.849004874458e-03
3100.00000  3150.00000  3.749966152542e-03
3150.00000  3200.00000  3.671935644366e-03
3200.00000  3250.00000  3.488864067491e-03
3250.00000  3300.00000  3.367316545140e-03
3300.00000  3350.00000  3.293787797051e-03
3350.00000  3400.00000  3.085206246349e-03
3400.00000  3450.00000  3.051443045696e-03
3450.00000  3500.00000  3.031185125304e-03
3500.00000  3550.00000  2.930645816692e-03
3550.00000  3600.00000  2.752075999905e-03
3600.00000  3650.00000  2.728066612774e-03
3650.00000  3700.00000  2.658289331424e-03
3700.00000  3750.00000  2.540493275812e-03
3750.00000  3800.00000  2.455710127505e-03
3800.00000  3850.00000  2.402439299808e-03
3850.00000  3900.00000  2.310153218023e-03
3900.00000  3950.00000  2.324408791632e-03
3950.00000  4000.00000  2.184854228932e-03
4000.00000  4050.00000  2.124080467756e-03
4050.00000  4100.00000  2.048300839624e-03
4100.00000  4150.00000  2.040797906145e-03
4150.00000  4200.00000  1.955264464491e-03
4200.00000  4250.00000  1.905745103533e-03
4250.00000  4300.00000  1.897491876706e-03
4300.00000  4350.00000  1.733927926876e-03
4350.00000  4400.00000  1.742181153702e-03
4400.00000  4450.00000  1.704666486310e-03
4450.00000  4500.00000  1.648394485221e-03
4500.00000  4550.00000  1.575616030480e-03
4550.00000  4600.00000  1.609379231133e-03
4600.00000  4650.00000  1.588371017393e-03
4650.00000  4700.00000  1.536600776392e-03
4700.00000  4750.00000  1.447315867998e-03
4750.00000  4800.00000  1.409050907258e-03
4800.00000  4850.00000  1.467573788390e-03
4850.00000  4900.00000  1.373036826561e-03
4900.00000  4950.00000  1.382790640083e-03
4950.00000  5000.00000  1.310012185342e-03
5000.00000  5050.00000  1.253740184253e-03
5050.00000  5100.00000  1.285252504863e-03
5100.00000  5150.00000  1.225229037035e-03
5150.00000  5200.00000  1.169707329294e-03
5200.00000  5250.00000  1.175709676077e-03
5250.00000  5300.00000  1.117186794945e-03
5300.00000  5350.00000  1.084173887640e-03
5350.00000  5400.00000  1.102180927988e-03
5400.00000  5450.00000  1.064666260596e-03
5450.00000  5500.00000  1.032403646638e-03
5500.00000  5550.00000  1.012896019594e-03
5550.00000  5600.00000  9.926380992023e-04
5600.00000  5650.00000  9.311140446788e-04
5650.00000  5700.00000  9.176087644175e-04
5700.00000  5750.00000  9.761316455496e-04
5750.00000  5800.00000  9.168584710697e-04
5800.00000  5850.00000  9.228608178525e-04
5850.00000  5900.00000  8.373273761978e-04
5900.00000  5950.00000  8.913484972429e-04
5950.00000  6000.00000  8.185700425017e-04
6000.00000  6050.00000  7.885583085878e-04
6050.00000  6100.00000  8.208209225452e-04
6100.00000  6150.00000  7.810553751093e-04
6150.00000  6200.00000  7.360377742384e-04
6200.00000  6250.00000  7.953109487184e-04
6250.00000  6300.00000  7.397892409777e-04
6300.00000  6350.00000  7.502933478475e-04
6350.00000  6400.00000  8.620870566768e-04
6400.00000  6450.00000  6.835172398891e-04
6450.00000  6500.00000  6.917704667154e-04
6500.00000  6550.00000  6.835172398891e-04
6550.00000  6600.00000  6.317469988876e-04
6600.00000  6650.00000  6.550060926709e-04
6650.00000  6700.00000  6.580072660623e-04
6700.00000  6750.00000  5.634703042335e-04
6750.00000  6800.00000  6.339978789312e-04
6800.00000  6850.00000  5.957329181909e-04
6850.00000  6900.00000  6.182417186264e-04
6900.00000  6950.00000  5.649708909292e-04
6950.00000  7000.00000  5.814773445818e-04
7000.00000  7050.00000  5.769755844948e-04
7050.00000  7100.00000  6.159908385828e-04
7100.00000  7150.00000  5.522159040158e-04
7150.00000  7200.00000  5.034468364057e-04
7200.00000  7250.00000  5.199532900583e-04
7250.00000  7300.00000  5.604691308421e-04
7300.00000  7350.00000  4.981947829708e-04
7350.00000  7400.00000  4.869403827531e-04
7400.00000  7450.00000  4.869403827531e-04
7450.00000  7500.00000  4.959439029272e-04
7500.00000  7550.00000  4.674327557090e-04
7550.00000  7600.00000  4.546777687956e-04
7600.00000  7650.00000  4.486754220128e-04
7650.00000  7700.00000  4.794374492746e-04
7700.00000  7750.00000  4.584292355348e-04
7750.00000  7800.00000  4.366707284473e-04
7800.00000  7850.00000  4.111607546204e-04
7850.00000  7900.00000  4.411724885344e-04
7900.00000  7950.00000  4.426730752300e-04
7950.00000  8000.00000  4.164128080554e-04
8000.00000  8050.00000  3.871513674893e-04
8050.00000  8100.00000  4.111607546204e-04
8100.00000  8150.00000  3.961548876635e-04
8150.00000  8200.00000  4.029075277941e-04
8200.00000  8250.00000  3.826496074022e-04
8250.00000  8300.00000  3.631419803582e-04
8300.00000  8350.00000  3.969051810113e-04
8350.00000  8400.00000  3.984057677070e-04
8400.00000  8450.00000  3.646425670539e-04
8450.00000  8500.00000  3.608911003147e-04
8500.00000  8550.00000  3.721455005324e-04
8550.00000  8600.00000  3.526378734883e-04
8600.00000  8650.00000  3.278781930094e-04
8650.00000  8700.00000  3.256273129658e-04
8700.00000  8750.00000  3.421337666185e-04
8750.00000  8800.00000  3.338805397922e-04
8800.00000  8850.00000  3.248770196180e-04
8850.00000  8900.00000  3.346308331400e-04
8900.00000  8950.00000  3.518875801405e-04
8950.00000  9000.00000  3.196249661830e-04
9000.00000  9050.00000  3.038688058783e-04
9050.00000  9100.00000  3.233764329223e-04
9100.00000  9150.00000  2.821102987907e-04
9150.00000  9200.00000  2.708558985730e-04
9200.00000  9250.00000  3.136226194003e-04
9250.00000  9300.00000  2.888629389213e-04
9300.00000  9350.00000  2.798594187471e-04
9350.00000  9400.00000  2.971161657476e-04
9400.00000  9450.00000  2.596014983552e-04
9450.00000  9500.00000  2.483470981375e-04
9500.00000  9550.00000  2.618523783988e-04
9550.00000  9600.00000  2.596014983552e-04
9600.00000  9650.00000  3.106214460089e-04
9650.00000  9700.00000  2.611020850509e-04
9700.00000  9750.00000  2.543494449203e-04
9750.00000  9800.00000  2.378429912677e-04
9800.00000  9850.00000  2.483470981375e-04
9850.00000  9900.00000  2.581009116596e-04
9900.00000  9950.00000  2.273388843978e-04
9950.00000  10000.00000  2.603517917031e-04
