10001.00000  11001.00000  1.379476757526e-04
11001.00000  12001.00000  1.251456106808e-04
12001.00000  13001.00000  1.096674077126e-04
13001.00000  14001.00000  9.569001180797e-05
14001.00000  15001.00000  8.252630647989e-05
15001.00000  16001.00000  7.218339515068e-05
16001.00000  17001.00000  6.283499452621e-05
17001.00000  18001.00000  5.860380352790e-05
18001.00000  19001.00000  4.874910654465e-05
19001.00000  20001.00000  4.468065366166e-05
20001.00000  21001.00000  3.788181684386e-05
21001.00000  22001.00000  3.536841706281e-05
22001.00000  23001.00000  3.236680293580e-05
23001.00000  24001.00000  2.900354855253e-05
24001.00000  25001.00000  2.600193442552e-05
25001.00000  26001.00000  2.343428860603e-05
26001.00000  27001.00000  2.135485713250e-05
27001.00000  28001.00000  1.969131195368e-05
28001.00000  29001.00000  1.766612651859e-05
29001.00000  30001.00000  1.734065028795e-05
30001.00000  31001.00000  1.513464472473e-05
31001.00000  32001.00000  1.356150960997e-05
32001.00000  33001.00000  1.231385072586e-05
33001.00000  34001.00000  1.247658884118e-05
34001.00000  35001.00000  1.130125800831e-05
35001.00000  36001.00000  9.818532957621e-06
36001.00000  37001.00000  1.018017321389e-05
37001.00000  38001.00000  8.842104265702e-06
38001.00000  39001.00000  8.607038099130e-06
39001.00000  40001.00000  8.299643881304e-06
40001.00000  41001.00000  7.178559086879e-06
41001.00000  42001.00000  6.997738958746e-06
42001.00000  43001.00000  6.925410907493e-06
43001.00000  44001.00000  5.948982215575e-06
44001.00000  45001.00000  6.093638318081e-06
45001.00000  46001.00000  5.460767869616e-06
46001.00000  47001.00000  4.864061446777e-06
47001.00000  48001.00000  4.845979433964e-06
48001.00000  49001.00000  4.267355023938e-06
49001.00000  50001.00000  4.339683075191e-06
50001.00000  51001.00000  4.032288857365e-06
51001.00000  52001.00000  3.887632754859e-06
52001.00000  53001.00000  3.272844319207e-06
53001.00000  54001.00000  3.616402562659e-06
54001.00000  55001.00000  3.598320549846e-06
55001.00000  56001.00000  3.272844319207e-06
56001.00000  57001.00000  2.929286075754e-06
57001.00000  58001.00000  3.019696139821e-06
58001.00000  59001.00000  2.658055883555e-06
59001.00000  60001.00000  2.694219909181e-06
60001.00000  61001.00000  2.296415627289e-06
61001.00000  62001.00000  2.368743678542e-06
62001.00000  63001.00000  2.151759524782e-06
63001.00000  64001.00000  2.169841537596e-06
64001.00000  65001.00000  2.441071729795e-06
65001.00000  66001.00000  1.898611345396e-06
66001.00000  67001.00000  1.952857383836e-06
67001.00000  68001.00000  1.663545178823e-06
68001.00000  69001.00000  1.753955242890e-06
69001.00000  70001.00000  1.446561025064e-06
70001.00000  71001.00000  1.500807063504e-06
71001.00000  72001.00000  1.518889076317e-06
72001.00000  73001.00000  1.392314986624e-06
73001.00000  74001.00000  1.338068948184e-06
74001.00000  75001.00000  1.464643037877e-06
75001.00000  76001.00000  1.301904922557e-06
76001.00000  77001.00000  1.356150960997e-06
77001.00000  78001.00000  1.573135114757e-06
78001.00000  79001.00000  1.175330832864e-06
79001.00000  80001.00000  1.247658884118e-06
80001.00000  81001.00000  8.860186278516e-07
81001.00000  82001.00000  1.048756743171e-06
82001.00000  83001.00000  1.084920768798e-06
83001.00000  84001.00000  8.498546022250e-07
84001.00000  85001.00000  7.775265509718e-07
85001.00000  86001.00000  9.583466791048e-07
86001.00000  87001.00000  8.860186278516e-07
87001.00000  88001.00000  5.062963587723e-07
88001.00000  89001.00000  8.860186278516e-07
89001.00000  90001.00000  6.328704484654e-07
90001.00000  91001.00000  7.594445381585e-07
91001.00000  92001.00000  8.317725894117e-07
92001.00000  93001.00000  7.775265509718e-07
93001.00000  94001.00000  7.594445381585e-07
94001.00000  95001.00000  5.967064228388e-07
95001.00000  96001.00000  5.967064228388e-07
96001.00000  97001.00000  6.690344740920e-07
97001.00000  98001.00000  6.147884356521e-07
98001.00000  99001.00000  6.690344740920e-07
99001.00000  100001.00000  5.967064228388e-07
100001.00000  101001.00000  6.871164869053e-07
101001.00000  102001.00000  6.690344740920e-07
102001.00000  103001.00000  4.520503203324e-07
103001.00000  104001.00000  3.073942178261e-07
104001.00000  105001.00000  4.520503203324e-07
105001.00000  106001.00000  6.147884356521e-07
106001.00000  107001.00000  5.786244100255e-07
107001.00000  108001.00000  4.158862947058e-07
108001.00000  109001.00000  4.339683075191e-07
109001.00000  110001.00000  4.158862947058e-07
110001.00000  111001.00000  2.893122050128e-07
111001.00000  112001.00000  3.435582434527e-07
112001.00000  113001.00000  3.254762306394e-07
113001.00000  114001.00000  3.978042818925e-07
114001.00000  115001.00000  4.882143459590e-07
115001.00000  116001.00000  2.169841537596e-07
116001.00000  117001.00000  1.627381153197e-07
117001.00000  118001.00000  3.435582434527e-07
118001.00000  119001.00000  2.712301921995e-07
119001.00000  120001.00000  2.350661665729e-07
120001.00000  121001.00000  2.350661665729e-07
121001.00000  122001.00000  1.446561025064e-07
122001.00000  123001.00000  1.265740896931e-07
123001.00000  124001.00000  2.893122050128e-07
124001.00000  125001.00000  1.989021409463e-07
125001.00000  126001.00000  1.989021409463e-07
126001.00000  127001.00000  1.989021409463e-07
127001.00000  128001.00000  1.989021409463e-07
128001.00000  129001.00000  1.808201281330e-07
129001.00000  130001.00000  2.169841537596e-07
130001.00000  131001.00000  1.446561025064e-07
131001.00000  132001.00000  1.265740896931e-07
132001.00000  133001.00000  2.531481793862e-07
133001.00000  134001.00000  1.084920768798e-07
134001.00000  135001.00000  1.446561025064e-07
135001.00000  136001.00000  1.446561025064e-07
136001.00000  137001.00000  1.265740896931e-07
137001.00000  138001.00000  1.627381153197e-07
138001.00000  139001.00000  1.084920768798e-07
139001.00000  140001.00000  1.265740896931e-07
140001.00000  141001.00000  1.265740896931e-07
141001.00000  142001.00000  1.446561025064e-07
142001.00000  143001.00000  2.531481793862e-07
143001.00000  144001.00000  1.808201281330e-07
144001.00000  145001.00000  1.084920768798e-07
145001.00000  146001.00000  9.041006406649e-08
146001.00000  147001.00000  1.084920768798e-07
147001.00000  148001.00000  1.265740896931e-07
148001.00000  149001.00000  1.627381153197e-07
149001.00000  150001.00000  5.424603843989e-08
150001.00000  151001.00000  1.446561025064e-07
151001.00000  152001.00000  5.424603843989e-08
152001.00000  153001.00000  9.041006406649e-08
153001.00000  154001.00000  1.084920768798e-07
154001.00000  155001.00000  1.446561025064e-07
155001.00000  156001.00000  1.446561025064e-07
156001.00000  157001.00000  7.232805125319e-08
157001.00000  158001.00000  1.084920768798e-07
158001.00000  159001.00000  9.041006406649e-08
159001.00000  160001.00000  1.808201281330e-08
160001.00000  161001.00000  1.084920768798e-07
161001.00000  162001.00000  5.424603843989e-08
162001.00000  163001.00000  9.041006406649e-08
163001.00000  164001.00000  1.265740896931e-07
164001.00000  165001.00000  5.424603843989e-08
165001.00000  166001.00000  7.232805125319e-08
166001.00000  167001.00000  3.616402562659e-08
167001.00000  168001.00000  9.041006406649e-08
168001.00000  169001.00000  9.041006406649e-08
169001.00000  170001.00000  5.424603843989e-08
170001.00000  171001.00000  1.084920768798e-07
171001.00000  172001.00000  5.424603843989e-08
172001.00000  173001.00000  5.424603843989e-08
173001.00000  174001.00000  5.424603843989e-08
174001.00000  175001.00000  5.424603843989e-08
175001.00000  176001.00000  7.232805125319e-08
176001.00000  177001.00000  5.424603843989e-08
177001.00000  178001.00000  7.232805125319e-08
178001.00000  179001.00000  1.808201281330e-08
179001.00000  180001.00000  5.424603843989e-08
180001.00000  181001.00000  5.424603843989e-08
181001.00000  182001.00000  0.000000000000e+00
182001.00000  183001.00000  5.424603843989e-08
183001.00000  184001.00000  3.616402562659e-08
184001.00000  185001.00000  1.808201281330e-08
185001.00000  186001.00000  5.424603843989e-08
186001.00000  187001.00000  1.808201281330e-08
187001.00000  188001.00000  3.616402562659e-08
188001.00000  189001.00000  1.808201281330e-08
189001.00000  190001.00000  0.000000000000e+00
190001.00000  191001.00000  1.808201281330e-08
191001.00000  192001.00000  3.616402562659e-08
192001.00000  193001.00000  1.808201281330e-08
193001.00000  194001.00000  0.000000000000e+00
194001.00000  195001.00000  1.808201281330e-08
195001.00000  196001.00000  3.616402562659e-08
196001.00000  197001.00000  0.000000000000e+00
197001.00000  198001.00000  0.000000000000e+00
198001.00000  199001.00000  1.808201281330e-08
