300.00000  350.00000  7.159839774965e-06
350.00000  400.00000  1.288771159494e-05
400.00000  450.00000  5.727871819972e-06
450.00000  500.00000  1.002377568495e-05
500.00000  550.00000  7.267237371589e-05
550.00000  600.00000  7.875823752461e-06
600.00000  650.00000  1.968955938115e-05
650.00000  700.00000  9.665783696202e-06
700.00000  750.00000  1.038176767370e-05
750.00000  800.00000  7.517831763713e-06
800.00000  850.00000  3.293526296484e-05
850.00000  900.00000  8.233815741209e-06
900.00000  950.00000  7.159839774965e-06
950.00000  1000.00000  7.875823752461e-06
1000.00000  1050.00000  9.665783696202e-06
1050.00000  1100.00000  6.443855797468e-06
1100.00000  1150.00000  8.233815741209e-06
1150.00000  1200.00000  1.073975966245e-05
1200.00000  1250.00000  7.517831763713e-06
1250.00000  1300.00000  1.396168756118e-05
1300.00000  1350.00000  7.517831763713e-06
1350.00000  1400.00000  5.727871819972e-06
1400.00000  1450.00000  8.591807729958e-06
1450.00000  1500.00000  7.517831763713e-06
1500.00000  1550.00000  5.727871819972e-06
1550.00000  1600.00000  7.517831763713e-06
1600.00000  1650.00000  3.579919887482e-06
1650.00000  1700.00000  5.011887842475e-06
1700.00000  1750.00000  1.682562347117e-05
1750.00000  1800.00000  4.653895853727e-06
1800.00000  1850.00000  3.579919887482e-06
1850.00000  1900.00000  5.727871819972e-06
1900.00000  1950.00000  6.085863808720e-06
1950.00000  2000.00000  3.221927898734e-06
2000.00000  2050.00000  4.653895853727e-06
2050.00000  2100.00000  3.579919887482e-06
2100.00000  2150.00000  4.295903864979e-06
2150.00000  2200.00000  6.085863808720e-06
2200.00000  2250.00000  4.653895853727e-06
2250.00000  2300.00000  5.011887842475e-06
2300.00000  2350.00000  2.720739114487e-05
2350.00000  2400.00000  6.443855797468e-06
2400.00000  2450.00000  1.789959943741e-06
2450.00000  2500.00000  8.591807729958e-06
2500.00000  2550.00000  3.221927898734e-06
2550.00000  2600.00000  4.295903864979e-06
2600.00000  2650.00000  5.727871819972e-06
2650.00000  2700.00000  3.579919887482e-06
2700.00000  2750.00000  1.789959943741e-06
2750.00000  2800.00000  3.221927898734e-06
2800.00000  2850.00000  5.011887842475e-06
2850.00000  2900.00000  4.653895853727e-06
2900.00000  2950.00000  5.727871819972e-06
2950.00000  3000.00000  1.646763148242e-05
3000.00000  3050.00000  3.579919887482e-06
3050.00000  3100.00000  3.579919887482e-06
3100.00000  3150.00000  4.295903864979e-06
3150.00000  3200.00000  7.875823752461e-06
3200.00000  3250.00000  1.038176767370e-05
3250.00000  3300.00000  1.360369557243e-05
3300.00000  3350.00000  7.875823752461e-06
3350.00000  3400.00000  1.109775165120e-05
3400.00000  3450.00000  1.897357540366e-05
3450.00000  3500.00000  1.897357540366e-05
3500.00000  3550.00000  2.541743120112e-05
3550.00000  3600.00000  2.147951932489e-05
3600.00000  3650.00000  3.186128699859e-05
3650.00000  3700.00000  4.761293450352e-05
3700.00000  3750.00000  3.794715080731e-05
3750.00000  3800.00000  4.224305467229e-05
3800.00000  3850.00000  5.405679030098e-05
3850.00000  3900.00000  6.085863808720e-05
3900.00000  3950.00000  6.085863808720e-05
3950.00000  4000.00000  7.231438172714e-05
4000.00000  4050.00000  8.054819746835e-05
4050.00000  4100.00000  6.730249388467e-05
4100.00000  4150.00000  8.914000519831e-05
4150.00000  4200.00000  1.027437007707e-04
4200.00000  4250.00000  1.023857087820e-04
4250.00000  4300.00000  1.285191239606e-04
4300.00000  4350.00000  1.249392040731e-04
4350.00000  4400.00000  1.238652281069e-04
4400.00000  4450.00000  1.356789637356e-04
4450.00000  4500.00000  1.474926993643e-04
4500.00000  4550.00000  1.736261145429e-04
4550.00000  4600.00000  1.775640264191e-04
4600.00000  4650.00000  1.868718181266e-04
4650.00000  4700.00000  2.162271612039e-04
4700.00000  4750.00000  2.026234656315e-04
4750.00000  4800.00000  2.072773614852e-04
4800.00000  4850.00000  2.269669208664e-04
4850.00000  4900.00000  2.466564802475e-04
4900.00000  4950.00000  2.652720636624e-04
4950.00000  5000.00000  2.667040316174e-04
5000.00000  5050.00000  2.706419434937e-04
5050.00000  5100.00000  2.720739114487e-04
5100.00000  5150.00000  2.910474868523e-04
5150.00000  5200.00000  2.924794548073e-04
5200.00000  5250.00000  3.082311023122e-04
5250.00000  5300.00000  3.243407418059e-04
5300.00000  5350.00000  3.261307017496e-04
5350.00000  5400.00000  3.508321489733e-04
5400.00000  5450.00000  3.619299006245e-04
5450.00000  5500.00000  3.633618685795e-04
5500.00000  5550.00000  3.515481329508e-04
5550.00000  5600.00000  3.758915881856e-04
5600.00000  5650.00000  3.884213077918e-04
5650.00000  5700.00000  3.830514279606e-04
5700.00000  5750.00000  3.970131155218e-04
5750.00000  5800.00000  3.859153638706e-04
5800.00000  5850.00000  4.184926348467e-04
5850.00000  5900.00000  4.138387389930e-04
5900.00000  5950.00000  4.102588191055e-04
5950.00000  6000.00000  4.299483784866e-04
6000.00000  6050.00000  4.041729552968e-04
6050.00000  6100.00000  4.496379378678e-04
6100.00000  6150.00000  4.378242022391e-04
6150.00000  6200.00000  4.317383384304e-04
6200.00000  6250.00000  5.036947281688e-04
6250.00000  6300.00000  5.552455745485e-04
6300.00000  6350.00000  5.931927253558e-04
6350.00000  6400.00000  2.065613775077e-03
6400.00000  6450.00000  4.525018737778e-04
6450.00000  6500.00000  4.614516734965e-04
6500.00000  6550.00000  4.764873370239e-04
6550.00000  6600.00000  4.704014732152e-04
6600.00000  6650.00000  4.707594652039e-04
6650.00000  6700.00000  4.696854892377e-04
6700.00000  6750.00000  4.775613129901e-04
6750.00000  6800.00000  4.675375373052e-04
6800.00000  6850.00000  4.704014732152e-04
6850.00000  6900.00000  5.069166560675e-04
6900.00000  6950.00000  4.990408323150e-04
6950.00000  7000.00000  4.779193049789e-04
7000.00000  7050.00000  5.069166560675e-04
7050.00000  7100.00000  6.451015637243e-04
7100.00000  7150.00000  2.380646725176e-04
7150.00000  7200.00000  2.387806564951e-04
7200.00000  7250.00000  2.262509368889e-04
7250.00000  7300.00000  2.405706164388e-04
7300.00000  7350.00000  2.344847526301e-04
7350.00000  7400.00000  2.359167205851e-04
7400.00000  7450.00000  2.445085283150e-04
7450.00000  7500.00000  2.964173666835e-04
7500.00000  7550.00000  2.606181678087e-04
7550.00000  7600.00000  2.452245122925e-04
7600.00000  7650.00000  2.652720636624e-04
7650.00000  7700.00000  2.520263600788e-04
7700.00000  7750.00000  2.767278073024e-04
7750.00000  7800.00000  2.541743120112e-04
7800.00000  7850.00000  2.674200155949e-04
7850.00000  7900.00000  2.402126244501e-04
7900.00000  7950.00000  2.731478874149e-04
7950.00000  8000.00000  2.677780075837e-04
8000.00000  8050.00000  2.602601758200e-04
8050.00000  8100.00000  2.670620236062e-04
8100.00000  8150.00000  2.613341517862e-04
8150.00000  8200.00000  2.641980876962e-04
8200.00000  8250.00000  2.677780075837e-04
8250.00000  8300.00000  2.749378473586e-04
8300.00000  8350.00000  2.731478874149e-04
8350.00000  8400.00000  2.713579274712e-04
8400.00000  8450.00000  2.627661197412e-04
8450.00000  8500.00000  2.828136711111e-04
8500.00000  8550.00000  2.778017832686e-04
8550.00000  8600.00000  2.570382479212e-04
8600.00000  8650.00000  2.763698153136e-04
8650.00000  8700.00000  2.735058794037e-04
8700.00000  8750.00000  2.742218633811e-04
8750.00000  8800.00000  2.745798553699e-04
8800.00000  8850.00000  2.903315028748e-04
8850.00000  8900.00000  2.688519835499e-04
8900.00000  8950.00000  2.835296550886e-04
8950.00000  9000.00000  2.942694147510e-04
9000.00000  9050.00000  2.914054788411e-04
9050.00000  9100.00000  2.752958393474e-04
9100.00000  9150.00000  3.028612224810e-04
9150.00000  9200.00000  2.670620236062e-04
9200.00000  9250.00000  2.803077271899e-04
9250.00000  9300.00000  2.781597752574e-04
9300.00000  9350.00000  2.996392945823e-04
9350.00000  9400.00000  2.706419434937e-04
9400.00000  9450.00000  2.649140716737e-04
9450.00000  9500.00000  2.695679675274e-04
9500.00000  9550.00000  2.853196150323e-04
9550.00000  9600.00000  2.810237111674e-04
9600.00000  9650.00000  2.917634708298e-04
9650.00000  9700.00000  2.992813025935e-04
9700.00000  9750.00000  2.788757592349e-04
9750.00000  9800.00000  2.835296550886e-04
9800.00000  9850.00000  2.717159194599e-04
9850.00000  9900.00000  2.738638713924e-04
9900.00000  9950.00000  2.881835509423e-04
9950.00000  10000.00000  2.989233106048e-04
