300.00000  350.00000  1.206783677249e-06
350.00000  400.00000  3.821481644622e-06
400.00000  450.00000  1.407914290124e-06
450.00000  500.00000  1.609044902999e-06
500.00000  550.00000  1.890627761023e-05
550.00000  600.00000  1.810175515873e-06
600.00000  650.00000  7.441832676368e-06
650.00000  700.00000  2.614697967373e-06
700.00000  750.00000  4.424873483246e-06
750.00000  800.00000  1.810175515873e-06
800.00000  850.00000  1.267122861111e-05
850.00000  900.00000  3.821481644622e-06
900.00000  950.00000  3.821481644622e-06
950.00000  1000.00000  2.614697967373e-06
1000.00000  1050.00000  3.419220418872e-06
1050.00000  1100.00000  3.620351031747e-06
1100.00000  1150.00000  2.413567354498e-06
1150.00000  1200.00000  5.631657160495e-06
1200.00000  1250.00000  2.614697967373e-06
1250.00000  1300.00000  1.206783677249e-05
1300.00000  1350.00000  3.821481644622e-06
1350.00000  1400.00000  3.218089805997e-06
1400.00000  1450.00000  2.212436741623e-06
1450.00000  1500.00000  4.626004096121e-06
1500.00000  1550.00000  4.626004096121e-06
1550.00000  1600.00000  4.223742870371e-06
1600.00000  1650.00000  5.229395934745e-06
1650.00000  1700.00000  4.022612257496e-06
1700.00000  1750.00000  1.629157964286e-05
1750.00000  1800.00000  4.827134708996e-06
1800.00000  1850.00000  4.022612257496e-06
1850.00000  1900.00000  5.028265321871e-06
1900.00000  1950.00000  5.229395934745e-06
1950.00000  2000.00000  5.631657160495e-06
2000.00000  2050.00000  7.240702063494e-06
2050.00000  2100.00000  6.637310224869e-06
2100.00000  2150.00000  5.028265321871e-06
2150.00000  2200.00000  7.240702063494e-06
2200.00000  2250.00000  6.838440837744e-06
2250.00000  2300.00000  9.050877579367e-06
2300.00000  2350.00000  2.514132660935e-05
2350.00000  2400.00000  5.028265321871e-06
2400.00000  2450.00000  8.246355127868e-06
2450.00000  2500.00000  9.252008192242e-06
2500.00000  2550.00000  6.235048999119e-06
2550.00000  2600.00000  6.637310224869e-06
2600.00000  2650.00000  9.453138805117e-06
2650.00000  2700.00000  6.235048999119e-06
2700.00000  2750.00000  7.844093902118e-06
2750.00000  2800.00000  8.447485740743e-06
2800.00000  2850.00000  7.441832676368e-06
2850.00000  2900.00000  8.447485740743e-06
2900.00000  2950.00000  9.252008192242e-06
2950.00000  3000.00000  1.206783677249e-05
3000.00000  3050.00000  8.648616353617e-06
3050.00000  3100.00000  7.441832676368e-06
3100.00000  3150.00000  8.246355127868e-06
3150.00000  3200.00000  8.045224514993e-06
3200.00000  3250.00000  6.033918386245e-06
3250.00000  3300.00000  8.849746966492e-06
3300.00000  3350.00000  8.648616353617e-06
3350.00000  3400.00000  6.033918386245e-06
3400.00000  3450.00000  8.648616353617e-06
3450.00000  3500.00000  9.050877579367e-06
3500.00000  3550.00000  1.166557554674e-05
3550.00000  3600.00000  9.654269417991e-06
3600.00000  3650.00000  9.252008192242e-06
3650.00000  3700.00000  1.830288577161e-05
3700.00000  3750.00000  9.050877579367e-06
3750.00000  3800.00000  1.025766125662e-05
3800.00000  3850.00000  9.855400030866e-06
3850.00000  3900.00000  9.252008192242e-06
3900.00000  3950.00000  1.045879186949e-05
3950.00000  4000.00000  1.005653064374e-05
4000.00000  4050.00000  8.648616353617e-06
4050.00000  4100.00000  1.065992248237e-05
4100.00000  4150.00000  9.453138805117e-06
4150.00000  4200.00000  8.246355127868e-06
4200.00000  4250.00000  9.654269417991e-06
4250.00000  4300.00000  1.045879186949e-05
4300.00000  4350.00000  9.453138805117e-06
4350.00000  4400.00000  1.005653064374e-05
4400.00000  4450.00000  1.065992248237e-05
4450.00000  4500.00000  9.252008192242e-06
4500.00000  4550.00000  1.166557554674e-05
4550.00000  4600.00000  1.206783677249e-05
4600.00000  4650.00000  1.206783677249e-05
4650.00000  4700.00000  1.126331432099e-05
4700.00000  4750.00000  1.548705719136e-05
4750.00000  4800.00000  1.045879186949e-05
4800.00000  4850.00000  1.166557554674e-05
4850.00000  4900.00000  1.247009799824e-05
4900.00000  4950.00000  1.126331432099e-05
4950.00000  5000.00000  1.086105309524e-05
5000.00000  5050.00000  1.025766125662e-05
5050.00000  5100.00000  1.186670615961e-05
5100.00000  5150.00000  1.247009799824e-05
5150.00000  5200.00000  1.186670615961e-05
5200.00000  5250.00000  1.206783677249e-05
5250.00000  5300.00000  1.045879186949e-05
5300.00000  5350.00000  1.307348983686e-05
5350.00000  5400.00000  1.428027351411e-05
5400.00000  5450.00000  1.568818780424e-05
5450.00000  5500.00000  1.287235922399e-05
5500.00000  5550.00000  1.247009799824e-05
5550.00000  5600.00000  1.468253473986e-05
5600.00000  5650.00000  1.065992248237e-05
5650.00000  5700.00000  1.106218370812e-05
5700.00000  5750.00000  1.267122861111e-05
5750.00000  5800.00000  1.247009799824e-05
5800.00000  5850.00000  1.568818780424e-05
5850.00000  5900.00000  1.609044902999e-05
5900.00000  5950.00000  1.106218370812e-05
5950.00000  6000.00000  1.065992248237e-05
6000.00000  6050.00000  1.709610209436e-05
6050.00000  6100.00000  1.106218370812e-05
6100.00000  6150.00000  1.267122861111e-05
6150.00000  6200.00000  1.729723270723e-05
6200.00000  6250.00000  1.749836332011e-05
6250.00000  6300.00000  2.494019599648e-05
6300.00000  6350.00000  2.494019599648e-05
6350.00000  6400.00000  2.186289761949e-04
6400.00000  6450.00000  1.448140412699e-05
6450.00000  6500.00000  1.166557554674e-05
6500.00000  6550.00000  1.186670615961e-05
6550.00000  6600.00000  1.226896738536e-05
6600.00000  6650.00000  1.347575106261e-05
6650.00000  6700.00000  1.508479596561e-05
6700.00000  6750.00000  1.247009799824e-05
6750.00000  6800.00000  1.387801228836e-05
6800.00000  6850.00000  1.367688167549e-05
6850.00000  6900.00000  1.568818780424e-05
6900.00000  6950.00000  1.367688167549e-05
6950.00000  7000.00000  1.387801228836e-05
7000.00000  7050.00000  1.126331432099e-05
7050.00000  7100.00000  3.962273073634e-05
7100.00000  7150.00000  6.235048999119e-06
7150.00000  7200.00000  9.050877579367e-06
7200.00000  7250.00000  8.447485740743e-06
7250.00000  7300.00000  5.430526547620e-06
7300.00000  7350.00000  7.441832676368e-06
7350.00000  7400.00000  7.240702063494e-06
7400.00000  7450.00000  9.855400030866e-06
7450.00000  7500.00000  1.428027351411e-05
7500.00000  7550.00000  6.637310224869e-06
7550.00000  7600.00000  5.229395934745e-06
7600.00000  7650.00000  8.447485740743e-06
7650.00000  7700.00000  7.642963289243e-06
7700.00000  7750.00000  7.039571450619e-06
7750.00000  7800.00000  7.844093902118e-06
7800.00000  7850.00000  7.240702063494e-06
7850.00000  7900.00000  8.045224514993e-06
7900.00000  7950.00000  7.844093902118e-06
7950.00000  8000.00000  7.642963289243e-06
8000.00000  8050.00000  8.045224514993e-06
8050.00000  8100.00000  7.844093902118e-06
8100.00000  8150.00000  8.447485740743e-06
8150.00000  8200.00000  8.045224514993e-06
8200.00000  8250.00000  6.436179611994e-06
8250.00000  8300.00000  9.252008192242e-06
8300.00000  8350.00000  8.447485740743e-06
8350.00000  8400.00000  8.447485740743e-06
8400.00000  8450.00000  9.453138805117e-06
8450.00000  8500.00000  9.050877579367e-06
8500.00000  8550.00000  7.642963289243e-06
8550.00000  8600.00000  5.430526547620e-06
8600.00000  8650.00000  6.838440837744e-06
8650.00000  8700.00000  8.045224514993e-06
8700.00000  8750.00000  8.849746966492e-06
8750.00000  8800.00000  9.252008192242e-06
8800.00000  8850.00000  7.240702063494e-06
8850.00000  8900.00000  7.844093902118e-06
8900.00000  8950.00000  9.453138805117e-06
8950.00000  9000.00000  6.637310224869e-06
9000.00000  9050.00000  8.045224514993e-06
9050.00000  9100.00000  6.436179611994e-06
9100.00000  9150.00000  7.039571450619e-06
9150.00000  9200.00000  9.050877579367e-06
9200.00000  9250.00000  7.441832676368e-06
9250.00000  9300.00000  9.050877579367e-06
9300.00000  9350.00000  8.849746966492e-06
9350.00000  9400.00000  8.648616353617e-06
9400.00000  9450.00000  1.005653064374e-05
9450.00000  9500.00000  7.642963289243e-06
9500.00000  9550.00000  7.441832676368e-06
9550.00000  9600.00000  8.648616353617e-06
9600.00000  9650.00000  7.240702063494e-06
9650.00000  9700.00000  8.849746966492e-06
9700.00000  9750.00000  8.246355127868e-06
9750.00000  9800.00000  9.252008192242e-06
9800.00000  9850.00000  6.436179611994e-06
9850.00000  9900.00000  8.648616353617e-06
9900.00000  9950.00000  7.441832676368e-06
9950.00000  10000.00000  9.654269417991e-06
