300.00000  350.00000  3.816860043905e-04
350.00000  400.00000  3.728631118267e-04
400.00000  450.00000  2.969095149731e-04
450.00000  500.00000  2.581655084973e-04
500.00000  550.00000  4.177447826947e-04
550.00000  600.00000  1.457695293149e-04
600.00000  650.00000  2.017757168939e-04
650.00000  700.00000  1.607300862710e-04
700.00000  750.00000  2.094477973841e-04
750.00000  800.00000  2.267099784872e-04
800.00000  850.00000  3.755483399983e-04
850.00000  900.00000  2.612343406934e-04
900.00000  950.00000  2.838669781396e-04
950.00000  1000.00000  3.513812864539e-04
1000.00000  1050.00000  4.376921919694e-04
1050.00000  1100.00000  4.864099030825e-04
1100.00000  1150.00000  6.283433921523e-04
1150.00000  1200.00000  7.119690694962e-04
1200.00000  1250.00000  8.546697666150e-04
1250.00000  1300.00000  9.693673699444e-04
1300.00000  1350.00000  9.290889473705e-04
1350.00000  1400.00000  1.093655073887e-03
1400.00000  1450.00000  1.231752522711e-03
1450.00000  1500.00000  1.397853065325e-03
1500.00000  1550.00000  1.480711534620e-03
1550.00000  1600.00000  1.653333345651e-03
1600.00000  1650.00000  1.773401405324e-03
1650.00000  1700.00000  1.873522055722e-03
1700.00000  1750.00000  2.043458638581e-03
1750.00000  1800.00000  1.942954384158e-03
1800.00000  1850.00000  1.901908753536e-03
1850.00000  1900.00000  1.830174800952e-03
1900.00000  1950.00000  1.961750981360e-03
1950.00000  2000.00000  1.972875498070e-03
2000.00000  2050.00000  2.014688336742e-03
2050.00000  2100.00000  1.982465598683e-03
2100.00000  2150.00000  2.026580061502e-03
2150.00000  2200.00000  2.013537524669e-03
2200.00000  2250.00000  1.982465598683e-03
2250.00000  2300.00000  1.895003881094e-03
2300.00000  2350.00000  2.069927316272e-03
2350.00000  2400.00000  1.849355002177e-03
2400.00000  2450.00000  1.779155465691e-03
2450.00000  2500.00000  1.720464049941e-03
2500.00000  2550.00000  1.642976036989e-03
2550.00000  2600.00000  1.579681372945e-03
2600.00000  2650.00000  1.509865440483e-03
2650.00000  2700.00000  1.516003104875e-03
2700.00000  2750.00000  1.444269152292e-03
2750.00000  2800.00000  1.402456313620e-03
2800.00000  2850.00000  1.328037132864e-03
2850.00000  2900.00000  1.318063428227e-03
2900.00000  2950.00000  1.263208052721e-03
2950.00000  3000.00000  1.218326381853e-03
3000.00000  3050.00000  1.191090496113e-03
3050.00000  3100.00000  1.130097456215e-03
3100.00000  3150.00000  1.139687556828e-03
3150.00000  3200.00000  1.038799698381e-03
3200.00000  3250.00000  1.000822899954e-03
3250.00000  3300.00000  9.716689940915e-04
3300.00000  3350.00000  9.068399139488e-04
3350.00000  3400.00000  8.374075855119e-04
3400.00000  3450.00000  8.328043372178e-04
3450.00000  3500.00000  8.078700756244e-04
3500.00000  3550.00000  7.710440892712e-04
3550.00000  3600.00000  7.721949013447e-04
3600.00000  3650.00000  7.599195725603e-04
3650.00000  3700.00000  7.307656666973e-04
3700.00000  3750.00000  6.670873986281e-04
3750.00000  3800.00000  6.724578549713e-04
3800.00000  3850.00000  6.659365865546e-04
3850.00000  3900.00000  6.283433921523e-04
3900.00000  3950.00000  5.834617212843e-04
3950.00000  4000.00000  5.535406073723e-04
4000.00000  4050.00000  5.527733993233e-04
4050.00000  4100.00000  5.255375135828e-04
4100.00000  4150.00000  5.002196479650e-04
4150.00000  4200.00000  4.630100575872e-04
4200.00000  4250.00000  4.407610241655e-04
4250.00000  4300.00000  4.549543730724e-04
4300.00000  4350.00000  4.300201114791e-04
4350.00000  4400.00000  4.296365074546e-04
4400.00000  4450.00000  3.920433130523e-04
4450.00000  4500.00000  3.897416889052e-04
4500.00000  4550.00000  3.809187963414e-04
4550.00000  4600.00000  3.544501186500e-04
4600.00000  4650.00000  3.490796623069e-04
4650.00000  4700.00000  3.356535214489e-04
4700.00000  4750.00000  3.314338771793e-04
4750.00000  4800.00000  2.965259109486e-04
4800.00000  4850.00000  3.041979914388e-04
4850.00000  4900.00000  2.792637298455e-04
4900.00000  4950.00000  2.911554546054e-04
4950.00000  5000.00000  2.873194143603e-04
5000.00000  5050.00000  2.715916493552e-04
5050.00000  5100.00000  2.600835286198e-04
5100.00000  5150.00000  2.447393676393e-04
5150.00000  5200.00000  2.343820589775e-04
5200.00000  5250.00000  2.324640388549e-04
5250.00000  5300.00000  2.301624147078e-04
5300.00000  5350.00000  2.105986094577e-04
5350.00000  5400.00000  2.113658175067e-04
5400.00000  5450.00000  2.067625692125e-04
5450.00000  5500.00000  1.871987639624e-04
5500.00000  5550.00000  1.971724685997e-04
5550.00000  5600.00000  1.887331800604e-04
5600.00000  5650.00000  1.676349587122e-04
5650.00000  5700.00000  1.799102874966e-04
5700.00000  5750.00000  1.668677506632e-04
5750.00000  5800.00000  1.657169385896e-04
5800.00000  5850.00000  1.565104420013e-04
5850.00000  5900.00000  1.611136902955e-04
5900.00000  5950.00000  1.534416098052e-04
5950.00000  6000.00000  1.534416098052e-04
6000.00000  6050.00000  1.338778045550e-04
6050.00000  6100.00000  1.354122206531e-04
6100.00000  6150.00000  1.346450126041e-04
6150.00000  6200.00000  1.269729321138e-04
6200.00000  6250.00000  1.304253683344e-04
6250.00000  6300.00000  1.223696838197e-04
6300.00000  6350.00000  1.254385160158e-04
6350.00000  6400.00000  3.882072728072e-04
6400.00000  6450.00000  1.131631872313e-04
6450.00000  6500.00000  1.024222745450e-04
6500.00000  6550.00000  1.127795832068e-04
6550.00000  6600.00000  1.154648113784e-04
6600.00000  6650.00000  9.206496588313e-05
6650.00000  6700.00000  9.590100612826e-05
6700.00000  6750.00000  1.012714624714e-04
6750.00000  6800.00000  9.244856990764e-05
6800.00000  6850.00000  8.285846929481e-05
6850.00000  6900.00000  9.053054978507e-05
6900.00000  6950.00000  8.055684514773e-05
6950.00000  7000.00000  8.362567734384e-05
7000.00000  7050.00000  7.518638880455e-05
7050.00000  7100.00000  1.135467912559e-04
7100.00000  7150.00000  6.789791233881e-05
7150.00000  7200.00000  7.748801295163e-05
7200.00000  7250.00000  6.828151636332e-05
7250.00000  7300.00000  6.674710026527e-05
7300.00000  7350.00000  6.329466404465e-05
7350.00000  7400.00000  7.173395258394e-05
7400.00000  7450.00000  6.176024794660e-05
7450.00000  7500.00000  7.250116063296e-05
7500.00000  7550.00000  6.329466404465e-05
7550.00000  7600.00000  6.329466404465e-05
7600.00000  7650.00000  5.600618757890e-05
7650.00000  7700.00000  5.715699965244e-05
7700.00000  7750.00000  6.597989221624e-05
7750.00000  7800.00000  6.444547611819e-05
7800.00000  7850.00000  6.060943587306e-05
7850.00000  7900.00000  5.869141575049e-05
7900.00000  7950.00000  5.293735538280e-05
7950.00000  8000.00000  6.406187209367e-05
8000.00000  8050.00000  5.370456343182e-05
8050.00000  8100.00000  4.756689903961e-05
8100.00000  8150.00000  4.910131513767e-05
8150.00000  8200.00000  4.871771111315e-05
8200.00000  8250.00000  4.142923464741e-05
8250.00000  8300.00000  3.874400647582e-05
8300.00000  8350.00000  4.603248294156e-05
8350.00000  8400.00000  4.986852318669e-05
8400.00000  8450.00000  4.411446281900e-05
8450.00000  8500.00000  4.641608696608e-05
8500.00000  8550.00000  3.298994610812e-05
8550.00000  8600.00000  3.989481854935e-05
8600.00000  8650.00000  4.526527489254e-05
8650.00000  8700.00000  4.334725476997e-05
8700.00000  8750.00000  3.567517427971e-05
8750.00000  8800.00000  4.258004672095e-05
8800.00000  8850.00000  4.296365074546e-05
8850.00000  8900.00000  3.414075818166e-05
8900.00000  8950.00000  3.951121452484e-05
8950.00000  9000.00000  4.142923464741e-05
9000.00000  9050.00000  3.529157025520e-05
9050.00000  9100.00000  3.836040245130e-05
9100.00000  9150.00000  2.915390586299e-05
9150.00000  9200.00000  3.222273805909e-05
9200.00000  9250.00000  2.723588574042e-05
9250.00000  9300.00000  3.260634208361e-05
9300.00000  9350.00000  3.375715415715e-05
9350.00000  9400.00000  3.068832196104e-05
9400.00000  9450.00000  3.183913403458e-05
9450.00000  9500.00000  2.570146964237e-05
9500.00000  9550.00000  2.915390586299e-05
9550.00000  9600.00000  2.838669781396e-05
9600.00000  9650.00000  2.685228171591e-05
9650.00000  9700.00000  2.800309378945e-05
9700.00000  9750.00000  2.723588574042e-05
9750.00000  9800.00000  2.493426159335e-05
9800.00000  9850.00000  2.646867769140e-05
9850.00000  9900.00000  2.723588574042e-05
9900.00000  9950.00000  3.222273805909e-05
9950.00000  10000.00000  3.298994610812e-05
