10001.00000  11001.00000  4.234525695056e-05
11001.00000  12001.00000  3.242058735277e-05
12001.00000  13001.00000  2.431991108647e-05
13001.00000  14001.00000  1.913404769303e-05
14001.00000  15001.00000  1.586158906890e-05
15001.00000  16001.00000  1.292889390847e-05
16001.00000  17001.00000  1.035384449931e-05
17001.00000  18001.00000  8.887496919099e-06
18001.00000  19001.00000  7.778795090157e-06
19001.00000  20001.00000  6.777386986597e-06
20001.00000  21001.00000  5.972684046236e-06
21001.00000  22001.00000  4.649394766531e-06
22001.00000  23001.00000  4.023514701806e-06
23001.00000  24001.00000  4.327513590386e-06
24001.00000  25001.00000  3.647986662970e-06
25001.00000  26001.00000  3.147282611190e-06
26001.00000  27001.00000  2.646578559410e-06
27001.00000  28001.00000  2.449873396210e-06
28001.00000  29001.00000  2.646578559410e-06
29001.00000  30001.00000  2.020698494685e-06
30001.00000  31001.00000  1.537876730468e-06
31001.00000  32001.00000  1.752464181231e-06
32001.00000  33001.00000  1.448465292650e-06
33001.00000  34001.00000  1.144466404069e-06
34001.00000  35001.00000  1.341171567269e-06
35001.00000  36001.00000  1.108701828942e-06
36001.00000  37001.00000  1.055054966251e-06
37001.00000  38001.00000  1.072937253815e-06
38001.00000  39001.00000  1.037172678688e-06
39001.00000  40001.00000  7.331737901068e-07
40001.00000  41001.00000  7.868206527975e-07
41001.00000  42001.00000  8.941143781790e-07
42001.00000  43001.00000  8.225852279247e-07
43001.00000  44001.00000  6.258800647253e-07
44001.00000  45001.00000  6.795269274160e-07
45001.00000  46001.00000  7.868206527975e-07
46001.00000  47001.00000  8.225852279247e-07
47001.00000  48001.00000  6.616446398525e-07
48001.00000  49001.00000  5.722332020346e-07
49001.00000  50001.00000  5.007040517802e-07
50001.00000  51001.00000  5.007040517802e-07
51001.00000  52001.00000  4.649394766531e-07
52001.00000  53001.00000  4.112926139623e-07
53001.00000  54001.00000  5.007040517802e-07
54001.00000  55001.00000  3.397634637080e-07
55001.00000  56001.00000  4.291749015259e-07
56001.00000  57001.00000  4.649394766531e-07
57001.00000  58001.00000  2.145874507630e-07
58001.00000  59001.00000  2.324697383265e-07
59001.00000  60001.00000  2.324697383265e-07
60001.00000  61001.00000  2.682343134537e-07
61001.00000  62001.00000  3.397634637080e-07
62001.00000  63001.00000  3.218811761444e-07
63001.00000  64001.00000  2.682343134537e-07
64001.00000  65001.00000  3.218811761444e-07
65001.00000  66001.00000  4.828217642167e-07
66001.00000  67001.00000  3.397634637080e-07
67001.00000  68001.00000  2.145874507630e-07
68001.00000  69001.00000  2.324697383265e-07
69001.00000  70001.00000  2.503520258901e-07
70001.00000  71001.00000  2.503520258901e-07
71001.00000  72001.00000  2.324697383265e-07
72001.00000  73001.00000  1.788228756358e-07
73001.00000  74001.00000  1.788228756358e-07
74001.00000  75001.00000  5.364686269074e-08
75001.00000  76001.00000  2.145874507630e-07
76001.00000  77001.00000  1.609405880722e-07
77001.00000  78001.00000  1.251760129451e-07
78001.00000  79001.00000  8.941143781790e-08
79001.00000  80001.00000  1.609405880722e-07
80001.00000  81001.00000  1.788228756358e-08
81001.00000  82001.00000  1.609405880722e-07
82001.00000  83001.00000  1.251760129451e-07
83001.00000  84001.00000  1.788228756358e-07
84001.00000  85001.00000  1.788228756358e-07
85001.00000  86001.00000  1.251760129451e-07
86001.00000  87001.00000  8.941143781790e-08
87001.00000  88001.00000  1.072937253815e-07
88001.00000  89001.00000  7.152915025432e-08
89001.00000  90001.00000  1.430583005086e-07
90001.00000  91001.00000  1.251760129451e-07
91001.00000  92001.00000  1.072937253815e-07
92001.00000  93001.00000  5.364686269074e-08
93001.00000  94001.00000  1.788228756358e-08
94001.00000  95001.00000  3.576457512716e-08
95001.00000  96001.00000  1.251760129451e-07
96001.00000  97001.00000  1.788228756358e-07
97001.00000  98001.00000  1.788228756358e-08
98001.00000  99001.00000  5.364686269074e-08
99001.00000  100001.00000  3.576457512716e-08
100001.00000  101001.00000  5.364686269074e-08
101001.00000  102001.00000  7.152915025432e-08
102001.00000  103001.00000  7.152915025432e-08
103001.00000  104001.00000  7.152915025432e-08
104001.00000  105001.00000  5.364686269074e-08
105001.00000  106001.00000  5.364686269074e-08
106001.00000  107001.00000  5.364686269074e-08
107001.00000  108001.00000  8.941143781790e-08
108001.00000  109001.00000  7.152915025432e-08
109001.00000  110001.00000  5.364686269074e-08
110001.00000  111001.00000  5.364686269074e-08
111001.00000  112001.00000  1.072937253815e-07
112001.00000  113001.00000  7.152915025432e-08
113001.00000  114001.00000  5.364686269074e-08
114001.00000  115001.00000  7.152915025432e-08
115001.00000  116001.00000  1.251760129451e-07
116001.00000  117001.00000  3.576457512716e-08
117001.00000  118001.00000  3.576457512716e-08
118001.00000  119001.00000  3.576457512716e-08
119001.00000  120001.00000  3.576457512716e-08
120001.00000  121001.00000  3.576457512716e-08
121001.00000  122001.00000  1.788228756358e-08
122001.00000  123001.00000  1.788228756358e-08
123001.00000  124001.00000  3.576457512716e-08
124001.00000  125001.00000  5.364686269074e-08
125001.00000  126001.00000  0.000000000000e+00
126001.00000  127001.00000  3.576457512716e-08
127001.00000  128001.00000  1.788228756358e-08
128001.00000  129001.00000  7.152915025432e-08
129001.00000  130001.00000  3.576457512716e-08
130001.00000  131001.00000  3.576457512716e-08
131001.00000  132001.00000  1.788228756358e-08
132001.00000  133001.00000  5.364686269074e-08
133001.00000  134001.00000  3.576457512716e-08
134001.00000  135001.00000  3.576457512716e-08
135001.00000  136001.00000  1.788228756358e-08
136001.00000  137001.00000  1.788228756358e-08
137001.00000  138001.00000  1.788228756358e-08
138001.00000  139001.00000  0.000000000000e+00
139001.00000  140001.00000  7.152915025432e-08
140001.00000  141001.00000  0.000000000000e+00
141001.00000  142001.00000  3.576457512716e-08
142001.00000  143001.00000  3.576457512716e-08
143001.00000  144001.00000  1.788228756358e-08
144001.00000  145001.00000  8.941143781790e-08
145001.00000  146001.00000  3.576457512716e-08
146001.00000  147001.00000  0.000000000000e+00
147001.00000  148001.00000  1.788228756358e-08
148001.00000  149001.00000  0.000000000000e+00
149001.00000  150001.00000  0.000000000000e+00
150001.00000  151001.00000  3.576457512716e-08
151001.00000  152001.00000  3.576457512716e-08
152001.00000  153001.00000  7.152915025432e-08
153001.00000  154001.00000  3.576457512716e-08
154001.00000  155001.00000  0.000000000000e+00
155001.00000  156001.00000  1.788228756358e-08
156001.00000  157001.00000  1.788228756358e-08
157001.00000  158001.00000  3.576457512716e-08
158001.00000  159001.00000  0.000000000000e+00
159001.00000  160001.00000  1.788228756358e-08
160001.00000  161001.00000  1.788228756358e-08
161001.00000  162001.00000  0.000000000000e+00
162001.00000  163001.00000  0.000000000000e+00
163001.00000  164001.00000  1.788228756358e-08
164001.00000  165001.00000  1.788228756358e-08
165001.00000  166001.00000  0.000000000000e+00
166001.00000  167001.00000  1.788228756358e-08
167001.00000  168001.00000  0.000000000000e+00
168001.00000  169001.00000  3.576457512716e-08
169001.00000  170001.00000  3.576457512716e-08
170001.00000  171001.00000  1.788228756358e-08
171001.00000  172001.00000  1.788228756358e-08
172001.00000  173001.00000  0.000000000000e+00
173001.00000  174001.00000  1.788228756358e-08
174001.00000  175001.00000  1.788228756358e-08
175001.00000  176001.00000  1.788228756358e-08
176001.00000  177001.00000  0.000000000000e+00
177001.00000  178001.00000  1.788228756358e-08
178001.00000  179001.00000  0.000000000000e+00
179001.00000  180001.00000  0.000000000000e+00
180001.00000  181001.00000  1.788228756358e-08
181001.00000  182001.00000  0.000000000000e+00
182001.00000  183001.00000  0.000000000000e+00
183001.00000  184001.00000  3.576457512716e-08
184001.00000  185001.00000  0.000000000000e+00
185001.00000  186001.00000  1.788228756358e-08
186001.00000  187001.00000  1.788228756358e-08
187001.00000  188001.00000  0.000000000000e+00
188001.00000  189001.00000  0.000000000000e+00
189001.00000  190001.00000  1.788228756358e-08
190001.00000  191001.00000  0.000000000000e+00
191001.00000  192001.00000  0.000000000000e+00
192001.00000  193001.00000  0.000000000000e+00
193001.00000  194001.00000  1.788228756358e-08
194001.00000  195001.00000  0.000000000000e+00
195001.00000  196001.00000  0.000000000000e+00
196001.00000  197001.00000  0.000000000000e+00
197001.00000  198001.00000  0.000000000000e+00
198001.00000  199001.00000  0.000000000000e+00
