300.00000  350.00000  0.000000000000e+00
350.00000  400.00000  9.034573238454e-06
400.00000  450.00000  3.011524412818e-06
450.00000  500.00000  4.517286619227e-06
500.00000  550.00000  8.883997017813e-05
550.00000  600.00000  5.270167722431e-06
600.00000  650.00000  3.613829295381e-05
650.00000  700.00000  6.023048825636e-06
700.00000  750.00000  1.882202758011e-05
750.00000  800.00000  1.731626537370e-05
800.00000  850.00000  6.851218039161e-05
850.00000  900.00000  1.129321654807e-05
900.00000  950.00000  1.129321654807e-05
950.00000  1000.00000  9.787454341658e-06
1000.00000  1050.00000  9.787454341658e-06
1050.00000  1100.00000  1.731626537370e-05
1100.00000  1150.00000  1.204609765127e-05
1150.00000  1200.00000  1.882202758011e-05
1200.00000  1250.00000  2.785660081857e-05
1250.00000  1300.00000  8.432268355890e-05
1300.00000  1350.00000  4.743150950188e-05
1350.00000  1400.00000  6.851218039161e-05
1400.00000  1450.00000  1.219667387191e-04
1450.00000  1500.00000  1.980077301428e-04
1500.00000  1550.00000  2.604968617087e-04
1550.00000  1600.00000  3.847222437375e-04
1600.00000  1650.00000  5.051832202502e-04
1650.00000  1700.00000  6.535007975815e-04
1700.00000  1750.00000  1.019401013739e-03
1750.00000  1800.00000  1.010366440500e-03
1800.00000  1850.00000  1.212891457262e-03
1850.00000  1900.00000  1.239995176978e-03
1900.00000  1950.00000  1.467365270146e-03
1950.00000  2000.00000  1.669890286908e-03
2000.00000  2050.00000  1.904789191107e-03
2050.00000  2100.00000  2.153992836268e-03
2100.00000  2150.00000  2.364046664062e-03
2150.00000  2200.00000  2.592922519436e-03
2200.00000  2250.00000  2.809752277159e-03
2250.00000  2300.00000  2.915908512711e-03
2300.00000  2350.00000  3.253199246946e-03
2350.00000  2400.00000  3.333004643886e-03
2400.00000  2450.00000  3.372154461253e-03
2450.00000  2500.00000  3.393235132143e-03
2500.00000  2550.00000  3.336016168299e-03
2550.00000  2600.00000  3.458735788121e-03
2600.00000  2650.00000  3.548328639403e-03
2650.00000  2700.00000  3.596513030008e-03
2700.00000  2750.00000  3.677071308051e-03
2750.00000  2800.00000  3.803555333389e-03
2800.00000  2850.00000  3.864538702749e-03
2850.00000  2900.00000  3.800543808976e-03
2900.00000  2950.00000  3.945096980791e-03
2950.00000  3000.00000  3.904441401218e-03
3000.00000  3050.00000  3.978223749332e-03
3050.00000  3100.00000  3.893148184670e-03
3100.00000  3150.00000  3.957895959546e-03
3150.00000  3200.00000  3.804308214492e-03
3200.00000  3250.00000  3.786239068015e-03
3250.00000  3300.00000  3.841952269652e-03
3300.00000  3350.00000  3.840446507446e-03
3350.00000  3400.00000  3.810331263318e-03
3400.00000  3450.00000  3.708692314385e-03
3450.00000  3500.00000  3.794520760151e-03
3500.00000  3550.00000  3.686858762392e-03
3550.00000  3600.00000  3.686858762392e-03
3600.00000  3650.00000  3.617593700897e-03
3650.00000  3700.00000  3.593501505595e-03
3700.00000  3750.00000  3.627381155239e-03
3750.00000  3800.00000  3.494874081075e-03
3800.00000  3850.00000  3.381189034491e-03
3850.00000  3900.00000  3.318699902925e-03
3900.00000  3950.00000  3.292349064313e-03
3950.00000  4000.00000  3.299124994242e-03
4000.00000  4050.00000  3.232871457160e-03
4050.00000  4100.00000  3.211037905167e-03
4100.00000  4150.00000  3.101117264099e-03
4150.00000  4200.00000  3.090576928654e-03
4200.00000  4250.00000  3.007007126199e-03
4250.00000  4300.00000  3.016794580540e-03
4300.00000  4350.00000  2.906121058369e-03
4350.00000  4400.00000  2.861701073280e-03
4400.00000  4450.00000  2.843631926803e-03
4450.00000  4500.00000  2.759309243244e-03
4500.00000  4550.00000  2.719406544775e-03
4550.00000  4600.00000  2.748016026696e-03
4600.00000  4650.00000  2.574100491856e-03
4650.00000  4700.00000  2.556784226482e-03
4700.00000  4750.00000  2.569583205237e-03
4750.00000  4800.00000  2.492036451607e-03
4800.00000  4850.00000  2.373081237300e-03
4850.00000  4900.00000  2.409219530254e-03
4900.00000  4950.00000  2.342965993172e-03
4950.00000  5000.00000  2.296287364774e-03
5000.00000  5050.00000  2.286499910432e-03
5050.00000  5100.00000  2.317368035663e-03
5100.00000  5150.00000  2.214223324524e-03
5150.00000  5200.00000  2.165286052816e-03
5200.00000  5250.00000  2.105055564560e-03
5250.00000  5300.00000  2.074187439328e-03
5300.00000  5350.00000  1.983841706944e-03
5350.00000  5400.00000  2.009439664453e-03
5400.00000  5450.00000  1.962008154951e-03
5450.00000  5500.00000  2.016215594382e-03
5500.00000  5550.00000  1.903283428901e-03
5550.00000  5600.00000  1.837782772922e-03
5600.00000  5650.00000  1.859616324915e-03
5650.00000  5700.00000  1.773034998047e-03
5700.00000  5750.00000  1.752707208260e-03
5750.00000  5800.00000  1.709792985377e-03
5800.00000  5850.00000  1.696241125520e-03
5850.00000  5900.00000  1.737649586196e-03
5900.00000  5950.00000  1.645798091605e-03
5950.00000  6000.00000  1.602130987619e-03
6000.00000  6050.00000  1.593849295484e-03
6050.00000  6100.00000  1.576533030110e-03
6100.00000  6150.00000  1.486187297726e-03
6150.00000  6200.00000  1.486940178829e-03
6200.00000  6250.00000  1.497480514274e-03
6250.00000  6300.00000  1.502750681996e-03
6300.00000  6350.00000  1.433485620501e-03
6350.00000  6400.00000  1.788845501214e-03
6400.00000  6450.00000  1.405629019683e-03
6450.00000  6500.00000  1.401864614167e-03
6500.00000  6550.00000  1.320553455021e-03
6550.00000  6600.00000  1.281403637654e-03
6600.00000  6650.00000  1.340128363704e-03
6650.00000  6700.00000  1.300225665234e-03
6700.00000  6750.00000  1.286673805376e-03
6750.00000  6800.00000  1.261828728971e-03
6800.00000  6850.00000  1.220420268294e-03
6850.00000  6900.00000  1.220420268294e-03
6900.00000  6950.00000  1.130074535910e-03
6950.00000  7000.00000  1.171482996586e-03
7000.00000  7050.00000  1.112758270536e-03
7050.00000  7100.00000  1.166965709967e-03
7100.00000  7150.00000  1.023918300358e-03
7150.00000  7200.00000  1.063068117725e-03
7200.00000  7250.00000  1.027682705874e-03
7250.00000  7300.00000  9.554061199665e-04
7300.00000  7350.00000  9.531474766569e-04
7350.00000  7400.00000  9.870271263011e-04
7400.00000  7450.00000  9.636878121017e-04
7450.00000  7500.00000  9.659464554113e-04
7500.00000  7550.00000  9.155034214966e-04
7550.00000  7600.00000  9.395956167992e-04
7600.00000  7650.00000  8.981871561229e-04
7650.00000  7700.00000  9.049630860518e-04
7700.00000  7750.00000  9.087274915678e-04
7750.00000  7800.00000  8.748478419236e-04
7800.00000  7850.00000  8.334393812473e-04
7850.00000  7900.00000  8.816237718524e-04
7900.00000  7950.00000  8.183817591833e-04
7950.00000  8000.00000  8.281692135249e-04
8000.00000  8050.00000  7.860078717455e-04
8050.00000  8100.00000  8.093471859448e-04
8100.00000  8150.00000  7.679387252686e-04
8150.00000  8200.00000  7.965482071903e-04
8200.00000  8250.00000  7.400821244500e-04
8250.00000  8300.00000  7.370706000372e-04
8300.00000  8350.00000  7.513753409981e-04
8350.00000  8400.00000  7.551397465141e-04
8400.00000  8450.00000  7.528811032045e-04
8450.00000  8500.00000  7.318004323147e-04
8500.00000  8550.00000  6.964150204641e-04
8550.00000  8600.00000  6.956621393609e-04
8600.00000  8650.00000  6.986736637737e-04
8650.00000  8700.00000  7.092139992186e-04
8700.00000  8750.00000  6.655468952327e-04
8750.00000  8800.00000  6.407018188270e-04
8800.00000  8850.00000  6.745814684712e-04
8850.00000  8900.00000  6.572652030975e-04
8900.00000  8950.00000  5.992933581508e-04
8950.00000  9000.00000  6.504892731687e-04
9000.00000  9050.00000  6.361845322078e-04
9050.00000  9100.00000  5.872472604995e-04
9100.00000  9150.00000  6.038106447700e-04
9150.00000  9200.00000  5.752011628482e-04
9200.00000  9250.00000  6.279028400725e-04
9250.00000  9300.00000  5.752011628482e-04
9300.00000  9350.00000  5.782126872610e-04
9350.00000  9400.00000  5.646608274033e-04
9400.00000  9450.00000  5.887530227059e-04
9450.00000  9500.00000  5.330398210688e-04
9500.00000  9550.00000  5.398157509976e-04
9550.00000  9600.00000  5.819770927771e-04
9600.00000  9650.00000  5.608964218873e-04
9650.00000  9700.00000  5.405686321008e-04
9700.00000  9750.00000  5.571320163713e-04
9750.00000  9800.00000  4.946428848053e-04
9800.00000  9850.00000  5.277696533463e-04
9850.00000  9900.00000  5.104533879726e-04
9900.00000  9950.00000  5.059361013534e-04
9950.00000  10000.00000  4.795852627412e-04
