300.00000  350.00000  5.903014362995e-05
350.00000  400.00000  5.555778223995e-05
400.00000  450.00000  5.440032844328e-05
450.00000  500.00000  5.285705671440e-05
500.00000  550.00000  6.886850090160e-05
550.00000  600.00000  3.491652286608e-05
600.00000  650.00000  8.121467473270e-05
650.00000  700.00000  1.105368375816e-04
700.00000  750.00000  1.535555370243e-04
750.00000  800.00000  2.125856806542e-04
800.00000  850.00000  3.123196161336e-04
850.00000  900.00000  3.007450781669e-04
900.00000  950.00000  3.283310603208e-04
950.00000  1000.00000  3.748221211535e-04
1000.00000  1050.00000  4.172620936979e-04
1050.00000  1100.00000  4.375175351396e-04
1100.00000  1150.00000  4.759064193957e-04
1150.00000  1200.00000  4.631744276323e-04
1200.00000  1250.00000  4.678042428190e-04
1250.00000  1300.00000  4.745560566329e-04
1300.00000  1350.00000  4.230493626813e-04
1350.00000  1400.00000  4.261359061390e-04
1400.00000  1450.00000  4.031797391718e-04
1450.00000  1500.00000  4.062662826296e-04
1500.00000  1550.00000  3.929555639680e-04
1550.00000  1600.00000  3.701923059669e-04
1600.00000  1650.00000  3.593894038647e-04
1650.00000  1700.00000  3.497439555591e-04
1700.00000  1750.00000  3.563028604069e-04
1750.00000  1800.00000  3.206147016764e-04
1800.00000  1850.00000  2.758598215386e-04
1850.00000  1900.00000  2.878201774375e-04
1900.00000  1950.00000  2.743165498097e-04
1950.00000  2000.00000  2.610058311481e-04
2000.00000  2050.00000  2.498171111137e-04
2050.00000  2100.00000  2.496242021475e-04
2100.00000  2150.00000  2.436440241981e-04
2150.00000  2200.00000  2.586909235548e-04
2200.00000  2250.00000  2.424865704014e-04
2250.00000  2300.00000  2.421007524692e-04
2300.00000  2350.00000  2.856981788103e-04
2350.00000  2400.00000  2.457660228253e-04
2400.00000  2450.00000  2.343843938248e-04
2450.00000  2500.00000  2.210736751631e-04
2500.00000  2550.00000  2.166367689426e-04
2550.00000  2600.00000  2.197233124004e-04
2600.00000  2650.00000  2.098849551287e-04
2650.00000  2700.00000  2.197233124004e-04
2700.00000  2750.00000  2.255105813837e-04
2750.00000  2800.00000  2.156722241120e-04
2800.00000  2850.00000  2.152864061798e-04
2850.00000  2900.00000  2.274396710448e-04
2900.00000  2950.00000  2.280183979431e-04
2950.00000  3000.00000  2.359276655537e-04
3000.00000  3050.00000  2.154793151459e-04
3050.00000  3100.00000  2.235814917226e-04
3100.00000  3150.00000  2.253176724176e-04
3150.00000  3200.00000  2.282113069092e-04
3200.00000  3250.00000  2.297545786381e-04
3250.00000  3300.00000  2.272467620787e-04
3300.00000  3350.00000  2.328411220959e-04
3350.00000  3400.00000  2.127785896204e-04
3400.00000  3450.00000  2.322623951976e-04
3450.00000  3500.00000  2.222311289598e-04
3500.00000  3550.00000  2.203020392987e-04
3550.00000  3600.00000  2.102707730609e-04
3600.00000  3650.00000  2.179871317054e-04
3650.00000  3700.00000  2.430652972998e-04
3700.00000  3750.00000  2.189516765359e-04
3750.00000  3800.00000  2.114282268576e-04
3800.00000  3850.00000  2.127785896204e-04
3850.00000  3900.00000  2.135502254848e-04
3900.00000  3950.00000  2.181800406715e-04
3950.00000  4000.00000  2.133573165187e-04
4000.00000  4050.00000  2.027473233826e-04
4050.00000  4100.00000  1.979245992298e-04
4100.00000  4150.00000  2.035189592470e-04
4150.00000  4200.00000  2.029402323487e-04
4200.00000  4250.00000  2.040976861454e-04
4250.00000  4300.00000  2.023615054504e-04
4300.00000  4350.00000  1.909798764498e-04
4350.00000  4400.00000  1.986962350943e-04
4400.00000  4450.00000  2.015898695859e-04
4450.00000  4500.00000  1.954167826704e-04
4500.00000  4550.00000  2.029402323487e-04
4550.00000  4600.00000  1.963813275009e-04
4600.00000  4650.00000  1.998536888909e-04
4650.00000  4700.00000  2.013969606198e-04
4700.00000  4750.00000  1.788266115848e-04
4750.00000  4800.00000  1.875075150598e-04
4800.00000  4850.00000  1.973458723315e-04
4850.00000  4900.00000  1.900153316193e-04
4900.00000  4950.00000  1.898224226532e-04
4950.00000  5000.00000  1.917515123143e-04
5000.00000  5050.00000  1.931018750770e-04
5050.00000  5100.00000  2.019756875181e-04
5100.00000  5150.00000  1.821060640087e-04
5150.00000  5200.00000  1.853855164326e-04
5200.00000  5250.00000  2.025544144165e-04
5250.00000  5300.00000  1.952238737043e-04
5300.00000  5350.00000  1.776691577882e-04
5350.00000  5400.00000  1.894366047209e-04
5400.00000  5450.00000  2.056409578743e-04
5450.00000  5500.00000  1.803698833137e-04
5500.00000  5550.00000  1.855784253987e-04
5550.00000  5600.00000  1.784407936526e-04
5600.00000  5650.00000  1.788266115848e-04
5650.00000  5700.00000  1.894366047209e-04
5700.00000  5750.00000  1.741967963982e-04
5750.00000  5800.00000  1.722677067371e-04
5800.00000  5850.00000  1.834564267715e-04
5850.00000  5900.00000  1.921373302465e-04
5900.00000  5950.00000  1.689882543132e-04
5950.00000  6000.00000  1.686024363810e-04
6000.00000  6050.00000  1.743897053643e-04
6050.00000  6100.00000  1.801769743476e-04
6100.00000  6150.00000  1.838422447037e-04
6150.00000  6200.00000  1.799840653815e-04
6200.00000  6250.00000  2.191445855020e-04
6250.00000  6300.00000  2.810683636236e-04
6300.00000  6350.00000  2.671789180636e-04
6350.00000  6400.00000  1.850189893970e-03
6400.00000  6450.00000  1.697598901776e-04
6450.00000  6500.00000  1.672520736182e-04
6500.00000  6550.00000  1.711102529404e-04
6550.00000  6600.00000  1.628151673976e-04
6600.00000  6650.00000  1.608860777365e-04
6650.00000  6700.00000  1.593428060076e-04
6700.00000  6750.00000  1.593428060076e-04
6750.00000  6800.00000  1.599215329060e-04
6800.00000  6850.00000  1.655158929232e-04
6850.00000  6900.00000  1.655158929232e-04
6900.00000  6950.00000  1.741967963982e-04
6950.00000  7000.00000  1.682166184487e-04
7000.00000  7050.00000  1.462249963121e-04
7050.00000  7100.00000  3.464645031352e-04
7100.00000  7150.00000  1.006984803099e-04
7150.00000  7200.00000  1.055212044627e-04
7200.00000  7250.00000  9.857648168269e-05
7250.00000  7300.00000  9.761193685213e-05
7300.00000  7350.00000  1.055212044627e-04
7350.00000  7400.00000  1.032062968693e-04
7400.00000  7450.00000  1.010842982421e-04
7450.00000  7500.00000  1.724606157032e-04
7500.00000  7550.00000  9.105303200436e-05
7550.00000  7600.00000  9.876939064880e-05
7600.00000  7650.00000  9.703320995380e-05
7650.00000  7700.00000  1.057141134288e-04
7700.00000  7750.00000  9.934811754713e-05
7750.00000  7800.00000  1.008913892760e-04
7800.00000  7850.00000  9.548993822491e-05
7850.00000  7900.00000  9.799775478435e-05
7900.00000  7950.00000  1.020488430727e-04
7950.00000  8000.00000  1.026275699710e-04
8000.00000  8050.00000  9.722611891991e-05
8050.00000  8100.00000  9.876939064880e-05
8100.00000  8150.00000  9.317503063158e-05
8150.00000  8200.00000  9.028139613992e-05
8200.00000  8250.00000  1.003126623777e-04
8250.00000  8300.00000  1.003126623777e-04
8300.00000  8350.00000  9.587575615713e-05
8350.00000  8400.00000  9.182466786880e-05
8400.00000  8450.00000  9.587575615713e-05
8450.00000  8500.00000  9.086012303825e-05
8500.00000  8550.00000  9.761193685213e-05
8550.00000  8600.00000  9.163175890269e-05
8600.00000  8650.00000  9.876939064880e-05
8650.00000  8700.00000  8.352958232603e-05
8700.00000  8750.00000  8.526576302103e-05
8750.00000  8800.00000  8.815939751270e-05
8800.00000  8850.00000  9.413957546213e-05
8850.00000  8900.00000  9.471830236047e-05
8900.00000  8950.00000  9.278921269936e-05
8950.00000  9000.00000  9.433248442825e-05
9000.00000  9050.00000  9.201757683491e-05
9050.00000  9100.00000  8.507285405492e-05
9100.00000  9150.00000  8.854521544492e-05
9150.00000  9200.00000  8.487994508881e-05
9200.00000  9250.00000  9.105303200436e-05
9250.00000  9300.00000  9.336793959769e-05
9300.00000  9350.00000  8.217921956326e-05
9350.00000  9400.00000  8.835230647881e-05
9400.00000  9450.00000  8.815939751270e-05
9450.00000  9500.00000  8.931685130936e-05
9500.00000  9550.00000  8.893103337714e-05
9550.00000  9600.00000  8.372249129214e-05
9600.00000  9650.00000  8.565158095325e-05
9650.00000  9700.00000  8.738776164825e-05
9700.00000  9750.00000  8.507285405492e-05
9750.00000  9800.00000  8.623030785159e-05
9800.00000  9850.00000  8.661612578381e-05
9850.00000  9900.00000  8.430121819048e-05
9900.00000  9950.00000  8.526576302103e-05
9950.00000  10000.00000  7.870685817326e-05
