10001.00000  11001.00000  9.285835133859e-04
11001.00000  12001.00000  7.879054587520e-04
12001.00000  13001.00000  6.739945592859e-04
13001.00000  14001.00000  5.797276215209e-04
14001.00000  15001.00000  5.055260174650e-04
15001.00000  16001.00000  4.397418209000e-04
16001.00000  17001.00000  3.868496012430e-04
17001.00000  18001.00000  3.469496851626e-04
18001.00000  19001.00000  3.102401571420e-04
19001.00000  20001.00000  2.789181712222e-04
20001.00000  21001.00000  2.493820000025e-04
21001.00000  22001.00000  2.262868009034e-04
22001.00000  23001.00000  2.052482985095e-04
23001.00000  24001.00000  1.865072768253e-04
24001.00000  25001.00000  1.714984072110e-04
25001.00000  26001.00000  1.579242089568e-04
26001.00000  27001.00000  1.420525299930e-04
27001.00000  28001.00000  1.327221498183e-04
28001.00000  29001.00000  1.206929822597e-04
29001.00000  30001.00000  1.106101520710e-04
30001.00000  31001.00000  1.046106172920e-04
31001.00000  32001.00000  9.713628048536e-05
32001.00000  33001.00000  8.863861165959e-05
33001.00000  34001.00000  8.316077555702e-05
34001.00000  35001.00000  7.624826809427e-05
35001.00000  36001.00000  7.148275133838e-05
36001.00000  37001.00000  6.574406589760e-05
37001.00000  38001.00000  6.107887581025e-05
38001.00000  39001.00000  5.715610307014e-05
39001.00000  40001.00000  5.445731568627e-05
40001.00000  41001.00000  5.128699296025e-05
41001.00000  42001.00000  4.721373021732e-05
42001.00000  43001.00000  4.484602083965e-05
43001.00000  44001.00000  4.315050014124e-05
44001.00000  45001.00000  3.971932807700e-05
45001.00000  46001.00000  3.767266403868e-05
46001.00000  47001.00000  3.496384398796e-05
47001.00000  48001.00000  3.311783328673e-05
48001.00000  49001.00000  3.100094058043e-05
49001.00000  50001.00000  3.008796789667e-05
50001.00000  51001.00000  2.849277386681e-05
51001.00000  52001.00000  2.663673049872e-05
52001.00000  53001.00000  2.576388848238e-05
53001.00000  54001.00000  2.234274908499e-05
54001.00000  55001.00000  2.202170374565e-05
55001.00000  56001.00000  2.117895972987e-05
56001.00000  57001.00000  2.006533370902e-05
57001.00000  58001.00000  1.916239369211e-05
58001.00000  59001.00000  1.787821233473e-05
59001.00000  60001.00000  1.709566432008e-05
60001.00000  61001.00000  1.604223430036e-05
61001.00000  62001.00000  1.542020895538e-05
62001.00000  63001.00000  1.461759560702e-05
63001.00000  64001.00000  1.389524359349e-05
64001.00000  65001.00000  1.282174824006e-05
65001.00000  66001.00000  1.300233624344e-05
66001.00000  67001.00000  1.212949422710e-05
67001.00000  68001.00000  1.118642354278e-05
68001.00000  69001.00000  1.083528020287e-05
69001.00000  70001.00000  9.541066178638e-06
70001.00000  71001.00000  1.009286285564e-05
71001.00000  72001.00000  9.019367502204e-06
72001.00000  73001.00000  9.089596170185e-06
73001.00000  74001.00000  8.256884821261e-06
74001.00000  75001.00000  7.755251478535e-06
75001.00000  76001.00000  8.066264151025e-06
76001.00000  77001.00000  6.962670797029e-06
77001.00000  78001.00000  7.022866798156e-06
78001.00000  79001.00000  6.731919459375e-06
79001.00000  80001.00000  6.109894114396e-06
80001.00000  81001.00000  5.899208110451e-06
81001.00000  82001.00000  5.758750774488e-06
82001.00000  83001.00000  5.417640101435e-06
83001.00000  84001.00000  5.257117431763e-06
84001.00000  85001.00000  5.277182765472e-06
85001.00000  86001.00000  4.885908758146e-06
86001.00000  87001.00000  5.036398760963e-06
87001.00000  88001.00000  4.534765418238e-06
88001.00000  89001.00000  4.003034074949e-06
89001.00000  90001.00000  3.982968741240e-06
90001.00000  91001.00000  3.962903407531e-06
91001.00000  92001.00000  3.712086736168e-06
92001.00000  93001.00000  3.511433399078e-06
93001.00000  94001.00000  3.441204731097e-06
94001.00000  95001.00000  3.340878062551e-06
95001.00000  96001.00000  3.110126724898e-06
96001.00000  97001.00000  3.280682061424e-06
97001.00000  98001.00000  3.019832723207e-06
98001.00000  99001.00000  2.618526049027e-06
99001.00000  100001.00000  2.518199380482e-06
100001.00000  101001.00000  2.558330047900e-06
101001.00000  102001.00000  2.608493382172e-06
102001.00000  103001.00000  2.307513376537e-06
103001.00000  104001.00000  2.217219374846e-06
104001.00000  105001.00000  2.126925373156e-06
105001.00000  106001.00000  1.896174035502e-06
106001.00000  107001.00000  2.207186707992e-06
107001.00000  108001.00000  1.986468037193e-06
108001.00000  109001.00000  2.267382709119e-06
109001.00000  110001.00000  1.715586032121e-06
110001.00000  111001.00000  1.835978034375e-06
111001.00000  112001.00000  1.745684032685e-06
112001.00000  113001.00000  1.424638693340e-06
113001.00000  114001.00000  1.464769360758e-06
114001.00000  115001.00000  1.304246691086e-06
115001.00000  116001.00000  1.394540692777e-06
116001.00000  117001.00000  1.284181357377e-06
117001.00000  118001.00000  1.384508025922e-06
118001.00000  119001.00000  1.274148690523e-06
119001.00000  120001.00000  1.033364686014e-06
120001.00000  121001.00000  1.244050689959e-06
121001.00000  122001.00000  1.033364686014e-06
122001.00000  123001.00000  1.073495353432e-06
123001.00000  124001.00000  9.832013517419e-07
124001.00000  125001.00000  1.043397352869e-06
125001.00000  126001.00000  9.832013517419e-07
126001.00000  127001.00000  8.929073500513e-07
127001.00000  128001.00000  9.832013517419e-07
128001.00000  129001.00000  8.427440157788e-07
129001.00000  130001.00000  9.330380174693e-07
130001.00000  131001.00000  7.624826809427e-07
131001.00000  132001.00000  5.618293438525e-07
132001.00000  133001.00000  8.929073500513e-07
133001.00000  134001.00000  7.223520135246e-07
134001.00000  135001.00000  6.521233455431e-07
135001.00000  136001.00000  6.822213461066e-07
136001.00000  137001.00000  5.216986764345e-07
137001.00000  138001.00000  5.718620107070e-07
138001.00000  139001.00000  5.417640101435e-07
139001.00000  140001.00000  5.116660095800e-07
140001.00000  141001.00000  6.822213461066e-07
141001.00000  142001.00000  4.314046747439e-07
142001.00000  143001.00000  4.615026753074e-07
143001.00000  144001.00000  4.715353421619e-07
144001.00000  145001.00000  4.815680090164e-07
145001.00000  146001.00000  4.414373415984e-07
146001.00000  147001.00000  4.414373415984e-07
147001.00000  148001.00000  4.715353421619e-07
148001.00000  149001.00000  4.815680090164e-07
149001.00000  150001.00000  3.712086736168e-07
150001.00000  151001.00000  3.310780061988e-07
151001.00000  152001.00000  3.611760067623e-07
152001.00000  153001.00000  4.013066741804e-07
153001.00000  154001.00000  3.511433399078e-07
154001.00000  155001.00000  3.210453393443e-07
155001.00000  156001.00000  3.611760067623e-07
156001.00000  157001.00000  2.809146719263e-07
157001.00000  158001.00000  2.006533370902e-07
158001.00000  159001.00000  2.207186707992e-07
159001.00000  160001.00000  2.407840045082e-07
160001.00000  161001.00000  2.307513376537e-07
161001.00000  162001.00000  3.210453393443e-07
162001.00000  163001.00000  1.906206702357e-07
163001.00000  164001.00000  2.608493382172e-07
164001.00000  165001.00000  2.407840045082e-07
165001.00000  166001.00000  2.508166713627e-07
166001.00000  167001.00000  1.906206702357e-07
167001.00000  168001.00000  2.708820050717e-07
168001.00000  169001.00000  1.304246691086e-07
169001.00000  170001.00000  1.103593353996e-07
170001.00000  171001.00000  2.508166713627e-07
171001.00000  172001.00000  2.006533370902e-07
172001.00000  173001.00000  2.608493382172e-07
173001.00000  174001.00000  2.307513376537e-07
174001.00000  175001.00000  1.203920022541e-07
175001.00000  176001.00000  1.504900028176e-07
176001.00000  177001.00000  1.304246691086e-07
177001.00000  178001.00000  2.006533370902e-07
178001.00000  179001.00000  1.103593353996e-07
179001.00000  180001.00000  1.504900028176e-07
180001.00000  181001.00000  1.906206702357e-07
181001.00000  182001.00000  7.022866798156e-08
182001.00000  183001.00000  1.805880033812e-07
183001.00000  184001.00000  1.906206702357e-07
184001.00000  185001.00000  8.026133483607e-08
185001.00000  186001.00000  1.705553365267e-07
186001.00000  187001.00000  1.304246691086e-07
187001.00000  188001.00000  8.026133483607e-08
188001.00000  189001.00000  1.103593353996e-07
189001.00000  190001.00000  1.304246691086e-07
190001.00000  191001.00000  8.026133483607e-08
191001.00000  192001.00000  1.203920022541e-07
192001.00000  193001.00000  4.013066741804e-08
193001.00000  194001.00000  9.029400169058e-08
194001.00000  195001.00000  9.029400169058e-08
195001.00000  196001.00000  8.026133483607e-08
196001.00000  197001.00000  1.003266685451e-07
197001.00000  198001.00000  6.019600112705e-08
198001.00000  199001.00000  1.103593353996e-07
