300.00000  350.00000  2.469370911125e-05
350.00000  400.00000  4.859084696085e-05
400.00000  450.00000  3.345599298944e-05
450.00000  500.00000  5.098056074581e-05
500.00000  550.00000  2.875622254568e-04
550.00000  600.00000  2.867656541952e-05
600.00000  650.00000  9.001255256683e-05
650.00000  700.00000  3.743884929771e-05
700.00000  750.00000  4.859084696085e-05
750.00000  800.00000  3.026970794283e-05
800.00000  850.00000  1.162994042014e-04
850.00000  900.00000  3.664227803605e-05
900.00000  950.00000  2.230399532629e-05
950.00000  1000.00000  3.664227803605e-05
1000.00000  1050.00000  3.026970794283e-05
1050.00000  1100.00000  3.504913551275e-05
1100.00000  1150.00000  2.787999415787e-05
1150.00000  1200.00000  2.628685163456e-05
1200.00000  1250.00000  2.708342289621e-05
1250.00000  1300.00000  7.248798481045e-05
1300.00000  1350.00000  3.265942172779e-05
1350.00000  1400.00000  2.708342289621e-05
1400.00000  1450.00000  3.743884929771e-05
1450.00000  1500.00000  3.982856308267e-05
1500.00000  1550.00000  2.947313668117e-05
1550.00000  1600.00000  2.947313668117e-05
1600.00000  1650.00000  3.504913551275e-05
1650.00000  1700.00000  3.026970794283e-05
1700.00000  1750.00000  8.363998247360e-05
1750.00000  1800.00000  3.425256425109e-05
1800.00000  1850.00000  3.186285046613e-05
1850.00000  1900.00000  3.345599298944e-05
1900.00000  1950.00000  3.584570677440e-05
1950.00000  2000.00000  2.787999415787e-05
2000.00000  2050.00000  3.504913551275e-05
2050.00000  2100.00000  3.425256425109e-05
2100.00000  2150.00000  3.345599298944e-05
2150.00000  2200.00000  4.620113317589e-05
2200.00000  2250.00000  3.425256425109e-05
2250.00000  2300.00000  4.460799065259e-05
2300.00000  2350.00000  7.009827102549e-05
2350.00000  2400.00000  3.106627920448e-05
2400.00000  2450.00000  3.743884929771e-05
2450.00000  2500.00000  3.664227803605e-05
2500.00000  2550.00000  3.186285046613e-05
2550.00000  2600.00000  3.106627920448e-05
2600.00000  2650.00000  2.787999415787e-05
2650.00000  2700.00000  1.991428154133e-05
2700.00000  2750.00000  3.186285046613e-05
2750.00000  2800.00000  2.947313668117e-05
2800.00000  2850.00000  3.345599298944e-05
2850.00000  2900.00000  3.743884929771e-05
2900.00000  2950.00000  2.947313668117e-05
2950.00000  3000.00000  4.540456191424e-05
3000.00000  3050.00000  2.230399532629e-05
3050.00000  3100.00000  2.549028037291e-05
3100.00000  3150.00000  3.504913551275e-05
3150.00000  3200.00000  3.664227803605e-05
3200.00000  3250.00000  2.628685163456e-05
3250.00000  3300.00000  2.389713784960e-05
3300.00000  3350.00000  3.106627920448e-05
3350.00000  3400.00000  3.584570677440e-05
3400.00000  3450.00000  2.787999415787e-05
3450.00000  3500.00000  2.947313668117e-05
3500.00000  3550.00000  2.150742406464e-05
3550.00000  3600.00000  2.389713784960e-05
3600.00000  3650.00000  2.230399532629e-05
3650.00000  3700.00000  4.301484812928e-05
3700.00000  3750.00000  2.549028037291e-05
3750.00000  3800.00000  2.708342289621e-05
3800.00000  3850.00000  2.867656541952e-05
3850.00000  3900.00000  2.628685163456e-05
3900.00000  3950.00000  2.549028037291e-05
3950.00000  4000.00000  2.469370911125e-05
4000.00000  4050.00000  3.106627920448e-05
4050.00000  4100.00000  2.230399532629e-05
4100.00000  4150.00000  2.549028037291e-05
4150.00000  4200.00000  1.593142523307e-05
4200.00000  4250.00000  2.947313668117e-05
4250.00000  4300.00000  3.026970794283e-05
4300.00000  4350.00000  1.752456775637e-05
4350.00000  4400.00000  2.947313668117e-05
4400.00000  4450.00000  2.549028037291e-05
4450.00000  4500.00000  2.549028037291e-05
4500.00000  4550.00000  2.549028037291e-05
4550.00000  4600.00000  1.991428154133e-05
4600.00000  4650.00000  2.628685163456e-05
4650.00000  4700.00000  2.230399532629e-05
4700.00000  4750.00000  2.469370911125e-05
4750.00000  4800.00000  2.150742406464e-05
4800.00000  4850.00000  1.832113901803e-05
4850.00000  4900.00000  2.230399532629e-05
4900.00000  4950.00000  2.787999415787e-05
4950.00000  5000.00000  1.752456775637e-05
5000.00000  5050.00000  2.230399532629e-05
5050.00000  5100.00000  1.752456775637e-05
5100.00000  5150.00000  1.433828270976e-05
5150.00000  5200.00000  2.389713784960e-05
5200.00000  5250.00000  2.549028037291e-05
5250.00000  5300.00000  2.469370911125e-05
5300.00000  5350.00000  2.628685163456e-05
5350.00000  5400.00000  2.389713784960e-05
5400.00000  5450.00000  2.230399532629e-05
5450.00000  5500.00000  1.832113901803e-05
5500.00000  5550.00000  1.832113901803e-05
5550.00000  5600.00000  2.389713784960e-05
5600.00000  5650.00000  2.389713784960e-05
5650.00000  5700.00000  1.672799649472e-05
5700.00000  5750.00000  1.433828270976e-05
5750.00000  5800.00000  2.150742406464e-05
5800.00000  5850.00000  2.549028037291e-05
5850.00000  5900.00000  1.991428154133e-05
5900.00000  5950.00000  1.752456775637e-05
5950.00000  6000.00000  2.310056658795e-05
6000.00000  6050.00000  1.513485397141e-05
6050.00000  6100.00000  2.310056658795e-05
6100.00000  6150.00000  1.911771027968e-05
6150.00000  6200.00000  2.549028037291e-05
6200.00000  6250.00000  3.504913551275e-05
6250.00000  6300.00000  3.584570677440e-05
6300.00000  6350.00000  3.265942172779e-05
6350.00000  6400.00000  2.668513726539e-04
6400.00000  6450.00000  2.708342289621e-05
6450.00000  6500.00000  2.310056658795e-05
6500.00000  6550.00000  2.469370911125e-05
6550.00000  6600.00000  2.549028037291e-05
6600.00000  6650.00000  2.708342289621e-05
6650.00000  6700.00000  1.672799649472e-05
6700.00000  6750.00000  1.752456775637e-05
6750.00000  6800.00000  2.310056658795e-05
6800.00000  6850.00000  1.911771027968e-05
6850.00000  6900.00000  2.549028037291e-05
6900.00000  6950.00000  1.513485397141e-05
6950.00000  7000.00000  2.230399532629e-05
7000.00000  7050.00000  1.991428154133e-05
7050.00000  7100.00000  3.584570677440e-05
7100.00000  7150.00000  9.558855139840e-06
7150.00000  7200.00000  1.035542640149e-05
7200.00000  7250.00000  1.513485397141e-05
7250.00000  7300.00000  1.115199766315e-05
7300.00000  7350.00000  4.779427569920e-06
7350.00000  7400.00000  6.372570093227e-06
7400.00000  7450.00000  1.513485397141e-05
7450.00000  7500.00000  2.230399532629e-05
7500.00000  7550.00000  1.115199766315e-05
7550.00000  7600.00000  1.115199766315e-05
7600.00000  7650.00000  8.762283878187e-06
7650.00000  7700.00000  1.194856892480e-05
7700.00000  7750.00000  4.779427569920e-06
7750.00000  7800.00000  2.389713784960e-06
7800.00000  7850.00000  5.575998831573e-06
7850.00000  7900.00000  1.035542640149e-05
7900.00000  7950.00000  7.965712616533e-06
7950.00000  8000.00000  1.115199766315e-05
8000.00000  8050.00000  6.372570093227e-06
8050.00000  8100.00000  1.194856892480e-05
8100.00000  8150.00000  1.115199766315e-05
8150.00000  8200.00000  1.035542640149e-05
8200.00000  8250.00000  1.194856892480e-05
8250.00000  8300.00000  1.035542640149e-05
8300.00000  8350.00000  1.115199766315e-05
8350.00000  8400.00000  8.762283878187e-06
8400.00000  8450.00000  9.558855139840e-06
8450.00000  8500.00000  7.169141354880e-06
8500.00000  8550.00000  1.752456775637e-05
8550.00000  8600.00000  1.035542640149e-05
8600.00000  8650.00000  5.575998831573e-06
8650.00000  8700.00000  9.558855139840e-06
8700.00000  8750.00000  1.354171144811e-05
8750.00000  8800.00000  7.169141354880e-06
8800.00000  8850.00000  8.762283878187e-06
8850.00000  8900.00000  7.169141354880e-06
8900.00000  8950.00000  1.115199766315e-05
8950.00000  9000.00000  7.965712616533e-06
9000.00000  9050.00000  1.035542640149e-05
9050.00000  9100.00000  8.762283878187e-06
9100.00000  9150.00000  1.115199766315e-05
9150.00000  9200.00000  9.558855139840e-06
9200.00000  9250.00000  1.433828270976e-05
9250.00000  9300.00000  8.762283878187e-06
9300.00000  9350.00000  1.115199766315e-05
9350.00000  9400.00000  1.274514018645e-05
9400.00000  9450.00000  7.965712616533e-06
9450.00000  9500.00000  8.762283878187e-06
9500.00000  9550.00000  7.169141354880e-06
9550.00000  9600.00000  7.965712616533e-06
9600.00000  9650.00000  1.274514018645e-05
9650.00000  9700.00000  6.372570093227e-06
9700.00000  9750.00000  8.762283878187e-06
9750.00000  9800.00000  1.035542640149e-05
9800.00000  9850.00000  1.115199766315e-05
9850.00000  9900.00000  8.762283878187e-06
9900.00000  9950.00000  1.274514018645e-05
9950.00000  10000.00000  1.354171144811e-05
