10001.00000  11001.00000  6.342250086038e-04
11001.00000  12001.00000  5.520745654634e-04
12001.00000  13001.00000  4.923516379838e-04
13001.00000  14001.00000  4.392506278437e-04
14001.00000  15001.00000  3.982624095670e-04
15001.00000  16001.00000  3.614600164114e-04
16001.00000  17001.00000  3.338896394008e-04
17001.00000  18001.00000  3.055265657159e-04
18001.00000  19001.00000  2.822580182178e-04
19001.00000  20001.00000  2.626339420145e-04
20001.00000  21001.00000  2.449432723338e-04
21001.00000  22001.00000  2.293406816973e-04
22001.00000  23001.00000  2.136897558978e-04
23001.00000  24001.00000  1.974781422068e-04
24001.00000  25001.00000  1.852010107890e-04
25001.00000  26001.00000  1.710484750444e-04
26001.00000  27001.00000  1.604437402685e-04
27001.00000  28001.00000  1.525071064937e-04
28001.00000  29001.00000  1.409936706523e-04
29001.00000  30001.00000  1.330280357797e-04
30001.00000  31001.00000  1.251687382658e-04
31001.00000  32001.00000  1.164877429798e-04
32001.00000  33001.00000  1.110452036190e-04
33001.00000  34001.00000  1.049549730732e-04
34001.00000  35001.00000  1.001214567670e-04
35001.00000  36001.00000  9.399255809068e-05
36001.00000  37001.00000  9.010641098048e-05
37001.00000  38001.00000  8.507955402201e-05
38001.00000  39001.00000  8.038137617237e-05
39001.00000  40001.00000  7.758760374738e-05
40001.00000  41001.00000  7.278308853900e-05
41001.00000  42001.00000  7.082068091868e-05
42001.00000  43001.00000  6.684753051497e-05
43001.00000  44001.00000  6.387975150295e-05
44001.00000  45001.00000  6.010960878410e-05
45001.00000  46001.00000  5.829220665296e-05
46001.00000  47001.00000  5.400971120566e-05
47001.00000  48001.00000  5.277233103127e-05
48001.00000  49001.00000  5.068425198698e-05
49001.00000  50001.00000  4.796781582289e-05
50001.00000  51001.00000  4.680777190940e-05
51001.00000  52001.00000  4.562839393068e-05
52001.00000  53001.00000  4.208059296192e-05
53001.00000  54001.00000  4.152957210301e-05
54001.00000  55001.00000  3.872613264540e-05
55001.00000  56001.00000  3.754675466669e-05
56001.00000  57001.00000  3.600002944870e-05
57001.00000  58001.00000  3.432763280675e-05
58001.00000  59001.00000  3.346726690424e-05
59001.00000  60001.00000  3.183353839274e-05
60001.00000  61001.00000  3.088616919672e-05
61001.00000  62001.00000  2.984212967458e-05
62001.00000  63001.00000  3.023847801169e-05
63001.00000  64001.00000  2.843074291316e-05
64001.00000  65001.00000  2.650700342329e-05
65001.00000  66001.00000  2.595598256438e-05
66001.00000  67001.00000  2.516328589016e-05
67001.00000  68001.00000  2.460259799864e-05
68001.00000  69001.00000  2.303653871543e-05
69001.00000  70001.00000  2.296886948714e-05
70001.00000  71001.00000  2.262085631309e-05
71001.00000  72001.00000  2.085178934502e-05
72001.00000  73001.00000  2.099679483420e-05
73001.00000  74001.00000  2.064878166015e-05
74001.00000  75001.00000  1.935339929009e-05
75001.00000  76001.00000  1.915039160523e-05
76001.00000  77001.00000  1.868637403983e-05
77001.00000  78001.00000  1.809668505047e-05
78001.00000  79001.00000  1.729432134364e-05
79001.00000  80001.00000  1.686897190869e-05
80001.00000  81001.00000  1.683030377824e-05
81001.00000  82001.00000  1.615361149537e-05
82001.00000  83001.00000  1.568959392998e-05
83001.00000  84001.00000  1.480989396225e-05
84001.00000  85001.00000  1.444254672297e-05
85001.00000  86001.00000  1.408486651631e-05
86001.00000  87001.00000  1.420087090766e-05
87001.00000  88001.00000  1.341784126606e-05
88001.00000  89001.00000  1.321483358119e-05
89001.00000  90001.00000  1.313749732029e-05
90001.00000  91001.00000  1.290548853760e-05
91001.00000  92001.00000  1.199678747203e-05
92001.00000  93001.00000  1.148443474357e-05
93001.00000  94001.00000  1.126209299348e-05
94001.00000  95001.00000  1.132976222177e-05
95001.00000  96001.00000  1.099141608034e-05
96001.00000  97001.00000  1.072073916719e-05
97001.00000  98001.00000  1.047906335188e-05
98001.00000  99001.00000  1.027605566702e-05
99001.00000  100001.00000  9.976377656030e-06
100001.00000  101001.00000  9.589696351532e-06
101001.00000  102001.00000  8.980673296949e-06
102001.00000  103001.00000  8.719663416414e-06
103001.00000  104001.00000  8.680995285964e-06
104001.00000  105001.00000  8.758331546863e-06
105001.00000  106001.00000  8.632660122902e-06
106001.00000  107001.00000  7.975301905256e-06
107001.00000  108001.00000  8.033304100931e-06
108001.00000  109001.00000  8.013970035706e-06
109001.00000  110001.00000  8.207310687955e-06
110001.00000  111001.00000  7.385612915898e-06
111001.00000  112001.00000  7.346944785448e-06
112001.00000  113001.00000  6.718587665640e-06
113001.00000  114001.00000  7.462949176797e-06
114001.00000  115001.00000  7.230940394099e-06
115001.00000  116001.00000  6.737921730865e-06
116001.00000  117001.00000  6.679919535190e-06
117001.00000  118001.00000  6.950596448339e-06
118001.00000  119001.00000  6.215901969794e-06
119001.00000  120001.00000  6.486578882942e-06
120001.00000  121001.00000  6.554248111229e-06
121001.00000  122001.00000  5.693882208722e-06
122001.00000  123001.00000  5.674548143498e-06
123001.00000  124001.00000  5.838887697909e-06
124001.00000  125001.00000  5.519875621699e-06
125001.00000  126001.00000  5.345869034675e-06
126001.00000  127001.00000  5.548876719536e-06
127001.00000  128001.00000  5.258865741163e-06
128001.00000  129001.00000  4.910852567115e-06
129001.00000  130001.00000  5.017189925852e-06
130001.00000  131001.00000  4.582173458293e-06
131001.00000  132001.00000  4.717511914867e-06
132001.00000  133001.00000  5.065525088914e-06
133001.00000  134001.00000  4.717511914867e-06
134001.00000  135001.00000  4.939853664953e-06
135001.00000  136001.00000  4.214826219020e-06
136001.00000  137001.00000  3.963483371097e-06
137001.00000  138001.00000  4.021485566772e-06
138001.00000  139001.00000  4.408166871269e-06
139001.00000  140001.00000  4.137489958121e-06
140001.00000  141001.00000  4.137489958121e-06
141001.00000  142001.00000  4.011818534159e-06
142001.00000  143001.00000  3.625137229662e-06
143001.00000  144001.00000  3.866813044973e-06
144001.00000  145001.00000  3.489798773088e-06
145001.00000  146001.00000  3.605803164437e-06
146001.00000  147001.00000  3.296458120839e-06
147001.00000  148001.00000  3.373794381739e-06
148001.00000  149001.00000  3.480131740475e-06
149001.00000  150001.00000  3.373794381739e-06
150001.00000  151001.00000  3.103117468591e-06
151001.00000  152001.00000  3.141785599040e-06
152001.00000  153001.00000  2.880775718505e-06
153001.00000  154001.00000  2.793772424993e-06
154001.00000  155001.00000  3.045115272916e-06
155001.00000  156001.00000  2.571430674907e-06
156001.00000  157001.00000  2.832440555443e-06
157001.00000  158001.00000  2.851774620667e-06
158001.00000  159001.00000  2.929110881567e-06
159001.00000  160001.00000  2.648766935806e-06
160001.00000  161001.00000  3.025781207691e-06
161001.00000  162001.00000  2.735770229318e-06
162001.00000  163001.00000  2.561763642294e-06
163001.00000  164001.00000  2.581097707519e-06
164001.00000  165001.00000  2.706769131481e-06
165001.00000  166001.00000  2.474760348783e-06
166001.00000  167001.00000  2.349088924821e-06
167001.00000  168001.00000  2.271752663921e-06
168001.00000  169001.00000  2.387757055271e-06
169001.00000  170001.00000  2.097746076898e-06
170001.00000  171001.00000  2.600431772744e-06
171001.00000  172001.00000  2.194416403022e-06
172001.00000  173001.00000  1.972074652936e-06
173001.00000  174001.00000  2.165415305185e-06
174001.00000  175001.00000  1.933406522486e-06
175001.00000  176001.00000  1.894738392037e-06
176001.00000  177001.00000  2.049410913836e-06
177001.00000  178001.00000  2.010742783386e-06
178001.00000  179001.00000  1.856070261587e-06
179001.00000  180001.00000  2.126747174735e-06
180001.00000  181001.00000  1.730398837625e-06
181001.00000  182001.00000  1.827069163750e-06
182001.00000  183001.00000  1.575726315826e-06
183001.00000  184001.00000  1.798068065912e-06
184001.00000  185001.00000  1.730398837625e-06
185001.00000  186001.00000  1.759399935463e-06
186001.00000  187001.00000  1.604727413664e-06
187001.00000  188001.00000  1.749732902850e-06
188001.00000  189001.00000  1.769066968075e-06
189001.00000  190001.00000  1.788401033300e-06
190001.00000  191001.00000  1.662729609338e-06
191001.00000  192001.00000  1.450054891865e-06
192001.00000  193001.00000  1.633728511501e-06
193001.00000  194001.00000  1.430720826640e-06
194001.00000  195001.00000  1.324383467903e-06
195001.00000  196001.00000  1.527391152764e-06
196001.00000  197001.00000  1.604727413664e-06
197001.00000  198001.00000  1.537058185377e-06
198001.00000  199001.00000  1.189045011329e-06
