300.00000  350.00000  4.755626633636e-05
350.00000  400.00000  8.173733276562e-05
400.00000  450.00000  5.647306627443e-05
450.00000  500.00000  6.093146624346e-05
500.00000  550.00000  3.618734641532e-04
550.00000  600.00000  3.343799976775e-05
600.00000  650.00000  9.659866599573e-05
650.00000  700.00000  3.789639973679e-05
700.00000  750.00000  6.984826618153e-05
750.00000  800.00000  3.343799976775e-05
800.00000  850.00000  1.456410656551e-04
850.00000  900.00000  4.161173304431e-05
900.00000  950.00000  2.452119982968e-05
950.00000  1000.00000  3.863946639829e-05
1000.00000  1050.00000  3.566719975227e-05
1050.00000  1100.00000  3.863946639829e-05
1100.00000  1150.00000  4.086866638281e-05
1150.00000  1200.00000  2.675039981420e-05
1200.00000  1250.00000  3.418106642926e-05
1250.00000  1300.00000  7.356359948905e-05
1300.00000  1350.00000  3.641026641377e-05
1350.00000  1400.00000  2.823653313721e-05
1400.00000  1450.00000  2.972266646022e-05
1450.00000  1500.00000  2.675039981420e-05
1500.00000  1550.00000  2.452119982968e-05
1550.00000  1600.00000  3.120879978324e-05
1600.00000  1650.00000  2.303506650667e-05
1650.00000  1700.00000  2.303506650667e-05
1700.00000  1750.00000  5.275773296690e-05
1750.00000  1800.00000  2.303506650667e-05
1800.00000  1850.00000  2.303506650667e-05
1850.00000  1900.00000  2.600733315270e-05
1900.00000  1950.00000  1.560439989162e-05
1950.00000  2000.00000  1.931973319915e-05
2000.00000  2050.00000  1.783359987613e-05
2050.00000  2100.00000  2.006279986065e-05
2100.00000  2150.00000  1.709053321463e-05
2150.00000  2200.00000  2.154893318366e-05
2200.00000  2250.00000  1.560439989162e-05
2250.00000  2300.00000  1.486133323011e-05
2300.00000  2350.00000  4.309786636732e-05
2350.00000  2400.00000  1.337519990710e-05
2400.00000  2450.00000  2.006279986065e-05
2450.00000  2500.00000  1.709053321463e-05
2500.00000  2550.00000  1.709053321463e-05
2550.00000  2600.00000  2.154893318366e-05
2600.00000  2650.00000  1.857666653764e-05
2650.00000  2700.00000  8.916799938067e-06
2700.00000  2750.00000  1.783359987613e-05
2750.00000  2800.00000  1.040293326108e-05
2800.00000  2850.00000  1.411826656861e-05
2850.00000  2900.00000  1.188906658409e-05
2900.00000  2950.00000  1.560439989162e-05
2950.00000  3000.00000  1.709053321463e-05
3000.00000  3050.00000  1.040293326108e-05
3050.00000  3100.00000  1.263213324560e-05
3100.00000  3150.00000  1.337519990710e-05
3150.00000  3200.00000  8.916799938067e-06
3200.00000  3250.00000  1.188906658409e-05
3250.00000  3300.00000  8.916799938067e-06
3300.00000  3350.00000  6.687599953550e-06
3350.00000  3400.00000  8.916799938067e-06
3400.00000  3450.00000  5.201466630539e-06
3450.00000  3500.00000  1.560439989162e-05
3500.00000  3550.00000  1.709053321463e-05
3550.00000  3600.00000  8.916799938067e-06
3600.00000  3650.00000  7.430666615056e-06
3650.00000  3700.00000  1.634746655312e-05
3700.00000  3750.00000  1.337519990710e-05
3750.00000  3800.00000  1.114599992258e-05
3800.00000  3850.00000  9.659866599573e-06
3850.00000  3900.00000  1.040293326108e-05
3900.00000  3950.00000  1.263213324560e-05
3950.00000  4000.00000  8.173733276562e-06
4000.00000  4050.00000  7.430666615056e-06
4050.00000  4100.00000  7.430666615056e-06
4100.00000  4150.00000  1.411826656861e-05
4150.00000  4200.00000  5.944533292045e-06
4200.00000  4250.00000  8.173733276562e-06
4250.00000  4300.00000  8.916799938067e-06
4300.00000  4350.00000  1.040293326108e-05
4350.00000  4400.00000  1.560439989162e-05
4400.00000  4450.00000  1.040293326108e-05
4450.00000  4500.00000  9.659866599573e-06
4500.00000  4550.00000  4.458399969034e-06
4550.00000  4600.00000  1.040293326108e-05
4600.00000  4650.00000  7.430666615056e-06
4650.00000  4700.00000  7.430666615056e-06
4700.00000  4750.00000  9.659866599573e-06
4750.00000  4800.00000  9.659866599573e-06
4800.00000  4850.00000  5.944533292045e-06
4850.00000  4900.00000  1.411826656861e-05
4900.00000  4950.00000  1.040293326108e-05
4950.00000  5000.00000  7.430666615056e-06
5000.00000  5050.00000  5.944533292045e-06
5050.00000  5100.00000  1.411826656861e-05
5100.00000  5150.00000  1.486133323011e-05
5150.00000  5200.00000  8.173733276562e-06
5200.00000  5250.00000  7.430666615056e-06
5250.00000  5300.00000  5.201466630539e-06
5300.00000  5350.00000  1.114599992258e-05
5350.00000  5400.00000  5.201466630539e-06
5400.00000  5450.00000  1.188906658409e-05
5450.00000  5500.00000  1.337519990710e-05
5500.00000  5550.00000  6.687599953550e-06
5550.00000  5600.00000  9.659866599573e-06
5600.00000  5650.00000  1.337519990710e-05
5650.00000  5700.00000  9.659866599573e-06
5700.00000  5750.00000  9.659866599573e-06
5750.00000  5800.00000  1.263213324560e-05
5800.00000  5850.00000  1.114599992258e-05
5850.00000  5900.00000  1.411826656861e-05
5900.00000  5950.00000  7.430666615056e-06
5950.00000  6000.00000  6.687599953550e-06
6000.00000  6050.00000  8.173733276562e-06
6050.00000  6100.00000  9.659866599573e-06
6100.00000  6150.00000  1.114599992258e-05
6150.00000  6200.00000  1.263213324560e-05
6200.00000  6250.00000  1.337519990710e-05
6250.00000  6300.00000  1.931973319915e-05
6300.00000  6350.00000  1.931973319915e-05
6350.00000  6400.00000  1.337519990710e-04
6400.00000  6450.00000  1.486133323011e-05
6450.00000  6500.00000  8.916799938067e-06
6500.00000  6550.00000  1.114599992258e-05
6550.00000  6600.00000  5.201466630539e-06
6600.00000  6650.00000  1.188906658409e-05
6650.00000  6700.00000  5.944533292045e-06
6700.00000  6750.00000  3.715333307528e-06
6750.00000  6800.00000  7.430666615056e-06
6800.00000  6850.00000  8.916799938067e-06
6850.00000  6900.00000  1.040293326108e-05
6900.00000  6950.00000  1.263213324560e-05
6950.00000  7000.00000  3.715333307528e-06
7000.00000  7050.00000  1.337519990710e-05
7050.00000  7100.00000  1.560439989162e-05
7100.00000  7150.00000  5.201466630539e-06
7150.00000  7200.00000  5.944533292045e-06
7200.00000  7250.00000  7.430666615056e-06
7250.00000  7300.00000  2.972266646022e-06
7300.00000  7350.00000  2.229199984517e-06
7350.00000  7400.00000  5.201466630539e-06
7400.00000  7450.00000  5.201466630539e-06
7450.00000  7500.00000  1.114599992258e-05
7500.00000  7550.00000  8.916799938067e-06
7550.00000  7600.00000  5.201466630539e-06
7600.00000  7650.00000  1.114599992258e-05
7650.00000  7700.00000  3.715333307528e-06
7700.00000  7750.00000  4.458399969034e-06
7750.00000  7800.00000  3.715333307528e-06
7800.00000  7850.00000  4.458399969034e-06
7850.00000  7900.00000  7.430666615056e-06
7900.00000  7950.00000  4.458399969034e-06
7950.00000  8000.00000  3.715333307528e-06
8000.00000  8050.00000  3.715333307528e-06
8050.00000  8100.00000  6.687599953550e-06
8100.00000  8150.00000  4.458399969034e-06
8150.00000  8200.00000  3.715333307528e-06
8200.00000  8250.00000  5.944533292045e-06
8250.00000  8300.00000  9.659866599573e-06
8300.00000  8350.00000  5.201466630539e-06
8350.00000  8400.00000  9.659866599573e-06
8400.00000  8450.00000  2.972266646022e-06
8450.00000  8500.00000  4.458399969034e-06
8500.00000  8550.00000  5.944533292045e-06
8550.00000  8600.00000  5.201466630539e-06
8600.00000  8650.00000  3.715333307528e-06
8650.00000  8700.00000  5.201466630539e-06
8700.00000  8750.00000  3.715333307528e-06
8750.00000  8800.00000  5.944533292045e-06
8800.00000  8850.00000  6.687599953550e-06
8850.00000  8900.00000  6.687599953550e-06
8900.00000  8950.00000  8.916799938067e-06
8950.00000  9000.00000  3.715333307528e-06
9000.00000  9050.00000  4.458399969034e-06
9050.00000  9100.00000  4.458399969034e-06
9100.00000  9150.00000  8.173733276562e-06
9150.00000  9200.00000  3.715333307528e-06
9200.00000  9250.00000  2.972266646022e-06
9250.00000  9300.00000  4.458399969034e-06
9300.00000  9350.00000  8.173733276562e-06
9350.00000  9400.00000  4.458399969034e-06
9400.00000  9450.00000  4.458399969034e-06
9450.00000  9500.00000  2.972266646022e-06
9500.00000  9550.00000  6.687599953550e-06
9550.00000  9600.00000  5.201466630539e-06
9600.00000  9650.00000  6.687599953550e-06
9650.00000  9700.00000  6.687599953550e-06
9700.00000  9750.00000  5.201466630539e-06
9750.00000  9800.00000  4.458399969034e-06
9800.00000  9850.00000  5.201466630539e-06
9850.00000  9900.00000  3.715333307528e-06
9900.00000  9950.00000  7.430666615056e-06
9950.00000  10000.00000  1.486133323011e-06
