10001.00000  11001.00000  4.875169142084e-05
11001.00000  12001.00000  3.753628642744e-05
12001.00000  13001.00000  2.997870980979e-05
13001.00000  14001.00000  2.344687342451e-05
14001.00000  15001.00000  2.078575489717e-05
15001.00000  16001.00000  1.743758395005e-05
16001.00000  17001.00000  1.504741567277e-05
17001.00000  18001.00000  1.187342702925e-05
18001.00000  19001.00000  1.053802936826e-05
19001.00000  20001.00000  9.425197984100e-06
20001.00000  21001.00000  7.431778287257e-06
21001.00000  22001.00000  7.634990974799e-06
22001.00000  23001.00000  6.522159590640e-06
23001.00000  24001.00000  5.854460760144e-06
24001.00000  25001.00000  5.864137554789e-06
25001.00000  26001.00000  4.693245402760e-06
26001.00000  27001.00000  4.557770277732e-06
27001.00000  28001.00000  3.706212348984e-06
28001.00000  29001.00000  3.377201331058e-06
29001.00000  30001.00000  3.677181965049e-06
30001.00000  31001.00000  2.932068777394e-06
31001.00000  32001.00000  3.028836723843e-06
32001.00000  33001.00000  2.661118527338e-06
33001.00000  34001.00000  2.574027375534e-06
34001.00000  35001.00000  2.515966607665e-06
35001.00000  36001.00000  2.409521866572e-06
36001.00000  37001.00000  2.022450080777e-06
37001.00000  38001.00000  2.080510848646e-06
38001.00000  39001.00000  1.906328545039e-06
39001.00000  40001.00000  1.896651750394e-06
40001.00000  41001.00000  1.567640732468e-06
41001.00000  42001.00000  1.722469446786e-06
42001.00000  43001.00000  1.499903169954e-06
43001.00000  44001.00000  1.490226375309e-06
44001.00000  45001.00000  1.228952919898e-06
45001.00000  46001.00000  1.093477794870e-06
46001.00000  47001.00000  1.335397660992e-06
47001.00000  48001.00000  1.035417027001e-06
48001.00000  49001.00000  1.122508178804e-06
49001.00000  50001.00000  1.083801000225e-06
50001.00000  51001.00000  8.805883126828e-07
51001.00000  52001.00000  8.709115180379e-07
52001.00000  53001.00000  8.322043394585e-07
53001.00000  54001.00000  8.999419019725e-07
54001.00000  55001.00000  8.999419019725e-07
55001.00000  56001.00000  7.741435715893e-07
56001.00000  57001.00000  7.644667769444e-07
57001.00000  58001.00000  7.257595983650e-07
58001.00000  59001.00000  5.806076786920e-07
59001.00000  60001.00000  6.580220358509e-07
60001.00000  61001.00000  5.999612679817e-07
61001.00000  62001.00000  7.064060090752e-07
62001.00000  63001.00000  5.612540894022e-07
63001.00000  64001.00000  6.096380626266e-07
64001.00000  65001.00000  5.515772947574e-07
65001.00000  66001.00000  5.515772947574e-07
66001.00000  67001.00000  5.031933215330e-07
67001.00000  68001.00000  5.225469108228e-07
68001.00000  69001.00000  5.709308840471e-07
69001.00000  70001.00000  4.548093483087e-07
70001.00000  71001.00000  4.644861429536e-07
71001.00000  72001.00000  3.677181965049e-07
72001.00000  73001.00000  3.870717857946e-07
73001.00000  74001.00000  3.773949911498e-07
74001.00000  75001.00000  4.451325536638e-07
75001.00000  76001.00000  4.935165268882e-07
76001.00000  77001.00000  3.773949911498e-07
77001.00000  78001.00000  3.096574286357e-07
78001.00000  79001.00000  3.386878125703e-07
79001.00000  80001.00000  2.806270447011e-07
80001.00000  81001.00000  3.386878125703e-07
81001.00000  82001.00000  2.709502500562e-07
82001.00000  83001.00000  1.838590982525e-07
83001.00000  84001.00000  2.806270447011e-07
84001.00000  85001.00000  1.935358928973e-07
85001.00000  86001.00000  2.806270447011e-07
86001.00000  87001.00000  3.193342232806e-07
87001.00000  88001.00000  2.128894821871e-07
88001.00000  89001.00000  2.999806339908e-07
89001.00000  90001.00000  2.225662768319e-07
90001.00000  91001.00000  2.806270447011e-07
91001.00000  92001.00000  2.709502500562e-07
92001.00000  93001.00000  2.709502500562e-07
93001.00000  94001.00000  2.225662768319e-07
94001.00000  95001.00000  2.515966607665e-07
95001.00000  96001.00000  2.999806339908e-07
96001.00000  97001.00000  2.225662768319e-07
97001.00000  98001.00000  1.645055089627e-07
98001.00000  99001.00000  1.548287143179e-07
99001.00000  100001.00000  1.838590982525e-07
100001.00000  101001.00000  1.451519196730e-07
101001.00000  102001.00000  2.225662768319e-07
102001.00000  103001.00000  1.354751250281e-07
103001.00000  104001.00000  1.161215357384e-07
104001.00000  105001.00000  1.741823036076e-07
105001.00000  106001.00000  1.935358928973e-07
106001.00000  107001.00000  1.548287143179e-07
107001.00000  108001.00000  1.161215357384e-07
108001.00000  109001.00000  2.225662768319e-07
109001.00000  110001.00000  6.773756251406e-08
110001.00000  111001.00000  1.354751250281e-07
111001.00000  112001.00000  1.257983303833e-07
112001.00000  113001.00000  7.741435715893e-08
113001.00000  114001.00000  1.257983303833e-07
114001.00000  115001.00000  6.773756251406e-08
115001.00000  116001.00000  1.354751250281e-07
116001.00000  117001.00000  5.806076786920e-08
117001.00000  118001.00000  1.451519196730e-07
118001.00000  119001.00000  1.257983303833e-07
119001.00000  120001.00000  8.709115180379e-08
120001.00000  121001.00000  6.773756251406e-08
121001.00000  122001.00000  8.709115180379e-08
122001.00000  123001.00000  1.161215357384e-07
123001.00000  124001.00000  7.741435715893e-08
124001.00000  125001.00000  1.354751250281e-07
125001.00000  126001.00000  7.741435715893e-08
126001.00000  127001.00000  6.773756251406e-08
127001.00000  128001.00000  8.709115180379e-08
128001.00000  129001.00000  1.161215357384e-07
129001.00000  130001.00000  7.741435715893e-08
130001.00000  131001.00000  9.676794644866e-08
131001.00000  132001.00000  6.773756251406e-08
132001.00000  133001.00000  6.773756251406e-08
133001.00000  134001.00000  7.741435715893e-08
134001.00000  135001.00000  8.709115180379e-08
135001.00000  136001.00000  8.709115180379e-08
136001.00000  137001.00000  3.870717857946e-08
137001.00000  138001.00000  5.806076786920e-08
138001.00000  139001.00000  1.935358928973e-08
139001.00000  140001.00000  2.903038393460e-08
140001.00000  141001.00000  1.935358928973e-08
141001.00000  142001.00000  6.773756251406e-08
142001.00000  143001.00000  3.870717857946e-08
143001.00000  144001.00000  5.806076786920e-08
144001.00000  145001.00000  1.935358928973e-08
145001.00000  146001.00000  7.741435715893e-08
146001.00000  147001.00000  4.838397322433e-08
147001.00000  148001.00000  3.870717857946e-08
148001.00000  149001.00000  7.741435715893e-08
149001.00000  150001.00000  2.903038393460e-08
150001.00000  151001.00000  2.903038393460e-08
151001.00000  152001.00000  5.806076786920e-08
152001.00000  153001.00000  4.838397322433e-08
153001.00000  154001.00000  2.903038393460e-08
154001.00000  155001.00000  1.935358928973e-08
155001.00000  156001.00000  9.676794644866e-09
156001.00000  157001.00000  4.838397322433e-08
157001.00000  158001.00000  2.903038393460e-08
158001.00000  159001.00000  5.806076786920e-08
159001.00000  160001.00000  9.676794644866e-09
160001.00000  161001.00000  5.806076786920e-08
161001.00000  162001.00000  3.870717857946e-08
162001.00000  163001.00000  1.935358928973e-08
163001.00000  164001.00000  3.870717857946e-08
164001.00000  165001.00000  9.676794644866e-09
165001.00000  166001.00000  1.935358928973e-08
166001.00000  167001.00000  2.903038393460e-08
167001.00000  168001.00000  1.935358928973e-08
168001.00000  169001.00000  2.903038393460e-08
169001.00000  170001.00000  2.903038393460e-08
170001.00000  171001.00000  2.903038393460e-08
171001.00000  172001.00000  3.870717857946e-08
172001.00000  173001.00000  1.935358928973e-08
173001.00000  174001.00000  3.870717857946e-08
174001.00000  175001.00000  1.935358928973e-08
175001.00000  176001.00000  0.000000000000e+00
176001.00000  177001.00000  2.903038393460e-08
177001.00000  178001.00000  9.676794644866e-09
178001.00000  179001.00000  2.903038393460e-08
179001.00000  180001.00000  4.838397322433e-08
180001.00000  181001.00000  2.903038393460e-08
181001.00000  182001.00000  1.935358928973e-08
182001.00000  183001.00000  9.676794644866e-09
183001.00000  184001.00000  0.000000000000e+00
184001.00000  185001.00000  2.903038393460e-08
185001.00000  186001.00000  0.000000000000e+00
186001.00000  187001.00000  9.676794644866e-09
187001.00000  188001.00000  0.000000000000e+00
188001.00000  189001.00000  0.000000000000e+00
189001.00000  190001.00000  9.676794644866e-09
190001.00000  191001.00000  0.000000000000e+00
191001.00000  192001.00000  0.000000000000e+00
192001.00000  193001.00000  9.676794644866e-09
193001.00000  194001.00000  0.000000000000e+00
194001.00000  195001.00000  0.000000000000e+00
195001.00000  196001.00000  2.903038393460e-08
196001.00000  197001.00000  0.000000000000e+00
197001.00000  198001.00000  9.676794644866e-09
198001.00000  199001.00000  0.000000000000e+00
