10001.00000  11001.00000  1.011578090672e-04
11001.00000  12001.00000  9.273423133213e-05
12001.00000  13001.00000  8.337470051540e-05
13001.00000  14001.00000  7.573732336895e-05
14001.00000  15001.00000  6.757581249677e-05
15001.00000  16001.00000  5.814140543351e-05
16001.00000  17001.00000  5.222618195734e-05
17001.00000  18001.00000  4.743410217917e-05
18001.00000  19001.00000  3.886077195105e-05
19001.00000  20001.00000  3.710118015750e-05
20001.00000  21001.00000  3.354455844715e-05
21001.00000  22001.00000  2.804115432691e-05
22001.00000  23001.00000  2.635643877990e-05
23001.00000  24001.00000  2.268750269975e-05
24001.00000  25001.00000  2.246287396014e-05
25001.00000  26001.00000  2.074072028987e-05
26001.00000  27001.00000  1.928063348246e-05
27001.00000  28001.00000  1.546194490923e-05
28001.00000  29001.00000  1.527475429290e-05
29001.00000  30001.00000  1.325309563649e-05
30001.00000  31001.00000  1.227970443155e-05
31001.00000  32001.00000  1.198019944541e-05
32001.00000  33001.00000  9.808788295930e-06
33001.00000  34001.00000  1.164325633601e-05
34001.00000  35001.00000  8.461015858321e-06
35001.00000  36001.00000  9.434407063261e-06
36001.00000  37001.00000  8.910273337524e-06
37001.00000  38001.00000  7.824567762784e-06
38001.00000  39001.00000  6.813738434577e-06
39001.00000  40001.00000  6.214728462307e-06
40001.00000  41001.00000  6.738862188043e-06
41001.00000  42001.00000  5.690594736570e-06
42001.00000  43001.00000  5.802909106371e-06
43001.00000  44001.00000  5.990099722705e-06
44001.00000  45001.00000  3.931002943025e-06
45001.00000  46001.00000  4.979270394499e-06
46001.00000  47001.00000  4.567451038563e-06
47001.00000  48001.00000  4.005879189559e-06
48001.00000  49001.00000  3.856126696491e-06
49001.00000  50001.00000  3.743812326691e-06
50001.00000  51001.00000  3.594059833623e-06
51001.00000  52001.00000  2.807859245018e-06
52001.00000  53001.00000  2.845297368285e-06
53001.00000  54001.00000  2.995049861353e-06
54001.00000  55001.00000  2.995049861353e-06
55001.00000  56001.00000  2.545792382150e-06
56001.00000  57001.00000  2.583230505417e-06
57001.00000  58001.00000  2.620668628683e-06
58001.00000  59001.00000  2.096534902947e-06
59001.00000  60001.00000  2.583230505417e-06
60001.00000  61001.00000  1.722153670278e-06
61001.00000  62001.00000  2.171411149481e-06
62001.00000  63001.00000  1.909344286612e-06
63001.00000  64001.00000  2.021658656413e-06
64001.00000  65001.00000  1.684715547011e-06
65001.00000  66001.00000  1.871906163345e-06
66001.00000  67001.00000  1.871906163345e-06
67001.00000  68001.00000  1.497524930676e-06
68001.00000  69001.00000  1.385210560876e-06
69001.00000  70001.00000  1.572401177210e-06
70001.00000  71001.00000  1.534963053943e-06
71001.00000  72001.00000  1.272896191075e-06
72001.00000  73001.00000  1.198019944541e-06
73001.00000  74001.00000  1.048267451473e-06
74001.00000  75001.00000  2.021658656413e-06
75001.00000  76001.00000  1.647277423744e-06
76001.00000  77001.00000  8.610768351389e-07
77001.00000  78001.00000  6.738862188043e-07
78001.00000  79001.00000  6.738862188043e-07
79001.00000  80001.00000  1.160581821274e-06
80001.00000  81001.00000  1.272896191075e-06
81001.00000  82001.00000  1.460086807409e-06
82001.00000  83001.00000  7.862005886050e-07
83001.00000  84001.00000  9.359530816727e-07
84001.00000  85001.00000  7.487624653381e-07
85001.00000  86001.00000  9.733912049396e-07
86001.00000  87001.00000  9.733912049396e-07
87001.00000  88001.00000  8.610768351389e-07
88001.00000  89001.00000  7.113243420712e-07
89001.00000  90001.00000  7.862005886050e-07
90001.00000  91001.00000  8.985149584058e-07
91001.00000  92001.00000  5.241337257367e-07
92001.00000  93001.00000  4.866956024698e-07
93001.00000  94001.00000  4.866956024698e-07
94001.00000  95001.00000  6.738862188043e-07
95001.00000  96001.00000  5.990099722705e-07
96001.00000  97001.00000  6.364480955374e-07
97001.00000  98001.00000  4.118193559360e-07
98001.00000  99001.00000  7.113243420712e-07
99001.00000  100001.00000  5.241337257367e-07
100001.00000  101001.00000  5.990099722705e-07
101001.00000  102001.00000  5.241337257367e-07
102001.00000  103001.00000  3.743812326691e-07
103001.00000  104001.00000  3.369431094022e-07
104001.00000  105001.00000  4.492574792029e-07
105001.00000  106001.00000  3.743812326691e-07
106001.00000  107001.00000  4.492574792029e-07
107001.00000  108001.00000  3.743812326691e-07
108001.00000  109001.00000  4.118193559360e-07
109001.00000  110001.00000  3.369431094022e-07
110001.00000  111001.00000  1.871906163345e-07
111001.00000  112001.00000  4.118193559360e-07
112001.00000  113001.00000  4.492574792029e-07
113001.00000  114001.00000  2.995049861353e-07
114001.00000  115001.00000  4.118193559360e-07
115001.00000  116001.00000  3.743812326691e-07
116001.00000  117001.00000  2.620668628683e-07
117001.00000  118001.00000  4.492574792029e-07
118001.00000  119001.00000  2.620668628683e-07
119001.00000  120001.00000  2.620668628683e-07
120001.00000  121001.00000  3.743812326691e-07
121001.00000  122001.00000  5.615718490036e-07
122001.00000  123001.00000  2.995049861353e-07
123001.00000  124001.00000  3.743812326691e-07
124001.00000  125001.00000  3.743812326691e-07
125001.00000  126001.00000  3.743812326691e-07
126001.00000  127001.00000  2.620668628683e-07
127001.00000  128001.00000  1.871906163345e-07
128001.00000  129001.00000  1.871906163345e-07
129001.00000  130001.00000  1.871906163345e-07
130001.00000  131001.00000  1.871906163345e-07
131001.00000  132001.00000  3.369431094022e-07
132001.00000  133001.00000  2.995049861353e-07
133001.00000  134001.00000  2.620668628683e-07
134001.00000  135001.00000  2.620668628683e-07
135001.00000  136001.00000  3.369431094022e-07
136001.00000  137001.00000  1.871906163345e-07
137001.00000  138001.00000  3.369431094022e-07
138001.00000  139001.00000  2.246287396014e-07
139001.00000  140001.00000  1.497524930676e-07
140001.00000  141001.00000  1.497524930676e-07
141001.00000  142001.00000  2.620668628683e-07
142001.00000  143001.00000  3.743812326691e-08
143001.00000  144001.00000  2.246287396014e-07
144001.00000  145001.00000  2.246287396014e-07
145001.00000  146001.00000  1.497524930676e-07
146001.00000  147001.00000  1.497524930676e-07
147001.00000  148001.00000  1.871906163345e-07
148001.00000  149001.00000  2.995049861353e-07
149001.00000  150001.00000  1.123143698007e-07
150001.00000  151001.00000  1.123143698007e-07
151001.00000  152001.00000  7.487624653381e-08
152001.00000  153001.00000  2.995049861353e-07
153001.00000  154001.00000  3.743812326691e-08
154001.00000  155001.00000  1.123143698007e-07
155001.00000  156001.00000  3.369431094022e-07
156001.00000  157001.00000  1.123143698007e-07
157001.00000  158001.00000  1.871906163345e-07
158001.00000  159001.00000  1.123143698007e-07
159001.00000  160001.00000  7.487624653381e-08
160001.00000  161001.00000  1.497524930676e-07
161001.00000  162001.00000  1.123143698007e-07
162001.00000  163001.00000  3.743812326691e-08
163001.00000  164001.00000  1.123143698007e-07
164001.00000  165001.00000  1.871906163345e-07
165001.00000  166001.00000  0.000000000000e+00
166001.00000  167001.00000  7.487624653381e-08
167001.00000  168001.00000  7.487624653381e-08
168001.00000  169001.00000  3.743812326691e-08
169001.00000  170001.00000  3.743812326691e-08
170001.00000  171001.00000  1.123143698007e-07
171001.00000  172001.00000  3.743812326691e-08
172001.00000  173001.00000  1.871906163345e-07
173001.00000  174001.00000  7.487624653381e-08
174001.00000  175001.00000  1.123143698007e-07
175001.00000  176001.00000  1.123143698007e-07
176001.00000  177001.00000  1.123143698007e-07
177001.00000  178001.00000  7.487624653381e-08
178001.00000  179001.00000  3.743812326691e-08
179001.00000  180001.00000  1.123143698007e-07
180001.00000  181001.00000  0.000000000000e+00
181001.00000  182001.00000  1.123143698007e-07
182001.00000  183001.00000  1.123143698007e-07
183001.00000  184001.00000  3.743812326691e-08
184001.00000  185001.00000  3.743812326691e-08
185001.00000  186001.00000  0.000000000000e+00
186001.00000  187001.00000  1.123143698007e-07
187001.00000  188001.00000  3.743812326691e-08
188001.00000  189001.00000  0.000000000000e+00
189001.00000  190001.00000  3.743812326691e-08
190001.00000  191001.00000  3.743812326691e-08
191001.00000  192001.00000  0.000000000000e+00
192001.00000  193001.00000  0.000000000000e+00
193001.00000  194001.00000  7.487624653381e-08
194001.00000  195001.00000  3.743812326691e-08
195001.00000  196001.00000  1.497524930676e-07
196001.00000  197001.00000  0.000000000000e+00
197001.00000  198001.00000  7.487624653381e-08
198001.00000  199001.00000  3.743812326691e-08
