300.00000  350.00000  1.173194552498e-01
350.00000  400.00000  9.305768076967e-02
400.00000  450.00000  7.642604171759e-02
450.00000  500.00000  6.370714865920e-02
500.00000  550.00000  5.430892988145e-02
550.00000  600.00000  4.689602939849e-02
600.00000  650.00000  4.104501332005e-02
650.00000  700.00000  3.629198242298e-02
700.00000  750.00000  3.219607755404e-02
750.00000  800.00000  2.893890867623e-02
800.00000  850.00000  2.634002751075e-02
850.00000  900.00000  2.387725701049e-02
900.00000  950.00000  2.183230559354e-02
950.00000  1000.00000  2.003924603356e-02
1000.00000  1050.00000  1.850795264626e-02
1050.00000  1100.00000  1.702564360931e-02
1100.00000  1150.00000  1.594159863833e-02
1150.00000  1200.00000  1.490324657914e-02
1200.00000  1250.00000  1.397041416796e-02
1250.00000  1300.00000  1.302906273932e-02
1300.00000  1350.00000  1.220833285327e-02
1350.00000  1400.00000  1.163678422774e-02
1400.00000  1450.00000  1.086213448155e-02
1450.00000  1500.00000  1.033685960992e-02
1500.00000  1550.00000  9.742464528486e-03
1550.00000  1600.00000  9.257267761690e-03
1600.00000  1650.00000  8.780977240415e-03
1650.00000  1700.00000  8.409044682947e-03
1700.00000  1750.00000  8.068090370765e-03
1750.00000  1800.00000  7.659758375086e-03
1800.00000  1850.00000  7.304283010427e-03
1850.00000  1900.00000  6.958681961452e-03
1900.00000  1950.00000  6.745512911076e-03
1950.00000  2000.00000  6.504269825910e-03
2000.00000  2050.00000  6.214623232484e-03
2050.00000  2100.00000  6.012490181991e-03
2100.00000  2150.00000  5.770859868758e-03
2150.00000  2200.00000  5.530972081823e-03
2200.00000  2250.00000  5.353040785460e-03
2250.00000  2300.00000  5.169107454073e-03
2300.00000  2350.00000  5.006665280354e-03
2350.00000  2400.00000  4.784783598491e-03
2400.00000  2450.00000  4.631054056258e-03
2450.00000  2500.00000  4.428146549633e-03
2500.00000  2550.00000  4.357477427574e-03
2550.00000  2600.00000  4.192905499491e-03
2600.00000  2650.00000  4.149535956090e-03
2650.00000  2700.00000  3.966377080836e-03
2700.00000  2750.00000  3.863180801226e-03
2750.00000  2800.00000  3.726295679867e-03
2800.00000  2850.00000  3.619033505564e-03
2850.00000  2900.00000  3.526873225837e-03
2900.00000  2950.00000  3.430066209318e-03
2950.00000  3000.00000  3.341003754120e-03
3000.00000  3050.00000  3.260460316376e-03
3050.00000  3100.00000  3.179723264598e-03
3100.00000  3150.00000  3.089305511169e-03
3150.00000  3200.00000  3.031995757390e-03
3200.00000  3250.00000  2.938480179432e-03
3250.00000  3300.00000  2.843609303243e-03
3300.00000  3350.00000  2.734798216675e-03
3350.00000  3400.00000  2.739251339435e-03
3400.00000  3450.00000  2.636055059825e-03
3450.00000  3500.00000  2.596751411118e-03
3500.00000  3550.00000  2.515239903209e-03
3550.00000  3600.00000  2.496846570070e-03
3600.00000  3650.00000  2.411462781500e-03
3650.00000  3700.00000  2.383582360742e-03
3700.00000  3750.00000  2.355701939985e-03
3750.00000  3800.00000  2.278062712736e-03
3800.00000  3850.00000  2.239339906128e-03
3850.00000  3900.00000  2.190936397869e-03
3900.00000  3950.00000  2.122009802107e-03
3950.00000  4000.00000  2.115814153049e-03
4000.00000  4050.00000  2.070895697384e-03
4050.00000  4100.00000  1.994418154334e-03
4100.00000  4150.00000  1.976412049261e-03
4150.00000  4200.00000  1.919295909515e-03
4200.00000  4250.00000  1.878830576610e-03
4250.00000  4300.00000  1.836622717407e-03
4300.00000  4350.00000  1.840882226134e-03
4350.00000  4400.00000  1.768276963745e-03
4400.00000  4450.00000  1.729360543104e-03
4450.00000  4500.00000  1.709805525767e-03
4500.00000  4550.00000  1.691993034727e-03
4550.00000  4600.00000  1.682118719042e-03
4600.00000  4650.00000  1.615321877644e-03
4650.00000  4700.00000  1.594217948043e-03
4700.00000  4750.00000  1.582407492027e-03
4750.00000  4800.00000  1.541167702990e-03
4800.00000  4850.00000  1.540780474924e-03
4850.00000  4900.00000  1.501089598151e-03
4900.00000  4950.00000  1.441843704041e-03
4950.00000  5000.00000  1.466432686237e-03
5000.00000  5050.00000  1.428484335761e-03
5050.00000  5100.00000  1.393440195781e-03
5100.00000  5150.00000  1.378338301204e-03
5150.00000  5200.00000  1.333032617473e-03
5200.00000  5250.00000  1.335936827969e-03
5250.00000  5300.00000  1.318705179028e-03
5300.00000  5350.00000  1.299537389757e-03
5350.00000  5400.00000  1.257135916522e-03
5400.00000  5450.00000  1.272431425132e-03
5450.00000  5500.00000  1.212991916989e-03
5500.00000  5550.00000  1.223059846707e-03
5550.00000  5600.00000  1.195179425949e-03
5600.00000  5650.00000  1.172139356018e-03
5650.00000  5700.00000  1.157424689507e-03
5700.00000  5750.00000  1.167686233258e-03
5750.00000  5800.00000  1.139999426533e-03
5800.00000  5850.00000  1.146388689624e-03
5850.00000  5900.00000  1.119863567097e-03
5900.00000  5950.00000  1.101663847992e-03
5950.00000  6000.00000  1.057132620393e-03
6000.00000  6050.00000  1.079398234192e-03
6050.00000  6100.00000  1.045128550344e-03
6100.00000  6150.00000  1.045128550344e-03
6150.00000  6200.00000  1.024411848809e-03
6200.00000  6250.00000  1.021507638313e-03
6250.00000  6300.00000  1.017635357653e-03
6300.00000  6350.00000  1.010858866496e-03
6350.00000  6400.00000  1.238161741284e-03
6400.00000  6450.00000  9.450300952630e-04
6450.00000  6500.00000  9.506449022211e-04
6500.00000  6550.00000  9.678765511616e-04
6550.00000  6600.00000  9.190858148358e-04
6600.00000  6650.00000  9.144390780429e-04
6650.00000  6700.00000  9.107604114151e-04
6700.00000  6750.00000  8.981754992676e-04
6750.00000  6800.00000  8.654547276840e-04
6800.00000  6850.00000  8.747482012699e-04
6850.00000  6900.00000  8.530634295695e-04
6900.00000  6950.00000  8.478358506775e-04
6950.00000  7000.00000  8.141470089287e-04
7000.00000  7050.00000  8.371870788603e-04
7050.00000  7100.00000  8.546123418338e-04
7100.00000  7150.00000  7.945919915918e-04
7150.00000  7200.00000  7.833623776755e-04
7200.00000  7250.00000  7.843304478407e-04
7250.00000  7300.00000  7.763922724861e-04
7300.00000  7350.00000  7.510288341580e-04
7350.00000  7400.00000  7.607095358100e-04
7400.00000  7450.00000  7.442523430016e-04
7450.00000  7500.00000  7.370886237792e-04
7500.00000  7550.00000  7.465757113981e-04
7550.00000  7600.00000  7.233420274334e-04
7600.00000  7650.00000  7.150166240128e-04
7650.00000  7700.00000  7.022380978322e-04
7700.00000  7750.00000  7.097890451207e-04
7750.00000  7800.00000  7.208250450039e-04
7800.00000  7850.00000  6.900404137507e-04
7850.00000  7900.00000  6.939126944115e-04
7900.00000  7950.00000  6.826830804953e-04
7950.00000  8000.00000  6.726151507772e-04
8000.00000  8050.00000  6.538345895725e-04
8050.00000  8100.00000  6.666131157530e-04
8100.00000  8150.00000  6.348604143346e-04
8150.00000  8200.00000  6.567388000680e-04
8200.00000  8250.00000  6.623536070262e-04
8250.00000  8300.00000  6.420241335571e-04
8300.00000  8350.00000  6.366029406320e-04
8350.00000  8400.00000  6.185968355594e-04
8400.00000  8450.00000  6.044630111475e-04
8450.00000  8500.00000  6.278903091452e-04
8500.00000  8550.00000  6.100778181057e-04
8550.00000  8600.00000  5.957503796608e-04
8600.00000  8650.00000  5.916844849670e-04
8650.00000  8700.00000  5.777442745882e-04
8700.00000  8750.00000  5.949759235286e-04
8750.00000  8800.00000  5.723230816631e-04
8800.00000  8850.00000  5.620615379120e-04
8850.00000  8900.00000  5.694188711675e-04
8900.00000  8950.00000  5.717422395640e-04
8950.00000  9000.00000  5.519936081940e-04
9000.00000  9050.00000  5.595445554825e-04
9050.00000  9100.00000  5.345683452205e-04
9100.00000  9150.00000  5.295343803615e-04
9150.00000  9200.00000  5.516063801279e-04
9200.00000  9250.00000  5.262429417998e-04
9250.00000  9300.00000  5.428937486412e-04
9300.00000  9350.00000  5.401831521786e-04
9350.00000  9400.00000  5.289535382624e-04
9400.00000  9450.00000  5.198536787095e-04
9450.00000  9500.00000  5.059134683307e-04
9500.00000  9550.00000  5.070751525290e-04
9550.00000  9600.00000  5.049453981655e-04
9600.00000  9650.00000  5.004922754056e-04
9650.00000  9700.00000  4.941030123153e-04
9700.00000  9750.00000  4.848095387295e-04
9750.00000  9800.00000  4.797755738705e-04
9800.00000  9850.00000  4.760969072427e-04
9850.00000  9900.00000  4.720310125489e-04
9900.00000  9950.00000  4.805500300026e-04
9950.00000  10000.00000  4.578971881371e-04
