10001.00000  11001.00000  1.864749652244e-04
11001.00000  12001.00000  1.674218456485e-04
12001.00000  13001.00000  1.503038085295e-04
13001.00000  14001.00000  1.360511819718e-04
14001.00000  15001.00000  1.198262598329e-04
15001.00000  16001.00000  1.076947813529e-04
16001.00000  17001.00000  9.500510601038e-05
17001.00000  18001.00000  8.276198815789e-05
18001.00000  19001.00000  7.721723265630e-05
19001.00000  20001.00000  6.884427971767e-05
20001.00000  21001.00000  5.924329368136e-05
21001.00000  22001.00000  5.485214502910e-05
22001.00000  23001.00000  4.938181577586e-05
23001.00000  24001.00000  4.484181462691e-05
24001.00000  25001.00000  3.877607538692e-05
25001.00000  26001.00000  3.691541917834e-05
26001.00000  27001.00000  3.252427052608e-05
27001.00000  28001.00000  3.125902430424e-05
28001.00000  29001.00000  2.850525311553e-05
29001.00000  30001.00000  2.608640004437e-05
30001.00000  31001.00000  2.314656323480e-05
31001.00000  32001.00000  2.214180888217e-05
32001.00000  33001.00000  2.043000517027e-05
33001.00000  34001.00000  1.853213583751e-05
34001.00000  35001.00000  1.775066022991e-05
35001.00000  36001.00000  1.670869275310e-05
36001.00000  37001.00000  1.428983968194e-05
37001.00000  38001.00000  1.492246279286e-05
38001.00000  39001.00000  1.332229845347e-05
39001.00000  40001.00000  1.268967534255e-05
40001.00000  41001.00000  1.161049474157e-05
41001.00000  42001.00000  1.161049474157e-05
42001.00000  43001.00000  1.001033040219e-05
43001.00000  44001.00000  8.484592311150e-06
44001.00000  45001.00000  1.001033040219e-05
45001.00000  46001.00000  7.926395448574e-06
46001.00000  47001.00000  8.000821696918e-06
47001.00000  48001.00000  7.703116703544e-06
48001.00000  49001.00000  7.293772337655e-06
49001.00000  50001.00000  7.107706716797e-06
50001.00000  51001.00000  6.698362350908e-06
51001.00000  52001.00000  5.321476756555e-06
52001.00000  53001.00000  6.177378612504e-06
53001.00000  54001.00000  4.986558639009e-06
54001.00000  55001.00000  5.321476756555e-06
55001.00000  56001.00000  4.763279893979e-06
56001.00000  57001.00000  4.540001148949e-06
57001.00000  58001.00000  5.023771763181e-06
58001.00000  59001.00000  4.949345514838e-06
59001.00000  60001.00000  3.981804286373e-06
60001.00000  61001.00000  4.316722403919e-06
61001.00000  62001.00000  4.688853645636e-06
62001.00000  63001.00000  4.019017410545e-06
63001.00000  64001.00000  3.870164913858e-06
64001.00000  65001.00000  3.646886168828e-06
65001.00000  66001.00000  3.014263057909e-06
66001.00000  67001.00000  2.604918692020e-06
67001.00000  68001.00000  2.344426822818e-06
68001.00000  69001.00000  3.088689306252e-06
69001.00000  70001.00000  2.642131816191e-06
70001.00000  71001.00000  2.716558064535e-06
71001.00000  72001.00000  2.642131816191e-06
72001.00000  73001.00000  2.381639946990e-06
73001.00000  74001.00000  2.046721829444e-06
74001.00000  75001.00000  2.790984312878e-06
75001.00000  76001.00000  2.046721829444e-06
76001.00000  77001.00000  2.604918692020e-06
77001.00000  78001.00000  1.972295581101e-06
78001.00000  79001.00000  2.083934953616e-06
79001.00000  80001.00000  2.456066195333e-06
80001.00000  81001.00000  1.488524966868e-06
81001.00000  82001.00000  1.600164339384e-06
82001.00000  83001.00000  1.786229960242e-06
83001.00000  84001.00000  2.009508705272e-06
84001.00000  85001.00000  2.046721829444e-06
85001.00000  86001.00000  1.674590587727e-06
86001.00000  87001.00000  1.376885594353e-06
87001.00000  88001.00000  1.749016836070e-06
88001.00000  89001.00000  1.339672470182e-06
89001.00000  90001.00000  1.302459346010e-06
90001.00000  91001.00000  1.414098718525e-06
91001.00000  92001.00000  1.860656208586e-06
92001.00000  93001.00000  1.228033097666e-06
93001.00000  94001.00000  9.303281042928e-07
94001.00000  95001.00000  1.376885594353e-06
95001.00000  96001.00000  8.931149801211e-07
96001.00000  97001.00000  1.041967476808e-06
97001.00000  98001.00000  1.562951215212e-06
98001.00000  99001.00000  8.559018559494e-07
99001.00000  100001.00000  1.153606849323e-06
100001.00000  101001.00000  9.675412284645e-07
101001.00000  102001.00000  1.339672470182e-06
102001.00000  103001.00000  7.442624834342e-07
103001.00000  104001.00000  7.070493592625e-07
104001.00000  105001.00000  1.190819973495e-06
105001.00000  106001.00000  9.675412284645e-07
106001.00000  107001.00000  7.814756076059e-07
107001.00000  108001.00000  6.326231109191e-07
108001.00000  109001.00000  7.442624834342e-07
109001.00000  110001.00000  1.041967476808e-06
110001.00000  111001.00000  5.954099867474e-07
111001.00000  112001.00000  8.559018559494e-07
112001.00000  113001.00000  4.837706142322e-07
113001.00000  114001.00000  7.442624834342e-07
114001.00000  115001.00000  8.186887317776e-07
115001.00000  116001.00000  7.442624834342e-07
116001.00000  117001.00000  8.186887317776e-07
117001.00000  118001.00000  4.465574900605e-07
118001.00000  119001.00000  7.442624834342e-07
119001.00000  120001.00000  8.559018559494e-07
120001.00000  121001.00000  7.814756076059e-07
121001.00000  122001.00000  4.837706142322e-07
122001.00000  123001.00000  4.093443658888e-07
123001.00000  124001.00000  5.954099867474e-07
124001.00000  125001.00000  5.954099867474e-07
125001.00000  126001.00000  4.837706142322e-07
126001.00000  127001.00000  5.209837384040e-07
127001.00000  128001.00000  4.093443658888e-07
128001.00000  129001.00000  3.349181175454e-07
129001.00000  130001.00000  4.837706142322e-07
130001.00000  131001.00000  7.070493592625e-07
131001.00000  132001.00000  5.581968625757e-07
132001.00000  133001.00000  3.349181175454e-07
133001.00000  134001.00000  5.581968625757e-07
134001.00000  135001.00000  1.116393725151e-07
135001.00000  136001.00000  3.349181175454e-07
136001.00000  137001.00000  4.465574900605e-07
137001.00000  138001.00000  4.093443658888e-07
138001.00000  139001.00000  3.721312417171e-07
139001.00000  140001.00000  2.604918692020e-07
140001.00000  141001.00000  3.349181175454e-07
141001.00000  142001.00000  2.977049933737e-07
142001.00000  143001.00000  4.093443658888e-07
143001.00000  144001.00000  2.232787450303e-07
144001.00000  145001.00000  4.837706142322e-07
145001.00000  146001.00000  3.721312417171e-07
146001.00000  147001.00000  2.232787450303e-07
147001.00000  148001.00000  4.465574900605e-07
148001.00000  149001.00000  5.209837384040e-07
149001.00000  150001.00000  4.093443658888e-07
150001.00000  151001.00000  1.488524966868e-07
151001.00000  152001.00000  1.116393725151e-07
152001.00000  153001.00000  3.721312417171e-07
153001.00000  154001.00000  1.116393725151e-07
154001.00000  155001.00000  2.604918692020e-07
155001.00000  156001.00000  4.093443658888e-07
156001.00000  157001.00000  1.488524966868e-07
157001.00000  158001.00000  3.721312417171e-07
158001.00000  159001.00000  2.604918692020e-07
159001.00000  160001.00000  2.232787450303e-07
160001.00000  161001.00000  2.604918692020e-07
161001.00000  162001.00000  2.232787450303e-07
162001.00000  163001.00000  3.721312417171e-07
163001.00000  164001.00000  2.977049933737e-07
164001.00000  165001.00000  3.349181175454e-07
165001.00000  166001.00000  2.232787450303e-07
166001.00000  167001.00000  1.488524966868e-07
167001.00000  168001.00000  2.232787450303e-07
168001.00000  169001.00000  2.232787450303e-07
169001.00000  170001.00000  1.488524966868e-07
170001.00000  171001.00000  1.116393725151e-07
171001.00000  172001.00000  2.977049933737e-07
172001.00000  173001.00000  2.977049933737e-07
173001.00000  174001.00000  1.860656208586e-07
174001.00000  175001.00000  2.232787450303e-07
175001.00000  176001.00000  1.488524966868e-07
176001.00000  177001.00000  1.488524966868e-07
177001.00000  178001.00000  1.860656208586e-07
178001.00000  179001.00000  2.232787450303e-07
179001.00000  180001.00000  1.116393725151e-07
180001.00000  181001.00000  1.488524966868e-07
181001.00000  182001.00000  1.860656208586e-07
182001.00000  183001.00000  2.604918692020e-07
183001.00000  184001.00000  1.488524966868e-07
184001.00000  185001.00000  0.000000000000e+00
185001.00000  186001.00000  1.860656208586e-07
186001.00000  187001.00000  2.232787450303e-07
187001.00000  188001.00000  2.232787450303e-07
188001.00000  189001.00000  2.232787450303e-07
189001.00000  190001.00000  1.860656208586e-07
190001.00000  191001.00000  3.721312417171e-08
191001.00000  192001.00000  3.721312417171e-08
192001.00000  193001.00000  1.488524966868e-07
193001.00000  194001.00000  2.977049933737e-07
194001.00000  195001.00000  1.116393725151e-07
195001.00000  196001.00000  7.442624834342e-08
196001.00000  197001.00000  1.488524966868e-07
197001.00000  198001.00000  1.116393725151e-07
198001.00000  199001.00000  7.442624834342e-08
