10001.00000  11001.00000  2.264452669156e-04
11001.00000  12001.00000  1.794066282324e-04
12001.00000  13001.00000  1.477880633807e-04
13001.00000  14001.00000  1.278828238433e-04
14001.00000  15001.00000  1.050863204626e-04
15001.00000  16001.00000  8.710859015414e-05
16001.00000  17001.00000  7.710036915771e-05
17001.00000  18001.00000  6.549824629888e-05
18001.00000  19001.00000  5.997519100826e-05
19001.00000  20001.00000  4.989283504148e-05
20001.00000  21001.00000  4.548180430601e-05
21001.00000  22001.00000  3.992168153022e-05
22001.00000  23001.00000  3.836484715300e-05
23001.00000  24001.00000  3.135909245549e-05
24001.00000  25001.00000  2.850489609725e-05
25001.00000  26001.00000  2.450160769868e-05
26001.00000  27001.00000  2.442747272833e-05
27001.00000  28001.00000  2.264823344008e-05
28001.00000  29001.00000  2.001644199287e-05
29001.00000  30001.00000  1.831133767496e-05
30001.00000  31001.00000  1.690277323842e-05
31001.00000  32001.00000  1.404857688018e-05
32001.00000  33001.00000  1.482699406879e-05
33001.00000  34001.00000  1.356669957294e-05
34001.00000  35001.00000  1.204693268089e-05
35001.00000  36001.00000  1.137971794780e-05
36001.00000  37001.00000  1.137971794780e-05
37001.00000  38001.00000  1.100904309608e-05
38001.00000  39001.00000  1.041596333333e-05
39001.00000  40001.00000  8.822061470930e-06
40001.00000  41001.00000  8.080711767491e-06
41001.00000  42001.00000  7.635901945427e-06
42001.00000  43001.00000  7.598834460255e-06
43001.00000  44001.00000  6.598012360612e-06
44001.00000  45001.00000  5.782527686828e-06
45001.00000  46001.00000  6.079067568204e-06
46001.00000  47001.00000  5.782527686828e-06
47001.00000  48001.00000  5.411852835108e-06
48001.00000  49001.00000  5.004110498217e-06
49001.00000  50001.00000  5.189447924077e-06
50001.00000  51001.00000  5.485987805452e-06
51001.00000  52001.00000  4.299828279949e-06
52001.00000  53001.00000  4.040355883745e-06
53001.00000  54001.00000  3.669681032026e-06
54001.00000  55001.00000  3.743816002370e-06
55001.00000  56001.00000  2.631791447210e-06
56001.00000  57001.00000  3.855018457885e-06
57001.00000  58001.00000  3.224871209962e-06
58001.00000  59001.00000  3.113668754446e-06
59001.00000  60001.00000  3.039533784102e-06
60001.00000  61001.00000  2.965398813758e-06
61001.00000  62001.00000  2.520588991694e-06
62001.00000  63001.00000  2.446454021350e-06
63001.00000  64001.00000  2.965398813758e-06
64001.00000  65001.00000  1.964576714115e-06
65001.00000  66001.00000  2.112846654803e-06
66001.00000  67001.00000  2.112846654803e-06
67001.00000  68001.00000  1.668036832739e-06
68001.00000  69001.00000  2.001644199287e-06
69001.00000  70001.00000  1.668036832739e-06
70001.00000  71001.00000  2.186981625147e-06
71001.00000  72001.00000  1.927509228943e-06
72001.00000  73001.00000  1.593901862395e-06
73001.00000  74001.00000  1.371496951363e-06
74001.00000  75001.00000  1.705104317911e-06
75001.00000  76001.00000  1.334429466191e-06
76001.00000  77001.00000  1.445631921707e-06
77001.00000  78001.00000  1.408564436535e-06
78001.00000  79001.00000  1.037889584815e-06
79001.00000  80001.00000  1.223227010675e-06
80001.00000  81001.00000  1.186159525503e-06
81001.00000  82001.00000  1.334429466191e-06
82001.00000  83001.00000  1.186159525503e-06
83001.00000  84001.00000  1.037889584815e-06
84001.00000  85001.00000  1.074957069987e-06
85001.00000  86001.00000  1.037889584815e-06
86001.00000  87001.00000  1.186159525503e-06
87001.00000  88001.00000  1.037889584815e-06
88001.00000  89001.00000  7.784171886115e-07
89001.00000  90001.00000  1.037889584815e-06
90001.00000  91001.00000  7.784171886115e-07
91001.00000  92001.00000  7.784171886115e-07
92001.00000  93001.00000  1.074957069987e-06
93001.00000  94001.00000  7.042822182675e-07
94001.00000  95001.00000  9.266871292994e-07
95001.00000  96001.00000  7.042822182675e-07
96001.00000  97001.00000  8.525521589554e-07
97001.00000  98001.00000  7.042822182675e-07
98001.00000  99001.00000  5.560122775796e-07
99001.00000  100001.00000  6.672147330956e-07
100001.00000  101001.00000  5.560122775796e-07
101001.00000  102001.00000  8.154846737835e-07
102001.00000  103001.00000  7.784171886115e-07
103001.00000  104001.00000  5.189447924077e-07
104001.00000  105001.00000  5.930797627516e-07
105001.00000  106001.00000  7.784171886115e-07
106001.00000  107001.00000  6.301472479236e-07
107001.00000  108001.00000  6.672147330956e-07
108001.00000  109001.00000  3.706748517198e-07
109001.00000  110001.00000  5.560122775796e-07
110001.00000  111001.00000  4.448098220637e-07
111001.00000  112001.00000  4.448098220637e-07
112001.00000  113001.00000  7.413497034395e-07
113001.00000  114001.00000  4.818773072357e-07
114001.00000  115001.00000  5.930797627516e-07
115001.00000  116001.00000  4.448098220637e-07
116001.00000  117001.00000  4.077423368917e-07
117001.00000  118001.00000  4.077423368917e-07
118001.00000  119001.00000  4.818773072357e-07
119001.00000  120001.00000  4.818773072357e-07
120001.00000  121001.00000  4.818773072357e-07
121001.00000  122001.00000  2.965398813758e-07
122001.00000  123001.00000  3.336073665478e-07
123001.00000  124001.00000  5.189447924077e-07
124001.00000  125001.00000  2.965398813758e-07
125001.00000  126001.00000  2.224049110319e-07
126001.00000  127001.00000  4.448098220637e-07
127001.00000  128001.00000  5.930797627516e-07
128001.00000  129001.00000  7.413497034395e-08
129001.00000  130001.00000  1.853374258599e-07
130001.00000  131001.00000  4.448098220637e-07
131001.00000  132001.00000  2.965398813758e-07
132001.00000  133001.00000  2.594723962038e-07
133001.00000  134001.00000  2.594723962038e-07
134001.00000  135001.00000  1.853374258599e-07
135001.00000  136001.00000  1.112024555159e-07
136001.00000  137001.00000  1.482699406879e-07
137001.00000  138001.00000  1.853374258599e-07
138001.00000  139001.00000  2.224049110319e-07
139001.00000  140001.00000  4.448098220637e-07
140001.00000  141001.00000  1.482699406879e-07
141001.00000  142001.00000  2.965398813758e-07
142001.00000  143001.00000  1.482699406879e-07
143001.00000  144001.00000  2.224049110319e-07
144001.00000  145001.00000  1.112024555159e-07
145001.00000  146001.00000  1.112024555159e-07
146001.00000  147001.00000  1.482699406879e-07
147001.00000  148001.00000  4.077423368917e-07
148001.00000  149001.00000  1.482699406879e-07
149001.00000  150001.00000  2.594723962038e-07
150001.00000  151001.00000  2.224049110319e-07
151001.00000  152001.00000  1.853374258599e-07
152001.00000  153001.00000  2.224049110319e-07
153001.00000  154001.00000  3.336073665478e-07
154001.00000  155001.00000  1.482699406879e-07
155001.00000  156001.00000  1.112024555159e-07
156001.00000  157001.00000  1.853374258599e-07
157001.00000  158001.00000  1.482699406879e-07
158001.00000  159001.00000  3.336073665478e-07
159001.00000  160001.00000  7.413497034395e-08
160001.00000  161001.00000  2.965398813758e-07
161001.00000  162001.00000  2.224049110319e-07
162001.00000  163001.00000  2.594723962038e-07
163001.00000  164001.00000  7.413497034395e-08
164001.00000  165001.00000  1.853374258599e-07
165001.00000  166001.00000  1.482699406879e-07
166001.00000  167001.00000  3.706748517198e-08
167001.00000  168001.00000  1.482699406879e-07
168001.00000  169001.00000  1.112024555159e-07
169001.00000  170001.00000  2.224049110319e-07
170001.00000  171001.00000  1.482699406879e-07
171001.00000  172001.00000  1.853374258599e-07
172001.00000  173001.00000  3.706748517198e-08
173001.00000  174001.00000  3.706748517198e-08
174001.00000  175001.00000  3.706748517198e-08
175001.00000  176001.00000  1.853374258599e-07
176001.00000  177001.00000  1.482699406879e-07
177001.00000  178001.00000  1.482699406879e-07
178001.00000  179001.00000  1.853374258599e-07
179001.00000  180001.00000  7.413497034395e-08
180001.00000  181001.00000  1.112024555159e-07
181001.00000  182001.00000  7.413497034395e-08
182001.00000  183001.00000  3.706748517198e-08
183001.00000  184001.00000  2.224049110319e-07
184001.00000  185001.00000  1.482699406879e-07
185001.00000  186001.00000  7.413497034395e-08
186001.00000  187001.00000  2.224049110319e-07
187001.00000  188001.00000  0.000000000000e+00
188001.00000  189001.00000  3.706748517198e-08
189001.00000  190001.00000  3.706748517198e-08
190001.00000  191001.00000  7.413497034395e-08
191001.00000  192001.00000  7.413497034395e-08
192001.00000  193001.00000  3.706748517198e-08
193001.00000  194001.00000  1.112024555159e-07
194001.00000  195001.00000  1.853374258599e-07
195001.00000  196001.00000  3.706748517198e-08
196001.00000  197001.00000  1.482699406879e-07
197001.00000  198001.00000  7.413497034395e-08
198001.00000  199001.00000  3.706748517198e-08
