10001.00000  11001.00000  2.427066734572e-05
11001.00000  12001.00000  2.441460013946e-05
12001.00000  13001.00000  2.533217169961e-05
13001.00000  14001.00000  2.529618850117e-05
14001.00000  15001.00000  2.570999528319e-05
15001.00000  16001.00000  2.738321401051e-05
16001.00000  17001.00000  2.387485216291e-05
17001.00000  18001.00000  2.549409609257e-05
18001.00000  19001.00000  2.362296977385e-05
19001.00000  20001.00000  2.277736461058e-05
20001.00000  21001.00000  2.101418788717e-05
21001.00000  22001.00000  2.025854072000e-05
22001.00000  23001.00000  1.854933879424e-05
23001.00000  24001.00000  1.802758241691e-05
24001.00000  25001.00000  1.660624607865e-05
25001.00000  26001.00000  1.406943058884e-05
26001.00000  27001.00000  1.433930457712e-05
27001.00000  28001.00000  1.255813625449e-05
28001.00000  29001.00000  1.174851428966e-05
29001.00000  30001.00000  1.086692592796e-05
30001.00000  31001.00000  1.030918635218e-05
31001.00000  32001.00000  9.229690399075e-06
32001.00000  33001.00000  8.581992827210e-06
33001.00000  34001.00000  7.934295255345e-06
34001.00000  35001.00000  7.178648088169e-06
35001.00000  36001.00000  7.088690092077e-06
36001.00000  37001.00000  6.189110131154e-06
37001.00000  38001.00000  6.476975718649e-06
38001.00000  39001.00000  5.451454563196e-06
39001.00000  40001.00000  5.415471364759e-06
40001.00000  41001.00000  5.037647781171e-06
41001.00000  42001.00000  4.641832598365e-06
42001.00000  43001.00000  4.767773792894e-06
43001.00000  44001.00000  4.299992213214e-06
44001.00000  45001.00000  3.868193831971e-06
45001.00000  46001.00000  3.760244236660e-06
46001.00000  47001.00000  3.454387049946e-06
47001.00000  48001.00000  3.436395450728e-06
48001.00000  49001.00000  2.896647474174e-06
49001.00000  50001.00000  2.788697878863e-06
50001.00000  51001.00000  2.680748283552e-06
51001.00000  52001.00000  2.662756684334e-06
52001.00000  53001.00000  2.320916299183e-06
53001.00000  54001.00000  2.105017108561e-06
54001.00000  55001.00000  2.123008707779e-06
55001.00000  56001.00000  2.194975104653e-06
56001.00000  57001.00000  1.961084314813e-06
57001.00000  58001.00000  1.673218727318e-06
58001.00000  59001.00000  1.583260731225e-06
59001.00000  60001.00000  1.619243929662e-06
60001.00000  61001.00000  1.439327937478e-06
61001.00000  62001.00000  1.457319536696e-06
62001.00000  63001.00000  1.385353139822e-06
63001.00000  64001.00000  1.385353139822e-06
64001.00000  65001.00000  1.277403544511e-06
65001.00000  66001.00000  1.403344739041e-06
66001.00000  67001.00000  1.223428746856e-06
67001.00000  68001.00000  9.895379570158e-07
68001.00000  69001.00000  1.043512754671e-06
69001.00000  70001.00000  1.115479151545e-06
70001.00000  71001.00000  7.196639687388e-07
71001.00000  72001.00000  8.456051632681e-07
72001.00000  73001.00000  9.535547585789e-07
73001.00000  74001.00000  9.895379570158e-07
74001.00000  75001.00000  7.196639687388e-07
75001.00000  76001.00000  8.276135640496e-07
76001.00000  77001.00000  6.476975718649e-07
77001.00000  78001.00000  6.117143734280e-07
78001.00000  79001.00000  6.836807703018e-07
79001.00000  80001.00000  6.476975718649e-07
80001.00000  81001.00000  4.857731788987e-07
81001.00000  82001.00000  8.456051632681e-07
82001.00000  83001.00000  7.916303656127e-07
83001.00000  84001.00000  6.656891710834e-07
84001.00000  85001.00000  5.937227742095e-07
85001.00000  86001.00000  5.397479765541e-07
86001.00000  87001.00000  4.857731788987e-07
87001.00000  88001.00000  4.497899804617e-07
88001.00000  89001.00000  4.857731788987e-07
89001.00000  90001.00000  3.778235835879e-07
90001.00000  91001.00000  4.497899804617e-07
91001.00000  92001.00000  4.138067820248e-07
92001.00000  93001.00000  5.217563773356e-07
93001.00000  94001.00000  4.497899804617e-07
94001.00000  95001.00000  3.238487859325e-07
95001.00000  96001.00000  3.418403851509e-07
96001.00000  97001.00000  3.238487859325e-07
97001.00000  98001.00000  1.799159921847e-07
98001.00000  99001.00000  3.238487859325e-07
99001.00000  100001.00000  2.158991906216e-07
100001.00000  101001.00000  2.698739882770e-07
101001.00000  102001.00000  1.799159921847e-07
102001.00000  103001.00000  1.979075914032e-07
103001.00000  104001.00000  2.698739882770e-07
104001.00000  105001.00000  1.619243929662e-07
105001.00000  106001.00000  2.158991906216e-07
106001.00000  107001.00000  5.397479765541e-08
107001.00000  108001.00000  1.799159921847e-07
108001.00000  109001.00000  1.979075914032e-07
109001.00000  110001.00000  2.158991906216e-07
110001.00000  111001.00000  1.979075914032e-07
111001.00000  112001.00000  1.079495953108e-07
112001.00000  113001.00000  1.439327937478e-07
113001.00000  114001.00000  1.799159921847e-07
114001.00000  115001.00000  1.439327937478e-07
115001.00000  116001.00000  1.979075914032e-07
116001.00000  117001.00000  1.259411945293e-07
117001.00000  118001.00000  1.439327937478e-07
118001.00000  119001.00000  1.259411945293e-07
119001.00000  120001.00000  1.259411945293e-07
120001.00000  121001.00000  1.619243929662e-07
121001.00000  122001.00000  5.397479765541e-08
122001.00000  123001.00000  2.518823890586e-07
123001.00000  124001.00000  7.196639687388e-08
124001.00000  125001.00000  5.397479765541e-08
125001.00000  126001.00000  1.979075914032e-07
126001.00000  127001.00000  1.439327937478e-07
127001.00000  128001.00000  1.979075914032e-07
128001.00000  129001.00000  1.439327937478e-07
129001.00000  130001.00000  8.995799609235e-08
130001.00000  131001.00000  3.598319843694e-08
131001.00000  132001.00000  1.439327937478e-07
132001.00000  133001.00000  8.995799609235e-08
133001.00000  134001.00000  7.196639687388e-08
134001.00000  135001.00000  5.397479765541e-08
135001.00000  136001.00000  8.995799609235e-08
136001.00000  137001.00000  5.397479765541e-08
137001.00000  138001.00000  5.397479765541e-08
138001.00000  139001.00000  5.397479765541e-08
139001.00000  140001.00000  7.196639687388e-08
140001.00000  141001.00000  1.079495953108e-07
141001.00000  142001.00000  7.196639687388e-08
142001.00000  143001.00000  5.397479765541e-08
143001.00000  144001.00000  8.995799609235e-08
144001.00000  145001.00000  3.598319843694e-08
145001.00000  146001.00000  5.397479765541e-08
146001.00000  147001.00000  1.079495953108e-07
147001.00000  148001.00000  5.397479765541e-08
148001.00000  149001.00000  5.397479765541e-08
149001.00000  150001.00000  5.397479765541e-08
150001.00000  151001.00000  3.598319843694e-08
151001.00000  152001.00000  3.598319843694e-08
152001.00000  153001.00000  1.799159921847e-08
153001.00000  154001.00000  0.000000000000e+00
154001.00000  155001.00000  1.799159921847e-08
155001.00000  156001.00000  3.598319843694e-08
156001.00000  157001.00000  0.000000000000e+00
157001.00000  158001.00000  1.799159921847e-08
158001.00000  159001.00000  1.799159921847e-08
159001.00000  160001.00000  3.598319843694e-08
160001.00000  161001.00000  5.397479765541e-08
161001.00000  162001.00000  1.799159921847e-08
162001.00000  163001.00000  7.196639687388e-08
163001.00000  164001.00000  0.000000000000e+00
164001.00000  165001.00000  5.397479765541e-08
165001.00000  166001.00000  1.799159921847e-08
166001.00000  167001.00000  0.000000000000e+00
167001.00000  168001.00000  0.000000000000e+00
168001.00000  169001.00000  0.000000000000e+00
169001.00000  170001.00000  1.799159921847e-08
170001.00000  171001.00000  5.397479765541e-08
171001.00000  172001.00000  0.000000000000e+00
172001.00000  173001.00000  0.000000000000e+00
173001.00000  174001.00000  0.000000000000e+00
174001.00000  175001.00000  0.000000000000e+00
175001.00000  176001.00000  0.000000000000e+00
176001.00000  177001.00000  0.000000000000e+00
177001.00000  178001.00000  0.000000000000e+00
178001.00000  179001.00000  1.799159921847e-08
179001.00000  180001.00000  0.000000000000e+00
180001.00000  181001.00000  0.000000000000e+00
181001.00000  182001.00000  0.000000000000e+00
182001.00000  183001.00000  0.000000000000e+00
183001.00000  184001.00000  0.000000000000e+00
184001.00000  185001.00000  0.000000000000e+00
185001.00000  186001.00000  0.000000000000e+00
186001.00000  187001.00000  0.000000000000e+00
187001.00000  188001.00000  0.000000000000e+00
188001.00000  189001.00000  0.000000000000e+00
189001.00000  190001.00000  0.000000000000e+00
190001.00000  191001.00000  0.000000000000e+00
191001.00000  192001.00000  0.000000000000e+00
192001.00000  193001.00000  0.000000000000e+00
193001.00000  194001.00000  0.000000000000e+00
194001.00000  195001.00000  0.000000000000e+00
195001.00000  196001.00000  0.000000000000e+00
196001.00000  197001.00000  0.000000000000e+00
197001.00000  198001.00000  0.000000000000e+00
198001.00000  199001.00000  0.000000000000e+00
