300.00000  350.00000  1.405549414375e-06
350.00000  400.00000  3.212684375715e-06
400.00000  450.00000  5.220612110536e-06
450.00000  500.00000  3.011891602233e-06
500.00000  550.00000  4.557995958045e-05
550.00000  600.00000  4.015855469643e-06
600.00000  650.00000  1.405549414375e-05
650.00000  700.00000  4.819026563572e-06
700.00000  750.00000  8.834882033215e-06
750.00000  800.00000  5.019819337054e-06
800.00000  850.00000  2.329196172393e-05
850.00000  900.00000  5.822990430983e-06
900.00000  950.00000  3.614269922679e-06
950.00000  1000.00000  4.015855469643e-06
1000.00000  1050.00000  3.413477149197e-06
1050.00000  1100.00000  3.614269922679e-06
1100.00000  1150.00000  5.622197657501e-06
1150.00000  1200.00000  5.622197657501e-06
1200.00000  1250.00000  1.064201699455e-05
1250.00000  1300.00000  3.393397871849e-05
1300.00000  1350.00000  1.766976406643e-05
1350.00000  1400.00000  2.710702442009e-05
1400.00000  1450.00000  4.497758126001e-05
1450.00000  1500.00000  7.610046114974e-05
1500.00000  1550.00000  1.114399892826e-04
1550.00000  1600.00000  1.700714791394e-04
1600.00000  1650.00000  2.268958340349e-04
1650.00000  1700.00000  3.208668520245e-04
1700.00000  1750.00000  4.692527116278e-04
1750.00000  1800.00000  5.467587221919e-04
1800.00000  1850.00000  6.280797954522e-04
1850.00000  1900.00000  6.324972364688e-04
1900.00000  1950.00000  7.935330408015e-04
1950.00000  2000.00000  9.417181076314e-04
2000.00000  2050.00000  1.094320615478e-03
2050.00000  2100.00000  1.233670800274e-03
2100.00000  2150.00000  1.369205922375e-03
2150.00000  2200.00000  1.512772755415e-03
2200.00000  2250.00000  1.674210145294e-03
2250.00000  2300.00000  1.849301443771e-03
2300.00000  2350.00000  2.079610754955e-03
2350.00000  2400.00000  2.088646429762e-03
2400.00000  2450.00000  2.273174988592e-03
2450.00000  2500.00000  2.217153804790e-03
2500.00000  2550.00000  2.246871135265e-03
2550.00000  2600.00000  2.357708746228e-03
2600.00000  2650.00000  2.449872629256e-03
2650.00000  2700.00000  2.548662673809e-03
2700.00000  2750.00000  2.615526667379e-03
2750.00000  2800.00000  2.707690550407e-03
2800.00000  2850.00000  2.793027479137e-03
2850.00000  2900.00000  2.837201889303e-03
2900.00000  2950.00000  2.900652405723e-03
2950.00000  3000.00000  3.013297151647e-03
3000.00000  3050.00000  2.952657734055e-03
3050.00000  3100.00000  3.048636679780e-03
3100.00000  3150.00000  3.042813689349e-03
3150.00000  3200.00000  3.106665791316e-03
3200.00000  3250.00000  3.020927277039e-03
3250.00000  3300.00000  3.082972244045e-03
3300.00000  3350.00000  3.127347446985e-03
3350.00000  3400.00000  3.103252314167e-03
3400.00000  3450.00000  3.082771451272e-03
3450.00000  3500.00000  3.159675083515e-03
3500.00000  3550.00000  3.165899659493e-03
3550.00000  3600.00000  3.127949825305e-03
3600.00000  3650.00000  3.161683011250e-03
3650.00000  3700.00000  3.171321064377e-03
3700.00000  3750.00000  3.142005319449e-03
3750.00000  3800.00000  3.177947225902e-03
3800.00000  3850.00000  3.139796598941e-03
3850.00000  3900.00000  3.105059449128e-03
3900.00000  3950.00000  3.130560131360e-03
3950.00000  4000.00000  3.086184928421e-03
4000.00000  4050.00000  3.031167708487e-03
4050.00000  4100.00000  2.995828180354e-03
4100.00000  4150.00000  2.967717192066e-03
4150.00000  4200.00000  2.988198054962e-03
4200.00000  4250.00000  2.919125340884e-03
4250.00000  4300.00000  2.861096229347e-03
4300.00000  4350.00000  2.853064518408e-03
4350.00000  4400.00000  2.888805632088e-03
4400.00000  4450.00000  2.847843906298e-03
4450.00000  4500.00000  2.828166214496e-03
4500.00000  4550.00000  2.784794975424e-03
4550.00000  4600.00000  2.794433028551e-03
4600.00000  4650.00000  2.745439591822e-03
4650.00000  4700.00000  2.681386697081e-03
4700.00000  4750.00000  2.725159521700e-03
4750.00000  4800.00000  2.633598016992e-03
4800.00000  4850.00000  2.625967891600e-03
4850.00000  4900.00000  2.634802773633e-03
4900.00000  4950.00000  2.575167319909e-03
4950.00000  5000.00000  2.501074786494e-03
5000.00000  5050.00000  2.540229377323e-03
5050.00000  5100.00000  2.458506718516e-03
5100.00000  5150.00000  2.476578068129e-03
5150.00000  5200.00000  2.396461751510e-03
5200.00000  5250.00000  2.430596523002e-03
5250.00000  5300.00000  2.399473643112e-03
5300.00000  5350.00000  2.357507953454e-03
5350.00000  5400.00000  2.355299232946e-03
5400.00000  5450.00000  2.311927993874e-03
5450.00000  5500.00000  2.259119494448e-03
5500.00000  5550.00000  2.260725836636e-03
5550.00000  5600.00000  2.196070563574e-03
5600.00000  5650.00000  2.210929228812e-03
5650.00000  5700.00000  2.170971466889e-03
5700.00000  5750.00000  2.147880297939e-03
5750.00000  5800.00000  2.135029560436e-03
5800.00000  5850.00000  2.073185386203e-03
5850.00000  5900.00000  2.120572480745e-03
5900.00000  5950.00000  2.086839294800e-03
5950.00000  6000.00000  2.061137819794e-03
6000.00000  6050.00000  2.037444272524e-03
6050.00000  6100.00000  1.961946189694e-03
6100.00000  6150.00000  1.993872240678e-03
6150.00000  6200.00000  1.923393977186e-03
6200.00000  6250.00000  1.949296244965e-03
6250.00000  6300.00000  1.900503601009e-03
6300.00000  6350.00000  1.891869511749e-03
6350.00000  6400.00000  2.467943978869e-03
6400.00000  6450.00000  1.839462597870e-03
6450.00000  6500.00000  1.838458634003e-03
6500.00000  6550.00000  1.805930204699e-03
6550.00000  6600.00000  1.753724083593e-03
6600.00000  6650.00000  1.785449341803e-03
6650.00000  6700.00000  1.740471760543e-03
6700.00000  6750.00000  1.706939367372e-03
6750.00000  6800.00000  1.681237892366e-03
6800.00000  6850.00000  1.697903692565e-03
6850.00000  6900.00000  1.672403010333e-03
6900.00000  6950.00000  1.666580019902e-03
6950.00000  7000.00000  1.615779448211e-03
7000.00000  7050.00000  1.632646041184e-03
7050.00000  7100.00000  1.694891800963e-03
7100.00000  7150.00000  1.481248289978e-03
7150.00000  7200.00000  1.407557342110e-03
7200.00000  7250.00000  1.448117482353e-03
7250.00000  7300.00000  1.438680222000e-03
7300.00000  7350.00000  1.369205922375e-03
7350.00000  7400.00000  1.393100262419e-03
7400.00000  7450.00000  1.351335365535e-03
7450.00000  7500.00000  1.387277271988e-03
7500.00000  7550.00000  1.350331401668e-03
7550.00000  7600.00000  1.319409314551e-03
7600.00000  7650.00000  1.312180774706e-03
7650.00000  7700.00000  1.299530829977e-03
7700.00000  7750.00000  1.294109425093e-03
7750.00000  7800.00000  1.315393459082e-03
7800.00000  7850.00000  1.274833318838e-03
7850.00000  7900.00000  1.245517573910e-03
7900.00000  7950.00000  1.240096169026e-03
7950.00000  8000.00000  1.244112024496e-03
8000.00000  8050.00000  1.264392094617e-03
8050.00000  8100.00000  1.231863665313e-03
8100.00000  8150.00000  1.225036711015e-03
8150.00000  8200.00000  1.211182009644e-03
8200.00000  8250.00000  1.192106696164e-03
8250.00000  8300.00000  1.177850409246e-03
8300.00000  8350.00000  1.185078949092e-03
8350.00000  8400.00000  1.141707710020e-03
8400.00000  8450.00000  1.131868864119e-03
8450.00000  8500.00000  1.106368181887e-03
8500.00000  8550.00000  1.128455386970e-03
8550.00000  8600.00000  1.093718237157e-03
8600.00000  8650.00000  1.088899210594e-03
8650.00000  8700.00000  1.072835788715e-03
8700.00000  8750.00000  1.078257193599e-03
8750.00000  8800.00000  1.097332507080e-03
8800.00000  8850.00000  1.035889918395e-03
8850.00000  8900.00000  1.039303395544e-03
8900.00000  8950.00000  1.053158096914e-03
8950.00000  9000.00000  1.040508152185e-03
9000.00000  9050.00000  1.034283576207e-03
9050.00000  9100.00000  1.001955939676e-03
9100.00000  9150.00000  1.000550390262e-03
9150.00000  9200.00000  9.850893467035e-04
9200.00000  9250.00000  1.002558317996e-03
9250.00000  9300.00000  9.644076910349e-04
9300.00000  9350.00000  9.579823222834e-04
9350.00000  9400.00000  9.469387197419e-04
9400.00000  9450.00000  9.611950066591e-04
9450.00000  9500.00000  9.356943244269e-04
9500.00000  9550.00000  9.250523074324e-04
9550.00000  9600.00000  9.501514041176e-04
9600.00000  9650.00000  9.447299992336e-04
9650.00000  9700.00000  9.302729195429e-04
9700.00000  9750.00000  9.071817505924e-04
9750.00000  9800.00000  8.885080226586e-04
9800.00000  9850.00000  8.919214998078e-04
9850.00000  9900.00000  8.939294275426e-04
9900.00000  9950.00000  8.820826539072e-04
9950.00000  10000.00000  8.678263669899e-04
