300.00000  350.00000  5.645637119699e-01
350.00000  400.00000  4.236024149992e-01
400.00000  450.00000  3.292859607588e-01
450.00000  500.00000  2.631228785611e-01
500.00000  550.00000  2.157359652741e-01
550.00000  600.00000  1.794262388709e-01
600.00000  650.00000  1.516310585776e-01
650.00000  700.00000  1.297845727382e-01
700.00000  750.00000  1.127394261072e-01
750.00000  800.00000  9.818342672373e-02
800.00000  850.00000  8.699599955052e-02
850.00000  900.00000  7.742293260305e-02
900.00000  950.00000  6.895476590291e-02
950.00000  1000.00000  6.235675971178e-02
1000.00000  1050.00000  5.644124437410e-02
1050.00000  1100.00000  5.114756989243e-02
1100.00000  1150.00000  4.668622743434e-02
1150.00000  1200.00000  4.286920200778e-02
1200.00000  1250.00000  3.942035774209e-02
1250.00000  1300.00000  3.647027051410e-02
1300.00000  1350.00000  3.368786269078e-02
1350.00000  1400.00000  3.124188397085e-02
1400.00000  1450.00000  2.901246141822e-02
1450.00000  1500.00000  2.713302502723e-02
1500.00000  1550.00000  2.544231715767e-02
1550.00000  1600.00000  2.377515575769e-02
1600.00000  1650.00000  2.225783552784e-02
1650.00000  1700.00000  2.106088999031e-02
1700.00000  1750.00000  2.000986121129e-02
1750.00000  1800.00000  1.863917126935e-02
1800.00000  1850.00000  1.774369189551e-02
1850.00000  1900.00000  1.678720575956e-02
1900.00000  1950.00000  1.599269079321e-02
1950.00000  2000.00000  1.513110406499e-02
2000.00000  2050.00000  1.436869792082e-02
2050.00000  2100.00000  1.382819941430e-02
2100.00000  2150.00000  1.306222562321e-02
2150.00000  2200.00000  1.249247241205e-02
2200.00000  2250.00000  1.204972743080e-02
2250.00000  2300.00000  1.150316392454e-02
2300.00000  2350.00000  1.092199424327e-02
2350.00000  2400.00000  1.044071867542e-02
2400.00000  2450.00000  1.010928427770e-02
2450.00000  2500.00000  9.631219592063e-03
2500.00000  2550.00000  9.194896375250e-03
2550.00000  2600.00000  8.875235212319e-03
2600.00000  2650.00000  8.579477283669e-03
2650.00000  2700.00000  8.252680826923e-03
2700.00000  2750.00000  8.011864660652e-03
2750.00000  2800.00000  7.663305557769e-03
2800.00000  2850.00000  7.315103219576e-03
2850.00000  2900.00000  7.191662636569e-03
2900.00000  2950.00000  6.846314415902e-03
2950.00000  3000.00000  6.701111186758e-03
3000.00000  3050.00000  6.494544430802e-03
3050.00000  3100.00000  6.260863558346e-03
3100.00000  3150.00000  6.055010331771e-03
3150.00000  3200.00000  5.882692986129e-03
3200.00000  3250.00000  5.633314467280e-03
3250.00000  3300.00000  5.537701530153e-03
3300.00000  3350.00000  5.294388011047e-03
3350.00000  3400.00000  5.270128012074e-03
3400.00000  3450.00000  5.023603610751e-03
3450.00000  3500.00000  4.913720085994e-03
3500.00000  3550.00000  4.728915976174e-03
3550.00000  3600.00000  4.612253922292e-03
3600.00000  3650.00000  4.470261575365e-03
3650.00000  3700.00000  4.392486872777e-03
3700.00000  3750.00000  4.247640408324e-03
3750.00000  3800.00000  4.154881588723e-03
3800.00000  3850.00000  3.998261889475e-03
3850.00000  3900.00000  3.983277772462e-03
3900.00000  3950.00000  3.823090426306e-03
3950.00000  4000.00000  3.740321018047e-03
4000.00000  4050.00000  3.693228078865e-03
4050.00000  4100.00000  3.523764850749e-03
4100.00000  4150.00000  3.521267497913e-03
4150.00000  4200.00000  3.392832209236e-03
4200.00000  4250.00000  3.317198094792e-03
4250.00000  4300.00000  3.261899567722e-03
4300.00000  4350.00000  3.175562512556e-03
4350.00000  4400.00000  3.079592810738e-03
4400.00000  4450.00000  3.063538399654e-03
4450.00000  4500.00000  2.973276932888e-03
4500.00000  4550.00000  2.855901349625e-03
4550.00000  4600.00000  2.745304295486e-03
4600.00000  4650.00000  2.761715471261e-03
4650.00000  4700.00000  2.720687531822e-03
4700.00000  4750.00000  2.672167533877e-03
4750.00000  4800.00000  2.643983123306e-03
4800.00000  4850.00000  2.561213715048e-03
4850.00000  4900.00000  2.518045187464e-03
4900.00000  4950.00000  2.402453427654e-03
4950.00000  5000.00000  2.397458721983e-03
5000.00000  5050.00000  2.329673430737e-03
5050.00000  5100.00000  2.302559314238e-03
5100.00000  5150.00000  2.247260787169e-03
5150.00000  5200.00000  2.204805788967e-03
5200.00000  5250.00000  2.248331081241e-03
5250.00000  5300.00000  2.130598733287e-03
5300.00000  5350.00000  2.082435500032e-03
5350.00000  5400.00000  2.091711381992e-03
5400.00000  5450.00000  2.095279028900e-03
5450.00000  5500.00000  1.958638152335e-03
5500.00000  5550.00000  1.968627563676e-03
5550.00000  5600.00000  1.961492269861e-03
5600.00000  5650.00000  1.904766684028e-03
5650.00000  5700.00000  1.890496096397e-03
5700.00000  5750.00000  1.803802276540e-03
5750.00000  5800.00000  1.763487866483e-03
5800.00000  5850.00000  1.723530221116e-03
5850.00000  5900.00000  1.722103162353e-03
5900.00000  5950.00000  1.686426693276e-03
5950.00000  6000.00000  1.677507576007e-03
6000.00000  6050.00000  1.670729046882e-03
6050.00000  6100.00000  1.602586990945e-03
6100.00000  6150.00000  1.617214343267e-03
6150.00000  6200.00000  1.535871993771e-03
6200.00000  6250.00000  1.569051110012e-03
6250.00000  6300.00000  1.569051110012e-03
6300.00000  6350.00000  1.503049642220e-03
6350.00000  6400.00000  2.081008441269e-03
6400.00000  6450.00000  1.417069351744e-03
6450.00000  6500.00000  1.419209939888e-03
6500.00000  6550.00000  1.419209939888e-03
6550.00000  6600.00000  1.393166117462e-03
6600.00000  6650.00000  1.373187294779e-03
6650.00000  6700.00000  1.368192589108e-03
6700.00000  6750.00000  1.311467003275e-03
6750.00000  6800.00000  1.367479059727e-03
6800.00000  6850.00000  1.307185826986e-03
6850.00000  6900.00000  1.301477591934e-03
6900.00000  6950.00000  1.225843477490e-03
6950.00000  7000.00000  1.274006710744e-03
7000.00000  7050.00000  1.228340830326e-03
7050.00000  7100.00000  1.245822300174e-03
7100.00000  7150.00000  1.134511716653e-03
7150.00000  7200.00000  1.158771715625e-03
7200.00000  7250.00000  1.123452011239e-03
7250.00000  7300.00000  1.106684070773e-03
7300.00000  7350.00000  1.122381717167e-03
7350.00000  7400.00000  1.079926718965e-03
7400.00000  7450.00000  1.071364366386e-03
7450.00000  7500.00000  1.085634954017e-03
7500.00000  7550.00000  1.063515543189e-03
7550.00000  7600.00000  1.050315249631e-03
7600.00000  7650.00000  1.034617603237e-03
7650.00000  7700.00000  1.008217016120e-03
7700.00000  7750.00000  1.020347015606e-03
7750.00000  7800.00000  9.932328991074e-04
7800.00000  7850.00000  9.361505485840e-04
7850.00000  7900.00000  9.497076068333e-04
7900.00000  7950.00000  9.343667251302e-04
7950.00000  8000.00000  9.529184890503e-04
8000.00000  8050.00000  9.290152547686e-04
8050.00000  8100.00000  8.844196684222e-04
8100.00000  8150.00000  8.772843746068e-04
8150.00000  8200.00000  8.901279034745e-04
8200.00000  8250.00000  8.458890818189e-04
8250.00000  8300.00000  8.515973168712e-04
8300.00000  8350.00000  8.615867282128e-04
8350.00000  8400.00000  8.501702581081e-04
8400.00000  8450.00000  8.191317300110e-04
8450.00000  8500.00000  8.055746717617e-04
8500.00000  8550.00000  8.330455529511e-04
8550.00000  8600.00000  8.055746717617e-04
8600.00000  8650.00000  7.998664367094e-04
8650.00000  8700.00000  7.991529073278e-04
8700.00000  8750.00000  7.913040841309e-04
8750.00000  8800.00000  7.938014369663e-04
8800.00000  8850.00000  7.823849668616e-04
8850.00000  8900.00000  7.238755575751e-04
8900.00000  8950.00000  7.556276150537e-04
8950.00000  9000.00000  7.427840861860e-04
9000.00000  9050.00000  7.128158521612e-04
9050.00000  9100.00000  7.220917341212e-04
9100.00000  9150.00000  7.067508524180e-04
9150.00000  9200.00000  7.260161457197e-04
9200.00000  9250.00000  6.935505588595e-04
9250.00000  9300.00000  6.889126178795e-04
9300.00000  9350.00000  6.746420302486e-04
9350.00000  9400.00000  6.564470310193e-04
9400.00000  9450.00000  6.436035021515e-04
9450.00000  9500.00000  6.336140908099e-04
9500.00000  9550.00000  6.400358552438e-04
9550.00000  9600.00000  6.346843848822e-04
9600.00000  9650.00000  6.507387959669e-04
9650.00000  9700.00000  6.200570325606e-04
9700.00000  9750.00000  6.254085029222e-04
9750.00000  9800.00000  6.100676212190e-04
9800.00000  9850.00000  6.150623268898e-04
9850.00000  9900.00000  6.179164444160e-04
9900.00000  9950.00000  6.093540918375e-04
9950.00000  10000.00000  5.904455632266e-04
