300.00000  350.00000  1.338594051938e-05
350.00000  400.00000  2.387762362916e-05
400.00000  450.00000  1.736554445757e-05
450.00000  500.00000  2.315405927676e-05
500.00000  550.00000  1.939152464429e-04
550.00000  600.00000  1.917445533857e-05
600.00000  650.00000  5.318197990132e-05
650.00000  700.00000  2.894257409595e-05
700.00000  750.00000  4.160495026293e-05
750.00000  800.00000  2.749544539116e-05
800.00000  850.00000  1.096199993884e-04
850.00000  900.00000  2.423940580536e-05
900.00000  950.00000  2.206871274817e-05
950.00000  1000.00000  1.953623751477e-05
1000.00000  1050.00000  2.134514839577e-05
1050.00000  1100.00000  2.170693057197e-05
1100.00000  1150.00000  2.532475233396e-05
1150.00000  1200.00000  2.279227710056e-05
1200.00000  1250.00000  2.821900974356e-05
1250.00000  1300.00000  9.189267275466e-05
1300.00000  1350.00000  2.243049492436e-05
1350.00000  1400.00000  3.183683150555e-05
1400.00000  1450.00000  3.075148497695e-05
1450.00000  1500.00000  4.015782155814e-05
1500.00000  1550.00000  4.196673243913e-05
1550.00000  1600.00000  3.509287109135e-05
1600.00000  1650.00000  3.653999979614e-05
1650.00000  1700.00000  3.328396021035e-05
1700.00000  1750.00000  1.193881181458e-04
1750.00000  1800.00000  4.232851461533e-05
1800.00000  1850.00000  3.581643544374e-05
1850.00000  1900.00000  3.726356414854e-05
1900.00000  1950.00000  3.690178197234e-05
1950.00000  2000.00000  4.088138591054e-05
2000.00000  2050.00000  3.907247502954e-05
2050.00000  2100.00000  3.617821761994e-05
2100.00000  2150.00000  4.232851461533e-05
2150.00000  2200.00000  4.196673243913e-05
2200.00000  2250.00000  3.690178197234e-05
2250.00000  2300.00000  4.775524725833e-05
2300.00000  2350.00000  1.439893061274e-04
2350.00000  2400.00000  4.884059378692e-05
2400.00000  2450.00000  4.594633637733e-05
2450.00000  2500.00000  4.739346508213e-05
2500.00000  2550.00000  5.245841554892e-05
2550.00000  2600.00000  4.558455420113e-05
2600.00000  2650.00000  4.956415813932e-05
2650.00000  2700.00000  4.305207896773e-05
2700.00000  2750.00000  5.101128684412e-05
2750.00000  2800.00000  4.666990072973e-05
2800.00000  2850.00000  5.571445513471e-05
2850.00000  2900.00000  5.426732642992e-05
2900.00000  2950.00000  5.535267295851e-05
2950.00000  3000.00000  1.002136628072e-04
3000.00000  3050.00000  5.716158383951e-05
3050.00000  3100.00000  5.028772249172e-05
3100.00000  3150.00000  5.426732642992e-05
3150.00000  3200.00000  5.752336601571e-05
3200.00000  3250.00000  4.739346508213e-05
3250.00000  3300.00000  6.186475213010e-05
3300.00000  3350.00000  6.114118777770e-05
3350.00000  3400.00000  6.077940560151e-05
3400.00000  3450.00000  6.114118777770e-05
3450.00000  3500.00000  6.186475213010e-05
3500.00000  3550.00000  6.041762342531e-05
3550.00000  3600.00000  6.186475213010e-05
3600.00000  3650.00000  6.512079171590e-05
3650.00000  3700.00000  1.114289102694e-04
3700.00000  3750.00000  6.258831648250e-05
3750.00000  3800.00000  6.295009865870e-05
3800.00000  3850.00000  6.439722736350e-05
3850.00000  3900.00000  6.403544518730e-05
3900.00000  3950.00000  6.331188083490e-05
3950.00000  4000.00000  6.910039565409e-05
4000.00000  4050.00000  5.933227689671e-05
4050.00000  4100.00000  7.127108871129e-05
4100.00000  4150.00000  6.765326694929e-05
4150.00000  4200.00000  7.995386094008e-05
4200.00000  4250.00000  7.633603917808e-05
4250.00000  4300.00000  6.367366301110e-05
4300.00000  4350.00000  7.597425700188e-05
4350.00000  4400.00000  7.127108871129e-05
4400.00000  4450.00000  6.946217783029e-05
4450.00000  4500.00000  7.778316788288e-05
4500.00000  4550.00000  8.465702923067e-05
4550.00000  4600.00000  8.031564311627e-05
4600.00000  4650.00000  7.488891047328e-05
4650.00000  4700.00000  7.163287088749e-05
4700.00000  4750.00000  7.814495005908e-05
4750.00000  4800.00000  8.538059358307e-05
4800.00000  4850.00000  8.465702923067e-05
4850.00000  4900.00000  7.633603917808e-05
4900.00000  4950.00000  7.235643523989e-05
4950.00000  5000.00000  7.054752435889e-05
5000.00000  5050.00000  8.031564311627e-05
5050.00000  5100.00000  8.610415793547e-05
5100.00000  5150.00000  7.814495005908e-05
5150.00000  5200.00000  8.972197969746e-05
5200.00000  5250.00000  7.633603917808e-05
5250.00000  5300.00000  7.850673223528e-05
5300.00000  5350.00000  7.959207876388e-05
5350.00000  5400.00000  7.597425700188e-05
5400.00000  5450.00000  9.189267275466e-05
5450.00000  5500.00000  7.525069264948e-05
5500.00000  5550.00000  8.031564311627e-05
5550.00000  5600.00000  7.705960353048e-05
5600.00000  5650.00000  8.682772228786e-05
5650.00000  5700.00000  8.067742529247e-05
5700.00000  5750.00000  8.357168270207e-05
5750.00000  5800.00000  7.488891047328e-05
5800.00000  5850.00000  7.742138570668e-05
5850.00000  5900.00000  8.574237575927e-05
5900.00000  5950.00000  7.886851441148e-05
5950.00000  6000.00000  8.248633617347e-05
6000.00000  6050.00000  7.235643523989e-05
6050.00000  6100.00000  7.488891047328e-05
6100.00000  6150.00000  7.995386094008e-05
6150.00000  6200.00000  8.320990052587e-05
6200.00000  6250.00000  9.514871234045e-05
6250.00000  6300.00000  1.327740586652e-04
6300.00000  6350.00000  1.277091081984e-04
6350.00000  6400.00000  1.051339004036e-03
6400.00000  6450.00000  7.886851441148e-05
6450.00000  6500.00000  7.488891047328e-05
6500.00000  6550.00000  7.054752435889e-05
6550.00000  6600.00000  7.705960353048e-05
6600.00000  6650.00000  6.873861347789e-05
6650.00000  6700.00000  7.452712829708e-05
6700.00000  6750.00000  6.946217783029e-05
6750.00000  6800.00000  7.452712829708e-05
6800.00000  6850.00000  8.791306881646e-05
6850.00000  6900.00000  7.525069264948e-05
6900.00000  6950.00000  8.610415793547e-05
6950.00000  7000.00000  7.163287088749e-05
7000.00000  7050.00000  7.307999959229e-05
7050.00000  7100.00000  1.769114841615e-04
7100.00000  7150.00000  4.739346508213e-05
7150.00000  7200.00000  4.920237596312e-05
7200.00000  7250.00000  4.666990072973e-05
7250.00000  7300.00000  4.630811855353e-05
7300.00000  7350.00000  4.992594031552e-05
7350.00000  7400.00000  4.956415813932e-05
7400.00000  7450.00000  4.775524725833e-05
7450.00000  7500.00000  8.429524705447e-05
7500.00000  7550.00000  3.943425720574e-05
7550.00000  7600.00000  4.449920767253e-05
7600.00000  7650.00000  4.269029679153e-05
7650.00000  7700.00000  4.920237596312e-05
7700.00000  7750.00000  4.666990072973e-05
7750.00000  7800.00000  4.305207896773e-05
7800.00000  7850.00000  4.160495026293e-05
7850.00000  7900.00000  4.341386114393e-05
7900.00000  7950.00000  4.594633637733e-05
7950.00000  8000.00000  4.739346508213e-05
8000.00000  8050.00000  5.028772249172e-05
8050.00000  8100.00000  4.594633637733e-05
8100.00000  8150.00000  5.462910860611e-05
8150.00000  8200.00000  4.413742549633e-05
8200.00000  8250.00000  3.871069285334e-05
8250.00000  8300.00000  4.305207896773e-05
8300.00000  8350.00000  4.232851461533e-05
8350.00000  8400.00000  4.196673243913e-05
8400.00000  8450.00000  3.762534632474e-05
8450.00000  8500.00000  4.160495026293e-05
8500.00000  8550.00000  3.943425720574e-05
8550.00000  8600.00000  4.015782155814e-05
8600.00000  8650.00000  4.124316808674e-05
8650.00000  8700.00000  4.449920767253e-05
8700.00000  8750.00000  4.269029679153e-05
8750.00000  8800.00000  4.124316808674e-05
8800.00000  8850.00000  3.762534632474e-05
8850.00000  8900.00000  4.124316808674e-05
8900.00000  8950.00000  4.739346508213e-05
8950.00000  9000.00000  3.473108891515e-05
9000.00000  9050.00000  3.726356414854e-05
9050.00000  9100.00000  3.798712850094e-05
9100.00000  9150.00000  4.124316808674e-05
9150.00000  9200.00000  4.630811855353e-05
9200.00000  9250.00000  4.088138591054e-05
9250.00000  9300.00000  4.449920767253e-05
9300.00000  9350.00000  4.088138591054e-05
9350.00000  9400.00000  4.196673243913e-05
9400.00000  9450.00000  4.341386114393e-05
9450.00000  9500.00000  4.413742549633e-05
9500.00000  9550.00000  4.015782155814e-05
9550.00000  9600.00000  3.834891067714e-05
9600.00000  9650.00000  3.581643544374e-05
9650.00000  9700.00000  3.509287109135e-05
9700.00000  9750.00000  3.617821761994e-05
9750.00000  9800.00000  4.015782155814e-05
9800.00000  9850.00000  4.232851461533e-05
9850.00000  9900.00000  4.377564332013e-05
9900.00000  9950.00000  3.943425720574e-05
9950.00000  10000.00000  3.690178197234e-05
