300.00000  350.00000  7.805047942194e-01
350.00000  400.00000  5.856137468991e-01
400.00000  450.00000  4.552474091320e-01
450.00000  500.00000  3.635624629319e-01
500.00000  550.00000  2.980451317676e-01
550.00000  600.00000  2.472915672846e-01
600.00000  650.00000  2.101071796870e-01
650.00000  700.00000  1.797269316263e-01
700.00000  750.00000  1.555463534912e-01
750.00000  800.00000  1.364278944580e-01
800.00000  850.00000  1.203920510752e-01
850.00000  900.00000  1.068418871805e-01
900.00000  950.00000  9.554386584996e-02
950.00000  1000.00000  8.596598207829e-02
1000.00000  1050.00000  7.772725857928e-02
1050.00000  1100.00000  7.056294842519e-02
1100.00000  1150.00000  6.469833761956e-02
1150.00000  1200.00000  5.922187881368e-02
1200.00000  1250.00000  5.436962008131e-02
1250.00000  1300.00000  5.028828431329e-02
1300.00000  1350.00000  4.657393514021e-02
1350.00000  1400.00000  4.328110038460e-02
1400.00000  1450.00000  4.030036566574e-02
1450.00000  1500.00000  3.771675133848e-02
1500.00000  1550.00000  3.519663322559e-02
1550.00000  1600.00000  3.282000938247e-02
1600.00000  1650.00000  3.096462847431e-02
1650.00000  1700.00000  2.919570286368e-02
1700.00000  1750.00000  2.735287770412e-02
1750.00000  1800.00000  2.594053535388e-02
1800.00000  1850.00000  2.442702954345e-02
1850.00000  1900.00000  2.321809032062e-02
1900.00000  1950.00000  2.209775880936e-02
1950.00000  2000.00000  2.094585855876e-02
2000.00000  2050.00000  1.994857338384e-02
2050.00000  2100.00000  1.883147049366e-02
2100.00000  2150.00000  1.806879844981e-02
2150.00000  2200.00000  1.722182352248e-02
2200.00000  2250.00000  1.638417572268e-02
2250.00000  2300.00000  1.584786588940e-02
2300.00000  2350.00000  1.520501156082e-02
2350.00000  2400.00000  1.448610526926e-02
2400.00000  2450.00000  1.396701474835e-02
2450.00000  2500.00000  1.319860293372e-02
2500.00000  2550.00000  1.264041022430e-02
2550.00000  2600.00000  1.236382501931e-02
2600.00000  2650.00000  1.187379208804e-02
2650.00000  2700.00000  1.137156214383e-02
2700.00000  2750.00000  1.107345279838e-02
2750.00000  2800.00000  1.059525814436e-02
2800.00000  2850.00000  1.013571774541e-02
2850.00000  2900.00000  9.848011734519e-03
2900.00000  2950.00000  9.535911697763e-03
2950.00000  3000.00000  9.230986374495e-03
3000.00000  3050.00000  8.914222773972e-03
3050.00000  3100.00000  8.633332740891e-03
3100.00000  3150.00000  8.314775461995e-03
3150.00000  3200.00000  7.978281399377e-03
3200.00000  3250.00000  7.858463684117e-03
3250.00000  3300.00000  7.534166634430e-03
3300.00000  3350.00000  7.368789488517e-03
3350.00000  3400.00000  7.100455204041e-03
3400.00000  3450.00000  6.880908971289e-03
3450.00000  3500.00000  6.747818036074e-03
3500.00000  3550.00000  6.542621230299e-03
3550.00000  3600.00000  6.293299936568e-03
3600.00000  3650.00000  6.215095559542e-03
3650.00000  3700.00000  6.033216572605e-03
3700.00000  3750.00000  5.920573570833e-03
3750.00000  3800.00000  5.758066310315e-03
3800.00000  3850.00000  5.563631574773e-03
3850.00000  3900.00000  5.434845467651e-03
3900.00000  3950.00000  5.335116950159e-03
3950.00000  4000.00000  5.116288188755e-03
4000.00000  4050.00000  5.050998296009e-03
4050.00000  4100.00000  4.805981830371e-03
4100.00000  4150.00000  4.757552514323e-03
4150.00000  4200.00000  4.555584329617e-03
4200.00000  4250.00000  4.523298118919e-03
4250.00000  4300.00000  4.447604891613e-03
4300.00000  4350.00000  4.340342924958e-03
4350.00000  4400.00000  4.230928544256e-03
4400.00000  4450.00000  4.154159109928e-03
4450.00000  4500.00000  4.062322777273e-03
4500.00000  4550.00000  3.975150008386e-03
4550.00000  4600.00000  3.852462407730e-03
4600.00000  4650.00000  3.840624130474e-03
4650.00000  4700.00000  3.644036980885e-03
4700.00000  4750.00000  3.648341808978e-03
4750.00000  4800.00000  3.588791687022e-03
4800.00000  4850.00000  3.532470186136e-03
4850.00000  4900.00000  3.423055805434e-03
4900.00000  4950.00000  3.402249136317e-03
4950.00000  5000.00000  3.217858999659e-03
5000.00000  5050.00000  3.231132219613e-03
5050.00000  5100.00000  3.188083938681e-03
5100.00000  5150.00000  3.089072892538e-03
5150.00000  5200.00000  3.093736456305e-03
5200.00000  5250.00000  2.962797935137e-03
5250.00000  5300.00000  2.911498733694e-03
5300.00000  5350.00000  2.870961602483e-03
5350.00000  5400.00000  2.836164242063e-03
5400.00000  5450.00000  2.732848367826e-03
5450.00000  5500.00000  2.672222038847e-03
5500.00000  5550.00000  2.653567783777e-03
5550.00000  5600.00000  2.630249964939e-03
5600.00000  5650.00000  2.576080878099e-03
5650.00000  5700.00000  2.563525129494e-03
5700.00000  5750.00000  2.501105122143e-03
5750.00000  5800.00000  2.423259480791e-03
5800.00000  5850.00000  2.365144301533e-03
5850.00000  5900.00000  2.354382231300e-03
5900.00000  5950.00000  2.281558889390e-03
5950.00000  6000.00000  2.271514290506e-03
6000.00000  6050.00000  2.276536589948e-03
6050.00000  6100.00000  2.202637041015e-03
6100.00000  6150.00000  2.121921514268e-03
6150.00000  6200.00000  2.153848989292e-03
6200.00000  6250.00000  2.069546105801e-03
6250.00000  6300.00000  2.020040582729e-03
6300.00000  6350.00000  1.987036900681e-03
6350.00000  6400.00000  2.182906578921e-03
6400.00000  6450.00000  1.996722763891e-03
6450.00000  6500.00000  1.918877122539e-03
6500.00000  6550.00000  1.919594593888e-03
6550.00000  6600.00000  1.850717344397e-03
6600.00000  6650.00000  1.856457115188e-03
6650.00000  6700.00000  1.796906993232e-03
6700.00000  6750.00000  1.795830786209e-03
6750.00000  6800.00000  1.725159858346e-03
6800.00000  6850.00000  1.736639399927e-03
6850.00000  6900.00000  1.740585492346e-03
6900.00000  6950.00000  1.678882956344e-03
6950.00000  7000.00000  1.658076287227e-03
7000.00000  7050.00000  1.646955481319e-03
7050.00000  7100.00000  1.647314216994e-03
7100.00000  7150.00000  1.615745477644e-03
7150.00000  7200.00000  1.575208346433e-03
7200.00000  7250.00000  1.540410986013e-03
7250.00000  7300.00000  1.537182364943e-03
7300.00000  7350.00000  1.496645233732e-03
7350.00000  7400.00000  1.466870172754e-03
7400.00000  7450.00000  1.453238217126e-03
7450.00000  7500.00000  1.477273507313e-03
7500.00000  7550.00000  1.432072812334e-03
7550.00000  7600.00000  1.404450165403e-03
7600.00000  7650.00000  1.407320050798e-03
7650.00000  7700.00000  1.378621196844e-03
7700.00000  7750.00000  1.324452110005e-03
7750.00000  7800.00000  1.353509699634e-03
7800.00000  7850.00000  1.285349921491e-03
7850.00000  7900.00000  1.287143599864e-03
7900.00000  7950.00000  1.225799799536e-03
7950.00000  8000.00000  1.249117618374e-03
8000.00000  8050.00000  1.269565551816e-03
8050.00000  8100.00000  1.242301640560e-03
8100.00000  8150.00000  1.204634394744e-03
8150.00000  8200.00000  1.156563814370e-03
8200.00000  8250.00000  1.191719910465e-03
8250.00000  8300.00000  1.153693928975e-03
8300.00000  8350.00000  1.165532206231e-03
8350.00000  8400.00000  1.144008065765e-03
8400.00000  8450.00000  1.123918867997e-03
8450.00000  8500.00000  1.100242313484e-03
8500.00000  8550.00000  1.091273921623e-03
8550.00000  8600.00000  1.066162424413e-03
8600.00000  8650.00000  1.062933803343e-03
8650.00000  8700.00000  1.064010010367e-03
8700.00000  8750.00000  1.047508169343e-03
8750.00000  8800.00000  1.090915185949e-03
8800.00000  8850.00000  1.029212649947e-03
8850.00000  8900.00000  1.015580694318e-03
8900.00000  8950.00000  9.908279327824e-04
8950.00000  9000.00000  1.020244258086e-03
9000.00000  9050.00000  9.911866684568e-04
9050.00000  9100.00000  9.915454041312e-04
9100.00000  9150.00000  9.531606869670e-04
9150.00000  9200.00000  9.208744762681e-04
9200.00000  9250.00000  9.119060844072e-04
9250.00000  9300.00000  9.628465501767e-04
9300.00000  9350.00000  9.413224097107e-04
9350.00000  9400.00000  9.165696481749e-04
9400.00000  9450.00000  8.771087239873e-04
9450.00000  9500.00000  8.903819439413e-04
9500.00000  9550.00000  8.778261953362e-04
9550.00000  9600.00000  8.957629790578e-04
9600.00000  9650.00000  8.785436666850e-04
9650.00000  9700.00000  8.484098700327e-04
9700.00000  9750.00000  8.455399846372e-04
9750.00000  9800.00000  8.387240068230e-04
9800.00000  9850.00000  8.534321694748e-04
9850.00000  9900.00000  8.197110160781e-04
9900.00000  9950.00000  8.337017073810e-04
9950.00000  10000.00000  7.931645761701e-04
