300.00000  350.00000  1.152534436156e-03
350.00000  400.00000  9.226227894339e-04
400.00000  450.00000  7.336339277273e-04
450.00000  500.00000  6.212822815946e-04
500.00000  550.00000  7.864615229288e-04
550.00000  600.00000  3.147334192988e-04
600.00000  650.00000  3.459835460377e-04
650.00000  700.00000  2.641379760073e-04
700.00000  750.00000  2.604177228241e-04
750.00000  800.00000  2.261913935386e-04
800.00000  850.00000  3.750015208667e-04
850.00000  900.00000  1.919650642532e-04
900.00000  950.00000  1.941972161631e-04
950.00000  1000.00000  1.741078489738e-04
1000.00000  1050.00000  1.532744311479e-04
1050.00000  1100.00000  1.540184817845e-04
1100.00000  1150.00000  1.607149375143e-04
1150.00000  1200.00000  1.681554438807e-04
1200.00000  1250.00000  1.510422792380e-04
1250.00000  1300.00000  2.232151909921e-04
1300.00000  1350.00000  1.369053171418e-04
1350.00000  1400.00000  1.480660766914e-04
1400.00000  1450.00000  1.302088614120e-04
1450.00000  1500.00000  1.398815196884e-04
1500.00000  1550.00000  1.339291145952e-04
1550.00000  1600.00000  1.458339247815e-04
1600.00000  1650.00000  1.517863298746e-04
1650.00000  1700.00000  1.316969626853e-04
1700.00000  1750.00000  2.425605075447e-04
1750.00000  1800.00000  1.465779754181e-04
1800.00000  1850.00000  1.733637983372e-04
1850.00000  1900.00000  1.391374690517e-04
1900.00000  1950.00000  1.480660766914e-04
1950.00000  2000.00000  1.674113932441e-04
2000.00000  2050.00000  1.703875957906e-04
2050.00000  2100.00000  1.845245578868e-04
2100.00000  2150.00000  1.837805072501e-04
2150.00000  2200.00000  1.800602540669e-04
2200.00000  2250.00000  2.291675960852e-04
2250.00000  2300.00000  2.343759505417e-04
2300.00000  2350.00000  2.991083559294e-04
2350.00000  2400.00000  2.023817731662e-04
2400.00000  2450.00000  2.537212670943e-04
2450.00000  2500.00000  2.172627858990e-04
2500.00000  2550.00000  2.202389884455e-04
2550.00000  2600.00000  2.700903811004e-04
2600.00000  2650.00000  2.596736721875e-04
2650.00000  2700.00000  2.633939253707e-04
2700.00000  2750.00000  2.812511406500e-04
2750.00000  2800.00000  2.671141785539e-04
2800.00000  2850.00000  2.872035457431e-04
2850.00000  2900.00000  3.177096218454e-04
2900.00000  2950.00000  3.214298750286e-04
2950.00000  3000.00000  3.802098753232e-04
3000.00000  3050.00000  3.779777234133e-04
3050.00000  3100.00000  3.906265842361e-04
3100.00000  3150.00000  3.861622804163e-04
3150.00000  3200.00000  4.449422807109e-04
3200.00000  3250.00000  4.136921539720e-04
3250.00000  3300.00000  4.002992425125e-04
3300.00000  3350.00000  4.449422807109e-04
3350.00000  3400.00000  4.404779768910e-04
3400.00000  3450.00000  4.657756985368e-04
3450.00000  3500.00000  4.821448125429e-04
3500.00000  3550.00000  5.044663316421e-04
3550.00000  3600.00000  5.565498762069e-04
3600.00000  3650.00000  5.744070914863e-04
3650.00000  3700.00000  5.915202561290e-04
3700.00000  3750.00000  5.543177242970e-04
3750.00000  3800.00000  5.706868383031e-04
3800.00000  3850.00000  6.071453194985e-04
3850.00000  3900.00000  6.183060790481e-04
3900.00000  3950.00000  6.264906360511e-04
3950.00000  4000.00000  6.681574717030e-04
4000.00000  4050.00000  6.822944337991e-04
4050.00000  4100.00000  6.555086108801e-04
4100.00000  4150.00000  6.480681045137e-04
4150.00000  4200.00000  6.808063325259e-04
4200.00000  4250.00000  6.741098767961e-04
4250.00000  4300.00000  7.142886111747e-04
4300.00000  4350.00000  7.284255732708e-04
4350.00000  4400.00000  7.180088643579e-04
4400.00000  4450.00000  7.321458264540e-04
4450.00000  4500.00000  7.619078519196e-04
4500.00000  4550.00000  7.819972191089e-04
4550.00000  4600.00000  7.686043076494e-04
4600.00000  4650.00000  7.514911430067e-04
4650.00000  4700.00000  7.715805101960e-04
4700.00000  4750.00000  7.983663331150e-04
4750.00000  4800.00000  7.797650671990e-04
4800.00000  4850.00000  7.395863328204e-04
4850.00000  4900.00000  7.805091178357e-04
4900.00000  4950.00000  8.244081053974e-04
4950.00000  5000.00000  7.775329152891e-04
5000.00000  5050.00000  7.656281051028e-04
5050.00000  5100.00000  8.117592445745e-04
5100.00000  5150.00000  8.258962066707e-04
5150.00000  5200.00000  7.723245608326e-04
5200.00000  5250.00000  7.596757000097e-04
5250.00000  5300.00000  7.961341812051e-04
5300.00000  5350.00000  8.221759534875e-04
5350.00000  5400.00000  7.559554468265e-04
5400.00000  5450.00000  8.370569662203e-04
5450.00000  5500.00000  7.544673455532e-04
5500.00000  5550.00000  8.132473458478e-04
5550.00000  5600.00000  7.842293710189e-04
5600.00000  5650.00000  7.857174722921e-04
5650.00000  5700.00000  7.738126621059e-04
5700.00000  5750.00000  7.566994974632e-04
5750.00000  5800.00000  7.671162063761e-04
5800.00000  5850.00000  7.834853203822e-04
5850.00000  5900.00000  7.961341812051e-04
5900.00000  5950.00000  7.723245608326e-04
5950.00000  6000.00000  7.708364595593e-04
6000.00000  6050.00000  7.328898770907e-04
6050.00000  6100.00000  7.730686114692e-04
6100.00000  6150.00000  7.150326618113e-04
6150.00000  6200.00000  7.901817761120e-04
6200.00000  6250.00000  8.013425356616e-04
6250.00000  6300.00000  8.065508901181e-04
6300.00000  6350.00000  7.693483582860e-04
6350.00000  6400.00000  1.539440767209e-03
6400.00000  6450.00000  7.128005099014e-04
6450.00000  6500.00000  7.157767124479e-04
6500.00000  6550.00000  7.261934213609e-04
6550.00000  6600.00000  7.038719022617e-04
6600.00000  6650.00000  7.068481048083e-04
6650.00000  6700.00000  6.912230414388e-04
6700.00000  6750.00000  6.994075984419e-04
6750.00000  6800.00000  6.875027882556e-04
6800.00000  6850.00000  6.889908895289e-04
6850.00000  6900.00000  6.622050666098e-04
6900.00000  6950.00000  6.555086108801e-04
6950.00000  7000.00000  6.488121551503e-04
7000.00000  7050.00000  6.793182312526e-04
7050.00000  7100.00000  7.455387379136e-04
7100.00000  7150.00000  4.404779768910e-04
7150.00000  7200.00000  4.330374705246e-04
7200.00000  7250.00000  4.025313944224e-04
7250.00000  7300.00000  4.166683565186e-04
7300.00000  7350.00000  4.166683565186e-04
7350.00000  7400.00000  4.047635463323e-04
7400.00000  7450.00000  4.218767109750e-04
7450.00000  7500.00000  4.419660781643e-04
7500.00000  7550.00000  4.077397488789e-04
7550.00000  7600.00000  4.010432931491e-04
7600.00000  7650.00000  3.973230399659e-04
7650.00000  7700.00000  4.047635463323e-04
7700.00000  7750.00000  4.047635463323e-04
7750.00000  7800.00000  4.196445590651e-04
7800.00000  7850.00000  4.069956982422e-04
7850.00000  7900.00000  3.750015208667e-04
7900.00000  7950.00000  3.943468374193e-04
7950.00000  8000.00000  3.928587361461e-04
8000.00000  8050.00000  4.099719007888e-04
8050.00000  8100.00000  4.129481033354e-04
8100.00000  8150.00000  3.958349386926e-04
8150.00000  8200.00000  3.995551918758e-04
8200.00000  8250.00000  3.846741791430e-04
8250.00000  8300.00000  3.921146855094e-04
8300.00000  8350.00000  4.055075969690e-04
8350.00000  8400.00000  3.839301285064e-04
8400.00000  8450.00000  3.668169638637e-04
8450.00000  8500.00000  3.653288625904e-04
8500.00000  8550.00000  3.578883562240e-04
8550.00000  8600.00000  3.846741791430e-04
8600.00000  8650.00000  4.002992425125e-04
8650.00000  8700.00000  3.750015208667e-04
8700.00000  8750.00000  3.630967106805e-04
8750.00000  8800.00000  3.816979765965e-04
8800.00000  8850.00000  3.526800017675e-04
8850.00000  8900.00000  3.534240524041e-04
8900.00000  8950.00000  3.087810142057e-04
8950.00000  9000.00000  3.266382294851e-04
9000.00000  9050.00000  3.474716473110e-04
9050.00000  9100.00000  3.586324068606e-04
9100.00000  9150.00000  3.459835460377e-04
9150.00000  9200.00000  3.534240524041e-04
9200.00000  9250.00000  3.370549383980e-04
9250.00000  9300.00000  3.058048116592e-04
9300.00000  9350.00000  3.385430396713e-04
9350.00000  9400.00000  3.110131661156e-04
9400.00000  9450.00000  3.281263307584e-04
9450.00000  9500.00000  2.961321533828e-04
9500.00000  9550.00000  3.601205081339e-04
9550.00000  9600.00000  3.005964572027e-04
9600.00000  9650.00000  3.162215205721e-04
9650.00000  9700.00000  3.080369635691e-04
9700.00000  9750.00000  2.983643052928e-04
9750.00000  9800.00000  3.020845584760e-04
9800.00000  9850.00000  3.385430396713e-04
9850.00000  9900.00000  3.043167103859e-04
9900.00000  9950.00000  3.139893686622e-04
9950.00000  10000.00000  3.020845584760e-04
