300.00000  350.00000  1.166973146255e-04
350.00000  400.00000  1.093114086365e-04
400.00000  450.00000  1.130043616310e-04
450.00000  500.00000  9.010805306522e-05
500.00000  550.00000  7.016610689505e-05
550.00000  600.00000  5.096275132377e-05
600.00000  650.00000  5.317852312046e-05
650.00000  700.00000  4.505402653261e-05
700.00000  750.00000  3.471375814808e-05
750.00000  800.00000  3.692952994476e-05
800.00000  850.00000  4.136107353814e-05
850.00000  900.00000  3.397516754918e-05
900.00000  950.00000  4.283825473593e-05
950.00000  1000.00000  3.914530174145e-05
1000.00000  1050.00000  3.619093934587e-05
1050.00000  1100.00000  2.658926156023e-05
1100.00000  1150.00000  4.209966413703e-05
1150.00000  1200.00000  3.249798635139e-05
1200.00000  1250.00000  3.914530174145e-05
1250.00000  1300.00000  4.062248293924e-05
1300.00000  1350.00000  3.397516754918e-05
1350.00000  1400.00000  4.431543593372e-05
1400.00000  1450.00000  4.874697952709e-05
1450.00000  1500.00000  4.283825473593e-05
1500.00000  1550.00000  5.391711371936e-05
1550.00000  1600.00000  5.022416072488e-05
1600.00000  1650.00000  5.761006671383e-05
1650.00000  1700.00000  6.573456330168e-05
1700.00000  1750.00000  8.493791887296e-05
1750.00000  1800.00000  6.942751629616e-05
1800.00000  1850.00000  9.306241546080e-05
1850.00000  1900.00000  7.755201288400e-05
1900.00000  1950.00000  1.019255026475e-04
1950.00000  2000.00000  1.085728180376e-04
2000.00000  2050.00000  9.158523426301e-05
2050.00000  2100.00000  1.019255026475e-04
2100.00000  2150.00000  1.344234889989e-04
2150.00000  2200.00000  1.174359052243e-04
2200.00000  2250.00000  1.329463078011e-04
2250.00000  2300.00000  1.536268445702e-04
2300.00000  2350.00000  1.683986565481e-04
2350.00000  2400.00000  1.610127505592e-04
2400.00000  2450.00000  1.676600659492e-04
2450.00000  2500.00000  1.683986565481e-04
2500.00000  2550.00000  1.654442941525e-04
2550.00000  2600.00000  1.861248309216e-04
2600.00000  2650.00000  1.765231531360e-04
2650.00000  2700.00000  1.617513411581e-04
2700.00000  2750.00000  1.676600659492e-04
2750.00000  2800.00000  1.846476497238e-04
2800.00000  2850.00000  1.890791933172e-04
2850.00000  2900.00000  2.016352334984e-04
2900.00000  2950.00000  2.031124146962e-04
2950.00000  3000.00000  2.134526830807e-04
3000.00000  3050.00000  1.802161061304e-04
3050.00000  3100.00000  1.824318779271e-04
3100.00000  3150.00000  1.898177839161e-04
3150.00000  3200.00000  1.780003343338e-04
3200.00000  3250.00000  1.743073813393e-04
3250.00000  3300.00000  2.068053676907e-04
3300.00000  3350.00000  1.979422805039e-04
3350.00000  3400.00000  1.935107369106e-04
3400.00000  3450.00000  1.868634215205e-04
3450.00000  3500.00000  1.964650993061e-04
3500.00000  3550.00000  1.787389249327e-04
3550.00000  3600.00000  1.698758377459e-04
3600.00000  3650.00000  1.765231531360e-04
3650.00000  3700.00000  2.008966428995e-04
3700.00000  3750.00000  1.765231531360e-04
3750.00000  3800.00000  1.772617437349e-04
3800.00000  3850.00000  1.728302001415e-04
3850.00000  3900.00000  1.780003343338e-04
3900.00000  3950.00000  1.780003343338e-04
3950.00000  4000.00000  1.514110727735e-04
4000.00000  4050.00000  1.816932873282e-04
4050.00000  4100.00000  1.720916095426e-04
4100.00000  4150.00000  1.543654351691e-04
4150.00000  4200.00000  1.580583881636e-04
4200.00000  4250.00000  1.580583881636e-04
4250.00000  4300.00000  1.743073813393e-04
4300.00000  4350.00000  1.624899317570e-04
4350.00000  4400.00000  1.602741599603e-04
4400.00000  4450.00000  1.551040257680e-04
4450.00000  4500.00000  1.447637573835e-04
4500.00000  4550.00000  1.462409385813e-04
4550.00000  4600.00000  1.477181197791e-04
4600.00000  4650.00000  1.595355693614e-04
4650.00000  4700.00000  1.373778513945e-04
4700.00000  4750.00000  1.477181197791e-04
4750.00000  4800.00000  1.418093949879e-04
4800.00000  4850.00000  1.440251667846e-04
4850.00000  4900.00000  1.395936231912e-04
4900.00000  4950.00000  1.292533548067e-04
4950.00000  5000.00000  1.388550325923e-04
5000.00000  5050.00000  1.336848984000e-04
5050.00000  5100.00000  1.484567103780e-04
5100.00000  5150.00000  1.395936231912e-04
5150.00000  5200.00000  1.189130864221e-04
5200.00000  5250.00000  1.381164419934e-04
5250.00000  5300.00000  1.580583881636e-04
5300.00000  5350.00000  1.395936231912e-04
5350.00000  5400.00000  1.322077172023e-04
5400.00000  5450.00000  1.661828847514e-04
5450.00000  5500.00000  1.226060394166e-04
5500.00000  5550.00000  1.388550325923e-04
5550.00000  5600.00000  1.425479855868e-04
5600.00000  5650.00000  1.100499992354e-04
5650.00000  5700.00000  1.285147642078e-04
5700.00000  5750.00000  1.418093949879e-04
5750.00000  5800.00000  1.314691266034e-04
5800.00000  5850.00000  1.240832206144e-04
5850.00000  5900.00000  1.203902676199e-04
5900.00000  5950.00000  1.292533548067e-04
5950.00000  6000.00000  1.181744958232e-04
6000.00000  6050.00000  1.418093949879e-04
6050.00000  6100.00000  1.203902676199e-04
6100.00000  6150.00000  1.226060394166e-04
6150.00000  6200.00000  1.189130864221e-04
6200.00000  6250.00000  1.100499992354e-04
6250.00000  6300.00000  1.491953009768e-04
6300.00000  6350.00000  1.706144283448e-04
6350.00000  6400.00000  6.772875791870e-04
6400.00000  6450.00000  1.189130864221e-04
6450.00000  6500.00000  1.137429522299e-04
6500.00000  6550.00000  1.122657710321e-04
6550.00000  6600.00000  1.137429522299e-04
6600.00000  6650.00000  1.048798650431e-04
6650.00000  6700.00000  1.041412744442e-04
6700.00000  6750.00000  1.218674488177e-04
6750.00000  6800.00000  1.070956368398e-04
6800.00000  6850.00000  9.970973085086e-05
6850.00000  6900.00000  1.130043616310e-04
6900.00000  6950.00000  1.093114086365e-04
6950.00000  7000.00000  9.897114025197e-05
7000.00000  7050.00000  1.100499992354e-04
7050.00000  7100.00000  1.683986565481e-04
7100.00000  7150.00000  5.022416072488e-05
7150.00000  7200.00000  5.613288551604e-05
7200.00000  7250.00000  5.022416072488e-05
7250.00000  7300.00000  6.278020090610e-05
7300.00000  7350.00000  5.022416072488e-05
7350.00000  7400.00000  5.982583851052e-05
7400.00000  7450.00000  5.096275132377e-05
7450.00000  7500.00000  6.647315390057e-05
7500.00000  7550.00000  5.761006671383e-05
7550.00000  7600.00000  6.278020090610e-05
7600.00000  7650.00000  5.687147611494e-05
7650.00000  7700.00000  5.539429491715e-05
7700.00000  7750.00000  5.465570431825e-05
7750.00000  7800.00000  5.022416072488e-05
7800.00000  7850.00000  5.317852312046e-05
7850.00000  7900.00000  5.687147611494e-05
7900.00000  7950.00000  6.278020090610e-05
7950.00000  8000.00000  5.243993252156e-05
8000.00000  8050.00000  5.613288551604e-05
8050.00000  8100.00000  4.579261713151e-05
8100.00000  8150.00000  5.317852312046e-05
8150.00000  8200.00000  5.243993252156e-05
8200.00000  8250.00000  5.465570431825e-05
8250.00000  8300.00000  6.351879150499e-05
8300.00000  8350.00000  4.948557012598e-05
8350.00000  8400.00000  3.619093934587e-05
8400.00000  8450.00000  5.022416072488e-05
8450.00000  8500.00000  5.761006671383e-05
8500.00000  8550.00000  4.357684533482e-05
8550.00000  8600.00000  4.431543593372e-05
8600.00000  8650.00000  4.874697952709e-05
8650.00000  8700.00000  4.874697952709e-05
8700.00000  8750.00000  5.170134192267e-05
8750.00000  8800.00000  4.431543593372e-05
8800.00000  8850.00000  5.243993252156e-05
8850.00000  8900.00000  3.914530174145e-05
8900.00000  8950.00000  5.391711371936e-05
8950.00000  9000.00000  4.431543593372e-05
9000.00000  9050.00000  4.505402653261e-05
9050.00000  9100.00000  5.096275132377e-05
9100.00000  9150.00000  3.766812054366e-05
9150.00000  9200.00000  4.505402653261e-05
9200.00000  9250.00000  4.431543593372e-05
9250.00000  9300.00000  5.317852312046e-05
9300.00000  9350.00000  5.391711371936e-05
9350.00000  9400.00000  5.170134192267e-05
9400.00000  9450.00000  5.391711371936e-05
9450.00000  9500.00000  4.062248293924e-05
9500.00000  9550.00000  3.545234874697e-05
9550.00000  9600.00000  4.136107353814e-05
9600.00000  9650.00000  4.800838892819e-05
9650.00000  9700.00000  4.283825473593e-05
9700.00000  9750.00000  5.096275132377e-05
9750.00000  9800.00000  3.840671114255e-05
9800.00000  9850.00000  3.914530174145e-05
9850.00000  9900.00000  4.357684533482e-05
9900.00000  9950.00000  4.431543593372e-05
9950.00000  10000.00000  3.988389234034e-05
