300.00000  350.00000  1.937344161955e-07
350.00000  400.00000  2.906016242932e-06
400.00000  450.00000  3.487219491519e-06
450.00000  500.00000  5.037094821083e-06
500.00000  550.00000  3.467846049899e-05
550.00000  600.00000  3.293485075323e-06
600.00000  650.00000  1.123659613934e-05
650.00000  700.00000  6.005766902060e-06
700.00000  750.00000  1.084912730695e-05
750.00000  800.00000  6.780704566842e-06
800.00000  850.00000  2.983510009411e-05
850.00000  900.00000  6.005766902060e-06
900.00000  950.00000  6.393235734451e-06
950.00000  1000.00000  7.749376647820e-06
1000.00000  1050.00000  8.911783144993e-06
1050.00000  1100.00000  8.911783144993e-06
1100.00000  1150.00000  9.299251977384e-06
1150.00000  1200.00000  1.065539289075e-05
1200.00000  1250.00000  1.084912730695e-05
1250.00000  1300.00000  3.584086699617e-05
1300.00000  1350.00000  1.394887796608e-05
1350.00000  1400.00000  9.299251977384e-06
1400.00000  1450.00000  1.472381563086e-05
1450.00000  1500.00000  1.685489420901e-05
1500.00000  1550.00000  1.181779938793e-05
1550.00000  1600.00000  1.762983187379e-05
1600.00000  1650.00000  1.685489420901e-05
1650.00000  1700.00000  1.879223837096e-05
1700.00000  1750.00000  6.025140343680e-05
1750.00000  1800.00000  2.537920852161e-05
1800.00000  1850.00000  2.131078578150e-05
1850.00000  1900.00000  2.286066111107e-05
1900.00000  1950.00000  1.898597278716e-05
1950.00000  2000.00000  2.053584811672e-05
2000.00000  2050.00000  2.441053644063e-05
2050.00000  2100.00000  2.208572344629e-05
2100.00000  2150.00000  2.499173968922e-05
2150.00000  2200.00000  2.421680202444e-05
2200.00000  2250.00000  2.751028709976e-05
2250.00000  2300.00000  3.138497542367e-05
2300.00000  2350.00000  1.059727256589e-04
2350.00000  2400.00000  3.099750659128e-05
2400.00000  2450.00000  3.835941440671e-05
2450.00000  2500.00000  3.835941440671e-05
2500.00000  2550.00000  3.971555532008e-05
2550.00000  2600.00000  5.075841704322e-05
2600.00000  2650.00000  5.056468262702e-05
2650.00000  2700.00000  5.676418394528e-05
2700.00000  2750.00000  6.199501318256e-05
2750.00000  2800.00000  6.625717033886e-05
2800.00000  2850.00000  7.884990739157e-05
2850.00000  2900.00000  8.989276911471e-05
2900.00000  2950.00000  9.299251977384e-05
2950.00000  3000.00000  1.342579504235e-04
3000.00000  3050.00000  1.059727256589e-04
3050.00000  3100.00000  1.226338854517e-04
3100.00000  3150.00000  1.288333867700e-04
3150.00000  3200.00000  1.429759991523e-04
3200.00000  3250.00000  1.478193595572e-04
3250.00000  3300.00000  1.666115979281e-04
3300.00000  3350.00000  1.654491914310e-04
3350.00000  3400.00000  1.896659934554e-04
3400.00000  3450.00000  1.976091045194e-04
3450.00000  3500.00000  2.053584811672e-04
3500.00000  3550.00000  2.235695162896e-04
3550.00000  3600.00000  2.353873156775e-04
3600.00000  3650.00000  2.630913371935e-04
3650.00000  3700.00000  2.950575158657e-04
3700.00000  3750.00000  2.613477274477e-04
3750.00000  3800.00000  2.547607572971e-04
3800.00000  3850.00000  2.958324535305e-04
3850.00000  3900.00000  3.064878464213e-04
3900.00000  3950.00000  3.074565185022e-04
3950.00000  4000.00000  3.165620360634e-04
4000.00000  4050.00000  3.293485075323e-04
4050.00000  4100.00000  3.254738192084e-04
4100.00000  4150.00000  3.347730711858e-04
4150.00000  4200.00000  3.330294614401e-04
4200.00000  4250.00000  3.403913692555e-04
4250.00000  4300.00000  3.634457647827e-04
4300.00000  4350.00000  3.601522797074e-04
4350.00000  4400.00000  3.572462634645e-04
4400.00000  4450.00000  3.865001603100e-04
4450.00000  4500.00000  3.589898732103e-04
4500.00000  4550.00000  3.870813635586e-04
4550.00000  4600.00000  3.841753473157e-04
4600.00000  4650.00000  3.973492876170e-04
4650.00000  4700.00000  4.039362577676e-04
4700.00000  4750.00000  3.994803661951e-04
4750.00000  4800.00000  3.886312388882e-04
4800.00000  4850.00000  3.979304908655e-04
4850.00000  4900.00000  4.027738512704e-04
4900.00000  4950.00000  4.019989136057e-04
4950.00000  5000.00000  4.064548051781e-04
5000.00000  5050.00000  3.921184583797e-04
5050.00000  5100.00000  4.041299921838e-04
5100.00000  5150.00000  4.035487889352e-04
5150.00000  5200.00000  4.107169623344e-04
5200.00000  5250.00000  4.213723552252e-04
5250.00000  5300.00000  3.957994122874e-04
5300.00000  5350.00000  4.151728539069e-04
5350.00000  5400.00000  4.180788701499e-04
5400.00000  5450.00000  4.343525611103e-04
5450.00000  5500.00000  4.155603227393e-04
5500.00000  5550.00000  4.050986642648e-04
5550.00000  5600.00000  3.950244746226e-04
5600.00000  5650.00000  4.000615694437e-04
5650.00000  5700.00000  4.097482902535e-04
5700.00000  5750.00000  3.998678350275e-04
5750.00000  5800.00000  4.176914013175e-04
5800.00000  5850.00000  3.975430220332e-04
5850.00000  5900.00000  4.186600733985e-04
5900.00000  5950.00000  3.956056778712e-04
5950.00000  6000.00000  3.870813635586e-04
6000.00000  6050.00000  3.990928973627e-04
6050.00000  6100.00000  3.894061765529e-04
6100.00000  6150.00000  3.969618187846e-04
6150.00000  6200.00000  3.936683337092e-04
6200.00000  6250.00000  4.353212331913e-04
6250.00000  6300.00000  5.467185225037e-04
6300.00000  6350.00000  4.990598561196e-04
6350.00000  6400.00000  2.520872223536e-03
6400.00000  6450.00000  3.783633148298e-04
6450.00000  6500.00000  3.834004096509e-04
6500.00000  6550.00000  3.624770927018e-04
6550.00000  6600.00000  3.576337322969e-04
6600.00000  6650.00000  3.400039004231e-04
6650.00000  6700.00000  3.522091686434e-04
6700.00000  6750.00000  3.578274667131e-04
6750.00000  6800.00000  3.351605400182e-04
6800.00000  6850.00000  3.432973854984e-04
6850.00000  6900.00000  3.593773420426e-04
6900.00000  6950.00000  3.448472608280e-04
6950.00000  7000.00000  3.394226971745e-04
7000.00000  7050.00000  3.386477595097e-04
7050.00000  7100.00000  5.438125062608e-04
7100.00000  7150.00000  2.065208876644e-04
7150.00000  7200.00000  2.010963240109e-04
7200.00000  7250.00000  1.993527142652e-04
7250.00000  7300.00000  2.162076084742e-04
7300.00000  7350.00000  2.138827954798e-04
7350.00000  7400.00000  2.076832941616e-04
7400.00000  7450.00000  2.069083564968e-04
7450.00000  7500.00000  2.892454833799e-04
7500.00000  7550.00000  2.107830448207e-04
7550.00000  7600.00000  2.140765298960e-04
7600.00000  7650.00000  2.043898090862e-04
7650.00000  7700.00000  2.134953266474e-04
7700.00000  7750.00000  2.071020909130e-04
7750.00000  7800.00000  2.065208876644e-04
7800.00000  7850.00000  2.092331694911e-04
7850.00000  7900.00000  2.071020909130e-04
7900.00000  7950.00000  1.993527142652e-04
7950.00000  8000.00000  1.935406817793e-04
8000.00000  8050.00000  1.950905571089e-04
8050.00000  8100.00000  1.929594785307e-04
8100.00000  8150.00000  1.931532129469e-04
8150.00000  8200.00000  1.875349148772e-04
8200.00000  8250.00000  1.960592291898e-04
8250.00000  8300.00000  1.966404324384e-04
8300.00000  8350.00000  1.956717603574e-04
8350.00000  8400.00000  1.854038362991e-04
8400.00000  8450.00000  1.912158687850e-04
8450.00000  8500.00000  1.792043349808e-04
8500.00000  8550.00000  1.904409311202e-04
8550.00000  8600.00000  1.784293973161e-04
8600.00000  8650.00000  1.774607252351e-04
8650.00000  8700.00000  1.838539609695e-04
8700.00000  8750.00000  1.793980693970e-04
8750.00000  8800.00000  1.821103512238e-04
8800.00000  8850.00000  1.815291479752e-04
8850.00000  8900.00000  1.708737550844e-04
8900.00000  8950.00000  1.700988174196e-04
8950.00000  9000.00000  1.817228823914e-04
9000.00000  9050.00000  1.790106005646e-04
9050.00000  9100.00000  1.751359122407e-04
9100.00000  9150.00000  1.799792726456e-04
9150.00000  9200.00000  1.759108499055e-04
9200.00000  9250.00000  1.749421778245e-04
9250.00000  9300.00000  1.731985680788e-04
9300.00000  9350.00000  1.658366602633e-04
9350.00000  9400.00000  1.681614732577e-04
9400.00000  9450.00000  1.770732564027e-04
9450.00000  9500.00000  1.580872836155e-04
9500.00000  9550.00000  1.635118472690e-04
9550.00000  9600.00000  1.648679881824e-04
9600.00000  9650.00000  1.638993161014e-04
9650.00000  9700.00000  1.538251264592e-04
9700.00000  9750.00000  1.464632186438e-04
9750.00000  9800.00000  1.720361615816e-04
9800.00000  9850.00000  1.561499394536e-04
9850.00000  9900.00000  1.565374082860e-04
9900.00000  9950.00000  1.596371589451e-04
9950.00000  10000.00000  1.447196088980e-04
