10001.00000  11001.00000  3.565040709661e-04
11001.00000  12001.00000  2.910718290352e-04
12001.00000  13001.00000  2.517801005839e-04
13001.00000  14001.00000  2.148271654929e-04
14001.00000  15001.00000  1.837392045204e-04
15001.00000  16001.00000  1.621683334522e-04
16001.00000  17001.00000  1.418208312185e-04
17001.00000  18001.00000  1.260969435507e-04
18001.00000  19001.00000  1.116144154357e-04
19001.00000  20001.00000  9.885899626357e-05
20001.00000  21001.00000  9.013349795823e-05
21001.00000  22001.00000  8.115612959872e-05
22001.00000  23001.00000  7.435563813600e-05
23001.00000  24001.00000  6.931823705251e-05
24001.00000  25001.00000  6.104250670105e-05
25001.00000  26001.00000  5.719249301581e-05
26001.00000  27001.00000  5.064387160727e-05
27001.00000  28001.00000  4.891676266436e-05
28001.00000  29001.00000  4.501277682465e-05
29001.00000  30001.00000  4.188239186562e-05
30001.00000  31001.00000  3.747466591756e-05
31001.00000  32001.00000  3.580152912912e-05
32001.00000  33001.00000  3.249123698853e-05
33001.00000  34001.00000  3.026038793727e-05
34001.00000  35001.00000  2.869519545776e-05
35001.00000  36001.00000  2.597859701630e-05
36001.00000  37001.00000  2.570873624397e-05
37001.00000  38001.00000  2.371176652873e-05
38001.00000  39001.00000  2.250638841232e-05
39001.00000  40001.00000  2.247040697601e-05
40001.00000  41001.00000  2.013161361582e-05
41001.00000  42001.00000  1.903417980834e-05
42001.00000  43001.00000  1.829656036398e-05
43001.00000  44001.00000  1.653346998475e-05
44001.00000  45001.00000  1.784679241009e-05
45001.00000  46001.00000  1.525612899572e-05
46001.00000  47001.00000  1.446453739689e-05
47001.00000  48001.00000  1.385285297961e-05
48001.00000  49001.00000  1.289934491738e-05
49001.00000  50001.00000  1.252153983611e-05
50001.00000  51001.00000  1.282738204475e-05
51001.00000  52001.00000  1.210775331854e-05
52001.00000  53001.00000  1.144209674679e-05
53001.00000  54001.00000  1.045260724825e-05
54001.00000  55001.00000  1.016475575776e-05
55001.00000  56001.00000  9.517089904172e-06
56001.00000  57001.00000  9.157275541065e-06
57001.00000  58001.00000  8.923396205046e-06
58001.00000  59001.00000  8.149795324367e-06
59001.00000  60001.00000  8.491618969318e-06
60001.00000  61001.00000  7.987878860969e-06
61001.00000  62001.00000  8.221758196988e-06
62001.00000  63001.00000  6.746519308251e-06
63001.00000  64001.00000  6.818482180872e-06
64001.00000  65001.00000  6.944417207959e-06
65001.00000  66001.00000  6.656565717474e-06
66001.00000  67001.00000  6.476658535921e-06
67001.00000  68001.00000  6.314742072523e-06
68001.00000  69001.00000  5.505159755532e-06
69001.00000  70001.00000  5.954927709416e-06
70001.00000  71001.00000  5.109363956115e-06
71001.00000  72001.00000  5.163336110581e-06
72001.00000  73001.00000  5.487169037377e-06
73001.00000  74001.00000  4.533660975144e-06
74001.00000  75001.00000  4.353753793591e-06
75001.00000  76001.00000  4.839503183785e-06
76001.00000  77001.00000  4.587633129610e-06
77001.00000  78001.00000  4.191837330193e-06
78001.00000  79001.00000  4.011930148640e-06
79001.00000  80001.00000  3.688097221844e-06
80001.00000  81001.00000  3.454217885824e-06
81001.00000  82001.00000  3.975948712329e-06
82001.00000  83001.00000  3.310292140582e-06
83001.00000  84001.00000  3.220338549805e-06
84001.00000  85001.00000  3.112394240873e-06
85001.00000  86001.00000  3.166366395339e-06
86001.00000  87001.00000  2.950477777475e-06
87001.00000  88001.00000  2.968468495630e-06
88001.00000  89001.00000  2.878514904854e-06
89001.00000  90001.00000  2.752579877766e-06
90001.00000  91001.00000  2.662626286990e-06
91001.00000  92001.00000  2.752579877766e-06
92001.00000  93001.00000  2.482719105436e-06
93001.00000  94001.00000  2.410756232815e-06
94001.00000  95001.00000  2.356784078349e-06
95001.00000  96001.00000  2.284821205728e-06
96001.00000  97001.00000  2.122904742330e-06
97001.00000  98001.00000  2.374774796504e-06
98001.00000  99001.00000  2.338793360194e-06
99001.00000  100001.00000  2.554681978058e-06
100001.00000  101001.00000  2.194867614951e-06
101001.00000  102001.00000  2.212858333106e-06
102001.00000  103001.00000  1.781081097378e-06
103001.00000  104001.00000  1.942997560776e-06
104001.00000  105001.00000  2.104914024174e-06
105001.00000  106001.00000  1.511220325048e-06
106001.00000  107001.00000  1.529211043203e-06
107001.00000  108001.00000  1.565192479514e-06
108001.00000  109001.00000  1.817062533689e-06
109001.00000  110001.00000  1.511220325048e-06
110001.00000  111001.00000  1.745099661067e-06
111001.00000  112001.00000  1.511220325048e-06
112001.00000  113001.00000  1.655146070291e-06
113001.00000  114001.00000  1.295331707184e-06
114001.00000  115001.00000  1.439257452427e-06
115001.00000  116001.00000  1.637155352135e-06
116001.00000  117001.00000  1.133415243786e-06
117001.00000  118001.00000  1.421266734271e-06
118001.00000  119001.00000  1.151405961941e-06
119001.00000  120001.00000  1.259350270873e-06
120001.00000  121001.00000  1.493229606893e-06
121001.00000  122001.00000  1.151405961941e-06
122001.00000  123001.00000  1.187387398252e-06
123001.00000  124001.00000  1.133415243786e-06
124001.00000  125001.00000  1.097433807475e-06
125001.00000  126001.00000  1.169396680097e-06
126001.00000  127001.00000  1.223368834563e-06
127001.00000  128001.00000  1.169396680097e-06
128001.00000  129001.00000  1.241359552718e-06
129001.00000  130001.00000  9.714987803881e-07
130001.00000  131001.00000  1.043461653009e-06
131001.00000  132001.00000  9.355173440774e-07
132001.00000  133001.00000  9.714987803881e-07
133001.00000  134001.00000  8.815451896114e-07
134001.00000  135001.00000  1.169396680097e-06
135001.00000  136001.00000  9.714987803881e-07
136001.00000  137001.00000  7.376194443687e-07
137001.00000  138001.00000  1.079443089320e-06
138001.00000  139001.00000  8.815451896114e-07
139001.00000  140001.00000  8.995359077667e-07
140001.00000  141001.00000  8.635544714561e-07
141001.00000  142001.00000  6.116844172814e-07
142001.00000  143001.00000  9.535080622328e-07
143001.00000  144001.00000  7.196287262134e-07
144001.00000  145001.00000  6.476658535921e-07
145001.00000  146001.00000  8.635544714561e-07
146001.00000  147001.00000  6.656565717474e-07
147001.00000  148001.00000  6.656565717474e-07
148001.00000  149001.00000  8.095823169901e-07
149001.00000  150001.00000  7.196287262134e-07
150001.00000  151001.00000  7.915915988347e-07
151001.00000  152001.00000  7.376194443687e-07
152001.00000  153001.00000  6.476658535921e-07
153001.00000  154001.00000  5.577122628154e-07
154001.00000  155001.00000  6.656565717474e-07
155001.00000  156001.00000  5.217308265047e-07
156001.00000  157001.00000  5.217308265047e-07
157001.00000  158001.00000  6.656565717474e-07
158001.00000  159001.00000  7.016380080581e-07
159001.00000  160001.00000  5.577122628154e-07
160001.00000  161001.00000  4.137865175727e-07
161001.00000  162001.00000  7.736008806794e-07
162001.00000  163001.00000  7.016380080581e-07
163001.00000  164001.00000  4.677586720387e-07
164001.00000  165001.00000  3.238329267960e-07
165001.00000  166001.00000  3.598143631067e-07
166001.00000  167001.00000  4.137865175727e-07
167001.00000  168001.00000  5.757029809707e-07
168001.00000  169001.00000  3.778050812620e-07
169001.00000  170001.00000  5.577122628154e-07
170001.00000  171001.00000  4.497679538834e-07
171001.00000  172001.00000  3.778050812620e-07
172001.00000  173001.00000  4.497679538834e-07
173001.00000  174001.00000  4.317772357280e-07
174001.00000  175001.00000  2.698607723300e-07
175001.00000  176001.00000  5.217308265047e-07
176001.00000  177001.00000  4.497679538834e-07
177001.00000  178001.00000  4.137865175727e-07
178001.00000  179001.00000  2.698607723300e-07
179001.00000  180001.00000  3.418236449514e-07
180001.00000  181001.00000  3.778050812620e-07
181001.00000  182001.00000  2.698607723300e-07
182001.00000  183001.00000  3.957957994174e-07
183001.00000  184001.00000  2.698607723300e-07
184001.00000  185001.00000  4.137865175727e-07
185001.00000  186001.00000  2.518700541747e-07
186001.00000  187001.00000  3.058422086407e-07
187001.00000  188001.00000  3.778050812620e-07
188001.00000  189001.00000  2.518700541747e-07
189001.00000  190001.00000  2.158886178640e-07
190001.00000  191001.00000  2.518700541747e-07
191001.00000  192001.00000  3.598143631067e-07
192001.00000  193001.00000  3.778050812620e-07
193001.00000  194001.00000  1.799071815533e-07
194001.00000  195001.00000  2.158886178640e-07
195001.00000  196001.00000  3.778050812620e-07
196001.00000  197001.00000  2.158886178640e-07
197001.00000  198001.00000  2.518700541747e-07
198001.00000  199001.00000  2.338793360194e-07
