10001.00000  11001.00000  4.332435115715e-04
11001.00000  12001.00000  3.713639873018e-04
12001.00000  13001.00000  3.272194646862e-04
13001.00000  14001.00000  2.862012426887e-04
14001.00000  15001.00000  2.540698196701e-04
15001.00000  16001.00000  2.254989056888e-04
16001.00000  17001.00000  2.050139173799e-04
17001.00000  18001.00000  1.853298023776e-04
18001.00000  19001.00000  1.665430514415e-04
19001.00000  20001.00000  1.561702947614e-04
20001.00000  21001.00000  1.429800078946e-04
21001.00000  22001.00000  1.326458475183e-04
22001.00000  23001.00000  1.214336212278e-04
23001.00000  24001.00000  1.137529567465e-04
24001.00000  25001.00000  1.054933477063e-04
25001.00000  26001.00000  9.968460396537e-05
26001.00000  27001.00000  9.175306350854e-05
27001.00000  28001.00000  8.622414297111e-05
28001.00000  29001.00000  8.206539122306e-05
29001.00000  30001.00000  7.511805651635e-05
30001.00000  31001.00000  7.100755014821e-05
31001.00000  32001.00000  6.679090394427e-05
32001.00000  33001.00000  6.466810722833e-05
33001.00000  34001.00000  6.201461133341e-05
34001.00000  35001.00000  5.820322632070e-05
35001.00000  36001.00000  5.667867231561e-05
36001.00000  37001.00000  5.295412898673e-05
37001.00000  38001.00000  5.103396286641e-05
38001.00000  39001.00000  4.796555670427e-05
39001.00000  40001.00000  4.614188134376e-05
40001.00000  41001.00000  4.397083924791e-05
41001.00000  42001.00000  4.195418236777e-05
42001.00000  43001.00000  4.129804520102e-05
43001.00000  44001.00000  3.869279468601e-05
44001.00000  45001.00000  3.724543328877e-05
45001.00000  46001.00000  3.620333308277e-05
46001.00000  47001.00000  3.557614314397e-05
47001.00000  48001.00000  3.261387681763e-05
48001.00000  49001.00000  3.110862096451e-05
49001.00000  50001.00000  3.060686901347e-05
50001.00000  51001.00000  2.983494293495e-05
51001.00000  52001.00000  2.775074252293e-05
52001.00000  53001.00000  2.749021747143e-05
53001.00000  54001.00000  2.663144970907e-05
54001.00000  55001.00000  2.555075319914e-05
55001.00000  56001.00000  2.543496428736e-05
56001.00000  57001.00000  2.439286408135e-05
57001.00000  58001.00000  2.311918605179e-05
58001.00000  59001.00000  2.223147106149e-05
59001.00000  60001.00000  2.236655812523e-05
60001.00000  61001.00000  2.117972177950e-05
61001.00000  62001.00000  2.025341048527e-05
62001.00000  63001.00000  1.950078255871e-05
63001.00000  64001.00000  1.931745011506e-05
64001.00000  65001.00000  1.814991192129e-05
65001.00000  66001.00000  1.897973245570e-05
66001.00000  67001.00000  1.880604908804e-05
67001.00000  68001.00000  1.681833943584e-05
68001.00000  69001.00000  1.675079590397e-05
69001.00000  70001.00000  1.618150042106e-05
70001.00000  71001.00000  1.593062444554e-05
71001.00000  72001.00000  1.566045031805e-05
72001.00000  73001.00000  1.520694374692e-05
73001.00000  74001.00000  1.501396222729e-05
74001.00000  75001.00000  1.445431582036e-05
75001.00000  76001.00000  1.393326571736e-05
76001.00000  77001.00000  1.379817865361e-05
77001.00000  78001.00000  1.372098604576e-05
78001.00000  79001.00000  1.319028686678e-05
79001.00000  80001.00000  1.295870904322e-05
80001.00000  81001.00000  1.212888850881e-05
81001.00000  82001.00000  1.142450596215e-05
82001.00000  83001.00000  1.164643470973e-05
83001.00000  84001.00000  1.109643737878e-05
84001.00000  85001.00000  1.130871705037e-05
85001.00000  86001.00000  1.156924210188e-05
86001.00000  87001.00000  1.121222629056e-05
87001.00000  88001.00000  1.039205483213e-05
88001.00000  89001.00000  1.022802054044e-05
89001.00000  90001.00000  1.000609179287e-05
90001.00000  91001.00000  9.494690765843e-06
91001.00000  92001.00000  9.050833270692e-06
92001.00000  93001.00000  9.340305550138e-06
93001.00000  94001.00000  9.851706577160e-06
94001.00000  95001.00000  9.301709246212e-06
95001.00000  96001.00000  8.587677623578e-06
96001.00000  97001.00000  8.549081319651e-06
97001.00000  98001.00000  8.008733064685e-06
98001.00000  99001.00000  8.288556268150e-06
99001.00000  100001.00000  7.661366329349e-06
100001.00000  101001.00000  7.999083988703e-06
101001.00000  102001.00000  7.796453393091e-06
102001.00000  103001.00000  7.506981113644e-06
103001.00000  104001.00000  7.487682961681e-06
104001.00000  105001.00000  7.371894049903e-06
105001.00000  106001.00000  7.285052366069e-06
106001.00000  107001.00000  7.043825466530e-06
107001.00000  108001.00000  7.140316226345e-06
108001.00000  109001.00000  6.860493022880e-06
109001.00000  110001.00000  6.445582755674e-06
110001.00000  111001.00000  6.599967971379e-06
111001.00000  112001.00000  6.532424439508e-06
112001.00000  113001.00000  6.040321564449e-06
113001.00000  114001.00000  5.760498360984e-06
114001.00000  115001.00000  6.069268792394e-06
115001.00000  116001.00000  6.368390147822e-06
116001.00000  117001.00000  5.847340044818e-06
117001.00000  118001.00000  5.692954829113e-06
118001.00000  119001.00000  5.673656677150e-06
119001.00000  120001.00000  5.721902057058e-06
120001.00000  121001.00000  4.882432446663e-06
121001.00000  122001.00000  5.403482549667e-06
122001.00000  123001.00000  5.007870434423e-06
123001.00000  124001.00000  5.065764890313e-06
124001.00000  125001.00000  4.843836142737e-06
125001.00000  126001.00000  4.872783370682e-06
126001.00000  127001.00000  4.959625054516e-06
127001.00000  128001.00000  4.998221358442e-06
128001.00000  129001.00000  4.814888914792e-06
129001.00000  130001.00000  4.342084191697e-06
130001.00000  131001.00000  4.708749078995e-06
131001.00000  132001.00000  4.631556471143e-06
132001.00000  133001.00000  4.197348051973e-06
133001.00000  134001.00000  4.544714787309e-06
134001.00000  135001.00000  4.303487887770e-06
135001.00000  136001.00000  4.564012939272e-06
136001.00000  137001.00000  4.071910064213e-06
137001.00000  138001.00000  4.264891583844e-06
138001.00000  139001.00000  4.033313760287e-06
139001.00000  140001.00000  3.956121152435e-06
140001.00000  141001.00000  3.734192404859e-06
141001.00000  142001.00000  3.898226696545e-06
142001.00000  143001.00000  3.927173924490e-06
143001.00000  144001.00000  3.956121152435e-06
144001.00000  145001.00000  3.878928544582e-06
145001.00000  146001.00000  3.502614581302e-06
146001.00000  147001.00000  3.608754417099e-06
147001.00000  148001.00000  3.396474745505e-06
148001.00000  149001.00000  3.415772897468e-06
149001.00000  150001.00000  3.685947024951e-06
150001.00000  151001.00000  3.203493225874e-06
151001.00000  152001.00000  3.145598769985e-06
152001.00000  153001.00000  3.193844149892e-06
153001.00000  154001.00000  3.444720125413e-06
154001.00000  155001.00000  3.097353390077e-06
155001.00000  156001.00000  2.875424642501e-06
156001.00000  157001.00000  2.971915402317e-06
157001.00000  158001.00000  2.914020946427e-06
158001.00000  159001.00000  2.827179262594e-06
159001.00000  160001.00000  2.653495894926e-06
160001.00000  161001.00000  3.020160782224e-06
161001.00000  162001.00000  2.807881110630e-06
162001.00000  163001.00000  2.759635730723e-06
163001.00000  164001.00000  2.798232034649e-06
164001.00000  165001.00000  2.875424642501e-06
165001.00000  166001.00000  2.836828338575e-06
166001.00000  167001.00000  2.402619919405e-06
167001.00000  168001.00000  2.653495894926e-06
168001.00000  169001.00000  2.605250515018e-06
169001.00000  170001.00000  2.431567147350e-06
170001.00000  171001.00000  2.373672691461e-06
171001.00000  172001.00000  2.161393019867e-06
172001.00000  173001.00000  2.663144970907e-06
173001.00000  174001.00000  2.537706983147e-06
174001.00000  175001.00000  2.344725463516e-06
175001.00000  176001.00000  2.421918071368e-06
176001.00000  177001.00000  2.508759755202e-06
177001.00000  178001.00000  2.460514375295e-06
178001.00000  179001.00000  2.248234703701e-06
179001.00000  180001.00000  2.190340247811e-06
180001.00000  181001.00000  2.238585627719e-06
181001.00000  182001.00000  2.007007804162e-06
182001.00000  183001.00000  1.978060576217e-06
183001.00000  184001.00000  2.055253184070e-06
184001.00000  185001.00000  2.142094867904e-06
185001.00000  186001.00000  1.968411500236e-06
186001.00000  187001.00000  2.344725463516e-06
187001.00000  188001.00000  2.441216223332e-06
188001.00000  189001.00000  2.016656880143e-06
189001.00000  190001.00000  2.257883779682e-06
190001.00000  191001.00000  2.055253184070e-06
191001.00000  192001.00000  1.765780904623e-06
192001.00000  193001.00000  1.678939220789e-06
193001.00000  194001.00000  1.814026284531e-06
194001.00000  195001.00000  1.659641068826e-06
195001.00000  196001.00000  1.987709652199e-06
196001.00000  197001.00000  1.765780904623e-06
197001.00000  198001.00000  1.746482752660e-06
198001.00000  199001.00000  1.688588296771e-06
