300.00000  350.00000  2.131662382747e-01
350.00000  400.00000  1.506695778977e-01
400.00000  450.00000  1.112306541874e-01
450.00000  500.00000  8.537069405456e-02
500.00000  550.00000  6.671354743605e-02
550.00000  600.00000  5.395447138004e-02
600.00000  650.00000  4.392609508536e-02
650.00000  700.00000  3.642438777303e-02
700.00000  750.00000  3.064451954373e-02
750.00000  800.00000  2.636213182870e-02
800.00000  850.00000  2.229356234699e-02
850.00000  900.00000  1.950112633520e-02
900.00000  950.00000  1.712202204908e-02
950.00000  1000.00000  1.517733015950e-02
1000.00000  1050.00000  1.344043345441e-02
1050.00000  1100.00000  1.194747022675e-02
1100.00000  1150.00000  1.076168248920e-02
1150.00000  1200.00000  9.680545225003e-03
1200.00000  1250.00000  8.680719119947e-03
1250.00000  1300.00000  7.856314311939e-03
1300.00000  1350.00000  7.188508773396e-03
1350.00000  1400.00000  6.696124531901e-03
1400.00000  1450.00000  6.078762027273e-03
1450.00000  1500.00000  5.541204919585e-03
1500.00000  1550.00000  5.216713164104e-03
1550.00000  1600.00000  4.841025493605e-03
1600.00000  1650.00000  4.383273782856e-03
1650.00000  1700.00000  4.208605366913e-03
1700.00000  1750.00000  4.069322362820e-03
1750.00000  1800.00000  3.618346582001e-03
1800.00000  1850.00000  3.509931703139e-03
1850.00000  1900.00000  3.276538561146e-03
1900.00000  1950.00000  3.189204353174e-03
1950.00000  2000.00000  3.017547461643e-03
2000.00000  2050.00000  2.907626820576e-03
2050.00000  2100.00000  2.769096697586e-03
2100.00000  2150.00000  2.651647245486e-03
2150.00000  2200.00000  2.626802169080e-03
2200.00000  2250.00000  2.454392396447e-03
2250.00000  2300.00000  2.493542213813e-03
2300.00000  2350.00000  2.419759865699e-03
2350.00000  2400.00000  2.228528065485e-03
2400.00000  2450.00000  2.235303995414e-03
2450.00000  2500.00000  2.099032515734e-03
2500.00000  2550.00000  2.059882698367e-03
2550.00000  2600.00000  1.885967163527e-03
2600.00000  2650.00000  1.919846813171e-03
2650.00000  2700.00000  1.867145135947e-03
2700.00000  2750.00000  1.815949220929e-03
2750.00000  2800.00000  1.743672635022e-03
2800.00000  2850.00000  1.693229601107e-03
2850.00000  2900.00000  1.733132299577e-03
2900.00000  2950.00000  1.704522817655e-03
2950.00000  3000.00000  1.620953015199e-03
3000.00000  3050.00000  1.614177085270e-03
3050.00000  3100.00000  1.550182191498e-03
3100.00000  3150.00000  1.504256444203e-03
3150.00000  3200.00000  1.522325590679e-03
3200.00000  3250.00000  1.435744263811e-03
3250.00000  3300.00000  1.415416474024e-03
3300.00000  3350.00000  1.416922236231e-03
3350.00000  3400.00000  1.388312754309e-03
3400.00000  3450.00000  1.316789049505e-03
3450.00000  3500.00000  1.257311442351e-03
3500.00000  3550.00000  1.264087372280e-03
3550.00000  3600.00000  1.261828728971e-03
3600.00000  3650.00000  1.213644338366e-03
3650.00000  3700.00000  1.173741639896e-03
3700.00000  3750.00000  1.179764688721e-03
3750.00000  3800.00000  1.122545724878e-03
3800.00000  3850.00000  1.075867096479e-03
3850.00000  3900.00000  1.094689124059e-03
3900.00000  3950.00000  9.922972940235e-04
3950.00000  4000.00000  1.026176943668e-03
4000.00000  4050.00000  1.032199992493e-03
4050.00000  4100.00000  1.021659657048e-03
4100.00000  4150.00000  1.028435586977e-03
4150.00000  4200.00000  9.320668057671e-04
4200.00000  4250.00000  9.222793514255e-04
4250.00000  4300.00000  9.200207081159e-04
4300.00000  4350.00000  8.725891986140e-04
4350.00000  4400.00000  8.545200521371e-04
4400.00000  4450.00000  8.981871561229e-04
4450.00000  4500.00000  8.552729332403e-04
4500.00000  4550.00000  7.875136339519e-04
4550.00000  4600.00000  8.582844576531e-04
4600.00000  4650.00000  8.123587103576e-04
4650.00000  4700.00000  7.656800819589e-04
4700.00000  4750.00000  6.896390905353e-04
4750.00000  4800.00000  7.242716212827e-04
4800.00000  4850.00000  7.333061945211e-04
4850.00000  4900.00000  6.873804472257e-04
4900.00000  4950.00000  7.280360267987e-04
4950.00000  5000.00000  6.828631606064e-04
5000.00000  5050.00000  6.595238464071e-04
5050.00000  5100.00000  6.316672455885e-04
5100.00000  5150.00000  6.399489377238e-04
5150.00000  5200.00000  6.000462392540e-04
5200.00000  5250.00000  6.241384345565e-04
5250.00000  5300.00000  5.925174282219e-04
5300.00000  5350.00000  5.985404770475e-04
5350.00000  5400.00000  5.383099887912e-04
5400.00000  5450.00000  5.548733730617e-04
5450.00000  5500.00000  5.496032053393e-04
5500.00000  5550.00000  5.224994856239e-04
5550.00000  5600.00000  5.315340588624e-04
5600.00000  5650.00000  4.976544092182e-04
5650.00000  5700.00000  4.931371225989e-04
5700.00000  5750.00000  4.841025493605e-04
5750.00000  5800.00000  4.750679761220e-04
5800.00000  5850.00000  5.119591501790e-04
5850.00000  5900.00000  4.750679761220e-04
5900.00000  5950.00000  4.314008721362e-04
5950.00000  6000.00000  4.517286619227e-04
6000.00000  6050.00000  4.336595154458e-04
6050.00000  6100.00000  4.110730823496e-04
6100.00000  6150.00000  4.351652776522e-04
6150.00000  6200.00000  4.148374878657e-04
6200.00000  6250.00000  4.291422288265e-04
6250.00000  6300.00000  4.381768020650e-04
6300.00000  6350.00000  3.960154602855e-04
6350.00000  6400.00000  4.735622139156e-04
6400.00000  6450.00000  4.042971524208e-04
6450.00000  6500.00000  3.839693626343e-04
6500.00000  6550.00000  3.930039358727e-04
6550.00000  6600.00000  3.802049571183e-04
6600.00000  6650.00000  3.621358106413e-04
6650.00000  6700.00000  3.651473350542e-04
6700.00000  6750.00000  3.651473350542e-04
6750.00000  6800.00000  3.470781885773e-04
6800.00000  6850.00000  3.726761460862e-04
6850.00000  6900.00000  3.448195452676e-04
6900.00000  6950.00000  3.297619232036e-04
6950.00000  7000.00000  3.290090421004e-04
7000.00000  7050.00000  3.214802310683e-04
7050.00000  7100.00000  3.064226090042e-04
7100.00000  7150.00000  2.800717703921e-04
7150.00000  7200.00000  2.740487215664e-04
7200.00000  7250.00000  2.710371971536e-04
7250.00000  7300.00000  2.725429593600e-04
7300.00000  7350.00000  2.823304137017e-04
7350.00000  7400.00000  2.544738128831e-04
7400.00000  7450.00000  2.763073648760e-04
7450.00000  7500.00000  2.461921207479e-04
7500.00000  7550.00000  2.364046664062e-04
7550.00000  7600.00000  2.507094073671e-04
7600.00000  7650.00000  2.522151695735e-04
7650.00000  7700.00000  2.281229742710e-04
7700.00000  7750.00000  2.416748341286e-04
7750.00000  7800.00000  2.213470443421e-04
7800.00000  7850.00000  2.484507640575e-04
7850.00000  7900.00000  2.356517853030e-04
7900.00000  7950.00000  2.055365411748e-04
7950.00000  8000.00000  2.303816175806e-04
8000.00000  8050.00000  2.070423033812e-04
8050.00000  8100.00000  2.108067088973e-04
8100.00000  8150.00000  2.273700931677e-04
8150.00000  8200.00000  2.175826388261e-04
8200.00000  8250.00000  2.251114498581e-04
8250.00000  8300.00000  2.100538277940e-04
8300.00000  8350.00000  2.228528065485e-04
8350.00000  8400.00000  2.025250167620e-04
8400.00000  8450.00000  2.055365411748e-04
8450.00000  8500.00000  1.980077301428e-04
8500.00000  8550.00000  2.025250167620e-04
8550.00000  8600.00000  1.942433246268e-04
8600.00000  8650.00000  1.965019679364e-04
8650.00000  8700.00000  1.837029891819e-04
8700.00000  8750.00000  1.867145135947e-04
8750.00000  8800.00000  1.761741781498e-04
8800.00000  8850.00000  1.919846813171e-04
8850.00000  8900.00000  1.799385836659e-04
8900.00000  8950.00000  1.769270592530e-04
8950.00000  9000.00000  1.716568915306e-04
9000.00000  9050.00000  1.633751993954e-04
9050.00000  9100.00000  1.693982482210e-04
9100.00000  9150.00000  1.814443458723e-04
9150.00000  9200.00000  1.618694371890e-04
9200.00000  9250.00000  1.550935072601e-04
9250.00000  9300.00000  1.739155348402e-04
9300.00000  9350.00000  1.701511293242e-04
9350.00000  9400.00000  1.641280804986e-04
9400.00000  9450.00000  1.460589340217e-04
9450.00000  9500.00000  1.581050316729e-04
9500.00000  9550.00000  1.693982482210e-04
9550.00000  9600.00000  1.453060529185e-04
9600.00000  9650.00000  1.460589340217e-04
9650.00000  9700.00000  1.159436898935e-04
9700.00000  9750.00000  1.438002907121e-04
9750.00000  9800.00000  1.249782631319e-04
9800.00000  9850.00000  1.385301229896e-04
9850.00000  9900.00000  1.422945285056e-04
9900.00000  9950.00000  1.407887662992e-04
9950.00000  10000.00000  1.302484308544e-04
