10001.00000  11001.00000  4.420843172852e-05
11001.00000  12001.00000  4.130475805177e-05
12001.00000  13001.00000  4.121401824937e-05
13001.00000  14001.00000  3.907255891277e-05
14001.00000  15001.00000  3.919959463613e-05
15001.00000  16001.00000  3.718517102288e-05
16001.00000  17001.00000  3.497111984436e-05
17001.00000  18001.00000  3.399112997846e-05
18001.00000  19001.00000  3.054301748732e-05
19001.00000  20001.00000  2.952673170045e-05
20001.00000  21001.00000  2.727638460097e-05
21001.00000  22001.00000  2.575195592068e-05
22001.00000  23001.00000  2.482640993621e-05
23001.00000  24001.00000  2.232199139002e-05
24001.00000  25001.00000  2.050719534205e-05
25001.00000  26001.00000  1.887387889888e-05
26001.00000  27001.00000  1.827499620305e-05
27001.00000  28001.00000  1.685945528563e-05
28001.00000  29001.00000  1.517169496102e-05
29001.00000  30001.00000  1.381059792504e-05
30001.00000  31001.00000  1.283060805914e-05
31001.00000  32001.00000  1.157839878604e-05
32001.00000  33001.00000  1.186876615372e-05
33001.00000  34001.00000  1.036248543390e-05
34001.00000  35001.00000  1.010841398719e-05
35001.00000  36001.00000  9.400643528479e-06
36001.00000  37001.00000  8.420653662575e-06
37001.00000  38001.00000  7.767327085307e-06
38001.00000  39001.00000  7.077704587078e-06
39001.00000  40001.00000  7.150296428997e-06
40001.00000  41001.00000  6.624005575086e-06
41001.00000  42001.00000  6.369934128371e-06
42001.00000  43001.00000  5.317352420549e-06
43001.00000  44001.00000  5.135872815752e-06
44001.00000  45001.00000  5.099576894792e-06
45001.00000  46001.00000  4.845505448077e-06
46001.00000  47001.00000  4.446250317524e-06
47001.00000  48001.00000  4.355510515125e-06
48001.00000  49001.00000  3.502556372580e-06
49001.00000  50001.00000  3.684035977377e-06
50001.00000  51001.00000  3.230336965385e-06
51001.00000  52001.00000  3.538852293539e-06
52001.00000  53001.00000  2.704046111474e-06
53001.00000  54001.00000  3.030709400108e-06
54001.00000  55001.00000  2.577010388116e-06
55001.00000  56001.00000  2.722194071953e-06
56001.00000  57001.00000  2.431826704278e-06
57001.00000  58001.00000  2.685898150994e-06
58001.00000  59001.00000  1.923683810847e-06
59001.00000  60001.00000  2.014423613245e-06
60001.00000  61001.00000  1.905535850367e-06
61001.00000  62001.00000  2.195903218042e-06
62001.00000  63001.00000  1.597020522213e-06
63001.00000  64001.00000  1.705908285091e-06
64001.00000  65001.00000  1.397392956936e-06
65001.00000  66001.00000  1.469984798855e-06
66001.00000  67001.00000  1.615168482692e-06
67001.00000  68001.00000  1.506280719814e-06
68001.00000  69001.00000  1.433688877895e-06
69001.00000  70001.00000  1.433688877895e-06
70001.00000  71001.00000  1.252209273098e-06
71001.00000  72001.00000  1.288505194058e-06
72001.00000  73001.00000  1.125173549741e-06
73001.00000  74001.00000  9.255459844641e-07
74001.00000  75001.00000  1.088877628781e-06
75001.00000  76001.00000  8.348061820657e-07
76001.00000  77001.00000  8.348061820657e-07
77001.00000  78001.00000  1.125173549741e-06
78001.00000  79001.00000  8.166582215860e-07
79001.00000  80001.00000  7.622143401469e-07
80001.00000  81001.00000  8.892500635047e-07
81001.00000  82001.00000  5.988826958297e-07
82001.00000  83001.00000  9.618419054235e-07
83001.00000  84001.00000  6.896224982282e-07
84001.00000  85001.00000  6.351786167891e-07
85001.00000  86001.00000  6.896224982282e-07
86001.00000  87001.00000  7.803623006266e-07
87001.00000  88001.00000  5.807347353500e-07
88001.00000  89001.00000  7.622143401469e-07
89001.00000  90001.00000  5.988826958297e-07
90001.00000  91001.00000  5.081428934313e-07
91001.00000  92001.00000  5.262908539110e-07
92001.00000  93001.00000  3.448112491141e-07
93001.00000  94001.00000  4.174030910328e-07
94001.00000  95001.00000  4.174030910328e-07
95001.00000  96001.00000  4.718469724719e-07
96001.00000  97001.00000  3.085153281547e-07
97001.00000  98001.00000  3.992551305531e-07
98001.00000  99001.00000  3.992551305531e-07
99001.00000  100001.00000  3.085153281547e-07
100001.00000  101001.00000  2.177755257563e-07
101001.00000  102001.00000  2.903673676750e-07
102001.00000  103001.00000  3.629592095938e-07
103001.00000  104001.00000  2.540714467156e-07
104001.00000  105001.00000  3.085153281547e-07
105001.00000  106001.00000  2.722194071953e-07
106001.00000  107001.00000  3.448112491141e-07
107001.00000  108001.00000  2.903673676750e-07
108001.00000  109001.00000  3.448112491141e-07
109001.00000  110001.00000  2.722194071953e-07
110001.00000  111001.00000  1.996275652766e-07
111001.00000  112001.00000  3.811071700735e-07
112001.00000  113001.00000  1.814796047969e-07
113001.00000  114001.00000  1.633316443172e-07
114001.00000  115001.00000  1.451836838375e-07
115001.00000  116001.00000  1.814796047969e-07
116001.00000  117001.00000  2.177755257563e-07
117001.00000  118001.00000  1.633316443172e-07
118001.00000  119001.00000  1.996275652766e-07
119001.00000  120001.00000  1.270357233578e-07
120001.00000  121001.00000  1.088877628781e-07
121001.00000  122001.00000  1.270357233578e-07
122001.00000  123001.00000  2.177755257563e-07
123001.00000  124001.00000  1.814796047969e-07
124001.00000  125001.00000  1.451836838375e-07
125001.00000  126001.00000  5.444388143907e-08
126001.00000  127001.00000  1.451836838375e-07
127001.00000  128001.00000  1.451836838375e-07
128001.00000  129001.00000  1.270357233578e-07
129001.00000  130001.00000  5.444388143907e-08
130001.00000  131001.00000  7.259184191875e-08
131001.00000  132001.00000  1.270357233578e-07
132001.00000  133001.00000  1.451836838375e-07
133001.00000  134001.00000  7.259184191875e-08
134001.00000  135001.00000  5.444388143907e-08
135001.00000  136001.00000  7.259184191875e-08
136001.00000  137001.00000  5.444388143907e-08
137001.00000  138001.00000  7.259184191875e-08
138001.00000  139001.00000  5.444388143907e-08
139001.00000  140001.00000  7.259184191875e-08
140001.00000  141001.00000  1.270357233578e-07
141001.00000  142001.00000  5.444388143907e-08
142001.00000  143001.00000  7.259184191875e-08
143001.00000  144001.00000  9.073980239844e-08
144001.00000  145001.00000  7.259184191875e-08
145001.00000  146001.00000  7.259184191875e-08
146001.00000  147001.00000  7.259184191875e-08
147001.00000  148001.00000  9.073980239844e-08
148001.00000  149001.00000  9.073980239844e-08
149001.00000  150001.00000  1.814796047969e-08
150001.00000  151001.00000  7.259184191875e-08
151001.00000  152001.00000  3.629592095938e-08
152001.00000  153001.00000  7.259184191875e-08
153001.00000  154001.00000  1.814796047969e-08
154001.00000  155001.00000  7.259184191875e-08
155001.00000  156001.00000  5.444388143907e-08
156001.00000  157001.00000  3.629592095938e-08
157001.00000  158001.00000  0.000000000000e+00
158001.00000  159001.00000  7.259184191875e-08
159001.00000  160001.00000  1.814796047969e-08
160001.00000  161001.00000  5.444388143907e-08
161001.00000  162001.00000  1.814796047969e-08
162001.00000  163001.00000  3.629592095938e-08
163001.00000  164001.00000  7.259184191875e-08
164001.00000  165001.00000  0.000000000000e+00
165001.00000  166001.00000  5.444388143907e-08
166001.00000  167001.00000  5.444388143907e-08
167001.00000  168001.00000  7.259184191875e-08
168001.00000  169001.00000  3.629592095938e-08
169001.00000  170001.00000  3.629592095938e-08
170001.00000  171001.00000  1.814796047969e-08
171001.00000  172001.00000  1.814796047969e-08
172001.00000  173001.00000  5.444388143907e-08
173001.00000  174001.00000  5.444388143907e-08
174001.00000  175001.00000  1.814796047969e-08
175001.00000  176001.00000  3.629592095938e-08
176001.00000  177001.00000  3.629592095938e-08
177001.00000  178001.00000  3.629592095938e-08
178001.00000  179001.00000  1.814796047969e-08
179001.00000  180001.00000  3.629592095938e-08
180001.00000  181001.00000  0.000000000000e+00
181001.00000  182001.00000  0.000000000000e+00
182001.00000  183001.00000  3.629592095938e-08
183001.00000  184001.00000  0.000000000000e+00
184001.00000  185001.00000  3.629592095938e-08
185001.00000  186001.00000  1.814796047969e-08
186001.00000  187001.00000  0.000000000000e+00
187001.00000  188001.00000  1.814796047969e-08
188001.00000  189001.00000  5.444388143907e-08
189001.00000  190001.00000  1.814796047969e-08
190001.00000  191001.00000  1.814796047969e-08
191001.00000  192001.00000  0.000000000000e+00
192001.00000  193001.00000  1.814796047969e-08
193001.00000  194001.00000  1.814796047969e-08
194001.00000  195001.00000  3.629592095938e-08
195001.00000  196001.00000  0.000000000000e+00
196001.00000  197001.00000  0.000000000000e+00
197001.00000  198001.00000  0.000000000000e+00
198001.00000  199001.00000  0.000000000000e+00
