10001.00000  11001.00000  2.119324885580e-04
11001.00000  12001.00000  1.669952847966e-04
12001.00000  13001.00000  1.341719357858e-04
13001.00000  14001.00000  1.111835975627e-04
14001.00000  15001.00000  9.651104081854e-05
15001.00000  16001.00000  8.099890998275e-05
16001.00000  17001.00000  6.932483213726e-05
17001.00000  18001.00000  5.801057175961e-05
18001.00000  19001.00000  5.129397902659e-05
19001.00000  20001.00000  4.325805557815e-05
20001.00000  21001.00000  3.886028652677e-05
21001.00000  22001.00000  3.402274057025e-05
22001.00000  23001.00000  2.910523517643e-05
23001.00000  24001.00000  2.462750668775e-05
24001.00000  25001.00000  2.182892638232e-05
25001.00000  26001.00000  2.010979848042e-05
26001.00000  27001.00000  1.743115733094e-05
27001.00000  28001.00000  1.647164408336e-05
28001.00000  29001.00000  1.459259730686e-05
29001.00000  30001.00000  1.399290152713e-05
30001.00000  31001.00000  1.083450375386e-05
31001.00000  32001.00000  9.994929662235e-06
32001.00000  33001.00000  8.555659790873e-06
33001.00000  34001.00000  8.475700353575e-06
34001.00000  35001.00000  7.556166824649e-06
35001.00000  36001.00000  7.236329075458e-06
36001.00000  37001.00000  6.276815827883e-06
37001.00000  38001.00000  5.717099766798e-06
38001.00000  39001.00000  4.797566237873e-06
39001.00000  40001.00000  4.397769051383e-06
40001.00000  41001.00000  3.918012427596e-06
41001.00000  42001.00000  3.478235522458e-06
42001.00000  43001.00000  3.158397773266e-06
43001.00000  44001.00000  3.318316647862e-06
44001.00000  45001.00000  2.998478898670e-06
45001.00000  46001.00000  3.798073271649e-06
46001.00000  47001.00000  2.638661430830e-06
47001.00000  48001.00000  2.318823681638e-06
48001.00000  49001.00000  2.478742556234e-06
49001.00000  50001.00000  1.519229308660e-06
50001.00000  51001.00000  1.839067057851e-06
51001.00000  52001.00000  1.359310434064e-06
52001.00000  53001.00000  1.559209027309e-06
53001.00000  54001.00000  2.118925088394e-06
54001.00000  55001.00000  1.159411840819e-06
55001.00000  56001.00000  1.839067057851e-06
56001.00000  57001.00000  1.559209027309e-06
57001.00000  58001.00000  1.079452403521e-06
58001.00000  59001.00000  1.039472684872e-06
59001.00000  60001.00000  9.994929662235e-07
60001.00000  61001.00000  1.199391559468e-06
61001.00000  62001.00000  7.596146543298e-07
62001.00000  63001.00000  6.796552170319e-07
63001.00000  64001.00000  8.395740916277e-07
64001.00000  65001.00000  5.597160610851e-07
65001.00000  66001.00000  7.995943729788e-07
66001.00000  67001.00000  4.797566237873e-07
67001.00000  68001.00000  8.395740916277e-07
68001.00000  69001.00000  4.797566237873e-07
69001.00000  70001.00000  5.597160610851e-07
70001.00000  71001.00000  8.395740916277e-07
71001.00000  72001.00000  3.598174678404e-07
72001.00000  73001.00000  5.996957797341e-07
73001.00000  74001.00000  4.397769051383e-07
74001.00000  75001.00000  3.997971864894e-07
75001.00000  76001.00000  4.397769051383e-07
76001.00000  77001.00000  4.397769051383e-07
77001.00000  78001.00000  7.596146543298e-07
78001.00000  79001.00000  3.997971864894e-07
79001.00000  80001.00000  4.797566237873e-07
80001.00000  81001.00000  2.798580305426e-07
81001.00000  82001.00000  2.798580305426e-07
82001.00000  83001.00000  2.398783118936e-07
83001.00000  84001.00000  1.998985932447e-07
84001.00000  85001.00000  3.198377491915e-07
85001.00000  86001.00000  3.598174678404e-07
86001.00000  87001.00000  1.998985932447e-07
87001.00000  88001.00000  1.998985932447e-07
88001.00000  89001.00000  2.798580305426e-07
89001.00000  90001.00000  1.599188745958e-07
90001.00000  91001.00000  7.995943729788e-08
91001.00000  92001.00000  1.998985932447e-07
92001.00000  93001.00000  1.199391559468e-07
93001.00000  94001.00000  7.995943729788e-08
94001.00000  95001.00000  2.398783118936e-07
95001.00000  96001.00000  1.599188745958e-07
96001.00000  97001.00000  1.199391559468e-07
97001.00000  98001.00000  0.000000000000e+00
98001.00000  99001.00000  1.599188745958e-07
99001.00000  100001.00000  1.599188745958e-07
100001.00000  101001.00000  7.995943729788e-08
101001.00000  102001.00000  1.599188745958e-07
102001.00000  103001.00000  2.398783118936e-07
103001.00000  104001.00000  7.995943729788e-08
104001.00000  105001.00000  7.995943729788e-08
105001.00000  106001.00000  3.997971864894e-08
106001.00000  107001.00000  3.997971864894e-08
107001.00000  108001.00000  1.199391559468e-07
108001.00000  109001.00000  1.199391559468e-07
109001.00000  110001.00000  1.199391559468e-07
110001.00000  111001.00000  3.997971864894e-08
111001.00000  112001.00000  7.995943729788e-08
112001.00000  113001.00000  3.997971864894e-08
113001.00000  114001.00000  1.199391559468e-07
114001.00000  115001.00000  0.000000000000e+00
115001.00000  116001.00000  3.997971864894e-08
116001.00000  117001.00000  3.997971864894e-08
117001.00000  118001.00000  3.997971864894e-08
118001.00000  119001.00000  0.000000000000e+00
119001.00000  120001.00000  3.997971864894e-08
120001.00000  121001.00000  0.000000000000e+00
121001.00000  122001.00000  3.997971864894e-08
122001.00000  123001.00000  7.995943729788e-08
123001.00000  124001.00000  0.000000000000e+00
124001.00000  125001.00000  3.997971864894e-08
125001.00000  126001.00000  3.997971864894e-08
126001.00000  127001.00000  0.000000000000e+00
127001.00000  128001.00000  1.199391559468e-07
128001.00000  129001.00000  3.997971864894e-08
129001.00000  130001.00000  0.000000000000e+00
130001.00000  131001.00000  0.000000000000e+00
131001.00000  132001.00000  7.995943729788e-08
132001.00000  133001.00000  3.997971864894e-08
133001.00000  134001.00000  0.000000000000e+00
134001.00000  135001.00000  0.000000000000e+00
135001.00000  136001.00000  0.000000000000e+00
136001.00000  137001.00000  0.000000000000e+00
137001.00000  138001.00000  0.000000000000e+00
138001.00000  139001.00000  3.997971864894e-08
139001.00000  140001.00000  3.997971864894e-08
140001.00000  141001.00000  0.000000000000e+00
141001.00000  142001.00000  3.997971864894e-08
142001.00000  143001.00000  0.000000000000e+00
143001.00000  144001.00000  3.997971864894e-08
144001.00000  145001.00000  0.000000000000e+00
145001.00000  146001.00000  3.997971864894e-08
146001.00000  147001.00000  7.995943729788e-08
147001.00000  148001.00000  3.997971864894e-08
148001.00000  149001.00000  0.000000000000e+00
149001.00000  150001.00000  0.000000000000e+00
150001.00000  151001.00000  0.000000000000e+00
151001.00000  152001.00000  0.000000000000e+00
152001.00000  153001.00000  0.000000000000e+00
153001.00000  154001.00000  0.000000000000e+00
154001.00000  155001.00000  0.000000000000e+00
155001.00000  156001.00000  0.000000000000e+00
156001.00000  157001.00000  0.000000000000e+00
157001.00000  158001.00000  0.000000000000e+00
158001.00000  159001.00000  3.997971864894e-08
159001.00000  160001.00000  3.997971864894e-08
160001.00000  161001.00000  3.997971864894e-08
161001.00000  162001.00000  0.000000000000e+00
162001.00000  163001.00000  0.000000000000e+00
163001.00000  164001.00000  0.000000000000e+00
164001.00000  165001.00000  0.000000000000e+00
165001.00000  166001.00000  0.000000000000e+00
166001.00000  167001.00000  0.000000000000e+00
167001.00000  168001.00000  0.000000000000e+00
168001.00000  169001.00000  0.000000000000e+00
169001.00000  170001.00000  0.000000000000e+00
170001.00000  171001.00000  3.997971864894e-08
171001.00000  172001.00000  0.000000000000e+00
172001.00000  173001.00000  0.000000000000e+00
173001.00000  174001.00000  0.000000000000e+00
174001.00000  175001.00000  0.000000000000e+00
175001.00000  176001.00000  0.000000000000e+00
176001.00000  177001.00000  0.000000000000e+00
177001.00000  178001.00000  0.000000000000e+00
178001.00000  179001.00000  0.000000000000e+00
179001.00000  180001.00000  0.000000000000e+00
180001.00000  181001.00000  3.997971864894e-08
181001.00000  182001.00000  0.000000000000e+00
182001.00000  183001.00000  0.000000000000e+00
183001.00000  184001.00000  0.000000000000e+00
184001.00000  185001.00000  0.000000000000e+00
185001.00000  186001.00000  0.000000000000e+00
186001.00000  187001.00000  0.000000000000e+00
187001.00000  188001.00000  0.000000000000e+00
188001.00000  189001.00000  0.000000000000e+00
189001.00000  190001.00000  0.000000000000e+00
190001.00000  191001.00000  0.000000000000e+00
191001.00000  192001.00000  0.000000000000e+00
192001.00000  193001.00000  0.000000000000e+00
193001.00000  194001.00000  0.000000000000e+00
194001.00000  195001.00000  0.000000000000e+00
195001.00000  196001.00000  0.000000000000e+00
196001.00000  197001.00000  0.000000000000e+00
197001.00000  198001.00000  0.000000000000e+00
198001.00000  199001.00000  0.000000000000e+00
