300.00000  350.00000  2.178574743549e-06
350.00000  400.00000  8.351203183605e-06
400.00000  450.00000  4.720245277690e-06
450.00000  500.00000  5.446436858873e-06
500.00000  550.00000  4.030363275566e-05
550.00000  600.00000  6.898820021239e-06
600.00000  650.00000  1.307144846130e-05
650.00000  700.00000  5.083341068281e-06
700.00000  750.00000  7.261915811831e-06
750.00000  800.00000  6.535724230648e-06
800.00000  850.00000  2.105955585431e-05
850.00000  900.00000  6.172628440056e-06
900.00000  950.00000  3.630957905915e-06
950.00000  1000.00000  4.720245277690e-06
1000.00000  1050.00000  4.720245277690e-06
1050.00000  1100.00000  2.178574743549e-06
1100.00000  1150.00000  5.809532649465e-06
1150.00000  1200.00000  3.630957905915e-06
1200.00000  1250.00000  7.261915811831e-06
1250.00000  1300.00000  1.379764004248e-05
1300.00000  1350.00000  5.809532649465e-06
1350.00000  1400.00000  3.267862115324e-06
1400.00000  1450.00000  3.994053696507e-06
1450.00000  1500.00000  5.446436858873e-06
1500.00000  1550.00000  5.083341068281e-06
1550.00000  1600.00000  4.720245277690e-06
1600.00000  1650.00000  7.261915811831e-06
1650.00000  1700.00000  4.357149487098e-06
1700.00000  1750.00000  1.343454425189e-05
1750.00000  1800.00000  5.809532649465e-06
1800.00000  1850.00000  3.267862115324e-06
1850.00000  1900.00000  4.357149487098e-06
1900.00000  1950.00000  6.535724230648e-06
1950.00000  2000.00000  7.625011602422e-06
2000.00000  2050.00000  8.351203183605e-06
2050.00000  2100.00000  5.446436858873e-06
2100.00000  2150.00000  5.083341068281e-06
2150.00000  2200.00000  6.535724230648e-06
2200.00000  2250.00000  6.172628440056e-06
2250.00000  2300.00000  4.720245277690e-06
2300.00000  2350.00000  1.924407690135e-05
2350.00000  2400.00000  5.809532649465e-06
2400.00000  2450.00000  7.988107393014e-06
2450.00000  2500.00000  6.898820021239e-06
2500.00000  2550.00000  6.535724230648e-06
2550.00000  2600.00000  7.988107393014e-06
2600.00000  2650.00000  5.446436858873e-06
2650.00000  2700.00000  7.625011602422e-06
2700.00000  2750.00000  5.809532649465e-06
2750.00000  2800.00000  7.988107393014e-06
2800.00000  2850.00000  7.988107393014e-06
2850.00000  2900.00000  8.714298974197e-06
2900.00000  2950.00000  6.535724230648e-06
2950.00000  3000.00000  1.016668213656e-05
3000.00000  3050.00000  7.261915811831e-06
3050.00000  3100.00000  5.809532649465e-06
3100.00000  3150.00000  5.809532649465e-06
3150.00000  3200.00000  1.161906529893e-05
3200.00000  3250.00000  7.625011602422e-06
3250.00000  3300.00000  1.089287371775e-05
3300.00000  3350.00000  6.898820021239e-06
3350.00000  3400.00000  5.083341068281e-06
3400.00000  3450.00000  9.803586345971e-06
3450.00000  3500.00000  5.809532649465e-06
3500.00000  3550.00000  7.261915811831e-06
3550.00000  3600.00000  1.016668213656e-05
3600.00000  3650.00000  7.625011602422e-06
3650.00000  3700.00000  1.561311899544e-05
3700.00000  3750.00000  4.357149487098e-06
3750.00000  3800.00000  8.714298974197e-06
3800.00000  3850.00000  7.261915811831e-06
3850.00000  3900.00000  7.261915811831e-06
3900.00000  3950.00000  1.052977792715e-05
3950.00000  4000.00000  7.988107393014e-06
4000.00000  4050.00000  1.016668213656e-05
4050.00000  4100.00000  5.809532649465e-06
4100.00000  4150.00000  1.016668213656e-05
4150.00000  4200.00000  1.016668213656e-05
4200.00000  4250.00000  6.898820021239e-06
4250.00000  4300.00000  1.089287371775e-05
4300.00000  4350.00000  8.714298974197e-06
4350.00000  4400.00000  1.016668213656e-05
4400.00000  4450.00000  1.052977792715e-05
4450.00000  4500.00000  9.803586345971e-06
4500.00000  4550.00000  7.625011602422e-06
4550.00000  4600.00000  8.714298974197e-06
4600.00000  4650.00000  7.261915811831e-06
4650.00000  4700.00000  1.016668213656e-05
4700.00000  4750.00000  1.307144846130e-05
4750.00000  4800.00000  1.161906529893e-05
4800.00000  4850.00000  9.803586345971e-06
4850.00000  4900.00000  6.535724230648e-06
4900.00000  4950.00000  7.261915811831e-06
4950.00000  5000.00000  1.234525688011e-05
5000.00000  5050.00000  9.803586345971e-06
5050.00000  5100.00000  9.077394764788e-06
5100.00000  5150.00000  9.077394764788e-06
5150.00000  5200.00000  1.379764004248e-05
5200.00000  5250.00000  9.803586345971e-06
5250.00000  5300.00000  1.270835267070e-05
5300.00000  5350.00000  1.089287371775e-05
5350.00000  5400.00000  1.234525688011e-05
5400.00000  5450.00000  1.089287371775e-05
5450.00000  5500.00000  1.161906529893e-05
5500.00000  5550.00000  9.803586345971e-06
5550.00000  5600.00000  1.161906529893e-05
5600.00000  5650.00000  9.803586345971e-06
5650.00000  5700.00000  7.625011602422e-06
5700.00000  5750.00000  9.077394764788e-06
5750.00000  5800.00000  7.261915811831e-06
5800.00000  5850.00000  1.052977792715e-05
5850.00000  5900.00000  8.351203183605e-06
5900.00000  5950.00000  1.198216108952e-05
5950.00000  6000.00000  1.016668213656e-05
6000.00000  6050.00000  7.988107393014e-06
6050.00000  6100.00000  8.351203183605e-06
6100.00000  6150.00000  9.803586345971e-06
6150.00000  6200.00000  7.261915811831e-06
6200.00000  6250.00000  1.379764004248e-05
6250.00000  6300.00000  1.670240636721e-05
6300.00000  6350.00000  2.214884322608e-05
6350.00000  6400.00000  1.405180709589e-04
6400.00000  6450.00000  1.161906529893e-05
6450.00000  6500.00000  1.016668213656e-05
6500.00000  6550.00000  9.440490555380e-06
6550.00000  6600.00000  9.077394764788e-06
6600.00000  6650.00000  1.016668213656e-05
6650.00000  6700.00000  9.440490555380e-06
6700.00000  6750.00000  7.261915811831e-06
6750.00000  6800.00000  1.307144846130e-05
6800.00000  6850.00000  7.261915811831e-06
6850.00000  6900.00000  9.440490555380e-06
6900.00000  6950.00000  1.052977792715e-05
6950.00000  7000.00000  9.077394764788e-06
7000.00000  7050.00000  1.161906529893e-05
7050.00000  7100.00000  2.214884322608e-05
7100.00000  7150.00000  6.535724230648e-06
7150.00000  7200.00000  3.994053696507e-06
7200.00000  7250.00000  2.904766324732e-06
7250.00000  7300.00000  5.446436858873e-06
7300.00000  7350.00000  5.083341068281e-06
7350.00000  7400.00000  5.083341068281e-06
7400.00000  7450.00000  6.535724230648e-06
7450.00000  7500.00000  1.161906529893e-05
7500.00000  7550.00000  3.994053696507e-06
7550.00000  7600.00000  7.625011602422e-06
7600.00000  7650.00000  5.446436858873e-06
7650.00000  7700.00000  4.357149487098e-06
7700.00000  7750.00000  5.809532649465e-06
7750.00000  7800.00000  6.535724230648e-06
7800.00000  7850.00000  6.172628440056e-06
7850.00000  7900.00000  7.988107393014e-06
7900.00000  7950.00000  6.172628440056e-06
7950.00000  8000.00000  6.172628440056e-06
8000.00000  8050.00000  5.446436858873e-06
8050.00000  8100.00000  4.720245277690e-06
8100.00000  8150.00000  6.172628440056e-06
8150.00000  8200.00000  4.720245277690e-06
8200.00000  8250.00000  6.172628440056e-06
8250.00000  8300.00000  7.625011602422e-06
8300.00000  8350.00000  6.172628440056e-06
8350.00000  8400.00000  6.172628440056e-06
8400.00000  8450.00000  5.083341068281e-06
8450.00000  8500.00000  6.172628440056e-06
8500.00000  8550.00000  8.351203183605e-06
8550.00000  8600.00000  5.809532649465e-06
8600.00000  8650.00000  4.357149487098e-06
8650.00000  8700.00000  5.809532649465e-06
8700.00000  8750.00000  5.446436858873e-06
8750.00000  8800.00000  3.994053696507e-06
8800.00000  8850.00000  4.720245277690e-06
8850.00000  8900.00000  5.809532649465e-06
8900.00000  8950.00000  6.535724230648e-06
8950.00000  9000.00000  5.809532649465e-06
9000.00000  9050.00000  5.083341068281e-06
9050.00000  9100.00000  3.267862115324e-06
9100.00000  9150.00000  5.446436858873e-06
9150.00000  9200.00000  7.261915811831e-06
9200.00000  9250.00000  7.261915811831e-06
9250.00000  9300.00000  4.720245277690e-06
9300.00000  9350.00000  5.083341068281e-06
9350.00000  9400.00000  6.898820021239e-06
9400.00000  9450.00000  5.446436858873e-06
9450.00000  9500.00000  5.809532649465e-06
9500.00000  9550.00000  6.898820021239e-06
9550.00000  9600.00000  4.720245277690e-06
9600.00000  9650.00000  7.261915811831e-06
9650.00000  9700.00000  3.994053696507e-06
9700.00000  9750.00000  5.083341068281e-06
9750.00000  9800.00000  4.720245277690e-06
9800.00000  9850.00000  5.446436858873e-06
9850.00000  9900.00000  3.994053696507e-06
9900.00000  9950.00000  4.357149487098e-06
9950.00000  10000.00000  6.172628440056e-06
