300.00000  350.00000  3.354948830762e-01
350.00000  400.00000  2.514453128996e-01
400.00000  450.00000  1.955434667255e-01
450.00000  500.00000  1.565865554148e-01
500.00000  550.00000  1.281068305962e-01
550.00000  600.00000  1.066660961143e-01
600.00000  650.00000  9.004850617646e-02
650.00000  700.00000  7.701344500318e-02
700.00000  750.00000  6.728442432035e-02
750.00000  800.00000  5.867675698771e-02
800.00000  850.00000  5.160481727105e-02
850.00000  900.00000  4.580572642267e-02
900.00000  950.00000  4.111151423456e-02
950.00000  1000.00000  3.716081196501e-02
1000.00000  1050.00000  3.347621175206e-02
1050.00000  1100.00000  3.059457359951e-02
1100.00000  1150.00000  2.790167809006e-02
1150.00000  1200.00000  2.569192076950e-02
1200.00000  1250.00000  2.356095544416e-02
1250.00000  1300.00000  2.168642224873e-02
1300.00000  1350.00000  1.999454322404e-02
1350.00000  1400.00000  1.859598530884e-02
1400.00000  1450.00000  1.728768004271e-02
1450.00000  1500.00000  1.608037178864e-02
1500.00000  1550.00000  1.502205203462e-02
1550.00000  1600.00000  1.406222227464e-02
1600.00000  1650.00000  1.328182337650e-02
1650.00000  1700.00000  1.247993575240e-02
1700.00000  1750.00000  1.178513361271e-02
1750.00000  1800.00000  1.117592823146e-02
1800.00000  1850.00000  1.055848550526e-02
1850.00000  1900.00000  1.003881648223e-02
1900.00000  1950.00000  9.556036438772e-03
1950.00000  2000.00000  8.967603492632e-03
2000.00000  2050.00000  8.538903409534e-03
2050.00000  2100.00000  8.173953213481e-03
2100.00000  2150.00000  7.742029821488e-03
2150.00000  2200.00000  7.452290166328e-03
2200.00000  2250.00000  7.080177061618e-03
2250.00000  2300.00000  6.792944424488e-03
2300.00000  2350.00000  6.507860659955e-03
2350.00000  2400.00000  6.118556574469e-03
2400.00000  2450.00000  5.987117200620e-03
2450.00000  2500.00000  5.751815651251e-03
2500.00000  2550.00000  5.426619598241e-03
2550.00000  2600.00000  5.193108776036e-03
2600.00000  2650.00000  5.035524785591e-03
2650.00000  2700.00000  4.826009707385e-03
2700.00000  2750.00000  4.679886370790e-03
2750.00000  2800.00000  4.540567797420e-03
2800.00000  2850.00000  4.433124167571e-03
2850.00000  2900.00000  4.288075267274e-03
2900.00000  2950.00000  4.077127607337e-03
2950.00000  3000.00000  3.941032342862e-03
3000.00000  3050.00000  3.812816277909e-03
3050.00000  3100.00000  3.653441560299e-03
3100.00000  3150.00000  3.573575128778e-03
3150.00000  3200.00000  3.430316955646e-03
3200.00000  3250.00000  3.319650016902e-03
3250.00000  3300.00000  3.227248495232e-03
3300.00000  3350.00000  3.193224679113e-03
3350.00000  3400.00000  3.047817633384e-03
3400.00000  3450.00000  2.993737673027e-03
3450.00000  3500.00000  2.883428879715e-03
3500.00000  3550.00000  2.767747904911e-03
3550.00000  3600.00000  2.667467183718e-03
3600.00000  3650.00000  2.693611800315e-03
3650.00000  3700.00000  2.550711772616e-03
3700.00000  3750.00000  2.521701992556e-03
3750.00000  3800.00000  2.443984433632e-03
3800.00000  3850.00000  2.357671384320e-03
3850.00000  3900.00000  2.269567607844e-03
3900.00000  3950.00000  2.286758588620e-03
3950.00000  4000.00000  2.214413211188e-03
4000.00000  4050.00000  2.111625471966e-03
4050.00000  4100.00000  2.101597399847e-03
4100.00000  4150.00000  2.111267326533e-03
4150.00000  4200.00000  1.968367298834e-03
4200.00000  4250.00000  1.986990861341e-03
4250.00000  4300.00000  1.864146977880e-03
4300.00000  4350.00000  1.871668031970e-03
4350.00000  4400.00000  1.839076797582e-03
4400.00000  4450.00000  1.782131673762e-03
4450.00000  4500.00000  1.754912620867e-03
4500.00000  4550.00000  1.670390298719e-03
4550.00000  4600.00000  1.663227390063e-03
4600.00000  4650.00000  1.644603827556e-03
4650.00000  4700.00000  1.572258450124e-03
4700.00000  4750.00000  1.555067469348e-03
4750.00000  4800.00000  1.506359690483e-03
4800.00000  4850.00000  1.499196781827e-03
4850.00000  4900.00000  1.484512819081e-03
4900.00000  4950.00000  1.428642131559e-03
4950.00000  5000.00000  1.384948388754e-03
5000.00000  5050.00000  1.371338862306e-03
5050.00000  5100.00000  1.351640863501e-03
5100.00000  5150.00000  1.346626827441e-03
5150.00000  5200.00000  1.316184465650e-03
5200.00000  5250.00000  1.277504758905e-03
5250.00000  5300.00000  1.248853124278e-03
5300.00000  5350.00000  1.197280181951e-03
5350.00000  5400.00000  1.187610255264e-03
5400.00000  5450.00000  1.189400982429e-03
5450.00000  5500.00000  1.194056873055e-03
5500.00000  5550.00000  1.134246585773e-03
5550.00000  5600.00000  1.143558367026e-03
5600.00000  5650.00000  1.090552842968e-03
5650.00000  5700.00000  1.066198953535e-03
5700.00000  5750.00000  1.032175137416e-03
5750.00000  5800.00000  1.059036044879e-03
5800.00000  5850.00000  1.001732775626e-03
5850.00000  5900.00000  1.047933536461e-03
5900.00000  5950.00000  9.759463044619e-04
5950.00000  6000.00000  9.648437960442e-04
6000.00000  6050.00000  9.501598332982e-04
6050.00000  6100.00000  9.032427815974e-04
6100.00000  6150.00000  9.283129618955e-04
6150.00000  6200.00000  8.763818741352e-04
6200.00000  6250.00000  8.770981650008e-04
6250.00000  6300.00000  8.624142022548e-04
6300.00000  6350.00000  8.402091854193e-04
6350.00000  6400.00000  8.917821277469e-04
6400.00000  6450.00000  8.337625676284e-04
6450.00000  6500.00000  8.419999125835e-04
6500.00000  6550.00000  8.079760964646e-04
6550.00000  6600.00000  8.004550423752e-04
6600.00000  6650.00000  7.882780976590e-04
6650.00000  6700.00000  7.488821000477e-04
6700.00000  6750.00000  7.825477707337e-04
6750.00000  6800.00000  7.427936276896e-04
6800.00000  6850.00000  7.707289714503e-04
6850.00000  6900.00000  7.538961361073e-04
6900.00000  6950.00000  7.438680639880e-04
6950.00000  7000.00000  7.256026469137e-04
7000.00000  7050.00000  6.811926132428e-04
7050.00000  7100.00000  6.865647947352e-04
7100.00000  7150.00000  6.460943608254e-04
7150.00000  7200.00000  6.432291973628e-04
7200.00000  7250.00000  6.536154149149e-04
7250.00000  7300.00000  6.299778163481e-04
7300.00000  7350.00000  6.346337069749e-04
7350.00000  7400.00000  6.414384701986e-04
7400.00000  7450.00000  6.299778163481e-04
7450.00000  7500.00000  6.385733067360e-04
7500.00000  7550.00000  6.034750543187e-04
7550.00000  7600.00000  5.984610182590e-04
7600.00000  7650.00000  5.923725459009e-04
7650.00000  7700.00000  5.733908379609e-04
7700.00000  7750.00000  5.834189100802e-04
7750.00000  7800.00000  5.673023656028e-04
7800.00000  7850.00000  5.468880759315e-04
7850.00000  7900.00000  5.515439665583e-04
7900.00000  7950.00000  5.393670218421e-04
7950.00000  8000.00000  5.261156408274e-04
8000.00000  8050.00000  5.225341864991e-04
8050.00000  8100.00000  5.368600038123e-04
8100.00000  8150.00000  5.135805506783e-04
8150.00000  8200.00000  5.035524785591e-04
8200.00000  8250.00000  5.146549869768e-04
8250.00000  8300.00000  5.042687694247e-04
8300.00000  8350.00000  4.981802970666e-04
8350.00000  8400.00000  4.992547333651e-04
8400.00000  8450.00000  4.680960807089e-04
8450.00000  8500.00000  4.838544797534e-04
8500.00000  8550.00000  4.788404436938e-04
8550.00000  8600.00000  4.376537189183e-04
8600.00000  8650.00000  4.387281552168e-04
8650.00000  8700.00000  4.448166275749e-04
8700.00000  8750.00000  4.193883018440e-04
8750.00000  8800.00000  4.444584821421e-04
8800.00000  8850.00000  4.387281552168e-04
8850.00000  8900.00000  4.340722645900e-04
8900.00000  8950.00000  4.272675013663e-04
8950.00000  9000.00000  4.179557201127e-04
9000.00000  9050.00000  4.190301564112e-04
9050.00000  9100.00000  4.143742657844e-04
9100.00000  9150.00000  4.240441924708e-04
9150.00000  9200.00000  3.817830313968e-04
9200.00000  9250.00000  4.082857934263e-04
9250.00000  9300.00000  3.846481948595e-04
9300.00000  9350.00000  3.921692489489e-04
9350.00000  9400.00000  3.635176143225e-04
9400.00000  9450.00000  3.721131047104e-04
9450.00000  9500.00000  3.907366672176e-04
9500.00000  9550.00000  3.867970674565e-04
9550.00000  9600.00000  3.717549592776e-04
9600.00000  9650.00000  3.513406696063e-04
9650.00000  9700.00000  3.624431780240e-04
9700.00000  9750.00000  3.484755061437e-04
9750.00000  9800.00000  3.585035782629e-04
9800.00000  9850.00000  3.527732513376e-04
9850.00000  9900.00000  3.581454328301e-04
9900.00000  9950.00000  3.488336515765e-04
9950.00000  10000.00000  3.398800157557e-04
