300.00000  350.00000  2.129599819881e-01
350.00000  400.00000  1.506705289220e-01
400.00000  450.00000  1.113770696070e-01
450.00000  500.00000  8.556433231627e-02
500.00000  550.00000  6.752722423455e-02
550.00000  600.00000  5.391836562965e-02
600.00000  650.00000  4.391014493976e-02
650.00000  700.00000  3.645108845933e-02
700.00000  750.00000  3.089749830697e-02
750.00000  800.00000  2.614589240028e-02
800.00000  850.00000  2.268620472392e-02
850.00000  900.00000  1.967801005806e-02
900.00000  950.00000  1.729391591420e-02
950.00000  1000.00000  1.497238257147e-02
1000.00000  1050.00000  1.353649912409e-02
1050.00000  1100.00000  1.197624781907e-02
1100.00000  1150.00000  1.085844458944e-02
1150.00000  1200.00000  9.603459844093e-03
1200.00000  1250.00000  8.600979537002e-03
1250.00000  1300.00000  7.907534512549e-03
1300.00000  1350.00000  7.181678470648e-03
1350.00000  1400.00000  6.476173532725e-03
1400.00000  1450.00000  5.934984915814e-03
1450.00000  1500.00000  5.675696776236e-03
1500.00000  1550.00000  5.111142076980e-03
1550.00000  1600.00000  4.696582551491e-03
1600.00000  1650.00000  4.441063134871e-03
1650.00000  1700.00000  4.039317267443e-03
1700.00000  1750.00000  3.767215469804e-03
1750.00000  1800.00000  3.594607958283e-03
1800.00000  1850.00000  3.305170035032e-03
1850.00000  1900.00000  3.164219796366e-03
1900.00000  1950.00000  2.878550596075e-03
1950.00000  2000.00000  2.740615335776e-03
2000.00000  2050.00000  2.714988019655e-03
2050.00000  2100.00000  2.477558473239e-03
2100.00000  2150.00000  2.301182238758e-03
2150.00000  2200.00000  2.108223623258e-03
2200.00000  2250.00000  2.070536393668e-03
2250.00000  2300.00000  1.893406414596e-03
2300.00000  2350.00000  1.883607734902e-03
2350.00000  2400.00000  1.729090093584e-03
2400.00000  2450.00000  1.695925331545e-03
2450.00000  2500.00000  1.589647344101e-03
2500.00000  2550.00000  1.505981694412e-03
2550.00000  2600.00000  1.404979919111e-03
2600.00000  2650.00000  1.407241152886e-03
2650.00000  2700.00000  1.339404139624e-03
2700.00000  2750.00000  1.267044658812e-03
2750.00000  2800.00000  1.245186065650e-03
2800.00000  2850.00000  1.184886498306e-03
2850.00000  2900.00000  1.178102796980e-03
2900.00000  2950.00000  1.070317320353e-03
2950.00000  3000.00000  1.102728337800e-03
3000.00000  3050.00000  9.896666490302e-04
3050.00000  3100.00000  1.012278986784e-03
3100.00000  3150.00000  9.097697222997e-04
3150.00000  3200.00000  8.502238995477e-04
3200.00000  3250.00000  8.253503280184e-04
3250.00000  3300.00000  8.291190509774e-04
3300.00000  3350.00000  7.733419511843e-04
3350.00000  3400.00000  7.650507606746e-04
3400.00000  3450.00000  7.416846783288e-04
3450.00000  3500.00000  7.386696999616e-04
3500.00000  3550.00000  7.002287257800e-04
3550.00000  3600.00000  6.369141800690e-04
3600.00000  3650.00000  6.693251975163e-04
3650.00000  3700.00000  6.467128597623e-04
3700.00000  3750.00000  6.143018423150e-04
3750.00000  3800.00000  5.947044829283e-04
3800.00000  3850.00000  5.916895045611e-04
3850.00000  3900.00000  5.841520586431e-04
3900.00000  3950.00000  5.524947857876e-04
3950.00000  4000.00000  5.215912575239e-04
4000.00000  4050.00000  4.854115171177e-04
4050.00000  4100.00000  4.914414738520e-04
4100.00000  4150.00000  4.891802400766e-04
4150.00000  4200.00000  4.409405862016e-04
4200.00000  4250.00000  4.469705429360e-04
4250.00000  4300.00000  4.484780321196e-04
4300.00000  4350.00000  4.876727508930e-04
4350.00000  4400.00000  4.205894822231e-04
4400.00000  4450.00000  4.266194389574e-04
4450.00000  4500.00000  3.942084215101e-04
4500.00000  4550.00000  3.874247201840e-04
4550.00000  4600.00000  4.017458674281e-04
4600.00000  4650.00000  3.813947634496e-04
4650.00000  4700.00000  3.731035729398e-04
4700.00000  4750.00000  3.527524689613e-04
4750.00000  4800.00000  3.437075338597e-04
4800.00000  4850.00000  3.731035729398e-04
4850.00000  4900.00000  3.429537892679e-04
4900.00000  4950.00000  3.286326420238e-04
4950.00000  5000.00000  3.188339623304e-04
5000.00000  5050.00000  3.256176636566e-04
5050.00000  5100.00000  3.263714082484e-04
5100.00000  5150.00000  3.060203042698e-04
5150.00000  5200.00000  3.391850663089e-04
5200.00000  5250.00000  2.819004773323e-04
5250.00000  5300.00000  2.690868192717e-04
5300.00000  5350.00000  2.894379232503e-04
5350.00000  5400.00000  2.675793300881e-04
5400.00000  5450.00000  2.623031179456e-04
5450.00000  5500.00000  2.947141353929e-04
5500.00000  5550.00000  2.653180963128e-04
5550.00000  5600.00000  2.781317543733e-04
5600.00000  5650.00000  2.638106071292e-04
5650.00000  5700.00000  2.751167760061e-04
5700.00000  5750.00000  2.434595031506e-04
5750.00000  5800.00000  2.751167760061e-04
5800.00000  5850.00000  2.404445247834e-04
5850.00000  5900.00000  2.351683126409e-04
5900.00000  5950.00000  2.313995896819e-04
5950.00000  6000.00000  2.540119274358e-04
6000.00000  6050.00000  2.216009099885e-04
6050.00000  6100.00000  2.329070788655e-04
6100.00000  6150.00000  2.472282261096e-04
6150.00000  6200.00000  2.359220572326e-04
6200.00000  6250.00000  2.261233775393e-04
6250.00000  6300.00000  2.298921004983e-04
6300.00000  6350.00000  2.381832910080e-04
6350.00000  6400.00000  3.957159106937e-04
6400.00000  6450.00000  2.140634640705e-04
6450.00000  6500.00000  2.102947411115e-04
6500.00000  6550.00000  2.148172086623e-04
6550.00000  6600.00000  1.952198492756e-04
6600.00000  6650.00000  1.891898925412e-04
6650.00000  6700.00000  1.854211695822e-04
6700.00000  6750.00000  1.914511263166e-04
6750.00000  6800.00000  1.914511263166e-04
6800.00000  6850.00000  1.937123600920e-04
6850.00000  6900.00000  1.733612561134e-04
6900.00000  6950.00000  2.065260181525e-04
6950.00000  7000.00000  1.793912128478e-04
7000.00000  7050.00000  1.846674249904e-04
7050.00000  7100.00000  2.268771221311e-04
7100.00000  7150.00000  1.537638967267e-04
7150.00000  7200.00000  1.447189616251e-04
7200.00000  7250.00000  1.447189616251e-04
7250.00000  7300.00000  1.499951737677e-04
7300.00000  7350.00000  1.424577278497e-04
7350.00000  7400.00000  1.665775547873e-04
7400.00000  7450.00000  1.326590481564e-04
7450.00000  7500.00000  1.326590481564e-04
7500.00000  7550.00000  1.281365806056e-04
7550.00000  7600.00000  1.190916455040e-04
7600.00000  7650.00000  1.145691779532e-04
7650.00000  7700.00000  1.175841563204e-04
7700.00000  7750.00000  1.281365806056e-04
7750.00000  7800.00000  1.334127927482e-04
7800.00000  7850.00000  1.281365806056e-04
7850.00000  7900.00000  1.462264508087e-04
7900.00000  7950.00000  1.273828360138e-04
7950.00000  8000.00000  1.319053035646e-04
8000.00000  8050.00000  1.281365806056e-04
8050.00000  8100.00000  1.108004549942e-04
8100.00000  8150.00000  1.017555198927e-04
8150.00000  8200.00000  1.213528792794e-04
8200.00000  8250.00000  1.266290914220e-04
8250.00000  8300.00000  1.213528792794e-04
8300.00000  8350.00000  9.421807397470e-05
8350.00000  8400.00000  1.115541995860e-04
8400.00000  8450.00000  1.175841563204e-04
8450.00000  8500.00000  1.115541995860e-04
8500.00000  8550.00000  1.123079441778e-04
8550.00000  8600.00000  1.108004549942e-04
8600.00000  8650.00000  1.077854766271e-04
8650.00000  8700.00000  1.092929658107e-04
8700.00000  8750.00000  9.271058479110e-05
8750.00000  8800.00000  1.115541995860e-04
8800.00000  8850.00000  9.572556315829e-05
8850.00000  8900.00000  9.949428611728e-05
8900.00000  8950.00000  1.062779874435e-04
8950.00000  9000.00000  8.215816050594e-05
9000.00000  9050.00000  1.160766671368e-04
9050.00000  9100.00000  1.025092644845e-04
9100.00000  9150.00000  9.647930775009e-05
9150.00000  9200.00000  9.647930775009e-05
9200.00000  9250.00000  9.874054152549e-05
9250.00000  9300.00000  9.044935101571e-05
9300.00000  9350.00000  8.441939428133e-05
9350.00000  9400.00000  9.723305234189e-05
9400.00000  9450.00000  8.140441591414e-05
9450.00000  9500.00000  7.989692673055e-05
9500.00000  9550.00000  9.874054152549e-05
9550.00000  9600.00000  8.894186183212e-05
9600.00000  9650.00000  7.914318213875e-05
9650.00000  9700.00000  1.047704982599e-04
9700.00000  9750.00000  7.537445917976e-05
9750.00000  9800.00000  8.668062805672e-05
9800.00000  9850.00000  8.818811724032e-05
9850.00000  9900.00000  8.366564968953e-05
9900.00000  9950.00000  8.215816050594e-05
9950.00000  10000.00000  8.517313887313e-05
