300.00000  350.00000  2.548984810420e-01
350.00000  400.00000  2.024857096518e-01
400.00000  450.00000  1.653855052859e-01
450.00000  500.00000  1.383008212272e-01
500.00000  550.00000  1.177269696069e-01
550.00000  600.00000  1.018555469495e-01
600.00000  650.00000  8.909658868118e-02
650.00000  700.00000  7.836485940794e-02
700.00000  750.00000  7.012391354283e-02
750.00000  800.00000  6.291697624971e-02
800.00000  850.00000  5.695572062379e-02
850.00000  900.00000  5.201474864771e-02
900.00000  950.00000  4.733938291166e-02
950.00000  1000.00000  4.352675418380e-02
1000.00000  1050.00000  4.009707011496e-02
1050.00000  1100.00000  3.726915622458e-02
1100.00000  1150.00000  3.457230567535e-02
1150.00000  1200.00000  3.235118799127e-02
1200.00000  1250.00000  3.025146821020e-02
1250.00000  1300.00000  2.842218738822e-02
1300.00000  1350.00000  2.654322621422e-02
1350.00000  1400.00000  2.514618378577e-02
1400.00000  1450.00000  2.370448703313e-02
1450.00000  1500.00000  2.246073845355e-02
1500.00000  1550.00000  2.130668513988e-02
1550.00000  1600.00000  2.020231217825e-02
1600.00000  1650.00000  1.912480913464e-02
1650.00000  1700.00000  1.821432486205e-02
1700.00000  1750.00000  1.746467348008e-02
1750.00000  1800.00000  1.662764653734e-02
1800.00000  1850.00000  1.594855285377e-02
1850.00000  1900.00000  1.519406875273e-02
1900.00000  1950.00000  1.448075941816e-02
1950.00000  2000.00000  1.387338328557e-02
2000.00000  2050.00000  1.341350173897e-02
2050.00000  2100.00000  1.285928551615e-02
2100.00000  2150.00000  1.249083901433e-02
2150.00000  2200.00000  1.199944813940e-02
2200.00000  2250.00000  1.149355910727e-02
2250.00000  2300.00000  1.110346202402e-02
2300.00000  2350.00000  1.087226474377e-02
2350.00000  2400.00000  1.037952070750e-02
2400.00000  2450.00000  1.010482895562e-02
2450.00000  2500.00000  9.778330455321e-03
2500.00000  2550.00000  9.354211029831e-03
2550.00000  2600.00000  9.119147574318e-03
2600.00000  2650.00000  8.878671473448e-03
2650.00000  2700.00000  8.592574504567e-03
2700.00000  2750.00000  8.310537019704e-03
2750.00000  2800.00000  8.069287683783e-03
2800.00000  2850.00000  7.759993663371e-03
2850.00000  2900.00000  7.568811297004e-03
2900.00000  2950.00000  7.494774040868e-03
2950.00000  3000.00000  7.234193828671e-03
3000.00000  3050.00000  7.060022633426e-03
3050.00000  3100.00000  6.863620930465e-03
3100.00000  3150.00000  6.622758212069e-03
3150.00000  3200.00000  6.496720898751e-03
3200.00000  3250.00000  6.369910350382e-03
3250.00000  3300.00000  6.194385993798e-03
3300.00000  3350.00000  6.099858008810e-03
3350.00000  3400.00000  5.881999033183e-03
3400.00000  3450.00000  5.779738697684e-03
3450.00000  3500.00000  5.644809181279e-03
3500.00000  3550.00000  5.541582301967e-03
3550.00000  3600.00000  5.363738240230e-03
3600.00000  3650.00000  5.312511418099e-03
3650.00000  3700.00000  5.146652499653e-03
3700.00000  3750.00000  5.035693269831e-03
3750.00000  3800.00000  4.921641099804e-03
3800.00000  3850.00000  4.806235768438e-03
3850.00000  3900.00000  4.725626014368e-03
3900.00000  3950.00000  4.659321108742e-03
3950.00000  4000.00000  4.516079315539e-03
4000.00000  4050.00000  4.402027145512e-03
4050.00000  4100.00000  4.361238996570e-03
4100.00000  4150.00000  4.255305794579e-03
4150.00000  4200.00000  4.116510102919e-03
4200.00000  4250.00000  4.076495189028e-03
4250.00000  4300.00000  4.048658727191e-03
4300.00000  4350.00000  3.968435590647e-03
4350.00000  4400.00000  3.947558244269e-03
4400.00000  4450.00000  3.837372249497e-03
4450.00000  4500.00000  3.721580300606e-03
4500.00000  4550.00000  3.652182454776e-03
4550.00000  4600.00000  3.623379449125e-03
4600.00000  4650.00000  3.587037401727e-03
4650.00000  4700.00000  3.477624642006e-03
4700.00000  4750.00000  3.454234281712e-03
4750.00000  4800.00000  3.431037230181e-03
4800.00000  4850.00000  3.274843749873e-03
4850.00000  4900.00000  3.282576100384e-03
4900.00000  4950.00000  3.237148541136e-03
4950.00000  5000.00000  3.166590842729e-03
5000.00000  5050.00000  3.154025773150e-03
5050.00000  5100.00000  3.039586985598e-03
5100.00000  5150.00000  3.026055372205e-03
5150.00000  5200.00000  2.972895462446e-03
5200.00000  5250.00000  2.944285765558e-03
5250.00000  5300.00000  2.910843349601e-03
5300.00000  5350.00000  2.872374905812e-03
5350.00000  5400.00000  2.793698239370e-03
5400.00000  5450.00000  2.801623898643e-03
5450.00000  5500.00000  2.715214881691e-03
5500.00000  5550.00000  2.664761294611e-03
5550.00000  5600.00000  2.648136741014e-03
5600.00000  5650.00000  2.627066085873e-03
5650.00000  5700.00000  2.605802121970e-03
5700.00000  5750.00000  2.594976831255e-03
5750.00000  5800.00000  2.480731352466e-03
5800.00000  5850.00000  2.475125398346e-03
5850.00000  5900.00000  2.455601213307e-03
5900.00000  5950.00000  2.399155054582e-03
5950.00000  6000.00000  2.403987773651e-03
6000.00000  6050.00000  2.307913318561e-03
6050.00000  6100.00000  2.300567585576e-03
6100.00000  6150.00000  2.262679068076e-03
6150.00000  6200.00000  2.301340820627e-03
6200.00000  6250.00000  2.259199510346e-03
6250.00000  6300.00000  2.263645611889e-03
6300.00000  6350.00000  2.188061885651e-03
6350.00000  6400.00000  2.901371220226e-03
6400.00000  6450.00000  2.098173310969e-03
6450.00000  6500.00000  2.106485587768e-03
6500.00000  6550.00000  2.074782950675e-03
6550.00000  6600.00000  2.054872148111e-03
6600.00000  6650.00000  1.994173196605e-03
6650.00000  6700.00000  1.968076513633e-03
6700.00000  6750.00000  1.954738209003e-03
6750.00000  6800.00000  1.939466816745e-03
6800.00000  6850.00000  1.890173082242e-03
6850.00000  6900.00000  1.897712123990e-03
6900.00000  6950.00000  1.895199110074e-03
6950.00000  7000.00000  1.863883090507e-03
7000.00000  7050.00000  1.847258536910e-03
7050.00000  7100.00000  1.922455645622e-03
7100.00000  7150.00000  1.772641354485e-03
7150.00000  7200.00000  1.714262108133e-03
7200.00000  7250.00000  1.734752836985e-03
7250.00000  7300.00000  1.684299249905e-03
7300.00000  7350.00000  1.661488815900e-03
7350.00000  7400.00000  1.695124540620e-03
7400.00000  7450.00000  1.666514843732e-03
7450.00000  7500.00000  1.673280650428e-03
7500.00000  7550.00000  1.642544557150e-03
7550.00000  7600.00000  1.600596555631e-03
7600.00000  7650.00000  1.579525900491e-03
7650.00000  7700.00000  1.569473844827e-03
7700.00000  7750.00000  1.544730323194e-03
7750.00000  7800.00000  1.519020257748e-03
7800.00000  7850.00000  1.542797235567e-03
7850.00000  7900.00000  1.514187538679e-03
7900.00000  7950.00000  1.519986801562e-03
7950.00000  8000.00000  1.460641011395e-03
8000.00000  8050.00000  1.444596384086e-03
8050.00000  8100.00000  1.449815720681e-03
8100.00000  8150.00000  1.450202338206e-03
8150.00000  8200.00000  1.409414189264e-03
8200.00000  8250.00000  1.388343534124e-03
8250.00000  8300.00000  1.379064713511e-03
8300.00000  8350.00000  1.384670667631e-03
8350.00000  8400.00000  1.353741265590e-03
8400.00000  8450.00000  1.354321191878e-03
8450.00000  8500.00000  1.351614869200e-03
8500.00000  8550.00000  1.298454959442e-03
8550.00000  8600.00000  1.336730094468e-03
8600.00000  8650.00000  1.294782092949e-03
8650.00000  8700.00000  1.302127825934e-03
8700.00000  8750.00000  1.276997686775e-03
8750.00000  8800.00000  1.266365704824e-03
8800.00000  8850.00000  1.245295049683e-03
8850.00000  8900.00000  1.229637039900e-03
8900.00000  8950.00000  1.231956745053e-03
8950.00000  9000.00000  1.216685352795e-03
9000.00000  9050.00000  1.205280135792e-03
9050.00000  9100.00000  1.175510586328e-03
9100.00000  9150.00000  1.187495729619e-03
9150.00000  9200.00000  1.189815434772e-03
9200.00000  9250.00000  1.158112797680e-03
9250.00000  9300.00000  1.172610954886e-03
9300.00000  9350.00000  1.118291192552e-03
9350.00000  9400.00000  1.162172281698e-03
9400.00000  9450.00000  1.123510529146e-03
9450.00000  9500.00000  1.115198252348e-03
9500.00000  9550.00000  1.126603469350e-03
9550.00000  9600.00000  1.090648039477e-03
9600.00000  9650.00000  1.078276278661e-03
9650.00000  9700.00000  1.058365476097e-03
9700.00000  9750.00000  1.084655467832e-03
9750.00000  9800.00000  1.062231651352e-03
9800.00000  9850.00000  1.064551356505e-03
9850.00000  9900.00000  1.053532757028e-03
9900.00000  9950.00000  1.031495558074e-03
9950.00000  10000.00000  1.026082912716e-03
