300.00000  350.00000  1.807166865429e-01
350.00000  400.00000  1.280307323780e-01
400.00000  450.00000  9.502654701364e-02
450.00000  500.00000  7.231414351730e-02
500.00000  550.00000  5.701909769666e-02
550.00000  600.00000  4.570402383468e-02
600.00000  650.00000  3.732148145380e-02
650.00000  700.00000  3.128360590560e-02
700.00000  750.00000  2.597244878671e-02
750.00000  800.00000  2.236979688480e-02
800.00000  850.00000  1.933010650758e-02
850.00000  900.00000  1.657642473338e-02
900.00000  950.00000  1.454946138849e-02
950.00000  1000.00000  1.276096431947e-02
1000.00000  1050.00000  1.131809242244e-02
1050.00000  1100.00000  1.014311776570e-02
1100.00000  1150.00000  9.055681362131e-03
1150.00000  1200.00000  8.112381220242e-03
1200.00000  1250.00000  7.507914489320e-03
1250.00000  1300.00000  6.585744270610e-03
1300.00000  1350.00000  6.082399314898e-03
1350.00000  1400.00000  5.631879167132e-03
1400.00000  1450.00000  5.151173414826e-03
1450.00000  1500.00000  4.763288396481e-03
1500.00000  1550.00000  4.379176578704e-03
1550.00000  1600.00000  3.949786354116e-03
1600.00000  1650.00000  3.882623384014e-03
1650.00000  1700.00000  3.493983725556e-03
1700.00000  1750.00000  3.195900880719e-03
1750.00000  1800.00000  3.130247190843e-03
1800.00000  1850.00000  2.872914912136e-03
1850.00000  1900.00000  2.580869188207e-03
1900.00000  1950.00000  2.440506127094e-03
1950.00000  2000.00000  2.329574030408e-03
2000.00000  2050.00000  2.245054337695e-03
2050.00000  2100.00000  2.110728397490e-03
2100.00000  2150.00000  1.963573575355e-03
2150.00000  2200.00000  1.847358997875e-03
2200.00000  2250.00000  1.717560898351e-03
2250.00000  2300.00000  1.662472170065e-03
2300.00000  2350.00000  1.625494804503e-03
2350.00000  2400.00000  1.531164790314e-03
2400.00000  2450.00000  1.408913091925e-03
2450.00000  2500.00000  1.341750121822e-03
2500.00000  2550.00000  1.273077871493e-03
2550.00000  2600.00000  1.230818025136e-03
2600.00000  2650.00000  1.198368500255e-03
2650.00000  2700.00000  1.087436403569e-03
2700.00000  2750.00000  1.069325040845e-03
2750.00000  2800.00000  1.014236312559e-03
2800.00000  2850.00000  9.765043068831e-04
2850.00000  2900.00000  9.553743837048e-04
2900.00000  2950.00000  9.304712599590e-04
2950.00000  3000.00000  8.527433282673e-04
3000.00000  3050.00000  8.648175700835e-04
3050.00000  3100.00000  8.519886881538e-04
3100.00000  3150.00000  8.029370807756e-04
3150.00000  3200.00000  7.387926711272e-04
3200.00000  3250.00000  7.289823496516e-04
3250.00000  3300.00000  7.108709869273e-04
3300.00000  3350.00000  6.769121818193e-04
3350.00000  3400.00000  6.663472202301e-04
3400.00000  3450.00000  6.384255360302e-04
3450.00000  3500.00000  6.248420139870e-04
3500.00000  3550.00000  5.795636071764e-04
3550.00000  3600.00000  5.516419229765e-04
3600.00000  3650.00000  5.357944805928e-04
3650.00000  3700.00000  5.342852003657e-04
3700.00000  3750.00000  5.199470382090e-04
3750.00000  3800.00000  5.124006370739e-04
3800.00000  3850.00000  4.603304692417e-04
3850.00000  3900.00000  4.663675901497e-04
3900.00000  3950.00000  4.754232715119e-04
3950.00000  4000.00000  4.761779116254e-04
4000.00000  4050.00000  4.188252629986e-04
4050.00000  4100.00000  3.644911748258e-04
4100.00000  4150.00000  3.758107765284e-04
4150.00000  4200.00000  4.067510211824e-04
4200.00000  4250.00000  4.044871008419e-04
4250.00000  4300.00000  3.509076527826e-04
4300.00000  4350.00000  3.539262132366e-04
4350.00000  4400.00000  3.418519714204e-04
4400.00000  4450.00000  3.780746968690e-04
4450.00000  4500.00000  3.305323697178e-04
4500.00000  4550.00000  3.041199657449e-04
4550.00000  4600.00000  3.116663668800e-04
4600.00000  4650.00000  3.252498889232e-04
4650.00000  4700.00000  3.003467651773e-04
4700.00000  4750.00000  2.822354024531e-04
4750.00000  4800.00000  2.822354024531e-04
4800.00000  4850.00000  2.656333199558e-04
4850.00000  4900.00000  2.694065205234e-04
4900.00000  4950.00000  2.535590781397e-04
4950.00000  5000.00000  2.731797210910e-04
5000.00000  5050.00000  2.407301962100e-04
5050.00000  5100.00000  2.535590781397e-04
5100.00000  5150.00000  2.301652346208e-04
5150.00000  5200.00000  2.256373939398e-04
5200.00000  5250.00000  2.173363526911e-04
5250.00000  5300.00000  2.362023555289e-04
5300.00000  5350.00000  2.037528306479e-04
5350.00000  5400.00000  2.014889103074e-04
5400.00000  5450.00000  2.226188334857e-04
5450.00000  5500.00000  1.916785888318e-04
5500.00000  5550.00000  1.984703498534e-04
5550.00000  5600.00000  1.999796300804e-04
5600.00000  5650.00000  1.818682673561e-04
5650.00000  5700.00000  1.879053882642e-04
5700.00000  5750.00000  1.667754650859e-04
5750.00000  5800.00000  1.705486656535e-04
5800.00000  5850.00000  1.901693086048e-04
5850.00000  5900.00000  1.705486656535e-04
5900.00000  5950.00000  1.614929842913e-04
5950.00000  6000.00000  1.584744238373e-04
6000.00000  6050.00000  1.554558633832e-04
6050.00000  6100.00000  1.592290639508e-04
6100.00000  6150.00000  1.833775475832e-04
6150.00000  6200.00000  1.350805803185e-04
6200.00000  6250.00000  1.516826628157e-04
6250.00000  6300.00000  1.501733825887e-04
6300.00000  6350.00000  1.584744238373e-04
6350.00000  6400.00000  1.750765063345e-04
6400.00000  6450.00000  1.237609786158e-04
6450.00000  6500.00000  1.335713000914e-04
6500.00000  6550.00000  1.448909017941e-04
6550.00000  6600.00000  1.343259402049e-04
6600.00000  6650.00000  1.214970582753e-04
6650.00000  6700.00000  1.109320966861e-04
6700.00000  6750.00000  1.252702588428e-04
6750.00000  6800.00000  1.245156187293e-04
6800.00000  6850.00000  1.116867367996e-04
6850.00000  6900.00000  1.139506571401e-04
6900.00000  6950.00000  1.230063385023e-04
6950.00000  7000.00000  1.222516983888e-04
7000.00000  7050.00000  1.184784978212e-04
7050.00000  7100.00000  1.396084209995e-04
7100.00000  7150.00000  1.048949757780e-04
7150.00000  7200.00000  1.071588961186e-04
7200.00000  7250.00000  1.094228164591e-04
7250.00000  7300.00000  9.659393452940e-05
7300.00000  7350.00000  1.071588961186e-04
7350.00000  7400.00000  1.056496158915e-04
7400.00000  7450.00000  8.904753339429e-05
7450.00000  7500.00000  9.583929441589e-05
7500.00000  7550.00000  9.206609384833e-05
7550.00000  7600.00000  8.678361305376e-05
7600.00000  7650.00000  8.753825316727e-05
7650.00000  7700.00000  7.546401135109e-05
7700.00000  7750.00000  8.678361305376e-05
7750.00000  7800.00000  9.282073396184e-05
7800.00000  7850.00000  8.678361305376e-05
7850.00000  7900.00000  8.301041248620e-05
7900.00000  7950.00000  8.301041248620e-05
7950.00000  8000.00000  7.999185203216e-05
8000.00000  8050.00000  7.923721191865e-05
8050.00000  8100.00000  8.376505259971e-05
8100.00000  8150.00000  8.301041248620e-05
8150.00000  8200.00000  7.169081078354e-05
8200.00000  8250.00000  7.018153055652e-05
8250.00000  8300.00000  6.489904976194e-05
8300.00000  8350.00000  8.527433282673e-05
8350.00000  8400.00000  7.169081078354e-05
8400.00000  8450.00000  6.640832998896e-05
8450.00000  8500.00000  7.395473112407e-05
8500.00000  8550.00000  6.791761021598e-05
8550.00000  8600.00000  7.772793169162e-05
8600.00000  8650.00000  6.338976953492e-05
8650.00000  8700.00000  5.659800851332e-05
8700.00000  8750.00000  7.018153055652e-05
8750.00000  8800.00000  5.735264862683e-05
8800.00000  8850.00000  6.188048930790e-05
8850.00000  8900.00000  6.414440964843e-05
8900.00000  8950.00000  6.037120908087e-05
8950.00000  9000.00000  7.018153055652e-05
9000.00000  9050.00000  5.282480794576e-05
9050.00000  9100.00000  6.112584919438e-05
9100.00000  9150.00000  6.565368987545e-05
9150.00000  9200.00000  6.188048930790e-05
9200.00000  9250.00000  5.357944805928e-05
9250.00000  9300.00000  5.056088760523e-05
9300.00000  9350.00000  5.131552771874e-05
9350.00000  9400.00000  4.075056612959e-05
9400.00000  9450.00000  3.848664578906e-05
9450.00000  9500.00000  5.810728874034e-05
9500.00000  9550.00000  5.282480794576e-05
9550.00000  9600.00000  4.905160737821e-05
9600.00000  9650.00000  5.659800851332e-05
9650.00000  9700.00000  4.754232715119e-05
9700.00000  9750.00000  3.924128590257e-05
9750.00000  9800.00000  5.207016783225e-05
9800.00000  9850.00000  4.829696726470e-05
9850.00000  9900.00000  4.603304692417e-05
9900.00000  9950.00000  4.225984635661e-05
9950.00000  10000.00000  4.376912658363e-05
