300.00000  350.00000  2.052095495727e-01
350.00000  400.00000  1.535492780193e-01
400.00000  450.00000  1.193884946077e-01
450.00000  500.00000  9.557926676258e-02
500.00000  550.00000  7.819028573801e-02
550.00000  600.00000  6.493882118452e-02
600.00000  650.00000  5.521888963012e-02
650.00000  700.00000  4.707205938914e-02
700.00000  750.00000  4.086632638409e-02
750.00000  800.00000  3.591047943180e-02
800.00000  850.00000  3.134032398610e-02
850.00000  900.00000  2.806591865807e-02
900.00000  950.00000  2.521404054233e-02
950.00000  1000.00000  2.252647856471e-02
1000.00000  1050.00000  2.042539880310e-02
1050.00000  1100.00000  1.846660598307e-02
1100.00000  1150.00000  1.695634204993e-02
1150.00000  1200.00000  1.552661108118e-02
1200.00000  1250.00000  1.427925296902e-02
1250.00000  1300.00000  1.318682150136e-02
1300.00000  1350.00000  1.219261858220e-02
1350.00000  1400.00000  1.132084021428e-02
1400.00000  1450.00000  1.062890676237e-02
1450.00000  1500.00000  9.798658846949e-03
1500.00000  1550.00000  9.244678724176e-03
1550.00000  1600.00000  8.561773631499e-03
1600.00000  1650.00000  8.157664272058e-03
1650.00000  1700.00000  7.559625756208e-03
1700.00000  1750.00000  7.206797477231e-03
1750.00000  1800.00000  6.791131817966e-03
1800.00000  1850.00000  6.287710506919e-03
1850.00000  1900.00000  6.091614544294e-03
1900.00000  1950.00000  5.732285846667e-03
1950.00000  2000.00000  5.502604387682e-03
2000.00000  2050.00000  5.166388289701e-03
2050.00000  2100.00000  5.003155554699e-03
2100.00000  2150.00000  4.716775999705e-03
2150.00000  2200.00000  4.505151259193e-03
2200.00000  2250.00000  4.337223777388e-03
2250.00000  2300.00000  4.114403871422e-03
2300.00000  2350.00000  4.065650731543e-03
2350.00000  2400.00000  3.776020967224e-03
2400.00000  2450.00000  3.600870798029e-03
2450.00000  2500.00000  3.489280277862e-03
2500.00000  2550.00000  3.375884085847e-03
2550.00000  2600.00000  3.200372782282e-03
2600.00000  2650.00000  3.066030796838e-03
2650.00000  2700.00000  2.952273470453e-03
2700.00000  2750.00000  2.819376022487e-03
2750.00000  2800.00000  2.789040735451e-03
2800.00000  2850.00000  2.691895590062e-03
2850.00000  2900.00000  2.613890566256e-03
2900.00000  2950.00000  2.510245002217e-03
2950.00000  3000.00000  2.469075684097e-03
3000.00000  3050.00000  2.326427608154e-03
3050.00000  3100.00000  2.240116493850e-03
3100.00000  3150.00000  2.179807054148e-03
3150.00000  3200.00000  2.148749498373e-03
3200.00000  3250.00000  2.016213184776e-03
3250.00000  3300.00000  1.955542610704e-03
3300.00000  3350.00000  1.910761948889e-03
3350.00000  3400.00000  1.874287377572e-03
3400.00000  3450.00000  1.832756925083e-03
3450.00000  3500.00000  1.794476681918e-03
3500.00000  3550.00000  1.682525027381e-03
3550.00000  3600.00000  1.632327350024e-03
3600.00000  3650.00000  1.625465797004e-03
3650.00000  3700.00000  1.608492481639e-03
3700.00000  3750.00000  1.553961191848e-03
3750.00000  3800.00000  1.459705121416e-03
3800.00000  3850.00000  1.464038733849e-03
3850.00000  3900.00000  1.430453237488e-03
3900.00000  3950.00000  1.384950306934e-03
3950.00000  4000.00000  1.317779314212e-03
4000.00000  4050.00000  1.327891076557e-03
4050.00000  4100.00000  1.269748443072e-03
4100.00000  4150.00000  1.239774290406e-03
4150.00000  4200.00000  1.250608321490e-03
4200.00000  4250.00000  1.169353088358e-03
4250.00000  4300.00000  1.163213804077e-03
4300.00000  4350.00000  1.120238814110e-03
4350.00000  4400.00000  1.110488186134e-03
4400.00000  4450.00000  1.114460664198e-03
4450.00000  4500.00000  1.050539880801e-03
4500.00000  4550.00000  1.018760056287e-03
4550.00000  4600.00000  9.949251879020e-04
4600.00000  4650.00000  9.866190974041e-04
4650.00000  4700.00000  9.790352756451e-04
4700.00000  4750.00000  9.356991513082e-04
4750.00000  4800.00000  9.057249986418e-04
4800.00000  4850.00000  9.364214200472e-04
4850.00000  4900.00000  8.605832024575e-04
4900.00000  4950.00000  8.753897116060e-04
4950.00000  5000.00000  8.844180708428e-04
5000.00000  5050.00000  8.598609337186e-04
5050.00000  5100.00000  8.576941275017e-04
5100.00000  5150.00000  7.944956128437e-04
5150.00000  5200.00000  8.020794346027e-04
5200.00000  5250.00000  7.612712508521e-04
5250.00000  5300.00000  7.627157883300e-04
5300.00000  5350.00000  7.410477261615e-04
5350.00000  5400.00000  7.421311292699e-04
5400.00000  5450.00000  7.421311292699e-04
5450.00000  5500.00000  6.995172736719e-04
5500.00000  5550.00000  7.316582325552e-04
5550.00000  5600.00000  6.912111831740e-04
5600.00000  5650.00000  6.742378678087e-04
5650.00000  5700.00000  6.644872398329e-04
5700.00000  5750.00000  6.608758961382e-04
5750.00000  5800.00000  6.254847279297e-04
5800.00000  5850.00000  6.572645524434e-04
5850.00000  5900.00000  6.280126685160e-04
5900.00000  5950.00000  5.767315880506e-04
5950.00000  6000.00000  5.929826346770e-04
6000.00000  6050.00000  5.691477662917e-04
6050.00000  6100.00000  5.680643631833e-04
6100.00000  6150.00000  5.478408384927e-04
6150.00000  6200.00000  5.525355852959e-04
6200.00000  6250.00000  5.384513448864e-04
6250.00000  6300.00000  5.640918851190e-04
6300.00000  6350.00000  5.193112233042e-04
6350.00000  6400.00000  6.189843092791e-04
6400.00000  6450.00000  4.983654298747e-04
6450.00000  6500.00000  5.045047141558e-04
6500.00000  6550.00000  5.016156392000e-04
6550.00000  6600.00000  4.792253082925e-04
6600.00000  6650.00000  4.644187991441e-04
6650.00000  6700.00000  4.936706830715e-04
6700.00000  6750.00000  4.503345587346e-04
6750.00000  6800.00000  4.398616620198e-04
6800.00000  6850.00000  4.535847680599e-04
6850.00000  6900.00000  4.434730057146e-04
6900.00000  6950.00000  4.297498996746e-04
6950.00000  7000.00000  4.272219590882e-04
7000.00000  7050.00000  4.438341400841e-04
7050.00000  7100.00000  4.351669152167e-04
7100.00000  7150.00000  3.986923438998e-04
7150.00000  7200.00000  3.983312095303e-04
7200.00000  7250.00000  3.986923438998e-04
7250.00000  7300.00000  3.954421345745e-04
7300.00000  7350.00000  3.965255376829e-04
7350.00000  7400.00000  3.979700751608e-04
7400.00000  7450.00000  3.755797442534e-04
7450.00000  7500.00000  3.921919252492e-04
7500.00000  7550.00000  3.484946665428e-04
7550.00000  7600.00000  3.513837414986e-04
7600.00000  7650.00000  3.578841601491e-04
7650.00000  7700.00000  3.549950851934e-04
7700.00000  7750.00000  3.477723978039e-04
7750.00000  7800.00000  3.643845787997e-04
7800.00000  7850.00000  3.445221884786e-04
7850.00000  7900.00000  3.528282789765e-04
7900.00000  7950.00000  3.282711418522e-04
7950.00000  8000.00000  3.087698859006e-04
8000.00000  8050.00000  3.141869014427e-04
8050.00000  8100.00000  3.351326948723e-04
8100.00000  8150.00000  3.217707232017e-04
8150.00000  8200.00000  2.856572862543e-04
8200.00000  8250.00000  3.044362734669e-04
8250.00000  8300.00000  2.845738831458e-04
8300.00000  8350.00000  3.084087515312e-04
8350.00000  8400.00000  3.029917359890e-04
8400.00000  8450.00000  2.975747204469e-04
8450.00000  8500.00000  2.867406893627e-04
8500.00000  8550.00000  2.824070769290e-04
8550.00000  8600.00000  2.618224178690e-04
8600.00000  8650.00000  2.751843895395e-04
8650.00000  8700.00000  2.701285083669e-04
8700.00000  8750.00000  2.751843895395e-04
8750.00000  8800.00000  2.531551930016e-04
8800.00000  8850.00000  2.477381774594e-04
8850.00000  8900.00000  2.542385961100e-04
8900.00000  8950.00000  2.704896427363e-04
8950.00000  9000.00000  2.466547743510e-04
9000.00000  9050.00000  2.549608648489e-04
9050.00000  9100.00000  2.574888054353e-04
9100.00000  9150.00000  2.484604461984e-04
9150.00000  9200.00000  2.545997304795e-04
9200.00000  9250.00000  2.415988931784e-04
9250.00000  9300.00000  2.578499398047e-04
9300.00000  9350.00000  2.574888054353e-04
9350.00000  9400.00000  2.322093995720e-04
9400.00000  9450.00000  2.253478465520e-04
9450.00000  9500.00000  2.188474279015e-04
9500.00000  9550.00000  2.260701152910e-04
9550.00000  9600.00000  2.199308310099e-04
9600.00000  9650.00000  2.148749498373e-04
9650.00000  9700.00000  2.177640247931e-04
9700.00000  9750.00000  2.166806216846e-04
9750.00000  9800.00000  2.054854562309e-04
9800.00000  9850.00000  2.094579342952e-04
9850.00000  9900.00000  2.004295750583e-04
9900.00000  9950.00000  2.076522624478e-04
9950.00000  10000.00000  2.105413374036e-04
