300.00000  350.00000  1.058089279734e-03
350.00000  400.00000  9.070472337911e-04
400.00000  450.00000  7.591850203948e-04
450.00000  500.00000  6.645850021467e-04
500.00000  550.00000  8.887631966507e-04
550.00000  600.00000  3.330874592099e-04
600.00000  650.00000  4.364320169600e-04
650.00000  700.00000  3.577311614426e-04
700.00000  750.00000  3.617059521253e-04
750.00000  800.00000  4.149681472734e-04
800.00000  850.00000  6.908186206525e-04
850.00000  900.00000  4.698202586946e-04
900.00000  950.00000  5.167227887504e-04
950.00000  1000.00000  6.256320534563e-04
1000.00000  1050.00000  7.210270298410e-04
1050.00000  1100.00000  8.839934478315e-04
1100.00000  1150.00000  9.666690940315e-04
1150.00000  1200.00000  1.143149800343e-03
1200.00000  1250.00000  1.356993539072e-03
1250.00000  1300.00000  1.570837277801e-03
1300.00000  1350.00000  1.440464143409e-03
1350.00000  1400.00000  1.648743175182e-03
1400.00000  1450.00000  1.934133146200e-03
1450.00000  1500.00000  2.132077722198e-03
1500.00000  1550.00000  2.227472698583e-03
1550.00000  1600.00000  2.441316437312e-03
1600.00000  1650.00000  2.526376957921e-03
1650.00000  1700.00000  2.609052604121e-03
1700.00000  1750.00000  2.885698035637e-03
1750.00000  1800.00000  2.817331635895e-03
1800.00000  1850.00000  2.669469422498e-03
1850.00000  1900.00000  2.557380325246e-03
1900.00000  1950.00000  2.602692939029e-03
1950.00000  2000.00000  2.659134966723e-03
2000.00000  2050.00000  2.657545050450e-03
2050.00000  2100.00000  2.659929924860e-03
2100.00000  2150.00000  2.662314799269e-03
2150.00000  2200.00000  2.644825720266e-03
2200.00000  2250.00000  2.537506371833e-03
2250.00000  2300.00000  2.396798781665e-03
2300.00000  2350.00000  2.488218967367e-03
2350.00000  2400.00000  2.330022298196e-03
2400.00000  2450.00000  2.274375228638e-03
2450.00000  2500.00000  2.181365126663e-03
2500.00000  2550.00000  1.822044048948e-03
2550.00000  2600.00000  1.951622225203e-03
2600.00000  2650.00000  1.837943211678e-03
2650.00000  2700.00000  1.783886058394e-03
2700.00000  2750.00000  1.736188570201e-03
2750.00000  2800.00000  1.670207044869e-03
2800.00000  2850.00000  1.543013743022e-03
2850.00000  2900.00000  1.496906171103e-03
2900.00000  2950.00000  1.482596924645e-03
2950.00000  3000.00000  1.438874227136e-03
3000.00000  3050.00000  1.297371678832e-03
3050.00000  3100.00000  1.228210320953e-03
3100.00000  3150.00000  1.202771660584e-03
3150.00000  3200.00000  1.161433837484e-03
3200.00000  3250.00000  1.116121223701e-03
3250.00000  3300.00000  1.015956498497e-03
3300.00000  3350.00000  9.611043870758e-04
3350.00000  3400.00000  9.483850568911e-04
3400.00000  3450.00000  9.022774849719e-04
3450.00000  3500.00000  9.229463965219e-04
3500.00000  3550.00000  8.156270480891e-04
3550.00000  3600.00000  7.949581365391e-04
3600.00000  3650.00000  8.013178016314e-04
3650.00000  3700.00000  7.401060251179e-04
3700.00000  3750.00000  6.820740811505e-04
3750.00000  3800.00000  6.629950858736e-04
3800.00000  3850.00000  6.145026395447e-04
3850.00000  3900.00000  6.025782674966e-04
3900.00000  3950.00000  5.612404443966e-04
3950.00000  4000.00000  5.866791047658e-04
4000.00000  4050.00000  5.429564072562e-04
4050.00000  4100.00000  5.040034585658e-04
4100.00000  4150.00000  4.809496726061e-04
4150.00000  4200.00000  4.785647981965e-04
4200.00000  4250.00000  4.563059703734e-04
4250.00000  4300.00000  4.109933565907e-04
4300.00000  4350.00000  4.149681472734e-04
4350.00000  4400.00000  3.895294869042e-04
4400.00000  4450.00000  3.680656172176e-04
4450.00000  4500.00000  3.784000729926e-04
4500.00000  4550.00000  3.497815800772e-04
4550.00000  4600.00000  3.561412451695e-04
4600.00000  4650.00000  3.171882964791e-04
4650.00000  4700.00000  3.155983802060e-04
4700.00000  4750.00000  2.869798872906e-04
4750.00000  4800.00000  2.798252640618e-04
4800.00000  4850.00000  2.710807245598e-04
4850.00000  4900.00000  2.575664362387e-04
4900.00000  4950.00000  2.631311431944e-04
4950.00000  5000.00000  2.337176921425e-04
5000.00000  5050.00000  2.241781945040e-04
5050.00000  5100.00000  2.217933200944e-04
5100.00000  5150.00000  2.074840736367e-04
5150.00000  5200.00000  2.273580270502e-04
5200.00000  5250.00000  2.217933200944e-04
5250.00000  5300.00000  2.154336550021e-04
5300.00000  5350.00000  2.011244085444e-04
5350.00000  5400.00000  2.050991992271e-04
5400.00000  5450.00000  1.804554969944e-04
5450.00000  5500.00000  2.011244085444e-04
5500.00000  5550.00000  1.518370040790e-04
5550.00000  5600.00000  1.613765017174e-04
5600.00000  5650.00000  1.574017110347e-04
5650.00000  5700.00000  1.510420459424e-04
5700.00000  5750.00000  1.430924645770e-04
5750.00000  5800.00000  1.526319622155e-04
5800.00000  5850.00000  1.367327994847e-04
5850.00000  5900.00000  1.375277576213e-04
5900.00000  5950.00000  1.160638879347e-04
5950.00000  6000.00000  1.200386786174e-04
6000.00000  6050.00000  1.271933018463e-04
6050.00000  6100.00000  1.136790135251e-04
6100.00000  6150.00000  1.128840553886e-04
6150.00000  6200.00000  1.112941391155e-04
6200.00000  6250.00000  1.001647252039e-04
6250.00000  6300.00000  1.057294321597e-04
6300.00000  6350.00000  1.097042228424e-04
6350.00000  6400.00000  3.092387151137e-04
6400.00000  6450.00000  1.232185111636e-04
6450.00000  6500.00000  8.426556247314e-05
6500.00000  6550.00000  1.001647252039e-04
6550.00000  6600.00000  1.025495996135e-04
6600.00000  6650.00000  7.552102297121e-05
6650.00000  6700.00000  9.380506011161e-05
6700.00000  6750.00000  7.870085551737e-05
6750.00000  6800.00000  7.870085551737e-05
6800.00000  6850.00000  7.393110669814e-05
6850.00000  6900.00000  7.234119042506e-05
6900.00000  6950.00000  7.075127415198e-05
6950.00000  7000.00000  6.359665092313e-05
7000.00000  7050.00000  6.200673465005e-05
7050.00000  7100.00000  8.108572992699e-05
7100.00000  7150.00000  5.644202769428e-05
7150.00000  7200.00000  4.769748819235e-05
7200.00000  7250.00000  5.246723701158e-05
7250.00000  7300.00000  5.485211142120e-05
7300.00000  7350.00000  4.531261378273e-05
7350.00000  7400.00000  5.803194396735e-05
7400.00000  7450.00000  3.895294869042e-05
7450.00000  7500.00000  6.280169278659e-05
7500.00000  7550.00000  4.372269750965e-05
7550.00000  7600.00000  5.723698583081e-05
7600.00000  7650.00000  3.656807428080e-05
7650.00000  7700.00000  4.690253005581e-05
7700.00000  7750.00000  4.610757191927e-05
7750.00000  7800.00000  3.259328359810e-05
7800.00000  7850.00000  3.577311614426e-05
7850.00000  7900.00000  3.736303241734e-05
7900.00000  7950.00000  4.451765564619e-05
7950.00000  8000.00000  3.895294869042e-05
8000.00000  8050.00000  4.213278123657e-05
8050.00000  8100.00000  5.644202769428e-05
8100.00000  8150.00000  3.338824173464e-05
8150.00000  8200.00000  3.259328359810e-05
8200.00000  8250.00000  4.213278123657e-05
8250.00000  8300.00000  4.133782310003e-05
8300.00000  8350.00000  3.020840918849e-05
8350.00000  8400.00000  3.736303241734e-05
8400.00000  8450.00000  3.100336732502e-05
8450.00000  8500.00000  3.577311614426e-05
8500.00000  8550.00000  2.384874409617e-05
8550.00000  8600.00000  2.861849291541e-05
8600.00000  8650.00000  2.464370223271e-05
8650.00000  8700.00000  3.020840918849e-05
8700.00000  8750.00000  2.702857664233e-05
8750.00000  8800.00000  3.100336732502e-05
8800.00000  8850.00000  1.987395341348e-05
8850.00000  8900.00000  2.941345105195e-05
8900.00000  8950.00000  2.782353477887e-05
8950.00000  9000.00000  2.543866036925e-05
9000.00000  9050.00000  3.100336732502e-05
9050.00000  9100.00000  2.305378595963e-05
9100.00000  9150.00000  2.782353477887e-05
9150.00000  9200.00000  2.225882782309e-05
9200.00000  9250.00000  2.146386968656e-05
9250.00000  9300.00000  2.225882782309e-05
9300.00000  9350.00000  1.828403714040e-05
9350.00000  9400.00000  2.702857664233e-05
9400.00000  9450.00000  1.987395341348e-05
9450.00000  9500.00000  1.907899527694e-05
9500.00000  9550.00000  2.146386968656e-05
9550.00000  9600.00000  1.987395341348e-05
9600.00000  9650.00000  1.907899527694e-05
9650.00000  9700.00000  1.907899527694e-05
9700.00000  9750.00000  1.669412086732e-05
9750.00000  9800.00000  1.828403714040e-05
9800.00000  9850.00000  1.589916273078e-05
9850.00000  9900.00000  1.828403714040e-05
9900.00000  9950.00000  2.066891155002e-05
9950.00000  10000.00000  2.623361850579e-05
