300.00000  350.00000  4.642158293462e-01
350.00000  400.00000  3.482679500218e-01
400.00000  450.00000  2.708243091325e-01
450.00000  500.00000  2.161028859098e-01
500.00000  550.00000  1.772640450494e-01
550.00000  600.00000  1.475245814938e-01
600.00000  650.00000  1.247050578247e-01
650.00000  700.00000  1.066441232409e-01
700.00000  750.00000  9.278290125946e-02
750.00000  800.00000  8.134600949850e-02
800.00000  850.00000  7.143490479664e-02
850.00000  900.00000  6.346232376708e-02
900.00000  950.00000  5.681730046794e-02
950.00000  1000.00000  5.118585121802e-02
1000.00000  1050.00000  4.638023692683e-02
1050.00000  1100.00000  4.178442739958e-02
1100.00000  1150.00000  3.833747982106e-02
1150.00000  1200.00000  3.509201716238e-02
1200.00000  1250.00000  3.238553570761e-02
1250.00000  1300.00000  3.001076281926e-02
1300.00000  1350.00000  2.763490473387e-02
1350.00000  1400.00000  2.567323019107e-02
1400.00000  1450.00000  2.397308813848e-02
1450.00000  1500.00000  2.218432165975e-02
1500.00000  1550.00000  2.082529321474e-02
1550.00000  1600.00000  1.937438475242e-02
1600.00000  1650.00000  1.841253842948e-02
1650.00000  1700.00000  1.728755081596e-02
1700.00000  1750.00000  1.639479537218e-02
1750.00000  1800.00000  1.536639029654e-02
1800.00000  1850.00000  1.447254965571e-02
1850.00000  1900.00000  1.372231675846e-02
1900.00000  1950.00000  1.300246937875e-02
1950.00000  2000.00000  1.239331209863e-02
2000.00000  2050.00000  1.184022333301e-02
2050.00000  2100.00000  1.122672526468e-02
2100.00000  2150.00000  1.058247994645e-02
2150.00000  2200.00000  1.011946253639e-02
2200.00000  2250.00000  9.788839167013e-03
2250.00000  2300.00000  9.333779868684e-03
2300.00000  2350.00000  9.121804710638e-03
2350.00000  2400.00000  8.581738309679e-03
2400.00000  2450.00000  8.267392896127e-03
2450.00000  2500.00000  7.906384009217e-03
2500.00000  2550.00000  7.587336075094e-03
2550.00000  2600.00000  7.373190522938e-03
2600.00000  2650.00000  7.061015503496e-03
2650.00000  2700.00000  6.675047084324e-03
2700.00000  2750.00000  6.550611155369e-03
2750.00000  2800.00000  6.304271423920e-03
2800.00000  2850.00000  6.020311527904e-03
2850.00000  2900.00000  5.843424407965e-03
2900.00000  2950.00000  5.673048470355e-03
2950.00000  3000.00000  5.477713000483e-03
3000.00000  3050.00000  5.264652645383e-03
3050.00000  3100.00000  5.087403793093e-03
3100.00000  3150.00000  4.856618552763e-03
3150.00000  3200.00000  4.729650497347e-03
3200.00000  3250.00000  4.620407327159e-03
3250.00000  3300.00000  4.484034230601e-03
3300.00000  3350.00000  4.362492160459e-03
3350.00000  3400.00000  4.215628825704e-03
3400.00000  3450.00000  4.187413702278e-03
3450.00000  3500.00000  3.975438544233e-03
3500.00000  3550.00000  3.823510956555e-03
3550.00000  3600.00000  3.767442442055e-03
3600.00000  3650.00000  3.607195010290e-03
3650.00000  3700.00000  3.547509172274e-03
3700.00000  3750.00000  3.445500649119e-03
3750.00000  3800.00000  3.362663940599e-03
3800.00000  3850.00000  3.297913849660e-03
3850.00000  3900.00000  3.159732091344e-03
3900.00000  3950.00000  3.174201385409e-03
3950.00000  4000.00000  3.032764035928e-03
4000.00000  4050.00000  2.929308583366e-03
4050.00000  4100.00000  2.896390939369e-03
4100.00000  4150.00000  2.804872654411e-03
4150.00000  4200.00000  2.771593278063e-03
4200.00000  4250.00000  2.718418622376e-03
4250.00000  4300.00000  2.619303958033e-03
4300.00000  4350.00000  2.593982693421e-03
4350.00000  4400.00000  2.525615278966e-03
4400.00000  4450.00000  2.439161246930e-03
4450.00000  4500.00000  2.360303594278e-03
4500.00000  4550.00000  2.366453044256e-03
4550.00000  4600.00000  2.280722476923e-03
4600.00000  4650.00000  2.228271285939e-03
4650.00000  4700.00000  2.239484988839e-03
4700.00000  4750.00000  2.158456942078e-03
4750.00000  4800.00000  2.091898189381e-03
4800.00000  4850.00000  2.042340857210e-03
4850.00000  4900.00000  2.025701169036e-03
4900.00000  4950.00000  1.986272342710e-03
4950.00000  5000.00000  2.017381324949e-03
5000.00000  5050.00000  1.878837834281e-03
5050.00000  5100.00000  1.838685543252e-03
5100.00000  5150.00000  1.848090584393e-03
5150.00000  5200.00000  1.789851675784e-03
5200.00000  5250.00000  1.749337652403e-03
5250.00000  5300.00000  1.750061117106e-03
5300.00000  5350.00000  1.701588981990e-03
5350.00000  5400.00000  1.666862676235e-03
5400.00000  5450.00000  1.638647552809e-03
5450.00000  5500.00000  1.595963135319e-03
5500.00000  5550.00000  1.571727067761e-03
5550.00000  5600.00000  1.524340129699e-03
5600.00000  5650.00000  1.553278717828e-03
5650.00000  5700.00000  1.510594300338e-03
5700.00000  5750.00000  1.511679497393e-03
5750.00000  5800.00000  1.461036968167e-03
5800.00000  5850.00000  1.414373494809e-03
5850.00000  5900.00000  1.462122165222e-03
5900.00000  5950.00000  1.361922303825e-03
5950.00000  6000.00000  1.381455850812e-03
6000.00000  6050.00000  1.313088436357e-03
6050.00000  6100.00000  1.285596777634e-03
6100.00000  6150.00000  1.277276933547e-03
6150.00000  6200.00000  1.261722442428e-03
6200.00000  6250.00000  1.239295036628e-03
6250.00000  6300.00000  1.219038024938e-03
6300.00000  6350.00000  1.234592516057e-03
6350.00000  6400.00000  1.523616664996e-03
6400.00000  6450.00000  1.178885733908e-03
6450.00000  6500.00000  1.186843845644e-03
6500.00000  6550.00000  1.111603516508e-03
6550.00000  6600.00000  1.146329822263e-03
6600.00000  6650.00000  1.120285092947e-03
6650.00000  6700.00000  1.064578310799e-03
6700.00000  6750.00000  1.104007137124e-03
6750.00000  6800.00000  1.069280831370e-03
6800.00000  6850.00000  1.014297513924e-03
6850.00000  6900.00000  1.039618778537e-03
6900.00000  6950.00000  1.015382710979e-03
6950.00000  7000.00000  1.010318458057e-03
7000.00000  7050.00000  9.835502640372e-04
7050.00000  7100.00000  9.911466434210e-04
7100.00000  7150.00000  9.329077348113e-04
7150.00000  7200.00000  9.361633259758e-04
7200.00000  7250.00000  9.036074143306e-04
7250.00000  7300.00000  8.873294585080e-04
7300.00000  7350.00000  9.003518231660e-04
7350.00000  7400.00000  8.457302380724e-04
7400.00000  7450.00000  8.656255174111e-04
7450.00000  7500.00000  8.493475615885e-04
7500.00000  7550.00000  8.323461410627e-04
7550.00000  7600.00000  8.280053528433e-04
7600.00000  7650.00000  8.207707058111e-04
7650.00000  7700.00000  7.968963706046e-04
7700.00000  7750.00000  7.987050323626e-04
7750.00000  7800.00000  7.788097530239e-04
7800.00000  7850.00000  7.777245559691e-04
7850.00000  7900.00000  7.798949500787e-04
7900.00000  7950.00000  7.469773060819e-04
7950.00000  8000.00000  7.339549414238e-04
8000.00000  8050.00000  7.838740059465e-04
8050.00000  8100.00000  7.245499002819e-04
8100.00000  8150.00000  7.231029708754e-04
8150.00000  8200.00000  7.122510003270e-04
8200.00000  8250.00000  6.985051709657e-04
8250.00000  8300.00000  6.800568210334e-04
8300.00000  8350.00000  6.684813857818e-04
8350.00000  8400.00000  6.626936681560e-04
8400.00000  8450.00000  6.637788652108e-04
8450.00000  8500.00000  6.471391770366e-04
8500.00000  8550.00000  6.843976092528e-04
8550.00000  8600.00000  6.431601211688e-04
8600.00000  8650.00000  6.315846859172e-04
8650.00000  8700.00000  6.315846859172e-04
8700.00000  8750.00000  6.033695624913e-04
8750.00000  8800.00000  6.171153918527e-04
8800.00000  8850.00000  5.928793242946e-04
8850.00000  8900.00000  5.903471978333e-04
8900.00000  8950.00000  6.370106711914e-04
8950.00000  9000.00000  5.787717625816e-04
9000.00000  9050.00000  6.008374360301e-04
9050.00000  9100.00000  5.802186919881e-04
9100.00000  9150.00000  5.382577392009e-04
9150.00000  9200.00000  5.581530185397e-04
9200.00000  9250.00000  5.473010479913e-04
9250.00000  9300.00000  5.708136508461e-04
9300.00000  9350.00000  5.436837244751e-04
9350.00000  9400.00000  5.397046686074e-04
9400.00000  9450.00000  5.201711216202e-04
9450.00000  9500.00000  5.252353745428e-04
9500.00000  9550.00000  5.350021480364e-04
9550.00000  9600.00000  5.143834039944e-04
9600.00000  9650.00000  5.194476569170e-04
9650.00000  9700.00000  5.089574187202e-04
9700.00000  9750.00000  4.988289128750e-04
9750.00000  9800.00000  5.057018275557e-04
9800.00000  9850.00000  4.579531571427e-04
9850.00000  9900.00000  4.814657599976e-04
9900.00000  9950.00000  4.821892247008e-04
9950.00000  10000.00000  4.677199306363e-04
