10001.00000  11001.00000  1.732365669523e-04
11001.00000  12001.00000  1.372533977080e-04
12001.00000  13001.00000  1.183352078692e-04
13001.00000  14001.00000  9.611598694626e-05
14001.00000  15001.00000  8.395429347847e-05
15001.00000  16001.00000  6.945678269384e-05
16001.00000  17001.00000  6.150342125141e-05
17001.00000  18001.00000  5.055789713040e-05
18001.00000  19001.00000  4.571252401863e-05
19001.00000  20001.00000  4.040384829856e-05
20001.00000  21001.00000  3.281726808770e-05
21001.00000  22001.00000  3.136944743677e-05
22001.00000  23001.00000  2.791398214989e-05
23001.00000  24001.00000  2.550094773168e-05
24001.00000  25001.00000  2.154357128581e-05
25001.00000  26001.00000  1.997992498280e-05
26001.00000  27001.00000  1.801088889754e-05
27001.00000  28001.00000  1.606115708763e-05
28001.00000  29001.00000  1.387977397356e-05
29001.00000  30001.00000  1.262499607609e-05
30001.00000  31001.00000  1.208447636641e-05
31001.00000  32001.00000  1.090691557032e-05
32001.00000  33001.00000  1.005752745511e-05
33001.00000  34001.00000  9.169530789209e-06
34001.00000  35001.00000  9.092313687827e-06
35001.00000  36001.00000  7.798927239664e-06
36001.00000  37001.00000  7.702405862936e-06
37001.00000  38001.00000  6.698583544959e-06
38001.00000  39001.00000  5.385892821451e-06
39001.00000  40001.00000  6.679279269614e-06
40001.00000  41001.00000  5.115632966612e-06
41001.00000  42001.00000  4.826068836426e-06
42001.00000  43001.00000  4.575113256932e-06
43001.00000  44001.00000  5.192850067994e-06
44001.00000  45001.00000  4.092506373289e-06
45001.00000  46001.00000  3.532682388264e-06
46001.00000  47001.00000  3.687116591029e-06
47001.00000  48001.00000  3.455465286881e-06
48001.00000  49001.00000  2.663989997707e-06
49001.00000  50001.00000  2.818424200473e-06
50001.00000  51001.00000  3.050075504621e-06
51001.00000  52001.00000  3.146596881350e-06
52001.00000  53001.00000  2.355121592176e-06
53001.00000  54001.00000  1.833906157842e-06
54001.00000  55001.00000  2.335817316830e-06
55001.00000  56001.00000  1.930427534570e-06
56001.00000  57001.00000  1.679471955076e-06
57001.00000  58001.00000  1.737384781113e-06
58001.00000  59001.00000  1.582950578348e-06
59001.00000  60001.00000  1.467124926274e-06
60001.00000  61001.00000  1.389907824891e-06
61001.00000  62001.00000  1.293386448162e-06
62001.00000  63001.00000  1.582950578348e-06
63001.00000  64001.00000  1.389907824891e-06
64001.00000  65001.00000  1.003822317977e-06
65001.00000  66001.00000  9.073009412481e-07
66001.00000  67001.00000  1.177560796088e-06
67001.00000  68001.00000  9.845180426309e-07
68001.00000  69001.00000  9.459094919395e-07
69001.00000  70001.00000  9.266052165938e-07
70001.00000  71001.00000  1.023126593322e-06
71001.00000  72001.00000  8.493881152110e-07
72001.00000  73001.00000  9.459094919395e-07
73001.00000  74001.00000  6.949539124453e-07
74001.00000  75001.00000  7.914752891739e-07
75001.00000  76001.00000  6.563453617539e-07
76001.00000  77001.00000  5.405197096797e-07
77001.00000  78001.00000  5.212154343340e-07
78001.00000  79001.00000  5.212154343340e-07
79001.00000  80001.00000  7.142581877911e-07
80001.00000  81001.00000  3.281726808770e-07
81001.00000  82001.00000  4.633026082969e-07
82001.00000  83001.00000  6.563453617539e-07
83001.00000  84001.00000  4.439983329512e-07
84001.00000  85001.00000  5.019111589883e-07
85001.00000  86001.00000  3.860855069141e-07
86001.00000  87001.00000  3.474769562227e-07
87001.00000  88001.00000  3.088684055313e-07
88001.00000  89001.00000  2.702598548399e-07
89001.00000  90001.00000  3.088684055313e-07
90001.00000  91001.00000  3.281726808770e-07
91001.00000  92001.00000  4.053897822598e-07
92001.00000  93001.00000  4.826068836426e-07
93001.00000  94001.00000  2.509555794942e-07
94001.00000  95001.00000  2.895641301856e-07
95001.00000  96001.00000  1.544342027656e-07
96001.00000  97001.00000  4.053897822598e-07
97001.00000  98001.00000  1.351299274199e-07
98001.00000  99001.00000  2.702598548399e-07
99001.00000  100001.00000  1.544342027656e-07
100001.00000  101001.00000  1.158256520742e-07
101001.00000  102001.00000  2.895641301856e-07
102001.00000  103001.00000  2.123470288027e-07
103001.00000  104001.00000  2.123470288027e-07
104001.00000  105001.00000  2.316513041484e-07
105001.00000  106001.00000  1.737384781113e-07
106001.00000  107001.00000  1.544342027656e-07
107001.00000  108001.00000  7.721710138282e-08
108001.00000  109001.00000  1.544342027656e-07
109001.00000  110001.00000  1.351299274199e-07
110001.00000  111001.00000  1.544342027656e-07
111001.00000  112001.00000  1.158256520742e-07
112001.00000  113001.00000  1.158256520742e-07
113001.00000  114001.00000  9.652137672852e-08
114001.00000  115001.00000  2.123470288027e-07
115001.00000  116001.00000  7.721710138282e-08
116001.00000  117001.00000  7.721710138282e-08
117001.00000  118001.00000  9.652137672852e-08
118001.00000  119001.00000  1.351299274199e-07
119001.00000  120001.00000  5.791282603711e-08
120001.00000  121001.00000  1.544342027656e-07
121001.00000  122001.00000  1.351299274199e-07
122001.00000  123001.00000  1.351299274199e-07
123001.00000  124001.00000  5.791282603711e-08
124001.00000  125001.00000  7.721710138282e-08
125001.00000  126001.00000  7.721710138282e-08
126001.00000  127001.00000  3.860855069141e-08
127001.00000  128001.00000  3.860855069141e-08
128001.00000  129001.00000  3.860855069141e-08
129001.00000  130001.00000  3.860855069141e-08
130001.00000  131001.00000  5.791282603711e-08
131001.00000  132001.00000  3.860855069141e-08
132001.00000  133001.00000  3.860855069141e-08
133001.00000  134001.00000  3.860855069141e-08
134001.00000  135001.00000  7.721710138282e-08
135001.00000  136001.00000  7.721710138282e-08
136001.00000  137001.00000  5.791282603711e-08
137001.00000  138001.00000  5.791282603711e-08
138001.00000  139001.00000  1.930427534570e-08
139001.00000  140001.00000  1.930427534570e-08
140001.00000  141001.00000  3.860855069141e-08
141001.00000  142001.00000  5.791282603711e-08
142001.00000  143001.00000  3.860855069141e-08
143001.00000  144001.00000  3.860855069141e-08
144001.00000  145001.00000  3.860855069141e-08
145001.00000  146001.00000  1.930427534570e-08
146001.00000  147001.00000  1.930427534570e-08
147001.00000  148001.00000  5.791282603711e-08
148001.00000  149001.00000  1.930427534570e-08
149001.00000  150001.00000  1.930427534570e-08
150001.00000  151001.00000  3.860855069141e-08
151001.00000  152001.00000  0.000000000000e+00
152001.00000  153001.00000  1.930427534570e-08
153001.00000  154001.00000  5.791282603711e-08
154001.00000  155001.00000  0.000000000000e+00
155001.00000  156001.00000  0.000000000000e+00
156001.00000  157001.00000  0.000000000000e+00
157001.00000  158001.00000  5.791282603711e-08
158001.00000  159001.00000  0.000000000000e+00
159001.00000  160001.00000  3.860855069141e-08
160001.00000  161001.00000  1.930427534570e-08
161001.00000  162001.00000  0.000000000000e+00
162001.00000  163001.00000  0.000000000000e+00
163001.00000  164001.00000  0.000000000000e+00
164001.00000  165001.00000  3.860855069141e-08
165001.00000  166001.00000  1.930427534570e-08
166001.00000  167001.00000  1.930427534570e-08
167001.00000  168001.00000  1.930427534570e-08
168001.00000  169001.00000  0.000000000000e+00
169001.00000  170001.00000  0.000000000000e+00
170001.00000  171001.00000  1.930427534570e-08
171001.00000  172001.00000  1.930427534570e-08
172001.00000  173001.00000  0.000000000000e+00
173001.00000  174001.00000  0.000000000000e+00
174001.00000  175001.00000  0.000000000000e+00
175001.00000  176001.00000  0.000000000000e+00
176001.00000  177001.00000  0.000000000000e+00
177001.00000  178001.00000  0.000000000000e+00
178001.00000  179001.00000  1.930427534570e-08
179001.00000  180001.00000  0.000000000000e+00
180001.00000  181001.00000  0.000000000000e+00
181001.00000  182001.00000  0.000000000000e+00
182001.00000  183001.00000  0.000000000000e+00
183001.00000  184001.00000  0.000000000000e+00
184001.00000  185001.00000  0.000000000000e+00
185001.00000  186001.00000  0.000000000000e+00
186001.00000  187001.00000  0.000000000000e+00
187001.00000  188001.00000  0.000000000000e+00
188001.00000  189001.00000  0.000000000000e+00
189001.00000  190001.00000  0.000000000000e+00
190001.00000  191001.00000  0.000000000000e+00
191001.00000  192001.00000  1.930427534570e-08
192001.00000  193001.00000  1.930427534570e-08
193001.00000  194001.00000  0.000000000000e+00
194001.00000  195001.00000  0.000000000000e+00
195001.00000  196001.00000  1.930427534570e-08
196001.00000  197001.00000  0.000000000000e+00
197001.00000  198001.00000  0.000000000000e+00
198001.00000  199001.00000  0.000000000000e+00
