300.00000  350.00000  0.000000000000e+00
350.00000  400.00000  0.000000000000e+00
400.00000  450.00000  0.000000000000e+00
450.00000  500.00000  3.629592095938e-07
500.00000  550.00000  5.081428934313e-06
550.00000  600.00000  7.259184191875e-07
600.00000  650.00000  1.814796047969e-06
650.00000  700.00000  0.000000000000e+00
700.00000  750.00000  1.814796047969e-06
750.00000  800.00000  1.814796047969e-06
800.00000  850.00000  6.170306563094e-06
850.00000  900.00000  3.629592095938e-07
900.00000  950.00000  7.259184191875e-07
950.00000  1000.00000  0.000000000000e+00
1000.00000  1050.00000  1.451836838375e-06
1050.00000  1100.00000  0.000000000000e+00
1100.00000  1150.00000  3.629592095938e-07
1150.00000  1200.00000  3.629592095938e-07
1200.00000  1250.00000  7.259184191875e-07
1250.00000  1300.00000  5.807347353500e-06
1300.00000  1350.00000  1.088877628781e-06
1350.00000  1400.00000  7.259184191875e-07
1400.00000  1450.00000  2.540714467156e-06
1450.00000  1500.00000  2.540714467156e-06
1500.00000  1550.00000  1.451836838375e-06
1550.00000  1600.00000  1.451836838375e-06
1600.00000  1650.00000  7.259184191875e-07
1650.00000  1700.00000  1.451836838375e-06
1700.00000  1750.00000  1.996275652766e-05
1750.00000  1800.00000  3.629592095938e-06
1800.00000  1850.00000  2.177755257563e-06
1850.00000  1900.00000  1.451836838375e-06
1900.00000  1950.00000  1.451836838375e-06
1950.00000  2000.00000  3.266632886344e-06
2000.00000  2050.00000  2.540714467156e-06
2050.00000  2100.00000  2.903673676750e-06
2100.00000  2150.00000  4.355510515125e-06
2150.00000  2200.00000  2.177755257563e-06
2200.00000  2250.00000  3.629592095938e-06
2250.00000  2300.00000  3.992551305531e-06
2300.00000  2350.00000  3.774775779775e-05
2350.00000  2400.00000  4.355510515125e-06
2400.00000  2450.00000  5.807347353500e-06
2450.00000  2500.00000  6.896224982282e-06
2500.00000  2550.00000  3.629592095938e-06
2550.00000  2600.00000  4.718469724719e-06
2600.00000  2650.00000  3.992551305531e-06
2650.00000  2700.00000  7.622143401469e-06
2700.00000  2750.00000  4.355510515125e-06
2750.00000  2800.00000  5.444388143907e-06
2800.00000  2850.00000  3.629592095938e-06
2850.00000  2900.00000  6.896224982282e-06
2900.00000  2950.00000  7.985102611063e-06
2950.00000  3000.00000  1.996275652766e-05
3000.00000  3050.00000  9.436939449438e-06
3050.00000  3100.00000  9.073980239844e-06
3100.00000  3150.00000  1.161469470700e-05
3150.00000  3200.00000  1.016285786863e-05
3200.00000  3250.00000  7.985102611063e-06
3250.00000  3300.00000  1.016285786863e-05
3300.00000  3350.00000  1.125173549741e-05
3350.00000  3400.00000  8.711021030250e-06
3400.00000  3450.00000  1.306653154538e-05
3450.00000  3500.00000  1.052581707822e-05
3500.00000  3550.00000  1.234061312619e-05
3550.00000  3600.00000  1.451836838375e-05
3600.00000  3650.00000  1.342949075497e-05
3650.00000  3700.00000  2.722194071953e-05
3700.00000  3750.00000  1.597020522213e-05
3750.00000  3800.00000  1.742204206050e-05
3800.00000  3850.00000  1.669612364131e-05
3850.00000  3900.00000  2.613306309075e-05
3900.00000  3950.00000  2.431826704278e-05
3950.00000  4000.00000  2.286643020441e-05
4000.00000  4050.00000  2.286643020441e-05
4050.00000  4100.00000  2.722194071953e-05
4100.00000  4150.00000  3.520704333060e-05
4150.00000  4200.00000  3.484408412100e-05
4200.00000  4250.00000  2.903673676750e-05
4250.00000  4300.00000  3.702183937856e-05
4300.00000  4350.00000  4.065143147450e-05
4350.00000  4400.00000  4.282918673206e-05
4400.00000  4450.00000  5.045133013353e-05
4450.00000  4500.00000  5.335500381028e-05
4500.00000  4550.00000  5.662163669663e-05
4550.00000  4600.00000  5.625867748703e-05
4600.00000  4650.00000  6.859929061322e-05
4650.00000  4700.00000  6.823633140363e-05
4700.00000  4750.00000  7.186592349957e-05
4750.00000  4800.00000  8.130286294900e-05
4800.00000  4850.00000  7.694735243388e-05
4850.00000  4900.00000  7.948806690104e-05
4900.00000  4950.00000  8.384357741616e-05
4950.00000  5000.00000  9.219163923682e-05
5000.00000  5050.00000  1.074359260398e-04
5050.00000  5100.00000  1.074359260398e-04
5100.00000  5150.00000  1.139691918124e-04
5150.00000  5200.00000  1.088877628781e-04
5200.00000  5250.00000  1.081618444589e-04
5250.00000  5300.00000  1.056211299918e-04
5300.00000  5350.00000  1.303023562442e-04
5350.00000  5400.00000  1.186876615372e-04
5400.00000  5450.00000  1.346578667593e-04
5450.00000  5500.00000  1.223172536331e-04
5500.00000  5550.00000  1.335689891305e-04
5550.00000  5600.00000  1.266727641482e-04
5600.00000  5650.00000  1.401022549032e-04
5650.00000  5700.00000  1.437318469991e-04
5700.00000  5750.00000  1.361097035977e-04
5750.00000  5800.00000  1.502651127718e-04
5800.00000  5850.00000  1.607909298500e-04
5850.00000  5900.00000  1.520799088198e-04
5900.00000  5950.00000  1.582502153829e-04
5950.00000  6000.00000  1.589761338021e-04
6000.00000  6050.00000  1.644205219460e-04
6050.00000  6100.00000  1.502651127718e-04
6100.00000  6150.00000  1.586131745925e-04
6150.00000  6200.00000  1.673241956227e-04
6200.00000  6250.00000  1.803907271681e-04
6250.00000  6300.00000  1.949090955519e-04
6300.00000  6350.00000  1.836573600544e-04
6350.00000  6400.00000  6.123121865847e-04
6400.00000  6450.00000  1.477243983047e-04
6450.00000  6500.00000  1.727685837666e-04
6500.00000  6550.00000  1.695019508803e-04
6550.00000  6600.00000  1.698649100899e-04
6600.00000  6650.00000  1.676871548323e-04
6650.00000  6700.00000  1.822055232161e-04
6700.00000  6750.00000  1.655093995748e-04
6750.00000  6800.00000  1.763981758626e-04
6800.00000  6850.00000  1.567983785445e-04
6850.00000  6900.00000  1.626057258980e-04
6900.00000  6950.00000  1.665982772035e-04
6950.00000  7000.00000  1.716797061379e-04
7000.00000  7050.00000  1.658723587844e-04
7050.00000  7100.00000  2.304790980920e-04
7100.00000  7150.00000  7.222888270916e-05
7150.00000  7200.00000  6.751041298444e-05
7200.00000  7250.00000  7.912510769144e-05
7250.00000  7300.00000  7.077704587078e-05
7300.00000  7350.00000  8.783612872169e-05
7350.00000  7400.00000  6.896224982282e-05
7400.00000  7450.00000  6.932520903241e-05
7450.00000  7500.00000  9.255459844641e-05
7500.00000  7550.00000  7.404367875713e-05
7550.00000  7600.00000  6.823633140363e-05
7600.00000  7650.00000  6.932520903241e-05
7650.00000  7700.00000  8.239174057779e-05
7700.00000  7750.00000  7.186592349957e-05
7750.00000  7800.00000  7.985102611063e-05
7800.00000  7850.00000  7.295480112835e-05
7850.00000  7900.00000  7.005112745160e-05
7900.00000  7950.00000  8.384357741616e-05
7950.00000  8000.00000  7.222888270916e-05
8000.00000  8050.00000  7.731031164347e-05
8050.00000  8100.00000  7.694735243388e-05
8100.00000  8150.00000  7.985102611063e-05
8150.00000  8200.00000  9.073980239844e-05
8200.00000  8250.00000  8.021398532022e-05
8250.00000  8300.00000  8.965092476966e-05
8300.00000  8350.00000  8.493245504494e-05
8350.00000  8400.00000  8.747316951210e-05
8400.00000  8450.00000  7.658439322429e-05
8450.00000  8500.00000  7.658439322429e-05
8500.00000  8550.00000  7.186592349957e-05
8550.00000  8600.00000  7.331776033794e-05
8600.00000  8650.00000  7.658439322429e-05
8650.00000  8700.00000  8.057694452982e-05
8700.00000  8750.00000  8.166582215860e-05
8750.00000  8800.00000  7.440663796672e-05
8800.00000  8850.00000  7.731031164347e-05
8850.00000  8900.00000  8.166582215860e-05
8900.00000  8950.00000  7.876214848185e-05
8950.00000  9000.00000  7.839918927225e-05
9000.00000  9050.00000  8.093990373941e-05
9050.00000  9100.00000  7.948806690104e-05
9100.00000  9150.00000  6.823633140363e-05
9150.00000  9200.00000  7.259184191875e-05
9200.00000  9250.00000  7.694735243388e-05
9250.00000  9300.00000  8.747316951210e-05
9300.00000  9350.00000  7.585847480510e-05
9350.00000  9400.00000  7.912510769144e-05
9400.00000  9450.00000  7.912510769144e-05
9450.00000  9500.00000  7.259184191875e-05
9500.00000  9550.00000  7.368071954753e-05
9550.00000  9600.00000  6.932520903241e-05
9600.00000  9650.00000  7.839918927225e-05
9650.00000  9700.00000  7.694735243388e-05
9700.00000  9750.00000  7.622143401469e-05
9750.00000  9800.00000  7.767327085307e-05
9800.00000  9850.00000  7.912510769144e-05
9850.00000  9900.00000  7.622143401469e-05
9900.00000  9950.00000  7.295480112835e-05
9950.00000  10000.00000  7.839918927225e-05
