10001.00000  11001.00000  5.493066436449e-05
11001.00000  12001.00000  4.976639565878e-05
12001.00000  13001.00000  4.415539090587e-05
13001.00000  14001.00000  3.722204745323e-05
14001.00000  15001.00000  3.418424233223e-05
15001.00000  16001.00000  2.876980144009e-05
16001.00000  17001.00000  2.657186008783e-05
17001.00000  18001.00000  2.276566896563e-05
18001.00000  19001.00000  2.047838040394e-05
19001.00000  20001.00000  1.915604170421e-05
20001.00000  21001.00000  1.742270584105e-05
21001.00000  22001.00000  1.543919779145e-05
22001.00000  23001.00000  1.409898964983e-05
23001.00000  24001.00000  1.275878150821e-05
24001.00000  25001.00000  1.163300666925e-05
25001.00000  26001.00000  1.004262634120e-05
26001.00000  27001.00000  9.470804200774e-06
27001.00000  28001.00000  8.773895967132e-06
28001.00000  29001.00000  7.558773918731e-06
29001.00000  30001.00000  6.969082336419e-06
30001.00000  31001.00000  6.611693498654e-06
31001.00000  32001.00000  6.486607405436e-06
32001.00000  33001.00000  7.344340616072e-06
33001.00000  34001.00000  4.914096519270e-06
34001.00000  35001.00000  5.861176939347e-06
35001.00000  36001.00000  5.128529821929e-06
36001.00000  37001.00000  4.467360472063e-06
37001.00000  38001.00000  4.074232750522e-06
38001.00000  39001.00000  3.984885541080e-06
39001.00000  40001.00000  4.252927169404e-06
40001.00000  41001.00000  3.734713354645e-06
41001.00000  42001.00000  3.627496703315e-06
42001.00000  43001.00000  3.520280051986e-06
43001.00000  44001.00000  3.520280051986e-06
44001.00000  45001.00000  2.680416283238e-06
45001.00000  46001.00000  2.680416283238e-06
46001.00000  47001.00000  2.591069073797e-06
47001.00000  48001.00000  2.608938515685e-06
48001.00000  49001.00000  2.662546841350e-06
49001.00000  50001.00000  2.269419119808e-06
50001.00000  51001.00000  2.001377491484e-06
51001.00000  52001.00000  2.287288561696e-06
52001.00000  53001.00000  2.197941352255e-06
53001.00000  54001.00000  1.965638607708e-06
54001.00000  55001.00000  1.769074746937e-06
55001.00000  56001.00000  1.983508049596e-06
56001.00000  57001.00000  1.554641444278e-06
57001.00000  58001.00000  1.786944188825e-06
58001.00000  59001.00000  1.393816467284e-06
59001.00000  60001.00000  1.465294234837e-06
60001.00000  61001.00000  1.286599815954e-06
61001.00000  62001.00000  1.536772002390e-06
62001.00000  63001.00000  1.268730374066e-06
63001.00000  64001.00000  1.268730374066e-06
64001.00000  65001.00000  1.197252606513e-06
65001.00000  66001.00000  8.398637687479e-07
66001.00000  67001.00000  9.649498619657e-07
67001.00000  68001.00000  1.090035955183e-06
68001.00000  69001.00000  1.018558187630e-06
69001.00000  70001.00000  7.862554430831e-07
70001.00000  71001.00000  1.143644280848e-06
71001.00000  72001.00000  1.161513722736e-06
72001.00000  73001.00000  9.292109781892e-07
73001.00000  74001.00000  9.470804200774e-07
74001.00000  75001.00000  9.292109781892e-07
75001.00000  76001.00000  8.041248849714e-07
76001.00000  77001.00000  8.219943268596e-07
77001.00000  78001.00000  7.147776755301e-07
78001.00000  79001.00000  6.254304660889e-07
79001.00000  80001.00000  6.790387917536e-07
80001.00000  81001.00000  6.611693498654e-07
81001.00000  82001.00000  5.003443728711e-07
82001.00000  83001.00000  5.182138147593e-07
83001.00000  84001.00000  6.790387917536e-07
84001.00000  85001.00000  4.646054890946e-07
85001.00000  86001.00000  4.646054890946e-07
86001.00000  87001.00000  6.969082336419e-07
87001.00000  88001.00000  4.467360472063e-07
88001.00000  89001.00000  4.467360472063e-07
89001.00000  90001.00000  5.003443728711e-07
90001.00000  91001.00000  5.182138147593e-07
91001.00000  92001.00000  4.467360472063e-07
92001.00000  93001.00000  5.003443728711e-07
93001.00000  94001.00000  4.109971634298e-07
94001.00000  95001.00000  3.573888377651e-07
95001.00000  96001.00000  3.395193958768e-07
96001.00000  97001.00000  4.646054890946e-07
97001.00000  98001.00000  5.003443728711e-07
98001.00000  99001.00000  3.216499539886e-07
99001.00000  100001.00000  3.931277215416e-07
100001.00000  101001.00000  4.109971634298e-07
101001.00000  102001.00000  2.323027445473e-07
102001.00000  103001.00000  3.573888377651e-07
103001.00000  104001.00000  2.680416283238e-07
104001.00000  105001.00000  3.573888377651e-07
105001.00000  106001.00000  2.323027445473e-07
106001.00000  107001.00000  2.859110702120e-07
107001.00000  108001.00000  3.395193958768e-07
108001.00000  109001.00000  2.144333026590e-07
109001.00000  110001.00000  2.859110702120e-07
110001.00000  111001.00000  3.037805121003e-07
111001.00000  112001.00000  3.752582796533e-07
112001.00000  113001.00000  2.501721864355e-07
113001.00000  114001.00000  2.144333026590e-07
114001.00000  115001.00000  3.037805121003e-07
115001.00000  116001.00000  1.965638607708e-07
116001.00000  117001.00000  2.323027445473e-07
117001.00000  118001.00000  2.501721864355e-07
118001.00000  119001.00000  1.965638607708e-07
119001.00000  120001.00000  1.786944188825e-07
120001.00000  121001.00000  2.859110702120e-07
121001.00000  122001.00000  2.501721864355e-07
122001.00000  123001.00000  1.429555351060e-07
123001.00000  124001.00000  2.144333026590e-07
124001.00000  125001.00000  1.786944188825e-07
125001.00000  126001.00000  1.786944188825e-07
126001.00000  127001.00000  1.072166513295e-07
127001.00000  128001.00000  2.144333026590e-07
128001.00000  129001.00000  8.934720944126e-08
129001.00000  130001.00000  1.608249769943e-07
130001.00000  131001.00000  1.965638607708e-07
131001.00000  132001.00000  1.786944188825e-07
132001.00000  133001.00000  1.608249769943e-07
133001.00000  134001.00000  1.786944188825e-07
134001.00000  135001.00000  1.786944188825e-07
135001.00000  136001.00000  1.429555351060e-07
136001.00000  137001.00000  1.965638607708e-07
137001.00000  138001.00000  1.072166513295e-07
138001.00000  139001.00000  1.429555351060e-07
139001.00000  140001.00000  2.144333026590e-07
140001.00000  141001.00000  1.250860932178e-07
141001.00000  142001.00000  1.608249769943e-07
142001.00000  143001.00000  1.608249769943e-07
143001.00000  144001.00000  1.608249769943e-07
144001.00000  145001.00000  1.429555351060e-07
145001.00000  146001.00000  3.573888377651e-08
146001.00000  147001.00000  1.072166513295e-07
147001.00000  148001.00000  8.934720944126e-08
148001.00000  149001.00000  5.360832566476e-08
149001.00000  150001.00000  8.934720944126e-08
150001.00000  151001.00000  8.934720944126e-08
151001.00000  152001.00000  7.147776755301e-08
152001.00000  153001.00000  1.429555351060e-07
153001.00000  154001.00000  3.573888377651e-08
154001.00000  155001.00000  5.360832566476e-08
155001.00000  156001.00000  1.786944188825e-08
156001.00000  157001.00000  1.072166513295e-07
157001.00000  158001.00000  3.573888377651e-08
158001.00000  159001.00000  3.573888377651e-08
159001.00000  160001.00000  8.934720944126e-08
160001.00000  161001.00000  5.360832566476e-08
161001.00000  162001.00000  3.573888377651e-08
162001.00000  163001.00000  3.573888377651e-08
163001.00000  164001.00000  5.360832566476e-08
164001.00000  165001.00000  1.072166513295e-07
165001.00000  166001.00000  1.786944188825e-08
166001.00000  167001.00000  1.072166513295e-07
167001.00000  168001.00000  5.360832566476e-08
168001.00000  169001.00000  1.786944188825e-08
169001.00000  170001.00000  3.573888377651e-08
170001.00000  171001.00000  5.360832566476e-08
171001.00000  172001.00000  1.786944188825e-08
172001.00000  173001.00000  7.147776755301e-08
173001.00000  174001.00000  3.573888377651e-08
174001.00000  175001.00000  5.360832566476e-08
175001.00000  176001.00000  3.573888377651e-08
176001.00000  177001.00000  1.786944188825e-08
177001.00000  178001.00000  0.000000000000e+00
178001.00000  179001.00000  3.573888377651e-08
179001.00000  180001.00000  1.786944188825e-08
180001.00000  181001.00000  0.000000000000e+00
181001.00000  182001.00000  3.573888377651e-08
182001.00000  183001.00000  1.786944188825e-08
183001.00000  184001.00000  0.000000000000e+00
184001.00000  185001.00000  1.786944188825e-08
185001.00000  186001.00000  3.573888377651e-08
186001.00000  187001.00000  0.000000000000e+00
187001.00000  188001.00000  0.000000000000e+00
188001.00000  189001.00000  0.000000000000e+00
189001.00000  190001.00000  0.000000000000e+00
190001.00000  191001.00000  0.000000000000e+00
191001.00000  192001.00000  0.000000000000e+00
192001.00000  193001.00000  1.786944188825e-08
193001.00000  194001.00000  0.000000000000e+00
194001.00000  195001.00000  0.000000000000e+00
195001.00000  196001.00000  0.000000000000e+00
196001.00000  197001.00000  0.000000000000e+00
197001.00000  198001.00000  1.786944188825e-08
198001.00000  199001.00000  0.000000000000e+00
