300.00000  350.00000  1.268070126518e-04
350.00000  400.00000  1.797675885241e-04
400.00000  450.00000  1.178559294058e-04
450.00000  500.00000  1.014456101215e-04
500.00000  550.00000  5.564590084604e-04
550.00000  600.00000  7.384643677960e-05
600.00000  650.00000  1.872268245624e-04
650.00000  700.00000  7.981382561027e-05
700.00000  750.00000  1.103966933675e-04
750.00000  800.00000  7.533828398727e-05
800.00000  850.00000  2.588354905305e-04
850.00000  900.00000  6.713312434509e-05
900.00000  950.00000  6.414942992975e-05
950.00000  1000.00000  6.713312434509e-05
1000.00000  1050.00000  7.608420759110e-05
1050.00000  1100.00000  7.160866596809e-05
1100.00000  1150.00000  8.055974921411e-05
1150.00000  1200.00000  6.713312434509e-05
1200.00000  1250.00000  7.608420759110e-05
1250.00000  1300.00000  1.902105189777e-04
1300.00000  1350.00000  8.578121444095e-05
1350.00000  1400.00000  6.564127713742e-05
1400.00000  1450.00000  6.937089515659e-05
1450.00000  1500.00000  9.174860327162e-05
1500.00000  1550.00000  7.981382561027e-05
1550.00000  1600.00000  7.683013119493e-05
1600.00000  1650.00000  9.995376291380e-05
1650.00000  1700.00000  1.133803877828e-04
1700.00000  1750.00000  3.020990595529e-04
1750.00000  1800.00000  1.141263113866e-04
1800.00000  1850.00000  9.324045047929e-05
1850.00000  1900.00000  8.951083246012e-05
1900.00000  1950.00000  9.100267966779e-05
1950.00000  2000.00000  8.951083246012e-05
2000.00000  2050.00000  1.074129989521e-04
2050.00000  2100.00000  1.230773946327e-04
2100.00000  2150.00000  9.622414489463e-05
2150.00000  2200.00000  1.051752281406e-04
2200.00000  2250.00000  1.178559294058e-04
2250.00000  2300.00000  1.021915337253e-04
2300.00000  2350.00000  2.767376570225e-04
2350.00000  2400.00000  9.995376291380e-05
2400.00000  2450.00000  1.223314710288e-04
2450.00000  2500.00000  1.186018530097e-04
2500.00000  2550.00000  1.089048461598e-04
2550.00000  2600.00000  1.103966933675e-04
2600.00000  2650.00000  9.771599210229e-05
2650.00000  2700.00000  1.118885405751e-04
2700.00000  2750.00000  9.473229768696e-05
2750.00000  2800.00000  1.215855474250e-04
2800.00000  2850.00000  9.622414489463e-05
2850.00000  2900.00000  1.103966933675e-04
2900.00000  2950.00000  1.103966933675e-04
2950.00000  3000.00000  1.484387971630e-04
3000.00000  3050.00000  9.473229768696e-05
3050.00000  3100.00000  1.126344641790e-04
3100.00000  3150.00000  1.193477766135e-04
3150.00000  3200.00000  8.727306164861e-05
3200.00000  3250.00000  9.846191570613e-05
3250.00000  3300.00000  1.059211517445e-04
3300.00000  3350.00000  9.622414489463e-05
3350.00000  3400.00000  1.081589225560e-04
3400.00000  3450.00000  1.051752281406e-04
3450.00000  3500.00000  9.174860327162e-05
3500.00000  3550.00000  9.398637408312e-05
3550.00000  3600.00000  1.066670753483e-04
3600.00000  3650.00000  8.578121444095e-05
3650.00000  3700.00000  1.059211517445e-04
3700.00000  3750.00000  9.547822129079e-05
3750.00000  3800.00000  9.697006849846e-05
3800.00000  3850.00000  8.652713804478e-05
3850.00000  3900.00000  8.801898525245e-05
3900.00000  3950.00000  9.398637408312e-05
3950.00000  4000.00000  9.249452687545e-05
4000.00000  4050.00000  9.846191570613e-05
4050.00000  4100.00000  9.324045047929e-05
4100.00000  4150.00000  7.086274236426e-05
4150.00000  4200.00000  8.876490885628e-05
4200.00000  4250.00000  8.951083246012e-05
4250.00000  4300.00000  8.130567281794e-05
4300.00000  4350.00000  8.951083246012e-05
4350.00000  4400.00000  7.011681876043e-05
4400.00000  4450.00000  7.459236038343e-05
4450.00000  4500.00000  6.713312434509e-05
4500.00000  4550.00000  7.459236038343e-05
4550.00000  4600.00000  7.981382561027e-05
4600.00000  4650.00000  8.055974921411e-05
4650.00000  4700.00000  8.876490885628e-05
4700.00000  4750.00000  6.787904794892e-05
4750.00000  4800.00000  6.191165911825e-05
4800.00000  4850.00000  6.713312434509e-05
4850.00000  4900.00000  6.414942992975e-05
4900.00000  4950.00000  7.906790200644e-05
4950.00000  5000.00000  5.669019389141e-05
5000.00000  5050.00000  6.116573551441e-05
5050.00000  5100.00000  7.310051317576e-05
5100.00000  5150.00000  5.892796470291e-05
5150.00000  5200.00000  7.011681876043e-05
5200.00000  5250.00000  7.459236038343e-05
5250.00000  5300.00000  7.384643677960e-05
5300.00000  5350.00000  6.787904794892e-05
5350.00000  5400.00000  7.310051317576e-05
5400.00000  5450.00000  7.981382561027e-05
5450.00000  5500.00000  5.669019389141e-05
5500.00000  5550.00000  6.116573551441e-05
5550.00000  5600.00000  7.683013119493e-05
5600.00000  5650.00000  7.086274236426e-05
5650.00000  5700.00000  5.892796470291e-05
5700.00000  5750.00000  5.445242307990e-05
5750.00000  5800.00000  6.414942992975e-05
5800.00000  5850.00000  6.116573551441e-05
5850.00000  5900.00000  6.116573551441e-05
5900.00000  5950.00000  6.041981191058e-05
5950.00000  6000.00000  6.041981191058e-05
6000.00000  6050.00000  5.221465226840e-05
6050.00000  6100.00000  6.414942992975e-05
6100.00000  6150.00000  5.370649947607e-05
6150.00000  6200.00000  6.862497155276e-05
6200.00000  6250.00000  6.041981191058e-05
6250.00000  6300.00000  6.862497155276e-05
6300.00000  6350.00000  6.191165911825e-05
6350.00000  6400.00000  5.191628282687e-04
6400.00000  6450.00000  5.669019389141e-05
6450.00000  6500.00000  6.041981191058e-05
6500.00000  6550.00000  5.221465226840e-05
6550.00000  6600.00000  4.400949262622e-05
6600.00000  6650.00000  5.072280506073e-05
6650.00000  6700.00000  4.251764541856e-05
6700.00000  6750.00000  4.400949262622e-05
6750.00000  6800.00000  4.326356902239e-05
6800.00000  6850.00000  4.773911064540e-05
6850.00000  6900.00000  4.177172181472e-05
6900.00000  6950.00000  4.773911064540e-05
6950.00000  7000.00000  4.848503424923e-05
7000.00000  7050.00000  2.983694415337e-05
7050.00000  7100.00000  8.503529083711e-05
7100.00000  7150.00000  3.207471496488e-05
7150.00000  7200.00000  2.983694415337e-05
7200.00000  7250.00000  3.207471496488e-05
7250.00000  7300.00000  3.655025658788e-05
7300.00000  7350.00000  3.132879136104e-05
7350.00000  7400.00000  2.536140253037e-05
7400.00000  7450.00000  3.132879136104e-05
7450.00000  7500.00000  4.102579821089e-05
7500.00000  7550.00000  2.909102054954e-05
7550.00000  7600.00000  2.759917334187e-05
7600.00000  7650.00000  2.759917334187e-05
7650.00000  7700.00000  2.759917334187e-05
7700.00000  7750.00000  2.013993730353e-05
7750.00000  7800.00000  3.505840938021e-05
7800.00000  7850.00000  2.834509694570e-05
7850.00000  7900.00000  2.088586090736e-05
7900.00000  7950.00000  3.282063856871e-05
7950.00000  8000.00000  2.983694415337e-05
8000.00000  8050.00000  3.356656217254e-05
8050.00000  8100.00000  2.386955532270e-05
8100.00000  8150.00000  2.386955532270e-05
8150.00000  8200.00000  2.909102054954e-05
8200.00000  8250.00000  2.759917334187e-05
8250.00000  8300.00000  2.610732613420e-05
8300.00000  8350.00000  2.983694415337e-05
8350.00000  8400.00000  2.685324973804e-05
8400.00000  8450.00000  2.834509694570e-05
8450.00000  8500.00000  2.834509694570e-05
8500.00000  8550.00000  2.759917334187e-05
8550.00000  8600.00000  2.610732613420e-05
8600.00000  8650.00000  2.163178451119e-05
8650.00000  8700.00000  2.312363171886e-05
8700.00000  8750.00000  1.342662486902e-05
8750.00000  8800.00000  2.834509694570e-05
8800.00000  8850.00000  1.715624288819e-05
8850.00000  8900.00000  2.386955532270e-05
8900.00000  8950.00000  2.536140253037e-05
8950.00000  9000.00000  2.088586090736e-05
9000.00000  9050.00000  2.759917334187e-05
9050.00000  9100.00000  2.536140253037e-05
9100.00000  9150.00000  1.864809009586e-05
9150.00000  9200.00000  2.386955532270e-05
9200.00000  9250.00000  1.641031928435e-05
9250.00000  9300.00000  2.610732613420e-05
9300.00000  9350.00000  3.058286775721e-05
9350.00000  9400.00000  2.461547892653e-05
9400.00000  9450.00000  1.939401369969e-05
9450.00000  9500.00000  2.536140253037e-05
9500.00000  9550.00000  2.237770811503e-05
9550.00000  9600.00000  1.193477766135e-05
9600.00000  9650.00000  2.163178451119e-05
9650.00000  9700.00000  2.237770811503e-05
9700.00000  9750.00000  2.610732613420e-05
9750.00000  9800.00000  1.790216649202e-05
9800.00000  9850.00000  2.386955532270e-05
9850.00000  9900.00000  1.491847207669e-05
9900.00000  9950.00000  1.491847207669e-05
9950.00000  10000.00000  1.715624288819e-05
