10001.00000  11001.00000  1.588966169739e-05
11001.00000  12001.00000  1.459254645679e-05
12001.00000  13001.00000  1.300718338494e-05
13001.00000  14001.00000  1.120563443966e-05
14001.00000  15001.00000  1.026882898811e-05
15001.00000  16001.00000  9.728364304526e-06
16001.00000  17001.00000  8.395218085017e-06
17001.00000  18001.00000  7.134133823319e-06
18001.00000  19001.00000  6.467560713564e-06
19001.00000  20001.00000  5.458693304206e-06
20001.00000  21001.00000  5.188460962414e-06
21001.00000  22001.00000  4.359748447584e-06
22001.00000  23001.00000  4.269671000320e-06
23001.00000  24001.00000  4.107531595244e-06
24001.00000  25001.00000  3.531035932754e-06
25001.00000  26001.00000  3.206757122603e-06
26001.00000  27001.00000  3.440958485490e-06
27001.00000  28001.00000  2.972555759716e-06
28001.00000  29001.00000  2.396060097226e-06
29001.00000  30001.00000  2.540184012848e-06
30001.00000  31001.00000  1.999719329264e-06
31001.00000  32001.00000  1.783533455830e-06
32001.00000  33001.00000  2.053765797622e-06
33001.00000  34001.00000  1.837579924188e-06
34001.00000  35001.00000  1.747502476924e-06
35001.00000  36001.00000  1.783533455830e-06
36001.00000  37001.00000  1.459254645679e-06
37001.00000  38001.00000  1.315130730056e-06
38001.00000  39001.00000  1.693456008566e-06
39001.00000  40001.00000  1.333146219509e-06
40001.00000  41001.00000  1.207037793339e-06
41001.00000  42001.00000  1.008867409358e-06
42001.00000  43001.00000  9.908519199054e-07
43001.00000  44001.00000  9.187899620941e-07
44001.00000  45001.00000  8.647434937356e-07
45001.00000  46001.00000  8.467280042828e-07
46001.00000  47001.00000  9.187899620941e-07
47001.00000  48001.00000  6.665731097545e-07
48001.00000  49001.00000  8.647434937356e-07
49001.00000  50001.00000  1.044898388264e-06
50001.00000  51001.00000  6.845885992074e-07
51001.00000  52001.00000  7.206195781130e-07
52001.00000  53001.00000  6.665731097545e-07
53001.00000  54001.00000  5.945111519432e-07
54001.00000  55001.00000  6.125266413961e-07
55001.00000  56001.00000  8.647434937356e-07
56001.00000  57001.00000  4.864182152263e-07
57001.00000  58001.00000  4.323717468678e-07
58001.00000  59001.00000  4.864182152263e-07
59001.00000  60001.00000  5.764956624904e-07
60001.00000  61001.00000  3.242788101509e-07
61001.00000  62001.00000  5.044337046791e-07
62001.00000  63001.00000  3.963407679622e-07
63001.00000  64001.00000  4.503872363206e-07
64001.00000  65001.00000  1.981703839811e-07
65001.00000  66001.00000  4.503872363206e-07
66001.00000  67001.00000  2.882478312452e-07
67001.00000  68001.00000  3.422942996037e-07
68001.00000  69001.00000  3.242788101509e-07
69001.00000  70001.00000  2.702323417924e-07
70001.00000  71001.00000  3.062633206980e-07
71001.00000  72001.00000  2.522168523396e-07
72001.00000  73001.00000  2.702323417924e-07
73001.00000  74001.00000  2.702323417924e-07
74001.00000  75001.00000  3.062633206980e-07
75001.00000  76001.00000  2.522168523396e-07
76001.00000  77001.00000  2.522168523396e-07
77001.00000  78001.00000  3.062633206980e-07
78001.00000  79001.00000  2.882478312452e-07
79001.00000  80001.00000  1.621394050754e-07
80001.00000  81001.00000  1.261084261698e-07
81001.00000  82001.00000  2.522168523396e-07
82001.00000  83001.00000  2.161858734339e-07
83001.00000  84001.00000  1.981703839811e-07
84001.00000  85001.00000  2.161858734339e-07
85001.00000  86001.00000  1.621394050754e-07
86001.00000  87001.00000  1.261084261698e-07
87001.00000  88001.00000  1.261084261698e-07
88001.00000  89001.00000  1.441239156226e-07
89001.00000  90001.00000  1.261084261698e-07
90001.00000  91001.00000  1.441239156226e-07
91001.00000  92001.00000  1.441239156226e-07
92001.00000  93001.00000  9.007744726413e-08
93001.00000  94001.00000  9.007744726413e-08
94001.00000  95001.00000  1.261084261698e-07
95001.00000  96001.00000  1.441239156226e-07
96001.00000  97001.00000  1.621394050754e-07
97001.00000  98001.00000  1.080929367170e-07
98001.00000  99001.00000  5.404646835848e-08
99001.00000  100001.00000  9.007744726413e-08
100001.00000  101001.00000  1.261084261698e-07
101001.00000  102001.00000  1.801548945283e-07
102001.00000  103001.00000  1.080929367170e-07
103001.00000  104001.00000  1.261084261698e-07
104001.00000  105001.00000  7.206195781130e-08
105001.00000  106001.00000  9.007744726413e-08
106001.00000  107001.00000  3.603097890565e-08
107001.00000  108001.00000  7.206195781130e-08
108001.00000  109001.00000  7.206195781130e-08
109001.00000  110001.00000  7.206195781130e-08
110001.00000  111001.00000  1.080929367170e-07
111001.00000  112001.00000  3.603097890565e-08
112001.00000  113001.00000  1.261084261698e-07
113001.00000  114001.00000  3.603097890565e-08
114001.00000  115001.00000  1.261084261698e-07
115001.00000  116001.00000  9.007744726413e-08
116001.00000  117001.00000  5.404646835848e-08
117001.00000  118001.00000  5.404646835848e-08
118001.00000  119001.00000  7.206195781130e-08
119001.00000  120001.00000  1.801548945283e-08
120001.00000  121001.00000  3.603097890565e-08
121001.00000  122001.00000  1.801548945283e-08
122001.00000  123001.00000  5.404646835848e-08
123001.00000  124001.00000  1.801548945283e-08
124001.00000  125001.00000  0.000000000000e+00
125001.00000  126001.00000  5.404646835848e-08
126001.00000  127001.00000  7.206195781130e-08
127001.00000  128001.00000  1.801548945283e-08
128001.00000  129001.00000  0.000000000000e+00
129001.00000  130001.00000  1.801548945283e-08
130001.00000  131001.00000  0.000000000000e+00
131001.00000  132001.00000  1.801548945283e-08
132001.00000  133001.00000  5.404646835848e-08
133001.00000  134001.00000  0.000000000000e+00
134001.00000  135001.00000  9.007744726413e-08
135001.00000  136001.00000  3.603097890565e-08
136001.00000  137001.00000  1.801548945283e-08
137001.00000  138001.00000  0.000000000000e+00
138001.00000  139001.00000  1.801548945283e-08
139001.00000  140001.00000  0.000000000000e+00
140001.00000  141001.00000  1.801548945283e-08
141001.00000  142001.00000  0.000000000000e+00
142001.00000  143001.00000  1.801548945283e-08
143001.00000  144001.00000  0.000000000000e+00
144001.00000  145001.00000  3.603097890565e-08
145001.00000  146001.00000  3.603097890565e-08
146001.00000  147001.00000  3.603097890565e-08
147001.00000  148001.00000  1.801548945283e-08
148001.00000  149001.00000  5.404646835848e-08
149001.00000  150001.00000  1.801548945283e-08
150001.00000  151001.00000  3.603097890565e-08
151001.00000  152001.00000  1.801548945283e-08
152001.00000  153001.00000  1.801548945283e-08
153001.00000  154001.00000  0.000000000000e+00
154001.00000  155001.00000  0.000000000000e+00
155001.00000  156001.00000  3.603097890565e-08
156001.00000  157001.00000  1.801548945283e-08
157001.00000  158001.00000  0.000000000000e+00
158001.00000  159001.00000  3.603097890565e-08
159001.00000  160001.00000  1.801548945283e-08
160001.00000  161001.00000  0.000000000000e+00
161001.00000  162001.00000  3.603097890565e-08
162001.00000  163001.00000  5.404646835848e-08
163001.00000  164001.00000  1.801548945283e-08
164001.00000  165001.00000  0.000000000000e+00
165001.00000  166001.00000  0.000000000000e+00
166001.00000  167001.00000  1.801548945283e-08
167001.00000  168001.00000  0.000000000000e+00
168001.00000  169001.00000  1.801548945283e-08
169001.00000  170001.00000  0.000000000000e+00
170001.00000  171001.00000  0.000000000000e+00
171001.00000  172001.00000  0.000000000000e+00
172001.00000  173001.00000  0.000000000000e+00
173001.00000  174001.00000  0.000000000000e+00
174001.00000  175001.00000  0.000000000000e+00
175001.00000  176001.00000  1.801548945283e-08
176001.00000  177001.00000  0.000000000000e+00
177001.00000  178001.00000  1.801548945283e-08
178001.00000  179001.00000  3.603097890565e-08
179001.00000  180001.00000  0.000000000000e+00
180001.00000  181001.00000  1.801548945283e-08
181001.00000  182001.00000  1.801548945283e-08
182001.00000  183001.00000  0.000000000000e+00
183001.00000  184001.00000  0.000000000000e+00
184001.00000  185001.00000  0.000000000000e+00
185001.00000  186001.00000  1.801548945283e-08
186001.00000  187001.00000  0.000000000000e+00
187001.00000  188001.00000  0.000000000000e+00
188001.00000  189001.00000  0.000000000000e+00
189001.00000  190001.00000  0.000000000000e+00
190001.00000  191001.00000  0.000000000000e+00
191001.00000  192001.00000  0.000000000000e+00
192001.00000  193001.00000  0.000000000000e+00
193001.00000  194001.00000  0.000000000000e+00
194001.00000  195001.00000  0.000000000000e+00
195001.00000  196001.00000  0.000000000000e+00
196001.00000  197001.00000  0.000000000000e+00
197001.00000  198001.00000  0.000000000000e+00
198001.00000  199001.00000  0.000000000000e+00
