10001.00000  11001.00000  4.426540764474e-05
11001.00000  12001.00000  3.935951221203e-05
12001.00000  13001.00000  3.186959552087e-05
13001.00000  14001.00000  2.861148176022e-05
14001.00000  15001.00000  2.273189715766e-05
15001.00000  16001.00000  1.992317839848e-05
16001.00000  17001.00000  1.831284630988e-05
17001.00000  18001.00000  1.621566963636e-05
18001.00000  19001.00000  1.561647630106e-05
19001.00000  20001.00000  1.359419879445e-05
20001.00000  21001.00000  1.198386670585e-05
21001.00000  22001.00000  1.089782878563e-05
22001.00000  23001.00000  1.003648836615e-05
23001.00000  24001.00000  8.575954611375e-06
24001.00000  25001.00000  7.752063775348e-06
25001.00000  26001.00000  7.003072106232e-06
26001.00000  27001.00000  7.227769606967e-06
27001.00000  28001.00000  6.066832519837e-06
28001.00000  29001.00000  5.804685435647e-06
29001.00000  30001.00000  5.242941683810e-06
30001.00000  31001.00000  5.018244183075e-06
31001.00000  32001.00000  4.156903763592e-06
32001.00000  33001.00000  4.344151680871e-06
33001.00000  34001.00000  2.546571674993e-06
34001.00000  35001.00000  3.070865843375e-06
35001.00000  36001.00000  2.995966676463e-06
36001.00000  37001.00000  3.033416259919e-06
37001.00000  38001.00000  2.546571674993e-06
38001.00000  39001.00000  2.134626256980e-06
39001.00000  40001.00000  2.733819592272e-06
40001.00000  41001.00000  2.696370008817e-06
41001.00000  42001.00000  2.284424590803e-06
42001.00000  43001.00000  2.022277506612e-06
43001.00000  44001.00000  1.647781672055e-06
44001.00000  45001.00000  1.722680838966e-06
45001.00000  46001.00000  1.273285837497e-06
46001.00000  47001.00000  1.385634587864e-06
47001.00000  48001.00000  1.310735420953e-06
48001.00000  49001.00000  9.362395863947e-07
49001.00000  50001.00000  1.273285837497e-06
50001.00000  51001.00000  1.647781672055e-06
51001.00000  52001.00000  1.198386670585e-06
52001.00000  53001.00000  1.160937087129e-06
53001.00000  54001.00000  1.086037920218e-06
54001.00000  55001.00000  1.011138753306e-06
55001.00000  56001.00000  9.362395863947e-07
56001.00000  57001.00000  1.011138753306e-06
57001.00000  58001.00000  1.235836254041e-06
58001.00000  59001.00000  7.115420856599e-07
59001.00000  60001.00000  4.868445849252e-07
60001.00000  61001.00000  8.987900029389e-07
61001.00000  62001.00000  6.740925022042e-07
62001.00000  63001.00000  8.238908360273e-07
63001.00000  64001.00000  6.366429187484e-07
64001.00000  65001.00000  8.238908360273e-07
65001.00000  66001.00000  9.362395863947e-07
66001.00000  67001.00000  4.868445849252e-07
67001.00000  68001.00000  6.740925022042e-07
68001.00000  69001.00000  4.493950014694e-07
69001.00000  70001.00000  3.744958345579e-07
70001.00000  71001.00000  5.242941683810e-07
71001.00000  72001.00000  4.119454180137e-07
72001.00000  73001.00000  5.617437518368e-07
73001.00000  74001.00000  2.621470841905e-07
74001.00000  75001.00000  3.744958345579e-07
75001.00000  76001.00000  1.497983338231e-07
76001.00000  77001.00000  2.995966676463e-07
77001.00000  78001.00000  3.370462511021e-07
78001.00000  79001.00000  2.621470841905e-07
79001.00000  80001.00000  3.744958345579e-07
80001.00000  81001.00000  3.744958345579e-07
81001.00000  82001.00000  1.872479172789e-07
82001.00000  83001.00000  1.872479172789e-07
83001.00000  84001.00000  4.119454180137e-07
84001.00000  85001.00000  2.621470841905e-07
85001.00000  86001.00000  1.123487503674e-07
86001.00000  87001.00000  2.621470841905e-07
87001.00000  88001.00000  2.246975007347e-07
88001.00000  89001.00000  1.123487503674e-07
89001.00000  90001.00000  3.370462511021e-07
90001.00000  91001.00000  2.621470841905e-07
91001.00000  92001.00000  1.497983338231e-07
92001.00000  93001.00000  1.123487503674e-07
93001.00000  94001.00000  7.489916691157e-08
94001.00000  95001.00000  1.497983338231e-07
95001.00000  96001.00000  1.872479172789e-07
96001.00000  97001.00000  2.995966676463e-07
97001.00000  98001.00000  1.123487503674e-07
98001.00000  99001.00000  1.872479172789e-07
99001.00000  100001.00000  1.872479172789e-07
100001.00000  101001.00000  7.489916691157e-08
101001.00000  102001.00000  7.489916691157e-08
102001.00000  103001.00000  1.497983338231e-07
103001.00000  104001.00000  0.000000000000e+00
104001.00000  105001.00000  1.123487503674e-07
105001.00000  106001.00000  2.621470841905e-07
106001.00000  107001.00000  1.123487503674e-07
107001.00000  108001.00000  7.489916691157e-08
108001.00000  109001.00000  3.744958345579e-08
109001.00000  110001.00000  7.489916691157e-08
110001.00000  111001.00000  7.489916691157e-08
111001.00000  112001.00000  1.872479172789e-07
112001.00000  113001.00000  7.489916691157e-08
113001.00000  114001.00000  3.744958345579e-08
114001.00000  115001.00000  1.497983338231e-07
115001.00000  116001.00000  7.489916691157e-08
116001.00000  117001.00000  0.000000000000e+00
117001.00000  118001.00000  1.872479172789e-07
118001.00000  119001.00000  1.123487503674e-07
119001.00000  120001.00000  2.246975007347e-07
120001.00000  121001.00000  7.489916691157e-08
121001.00000  122001.00000  3.744958345579e-08
122001.00000  123001.00000  1.497983338231e-07
123001.00000  124001.00000  7.489916691157e-08
124001.00000  125001.00000  3.744958345579e-08
125001.00000  126001.00000  1.123487503674e-07
126001.00000  127001.00000  7.489916691157e-08
127001.00000  128001.00000  3.744958345579e-08
128001.00000  129001.00000  7.489916691157e-08
129001.00000  130001.00000  7.489916691157e-08
130001.00000  131001.00000  3.744958345579e-08
131001.00000  132001.00000  7.489916691157e-08
132001.00000  133001.00000  1.497983338231e-07
133001.00000  134001.00000  3.744958345579e-08
134001.00000  135001.00000  7.489916691157e-08
135001.00000  136001.00000  7.489916691157e-08
136001.00000  137001.00000  3.744958345579e-08
137001.00000  138001.00000  3.744958345579e-08
138001.00000  139001.00000  3.744958345579e-08
139001.00000  140001.00000  1.123487503674e-07
140001.00000  141001.00000  0.000000000000e+00
141001.00000  142001.00000  7.489916691157e-08
142001.00000  143001.00000  1.497983338231e-07
143001.00000  144001.00000  0.000000000000e+00
144001.00000  145001.00000  7.489916691157e-08
145001.00000  146001.00000  0.000000000000e+00
146001.00000  147001.00000  1.123487503674e-07
147001.00000  148001.00000  0.000000000000e+00
148001.00000  149001.00000  1.872479172789e-07
149001.00000  150001.00000  1.123487503674e-07
150001.00000  151001.00000  7.489916691157e-08
151001.00000  152001.00000  3.744958345579e-08
152001.00000  153001.00000  3.744958345579e-08
153001.00000  154001.00000  3.744958345579e-08
154001.00000  155001.00000  3.744958345579e-08
155001.00000  156001.00000  0.000000000000e+00
156001.00000  157001.00000  3.744958345579e-08
157001.00000  158001.00000  0.000000000000e+00
158001.00000  159001.00000  0.000000000000e+00
159001.00000  160001.00000  7.489916691157e-08
160001.00000  161001.00000  0.000000000000e+00
161001.00000  162001.00000  0.000000000000e+00
162001.00000  163001.00000  0.000000000000e+00
163001.00000  164001.00000  0.000000000000e+00
164001.00000  165001.00000  3.744958345579e-08
165001.00000  166001.00000  3.744958345579e-08
166001.00000  167001.00000  7.489916691157e-08
167001.00000  168001.00000  3.744958345579e-08
168001.00000  169001.00000  3.744958345579e-08
169001.00000  170001.00000  7.489916691157e-08
170001.00000  171001.00000  3.744958345579e-08
171001.00000  172001.00000  0.000000000000e+00
172001.00000  173001.00000  7.489916691157e-08
173001.00000  174001.00000  3.744958345579e-08
174001.00000  175001.00000  0.000000000000e+00
175001.00000  176001.00000  0.000000000000e+00
176001.00000  177001.00000  0.000000000000e+00
177001.00000  178001.00000  3.744958345579e-08
178001.00000  179001.00000  3.744958345579e-08
179001.00000  180001.00000  0.000000000000e+00
180001.00000  181001.00000  3.744958345579e-08
181001.00000  182001.00000  0.000000000000e+00
182001.00000  183001.00000  0.000000000000e+00
183001.00000  184001.00000  0.000000000000e+00
184001.00000  185001.00000  3.744958345579e-08
185001.00000  186001.00000  0.000000000000e+00
186001.00000  187001.00000  3.744958345579e-08
187001.00000  188001.00000  0.000000000000e+00
188001.00000  189001.00000  3.744958345579e-08
189001.00000  190001.00000  0.000000000000e+00
190001.00000  191001.00000  0.000000000000e+00
191001.00000  192001.00000  7.489916691157e-08
192001.00000  193001.00000  3.744958345579e-08
193001.00000  194001.00000  3.744958345579e-08
194001.00000  195001.00000  0.000000000000e+00
195001.00000  196001.00000  0.000000000000e+00
196001.00000  197001.00000  0.000000000000e+00
197001.00000  198001.00000  0.000000000000e+00
198001.00000  199001.00000  0.000000000000e+00
