10001.00000  11001.00000  4.296448147967e-04
11001.00000  12001.00000  3.798163229513e-04
12001.00000  13001.00000  3.350152392061e-04
13001.00000  14001.00000  2.995037207174e-04
14001.00000  15001.00000  2.677506499030e-04
15001.00000  16001.00000  2.403081698489e-04
16001.00000  17001.00000  2.188230230928e-04
17001.00000  18001.00000  1.991589798490e-04
18001.00000  19001.00000  1.810932455387e-04
19001.00000  20001.00000  1.673381019889e-04
20001.00000  21001.00000  1.534667177893e-04
21001.00000  22001.00000  1.417942192135e-04
22001.00000  23001.00000  1.290368079070e-04
23001.00000  24001.00000  1.190982323562e-04
24001.00000  25001.00000  1.126468762969e-04
25001.00000  26001.00000  1.058080514052e-04
26001.00000  27001.00000  9.862050456432e-05
27001.00000  28001.00000  9.175261951019e-05
28001.00000  29001.00000  8.546593770464e-05
29001.00000  30001.00000  8.160093610154e-05
30001.00000  31001.00000  7.527550741276e-05
31001.00000  32001.00000  7.272789983979e-05
32001.00000  33001.00000  6.775861206437e-05
33001.00000  34001.00000  6.470729500930e-05
34001.00000  35001.00000  5.989299476684e-05
35001.00000  36001.00000  5.753912161006e-05
36001.00000  37001.00000  5.577613842268e-05
37001.00000  38001.00000  5.235672597683e-05
38001.00000  39001.00000  4.983817856629e-05
39001.00000  40001.00000  4.773616015057e-05
40001.00000  41001.00000  4.414238673014e-05
41001.00000  42001.00000  4.328026857807e-05
42001.00000  43001.00000  4.095545558373e-05
43001.00000  44001.00000  3.851440193966e-05
44001.00000  45001.00000  3.716794774711e-05
45001.00000  46001.00000  3.635426319908e-05
46001.00000  47001.00000  3.424255806255e-05
47001.00000  48001.00000  3.256675536246e-05
48001.00000  49001.00000  3.274111633704e-05
49001.00000  50001.00000  3.027100253055e-05
50001.00000  51001.00000  2.979635321087e-05
51001.00000  52001.00000  2.835303181021e-05
52001.00000  53001.00000  2.706469794251e-05
53001.00000  54001.00000  2.649318141473e-05
54001.00000  55001.00000  2.501111313084e-05
55001.00000  56001.00000  2.443959660306e-05
56001.00000  57001.00000  2.347092452208e-05
57001.00000  58001.00000  2.244413211625e-05
58001.00000  59001.00000  2.161107412661e-05
59001.00000  60001.00000  2.077801613697e-05
60001.00000  61001.00000  1.993527142652e-05
61001.00000  62001.00000  2.044866762943e-05
62001.00000  63001.00000  1.903440639121e-05
63001.00000  64001.00000  1.786231317322e-05
64001.00000  65001.00000  1.846288986343e-05
65001.00000  66001.00000  1.742641073678e-05
66001.00000  67001.00000  1.724236304140e-05
67001.00000  68001.00000  1.550844001645e-05
68001.00000  69001.00000  1.561499394536e-05
69001.00000  70001.00000  1.516940478811e-05
70001.00000  71001.00000  1.413292566146e-05
71001.00000  72001.00000  1.447196088980e-05
72001.00000  73001.00000  1.384232403717e-05
73001.00000  74001.00000  1.325143406777e-05
74001.00000  75001.00000  1.299957932672e-05
75001.00000  76001.00000  1.172093217983e-05
76001.00000  77001.00000  1.248618312380e-05
77001.00000  78001.00000  1.155625792606e-05
78001.00000  79001.00000  1.153688448444e-05
79001.00000  80001.00000  1.092662107343e-05
80001.00000  81001.00000  1.064570616994e-05
81001.00000  82001.00000  1.052946552023e-05
82001.00000  83001.00000  9.957948992448e-06
83001.00000  84001.00000  1.068445305318e-05
84001.00000  85001.00000  9.967635713258e-06
85001.00000  86001.00000  9.231444931715e-06
86001.00000  87001.00000  9.909515388400e-06
87001.00000  88001.00000  9.095830840378e-06
88001.00000  89001.00000  8.320893175596e-06
89001.00000  90001.00000  8.863349540944e-06
90001.00000  91001.00000  9.047397236330e-06
91001.00000  92001.00000  8.069038434542e-06
92001.00000  93001.00000  7.487835185956e-06
93001.00000  94001.00000  7.439401581907e-06
94001.00000  95001.00000  7.468461744336e-06
95001.00000  96001.00000  7.177860120043e-06
96001.00000  97001.00000  7.478148465146e-06
97001.00000  98001.00000  6.674150637935e-06
98001.00000  99001.00000  6.867885054130e-06
99001.00000  100001.00000  6.431982617690e-06
100001.00000  101001.00000  6.344802130402e-06
101001.00000  102001.00000  6.015453622870e-06
102001.00000  103001.00000  6.354488851212e-06
103001.00000  104001.00000  6.276995084734e-06
104001.00000  105001.00000  5.482683978332e-06
105001.00000  106001.00000  6.102634110158e-06
106001.00000  107001.00000  5.802345765055e-06
107001.00000  108001.00000  5.288949562137e-06
108001.00000  109001.00000  5.221142516469e-06
109001.00000  110001.00000  5.666731673718e-06
110001.00000  111001.00000  5.095215145941e-06
111001.00000  112001.00000  4.920854171366e-06
112001.00000  113001.00000  4.920854171366e-06
113001.00000  114001.00000  5.037094821083e-06
114001.00000  115001.00000  5.017721379463e-06
115001.00000  116001.00000  4.475265014116e-06
116001.00000  117001.00000  4.368711085208e-06
117001.00000  118001.00000  4.668999430311e-06
118001.00000  119001.00000  4.475265014116e-06
119001.00000  120001.00000  4.494638455735e-06
120001.00000  121001.00000  4.368711085208e-06
121001.00000  122001.00000  4.068422740105e-06
122001.00000  123001.00000  4.233096993872e-06
123001.00000  124001.00000  3.865001603100e-06
124001.00000  125001.00000  3.758447674193e-06
125001.00000  126001.00000  3.942495369578e-06
126001.00000  127001.00000  3.826254719861e-06
127001.00000  128001.00000  3.380665562611e-06
128001.00000  129001.00000  3.148184263177e-06
129001.00000  130001.00000  3.157870983987e-06
130001.00000  131001.00000  3.109437379938e-06
131001.00000  132001.00000  3.380665562611e-06
132001.00000  133001.00000  3.109437379938e-06
133001.00000  134001.00000  3.196617867226e-06
134001.00000  135001.00000  2.702595105927e-06
135001.00000  136001.00000  3.090063938318e-06
136001.00000  137001.00000  2.993196730220e-06
137001.00000  138001.00000  3.293485075323e-06
138001.00000  139001.00000  2.751028709976e-06
139001.00000  140001.00000  2.954449846981e-06
140001.00000  141001.00000  2.857582638884e-06
141001.00000  142001.00000  2.557294293781e-06
142001.00000  143001.00000  2.557294293781e-06
143001.00000  144001.00000  2.382933319205e-06
144001.00000  145001.00000  2.702595105927e-06
145001.00000  146001.00000  2.751028709976e-06
146001.00000  147001.00000  2.373246598395e-06
147001.00000  148001.00000  2.625101339449e-06
148001.00000  149001.00000  2.411993481634e-06
149001.00000  150001.00000  2.218259065438e-06
150001.00000  151001.00000  2.189198903009e-06
151001.00000  152001.00000  2.218259065438e-06
152001.00000  153001.00000  2.131078578150e-06
153001.00000  154001.00000  2.063271532482e-06
154001.00000  155001.00000  2.140765298960e-06
155001.00000  156001.00000  1.801730070618e-06
156001.00000  157001.00000  1.995464486814e-06
157001.00000  158001.00000  1.937344161955e-06
158001.00000  159001.00000  1.772669908189e-06
159001.00000  160001.00000  1.985777766004e-06
160001.00000  161001.00000  1.898597278716e-06
161001.00000  162001.00000  1.976091045194e-06
162001.00000  163001.00000  1.762983187379e-06
163001.00000  164001.00000  1.733923024950e-06
164001.00000  165001.00000  1.840476953857e-06
165001.00000  166001.00000  1.607995654423e-06
166001.00000  167001.00000  1.617682375232e-06
167001.00000  168001.00000  1.627369096042e-06
168001.00000  169001.00000  1.637055816852e-06
169001.00000  170001.00000  1.617682375232e-06
170001.00000  171001.00000  1.559562050374e-06
171001.00000  172001.00000  1.520815167135e-06
172001.00000  173001.00000  1.675802700091e-06
173001.00000  174001.00000  1.453008121466e-06
174001.00000  175001.00000  1.549875329564e-06
175001.00000  176001.00000  1.540188608754e-06
176001.00000  177001.00000  1.336767471749e-06
177001.00000  178001.00000  1.394887796608e-06
178001.00000  179001.00000  1.482068283896e-06
179001.00000  180001.00000  1.201153380412e-06
180001.00000  181001.00000  1.123659613934e-06
181001.00000  182001.00000  1.278647146890e-06
182001.00000  183001.00000  1.346454192559e-06
183001.00000  184001.00000  1.133346334744e-06
184001.00000  185001.00000  1.230213542841e-06
185001.00000  186001.00000  1.152719776363e-06
186001.00000  187001.00000  1.220526822032e-06
187001.00000  188001.00000  1.133346334744e-06
188001.00000  189001.00000  9.977322434068e-07
189001.00000  190001.00000  9.299251977384e-07
190001.00000  191001.00000  1.113972893124e-06
191001.00000  192001.00000  1.046165847456e-06
192001.00000  193001.00000  1.084912730695e-06
193001.00000  194001.00000  1.084912730695e-06
194001.00000  195001.00000  9.880455225970e-07
195001.00000  196001.00000  9.880455225970e-07
196001.00000  197001.00000  9.105517561188e-07
197001.00000  198001.00000  1.104286172314e-06
198001.00000  199001.00000  8.814915936895e-07
