300.00000  350.00000  6.420057415964e-02
350.00000  400.00000  4.817795747736e-02
400.00000  450.00000  3.738742928788e-02
450.00000  500.00000  2.978640650336e-02
500.00000  550.00000  2.444962569958e-02
550.00000  600.00000  2.043882716545e-02
600.00000  650.00000  1.732080133834e-02
650.00000  700.00000  1.473490125733e-02
700.00000  750.00000  1.278870729716e-02
750.00000  800.00000  1.117391865241e-02
800.00000  850.00000  1.003096742298e-02
850.00000  900.00000  8.856247492279e-03
900.00000  950.00000  7.872861785081e-03
950.00000  1000.00000  7.034962289338e-03
1000.00000  1050.00000  6.357350331772e-03
1050.00000  1100.00000  5.803564107528e-03
1100.00000  1150.00000  5.330282660341e-03
1150.00000  1200.00000  4.851947101591e-03
1200.00000  1250.00000  4.524151865858e-03
1250.00000  1300.00000  4.155201721675e-03
1300.00000  1350.00000  3.761703035608e-03
1350.00000  1400.00000  3.512607537089e-03
1400.00000  1450.00000  3.272176229823e-03
1450.00000  1500.00000  3.084452086011e-03
1500.00000  1550.00000  2.881204599538e-03
1550.00000  1600.00000  2.665321834155e-03
1600.00000  1650.00000  2.512976471293e-03
1650.00000  1700.00000  2.336082566547e-03
1700.00000  1750.00000  2.238249406984e-03
1750.00000  1800.00000  2.151968502424e-03
1800.00000  1850.00000  1.991319956278e-03
1850.00000  1900.00000  1.955580167360e-03
1900.00000  1950.00000  1.857385999828e-03
1950.00000  2000.00000  1.709011724623e-03
2000.00000  2050.00000  1.611539573028e-03
2050.00000  2100.00000  1.525258668469e-03
2100.00000  2150.00000  1.486991823769e-03
2150.00000  2200.00000  1.409014102493e-03
2200.00000  2250.00000  1.351974843412e-03
2250.00000  2300.00000  1.283744337296e-03
2300.00000  2350.00000  1.246199508534e-03
2350.00000  2400.00000  1.186994201639e-03
2400.00000  2450.00000  1.154142476472e-03
2450.00000  2500.00000  1.105767408644e-03
2500.00000  2550.00000  1.079774834885e-03
2550.00000  2600.00000  1.025984647524e-03
2600.00000  2650.00000  9.974650179833e-04
2650.00000  2700.00000  8.978268185756e-04
2700.00000  2750.00000  9.267074560851e-04
2750.00000  2800.00000  8.689461810662e-04
2800.00000  2850.00000  8.288742965218e-04
2850.00000  2900.00000  8.332063921482e-04
2900.00000  2950.00000  7.837483004132e-04
2950.00000  3000.00000  7.523406071217e-04
3000.00000  3050.00000  7.332071847717e-04
3050.00000  3100.00000  7.061315871065e-04
3100.00000  3150.00000  6.967453799160e-04
3150.00000  3200.00000  6.700307902197e-04
3200.00000  3250.00000  6.379010809904e-04
3250.00000  3300.00000  6.212947144225e-04
3300.00000  3350.00000  5.974681884772e-04
3350.00000  3400.00000  5.693095669054e-04
3400.00000  3450.00000  5.996342362904e-04
3450.00000  3500.00000  5.433169931469e-04
3500.00000  3550.00000  5.093822440733e-04
3550.00000  3600.00000  5.129923237620e-04
3600.00000  3650.00000  5.245445787657e-04
3650.00000  3700.00000  5.072161962601e-04
3700.00000  3750.00000  4.888047898478e-04
3750.00000  3800.00000  4.635342320270e-04
3800.00000  3850.00000  4.458448415524e-04
3850.00000  3900.00000  4.317655307666e-04
3900.00000  3950.00000  4.444008096770e-04
3950.00000  4000.00000  4.263504112335e-04
4000.00000  4050.00000  4.101050526345e-04
4050.00000  4100.00000  3.996358215373e-04
4100.00000  4150.00000  4.039679171637e-04
4150.00000  4200.00000  3.685891362146e-04
4200.00000  4250.00000  3.653400644948e-04
4250.00000  4300.00000  3.516217616778e-04
4300.00000  4350.00000  3.462066421448e-04
4350.00000  4400.00000  3.606469608995e-04
4400.00000  4450.00000  3.346543871410e-04
4450.00000  4500.00000  3.220191082306e-04
4500.00000  4550.00000  3.389864827674e-04
4550.00000  4600.00000  3.469286580825e-04
4600.00000  4650.00000  3.028856858806e-04
4650.00000  4700.00000  3.018026619740e-04
4700.00000  4750.00000  3.111888691645e-04
4750.00000  4800.00000  3.227411241683e-04
4800.00000  4850.00000  2.906114149390e-04
4850.00000  4900.00000  2.985535902541e-04
4900.00000  4950.00000  2.826692396239e-04
4950.00000  5000.00000  2.826692396239e-04
5000.00000  5050.00000  2.469294507060e-04
5050.00000  5100.00000  2.768931121220e-04
5100.00000  5150.00000  2.418753391418e-04
5150.00000  5200.00000  2.599257375852e-04
5200.00000  5250.00000  2.454854188305e-04
5250.00000  5300.00000  2.472904586748e-04
5300.00000  5350.00000  2.310451000758e-04
5350.00000  5400.00000  2.458464267994e-04
5400.00000  5450.00000  2.328501399201e-04
5450.00000  5500.00000  2.184098211654e-04
5500.00000  5550.00000  2.166047813210e-04
5550.00000  5600.00000  2.191318371031e-04
5600.00000  5650.00000  2.317671160135e-04
5650.00000  5700.00000  2.166047813210e-04
5700.00000  5750.00000  2.101066378814e-04
5750.00000  5800.00000  2.021644625663e-04
5800.00000  5850.00000  1.999984147531e-04
5850.00000  5900.00000  1.956663191267e-04
5900.00000  5950.00000  1.931392633446e-04
5950.00000  6000.00000  1.844750720917e-04
6000.00000  6050.00000  1.794209605276e-04
6050.00000  6100.00000  2.043305103795e-04
6100.00000  6150.00000  2.018034545974e-04
6150.00000  6200.00000  1.653416497417e-04
6200.00000  6250.00000  1.761718888078e-04
6250.00000  6300.00000  1.599265302087e-04
6300.00000  6350.00000  1.732838250568e-04
6350.00000  6400.00000  2.216588928852e-04
6400.00000  6450.00000  1.617315700530e-04
6450.00000  6500.00000  1.573994744266e-04
6500.00000  6550.00000  1.595655222398e-04
6550.00000  6600.00000  1.577604823955e-04
6600.00000  6650.00000  1.382660520766e-04
6650.00000  6700.00000  1.592045142710e-04
6700.00000  6750.00000  1.451252034851e-04
6750.00000  6800.00000  1.472912512983e-04
6800.00000  6850.00000  1.418761317653e-04
6850.00000  6900.00000  1.429591556719e-04
6900.00000  6950.00000  1.364610122322e-04
6950.00000  7000.00000  1.393490759832e-04
7000.00000  7050.00000  1.299628687926e-04
7050.00000  7100.00000  1.422371397341e-04
7100.00000  7150.00000  1.321289166058e-04
7150.00000  7200.00000  1.277968209794e-04
7200.00000  7250.00000  1.256307731662e-04
7250.00000  7300.00000  1.281578289483e-04
7300.00000  7350.00000  1.277968209794e-04
7350.00000  7400.00000  1.212986775398e-04
7400.00000  7450.00000  1.296018608237e-04
7450.00000  7500.00000  1.176885978511e-04
7500.00000  7550.00000  1.148005341001e-04
7550.00000  7600.00000  1.234647253530e-04
7600.00000  7650.00000  1.115514623803e-04
7650.00000  7700.00000  1.093854145671e-04
7700.00000  7750.00000  1.108294464426e-04
7750.00000  7800.00000  1.064973508162e-04
7800.00000  7850.00000  1.176885978511e-04
7850.00000  7900.00000  1.090244065982e-04
7900.00000  7950.00000  1.111904544115e-04
7950.00000  8000.00000  1.025262631586e-04
8000.00000  8050.00000  1.054143269096e-04
8050.00000  8100.00000  1.010822312831e-04
8100.00000  8150.00000  9.602811971899e-05
8150.00000  8200.00000  9.747215159446e-05
8200.00000  8250.00000  1.018042472209e-04
8250.00000  8300.00000  1.101074305049e-04
8300.00000  8350.00000  9.927719143880e-05
8350.00000  8400.00000  1.068583587850e-04
8400.00000  8450.00000  1.010822312831e-04
8450.00000  8500.00000  8.664191252841e-05
8500.00000  8550.00000  9.711114362559e-05
8550.00000  8600.00000  8.194880893312e-05
8600.00000  8650.00000  8.664191252841e-05
8650.00000  8700.00000  8.628090455954e-05
8700.00000  8750.00000  8.411485674633e-05
8750.00000  8800.00000  8.952997627936e-05
8800.00000  8850.00000  8.519788065294e-05
8850.00000  8900.00000  8.411485674633e-05
8900.00000  8950.00000  7.292360971141e-05
8950.00000  9000.00000  9.169602409257e-05
9000.00000  9050.00000  8.086578502651e-05
9050.00000  9100.00000  7.725570533783e-05
9100.00000  9150.00000  7.761671330670e-05
9150.00000  9200.00000  8.014376908878e-05
9200.00000  9250.00000  7.328461768028e-05
9250.00000  9300.00000  8.122679299538e-05
9300.00000  9350.00000  7.256260174254e-05
9350.00000  9400.00000  8.158780096425e-05
9400.00000  9450.00000  7.978276111991e-05
9450.00000  9500.00000  7.220159377367e-05
9500.00000  9550.00000  6.714748220952e-05
9550.00000  9600.00000  6.389841048970e-05
9600.00000  9650.00000  7.761671330670e-05
9650.00000  9700.00000  6.642546627178e-05
9700.00000  9750.00000  6.750849017839e-05
9750.00000  9800.00000  6.137135470762e-05
9800.00000  9850.00000  6.064933876989e-05
9850.00000  9900.00000  7.039655392933e-05
9900.00000  9950.00000  6.786949814725e-05
9950.00000  10000.00000  6.534244236517e-05
