300.00000  350.00000  1.968560123775e-01
350.00000  400.00000  1.385500562710e-01
400.00000  450.00000  1.028059088028e-01
450.00000  500.00000  7.830183047272e-02
500.00000  550.00000  6.209843071890e-02
550.00000  600.00000  4.974022008372e-02
600.00000  650.00000  4.085299981919e-02
650.00000  700.00000  3.489700308050e-02
700.00000  750.00000  2.964634128344e-02
750.00000  800.00000  2.628152238295e-02
800.00000  850.00000  2.382621432825e-02
850.00000  900.00000  2.128923591188e-02
900.00000  950.00000  1.938186173815e-02
950.00000  1000.00000  1.802316390322e-02
1000.00000  1050.00000  1.685602018928e-02
1050.00000  1100.00000  1.604377131966e-02
1100.00000  1150.00000  1.500284543738e-02
1150.00000  1200.00000  1.427969150775e-02
1200.00000  1250.00000  1.365676938562e-02
1250.00000  1300.00000  1.294029757649e-02
1300.00000  1350.00000  1.200777053787e-02
1350.00000  1400.00000  1.138039366873e-02
1400.00000  1450.00000  1.069955983560e-02
1450.00000  1500.00000  1.047088282295e-02
1500.00000  1550.00000  9.748471351154e-03
1550.00000  1600.00000  9.248054771514e-03
1600.00000  1650.00000  8.807034818537e-03
1650.00000  1700.00000  8.163323877071e-03
1700.00000  1750.00000  8.008892647746e-03
1750.00000  1800.00000  7.670331875763e-03
1800.00000  1850.00000  7.318406862782e-03
1850.00000  1900.00000  6.675438379149e-03
1900.00000  1950.00000  6.388107197664e-03
1950.00000  2000.00000  6.189128498341e-03
2000.00000  2050.00000  5.869871630025e-03
2050.00000  2100.00000  5.623375629371e-03
2100.00000  2150.00000  5.341984110552e-03
2150.00000  2200.00000  5.055395386901e-03
2200.00000  2250.00000  4.840825073079e-03
2250.00000  2300.00000  4.549039144594e-03
2300.00000  2350.00000  4.603238566425e-03
2350.00000  2400.00000  4.282496782441e-03
2400.00000  2450.00000  4.092427577118e-03
2450.00000  2500.00000  3.902358371795e-03
2500.00000  2550.00000  3.867462853630e-03
2550.00000  2600.00000  3.531871912981e-03
2600.00000  2650.00000  3.395259671655e-03
2650.00000  2700.00000  3.229691574830e-03
2700.00000  2750.00000  3.130944683002e-03
2750.00000  2800.00000  3.017348634508e-03
2800.00000  2850.00000  2.936420730679e-03
2850.00000  2900.00000  2.830991718351e-03
2900.00000  2950.00000  2.694379477025e-03
2950.00000  3000.00000  2.548857741699e-03
3000.00000  3050.00000  2.513962223534e-03
3050.00000  3100.00000  2.392199138874e-03
3100.00000  3150.00000  2.342454464044e-03
3150.00000  3200.00000  2.352106415876e-03
3200.00000  3250.00000  2.149415427387e-03
3250.00000  3300.00000  2.137536102054e-03
3300.00000  3350.00000  2.016515475227e-03
3350.00000  3400.00000  1.976422752229e-03
3400.00000  3450.00000  1.965285884730e-03
3450.00000  3500.00000  1.839068053070e-03
3500.00000  3550.00000  1.741063619075e-03
3550.00000  3600.00000  1.711365305743e-03
3600.00000  3650.00000  1.710622847910e-03
3650.00000  3700.00000  1.627467570581e-03
3700.00000  3750.00000  1.571783233084e-03
3750.00000  3800.00000  1.568070943918e-03
3800.00000  3850.00000  1.479718461756e-03
3850.00000  3900.00000  1.452247521924e-03
3900.00000  3950.00000  1.430716244758e-03
3950.00000  4000.00000  1.313407907098e-03
4000.00000  4050.00000  1.335681642096e-03
4050.00000  4100.00000  1.304498413098e-03
4100.00000  4150.00000  1.204266605603e-03
4150.00000  4200.00000  1.203524147770e-03
4200.00000  4250.00000  1.219115762269e-03
4250.00000  4300.00000  1.135218027107e-03
4300.00000  4350.00000  1.112201834275e-03
4350.00000  4400.00000  1.072109111277e-03
4400.00000  4450.00000  1.061714701611e-03
4450.00000  4500.00000  1.037956050945e-03
4500.00000  4550.00000  1.023106894280e-03
4550.00000  4600.00000  9.481186531168e-04
4600.00000  4650.00000  9.711348459489e-04
4650.00000  4700.00000  9.488611109501e-04
4700.00000  4750.00000  8.983739782861e-04
4750.00000  4800.00000  9.265873759513e-04
4800.00000  4850.00000  8.694181227876e-04
4850.00000  4900.00000  8.716454962875e-04
4900.00000  4950.00000  8.367499781227e-04
4950.00000  5000.00000  8.219008214568e-04
5000.00000  5050.00000  8.248706527900e-04
5050.00000  5100.00000  8.100214961241e-04
5100.00000  5150.00000  7.461701224608e-04
5150.00000  5200.00000  7.491399537939e-04
5200.00000  5250.00000  7.647315682931e-04
5250.00000  5300.00000  7.298360501283e-04
5300.00000  5350.00000  6.734092547979e-04
5350.00000  5400.00000  6.964254476300e-04
5400.00000  5450.00000  6.882584114638e-04
5450.00000  5500.00000  6.912282427970e-04
5500.00000  5550.00000  6.607874716319e-04
5550.00000  5600.00000  6.578176402987e-04
5600.00000  5650.00000  6.065880498014e-04
5650.00000  5700.00000  6.199522908007e-04
5700.00000  5750.00000  6.414835679663e-04
5750.00000  5800.00000  5.635254954704e-04
5800.00000  5850.00000  6.028757606350e-04
5850.00000  5900.00000  5.783746521363e-04
5900.00000  5950.00000  5.754048208031e-04
5950.00000  6000.00000  5.857992304692e-04
6000.00000  6050.00000  5.598132063039e-04
6050.00000  6100.00000  5.041288688068e-04
6100.00000  6150.00000  5.130383628064e-04
6150.00000  6200.00000  5.553584593041e-04
6200.00000  6250.00000  5.219478568059e-04
6250.00000  6300.00000  5.412517604715e-04
6300.00000  6350.00000  5.353120978052e-04
6350.00000  6400.00000  8.850097372868e-04
6400.00000  6450.00000  5.063562423067e-04
6450.00000  6500.00000  4.722031819752e-04
6500.00000  6550.00000  4.291406276441e-04
6550.00000  6600.00000  4.328529168106e-04
6600.00000  6650.00000  4.135490131449e-04
6650.00000  6700.00000  4.603238566425e-04
6700.00000  6750.00000  4.261707963109e-04
6750.00000  6800.00000  4.491869891430e-04
6800.00000  6850.00000  4.395350373102e-04
6850.00000  6900.00000  4.298830854774e-04
6900.00000  6950.00000  4.261707963109e-04
6950.00000  7000.00000  4.321104589773e-04
7000.00000  7050.00000  3.823657841466e-04
7050.00000  7100.00000  4.491869891430e-04
7100.00000  7150.00000  3.318786514826e-04
7150.00000  7200.00000  3.682590853140e-04
7200.00000  7250.00000  3.333635671491e-04
7250.00000  7300.00000  3.393032298155e-04
7300.00000  7350.00000  3.385607719822e-04
7350.00000  7400.00000  3.274239044828e-04
7400.00000  7450.00000  3.096049164837e-04
7450.00000  7500.00000  3.422730611487e-04
7500.00000  7550.00000  3.177719526500e-04
7550.00000  7600.00000  3.422730611487e-04
7600.00000  7650.00000  2.836188923184e-04
7650.00000  7700.00000  3.162870369834e-04
7700.00000  7750.00000  2.806490609852e-04
7750.00000  7800.00000  3.014378803175e-04
7800.00000  7850.00000  2.917859284847e-04
7850.00000  7900.00000  2.873311814849e-04
7900.00000  7950.00000  2.769367718188e-04
7950.00000  8000.00000  2.858462658183e-04
8000.00000  8050.00000  2.954982176511e-04
8050.00000  8100.00000  2.672848199859e-04
8100.00000  8150.00000  2.628300729862e-04
8150.00000  8200.00000  2.650574464861e-04
8200.00000  8250.00000  2.813915188185e-04
8250.00000  8300.00000  2.583753259864e-04
8300.00000  8350.00000  2.197675186551e-04
8350.00000  8400.00000  2.494658319869e-04
8400.00000  8450.00000  2.539205789866e-04
8450.00000  8500.00000  2.398138801541e-04
8500.00000  8550.00000  2.464960006537e-04
8550.00000  8600.00000  2.412987958206e-04
8600.00000  8650.00000  2.242222656549e-04
8650.00000  8700.00000  2.375865066542e-04
8700.00000  8750.00000  2.323893018211e-04
8750.00000  8800.00000  2.264496391548e-04
8800.00000  8850.00000  2.205099764884e-04
8850.00000  8900.00000  2.227373499883e-04
8900.00000  8950.00000  2.309043861545e-04
8950.00000  9000.00000  2.138278559888e-04
9000.00000  9050.00000  2.108580246556e-04
9050.00000  9100.00000  2.012060728228e-04
9100.00000  9150.00000  2.279345548213e-04
9150.00000  9200.00000  1.878418318235e-04
9200.00000  9250.00000  2.019485306560e-04
9250.00000  9300.00000  2.175401451552e-04
9300.00000  9350.00000  2.012060728228e-04
9350.00000  9400.00000  1.974937836563e-04
9400.00000  9450.00000  1.960088679897e-04
9450.00000  9500.00000  1.982362414896e-04
9500.00000  9550.00000  1.819021691571e-04
9550.00000  9600.00000  1.796747956572e-04
9600.00000  9650.00000  1.715077594910e-04
9650.00000  9700.00000  1.989786993229e-04
9700.00000  9750.00000  1.900692053233e-04
9750.00000  9800.00000  1.989786993229e-04
9800.00000  9850.00000  1.974937836563e-04
9850.00000  9900.00000  2.049183619892e-04
9900.00000  9950.00000  1.707653016577e-04
9950.00000  10000.00000  1.707653016577e-04
