10001.00000  11001.00000  2.259901665415e-04
11001.00000  12001.00000  1.779377535187e-04
12001.00000  13001.00000  1.452267095040e-04
13001.00000  14001.00000  1.220302645375e-04
14001.00000  15001.00000  1.003089512064e-04
15001.00000  16001.00000  8.706964477880e-05
16001.00000  17001.00000  7.217081526138e-05
17001.00000  18001.00000  6.523769657505e-05
18001.00000  19001.00000  5.635002847184e-05
19001.00000  20001.00000  4.941690978551e-05
20001.00000  21001.00000  4.185686015415e-05
21001.00000  22001.00000  3.901723175602e-05
22001.00000  23001.00000  3.418617565013e-05
23001.00000  24001.00000  2.913384979892e-05
24001.00000  25001.00000  2.776935303619e-05
25001.00000  26001.00000  2.426591540214e-05
26001.00000  27001.00000  2.190570478552e-05
27001.00000  28001.00000  2.061496460455e-05
28001.00000  29001.00000  1.913983296916e-05
29001.00000  30001.00000  1.781221449731e-05
30001.00000  31001.00000  1.604205653485e-05
31001.00000  32001.00000  1.523073413539e-05
32001.00000  33001.00000  1.368184591823e-05
33001.00000  34001.00000  1.250174060992e-05
34001.00000  35001.00000  1.169041821045e-05
35001.00000  36001.00000  1.224359257372e-05
36001.00000  37001.00000  1.076846093834e-05
37001.00000  38001.00000  8.777033230561e-06
38001.00000  39001.00000  8.924546394100e-06
39001.00000  40001.00000  9.367085884716e-06
40001.00000  41001.00000  8.113223994636e-06
41001.00000  42001.00000  8.113223994636e-06
42001.00000  43001.00000  6.379944323055e-06
43001.00000  44001.00000  6.453700904824e-06
44001.00000  45001.00000  5.679256796245e-06
45001.00000  46001.00000  6.195552868631e-06
46001.00000  47001.00000  5.347352178283e-06
47001.00000  48001.00000  5.126082432975e-06
48001.00000  49001.00000  4.683542942358e-06
49001.00000  50001.00000  4.757299524128e-06
50001.00000  51001.00000  4.093490288203e-06
51001.00000  52001.00000  4.867934396782e-06
52001.00000  53001.00000  4.867934396782e-06
53001.00000  54001.00000  3.577194215817e-06
54001.00000  55001.00000  3.761585670240e-06
55001.00000  56001.00000  3.724707379356e-06
56001.00000  57001.00000  3.577194215817e-06
57001.00000  58001.00000  3.245289597854e-06
58001.00000  59001.00000  2.765871816353e-06
59001.00000  60001.00000  3.614072506702e-06
60001.00000  61001.00000  2.913384979892e-06
61001.00000  62001.00000  3.060898143431e-06
62001.00000  63001.00000  2.839628398123e-06
63001.00000  64001.00000  2.138940871313e-06
64001.00000  65001.00000  2.065184289544e-06
65001.00000  66001.00000  2.286454034852e-06
66001.00000  67001.00000  1.880792835120e-06
67001.00000  68001.00000  2.470845489276e-06
68001.00000  69001.00000  1.438253344504e-06
69001.00000  70001.00000  1.917671126005e-06
70001.00000  71001.00000  1.622644798927e-06
71001.00000  72001.00000  1.401375053619e-06
72001.00000  73001.00000  1.659523089812e-06
73001.00000  74001.00000  1.807036253351e-06
74001.00000  75001.00000  1.401375053619e-06
75001.00000  76001.00000  1.401375053619e-06
76001.00000  77001.00000  1.659523089812e-06
77001.00000  78001.00000  1.548888217158e-06
78001.00000  79001.00000  1.364496762734e-06
79001.00000  80001.00000  9.957138538872e-07
80001.00000  81001.00000  1.327618471850e-06
81001.00000  82001.00000  1.438253344504e-06
82001.00000  83001.00000  1.253861890080e-06
83001.00000  84001.00000  8.113223994636e-07
84001.00000  85001.00000  7.006875268095e-07
85001.00000  86001.00000  1.032592144772e-06
86001.00000  87001.00000  8.482006903483e-07
87001.00000  88001.00000  7.744441085789e-07
88001.00000  89001.00000  9.957138538872e-07
89001.00000  90001.00000  5.531743632706e-07
90001.00000  91001.00000  5.531743632706e-07
91001.00000  92001.00000  7.744441085789e-07
92001.00000  93001.00000  1.032592144772e-06
93001.00000  94001.00000  1.216983599195e-06
94001.00000  95001.00000  9.219572721177e-07
95001.00000  96001.00000  8.850789812330e-07
96001.00000  97001.00000  8.482006903483e-07
97001.00000  98001.00000  7.006875268095e-07
98001.00000  99001.00000  5.162960723859e-07
99001.00000  100001.00000  2.950263270777e-07
100001.00000  101001.00000  5.531743632706e-07
101001.00000  102001.00000  8.482006903483e-07
102001.00000  103001.00000  6.638092359248e-07
103001.00000  104001.00000  5.162960723859e-07
104001.00000  105001.00000  2.950263270777e-07
105001.00000  106001.00000  5.162960723859e-07
106001.00000  107001.00000  7.744441085789e-07
107001.00000  108001.00000  8.482006903483e-07
108001.00000  109001.00000  5.162960723859e-07
109001.00000  110001.00000  3.319046179624e-07
110001.00000  111001.00000  5.162960723859e-07
111001.00000  112001.00000  2.212697453083e-07
112001.00000  113001.00000  3.319046179624e-07
113001.00000  114001.00000  4.794177815012e-07
114001.00000  115001.00000  5.531743632706e-07
115001.00000  116001.00000  5.531743632706e-07
116001.00000  117001.00000  4.794177815012e-07
117001.00000  118001.00000  4.794177815012e-07
118001.00000  119001.00000  5.162960723859e-07
119001.00000  120001.00000  4.425394906165e-07
120001.00000  121001.00000  3.687829088471e-07
121001.00000  122001.00000  4.056611997318e-07
122001.00000  123001.00000  4.794177815012e-07
123001.00000  124001.00000  3.319046179624e-07
124001.00000  125001.00000  4.794177815012e-07
125001.00000  126001.00000  5.531743632706e-07
126001.00000  127001.00000  1.843914544235e-07
127001.00000  128001.00000  2.212697453083e-07
128001.00000  129001.00000  3.687829088471e-07
129001.00000  130001.00000  2.950263270777e-07
130001.00000  131001.00000  2.581480361930e-07
131001.00000  132001.00000  4.056611997318e-07
132001.00000  133001.00000  2.950263270777e-07
133001.00000  134001.00000  2.950263270777e-07
134001.00000  135001.00000  2.950263270777e-07
135001.00000  136001.00000  4.056611997318e-07
136001.00000  137001.00000  1.475131635388e-07
137001.00000  138001.00000  1.843914544235e-07
138001.00000  139001.00000  4.425394906165e-07
139001.00000  140001.00000  4.056611997318e-07
140001.00000  141001.00000  2.212697453083e-07
141001.00000  142001.00000  4.056611997318e-07
142001.00000  143001.00000  1.843914544235e-07
143001.00000  144001.00000  2.212697453083e-07
144001.00000  145001.00000  2.581480361930e-07
145001.00000  146001.00000  7.375658176942e-08
146001.00000  147001.00000  1.843914544235e-07
147001.00000  148001.00000  1.843914544235e-07
148001.00000  149001.00000  2.212697453083e-07
149001.00000  150001.00000  2.212697453083e-07
150001.00000  151001.00000  2.212697453083e-07
151001.00000  152001.00000  7.375658176942e-08
152001.00000  153001.00000  3.687829088471e-08
153001.00000  154001.00000  2.212697453083e-07
154001.00000  155001.00000  4.056611997318e-07
155001.00000  156001.00000  2.950263270777e-07
156001.00000  157001.00000  4.056611997318e-07
157001.00000  158001.00000  1.475131635388e-07
158001.00000  159001.00000  2.581480361930e-07
159001.00000  160001.00000  1.843914544235e-07
160001.00000  161001.00000  2.581480361930e-07
161001.00000  162001.00000  2.212697453083e-07
162001.00000  163001.00000  1.475131635388e-07
163001.00000  164001.00000  1.106348726541e-07
164001.00000  165001.00000  1.475131635388e-07
165001.00000  166001.00000  1.843914544235e-07
166001.00000  167001.00000  7.375658176942e-08
167001.00000  168001.00000  7.375658176942e-08
168001.00000  169001.00000  7.375658176942e-08
169001.00000  170001.00000  1.106348726541e-07
170001.00000  171001.00000  2.581480361930e-07
171001.00000  172001.00000  7.375658176942e-08
172001.00000  173001.00000  2.212697453083e-07
173001.00000  174001.00000  7.375658176942e-08
174001.00000  175001.00000  1.843914544235e-07
175001.00000  176001.00000  7.375658176942e-08
176001.00000  177001.00000  1.843914544235e-07
177001.00000  178001.00000  1.843914544235e-07
178001.00000  179001.00000  1.475131635388e-07
179001.00000  180001.00000  1.475131635388e-07
180001.00000  181001.00000  3.687829088471e-08
181001.00000  182001.00000  1.106348726541e-07
182001.00000  183001.00000  7.375658176942e-08
183001.00000  184001.00000  0.000000000000e+00
184001.00000  185001.00000  0.000000000000e+00
185001.00000  186001.00000  1.106348726541e-07
186001.00000  187001.00000  3.687829088471e-08
187001.00000  188001.00000  1.106348726541e-07
188001.00000  189001.00000  2.581480361930e-07
189001.00000  190001.00000  1.106348726541e-07
190001.00000  191001.00000  1.843914544235e-07
191001.00000  192001.00000  1.475131635388e-07
192001.00000  193001.00000  1.106348726541e-07
193001.00000  194001.00000  1.106348726541e-07
194001.00000  195001.00000  1.475131635388e-07
195001.00000  196001.00000  1.843914544235e-07
196001.00000  197001.00000  2.212697453083e-07
197001.00000  198001.00000  3.687829088471e-08
198001.00000  199001.00000  1.106348726541e-07
