300.00000  350.00000  2.028217477848e-05
350.00000  400.00000  2.854528302156e-05
400.00000  450.00000  2.403813307079e-05
450.00000  500.00000  4.056434955695e-05
500.00000  550.00000  2.569075471940e-04
550.00000  600.00000  2.253574975386e-05
600.00000  650.00000  8.187989077237e-05
650.00000  700.00000  3.831077458157e-05
700.00000  750.00000  6.009533267697e-05
750.00000  800.00000  4.507149950773e-05
800.00000  850.00000  1.569990566186e-04
850.00000  900.00000  3.906196624003e-05
900.00000  950.00000  3.230124131387e-05
950.00000  1000.00000  4.957864945850e-05
1000.00000  1050.00000  4.807626614157e-05
1050.00000  1100.00000  4.957864945850e-05
1100.00000  1150.00000  4.356911619080e-05
1150.00000  1200.00000  4.056434955695e-05
1200.00000  1250.00000  4.957864945850e-05
1250.00000  1300.00000  1.104251737939e-04
1300.00000  1350.00000  5.032984111696e-05
1350.00000  1400.00000  4.582269116619e-05
1400.00000  1450.00000  5.633937438466e-05
1450.00000  1500.00000  6.159771599389e-05
1500.00000  1550.00000  6.159771599389e-05
1550.00000  1600.00000  5.483699106773e-05
1600.00000  1650.00000  5.333460775081e-05
1650.00000  1700.00000  5.859294936004e-05
1700.00000  1750.00000  1.254490069632e-04
1750.00000  1800.00000  5.859294936004e-05
1800.00000  1850.00000  6.385129096928e-05
1850.00000  1900.00000  5.859294936004e-05
1900.00000  1950.00000  5.934414101851e-05
1950.00000  2000.00000  5.558818272620e-05
2000.00000  2050.00000  5.333460775081e-05
2050.00000  2100.00000  5.784175770158e-05
2100.00000  2150.00000  5.408579940927e-05
2150.00000  2200.00000  4.957864945850e-05
2200.00000  2250.00000  5.183222443388e-05
2250.00000  2300.00000  6.685605760313e-05
2300.00000  2350.00000  1.494871400340e-04
2350.00000  2400.00000  5.108103277542e-05
2400.00000  2450.00000  4.432030784926e-05
2450.00000  2500.00000  5.859294936004e-05
2500.00000  2550.00000  5.709056604312e-05
2550.00000  2600.00000  5.483699106773e-05
2600.00000  2650.00000  6.159771599389e-05
2650.00000  2700.00000  5.333460775081e-05
2700.00000  2750.00000  5.108103277542e-05
2750.00000  2800.00000  5.483699106773e-05
2800.00000  2850.00000  4.432030784926e-05
2850.00000  2900.00000  6.234890765235e-05
2900.00000  2950.00000  5.784175770158e-05
2950.00000  3000.00000  8.563584906468e-05
3000.00000  3050.00000  7.436797418775e-05
3050.00000  3100.00000  5.483699106773e-05
3100.00000  3150.00000  6.159771599389e-05
3150.00000  3200.00000  6.385129096928e-05
3200.00000  3250.00000  4.807626614157e-05
3250.00000  3300.00000  4.657388282465e-05
3300.00000  3350.00000  6.009533267697e-05
3350.00000  3400.00000  6.084652433543e-05
3400.00000  3450.00000  5.333460775081e-05
3450.00000  3500.00000  4.356911619080e-05
3500.00000  3550.00000  6.310009931082e-05
3550.00000  3600.00000  5.333460775081e-05
3600.00000  3650.00000  6.310009931082e-05
3650.00000  3700.00000  8.037750745544e-05
3700.00000  3750.00000  6.159771599389e-05
3750.00000  3800.00000  6.460248262774e-05
3800.00000  3850.00000  5.183222443388e-05
3850.00000  3900.00000  6.385129096928e-05
3900.00000  3950.00000  4.957864945850e-05
3950.00000  4000.00000  5.784175770158e-05
4000.00000  4050.00000  5.258341609235e-05
4050.00000  4100.00000  5.934414101851e-05
4100.00000  4150.00000  5.258341609235e-05
4150.00000  4200.00000  6.009533267697e-05
4200.00000  4250.00000  4.957864945850e-05
4250.00000  4300.00000  5.333460775081e-05
4300.00000  4350.00000  5.108103277542e-05
4350.00000  4400.00000  6.986082423697e-05
4400.00000  4450.00000  7.136320755390e-05
4450.00000  4500.00000  5.934414101851e-05
4500.00000  4550.00000  6.310009931082e-05
4550.00000  4600.00000  6.760724926159e-05
4600.00000  4650.00000  5.859294936004e-05
4650.00000  4700.00000  5.183222443388e-05
4700.00000  4750.00000  5.558818272620e-05
4750.00000  4800.00000  5.183222443388e-05
4800.00000  4850.00000  6.385129096928e-05
4850.00000  4900.00000  5.108103277542e-05
4900.00000  4950.00000  6.835844092005e-05
4950.00000  5000.00000  5.408579940927e-05
5000.00000  5050.00000  6.610486594466e-05
5050.00000  5100.00000  5.183222443388e-05
5100.00000  5150.00000  6.535367428620e-05
5150.00000  5200.00000  5.633937438466e-05
5200.00000  5250.00000  5.032984111696e-05
5250.00000  5300.00000  5.934414101851e-05
5300.00000  5350.00000  5.408579940927e-05
5350.00000  5400.00000  6.835844092005e-05
5400.00000  5450.00000  6.385129096928e-05
5450.00000  5500.00000  5.859294936004e-05
5500.00000  5550.00000  5.483699106773e-05
5550.00000  5600.00000  5.408579940927e-05
5600.00000  5650.00000  5.108103277542e-05
5650.00000  5700.00000  4.206673287388e-05
5700.00000  5750.00000  5.032984111696e-05
5750.00000  5800.00000  5.183222443388e-05
5800.00000  5850.00000  5.709056604312e-05
5850.00000  5900.00000  5.032984111696e-05
5900.00000  5950.00000  4.882745780004e-05
5950.00000  6000.00000  5.483699106773e-05
6000.00000  6050.00000  5.558818272620e-05
6050.00000  6100.00000  5.784175770158e-05
6100.00000  6150.00000  4.882745780004e-05
6150.00000  6200.00000  4.957864945850e-05
6200.00000  6250.00000  5.633937438466e-05
6250.00000  6300.00000  6.610486594466e-05
6300.00000  6350.00000  5.483699106773e-05
6350.00000  6400.00000  5.183222443388e-04
6400.00000  6450.00000  5.934414101851e-05
6450.00000  6500.00000  4.582269116619e-05
6500.00000  6550.00000  4.957864945850e-05
6550.00000  6600.00000  5.032984111696e-05
6600.00000  6650.00000  4.131554121542e-05
6650.00000  6700.00000  4.432030784926e-05
6700.00000  6750.00000  4.957864945850e-05
6750.00000  6800.00000  4.507149950773e-05
6800.00000  6850.00000  4.131554121542e-05
6850.00000  6900.00000  4.281792453234e-05
6900.00000  6950.00000  5.859294936004e-05
6950.00000  7000.00000  4.131554121542e-05
7000.00000  7050.00000  4.206673287388e-05
7050.00000  7100.00000  1.111763654524e-04
7100.00000  7150.00000  3.755958292310e-05
7150.00000  7200.00000  3.079885799695e-05
7200.00000  7250.00000  3.230124131387e-05
7250.00000  7300.00000  1.727740814463e-05
7300.00000  7350.00000  3.305243297233e-05
7350.00000  7400.00000  2.253574975386e-05
7400.00000  7450.00000  2.554051638771e-05
7450.00000  7500.00000  4.882745780004e-05
7500.00000  7550.00000  3.155004965541e-05
7550.00000  7600.00000  3.004766633848e-05
7600.00000  7650.00000  3.230124131387e-05
7650.00000  7700.00000  2.929647468002e-05
7700.00000  7750.00000  2.629170804617e-05
7750.00000  7800.00000  2.253574975386e-05
7800.00000  7850.00000  3.455481628926e-05
7850.00000  7900.00000  2.403813307079e-05
7900.00000  7950.00000  2.704289970464e-05
7950.00000  8000.00000  2.478932472925e-05
8000.00000  8050.00000  1.577502482770e-05
8050.00000  8100.00000  2.554051638771e-05
8100.00000  8150.00000  3.305243297233e-05
8150.00000  8200.00000  2.478932472925e-05
8200.00000  8250.00000  2.253574975386e-05
8250.00000  8300.00000  3.305243297233e-05
8300.00000  8350.00000  2.253574975386e-05
8350.00000  8400.00000  2.704289970464e-05
8400.00000  8450.00000  1.877979146155e-05
8450.00000  8500.00000  2.103336643694e-05
8500.00000  8550.00000  2.403813307079e-05
8550.00000  8600.00000  2.028217477848e-05
8600.00000  8650.00000  2.028217477848e-05
8650.00000  8700.00000  3.230124131387e-05
8700.00000  8750.00000  3.981315789849e-05
8750.00000  8800.00000  2.403813307079e-05
8800.00000  8850.00000  2.629170804617e-05
8850.00000  8900.00000  1.953098312001e-05
8900.00000  8950.00000  2.779409136310e-05
8950.00000  9000.00000  2.253574975386e-05
9000.00000  9050.00000  2.629170804617e-05
9050.00000  9100.00000  2.554051638771e-05
9100.00000  9150.00000  2.629170804617e-05
9150.00000  9200.00000  1.953098312001e-05
9200.00000  9250.00000  2.554051638771e-05
9250.00000  9300.00000  2.629170804617e-05
9300.00000  9350.00000  2.554051638771e-05
9350.00000  9400.00000  2.253574975386e-05
9400.00000  9450.00000  1.953098312001e-05
9450.00000  9500.00000  2.554051638771e-05
9500.00000  9550.00000  2.403813307079e-05
9550.00000  9600.00000  2.478932472925e-05
9600.00000  9650.00000  1.802859980309e-05
9650.00000  9700.00000  2.403813307079e-05
9700.00000  9750.00000  2.478932472925e-05
9750.00000  9800.00000  1.953098312001e-05
9800.00000  9850.00000  1.727740814463e-05
9850.00000  9900.00000  2.028217477848e-05
9900.00000  9950.00000  2.779409136310e-05
9950.00000  10000.00000  2.328694141232e-05
