10001.00000  11001.00000  4.880105723163e-04
11001.00000  12001.00000  4.051411930625e-04
12001.00000  13001.00000  3.448528622615e-04
13001.00000  14001.00000  2.983550358713e-04
14001.00000  15001.00000  2.564239602872e-04
15001.00000  16001.00000  2.253231237692e-04
16001.00000  17001.00000  1.960634278924e-04
17001.00000  18001.00000  1.758289312373e-04
18001.00000  19001.00000  1.553056282072e-04
19001.00000  20001.00000  1.348003755754e-04
20001.00000  21001.00000  1.253058659942e-04
21001.00000  22001.00000  1.112446056068e-04
22001.00000  23001.00000  9.985480418899e-05
23001.00000  24001.00000  9.115451213926e-05
24001.00000  25001.00000  8.427731033232e-05
25001.00000  26001.00000  7.678639497830e-05
26001.00000  27001.00000  7.066730990598e-05
27001.00000  28001.00000  6.743628858461e-05
28001.00000  29001.00000  6.073959076210e-05
29001.00000  30001.00000  5.516201764309e-05
30001.00000  31001.00000  5.286961704077e-05
31001.00000  32001.00000  4.786965667195e-05
32001.00000  33001.00000  4.444008096770e-05
33001.00000  34001.00000  4.290579710001e-05
34001.00000  35001.00000  4.072169888835e-05
35001.00000  36001.00000  3.893470944245e-05
36001.00000  37001.00000  3.552318413665e-05
37001.00000  38001.00000  3.214775962773e-05
38001.00000  39001.00000  3.021636699428e-05
39001.00000  40001.00000  2.866403272815e-05
40001.00000  41001.00000  2.718390005579e-05
41001.00000  42001.00000  2.570376738343e-05
42001.00000  43001.00000  2.584817057098e-05
43001.00000  44001.00000  2.353771957022e-05
44001.00000  45001.00000  2.147997414767e-05
45001.00000  46001.00000  2.066770621771e-05
46001.00000  47001.00000  2.063160542083e-05
47001.00000  48001.00000  1.976518629554e-05
48001.00000  49001.00000  1.797819684964e-05
49001.00000  50001.00000  1.779769286521e-05
50001.00000  51001.00000  1.658831616950e-05
51001.00000  52001.00000  1.563164505200e-05
52001.00000  53001.00000  1.503598190337e-05
53001.00000  54001.00000  1.442226835629e-05
54001.00000  55001.00000  1.351974843412e-05
55001.00000  56001.00000  1.317679086370e-05
56001.00000  57001.00000  1.185911177733e-05
57001.00000  58001.00000  1.234647253530e-05
58001.00000  59001.00000  1.092049105827e-05
59001.00000  60001.00000  1.164250699600e-05
60001.00000  61001.00000  1.191326297266e-05
61001.00000  62001.00000  1.086633986294e-05
62001.00000  63001.00000  9.440358385908e-06
63001.00000  64001.00000  9.693063964116e-06
64001.00000  65001.00000  8.989098424822e-06
65001.00000  66001.00000  8.646140854397e-06
66001.00000  67001.00000  8.068528104208e-06
67001.00000  68001.00000  8.718342448171e-06
68001.00000  69001.00000  8.429536073076e-06
69001.00000  70001.00000  7.111856986707e-06
70001.00000  71001.00000  7.202108978924e-06
71001.00000  72001.00000  7.689469736896e-06
72001.00000  73001.00000  6.931353002273e-06
73001.00000  74001.00000  6.155185869206e-06
74001.00000  75001.00000  7.147957783594e-06
75001.00000  76001.00000  6.805000213169e-06
76001.00000  77001.00000  5.577573119016e-06
77001.00000  78001.00000  6.443992244300e-06
78001.00000  79001.00000  4.927758775053e-06
79001.00000  80001.00000  5.379018736139e-06
80001.00000  81001.00000  5.162413954818e-06
81001.00000  82001.00000  4.765305189062e-06
82001.00000  83001.00000  5.180464353261e-06
83001.00000  84001.00000  4.729204392176e-06
84001.00000  85001.00000  4.945809173497e-06
85001.00000  86001.00000  4.350146024864e-06
86001.00000  87001.00000  4.332095626420e-06
87001.00000  88001.00000  4.440398017081e-06
88001.00000  89001.00000  4.151591641986e-06
89001.00000  90001.00000  3.971087657552e-06
90001.00000  91001.00000  4.368196423307e-06
91001.00000  92001.00000  3.754482876231e-06
92001.00000  93001.00000  3.483726899580e-06
93001.00000  94001.00000  3.772533274674e-06
94001.00000  95001.00000  3.610079688684e-06
95001.00000  96001.00000  2.815862157173e-06
96001.00000  97001.00000  2.978315743164e-06
97001.00000  98001.00000  2.924164547834e-06
98001.00000  99001.00000  2.870013352504e-06
99001.00000  100001.00000  2.924164547834e-06
100001.00000  101001.00000  2.960265344721e-06
101001.00000  102001.00000  3.014416540051e-06
102001.00000  103001.00000  2.870013352504e-06
103001.00000  104001.00000  2.527055782079e-06
104001.00000  105001.00000  2.833912555617e-06
105001.00000  106001.00000  2.545106180522e-06
106001.00000  107001.00000  2.581206977409e-06
107001.00000  108001.00000  2.472904586748e-06
108001.00000  109001.00000  2.310451000758e-06
109001.00000  110001.00000  2.310451000758e-06
110001.00000  111001.00000  2.617307774296e-06
111001.00000  112001.00000  2.364602196088e-06
112001.00000  113001.00000  2.147997414767e-06
113001.00000  114001.00000  2.111896617880e-06
114001.00000  115001.00000  1.931392633446e-06
115001.00000  116001.00000  2.256299805427e-06
116001.00000  117001.00000  2.021644625663e-06
117001.00000  118001.00000  1.732838250568e-06
118001.00000  119001.00000  1.985543828776e-06
119001.00000  120001.00000  1.642586258351e-06
120001.00000  121001.00000  1.660636656795e-06
121001.00000  122001.00000  1.552334266134e-06
122001.00000  123001.00000  2.075795820993e-06
123001.00000  124001.00000  1.877241438116e-06
124001.00000  125001.00000  1.678687055238e-06
125001.00000  126001.00000  1.805039844342e-06
126001.00000  127001.00000  1.462082273917e-06
127001.00000  128001.00000  1.552334266134e-06
128001.00000  129001.00000  1.498183070804e-06
129001.00000  130001.00000  1.317679086370e-06
130001.00000  131001.00000  1.389880680143e-06
131001.00000  132001.00000  1.462082273917e-06
132001.00000  133001.00000  9.927719143880e-07
133001.00000  134001.00000  1.263527891039e-06
134001.00000  135001.00000  1.462082273917e-06
135001.00000  136001.00000  1.046923109718e-06
136001.00000  137001.00000  1.407931078587e-06
137001.00000  138001.00000  1.137175101935e-06
138001.00000  139001.00000  1.101074305049e-06
139001.00000  140001.00000  1.155225500379e-06
140001.00000  141001.00000  9.025199221709e-07
141001.00000  142001.00000  9.927719143880e-07
142001.00000  143001.00000  1.010822312831e-06
143001.00000  144001.00000  7.220159377367e-07
144001.00000  145001.00000  9.927719143880e-07
145001.00000  146001.00000  8.844695237275e-07
146001.00000  147001.00000  8.483687268407e-07
147001.00000  148001.00000  8.664191252841e-07
148001.00000  149001.00000  1.046923109718e-06
149001.00000  150001.00000  8.122679299538e-07
150001.00000  151001.00000  9.205703206143e-07
151001.00000  152001.00000  8.303183283973e-07
152001.00000  153001.00000  8.303183283973e-07
153001.00000  154001.00000  9.205703206143e-07
154001.00000  155001.00000  6.678647424065e-07
155001.00000  156001.00000  7.942175315104e-07
156001.00000  157001.00000  9.386207190578e-07
157001.00000  158001.00000  6.317639455196e-07
158001.00000  159001.00000  7.400663361802e-07
159001.00000  160001.00000  6.678647424065e-07
160001.00000  161001.00000  6.317639455196e-07
161001.00000  162001.00000  7.220159377367e-07
162001.00000  163001.00000  8.122679299538e-07
163001.00000  164001.00000  6.859151408499e-07
164001.00000  165001.00000  1.010822312831e-06
165001.00000  166001.00000  7.220159377367e-07
166001.00000  167001.00000  5.595623517460e-07
167001.00000  168001.00000  6.137135470762e-07
168001.00000  169001.00000  7.581167346236e-07
169001.00000  170001.00000  5.054111564157e-07
170001.00000  171001.00000  5.415119533026e-07
171001.00000  172001.00000  4.512599610855e-07
172001.00000  173001.00000  6.317639455196e-07
173001.00000  174001.00000  4.693103595289e-07
174001.00000  175001.00000  5.595623517460e-07
175001.00000  176001.00000  4.693103595289e-07
176001.00000  177001.00000  6.498143439631e-07
177001.00000  178001.00000  6.317639455196e-07
178001.00000  179001.00000  4.512599610855e-07
179001.00000  180001.00000  4.873607579723e-07
180001.00000  181001.00000  4.151591641986e-07
181001.00000  182001.00000  7.220159377367e-07
182001.00000  183001.00000  5.234615548591e-07
183001.00000  184001.00000  6.137135470762e-07
184001.00000  185001.00000  4.693103595289e-07
185001.00000  186001.00000  5.234615548591e-07
186001.00000  187001.00000  4.512599610855e-07
187001.00000  188001.00000  4.151591641986e-07
188001.00000  189001.00000  5.595623517460e-07
189001.00000  190001.00000  3.429575704250e-07
190001.00000  191001.00000  3.971087657552e-07
191001.00000  192001.00000  3.971087657552e-07
192001.00000  193001.00000  5.595623517460e-07
193001.00000  194001.00000  4.693103595289e-07
194001.00000  195001.00000  4.151591641986e-07
195001.00000  196001.00000  3.068567735381e-07
196001.00000  197001.00000  2.888063750947e-07
197001.00000  198001.00000  4.693103595289e-07
198001.00000  199001.00000  4.693103595289e-07
