300.00000  350.00000  3.809592702669e-01
350.00000  400.00000  2.856701664111e-01
400.00000  450.00000  2.225038511084e-01
450.00000  500.00000  1.775932492047e-01
500.00000  550.00000  1.458111476276e-01
550.00000  600.00000  1.212644171783e-01
600.00000  650.00000  1.027212603857e-01
650.00000  700.00000  8.798681849609e-02
700.00000  750.00000  7.633402880823e-02
750.00000  800.00000  6.684515903555e-02
800.00000  850.00000  5.888884102325e-02
850.00000  900.00000  5.231685615036e-02
900.00000  950.00000  4.687701690891e-02
950.00000  1000.00000  4.206530803684e-02
1000.00000  1050.00000  3.796663146268e-02
1050.00000  1100.00000  3.471805343541e-02
1100.00000  1150.00000  3.183030860430e-02
1150.00000  1200.00000  2.929548238280e-02
1200.00000  1250.00000  2.700528883666e-02
1250.00000  1300.00000  2.514032444094e-02
1300.00000  1350.00000  2.321851892359e-02
1350.00000  1400.00000  2.164567472257e-02
1400.00000  1450.00000  2.025702453594e-02
1450.00000  1500.00000  1.899536748814e-02
1500.00000  1550.00000  1.796934926735e-02
1550.00000  1600.00000  1.684583773034e-02
1600.00000  1650.00000  1.613784198752e-02
1650.00000  1700.00000  1.552050423616e-02
1700.00000  1750.00000  1.470242378942e-02
1750.00000  1800.00000  1.421747548591e-02
1800.00000  1850.00000  1.329614566001e-02
1850.00000  1900.00000  1.273708804601e-02
1900.00000  1950.00000  1.242194359951e-02
1950.00000  2000.00000  1.202369599418e-02
2000.00000  2050.00000  1.157328406836e-02
2050.00000  2100.00000  1.120813382498e-02
2100.00000  2150.00000  1.092428797077e-02
2150.00000  2200.00000  1.053611347560e-02
2200.00000  2250.00000  1.035443773875e-02
2250.00000  2300.00000  1.005872000470e-02
2300.00000  2350.00000  1.002562264274e-02
2350.00000  2400.00000  9.525564673983e-03
2400.00000  2450.00000  9.452894379242e-03
2450.00000  2500.00000  9.041695632269e-03
2500.00000  2550.00000  8.652801629226e-03
2550.00000  2600.00000  8.494150144173e-03
2600.00000  2650.00000  8.352407094035e-03
2650.00000  2700.00000  8.124323099651e-03
2700.00000  2750.00000  8.033665108192e-03
2750.00000  2800.00000  7.863141743306e-03
2800.00000  2850.00000  7.606996942041e-03
2850.00000  2900.00000  7.533966893366e-03
2900.00000  2950.00000  7.261992918990e-03
2950.00000  3000.00000  7.255517348172e-03
3000.00000  3050.00000  7.048299081980e-03
3050.00000  3100.00000  6.843239339395e-03
3100.00000  3150.00000  6.764812981705e-03
3150.00000  3200.00000  6.657606309265e-03
3200.00000  3250.00000  6.398943230461e-03
3250.00000  3300.00000  6.338504569488e-03
3300.00000  3350.00000  6.136682612312e-03
3350.00000  3400.00000  6.126969256084e-03
3400.00000  3450.00000  5.935939916939e-03
3450.00000  3500.00000  5.739874022713e-03
3500.00000  3550.00000  5.821897919747e-03
3550.00000  3600.00000  5.558558039796e-03
3600.00000  3650.00000  5.526539939638e-03
3650.00000  3700.00000  5.411058926708e-03
3700.00000  3750.00000  5.271834154111e-03
3750.00000  3800.00000  5.272553661980e-03
3800.00000  3850.00000  5.172182314293e-03
3850.00000  3900.00000  4.979354205476e-03
3900.00000  3950.00000  4.954531184005e-03
3950.00000  4000.00000  4.821422228292e-03
4000.00000  4050.00000  4.741916608799e-03
4050.00000  4100.00000  4.671045083730e-03
4100.00000  4150.00000  4.513113106546e-03
4150.00000  4200.00000  4.458070754589e-03
4200.00000  4250.00000  4.389357753126e-03
4250.00000  4300.00000  4.253730519872e-03
4300.00000  4350.00000  4.246895195119e-03
4350.00000  4400.00000  4.145804339564e-03
4400.00000  4450.00000  3.999024734345e-03
4450.00000  4500.00000  3.955134754353e-03
4500.00000  4550.00000  3.909086250755e-03
4550.00000  4600.00000  3.832458662737e-03
4600.00000  4650.00000  3.722733712757e-03
4650.00000  4700.00000  3.702947246367e-03
4700.00000  4750.00000  3.592143034584e-03
4750.00000  4800.00000  3.600777129009e-03
4800.00000  4850.00000  3.508680121813e-03
4850.00000  4900.00000  3.438887858547e-03
4900.00000  4950.00000  3.371613872822e-03
4950.00000  5000.00000  3.291748499394e-03
5000.00000  5050.00000  3.280236373494e-03
5050.00000  5100.00000  3.202889277607e-03
5100.00000  5150.00000  3.139932339094e-03
5150.00000  5200.00000  3.047835331898e-03
5200.00000  5250.00000  3.034884190261e-03
5250.00000  5300.00000  2.998908796825e-03
5300.00000  5350.00000  2.994591749612e-03
5350.00000  5400.00000  2.899976464876e-03
5400.00000  5450.00000  2.860763286030e-03
5450.00000  5500.00000  2.769745540637e-03
5500.00000  5550.00000  2.752837105722e-03
5550.00000  5600.00000  2.722617775236e-03
5600.00000  5650.00000  2.687721643603e-03
5650.00000  5700.00000  2.619368396075e-03
5700.00000  5750.00000  2.595264882473e-03
5750.00000  5800.00000  2.582313740836e-03
5800.00000  5850.00000  2.539143268713e-03
5850.00000  5900.00000  2.521875079863e-03
5900.00000  5950.00000  2.458918141350e-03
5950.00000  6000.00000  2.448845031188e-03
6000.00000  6050.00000  2.380132029725e-03
6050.00000  6100.00000  2.366461380220e-03
6100.00000  6150.00000  2.329406724981e-03
6150.00000  6200.00000  2.258175445977e-03
6200.00000  6250.00000  2.232632916638e-03
6250.00000  6300.00000  2.239468241391e-03
6300.00000  6350.00000  2.198816046808e-03
6350.00000  6400.00000  2.747081042773e-03
6400.00000  6450.00000  2.069304630438e-03
6450.00000  6500.00000  1.999152613238e-03
6500.00000  6550.00000  2.028652435856e-03
6550.00000  6600.00000  2.027932927987e-03
6600.00000  6650.00000  2.004189168319e-03
6650.00000  6700.00000  1.939793214069e-03
6700.00000  6750.00000  1.944470015216e-03
6750.00000  6800.00000  1.951305339968e-03
6800.00000  6850.00000  1.862805872116e-03
6850.00000  6900.00000  1.861366856378e-03
6900.00000  6950.00000  1.775385666066e-03
6950.00000  7000.00000  1.827549986549e-03
7000.00000  7050.00000  1.784379514425e-03
7050.00000  7100.00000  1.801647703275e-03
7100.00000  7150.00000  1.668898501496e-03
7150.00000  7200.00000  1.623929259701e-03
7200.00000  7250.00000  1.591191651674e-03
7250.00000  7300.00000  1.579679525775e-03
7300.00000  7350.00000  1.572484447087e-03
7350.00000  7400.00000  1.555576012172e-03
7400.00000  7450.00000  1.560252813319e-03
7450.00000  7500.00000  1.546582163813e-03
7500.00000  7550.00000  1.540106592995e-03
7550.00000  7600.00000  1.484344733169e-03
7600.00000  7650.00000  1.437576721702e-03
7650.00000  7700.00000  1.430741396950e-03
7700.00000  7750.00000  1.431460904818e-03
7750.00000  7800.00000  1.400881820398e-03
7800.00000  7850.00000  1.414192715969e-03
7850.00000  7900.00000  1.371381997780e-03
7900.00000  7950.00000  1.335766358279e-03
7950.00000  8000.00000  1.348717499915e-03
8000.00000  8050.00000  1.354473562865e-03
8050.00000  8100.00000  1.308784813202e-03
8100.00000  8150.00000  1.304467765989e-03
8150.00000  8200.00000  1.249785167966e-03
8200.00000  8250.00000  1.301229980580e-03
8250.00000  8300.00000  1.281803268125e-03
8300.00000  8350.00000  1.247626644360e-03
8350.00000  8400.00000  1.237913288133e-03
8400.00000  8450.00000  1.218126821743e-03
8450.00000  8500.00000  1.194383062075e-03
8500.00000  8550.00000  1.207334203712e-03
8550.00000  8600.00000  1.191864784535e-03
8600.00000  8650.00000  1.142218741593e-03
8650.00000  8700.00000  1.135383416840e-03
8700.00000  8750.00000  1.115956704385e-03
8750.00000  8800.00000  1.124590798809e-03
8800.00000  8850.00000  1.118834735859e-03
8850.00000  8900.00000  1.074225247999e-03
8900.00000  8950.00000  1.090414175045e-03
8950.00000  9000.00000  1.112718918975e-03
9000.00000  9050.00000  1.039688870300e-03
9050.00000  9100.00000  1.068469185049e-03
9100.00000  9150.00000  1.021341419648e-03
9150.00000  9200.00000  1.037170592760e-03
9200.00000  9250.00000  1.010548801617e-03
9250.00000  9300.00000  1.043286409644e-03
9300.00000  9350.00000  9.695368531001e-04
9350.00000  9400.00000  9.889635655555e-04
9400.00000  9450.00000  9.914818430960e-04
9450.00000  9500.00000  9.954391363740e-04
9500.00000  9550.00000  9.591039890036e-04
9550.00000  9600.00000  9.439943237605e-04
9600.00000  9650.00000  9.321224439266e-04
9650.00000  9700.00000  9.317626899923e-04
9700.00000  9750.00000  9.519089103164e-04
9750.00000  9800.00000  9.134152393399e-04
9800.00000  9850.00000  8.900312336065e-04
9850.00000  9900.00000  9.072994224558e-04
9900.00000  9950.00000  8.950677886876e-04
9950.00000  10000.00000  8.601716570547e-04
