10001.00000  11001.00000  2.126658870299e-04
11001.00000  12001.00000  1.933975985234e-04
12001.00000  13001.00000  1.744673501661e-04
13001.00000  14001.00000  1.565705388365e-04
14001.00000  15001.00000  1.380555969483e-04
15001.00000  16001.00000  1.228727651026e-04
16001.00000  17001.00000  1.120747969070e-04
17001.00000  18001.00000  1.012285372615e-04
18001.00000  19001.00000  9.095211672468e-05
19001.00000  20001.00000  8.328343448199e-05
20001.00000  21001.00000  7.555680249943e-05
21001.00000  22001.00000  7.116228055935e-05
22001.00000  23001.00000  6.380266359597e-05
23001.00000  24001.00000  5.875137793737e-05
24001.00000  25001.00000  5.661689585219e-05
25001.00000  26001.00000  5.049354000601e-05
26001.00000  27001.00000  4.675578178445e-05
27001.00000  28001.00000  4.524908854785e-05
28001.00000  29001.00000  4.132782281670e-05
29001.00000  30001.00000  3.892290861213e-05
30001.00000  31001.00000  3.683671797684e-05
31001.00000  32001.00000  3.433522087249e-05
32001.00000  33001.00000  3.270296986617e-05
33001.00000  34001.00000  3.213313075746e-05
34001.00000  35001.00000  2.848229714570e-05
35001.00000  36001.00000  2.679209639952e-05
36001.00000  37001.00000  2.509223736335e-05
37001.00000  38001.00000  2.444513193482e-05
38001.00000  39001.00000  2.329579542741e-05
39001.00000  40001.00000  2.255210709909e-05
40001.00000  41001.00000  2.153798665138e-05
41001.00000  42001.00000  2.001197683482e-05
42001.00000  43001.00000  1.865981623788e-05
43001.00000  44001.00000  1.851494188820e-05
44001.00000  45001.00000  1.787749474964e-05
45001.00000  46001.00000  1.634182664311e-05
46001.00000  47001.00000  1.599412820389e-05
47001.00000  48001.00000  1.521180671566e-05
48001.00000  49001.00000  1.473855050673e-05
49001.00000  50001.00000  1.442948522743e-05
50001.00000  51001.00000  1.300005831065e-05
51001.00000  52001.00000  1.298074173070e-05
52001.00000  53001.00000  1.233363630216e-05
53001.00000  54001.00000  1.190867154312e-05
54001.00000  55001.00000  1.151268165401e-05
55001.00000  56001.00000  1.133883243440e-05
56001.00000  57001.00000  1.040197830652e-05
57001.00000  58001.00000  1.075933503571e-05
58001.00000  59001.00000  9.938380387564e-06
59001.00000  60001.00000  9.107767449439e-06
60001.00000  61001.00000  9.552048788436e-06
61001.00000  62001.00000  9.020842839635e-06
62001.00000  63001.00000  9.040159419592e-06
63001.00000  64001.00000  8.595878080595e-06
64001.00000  65001.00000  8.093647001729e-06
65001.00000  66001.00000  7.852189752274e-06
66001.00000  67001.00000  6.934652204345e-06
67001.00000  68001.00000  7.263034063604e-06
68001.00000  69001.00000  6.963627074280e-06
69001.00000  70001.00000  6.683536664912e-06
70001.00000  71001.00000  6.654561794977e-06
71001.00000  72001.00000  6.924993914367e-06
72001.00000  73001.00000  6.403446255544e-06
73001.00000  74001.00000  6.451737705435e-06
74001.00000  75001.00000  6.055747816329e-06
75001.00000  76001.00000  5.688732797158e-06
76001.00000  77001.00000  5.582491607398e-06
77001.00000  78001.00000  5.350692647921e-06
78001.00000  79001.00000  5.099577108488e-06
79001.00000  80001.00000  4.722903799338e-06
80001.00000  81001.00000  4.800170119164e-06
81001.00000  82001.00000  4.761536959251e-06
82001.00000  83001.00000  4.925727888880e-06
83001.00000  84001.00000  4.182039560559e-06
84001.00000  85001.00000  4.568371159687e-06
85001.00000  86001.00000  3.892290861213e-06
86001.00000  87001.00000  3.998532050973e-06
87001.00000  88001.00000  4.075798370799e-06
88001.00000  89001.00000  3.650833611758e-06
89001.00000  90001.00000  3.737758221562e-06
90001.00000  91001.00000  3.872974281257e-06
91001.00000  92001.00000  3.728099931584e-06
92001.00000  93001.00000  3.380401492369e-06
93001.00000  94001.00000  3.708783351627e-06
94001.00000  95001.00000  3.206552272761e-06
95001.00000  96001.00000  3.013386473197e-06
96001.00000  97001.00000  2.713979483873e-06
97001.00000  98001.00000  2.849195543568e-06
98001.00000  99001.00000  3.206552272761e-06
99001.00000  100001.00000  3.052019633110e-06
100001.00000  101001.00000  2.540130264266e-06
101001.00000  102001.00000  2.858853833546e-06
102001.00000  103001.00000  2.974753313285e-06
103001.00000  104001.00000  2.511155394331e-06
104001.00000  105001.00000  2.569105134200e-06
105001.00000  106001.00000  2.404914204571e-06
106001.00000  107001.00000  2.356622754680e-06
107001.00000  108001.00000  2.511155394331e-06
108001.00000  109001.00000  2.279356434854e-06
109001.00000  110001.00000  2.163456955116e-06
110001.00000  111001.00000  2.221406694985e-06
111001.00000  112001.00000  2.260039854898e-06
112001.00000  113001.00000  2.037899185399e-06
113001.00000  114001.00000  1.825416805879e-06
114001.00000  115001.00000  2.134482085181e-06
115001.00000  116001.00000  2.076532345312e-06
116001.00000  117001.00000  1.767467066010e-06
117001.00000  118001.00000  1.902683125705e-06
118001.00000  119001.00000  1.661225876250e-06
119001.00000  120001.00000  1.690200746184e-06
120001.00000  121001.00000  1.371477176904e-06
121001.00000  122001.00000  1.670884166228e-06
122001.00000  123001.00000  1.574301266446e-06
123001.00000  124001.00000  1.554984686490e-06
124001.00000  125001.00000  1.574301266446e-06
125001.00000  126001.00000  1.448743496729e-06
126001.00000  127001.00000  1.477718366664e-06
127001.00000  128001.00000  1.477718366664e-06
128001.00000  129001.00000  1.313527437035e-06
129001.00000  130001.00000  1.303869147057e-06
130001.00000  131001.00000  1.207286247275e-06
131001.00000  132001.00000  1.274894277122e-06
132001.00000  133001.00000  1.216944537253e-06
133001.00000  134001.00000  1.178311377340e-06
134001.00000  135001.00000  1.361818886926e-06
135001.00000  136001.00000  1.245919407187e-06
136001.00000  137001.00000  1.178311377340e-06
137001.00000  138001.00000  1.101045057514e-06
138001.00000  139001.00000  1.014120447711e-06
139001.00000  140001.00000  1.072070187580e-06
140001.00000  141001.00000  8.982209679723e-07
141001.00000  142001.00000  9.465124178633e-07
142001.00000  143001.00000  9.175375479287e-07
143001.00000  144001.00000  8.209546481467e-07
144001.00000  145001.00000  8.595878080595e-07
145001.00000  146001.00000  8.499295180813e-07
146001.00000  147001.00000  8.209546481467e-07
147001.00000  148001.00000  6.953968784301e-07
148001.00000  149001.00000  8.595878080595e-07
149001.00000  150001.00000  7.919797782121e-07
150001.00000  151001.00000  7.630049082775e-07
151001.00000  152001.00000  8.595878080595e-07
152001.00000  153001.00000  8.595878080595e-07
153001.00000  154001.00000  8.306129381249e-07
154001.00000  155001.00000  6.277888485828e-07
155001.00000  156001.00000  6.664220084956e-07
156001.00000  157001.00000  6.084722686264e-07
157001.00000  158001.00000  5.408642387790e-07
158001.00000  159001.00000  5.891556886700e-07
159001.00000  160001.00000  4.925727888880e-07
160001.00000  161001.00000  6.857385884519e-07
161001.00000  162001.00000  5.794973986918e-07
162001.00000  163001.00000  5.505225287572e-07
163001.00000  164001.00000  4.732562089316e-07
164001.00000  165001.00000  6.181305586046e-07
165001.00000  166001.00000  5.505225287572e-07
166001.00000  167001.00000  3.670150191715e-07
167001.00000  168001.00000  4.829144989098e-07
168001.00000  169001.00000  4.153064690624e-07
169001.00000  170001.00000  4.442813389970e-07
170001.00000  171001.00000  4.732562089316e-07
171001.00000  172001.00000  4.635979189534e-07
172001.00000  173001.00000  4.829144989098e-07
173001.00000  174001.00000  4.346230490188e-07
174001.00000  175001.00000  4.056481790843e-07
175001.00000  176001.00000  4.829144989098e-07
176001.00000  177001.00000  3.573567291933e-07
177001.00000  178001.00000  2.511155394331e-07
178001.00000  179001.00000  2.897486993459e-07
179001.00000  180001.00000  3.573567291933e-07
180001.00000  181001.00000  2.704321193895e-07
181001.00000  182001.00000  1.835075095857e-07
182001.00000  183001.00000  2.414572494549e-07
183001.00000  184001.00000  2.317989594767e-07
184001.00000  185001.00000  2.124823795203e-07
185001.00000  186001.00000  2.607738294113e-07
186001.00000  187001.00000  1.931657995639e-07
187001.00000  188001.00000  1.931657995639e-07
188001.00000  189001.00000  1.255577697166e-07
189001.00000  190001.00000  7.726631982557e-08
190001.00000  191001.00000  1.255577697166e-07
191001.00000  192001.00000  6.760802984738e-08
192001.00000  193001.00000  1.062411897602e-07
193001.00000  194001.00000  4.829144989098e-08
194001.00000  195001.00000  4.829144989098e-08
195001.00000  196001.00000  3.863315991279e-08
196001.00000  197001.00000  2.897486993459e-08
197001.00000  198001.00000  3.863315991279e-08
198001.00000  199001.00000  9.658289978196e-09
