300.00000  350.00000  4.621641555291e-01
350.00000  400.00000  3.458585298948e-01
400.00000  450.00000  2.691280655388e-01
450.00000  500.00000  2.154080044096e-01
500.00000  550.00000  1.759877917102e-01
550.00000  600.00000  1.467877140461e-01
600.00000  650.00000  1.239505943808e-01
650.00000  700.00000  1.059438438703e-01
700.00000  750.00000  9.203406320864e-02
750.00000  800.00000  8.018750735940e-02
800.00000  850.00000  7.103116082734e-02
850.00000  900.00000  6.280091067388e-02
900.00000  950.00000  5.639373301106e-02
950.00000  1000.00000  5.090294497132e-02
1000.00000  1050.00000  4.585687013822e-02
1050.00000  1100.00000  4.168188673578e-02
1100.00000  1150.00000  3.817882652107e-02
1150.00000  1200.00000  3.497631621805e-02
1200.00000  1250.00000  3.228934248604e-02
1250.00000  1300.00000  2.971130012154e-02
1300.00000  1350.00000  2.738958800469e-02
1350.00000  1400.00000  2.534002455190e-02
1400.00000  1450.00000  2.366578897925e-02
1450.00000  1500.00000  2.210839398232e-02
1500.00000  1550.00000  2.074081998224e-02
1550.00000  1600.00000  1.945018100740e-02
1600.00000  1650.00000  1.821742305623e-02
1650.00000  1700.00000  1.710294371863e-02
1700.00000  1750.00000  1.607977978482e-02
1750.00000  1800.00000  1.527663564281e-02
1800.00000  1850.00000  1.440913930680e-02
1850.00000  1900.00000  1.361857799603e-02
1900.00000  1950.00000  1.294377873259e-02
1950.00000  2000.00000  1.235777830669e-02
2000.00000  2050.00000  1.172935576407e-02
2050.00000  2100.00000  1.107361050220e-02
2100.00000  2150.00000  1.053506532551e-02
2150.00000  2200.00000  1.019676692013e-02
2200.00000  2250.00000  9.674759178777e-03
2250.00000  2300.00000  9.332865678758e-03
2300.00000  2350.00000  8.954661722901e-03
2350.00000  2400.00000  8.468604927921e-03
2400.00000  2450.00000  8.091479500455e-03
2450.00000  2500.00000  7.810343099808e-03
2500.00000  2550.00000  7.429982087168e-03
2550.00000  2600.00000  7.236206486211e-03
2600.00000  2650.00000  6.977359672317e-03
2650.00000  2700.00000  6.769922711737e-03
2700.00000  2750.00000  6.413648833168e-03
2750.00000  2800.00000  6.154802019273e-03
2800.00000  2850.00000  5.881934336293e-03
2850.00000  2900.00000  5.843107314209e-03
2900.00000  2950.00000  5.560532875707e-03
2950.00000  3000.00000  5.447646904092e-03
3000.00000  3050.00000  5.177655296821e-03
3050.00000  3100.00000  5.036008568106e-03
3100.00000  3150.00000  4.907304180087e-03
3150.00000  3200.00000  4.746243940330e-03
3200.00000  3250.00000  4.616461023919e-03
3250.00000  3300.00000  4.442098934004e-03
3300.00000  3350.00000  4.334246094881e-03
3350.00000  3400.00000  4.231426388250e-03
3400.00000  3450.00000  4.088341621681e-03
3450.00000  3500.00000  3.932674023880e-03
3500.00000  3550.00000  3.832011374032e-03
3550.00000  3600.00000  3.762626047530e-03
3600.00000  3650.00000  3.594016109035e-03
3650.00000  3700.00000  3.532539990735e-03
3700.00000  3750.00000  3.450212323538e-03
3750.00000  3800.00000  3.284837970216e-03
3800.00000  3850.00000  3.301015896085e-03
3850.00000  3900.00000  3.139236637400e-03
3900.00000  3950.00000  3.136001052227e-03
3950.00000  4000.00000  3.010532249381e-03
4000.00000  4050.00000  2.941865941806e-03
4050.00000  4100.00000  2.862773859782e-03
4100.00000  4150.00000  2.780805702049e-03
4150.00000  4200.00000  2.768941889746e-03
4200.00000  4250.00000  2.665762673651e-03
4250.00000  4300.00000  2.624059575857e-03
4300.00000  4350.00000  2.552517192573e-03
4350.00000  4400.00000  2.478098733578e-03
4400.00000  4450.00000  2.392535481207e-03
4450.00000  4500.00000  2.378155102657e-03
4500.00000  4550.00000  2.361617667325e-03
4550.00000  4600.00000  2.220330448074e-03
4600.00000  4650.00000  2.234710826624e-03
4650.00000  4700.00000  2.146990517471e-03
4700.00000  4750.00000  2.126857987501e-03
4750.00000  4800.00000  2.114994175198e-03
4800.00000  4850.00000  1.995277523771e-03
4850.00000  4900.00000  2.007860355002e-03
4900.00000  4950.00000  1.955012463832e-03
4950.00000  5000.00000  1.891019779286e-03
5000.00000  5050.00000  1.902524082126e-03
5050.00000  5100.00000  1.882751061620e-03
5100.00000  5150.00000  1.743620899152e-03
5150.00000  5200.00000  1.788200072656e-03
5200.00000  5250.00000  1.722050331327e-03
5250.00000  5300.00000  1.704793877067e-03
5300.00000  5350.00000  1.633611003246e-03
5350.00000  5400.00000  1.651945985897e-03
5400.00000  5450.00000  1.586155754032e-03
5450.00000  5500.00000  1.578965564758e-03
5500.00000  5550.00000  1.558473525324e-03
5550.00000  5600.00000  1.511737295038e-03
5600.00000  5650.00000  1.525039145196e-03
5650.00000  5700.00000  1.450620686201e-03
5700.00000  5750.00000  1.456013328158e-03
5750.00000  5800.00000  1.425455023739e-03
5800.00000  5850.00000  1.349239017426e-03
5850.00000  5900.00000  1.361102829730e-03
5900.00000  5950.00000  1.345284413325e-03
5950.00000  6000.00000  1.312569052124e-03
6000.00000  6050.00000  1.332342072630e-03
6050.00000  6100.00000  1.282729766634e-03
6100.00000  6150.00000  1.234915007956e-03
6150.00000  6200.00000  1.223051195652e-03
6200.00000  6250.00000  1.204356703538e-03
6250.00000  6300.00000  1.209749345494e-03
6300.00000  6350.00000  1.176674474830e-03
6350.00000  6400.00000  1.273382520576e-03
6400.00000  6450.00000  1.156541944860e-03
6450.00000  6500.00000  1.113400809211e-03
6500.00000  6550.00000  1.096503864415e-03
6550.00000  6600.00000  1.109446205110e-03
6600.00000  6650.00000  1.085718580503e-03
6650.00000  6700.00000  1.035387255579e-03
6700.00000  6750.00000  1.041139406999e-03
6750.00000  6800.00000  1.034308727187e-03
6800.00000  6850.00000  9.821798549448e-04
6850.00000  6900.00000  1.020647367565e-03
6900.00000  6950.00000  9.839774022635e-04
6950.00000  7000.00000  9.800227981623e-04
7000.00000  7050.00000  9.185466798624e-04
7050.00000  7100.00000  9.807418170898e-04
7100.00000  7150.00000  8.944595457916e-04
7150.00000  7200.00000  9.257368691372e-04
7200.00000  7250.00000  8.969761120378e-04
7250.00000  7300.00000  8.520374290700e-04
7300.00000  7350.00000  8.811576956331e-04
7350.00000  7400.00000  8.505993912150e-04
7400.00000  7450.00000  8.351404842741e-04
7450.00000  7500.00000  8.160864826957e-04
7500.00000  7550.00000  8.333429369554e-04
7550.00000  7600.00000  7.963134621899e-04
7600.00000  7650.00000  7.546103643957e-04
7650.00000  7700.00000  7.668336861630e-04
7700.00000  7750.00000  7.524533076133e-04
7750.00000  7800.00000  7.711477997279e-04
7800.00000  7850.00000  7.531723265408e-04
7850.00000  7900.00000  7.200974558764e-04
7900.00000  7950.00000  7.477796845846e-04
7950.00000  8000.00000  7.409490047735e-04
8000.00000  8050.00000  7.319612681799e-04
8050.00000  8100.00000  7.010434542981e-04
8100.00000  8150.00000  7.003244353706e-04
8150.00000  8200.00000  6.992459069794e-04
8200.00000  8250.00000  6.733612255899e-04
8250.00000  8300.00000  6.841465095022e-04
8300.00000  8350.00000  6.420839022443e-04
8350.00000  8400.00000  6.413648833168e-04
8400.00000  8450.00000  6.478360536642e-04
8450.00000  8500.00000  6.255464669121e-04
8500.00000  8550.00000  6.316581277958e-04
8550.00000  8600.00000  6.341746940420e-04
8600.00000  8650.00000  6.158397113911e-04
8650.00000  8700.00000  6.323771467232e-04
8700.00000  8750.00000  6.165587303186e-04
8750.00000  8800.00000  6.018188423051e-04
8800.00000  8850.00000  5.849218975092e-04
8850.00000  8900.00000  5.881574826829e-04
8900.00000  8950.00000  5.665869148583e-04
8950.00000  9000.00000  5.978642382040e-04
9000.00000  9050.00000  5.827648407268e-04
9050.00000  9100.00000  5.540040836274e-04
9100.00000  9150.00000  5.478924227437e-04
9150.00000  9200.00000  5.331525347303e-04
9200.00000  9250.00000  5.176936277894e-04
9250.00000  9300.00000  5.299169495566e-04
9300.00000  9350.00000  5.256028359917e-04
9350.00000  9400.00000  5.040322681671e-04
9400.00000  9450.00000  4.979206072835e-04
9450.00000  9500.00000  5.407022334689e-04
9500.00000  9550.00000  5.072678533408e-04
9550.00000  9600.00000  5.011561924572e-04
9600.00000  9650.00000  4.896518896174e-04
9650.00000  9700.00000  4.907304180087e-04
9700.00000  9750.00000  4.896518896174e-04
9750.00000  9800.00000  4.781475867777e-04
9800.00000  9850.00000  4.684408312566e-04
9850.00000  9900.00000  4.594530946631e-04
9900.00000  9950.00000  4.504653580695e-04
9950.00000  10000.00000  4.382420363022e-04
