10001.00000  11001.00000  3.234890191601e-04
11001.00000  12001.00000  2.625383165691e-04
12001.00000  13001.00000  2.075379464211e-04
13001.00000  14001.00000  1.638351669248e-04
14001.00000  15001.00000  1.414410103660e-04
15001.00000  16001.00000  1.114883234068e-04
16001.00000  17001.00000  9.645167250373e-05
17001.00000  18001.00000  7.936456920482e-05
18001.00000  19001.00000  6.842882309352e-05
19001.00000  20001.00000  5.962393927596e-05
20001.00000  21001.00000  5.190458907975e-05
21001.00000  22001.00000  4.494913291337e-05
22001.00000  23001.00000  4.020494893861e-05
23001.00000  24001.00000  3.570199465749e-05
24001.00000  25001.00000  2.930940777625e-05
25001.00000  26001.00000  2.878674344005e-05
26001.00000  27001.00000  2.641465145267e-05
27001.00000  28001.00000  1.962001508204e-05
28001.00000  29001.00000  1.970042497992e-05
29001.00000  30001.00000  1.684587360528e-05
30001.00000  31001.00000  1.535829049455e-05
31001.00000  32001.00000  1.455419151578e-05
32001.00000  33001.00000  1.387070738382e-05
33001.00000  34001.00000  1.069451641767e-05
34001.00000  35001.00000  9.810007541021e-06
35001.00000  36001.00000  7.719350196213e-06
36001.00000  37001.00000  9.005908562249e-06
37001.00000  38001.00000  8.282219481354e-06
38001.00000  39001.00000  6.955456166380e-06
39001.00000  40001.00000  6.513201728055e-06
40001.00000  41001.00000  6.553406676994e-06
41001.00000  42001.00000  5.226643362019e-06
42001.00000  43001.00000  4.945208719449e-06
43001.00000  44001.00000  5.065823566265e-06
44001.00000  45001.00000  4.703979025817e-06
45001.00000  46001.00000  4.543159230063e-06
46001.00000  47001.00000  3.698855302352e-06
47001.00000  48001.00000  3.940084995984e-06
48001.00000  49001.00000  3.578240455536e-06
49001.00000  50001.00000  2.894756323580e-06
50001.00000  51001.00000  3.658650353414e-06
51001.00000  52001.00000  2.291682089501e-06
52001.00000  53001.00000  2.050452395869e-06
53001.00000  54001.00000  2.090657344808e-06
54001.00000  55001.00000  2.372091987378e-06
55001.00000  56001.00000  1.567993008606e-06
56001.00000  57001.00000  2.130862293746e-06
57001.00000  58001.00000  1.447378161790e-06
58001.00000  59001.00000  1.809222702237e-06
59001.00000  60001.00000  1.608197957544e-06
60001.00000  61001.00000  1.407173212851e-06
61001.00000  62001.00000  8.845088766494e-07
62001.00000  63001.00000  1.045328672404e-06
63001.00000  64001.00000  1.045328672404e-06
64001.00000  65001.00000  7.236890808950e-07
65001.00000  66001.00000  5.226643362019e-07
66001.00000  67001.00000  1.085533621342e-06
67001.00000  68001.00000  4.422544383247e-07
68001.00000  69001.00000  6.030742340792e-07
69001.00000  70001.00000  1.045328672404e-06
70001.00000  71001.00000  8.040989787722e-07
71001.00000  72001.00000  7.638940298336e-07
72001.00000  73001.00000  5.628692851406e-07
73001.00000  74001.00000  4.422544383247e-07
74001.00000  75001.00000  8.040989787722e-07
75001.00000  76001.00000  5.628692851406e-07
76001.00000  77001.00000  7.236890808950e-07
77001.00000  78001.00000  4.824593872633e-07
78001.00000  79001.00000  4.422544383247e-07
79001.00000  80001.00000  4.824593872633e-07
80001.00000  81001.00000  6.834841319564e-07
81001.00000  82001.00000  4.422544383247e-07
82001.00000  83001.00000  2.412296936317e-07
83001.00000  84001.00000  2.814346425703e-07
84001.00000  85001.00000  4.020494893861e-07
85001.00000  86001.00000  2.412296936317e-07
86001.00000  87001.00000  3.216395915089e-07
87001.00000  88001.00000  3.216395915089e-07
88001.00000  89001.00000  3.216395915089e-07
89001.00000  90001.00000  1.206148468158e-07
90001.00000  91001.00000  3.216395915089e-07
91001.00000  92001.00000  0.000000000000e+00
92001.00000  93001.00000  2.010247446931e-07
93001.00000  94001.00000  2.814346425703e-07
94001.00000  95001.00000  1.608197957544e-07
95001.00000  96001.00000  2.412296936317e-07
96001.00000  97001.00000  2.412296936317e-07
97001.00000  98001.00000  2.412296936317e-07
98001.00000  99001.00000  2.814346425703e-07
99001.00000  100001.00000  1.206148468158e-07
100001.00000  101001.00000  4.020494893861e-08
101001.00000  102001.00000  2.412296936317e-07
102001.00000  103001.00000  1.608197957544e-07
103001.00000  104001.00000  1.206148468158e-07
104001.00000  105001.00000  2.412296936317e-07
105001.00000  106001.00000  1.608197957544e-07
106001.00000  107001.00000  8.040989787722e-08
107001.00000  108001.00000  8.040989787722e-08
108001.00000  109001.00000  1.608197957544e-07
109001.00000  110001.00000  8.040989787722e-08
110001.00000  111001.00000  4.020494893861e-08
111001.00000  112001.00000  1.608197957544e-07
112001.00000  113001.00000  1.206148468158e-07
113001.00000  114001.00000  2.010247446931e-07
114001.00000  115001.00000  4.020494893861e-08
115001.00000  116001.00000  4.020494893861e-08
116001.00000  117001.00000  4.020494893861e-08
117001.00000  118001.00000  4.020494893861e-08
118001.00000  119001.00000  1.608197957544e-07
119001.00000  120001.00000  1.206148468158e-07
120001.00000  121001.00000  1.206148468158e-07
121001.00000  122001.00000  1.206148468158e-07
122001.00000  123001.00000  1.206148468158e-07
123001.00000  124001.00000  8.040989787722e-08
124001.00000  125001.00000  1.608197957544e-07
125001.00000  126001.00000  8.040989787722e-08
126001.00000  127001.00000  4.020494893861e-08
127001.00000  128001.00000  4.020494893861e-08
128001.00000  129001.00000  8.040989787722e-08
129001.00000  130001.00000  8.040989787722e-08
130001.00000  131001.00000  4.020494893861e-08
131001.00000  132001.00000  4.020494893861e-08
132001.00000  133001.00000  4.020494893861e-08
133001.00000  134001.00000  0.000000000000e+00
134001.00000  135001.00000  0.000000000000e+00
135001.00000  136001.00000  1.206148468158e-07
136001.00000  137001.00000  4.020494893861e-08
137001.00000  138001.00000  1.206148468158e-07
138001.00000  139001.00000  0.000000000000e+00
139001.00000  140001.00000  0.000000000000e+00
140001.00000  141001.00000  0.000000000000e+00
141001.00000  142001.00000  0.000000000000e+00
142001.00000  143001.00000  4.020494893861e-08
143001.00000  144001.00000  0.000000000000e+00
144001.00000  145001.00000  0.000000000000e+00
145001.00000  146001.00000  0.000000000000e+00
146001.00000  147001.00000  4.020494893861e-08
147001.00000  148001.00000  4.020494893861e-08
148001.00000  149001.00000  0.000000000000e+00
149001.00000  150001.00000  0.000000000000e+00
150001.00000  151001.00000  0.000000000000e+00
151001.00000  152001.00000  0.000000000000e+00
152001.00000  153001.00000  0.000000000000e+00
153001.00000  154001.00000  0.000000000000e+00
154001.00000  155001.00000  0.000000000000e+00
155001.00000  156001.00000  4.020494893861e-08
156001.00000  157001.00000  0.000000000000e+00
157001.00000  158001.00000  0.000000000000e+00
158001.00000  159001.00000  0.000000000000e+00
159001.00000  160001.00000  4.020494893861e-08
160001.00000  161001.00000  0.000000000000e+00
161001.00000  162001.00000  0.000000000000e+00
162001.00000  163001.00000  0.000000000000e+00
163001.00000  164001.00000  4.020494893861e-08
164001.00000  165001.00000  0.000000000000e+00
165001.00000  166001.00000  0.000000000000e+00
166001.00000  167001.00000  0.000000000000e+00
167001.00000  168001.00000  0.000000000000e+00
168001.00000  169001.00000  0.000000000000e+00
169001.00000  170001.00000  0.000000000000e+00
170001.00000  171001.00000  4.020494893861e-08
171001.00000  172001.00000  0.000000000000e+00
172001.00000  173001.00000  0.000000000000e+00
173001.00000  174001.00000  0.000000000000e+00
174001.00000  175001.00000  0.000000000000e+00
175001.00000  176001.00000  0.000000000000e+00
176001.00000  177001.00000  0.000000000000e+00
177001.00000  178001.00000  0.000000000000e+00
178001.00000  179001.00000  0.000000000000e+00
179001.00000  180001.00000  0.000000000000e+00
180001.00000  181001.00000  0.000000000000e+00
181001.00000  182001.00000  0.000000000000e+00
182001.00000  183001.00000  0.000000000000e+00
183001.00000  184001.00000  0.000000000000e+00
184001.00000  185001.00000  0.000000000000e+00
185001.00000  186001.00000  0.000000000000e+00
186001.00000  187001.00000  0.000000000000e+00
187001.00000  188001.00000  0.000000000000e+00
188001.00000  189001.00000  0.000000000000e+00
189001.00000  190001.00000  0.000000000000e+00
190001.00000  191001.00000  0.000000000000e+00
191001.00000  192001.00000  0.000000000000e+00
192001.00000  193001.00000  4.020494893861e-08
193001.00000  194001.00000  0.000000000000e+00
194001.00000  195001.00000  0.000000000000e+00
195001.00000  196001.00000  0.000000000000e+00
196001.00000  197001.00000  0.000000000000e+00
197001.00000  198001.00000  0.000000000000e+00
198001.00000  199001.00000  0.000000000000e+00
