10001.00000  11001.00000  2.967987204186e-05
11001.00000  12001.00000  3.269003994274e-05
12001.00000  13001.00000  3.583441915131e-05
13001.00000  14001.00000  3.671637917323e-05
14001.00000  15001.00000  3.700397483255e-05
15001.00000  16001.00000  3.788593485446e-05
16001.00000  17001.00000  3.616036089854e-05
17001.00000  18001.00000  3.646712960181e-05
18001.00000  19001.00000  3.343778865697e-05
19001.00000  20001.00000  3.307350082183e-05
20001.00000  21001.00000  2.954566073417e-05
21001.00000  22001.00000  2.697647284424e-05
22001.00000  23001.00000  2.379374754777e-05
23001.00000  24001.00000  2.344863275658e-05
24001.00000  25001.00000  2.063019529524e-05
25001.00000  26001.00000  1.917304395469e-05
26001.00000  27001.00000  1.669972128453e-05
27001.00000  28001.00000  1.503166646047e-05
28001.00000  29001.00000  1.321022728478e-05
29001.00000  30001.00000  1.238578639473e-05
30001.00000  31001.00000  1.069855852672e-05
31001.00000  32001.00000  1.000832894435e-05
32001.00000  33001.00000  9.203061098250e-06
33001.00000  34001.00000  8.685388911473e-06
34001.00000  35001.00000  7.592525406056e-06
35001.00000  36001.00000  6.384623636911e-06
36001.00000  37001.00000  6.135374065500e-06
37001.00000  38001.00000  5.790259274315e-06
38001.00000  39001.00000  5.023337516128e-06
39001.00000  40001.00000  4.965818384264e-06
40001.00000  41001.00000  4.486492285397e-06
41001.00000  42001.00000  4.179723582122e-06
42001.00000  43001.00000  3.662051395345e-06
43001.00000  44001.00000  3.259417472297e-06
44001.00000  45001.00000  2.780091373430e-06
45001.00000  46001.00000  2.780091373430e-06
46001.00000  47001.00000  2.300765274562e-06
47001.00000  48001.00000  2.607533977837e-06
48001.00000  49001.00000  2.454149626200e-06
49001.00000  50001.00000  2.396630494336e-06
50001.00000  51001.00000  1.706400911967e-06
51001.00000  52001.00000  1.821439175695e-06
52001.00000  53001.00000  1.783093087786e-06
53001.00000  54001.00000  1.591362648239e-06
54001.00000  55001.00000  1.572189604284e-06
55001.00000  56001.00000  1.246247857055e-06
56001.00000  57001.00000  9.778252416890e-07
57001.00000  58001.00000  9.011330658703e-07
58001.00000  59001.00000  1.265420901009e-06
59001.00000  60001.00000  1.016171329598e-06
60001.00000  61001.00000  1.092863505417e-06
61001.00000  62001.00000  9.203061098250e-07
62001.00000  63001.00000  9.011330658703e-07
63001.00000  64001.00000  7.477487142328e-07
64001.00000  65001.00000  7.860948021422e-07
65001.00000  66001.00000  7.094026263234e-07
66001.00000  67001.00000  6.710565384140e-07
67001.00000  68001.00000  6.518834944594e-07
68001.00000  69001.00000  4.218069670031e-07
69001.00000  70001.00000  4.026339230484e-07
70001.00000  71001.00000  3.834608790937e-07
71001.00000  72001.00000  4.793260988672e-07
72001.00000  73001.00000  4.984991428219e-07
73001.00000  74001.00000  4.601530549125e-07
74001.00000  75001.00000  4.601530549125e-07
75001.00000  76001.00000  4.601530549125e-07
76001.00000  77001.00000  4.601530549125e-07
77001.00000  78001.00000  2.492495714109e-07
78001.00000  79001.00000  3.834608790937e-07
79001.00000  80001.00000  3.067687032750e-07
80001.00000  81001.00000  2.875956593203e-07
81001.00000  82001.00000  2.492495714109e-07
82001.00000  83001.00000  3.067687032750e-07
83001.00000  84001.00000  2.300765274562e-07
84001.00000  85001.00000  2.109034835016e-07
85001.00000  86001.00000  1.917304395469e-07
86001.00000  87001.00000  1.725573955922e-07
87001.00000  88001.00000  2.109034835016e-07
88001.00000  89001.00000  1.342113076828e-07
89001.00000  90001.00000  2.684226153656e-07
90001.00000  91001.00000  1.150382637281e-07
91001.00000  92001.00000  1.533843516375e-07
92001.00000  93001.00000  1.533843516375e-07
93001.00000  94001.00000  5.751913186406e-08
94001.00000  95001.00000  1.533843516375e-07
95001.00000  96001.00000  1.725573955922e-07
96001.00000  97001.00000  2.109034835016e-07
97001.00000  98001.00000  1.533843516375e-07
98001.00000  99001.00000  1.725573955922e-07
99001.00000  100001.00000  7.669217581875e-08
100001.00000  101001.00000  9.586521977343e-08
101001.00000  102001.00000  1.917304395469e-08
102001.00000  103001.00000  1.917304395469e-08
103001.00000  104001.00000  9.586521977343e-08
104001.00000  105001.00000  3.834608790937e-08
105001.00000  106001.00000  7.669217581875e-08
106001.00000  107001.00000  9.586521977343e-08
107001.00000  108001.00000  1.917304395469e-08
108001.00000  109001.00000  3.834608790937e-08
109001.00000  110001.00000  7.669217581875e-08
110001.00000  111001.00000  3.834608790937e-08
111001.00000  112001.00000  5.751913186406e-08
112001.00000  113001.00000  1.917304395469e-08
113001.00000  114001.00000  9.586521977343e-08
114001.00000  115001.00000  3.834608790937e-08
115001.00000  116001.00000  1.917304395469e-08
116001.00000  117001.00000  9.586521977343e-08
117001.00000  118001.00000  1.150382637281e-07
118001.00000  119001.00000  7.669217581875e-08
119001.00000  120001.00000  5.751913186406e-08
120001.00000  121001.00000  3.834608790937e-08
121001.00000  122001.00000  0.000000000000e+00
122001.00000  123001.00000  5.751913186406e-08
123001.00000  124001.00000  3.834608790937e-08
124001.00000  125001.00000  1.917304395469e-08
125001.00000  126001.00000  0.000000000000e+00
126001.00000  127001.00000  1.917304395469e-08
127001.00000  128001.00000  5.751913186406e-08
128001.00000  129001.00000  5.751913186406e-08
129001.00000  130001.00000  3.834608790937e-08
130001.00000  131001.00000  1.917304395469e-08
131001.00000  132001.00000  0.000000000000e+00
132001.00000  133001.00000  3.834608790937e-08
133001.00000  134001.00000  3.834608790937e-08
134001.00000  135001.00000  3.834608790937e-08
135001.00000  136001.00000  1.917304395469e-08
136001.00000  137001.00000  0.000000000000e+00
137001.00000  138001.00000  0.000000000000e+00
138001.00000  139001.00000  1.917304395469e-08
139001.00000  140001.00000  1.917304395469e-08
140001.00000  141001.00000  0.000000000000e+00
141001.00000  142001.00000  3.834608790937e-08
142001.00000  143001.00000  1.917304395469e-08
143001.00000  144001.00000  1.917304395469e-08
144001.00000  145001.00000  3.834608790937e-08
145001.00000  146001.00000  0.000000000000e+00
146001.00000  147001.00000  1.917304395469e-08
147001.00000  148001.00000  3.834608790937e-08
148001.00000  149001.00000  1.917304395469e-08
149001.00000  150001.00000  0.000000000000e+00
150001.00000  151001.00000  0.000000000000e+00
151001.00000  152001.00000  0.000000000000e+00
152001.00000  153001.00000  0.000000000000e+00
153001.00000  154001.00000  1.917304395469e-08
154001.00000  155001.00000  0.000000000000e+00
155001.00000  156001.00000  1.917304395469e-08
156001.00000  157001.00000  0.000000000000e+00
157001.00000  158001.00000  0.000000000000e+00
158001.00000  159001.00000  0.000000000000e+00
159001.00000  160001.00000  0.000000000000e+00
160001.00000  161001.00000  0.000000000000e+00
161001.00000  162001.00000  0.000000000000e+00
162001.00000  163001.00000  0.000000000000e+00
163001.00000  164001.00000  0.000000000000e+00
164001.00000  165001.00000  0.000000000000e+00
165001.00000  166001.00000  0.000000000000e+00
166001.00000  167001.00000  0.000000000000e+00
167001.00000  168001.00000  0.000000000000e+00
168001.00000  169001.00000  0.000000000000e+00
169001.00000  170001.00000  0.000000000000e+00
170001.00000  171001.00000  0.000000000000e+00
171001.00000  172001.00000  0.000000000000e+00
172001.00000  173001.00000  0.000000000000e+00
173001.00000  174001.00000  0.000000000000e+00
174001.00000  175001.00000  0.000000000000e+00
175001.00000  176001.00000  0.000000000000e+00
176001.00000  177001.00000  0.000000000000e+00
177001.00000  178001.00000  0.000000000000e+00
178001.00000  179001.00000  1.917304395469e-08
179001.00000  180001.00000  0.000000000000e+00
180001.00000  181001.00000  0.000000000000e+00
181001.00000  182001.00000  0.000000000000e+00
182001.00000  183001.00000  0.000000000000e+00
183001.00000  184001.00000  1.917304395469e-08
184001.00000  185001.00000  0.000000000000e+00
185001.00000  186001.00000  0.000000000000e+00
186001.00000  187001.00000  0.000000000000e+00
187001.00000  188001.00000  0.000000000000e+00
188001.00000  189001.00000  0.000000000000e+00
189001.00000  190001.00000  0.000000000000e+00
190001.00000  191001.00000  0.000000000000e+00
191001.00000  192001.00000  0.000000000000e+00
192001.00000  193001.00000  0.000000000000e+00
193001.00000  194001.00000  0.000000000000e+00
194001.00000  195001.00000  0.000000000000e+00
195001.00000  196001.00000  0.000000000000e+00
196001.00000  197001.00000  0.000000000000e+00
197001.00000  198001.00000  0.000000000000e+00
198001.00000  199001.00000  0.000000000000e+00
