300.00000  350.00000  1.795231809715e-01
350.00000  400.00000  1.268169071104e-01
400.00000  450.00000  9.345599038713e-02
450.00000  500.00000  7.198738056584e-02
500.00000  550.00000  5.655158757038e-02
550.00000  600.00000  4.522109840871e-02
600.00000  650.00000  3.687227760022e-02
650.00000  700.00000  3.063475590625e-02
700.00000  750.00000  2.589964840878e-02
750.00000  800.00000  2.216266391803e-02
800.00000  850.00000  1.903531144337e-02
850.00000  900.00000  1.657511753532e-02
900.00000  950.00000  1.441600414503e-02
950.00000  1000.00000  1.268348374638e-02
1000.00000  1050.00000  1.124307868877e-02
1050.00000  1100.00000  1.003875661778e-02
1100.00000  1150.00000  9.026438747940e-03
1150.00000  1200.00000  8.087336487870e-03
1200.00000  1250.00000  7.264034426934e-03
1250.00000  1300.00000  6.668597273970e-03
1300.00000  1350.00000  6.101549847246e-03
1350.00000  1400.00000  5.526284341873e-03
1400.00000  1450.00000  4.978661464680e-03
1450.00000  1500.00000  4.720165536292e-03
1500.00000  1550.00000  4.283113171821e-03
1550.00000  1600.00000  4.035823714316e-03
1600.00000  1650.00000  3.663021782912e-03
1650.00000  1700.00000  3.428432992410e-03
1700.00000  1750.00000  3.242405575737e-03
1750.00000  1800.00000  2.957761215287e-03
1800.00000  1850.00000  2.791905446205e-03
1850.00000  1900.00000  2.593924460590e-03
1900.00000  1950.00000  2.440769358510e-03
1950.00000  2000.00000  2.366806650676e-03
2000.00000  2050.00000  2.174802449533e-03
2050.00000  2100.00000  2.070955819342e-03
2100.00000  2150.00000  1.910329736673e-03
2150.00000  2200.00000  1.872227735668e-03
2200.00000  2250.00000  1.763898517123e-03
2250.00000  2300.00000  1.645857023813e-03
2300.00000  2350.00000  1.556952354801e-03
2350.00000  2400.00000  1.545745883917e-03
2400.00000  2450.00000  1.397820468250e-03
2450.00000  2500.00000  1.286502857470e-03
2500.00000  2550.00000  1.263342817643e-03
2550.00000  2600.00000  1.201333678752e-03
2600.00000  2650.00000  1.169955560278e-03
2650.00000  2700.00000  1.064614733969e-03
2700.00000  2750.00000  1.094498656326e-03
2750.00000  2800.00000  1.039213399966e-03
2800.00000  2850.00000  9.637564960141e-04
2850.00000  2900.00000  9.435848484231e-04
2900.00000  2950.00000  9.749629668980e-04
2950.00000  3000.00000  8.793344153555e-04
3000.00000  3050.00000  7.852000599308e-04
3050.00000  3100.00000  7.695110006934e-04
3100.00000  3150.00000  7.366386861007e-04
3150.00000  3200.00000  7.112373520972e-04
3200.00000  3250.00000  7.089960579204e-04
3250.00000  3300.00000  6.716411549742e-04
3300.00000  3350.00000  6.858360180937e-04
3350.00000  3400.00000  6.223326830851e-04
3400.00000  3450.00000  6.066436238476e-04
3450.00000  3500.00000  6.425043306761e-04
3500.00000  3550.00000  6.103791141422e-04
3550.00000  3600.00000  5.394047985443e-04
3600.00000  3650.00000  5.281983276604e-04
3650.00000  3700.00000  5.169918567765e-04
3700.00000  3750.00000  5.252099354247e-04
3750.00000  3800.00000  4.893492285963e-04
3800.00000  3850.00000  4.691775810053e-04
3850.00000  3900.00000  4.579711101214e-04
3900.00000  3950.00000  4.340639722358e-04
3950.00000  4000.00000  4.318226780590e-04
4000.00000  4050.00000  4.183749129984e-04
4050.00000  4100.00000  4.101568343502e-04
4100.00000  4150.00000  3.937206770538e-04
4150.00000  4200.00000  3.720548333450e-04
4200.00000  4250.00000  3.780316178164e-04
4250.00000  4300.00000  3.541244799308e-04
4300.00000  4350.00000  3.406767148701e-04
4350.00000  4400.00000  3.376883226344e-04
4400.00000  4450.00000  3.481476954593e-04
4450.00000  4500.00000  3.182637731023e-04
4500.00000  4550.00000  2.861385565685e-04
4550.00000  4600.00000  3.145282828077e-04
4600.00000  4650.00000  2.913682429810e-04
4650.00000  4700.00000  2.973450274524e-04
4700.00000  4750.00000  2.936095371578e-04
4750.00000  4800.00000  2.898740468631e-04
4800.00000  4850.00000  2.562546342115e-04
4850.00000  4900.00000  2.465423594455e-04
4900.00000  4950.00000  2.562546342115e-04
4950.00000  5000.00000  2.301062021491e-04
5000.00000  5050.00000  2.450481633276e-04
5050.00000  5100.00000  2.308533002080e-04
5100.00000  5150.00000  2.316003982669e-04
5150.00000  5200.00000  2.532662419758e-04
5200.00000  5250.00000  2.256236137955e-04
5250.00000  5300.00000  2.248765157366e-04
5300.00000  5350.00000  2.338416924437e-04
5350.00000  5400.00000  2.271178099134e-04
5400.00000  5450.00000  2.233823196188e-04
5450.00000  5500.00000  1.800506322011e-04
5500.00000  5550.00000  1.882687108493e-04
5550.00000  5600.00000  1.800506322011e-04
5600.00000  5650.00000  2.032106720278e-04
5650.00000  5700.00000  1.703383574350e-04
5700.00000  5750.00000  1.927512992028e-04
5750.00000  5800.00000  1.628673768458e-04
5800.00000  5850.00000  1.725796516118e-04
5850.00000  5900.00000  1.733267496707e-04
5900.00000  5950.00000  1.755680438475e-04
5950.00000  6000.00000  1.539022001387e-04
6000.00000  6050.00000  1.553963962565e-04
6050.00000  6100.00000  1.509138079030e-04
6100.00000  6150.00000  1.628673768458e-04
6150.00000  6200.00000  1.524080040208e-04
6200.00000  6250.00000  1.419486311959e-04
6250.00000  6300.00000  1.486725137262e-04
6300.00000  6350.00000  1.322363564298e-04
6350.00000  6400.00000  1.800506322011e-04
6400.00000  6450.00000  1.352247486655e-04
6450.00000  6500.00000  1.449370234316e-04
6500.00000  6550.00000  1.255124738995e-04
6550.00000  6600.00000  1.397073370191e-04
6600.00000  6650.00000  1.187885913692e-04
6650.00000  6700.00000  1.180414933103e-04
6700.00000  6750.00000  1.307421603120e-04
6750.00000  6800.00000  1.210298855460e-04
6800.00000  6850.00000  1.374660428423e-04
6850.00000  6900.00000  1.135589049567e-04
6900.00000  6950.00000  1.262595719584e-04
6950.00000  7000.00000  1.150531010745e-04
7000.00000  7050.00000  9.786984571926e-05
7050.00000  7100.00000  1.292479641941e-04
7100.00000  7150.00000  1.038466301907e-04
7150.00000  7200.00000  9.264015930678e-05
7200.00000  7250.00000  1.016053360139e-04
7250.00000  7300.00000  9.637564960141e-05
7300.00000  7350.00000  1.172943952513e-04
7350.00000  7400.00000  8.367498259967e-05
7400.00000  7450.00000  1.060879243674e-04
7450.00000  7500.00000  1.023524340728e-04
7500.00000  7550.00000  7.844529618719e-05
7550.00000  7600.00000  8.666337483537e-05
7600.00000  7650.00000  8.666337483537e-05
7650.00000  7700.00000  1.023524340728e-04
7700.00000  7750.00000  8.516917871752e-05
7750.00000  7800.00000  8.292788454075e-05
7800.00000  7850.00000  1.075821204853e-04
7850.00000  7900.00000  1.135589049567e-04
7900.00000  7950.00000  8.741047289430e-05
7950.00000  8000.00000  7.022721753901e-05
8000.00000  8050.00000  7.545690395149e-05
8050.00000  8100.00000  7.022721753901e-05
8100.00000  8150.00000  8.143368842290e-05
8150.00000  8200.00000  6.350333500868e-05
8200.00000  8250.00000  7.022721753901e-05
8250.00000  8300.00000  6.499753112653e-05
8300.00000  8350.00000  7.246851171579e-05
8350.00000  8400.00000  7.321560977471e-05
8400.00000  8450.00000  7.246851171579e-05
8450.00000  8500.00000  7.321560977471e-05
8500.00000  8550.00000  6.723882530331e-05
8550.00000  8600.00000  6.574462918546e-05
8600.00000  8650.00000  6.425043306761e-05
8650.00000  8700.00000  6.723882530331e-05
8700.00000  8750.00000  7.620400201042e-05
8750.00000  8800.00000  6.051494277298e-05
8800.00000  8850.00000  5.902074665513e-05
8850.00000  8900.00000  7.470980589256e-05
8900.00000  8950.00000  6.051494277298e-05
8950.00000  9000.00000  7.321560977471e-05
9000.00000  9050.00000  6.723882530331e-05
9050.00000  9100.00000  6.873302142116e-05
9100.00000  9150.00000  6.350333500868e-05
9150.00000  9200.00000  5.752655053727e-05
9200.00000  9250.00000  5.229686412479e-05
9250.00000  9300.00000  5.453815830157e-05
9300.00000  9350.00000  5.752655053727e-05
9350.00000  9400.00000  5.827364859620e-05
9400.00000  9450.00000  7.246851171579e-05
9450.00000  9500.00000  6.200913889083e-05
9500.00000  9550.00000  4.706717771232e-05
9550.00000  9600.00000  4.632007965339e-05
9600.00000  9650.00000  6.200913889083e-05
9650.00000  9700.00000  5.827364859620e-05
9700.00000  9750.00000  4.183749129984e-05
9750.00000  9800.00000  5.005556994802e-05
9800.00000  9850.00000  4.034329518198e-05
9850.00000  9900.00000  4.333168741769e-05
9900.00000  9950.00000  4.632007965339e-05
9950.00000  10000.00000  4.109039324091e-05
