300.00000  350.00000  7.458355276036e-02
350.00000  400.00000  5.594434790789e-02
400.00000  450.00000  4.332157269485e-02
450.00000  500.00000  3.488702239224e-02
500.00000  550.00000  2.863712149185e-02
550.00000  600.00000  2.358523113819e-02
600.00000  650.00000  2.034407972452e-02
650.00000  700.00000  1.772991449106e-02
700.00000  750.00000  1.570388296843e-02
750.00000  800.00000  1.419540911133e-02
800.00000  850.00000  1.308187595216e-02
850.00000  900.00000  1.181008135808e-02
900.00000  950.00000  1.098990216498e-02
950.00000  1000.00000  1.039784756275e-02
1000.00000  1050.00000  1.001324376034e-02
1050.00000  1100.00000  9.694582222470e-03
1100.00000  1150.00000  9.236907262045e-03
1150.00000  1200.00000  8.867630580580e-03
1200.00000  1250.00000  8.527582362320e-03
1250.00000  1300.00000  8.243852402430e-03
1300.00000  1350.00000  7.693501826965e-03
1350.00000  1400.00000  7.461456344693e-03
1400.00000  1450.00000  7.122121015780e-03
1450.00000  1500.00000  6.922511998772e-03
1500.00000  1550.00000  6.508323288480e-03
1550.00000  1600.00000  6.331170285885e-03
1600.00000  1650.00000  6.111600367177e-03
1650.00000  1700.00000  5.864227763956e-03
1700.00000  1750.00000  5.617568050082e-03
1750.00000  1800.00000  5.331342977479e-03
1800.00000  1850.00000  5.157754421617e-03
1850.00000  1900.00000  4.867964902282e-03
1900.00000  1950.00000  4.720040362892e-03
1950.00000  2000.00000  4.595284727262e-03
2000.00000  2050.00000  4.368229470416e-03
2050.00000  2100.00000  4.168620453408e-03
2100.00000  2150.00000  4.068103055557e-03
2150.00000  2200.00000  3.936931415809e-03
2200.00000  2250.00000  3.729124171317e-03
2250.00000  2300.00000  3.544842275258e-03
2300.00000  2350.00000  3.507415584569e-03
2350.00000  2400.00000  3.359491045179e-03
2400.00000  2450.00000  3.231527407490e-03
2450.00000  2500.00000  3.091444650911e-03
2500.00000  2550.00000  3.043681064699e-03
2550.00000  2600.00000  2.931400992632e-03
2600.00000  2650.00000  2.850844496482e-03
2650.00000  2700.00000  2.750683543305e-03
2700.00000  2750.00000  2.581728768194e-03
2750.00000  2800.00000  2.501885161391e-03
2800.00000  2850.00000  2.433091339458e-03
2850.00000  2900.00000  2.359663736773e-03
2900.00000  2950.00000  2.355386400694e-03
2950.00000  3000.00000  2.254869002844e-03
3000.00000  3050.00000  2.153282270974e-03
3050.00000  3100.00000  2.133677813946e-03
3100.00000  3150.00000  2.055616430509e-03
3150.00000  3200.00000  1.962584370796e-03
3200.00000  3250.00000  1.906266112426e-03
3250.00000  3300.00000  1.937276798997e-03
3300.00000  3350.00000  1.817867833466e-03
3350.00000  3400.00000  1.761193130422e-03
3400.00000  3450.00000  1.713785988883e-03
3450.00000  3500.00000  1.690973529796e-03
3500.00000  3550.00000  1.634655271426e-03
3550.00000  3600.00000  1.639645496851e-03
3600.00000  3650.00000  1.601505916816e-03
3650.00000  3700.00000  1.490651623442e-03
3700.00000  3750.00000  1.421857801509e-03
3750.00000  3800.00000  1.446452483961e-03
3800.00000  3850.00000  1.442531592556e-03
3850.00000  3900.00000  1.387282668206e-03
3900.00000  3950.00000  1.357697760328e-03
3950.00000  4000.00000  1.300666612611e-03
4000.00000  4050.00000  1.280705710910e-03
4050.00000  4100.00000  1.224031007867e-03
4100.00000  4150.00000  1.206208774205e-03
4150.00000  4200.00000  1.167356304823e-03
4200.00000  4250.00000  1.175554532308e-03
4250.00000  4300.00000  1.124226499363e-03
4300.00000  4350.00000  1.100344706257e-03
4350.00000  4400.00000  1.105691376355e-03
4400.00000  4450.00000  1.072542021745e-03
4450.00000  4500.00000  1.042600669193e-03
4500.00000  4550.00000  1.008381980564e-03
4550.00000  4600.00000  9.463606074218e-04
4600.00000  4650.00000  9.976886403667e-04
4650.00000  4700.00000  9.688166218352e-04
4700.00000  4750.00000  9.153499208509e-04
4750.00000  4800.00000  9.018050232682e-04
4800.00000  4850.00000  9.292512631068e-04
4850.00000  4900.00000  9.082210273863e-04
4900.00000  4950.00000  8.454867648981e-04
4950.00000  5000.00000  8.262387525438e-04
5000.00000  5050.00000  8.208920824453e-04
5050.00000  5100.00000  8.166147463666e-04
5100.00000  5150.00000  7.788316110044e-04
5150.00000  5200.00000  7.791880556776e-04
5200.00000  5250.00000  7.545933732248e-04
5250.00000  5300.00000  7.741978302524e-04
5300.00000  5350.00000  7.421178096618e-04
5350.00000  5400.00000  7.342760268508e-04
5400.00000  5450.00000  7.046911189728e-04
5450.00000  5500.00000  7.125329017839e-04
5500.00000  5550.00000  6.833044385791e-04
5550.00000  5600.00000  6.804528811933e-04
5600.00000  5650.00000  6.291248482484e-04
5650.00000  5700.00000  6.601355348193e-04
5700.00000  5750.00000  6.416004118114e-04
5750.00000  5800.00000  6.177186187051e-04
5800.00000  5850.00000  6.252039568429e-04
5850.00000  5900.00000  6.187879527248e-04
5900.00000  5950.00000  6.141541719728e-04
5950.00000  6000.00000  5.792225939964e-04
6000.00000  6050.00000  5.867079321342e-04
6050.00000  6100.00000  5.685292537995e-04
6100.00000  6150.00000  5.671034751066e-04
6150.00000  6200.00000  5.368056778822e-04
6200.00000  6250.00000  5.296767844176e-04
6250.00000  6300.00000  5.385879012483e-04
6300.00000  6350.00000  5.318154524570e-04
6350.00000  6400.00000  6.398181884452e-04
6400.00000  6450.00000  5.004483212129e-04
6450.00000  6500.00000  5.018740999058e-04
6500.00000  6550.00000  5.264687823586e-04
6550.00000  6600.00000  4.847647555908e-04
6600.00000  6650.00000  4.687247452955e-04
6650.00000  6700.00000  4.737149707207e-04
6700.00000  6750.00000  4.501896222877e-04
6750.00000  6800.00000  4.790616408192e-04
6800.00000  6850.00000  4.216740484294e-04
6850.00000  6900.00000  4.526847350003e-04
6900.00000  6950.00000  4.270207185278e-04
6950.00000  7000.00000  4.280900525475e-04
7000.00000  7050.00000  4.526847350003e-04
7050.00000  7100.00000  4.298722759136e-04
7100.00000  7150.00000  4.138322656183e-04
7150.00000  7200.00000  3.952971426105e-04
7200.00000  7250.00000  3.824651343742e-04
7250.00000  7300.00000  3.764055749293e-04
7300.00000  7350.00000  3.846038024136e-04
7350.00000  7400.00000  3.806829110081e-04
7400.00000  7450.00000  3.878118044727e-04
7450.00000  7500.00000  3.614348986537e-04
7500.00000  7550.00000  3.642864560396e-04
7550.00000  7600.00000  3.571575625750e-04
7600.00000  7650.00000  3.339886588151e-04
7650.00000  7700.00000  3.532366711695e-04
7700.00000  7750.00000  3.268597653506e-04
7750.00000  7800.00000  3.286419887167e-04
7800.00000  7850.00000  3.350579928348e-04
7850.00000  7900.00000  3.407611076065e-04
7900.00000  7950.00000  3.133148677679e-04
7950.00000  8000.00000  3.307806567561e-04
8000.00000  8050.00000  3.293548780632e-04
8050.00000  8100.00000  3.115326444017e-04
8100.00000  8150.00000  3.218695399254e-04
8150.00000  8200.00000  3.275726546970e-04
8200.00000  8250.00000  2.983441914923e-04
8250.00000  8300.00000  3.083246423427e-04
8300.00000  8350.00000  2.987006361655e-04
8350.00000  8400.00000  3.108197550553e-04
8400.00000  8450.00000  2.897895193348e-04
8450.00000  8500.00000  2.901459640080e-04
8500.00000  8550.00000  2.737495090395e-04
8550.00000  8600.00000  2.676899495946e-04
8600.00000  8650.00000  2.708979516537e-04
8650.00000  8700.00000  2.758881770789e-04
8700.00000  8750.00000  2.844428492364e-04
8750.00000  8800.00000  2.758881770789e-04
8800.00000  8850.00000  2.502241606064e-04
8850.00000  8900.00000  2.741059537128e-04
8900.00000  8950.00000  2.548579413584e-04
8950.00000  9000.00000  2.630561688427e-04
9000.00000  9050.00000  2.641255028624e-04
9050.00000  9100.00000  2.416694884490e-04
9100.00000  9150.00000  2.470161585474e-04
9150.00000  9200.00000  2.363228183505e-04
9200.00000  9250.00000  2.566401647246e-04
9250.00000  9300.00000  2.359663736773e-04
9300.00000  9350.00000  2.377485970434e-04
9350.00000  9400.00000  2.309761482521e-04
9400.00000  9450.00000  2.252730334804e-04
9450.00000  9500.00000  2.377485970434e-04
9500.00000  9550.00000  2.331148162915e-04
9550.00000  9600.00000  2.185005846891e-04
9600.00000  9650.00000  2.345405949844e-04
9650.00000  9700.00000  2.224214760946e-04
9700.00000  9750.00000  2.199263633820e-04
9750.00000  9800.00000  2.234908101143e-04
9800.00000  9850.00000  2.088765785119e-04
9850.00000  9900.00000  2.049556871064e-04
9900.00000  9950.00000  2.085201338387e-04
9950.00000  10000.00000  2.049556871064e-04
