300.00000  350.00000  2.133587425589e-01
350.00000  400.00000  1.510638161005e-01
400.00000  450.00000  1.118702816821e-01
450.00000  500.00000  8.596534984238e-02
500.00000  550.00000  6.720972460562e-02
550.00000  600.00000  5.388510738493e-02
600.00000  650.00000  4.431881814000e-02
650.00000  700.00000  3.769372465974e-02
700.00000  750.00000  3.248280612265e-02
750.00000  800.00000  2.852279615161e-02
800.00000  850.00000  2.580088954055e-02
850.00000  900.00000  2.312780277755e-02
900.00000  950.00000  2.063238824850e-02
950.00000  1000.00000  1.930304779541e-02
1000.00000  1050.00000  1.838427426130e-02
1050.00000  1100.00000  1.714457025056e-02
1100.00000  1150.00000  1.637225626065e-02
1150.00000  1200.00000  1.539986092621e-02
1200.00000  1250.00000  1.449469292353e-02
1250.00000  1300.00000  1.372958186203e-02
1300.00000  1350.00000  1.289564281800e-02
1350.00000  1400.00000  1.238103359986e-02
1400.00000  1450.00000  1.169435442541e-02
1450.00000  1500.00000  1.103328566307e-02
1500.00000  1550.00000  1.056029336459e-02
1550.00000  1600.00000  9.992062346105e-03
1600.00000  1650.00000  9.475052151825e-03
1650.00000  1700.00000  9.054081002922e-03
1700.00000  1750.00000  8.606699116541e-03
1750.00000  1800.00000  8.289770266796e-03
1800.00000  1850.00000  7.766357469491e-03
1850.00000  1900.00000  7.368595756555e-03
1900.00000  1950.00000  7.093283826474e-03
1950.00000  2000.00000  6.607486321941e-03
2000.00000  2050.00000  6.306563979760e-03
2050.00000  2100.00000  6.094477754552e-03
2100.00000  2150.00000  5.721526128338e-03
2150.00000  2200.00000  5.547855521281e-03
2200.00000  2250.00000  5.312559860108e-03
2250.00000  2300.00000  5.110077539438e-03
2300.00000  2350.00000  4.995631010363e-03
2350.00000  2400.00000  4.823561054063e-03
2400.00000  2450.00000  4.569857909192e-03
2450.00000  2500.00000  4.409792833563e-03
2500.00000  2550.00000  4.140083181129e-03
2550.00000  2600.00000  4.139282855751e-03
2600.00000  2650.00000  3.847964418107e-03
2650.00000  2700.00000  3.732717563655e-03
2700.00000  2750.00000  3.659087628866e-03
2750.00000  2800.00000  3.519030687691e-03
2800.00000  2850.00000  3.370970492735e-03
2850.00000  2900.00000  3.294939581811e-03
2900.00000  2950.00000  3.154082315258e-03
2950.00000  3000.00000  3.093257586519e-03
3000.00000  3050.00000  2.984413335092e-03
3050.00000  3100.00000  2.925189257110e-03
3100.00000  3150.00000  2.717904984171e-03
3150.00000  3200.00000  2.861163226858e-03
3200.00000  3250.00000  2.642674398625e-03
3250.00000  3300.00000  2.563442186189e-03
3300.00000  3350.00000  2.542633726358e-03
3350.00000  3400.00000  2.395373856779e-03
3400.00000  3450.00000  2.444994030224e-03
3450.00000  3500.00000  2.328146525015e-03
3500.00000  3550.00000  2.344153032578e-03
3550.00000  3600.00000  2.208898043672e-03
3600.00000  3650.00000  2.146472664177e-03
3650.00000  3700.00000  2.126464529724e-03
3700.00000  3750.00000  2.049633293422e-03
3750.00000  3800.00000  1.996011493086e-03
3800.00000  3850.00000  1.927983835944e-03
3850.00000  3900.00000  1.883165614768e-03
3900.00000  3950.00000  1.811136330736e-03
3950.00000  4000.00000  1.787926894770e-03
4000.00000  4050.00000  1.754313228888e-03
4050.00000  4100.00000  1.711095658468e-03
4100.00000  4150.00000  1.721499888384e-03
4150.00000  4200.00000  1.635865072923e-03
4200.00000  4250.00000  1.582243272587e-03
4250.00000  4300.00000  1.589446200990e-03
4300.00000  4350.00000  1.512614964689e-03
4350.00000  4400.00000  1.543027329058e-03
4400.00000  4450.00000  1.442986656790e-03
4450.00000  4500.00000  1.392566157967e-03
4500.00000  4550.00000  1.474999671916e-03
4550.00000  4600.00000  1.334142405363e-03
4600.00000  4650.00000  1.371757698136e-03
4650.00000  4700.00000  1.302129390237e-03
4700.00000  4750.00000  1.276518978137e-03
4750.00000  4800.00000  1.251708891414e-03
4800.00000  4850.00000  1.246106613767e-03
4850.00000  4900.00000  1.239704010742e-03
4900.00000  4950.00000  1.212492947885e-03
4950.00000  5000.00000  1.161272123684e-03
5000.00000  5050.00000  1.118854878643e-03
5050.00000  5100.00000  1.126057807046e-03
5100.00000  5150.00000  1.086841863517e-03
5150.00000  5200.00000  1.062832102173e-03
5200.00000  5250.00000  1.034820713938e-03
5250.00000  5300.00000  1.039622666207e-03
5300.00000  5350.00000  1.016413230241e-03
5350.00000  5400.00000  9.723953344427e-04
5400.00000  5450.00000  1.007609651081e-03
5450.00000  5500.00000  9.195738594853e-04
5500.00000  5550.00000  1.001207048056e-03
5550.00000  5600.00000  9.259764625105e-04
5600.00000  5650.00000  9.403823193170e-04
5650.00000  5700.00000  9.115706057039e-04
5700.00000  5750.00000  8.827588920908e-04
5750.00000  5800.00000  8.731549875531e-04
5800.00000  5850.00000  8.371403455367e-04
5850.00000  5900.00000  8.395413216711e-04
5900.00000  5950.00000  8.451435993181e-04
5950.00000  6000.00000  8.123302588143e-04
6000.00000  6050.00000  8.267361156208e-04
6050.00000  6100.00000  7.923221243607e-04
6100.00000  6150.00000  8.003253781421e-04
6150.00000  6200.00000  7.499048793192e-04
6200.00000  6250.00000  7.731143152853e-04
6250.00000  6300.00000  7.731143152853e-04
6300.00000  6350.00000  7.907214736044e-04
6350.00000  6400.00000  1.446988283681e-03
6400.00000  6450.00000  6.970834043618e-04
6450.00000  6500.00000  6.650703892361e-04
6500.00000  6550.00000  6.738739683957e-04
6550.00000  6600.00000  6.690720161268e-04
6600.00000  6650.00000  6.346580248667e-04
6650.00000  6700.00000  6.354583502449e-04
6700.00000  6750.00000  6.218528188164e-04
6750.00000  6800.00000  6.234534695727e-04
6800.00000  6850.00000  5.570264631869e-04
6850.00000  6900.00000  5.986433828503e-04
6900.00000  6950.00000  5.786352483968e-04
6950.00000  7000.00000  6.034453351192e-04
7000.00000  7050.00000  5.458219078929e-04
7050.00000  7100.00000  6.578674608328e-04
7100.00000  7150.00000  4.697909969694e-04
7150.00000  7200.00000  4.922001075574e-04
7200.00000  7250.00000  4.761935999946e-04
7250.00000  7300.00000  4.994030359607e-04
7300.00000  7350.00000  4.905994568011e-04
7350.00000  7400.00000  4.321757041968e-04
7400.00000  7450.00000  4.641887193224e-04
7450.00000  7500.00000  4.841968537760e-04
7500.00000  7550.00000  4.513835132722e-04
7550.00000  7600.00000  4.097665936088e-04
7600.00000  7650.00000  4.209711489028e-04
7650.00000  7700.00000  4.137682204995e-04
7700.00000  7750.00000  4.241724504153e-04
7750.00000  7800.00000  3.817552053738e-04
7800.00000  7850.00000  3.849565068864e-04
7850.00000  7900.00000  4.129678951213e-04
7900.00000  7950.00000  4.057649667181e-04
7950.00000  8000.00000  4.105669189869e-04
8000.00000  8050.00000  3.769532531049e-04
8050.00000  8100.00000  3.873574830208e-04
8100.00000  8150.00000  3.713509754580e-04
8150.00000  8200.00000  3.713509754580e-04
8200.00000  8250.00000  3.281334050383e-04
8250.00000  8300.00000  3.705506500798e-04
8300.00000  8350.00000  3.457405633574e-04
8350.00000  8400.00000  3.633477216765e-04
8400.00000  8450.00000  3.417389364667e-04
8450.00000  8500.00000  3.169288497443e-04
8500.00000  8550.00000  3.249321035257e-04
8550.00000  8600.00000  3.145278736099e-04
8600.00000  8650.00000  3.233314527694e-04
8650.00000  8700.00000  3.201301512569e-04
8700.00000  8750.00000  3.009223421814e-04
8750.00000  8800.00000  2.857161599967e-04
8800.00000  8850.00000  3.121268974754e-04
8850.00000  8900.00000  2.801138823497e-04
8900.00000  8950.00000  2.681090016776e-04
8950.00000  9000.00000  2.905181122656e-04
9000.00000  9050.00000  2.633070494088e-04
9050.00000  9100.00000  2.785132315935e-04
9100.00000  9150.00000  2.961203899126e-04
9150.00000  9200.00000  3.057242944503e-04
9200.00000  9250.00000  2.729109539465e-04
9250.00000  9300.00000  2.633070494088e-04
9300.00000  9350.00000  2.737112793246e-04
9350.00000  9400.00000  2.705099778120e-04
9400.00000  9450.00000  2.529028194929e-04
9450.00000  9500.00000  2.641073747869e-04
9500.00000  9550.00000  2.384969626864e-04
9550.00000  9600.00000  2.649077001650e-04
9600.00000  9650.00000  2.545034702492e-04
9650.00000  9700.00000  2.232907805017e-04
9700.00000  9750.00000  2.481008672241e-04
9750.00000  9800.00000  2.336950104175e-04
9800.00000  9850.00000  2.505018433585e-04
9850.00000  9900.00000  2.344953357956e-04
9900.00000  9950.00000  2.112858998295e-04
9950.00000  10000.00000  2.320943596612e-04
