300.00000  350.00000  1.957833521420e-01
350.00000  400.00000  1.383181516885e-01
400.00000  450.00000  1.022024940303e-01
450.00000  500.00000  7.780370817117e-02
500.00000  550.00000  6.115188782013e-02
550.00000  600.00000  4.901623932085e-02
600.00000  650.00000  4.008475705766e-02
650.00000  700.00000  3.349568088444e-02
700.00000  750.00000  2.797573597862e-02
750.00000  800.00000  2.385897543053e-02
800.00000  850.00000  2.059187165569e-02
850.00000  900.00000  1.774515836410e-02
900.00000  950.00000  1.557058571081e-02
950.00000  1000.00000  1.364292186342e-02
1000.00000  1050.00000  1.225506844462e-02
1050.00000  1100.00000  1.067114038583e-02
1100.00000  1150.00000  9.678663813088e-03
1150.00000  1200.00000  8.667628735322e-03
1200.00000  1250.00000  7.838951141655e-03
1250.00000  1300.00000  7.216030886240e-03
1300.00000  1350.00000  6.614089810411e-03
1350.00000  1400.00000  5.791060457402e-03
1400.00000  1450.00000  5.434414404431e-03
1450.00000  1500.00000  4.959962189166e-03
1500.00000  1550.00000  4.678357047794e-03
1550.00000  1600.00000  4.330586801571e-03
1600.00000  1650.00000  3.858555260874e-03
1650.00000  1700.00000  3.576950119501e-03
1700.00000  1750.00000  3.359089408411e-03
1750.00000  1800.00000  3.196904212376e-03
1800.00000  1850.00000  3.020194968936e-03
1850.00000  1900.00000  2.775706837601e-03
1900.00000  1950.00000  2.553004777375e-03
1950.00000  2000.00000  2.438426181171e-03
2000.00000  2050.00000  2.329495825626e-03
2050.00000  2100.00000  2.232668842919e-03
2100.00000  2150.00000  1.973656664178e-03
2150.00000  2200.00000  1.820347274892e-03
2200.00000  2250.00000  1.821961057937e-03
2250.00000  2300.00000  1.787264722467e-03
2300.00000  2350.00000  1.640410465361e-03
2350.00000  2400.00000  1.551652397880e-03
2400.00000  2450.00000  1.479839052372e-03
2450.00000  2500.00000  1.459666764308e-03
2500.00000  2550.00000  1.349929517240e-03
2550.00000  2600.00000  1.267626581939e-03
2600.00000  2650.00000  1.230509571902e-03
2650.00000  2700.00000  1.170799599232e-03
2700.00000  2750.00000  1.131261914627e-03
2750.00000  2800.00000  1.037662498010e-03
2800.00000  2850.00000  9.755318507731e-04
2850.00000  2900.00000  9.844076575212e-04
2900.00000  2950.00000  8.754773019758e-04
2950.00000  3000.00000  8.875806748142e-04
3000.00000  3050.00000  8.310982682351e-04
3050.00000  3100.00000  8.173811123516e-04
3100.00000  3150.00000  8.093121971261e-04
3150.00000  3200.00000  7.431470922763e-04
3200.00000  3250.00000  7.423402007537e-04
3250.00000  3300.00000  7.431470922763e-04
3300.00000  3350.00000  6.664923976332e-04
3350.00000  3400.00000  6.551959163174e-04
3400.00000  3450.00000  6.761750959039e-04
3450.00000  3500.00000  6.301822791181e-04
3500.00000  3550.00000  5.753136555841e-04
3550.00000  3600.00000  5.438448862044e-04
3600.00000  3650.00000  5.414242116367e-04
3650.00000  3700.00000  5.551413675202e-04
3700.00000  3750.00000  5.357759709788e-04
3750.00000  3800.00000  4.986589609411e-04
3800.00000  3850.00000  4.728384322192e-04
3850.00000  3900.00000  4.583143848132e-04
3900.00000  3950.00000  4.445972289297e-04
3950.00000  4000.00000  4.139353510725e-04
4000.00000  4050.00000  4.437903374071e-04
4050.00000  4100.00000  4.163560256401e-04
4100.00000  4150.00000  3.961837375762e-04
4150.00000  4200.00000  3.752045579896e-04
4200.00000  4250.00000  3.509978123129e-04
4250.00000  4300.00000  3.566460529708e-04
4300.00000  4350.00000  3.711701003769e-04
4350.00000  4400.00000  3.477702462227e-04
4400.00000  4450.00000  3.397013309971e-04
4450.00000  4500.00000  3.211428259782e-04
4500.00000  4550.00000  3.163014768429e-04
4550.00000  4600.00000  2.961291887789e-04
4600.00000  4650.00000  2.985498633466e-04
4650.00000  4700.00000  2.912878396436e-04
4700.00000  4750.00000  3.332461988166e-04
4750.00000  4800.00000  2.783775752826e-04
4800.00000  4850.00000  2.807982498503e-04
4850.00000  4900.00000  2.654673109217e-04
4900.00000  4950.00000  2.703086600571e-04
4950.00000  5000.00000  2.703086600571e-04
5000.00000  5050.00000  2.582052872187e-04
5050.00000  5100.00000  2.420674567675e-04
5100.00000  5150.00000  2.267365178389e-04
5150.00000  5200.00000  2.307709754517e-04
5200.00000  5250.00000  2.186676026133e-04
5250.00000  5300.00000  1.960746399817e-04
5300.00000  5350.00000  1.960746399817e-04
5350.00000  5400.00000  2.057573382524e-04
5400.00000  5450.00000  2.073711212975e-04
5450.00000  5500.00000  2.049504467298e-04
5500.00000  5550.00000  2.138262534780e-04
5550.00000  5600.00000  2.130193619554e-04
5600.00000  5650.00000  1.904263993238e-04
5650.00000  5700.00000  1.871988332335e-04
5700.00000  5750.00000  1.694472197373e-04
5750.00000  5800.00000  1.718678943049e-04
5800.00000  5850.00000  1.678334366921e-04
5850.00000  5900.00000  1.573438468989e-04
5900.00000  5950.00000  1.629920875568e-04
5950.00000  6000.00000  1.525024977635e-04
6000.00000  6050.00000  1.718678943049e-04
6050.00000  6100.00000  1.573438468989e-04
6100.00000  6150.00000  1.403991249252e-04
6150.00000  6200.00000  1.428197994928e-04
6200.00000  6250.00000  1.654127621245e-04
6250.00000  6300.00000  1.428197994928e-04
6300.00000  6350.00000  1.258750775191e-04
6350.00000  6400.00000  1.581507384214e-04
6400.00000  6450.00000  1.355577757898e-04
6450.00000  6500.00000  1.282957520868e-04
6500.00000  6550.00000  1.460473655831e-04
6550.00000  6600.00000  1.274888605642e-04
6600.00000  6650.00000  1.258750775191e-04
6650.00000  6700.00000  1.210337283838e-04
6700.00000  6750.00000  1.291026436093e-04
6750.00000  6800.00000  1.081234640228e-04
6800.00000  6850.00000  1.137717046807e-04
6850.00000  6900.00000  1.097372470679e-04
6900.00000  6950.00000  1.081234640228e-04
6950.00000  7000.00000  1.089303555454e-04
7000.00000  7050.00000  9.117874204910e-05
7050.00000  7100.00000  1.226475114289e-04
7100.00000  7150.00000  9.359941661677e-05
7150.00000  7200.00000  9.037185052654e-05
7200.00000  7250.00000  9.844076575212e-05
7250.00000  7300.00000  1.089303555454e-04
7300.00000  7350.00000  9.198563357166e-05
7350.00000  7400.00000  9.198563357166e-05
7400.00000  7450.00000  9.844076575212e-05
7450.00000  7500.00000  9.521319966189e-05
7500.00000  7550.00000  9.198563357166e-05
7550.00000  7600.00000  7.988226073328e-05
7600.00000  7650.00000  8.553050139119e-05
7650.00000  7700.00000  8.310982682351e-05
7700.00000  7750.00000  7.988226073328e-05
7750.00000  7800.00000  8.391671834607e-05
7800.00000  7850.00000  7.100645398514e-05
7850.00000  7900.00000  6.293753875955e-05
7900.00000  7950.00000  7.746158616560e-05
7950.00000  8000.00000  6.858577941746e-05
8000.00000  8050.00000  7.181334550770e-05
8050.00000  8100.00000  6.132375571444e-05
8100.00000  8150.00000  8.391671834607e-05
8150.00000  8200.00000  6.858577941746e-05
8200.00000  8250.00000  7.181334550770e-05
8250.00000  8300.00000  6.939267094002e-05
8300.00000  8350.00000  7.181334550770e-05
8350.00000  8400.00000  7.665469464305e-05
8400.00000  8450.00000  6.939267094002e-05
8450.00000  8500.00000  6.213064723700e-05
8500.00000  8550.00000  5.890308114676e-05
8550.00000  8600.00000  6.858577941746e-05
8600.00000  8650.00000  6.697199637235e-05
8650.00000  8700.00000  6.535821332723e-05
8700.00000  8750.00000  6.051686419188e-05
8750.00000  8800.00000  6.293753875955e-05
8800.00000  8850.00000  5.486862353397e-05
8850.00000  8900.00000  6.051686419188e-05
8900.00000  8950.00000  5.083416592118e-05
8950.00000  9000.00000  5.244794896629e-05
9000.00000  9050.00000  4.357214221815e-05
9050.00000  9100.00000  6.051686419188e-05
9100.00000  9150.00000  5.970997266932e-05
9150.00000  9200.00000  4.115146765048e-05
9200.00000  9250.00000  4.357214221815e-05
9250.00000  9300.00000  5.164105744374e-05
9300.00000  9350.00000  5.002727439862e-05
9350.00000  9400.00000  4.760659983094e-05
9400.00000  9450.00000  5.244794896629e-05
9450.00000  9500.00000  4.115146765048e-05
9500.00000  9550.00000  3.873079308280e-05
9550.00000  9600.00000  4.841349135350e-05
9600.00000  9650.00000  3.792390156024e-05
9650.00000  9700.00000  5.083416592118e-05
9700.00000  9750.00000  4.034457612792e-05
9750.00000  9800.00000  4.357214221815e-05
9800.00000  9850.00000  4.357214221815e-05
9850.00000  9900.00000  3.550322699257e-05
9900.00000  9950.00000  5.002727439862e-05
9950.00000  10000.00000  5.002727439862e-05
