10001.00000  11001.00000  5.597464956306e-05
11001.00000  12001.00000  5.589419731791e-05
12001.00000  13001.00000  5.426503935363e-05
13001.00000  14001.00000  5.306831220702e-05
14001.00000  15001.00000  5.056423607673e-05
15001.00000  16001.00000  4.990050505424e-05
16001.00000  17001.00000  4.723552443365e-05
17001.00000  18001.00000  4.583766667417e-05
18001.00000  19001.00000  4.182511094732e-05
19001.00000  20001.00000  3.880815175420e-05
20001.00000  21001.00000  3.849639930424e-05
21001.00000  22001.00000  3.406146929035e-05
22001.00000  23001.00000  3.205016316160e-05
23001.00000  24001.00000  3.070258805534e-05
24001.00000  25001.00000  2.689116294136e-05
25001.00000  26001.00000  2.525194844643e-05
26001.00000  27001.00000  2.399488211597e-05
27001.00000  28001.00000  2.011306128748e-05
28001.00000  29001.00000  1.917780393761e-05
29001.00000  30001.00000  1.781011577007e-05
30001.00000  31001.00000  1.626141005093e-05
31001.00000  32001.00000  1.522558739462e-05
32001.00000  33001.00000  1.282207657077e-05
33001.00000  34001.00000  1.246004146760e-05
34001.00000  35001.00000  1.180636697575e-05
35001.00000  36001.00000  1.092139227910e-05
36001.00000  37001.00000  9.855400030866e-06
37001.00000  38001.00000  8.779351251986e-06
38001.00000  39001.00000  8.477655332674e-06
39001.00000  40001.00000  8.085450637568e-06
40001.00000  41001.00000  7.009401858688e-06
41001.00000  42001.00000  7.140136757056e-06
42001.00000  43001.00000  6.184766345901e-06
43001.00000  44001.00000  5.159000220239e-06
44001.00000  45001.00000  5.088604505733e-06
45001.00000  46001.00000  4.686343279983e-06
46001.00000  47001.00000  4.505325728396e-06
47001.00000  48001.00000  4.223742870371e-06
48001.00000  49001.00000  4.042725318784e-06
49001.00000  50001.00000  3.449390010803e-06
50001.00000  51001.00000  3.338768173722e-06
51001.00000  52001.00000  3.147694091491e-06
52001.00000  53001.00000  2.886224294754e-06
53001.00000  54001.00000  2.735376335098e-06
54001.00000  55001.00000  2.705206743166e-06
55001.00000  56001.00000  2.313002048060e-06
56001.00000  57001.00000  2.232549802911e-06
57001.00000  58001.00000  1.930853883598e-06
58001.00000  59001.00000  1.900684291667e-06
59001.00000  60001.00000  1.749836332011e-06
60001.00000  61001.00000  1.699553678792e-06
61001.00000  62001.00000  1.790062454586e-06
62001.00000  63001.00000  1.458196943342e-06
63001.00000  64001.00000  1.468253473986e-06
64001.00000  65001.00000  1.357631636905e-06
65001.00000  66001.00000  1.357631636905e-06
66001.00000  67001.00000  1.156501024030e-06
67001.00000  68001.00000  1.055935717593e-06
68001.00000  69001.00000  9.151442885804e-07
69001.00000  70001.00000  1.065992248237e-06
70001.00000  71001.00000  7.743528595681e-07
71001.00000  72001.00000  8.849746966492e-07
72001.00000  73001.00000  9.352573498679e-07
73001.00000  74001.00000  7.341267369931e-07
74001.00000  75001.00000  8.648616353617e-07
75001.00000  76001.00000  6.134483692682e-07
76001.00000  77001.00000  6.033918386245e-07
77001.00000  78001.00000  5.531091854058e-07
78001.00000  79001.00000  5.329961241183e-07
79001.00000  80001.00000  5.028265321871e-07
80001.00000  81001.00000  4.726569402558e-07
81001.00000  82001.00000  4.927700015433e-07
82001.00000  83001.00000  3.922046951059e-07
83001.00000  84001.00000  3.720916338184e-07
84001.00000  85001.00000  4.525438789684e-07
85001.00000  86001.00000  3.318655112435e-07
86001.00000  87001.00000  4.424873483246e-07
87001.00000  88001.00000  3.519785725309e-07
88001.00000  89001.00000  2.815828580248e-07
89001.00000  90001.00000  3.218089805997e-07
90001.00000  91001.00000  2.815828580248e-07
91001.00000  92001.00000  2.212436741623e-07
92001.00000  93001.00000  1.810175515873e-07
93001.00000  94001.00000  2.313002048060e-07
94001.00000  95001.00000  2.413567354498e-07
95001.00000  96001.00000  1.709610209436e-07
96001.00000  97001.00000  1.910740822311e-07
97001.00000  98001.00000  2.614697967373e-07
98001.00000  99001.00000  2.313002048060e-07
99001.00000  100001.00000  1.005653064374e-07
100001.00000  101001.00000  1.709610209436e-07
101001.00000  102001.00000  1.206783677249e-07
102001.00000  103001.00000  1.709610209436e-07
103001.00000  104001.00000  2.111871435186e-07
104001.00000  105001.00000  1.508479596561e-07
105001.00000  106001.00000  1.106218370812e-07
106001.00000  107001.00000  6.033918386245e-08
107001.00000  108001.00000  7.039571450619e-08
108001.00000  109001.00000  6.033918386245e-08
109001.00000  110001.00000  7.039571450619e-08
110001.00000  111001.00000  7.039571450619e-08
111001.00000  112001.00000  1.206783677249e-07
112001.00000  113001.00000  1.407914290124e-07
113001.00000  114001.00000  8.045224514993e-08
114001.00000  115001.00000  6.033918386245e-08
115001.00000  116001.00000  7.039571450619e-08
116001.00000  117001.00000  7.039571450619e-08
117001.00000  118001.00000  5.028265321871e-08
118001.00000  119001.00000  4.022612257496e-08
119001.00000  120001.00000  6.033918386245e-08
120001.00000  121001.00000  6.033918386245e-08
121001.00000  122001.00000  4.022612257496e-08
122001.00000  123001.00000  1.005653064374e-08
123001.00000  124001.00000  6.033918386245e-08
124001.00000  125001.00000  3.016959193122e-08
125001.00000  126001.00000  5.028265321871e-08
126001.00000  127001.00000  2.011306128748e-08
127001.00000  128001.00000  4.022612257496e-08
128001.00000  129001.00000  3.016959193122e-08
129001.00000  130001.00000  0.000000000000e+00
130001.00000  131001.00000  2.011306128748e-08
131001.00000  132001.00000  0.000000000000e+00
132001.00000  133001.00000  1.005653064374e-08
133001.00000  134001.00000  4.022612257496e-08
134001.00000  135001.00000  3.016959193122e-08
135001.00000  136001.00000  5.028265321871e-08
136001.00000  137001.00000  1.005653064374e-08
137001.00000  138001.00000  3.016959193122e-08
138001.00000  139001.00000  2.011306128748e-08
139001.00000  140001.00000  1.005653064374e-08
140001.00000  141001.00000  4.022612257496e-08
141001.00000  142001.00000  1.005653064374e-08
142001.00000  143001.00000  3.016959193122e-08
143001.00000  144001.00000  6.033918386245e-08
144001.00000  145001.00000  0.000000000000e+00
145001.00000  146001.00000  0.000000000000e+00
146001.00000  147001.00000  0.000000000000e+00
147001.00000  148001.00000  2.011306128748e-08
148001.00000  149001.00000  0.000000000000e+00
149001.00000  150001.00000  3.016959193122e-08
150001.00000  151001.00000  1.005653064374e-08
151001.00000  152001.00000  2.011306128748e-08
152001.00000  153001.00000  0.000000000000e+00
153001.00000  154001.00000  1.005653064374e-08
154001.00000  155001.00000  0.000000000000e+00
155001.00000  156001.00000  1.005653064374e-08
156001.00000  157001.00000  0.000000000000e+00
157001.00000  158001.00000  0.000000000000e+00
158001.00000  159001.00000  0.000000000000e+00
159001.00000  160001.00000  1.005653064374e-08
160001.00000  161001.00000  0.000000000000e+00
161001.00000  162001.00000  1.005653064374e-08
162001.00000  163001.00000  0.000000000000e+00
163001.00000  164001.00000  1.005653064374e-08
164001.00000  165001.00000  1.005653064374e-08
165001.00000  166001.00000  2.011306128748e-08
166001.00000  167001.00000  0.000000000000e+00
167001.00000  168001.00000  1.005653064374e-08
168001.00000  169001.00000  1.005653064374e-08
169001.00000  170001.00000  2.011306128748e-08
170001.00000  171001.00000  0.000000000000e+00
171001.00000  172001.00000  0.000000000000e+00
172001.00000  173001.00000  1.005653064374e-08
173001.00000  174001.00000  0.000000000000e+00
174001.00000  175001.00000  0.000000000000e+00
175001.00000  176001.00000  0.000000000000e+00
176001.00000  177001.00000  0.000000000000e+00
177001.00000  178001.00000  0.000000000000e+00
178001.00000  179001.00000  0.000000000000e+00
179001.00000  180001.00000  0.000000000000e+00
180001.00000  181001.00000  2.011306128748e-08
181001.00000  182001.00000  2.011306128748e-08
182001.00000  183001.00000  2.011306128748e-08
183001.00000  184001.00000  1.005653064374e-08
184001.00000  185001.00000  1.005653064374e-08
185001.00000  186001.00000  0.000000000000e+00
186001.00000  187001.00000  1.005653064374e-08
187001.00000  188001.00000  2.011306128748e-08
188001.00000  189001.00000  0.000000000000e+00
189001.00000  190001.00000  0.000000000000e+00
190001.00000  191001.00000  0.000000000000e+00
191001.00000  192001.00000  0.000000000000e+00
192001.00000  193001.00000  1.005653064374e-08
193001.00000  194001.00000  0.000000000000e+00
194001.00000  195001.00000  1.005653064374e-08
195001.00000  196001.00000  0.000000000000e+00
196001.00000  197001.00000  0.000000000000e+00
197001.00000  198001.00000  0.000000000000e+00
198001.00000  199001.00000  0.000000000000e+00
