300.00000  350.00000  2.653120780855e-05
350.00000  400.00000  4.037357709997e-05
400.00000  450.00000  2.730022832474e-05
450.00000  500.00000  2.730022832474e-05
500.00000  550.00000  1.941776803380e-04
550.00000  600.00000  2.383963600189e-05
600.00000  650.00000  6.344419258567e-05
650.00000  700.00000  2.845375909903e-05
700.00000  750.00000  4.191161813235e-05
750.00000  800.00000  3.191435142188e-05
800.00000  850.00000  1.088164030409e-04
850.00000  900.00000  2.806924884093e-05
900.00000  950.00000  2.499316677617e-05
950.00000  1000.00000  2.499316677617e-05
1000.00000  1050.00000  3.806651555140e-05
1050.00000  1100.00000  3.037631038950e-05
1100.00000  1150.00000  2.614669755046e-05
1150.00000  1200.00000  2.653120780855e-05
1200.00000  1250.00000  3.037631038950e-05
1250.00000  1300.00000  6.767380542472e-05
1300.00000  1350.00000  3.152984116379e-05
1350.00000  1400.00000  3.152984116379e-05
1400.00000  1450.00000  2.691571806665e-05
1450.00000  1500.00000  2.499316677617e-05
1500.00000  1550.00000  2.576218729236e-05
1550.00000  1600.00000  2.691571806665e-05
1600.00000  1650.00000  2.383963600189e-05
1650.00000  1700.00000  2.653120780855e-05
1700.00000  1750.00000  5.344692587520e-05
1750.00000  1800.00000  2.576218729236e-05
1800.00000  1850.00000  1.961002316284e-05
1850.00000  1900.00000  2.653120780855e-05
1900.00000  1950.00000  2.037904367903e-05
1950.00000  2000.00000  2.037904367903e-05
2000.00000  2050.00000  2.230159496951e-05
2050.00000  2100.00000  2.191708471141e-05
2100.00000  2150.00000  1.576492058189e-05
2150.00000  2200.00000  1.691845135618e-05
2200.00000  2250.00000  1.922551290475e-05
2250.00000  2300.00000  1.961002316284e-05
2300.00000  2350.00000  3.998906684188e-05
2350.00000  2400.00000  1.845649238856e-05
2400.00000  2450.00000  1.614943083999e-05
2450.00000  2500.00000  2.076355393713e-05
2500.00000  2550.00000  1.653394109808e-05
2550.00000  2600.00000  1.807198213046e-05
2600.00000  2650.00000  2.268610522760e-05
2650.00000  2700.00000  1.345785903332e-05
2700.00000  2750.00000  1.384236929142e-05
2750.00000  2800.00000  1.461138980761e-05
2800.00000  2850.00000  1.461138980761e-05
2850.00000  2900.00000  2.307061548570e-05
2900.00000  2950.00000  1.614943083999e-05
2950.00000  3000.00000  2.153257445332e-05
3000.00000  3050.00000  1.538041032380e-05
3050.00000  3100.00000  1.307334877523e-05
3100.00000  3150.00000  1.461138980761e-05
3150.00000  3200.00000  1.730296161427e-05
3200.00000  3250.00000  1.422687954951e-05
3250.00000  3300.00000  1.461138980761e-05
3300.00000  3350.00000  1.191981800094e-05
3350.00000  3400.00000  1.538041032380e-05
3400.00000  3450.00000  1.653394109808e-05
3450.00000  3500.00000  1.499590006570e-05
3500.00000  3550.00000  1.614943083999e-05
3550.00000  3600.00000  1.538041032380e-05
3600.00000  3650.00000  1.191981800094e-05
3650.00000  3700.00000  1.961002316284e-05
3700.00000  3750.00000  1.691845135618e-05
3750.00000  3800.00000  1.191981800094e-05
3800.00000  3850.00000  1.115079748475e-05
3850.00000  3900.00000  1.384236929142e-05
3900.00000  3950.00000  1.230432825904e-05
3950.00000  4000.00000  1.345785903332e-05
4000.00000  4050.00000  1.576492058189e-05
4050.00000  4100.00000  1.191981800094e-05
4100.00000  4150.00000  1.499590006570e-05
4150.00000  4200.00000  1.307334877523e-05
4200.00000  4250.00000  1.499590006570e-05
4250.00000  4300.00000  1.076628722666e-05
4300.00000  4350.00000  1.268883851713e-05
4350.00000  4400.00000  1.730296161427e-05
4400.00000  4450.00000  1.422687954951e-05
4450.00000  4500.00000  1.345785903332e-05
4500.00000  4550.00000  1.345785903332e-05
4550.00000  4600.00000  1.384236929142e-05
4600.00000  4650.00000  1.730296161427e-05
4650.00000  4700.00000  1.307334877523e-05
4700.00000  4750.00000  1.730296161427e-05
4750.00000  4800.00000  1.422687954951e-05
4800.00000  4850.00000  1.422687954951e-05
4850.00000  4900.00000  1.730296161427e-05
4900.00000  4950.00000  9.997266710470e-06
4950.00000  5000.00000  1.268883851713e-05
5000.00000  5050.00000  1.076628722666e-05
5050.00000  5100.00000  1.422687954951e-05
5100.00000  5150.00000  1.230432825904e-05
5150.00000  5200.00000  1.230432825904e-05
5200.00000  5250.00000  1.115079748475e-05
5250.00000  5300.00000  1.653394109808e-05
5300.00000  5350.00000  1.538041032380e-05
5350.00000  5400.00000  1.115079748475e-05
5400.00000  5450.00000  1.345785903332e-05
5450.00000  5500.00000  1.307334877523e-05
5500.00000  5550.00000  1.384236929142e-05
5550.00000  5600.00000  1.230432825904e-05
5600.00000  5650.00000  1.268883851713e-05
5650.00000  5700.00000  1.730296161427e-05
5700.00000  5750.00000  1.307334877523e-05
5750.00000  5800.00000  1.538041032380e-05
5800.00000  5850.00000  1.538041032380e-05
5850.00000  5900.00000  1.691845135618e-05
5900.00000  5950.00000  1.307334877523e-05
5950.00000  6000.00000  1.115079748475e-05
6000.00000  6050.00000  1.730296161427e-05
6050.00000  6100.00000  1.345785903332e-05
6100.00000  6150.00000  2.037904367903e-05
6150.00000  6200.00000  1.653394109808e-05
6200.00000  6250.00000  2.230159496951e-05
6250.00000  6300.00000  2.537767703427e-05
6300.00000  6350.00000  2.307061548570e-05
6350.00000  6400.00000  1.972537624027e-04
6400.00000  6450.00000  1.576492058189e-05
6450.00000  6500.00000  1.384236929142e-05
6500.00000  6550.00000  1.384236929142e-05
6550.00000  6600.00000  1.576492058189e-05
6600.00000  6650.00000  1.422687954951e-05
6650.00000  6700.00000  1.730296161427e-05
6700.00000  6750.00000  1.307334877523e-05
6750.00000  6800.00000  1.384236929142e-05
6800.00000  6850.00000  1.691845135618e-05
6850.00000  6900.00000  1.461138980761e-05
6900.00000  6950.00000  1.499590006570e-05
6950.00000  7000.00000  8.843735936185e-06
7000.00000  7050.00000  1.268883851713e-05
7050.00000  7100.00000  3.768200529331e-05
7100.00000  7150.00000  7.305694903805e-06
7150.00000  7200.00000  1.076628722666e-05
7200.00000  7250.00000  8.843735936185e-06
7250.00000  7300.00000  5.767653871425e-06
7300.00000  7350.00000  8.843735936185e-06
7350.00000  7400.00000  7.305694903805e-06
7400.00000  7450.00000  1.076628722666e-05
7450.00000  7500.00000  1.345785903332e-05
7500.00000  7550.00000  8.459225678090e-06
7550.00000  7600.00000  4.229612839045e-06
7600.00000  7650.00000  9.612756452375e-06
7650.00000  7700.00000  9.997266710470e-06
7700.00000  7750.00000  8.074715419995e-06
7750.00000  7800.00000  9.228246194280e-06
7800.00000  7850.00000  8.074715419995e-06
7850.00000  7900.00000  4.998633355235e-06
7900.00000  7950.00000  7.305694903805e-06
7950.00000  8000.00000  6.152164129520e-06
8000.00000  8050.00000  8.843735936185e-06
8050.00000  8100.00000  9.228246194280e-06
8100.00000  8150.00000  1.115079748475e-05
8150.00000  8200.00000  1.076628722666e-05
8200.00000  8250.00000  9.228246194280e-06
8250.00000  8300.00000  8.843735936185e-06
8300.00000  8350.00000  1.038177696856e-05
8350.00000  8400.00000  8.459225678090e-06
8400.00000  8450.00000  6.536674387615e-06
8450.00000  8500.00000  9.612756452375e-06
8500.00000  8550.00000  8.074715419995e-06
8550.00000  8600.00000  9.228246194280e-06
8600.00000  8650.00000  7.305694903805e-06
8650.00000  8700.00000  8.459225678090e-06
8700.00000  8750.00000  4.614123097140e-06
8750.00000  8800.00000  7.690205161900e-06
8800.00000  8850.00000  8.074715419995e-06
8850.00000  8900.00000  1.038177696856e-05
8900.00000  8950.00000  8.074715419995e-06
8950.00000  9000.00000  6.152164129520e-06
9000.00000  9050.00000  9.997266710470e-06
9050.00000  9100.00000  7.305694903805e-06
9100.00000  9150.00000  6.921184645710e-06
9150.00000  9200.00000  6.536674387615e-06
9200.00000  9250.00000  7.690205161900e-06
9250.00000  9300.00000  5.383143613330e-06
9300.00000  9350.00000  6.152164129520e-06
9350.00000  9400.00000  9.612756452375e-06
9400.00000  9450.00000  9.997266710470e-06
9450.00000  9500.00000  8.074715419995e-06
9500.00000  9550.00000  8.074715419995e-06
9550.00000  9600.00000  9.228246194280e-06
9600.00000  9650.00000  6.152164129520e-06
9650.00000  9700.00000  6.536674387615e-06
9700.00000  9750.00000  7.305694903805e-06
9750.00000  9800.00000  8.074715419995e-06
9800.00000  9850.00000  8.459225678090e-06
9850.00000  9900.00000  1.153530774285e-05
9900.00000  9950.00000  1.038177696856e-05
9950.00000  10000.00000  7.305694903805e-06
