300.00000  350.00000  1.636845158025e-05
350.00000  400.00000  3.720102631874e-05
400.00000  450.00000  2.232061579125e-05
450.00000  500.00000  2.083257473850e-05
500.00000  550.00000  1.696366800135e-04
550.00000  600.00000  1.636845158025e-05
600.00000  650.00000  4.017710842424e-05
650.00000  700.00000  2.008855421212e-05
700.00000  750.00000  2.976082105499e-05
750.00000  800.00000  2.306463631762e-05
800.00000  850.00000  7.440205263748e-05
850.00000  900.00000  1.785649263300e-05
900.00000  950.00000  1.190432842200e-05
950.00000  1000.00000  1.562443105387e-05
1000.00000  1050.00000  1.041628736925e-05
1050.00000  1100.00000  2.306463631762e-05
1100.00000  1150.00000  1.190432842200e-05
1150.00000  1200.00000  1.264834894837e-05
1200.00000  1250.00000  1.785649263300e-05
1250.00000  1300.00000  6.026566263636e-05
1300.00000  1350.00000  3.496896473962e-05
1350.00000  1400.00000  7.291401158473e-05
1400.00000  1450.00000  8.928246316498e-05
1450.00000  1500.00000  1.607084336970e-04
1500.00000  1550.00000  2.611512047576e-04
1550.00000  1600.00000  3.593619142390e-04
1600.00000  1650.00000  5.289985942525e-04
1650.00000  1700.00000  6.554820837362e-04
1700.00000  1750.00000  9.858271974467e-04
1750.00000  1800.00000  1.060973270611e-03
1800.00000  1850.00000  1.209033355359e-03
1850.00000  1900.00000  1.217217581149e-03
1900.00000  1950.00000  1.461256313800e-03
1950.00000  2000.00000  1.624196809076e-03
2000.00000  2050.00000  1.924037081205e-03
2050.00000  2100.00000  2.168819834383e-03
2100.00000  2150.00000  2.402442279664e-03
2150.00000  2200.00000  2.579519164942e-03
2200.00000  2250.00000  2.816117692329e-03
2250.00000  2300.00000  2.944833243392e-03
2300.00000  2350.00000  3.223096920256e-03
2350.00000  2400.00000  3.240209392362e-03
2400.00000  2450.00000  3.429190606062e-03
2450.00000  2500.00000  3.383061333426e-03
2500.00000  2550.00000  3.361484738162e-03
2550.00000  2600.00000  3.425470503430e-03
2600.00000  2650.00000  3.557162136598e-03
2650.00000  2700.00000  3.496896473962e-03
2700.00000  2750.00000  3.617427799234e-03
2750.00000  2800.00000  3.734239021875e-03
2800.00000  2850.00000  3.684389646608e-03
2850.00000  2900.00000  3.768463966089e-03
2900.00000  2950.00000  3.839889936621e-03
2950.00000  3000.00000  3.968605487683e-03
3000.00000  3050.00000  3.828729628725e-03
3050.00000  3100.00000  3.900155599257e-03
3100.00000  3150.00000  3.958189200314e-03
3150.00000  3200.00000  3.839889936621e-03
3200.00000  3250.00000  3.822033443988e-03
3250.00000  3300.00000  3.793016643459e-03
3300.00000  3350.00000  3.792272622933e-03
3350.00000  3400.00000  3.711918406084e-03
3400.00000  3450.00000  3.755815617140e-03
3450.00000  3500.00000  3.714150467663e-03
3500.00000  3550.00000  3.655372846080e-03
3550.00000  3600.00000  3.638260373973e-03
3600.00000  3650.00000  3.604779450286e-03
3650.00000  3700.00000  3.601803368181e-03
3700.00000  3750.00000  3.551953992913e-03
3750.00000  3800.00000  3.537073582386e-03
3800.00000  3850.00000  3.436630811325e-03
3850.00000  3900.00000  3.339908142897e-03
3900.00000  3950.00000  3.337676081318e-03
3950.00000  4000.00000  3.224584961309e-03
4000.00000  4050.00000  3.261785987627e-03
4050.00000  4100.00000  3.121166108142e-03
4100.00000  4150.00000  3.033371686030e-03
4150.00000  4200.00000  3.047508076031e-03
4200.00000  4250.00000  2.956737571814e-03
4250.00000  4300.00000  3.022211378135e-03
4300.00000  4350.00000  2.850342636542e-03
4350.00000  4400.00000  2.879359437071e-03
4400.00000  4450.00000  2.782636768642e-03
4450.00000  4500.00000  2.708234716004e-03
4500.00000  4550.00000  2.719395023900e-03
4550.00000  4600.00000  2.664337504948e-03
4600.00000  4650.00000  2.675497812844e-03
4650.00000  4700.00000  2.592167513890e-03
4700.00000  4750.00000  2.523717625463e-03
4750.00000  4800.00000  2.510325255989e-03
4800.00000  4850.00000  2.526693707569e-03
4850.00000  4900.00000  2.457499798616e-03
4900.00000  4950.00000  2.361521150714e-03
4950.00000  5000.00000  2.329528268080e-03
5000.00000  5050.00000  2.267030543864e-03
5050.00000  5100.00000  2.270750646496e-03
5100.00000  5150.00000  2.150963341750e-03
5150.00000  5200.00000  2.206020860701e-03
5200.00000  5250.00000  2.145755198065e-03
5250.00000  5300.00000  2.060936858058e-03
5300.00000  5350.00000  2.017039647002e-03
5350.00000  5400.00000  2.014063564897e-03
5400.00000  5450.00000  2.034896139635e-03
5450.00000  5500.00000  1.928501204364e-03
5500.00000  5550.00000  1.877163788044e-03
5550.00000  5600.00000  1.865259459622e-03
5600.00000  5650.00000  1.857075233832e-03
5650.00000  5700.00000  1.804249776459e-03
5700.00000  5750.00000  1.816898125407e-03
5750.00000  5800.00000  1.781185140141e-03
5800.00000  5850.00000  1.704551025925e-03
5850.00000  5900.00000  1.686694533292e-03
5900.00000  5950.00000  1.655445671184e-03
5950.00000  6000.00000  1.624196809076e-03
6000.00000  6050.00000  1.566163208019e-03
6050.00000  6100.00000  1.566907228545e-03
6100.00000  6150.00000  1.520777955910e-03
6150.00000  6200.00000  1.544586612754e-03
6200.00000  6250.00000  1.492505175908e-03
6250.00000  6300.00000  1.484320950118e-03
6300.00000  6350.00000  1.422567246429e-03
6350.00000  6400.00000  1.770768852772e-03
6400.00000  6450.00000  1.369741789056e-03
6450.00000  6500.00000  1.357837460634e-03
6500.00000  6550.00000  1.392062404847e-03
6550.00000  6600.00000  1.400990651164e-03
6600.00000  6650.00000  1.336260865369e-03
6650.00000  6700.00000  1.296083756945e-03
6700.00000  6750.00000  1.307244064841e-03
6750.00000  6800.00000  1.269299017995e-03
6800.00000  6850.00000  1.259626751153e-03
6850.00000  6900.00000  1.218705622202e-03
6900.00000  6950.00000  1.205313252727e-03
6950.00000  7000.00000  1.209777375885e-03
7000.00000  7050.00000  1.155463877460e-03
7050.00000  7100.00000  1.235074073782e-03
7100.00000  7150.00000  9.999635874478e-04
7150.00000  7200.00000  1.030468429029e-03
7200.00000  7250.00000  1.050556983241e-03
7250.00000  7300.00000  1.001451628501e-03
7300.00000  7350.00000  1.026748326397e-03
7350.00000  7400.00000  9.263055553367e-04
7400.00000  7450.00000  9.560663763917e-04
7450.00000  7500.00000  9.218414321784e-04
7500.00000  7550.00000  8.801762827014e-04
7550.00000  7600.00000  9.516022532334e-04
7600.00000  7650.00000  9.449060684960e-04
7650.00000  7700.00000  8.719920569113e-04
7700.00000  7750.00000  8.556236053311e-04
7750.00000  7800.00000  8.481834000673e-04
7800.00000  7850.00000  9.270495758630e-04
7850.00000  7900.00000  8.652958721739e-04
7900.00000  7950.00000  8.742241184904e-04
7950.00000  8000.00000  7.849416553255e-04
8000.00000  8050.00000  8.072622711167e-04
8050.00000  8100.00000  7.856856758518e-04
8100.00000  8150.00000  7.871737169046e-04
8150.00000  8200.00000  7.663411421661e-04
8200.00000  8250.00000  7.403004237430e-04
8250.00000  8300.00000  7.179798079517e-04
8300.00000  8350.00000  7.589009369023e-04
8350.00000  8400.00000  7.269080542682e-04
8400.00000  8450.00000  7.321161979528e-04
8450.00000  8500.00000  6.926831100550e-04
8500.00000  8550.00000  7.187238284781e-04
8550.00000  8600.00000  7.231879516363e-04
8600.00000  8650.00000  6.904510484758e-04
8650.00000  8700.00000  6.606902274209e-04
8700.00000  8750.00000  6.569701247890e-04
8750.00000  8800.00000  6.696184737374e-04
8800.00000  8850.00000  6.584581658417e-04
8850.00000  8900.00000  6.502739400516e-04
8900.00000  8950.00000  6.309294063659e-04
8950.00000  9000.00000  6.934271305813e-04
9000.00000  9050.00000  6.048886879427e-04
9050.00000  9100.00000  6.458098168934e-04
9100.00000  9150.00000  6.063767289955e-04
9150.00000  9200.00000  6.034006468900e-04
9200.00000  9250.00000  5.639675589921e-04
9250.00000  9300.00000  6.339054884714e-04
9300.00000  9350.00000  5.937283800471e-04
9350.00000  9400.00000  5.654556000449e-04
9400.00000  9450.00000  5.647115795185e-04
9450.00000  9500.00000  5.490871484646e-04
9500.00000  9550.00000  5.498311689910e-04
9550.00000  9600.00000  5.535512716229e-04
9600.00000  9650.00000  5.617354974130e-04
9650.00000  9700.00000  5.520632305701e-04
9700.00000  9750.00000  5.706637437295e-04
9750.00000  9800.00000  5.282545737261e-04
9800.00000  9850.00000  5.312306558316e-04
9850.00000  9900.00000  5.074219989876e-04
9900.00000  9950.00000  5.230464300415e-04
9950.00000  10000.00000  5.051899374085e-04
