300.00000  350.00000  6.990746181656e-02
350.00000  400.00000  5.525269946021e-02
400.00000  450.00000  4.533277857088e-02
450.00000  500.00000  3.783196882410e-02
500.00000  550.00000  3.249635920130e-02
550.00000  600.00000  2.789929441329e-02
600.00000  650.00000  2.432695575268e-02
650.00000  700.00000  2.162436860998e-02
700.00000  750.00000  1.932602945115e-02
750.00000  800.00000  1.727986219431e-02
800.00000  850.00000  1.567736289683e-02
850.00000  900.00000  1.433882284696e-02
900.00000  950.00000  1.299197368461e-02
950.00000  1000.00000  1.191043641607e-02
1000.00000  1050.00000  1.108145751987e-02
1050.00000  1100.00000  1.026349302859e-02
1100.00000  1150.00000  9.534416717317e-03
1150.00000  1200.00000  8.917030336582e-03
1200.00000  1250.00000  8.337324814766e-03
1250.00000  1300.00000  7.876652160096e-03
1300.00000  1350.00000  7.347960724199e-03
1350.00000  1400.00000  6.940234507188e-03
1400.00000  1450.00000  6.567870327008e-03
1450.00000  1500.00000  6.104105909555e-03
1500.00000  1550.00000  5.843045189563e-03
1550.00000  1600.00000  5.530777148478e-03
1600.00000  1650.00000  5.281697009271e-03
1650.00000  1700.00000  5.027013050019e-03
1700.00000  1750.00000  4.851941982431e-03
1750.00000  1800.00000  4.583731561004e-03
1800.00000  1850.00000  4.425858423896e-03
1850.00000  1900.00000  4.235135307218e-03
1900.00000  1950.00000  4.042479838801e-03
1950.00000  2000.00000  3.893881990042e-03
2000.00000  2050.00000  3.691564762928e-03
2050.00000  2100.00000  3.603835993960e-03
2100.00000  2150.00000  3.481518128856e-03
2150.00000  2200.00000  3.300843241224e-03
2200.00000  2250.00000  3.196882717644e-03
2250.00000  2300.00000  3.075337793237e-03
2300.00000  2350.00000  3.008285187880e-03
2350.00000  2400.00000  2.850991756294e-03
2400.00000  2450.00000  2.800364140722e-03
2450.00000  2500.00000  2.707224786883e-03
2500.00000  2550.00000  2.621428369655e-03
2550.00000  2600.00000  2.510897850162e-03
2600.00000  2650.00000  2.445584361370e-03
2650.00000  2700.00000  2.375246758056e-03
2700.00000  2750.00000  2.315537089309e-03
2750.00000  2800.00000  2.234764786603e-03
2800.00000  2850.00000  2.138147199633e-03
2850.00000  2900.00000  2.123654561588e-03
2900.00000  2950.00000  2.089645170975e-03
2950.00000  3000.00000  1.988003469483e-03
3000.00000  3050.00000  1.977762005264e-03
3050.00000  3100.00000  1.884622651426e-03
3100.00000  3150.00000  1.918052336517e-03
3150.00000  3200.00000  1.783174185108e-03
3200.00000  3250.00000  1.746266266885e-03
3250.00000  3300.00000  1.722498340491e-03
3300.00000  3350.00000  1.678827191181e-03
3350.00000  3400.00000  1.632257514262e-03
3400.00000  3450.00000  1.589359305647e-03
3450.00000  3500.00000  1.557861972295e-03
3500.00000  3550.00000  1.520567583725e-03
3550.00000  3600.00000  1.510132884332e-03
3600.00000  3650.00000  1.462790266717e-03
3650.00000  3700.00000  1.458539092890e-03
3700.00000  3750.00000  1.414481473232e-03
3750.00000  3800.00000  1.383950315750e-03
3800.00000  3850.00000  1.333902405700e-03
3850.00000  3900.00000  1.332742994656e-03
3900.00000  3950.00000  1.281728908736e-03
3950.00000  4000.00000  1.270521268648e-03
4000.00000  4050.00000  1.277091264562e-03
4050.00000  4100.00000  1.216222184771e-03
4100.00000  4150.00000  1.208299542640e-03
4150.00000  4200.00000  1.202309252248e-03
4200.00000  4250.00000  1.117092540541e-03
4250.00000  4300.00000  1.130232532368e-03
4300.00000  4350.00000  1.104339019061e-03
4350.00000  4400.00000  1.086947853406e-03
4400.00000  4450.00000  1.055643755228e-03
4450.00000  4500.00000  1.041344352356e-03
4500.00000  4550.00000  1.036127002660e-03
4550.00000  4600.00000  9.982529085681e-04
4600.00000  4650.00000  1.029943477094e-03
4650.00000  4700.00000  9.710067490428e-04
4700.00000  4750.00000  9.565141109973e-04
4750.00000  4800.00000  9.609585199979e-04
4800.00000  4850.00000  9.493644095616e-04
4850.00000  4900.00000  9.105241395999e-04
4900.00000  4950.00000  9.107173747738e-04
4950.00000  5000.00000  8.898479759884e-04
5000.00000  5050.00000  8.560318205491e-04
5050.00000  5100.00000  8.569979964188e-04
5100.00000  5150.00000  8.409594769819e-04
5150.00000  5200.00000  8.326503645025e-04
5200.00000  5250.00000  7.949695055845e-04
5250.00000  5300.00000  8.235683113274e-04
5300.00000  5350.00000  8.108147898474e-04
5350.00000  5400.00000  7.982545035414e-04
5400.00000  5450.00000  7.727474605815e-04
5450.00000  5500.00000  7.661774646676e-04
5500.00000  5550.00000  7.619262908409e-04
5550.00000  5600.00000  7.503321804046e-04
5600.00000  5650.00000  7.505254155785e-04
5650.00000  5700.00000  7.047286793550e-04
5700.00000  5750.00000  7.002842703544e-04
5750.00000  5800.00000  6.946804503102e-04
5800.00000  5850.00000  6.697531128721e-04
5850.00000  5900.00000  6.761298736121e-04
5900.00000  5950.00000  6.770960494818e-04
5950.00000  6000.00000  6.765163439599e-04
6000.00000  6050.00000  6.564198858703e-04
6050.00000  6100.00000  6.413475423031e-04
6100.00000  6150.00000  6.427001885206e-04
6150.00000  6200.00000  6.312993132582e-04
6200.00000  6250.00000  6.332316649976e-04
6250.00000  6300.00000  6.220240249092e-04
6300.00000  6350.00000  6.083043275595e-04
6350.00000  6400.00000  8.326503645025e-04
6400.00000  6450.00000  5.901402212093e-04
6450.00000  6500.00000  5.980628633408e-04
6500.00000  6550.00000  5.598022989009e-04
6550.00000  6600.00000  5.822175790778e-04
6600.00000  6650.00000  5.785461107729e-04
6650.00000  6700.00000  5.499473050300e-04
6700.00000  6750.00000  5.397058408112e-04
6750.00000  6800.00000  5.325561393755e-04
6800.00000  6850.00000  5.219282048089e-04
6850.00000  6900.00000  5.321696690276e-04
6900.00000  6950.00000  5.182567365040e-04
6950.00000  7000.00000  5.151649737210e-04
7000.00000  7050.00000  5.221214399828e-04
7050.00000  7100.00000  5.252132027658e-04
7100.00000  7150.00000  5.027979225889e-04
7150.00000  7200.00000  4.917835176744e-04
7200.00000  7250.00000  4.875323438477e-04
7250.00000  7300.00000  4.684020616278e-04
7300.00000  7350.00000  4.774841148029e-04
7350.00000  7400.00000  4.670494154102e-04
7400.00000  7450.00000  4.649238284969e-04
7450.00000  7500.00000  4.695614726714e-04
7500.00000  7550.00000  4.618320657139e-04
7550.00000  7600.00000  4.769044092811e-04
7600.00000  7650.00000  4.353588468842e-04
7650.00000  7700.00000  4.367114931018e-04
7700.00000  7750.00000  4.195135626213e-04
7750.00000  7800.00000  4.324603192752e-04
7800.00000  7850.00000  4.133300370552e-04
7850.00000  7900.00000  4.287888509703e-04
7900.00000  7950.00000  4.152623887946e-04
7950.00000  8000.00000  4.023156321407e-04
8000.00000  8050.00000  4.077262170110e-04
8050.00000  8100.00000  4.028953376625e-04
8100.00000  8150.00000  4.071465114892e-04
8150.00000  8200.00000  3.978712231401e-04
8200.00000  8250.00000  4.036682783583e-04
8250.00000  8300.00000  3.965185769225e-04
8300.00000  8350.00000  3.688859470493e-04
8350.00000  8400.00000  3.876297589213e-04
8400.00000  8450.00000  3.793206464420e-04
8450.00000  8500.00000  3.855041720080e-04
8500.00000  8550.00000  3.899485810086e-04
8550.00000  8600.00000  3.659874194402e-04
8600.00000  8650.00000  3.795138816159e-04
8650.00000  8700.00000  3.661806546141e-04
8700.00000  8750.00000  3.565188959172e-04
8750.00000  8800.00000  3.441518447851e-04
8800.00000  8850.00000  3.549730145257e-04
8850.00000  8900.00000  3.462774316984e-04
8900.00000  8950.00000  3.408668468281e-04
8950.00000  9000.00000  3.464706668724e-04
9000.00000  9050.00000  3.298524419136e-04
9050.00000  9100.00000  3.540068386560e-04
9100.00000  9150.00000  3.429924337415e-04
9150.00000  9200.00000  3.342968509142e-04
9200.00000  9250.00000  3.281133253482e-04
9250.00000  9300.00000  3.198042128688e-04
9300.00000  9350.00000  3.093695134761e-04
9350.00000  9400.00000  3.167124500858e-04
9400.00000  9450.00000  3.182583314773e-04
9450.00000  9500.00000  3.136206873028e-04
9500.00000  9550.00000  3.267606791306e-04
9550.00000  9600.00000  3.027995175622e-04
9600.00000  9650.00000  3.012536361707e-04
9650.00000  9700.00000  3.022198120404e-04
9700.00000  9750.00000  3.074371617367e-04
9750.00000  9800.00000  3.010604009967e-04
9800.00000  9850.00000  2.956498161265e-04
9850.00000  9900.00000  2.942971699089e-04
9900.00000  9950.00000  2.875339388210e-04
9950.00000  10000.00000  2.774857097762e-04
