300.00000  350.00000  3.792731482036e-01
350.00000  400.00000  2.853899788778e-01
400.00000  450.00000  2.208045385393e-01
450.00000  500.00000  1.774216659697e-01
500.00000  550.00000  1.448830789608e-01
550.00000  600.00000  1.203425957578e-01
600.00000  650.00000  1.020710902111e-01
650.00000  700.00000  8.759234479811e-02
700.00000  750.00000  7.584947234648e-02
750.00000  800.00000  6.651262091260e-02
800.00000  850.00000  5.870469233147e-02
850.00000  900.00000  5.204712688060e-02
900.00000  950.00000  4.659436266576e-02
950.00000  1000.00000  4.211324701019e-02
1000.00000  1050.00000  3.815430739569e-02
1050.00000  1100.00000  3.451447536183e-02
1100.00000  1150.00000  3.161206477418e-02
1150.00000  1200.00000  2.908749761816e-02
1200.00000  1250.00000  2.677065481318e-02
1250.00000  1300.00000  2.491940107088e-02
1300.00000  1350.00000  2.331311880464e-02
1350.00000  1400.00000  2.149445629673e-02
1400.00000  1450.00000  2.019116506666e-02
1450.00000  1500.00000  1.894481896041e-02
1500.00000  1550.00000  1.787288967995e-02
1550.00000  1600.00000  1.686184512307e-02
1600.00000  1650.00000  1.611869334995e-02
1650.00000  1700.00000  1.529030296381e-02
1700.00000  1750.00000  1.456470031690e-02
1750.00000  1800.00000  1.396695558951e-02
1800.00000  1850.00000  1.338389482486e-02
1850.00000  1900.00000  1.276322878977e-02
1900.00000  1950.00000  1.229978859968e-02
1950.00000  2000.00000  1.183563211874e-02
2000.00000  2050.00000  1.165118722083e-02
2050.00000  2100.00000  1.104663773021e-02
2100.00000  2150.00000  1.087723494048e-02
2150.00000  2200.00000  1.060611884783e-02
2200.00000  2250.00000  1.029632304843e-02
2250.00000  2300.00000  9.971485140855e-03
2300.00000  2350.00000  9.720425192441e-03
2350.00000  2400.00000  9.538487312563e-03
2400.00000  2450.00000  9.256268711493e-03
2450.00000  2500.00000  8.899555860394e-03
2500.00000  2550.00000  8.653509948040e-03
2550.00000  2600.00000  8.459395123446e-03
2600.00000  2650.00000  8.300378551270e-03
2650.00000  2700.00000  8.084775000706e-03
2700.00000  2750.00000  7.918595519873e-03
2750.00000  2800.00000  7.827626579934e-03
2800.00000  2850.00000  7.639242082265e-03
2850.00000  2900.00000  7.328729992002e-03
2900.00000  2950.00000  7.278589631405e-03
2950.00000  3000.00000  7.249937996779e-03
3000.00000  3050.00000  7.007831684186e-03
3050.00000  3100.00000  6.816582023055e-03
3100.00000  3150.00000  6.749966972548e-03
3150.00000  3200.00000  6.526842367895e-03
3200.00000  3250.00000  6.462376189986e-03
3250.00000  3300.00000  6.242833039661e-03
3300.00000  3350.00000  6.145059336498e-03
3350.00000  3400.00000  6.007889635724e-03
3400.00000  3450.00000  5.814491101996e-03
3450.00000  3500.00000  5.797300121220e-03
3500.00000  3550.00000  5.711703362774e-03
3550.00000  3600.00000  5.493950939613e-03
3600.00000  3650.00000  5.412293780928e-03
3650.00000  3700.00000  5.390088764092e-03
3700.00000  3750.00000  5.227490737588e-03
3750.00000  3800.00000  5.152638342126e-03
3800.00000  3850.00000  5.015468641352e-03
3850.00000  3900.00000  4.963895699025e-03
3900.00000  3950.00000  4.828158579982e-03
3950.00000  4000.00000  4.746143275864e-03
4000.00000  4050.00000  4.588917430852e-03
4050.00000  4100.00000  4.573875322673e-03
4100.00000  4150.00000  4.442435948824e-03
4150.00000  4200.00000  4.365792826198e-03
4200.00000  4250.00000  4.269093559334e-03
4250.00000  4300.00000  4.209999562917e-03
4300.00000  4350.00000  4.085723097725e-03
4350.00000  4400.00000  4.005140375339e-03
4400.00000  4450.00000  3.923841362086e-03
4450.00000  4500.00000  3.908441108475e-03
4500.00000  4550.00000  3.762675917313e-03
4550.00000  4600.00000  3.771629553133e-03
4600.00000  4650.00000  3.723996210567e-03
4650.00000  4700.00000  3.675646577135e-03
4700.00000  4750.00000  3.539193167227e-03
4750.00000  4800.00000  3.509825241735e-03
4800.00000  4850.00000  3.459684881138e-03
4850.00000  4900.00000  3.384832485677e-03
4900.00000  4950.00000  3.298161290932e-03
4950.00000  5000.00000  3.285268055350e-03
5000.00000  5050.00000  3.207192350993e-03
5050.00000  5100.00000  3.133772537263e-03
5100.00000  5150.00000  3.100823157443e-03
5150.00000  5200.00000  2.975830401385e-03
5200.00000  5250.00000  2.953267239117e-03
5250.00000  5300.00000  2.946462475893e-03
5300.00000  5350.00000  2.841884009507e-03
5350.00000  5400.00000  2.907066478282e-03
5400.00000  5450.00000  2.791385503478e-03
5450.00000  5500.00000  2.739812561150e-03
5500.00000  5550.00000  2.681793001032e-03
5550.00000  5600.00000  2.719756416912e-03
5600.00000  5650.00000  2.681434855599e-03
5650.00000  5700.00000  2.558949117571e-03
5700.00000  5750.00000  2.579005261809e-03
5750.00000  5800.00000  2.512748356736e-03
5800.00000  5850.00000  2.415690944439e-03
5850.00000  5900.00000  2.402439563424e-03
5900.00000  5950.00000  2.407811744917e-03
5950.00000  6000.00000  2.341554839843e-03
6000.00000  6050.00000  2.268851316978e-03
6050.00000  6100.00000  2.290340042948e-03
6100.00000  6150.00000  2.235543791725e-03
6150.00000  6200.00000  2.183970849398e-03
6200.00000  6250.00000  2.170361322950e-03
6250.00000  6300.00000  2.184328994831e-03
6300.00000  6350.00000  2.135621215966e-03
6350.00000  6400.00000  2.159616959965e-03
6400.00000  6450.00000  2.063992129400e-03
6450.00000  6500.00000  2.036414931072e-03
6500.00000  6550.00000  1.985200134177e-03
6550.00000  6600.00000  1.981976825282e-03
6600.00000  6650.00000  1.895663775970e-03
6650.00000  6700.00000  1.946878572864e-03
6700.00000  6750.00000  1.863430687015e-03
6750.00000  6800.00000  1.862714396149e-03
6800.00000  6850.00000  1.871309886537e-03
6850.00000  6900.00000  1.827257998299e-03
6900.00000  6950.00000  1.738079785524e-03
6950.00000  7000.00000  1.733423894898e-03
7000.00000  7050.00000  1.708353714599e-03
7050.00000  7100.00000  1.703339678540e-03
7100.00000  7150.00000  1.597328630422e-03
7150.00000  7200.00000  1.617384774661e-03
7200.00000  7250.00000  1.552202305886e-03
7250.00000  7300.00000  1.554351178482e-03
7300.00000  7350.00000  1.511015581110e-03
7350.00000  7400.00000  1.501345654424e-03
7400.00000  7450.00000  1.523550671259e-03
7450.00000  7500.00000  1.442967948872e-03
7500.00000  7550.00000  1.474126601529e-03
7550.00000  7600.00000  1.459442638783e-03
7600.00000  7650.00000  1.397483478903e-03
7650.00000  7700.00000  1.421121077470e-03
7700.00000  7750.00000  1.386380970485e-03
7750.00000  7800.00000  1.409660423619e-03
7800.00000  7850.00000  1.342687227680e-03
7850.00000  7900.00000  1.325138101471e-03
7900.00000  7950.00000  1.371338862306e-03
7950.00000  8000.00000  1.297560903143e-03
8000.00000  8050.00000  1.306514538964e-03
8050.00000  8100.00000  1.309737847860e-03
8100.00000  8150.00000  1.282518794964e-03
8150.00000  8200.00000  1.271416286547e-03
8200.00000  8250.00000  1.268192977651e-03
8250.00000  8300.00000  1.244555379084e-03
8300.00000  8350.00000  1.185819528100e-03
8350.00000  8400.00000  1.201936072578e-03
8400.00000  8450.00000  1.180447346608e-03
8450.00000  8500.00000  1.151795711981e-03
8500.00000  8550.00000  1.132455858609e-03
8550.00000  8600.00000  1.126009240818e-03
8600.00000  8650.00000  1.143916512459e-03
8650.00000  8700.00000  1.102371642251e-03
8700.00000  8750.00000  1.127083677116e-03
8750.00000  8800.00000  1.107743823743e-03
8800.00000  8850.00000  1.084822516042e-03
8850.00000  8900.00000  1.049366118192e-03
8900.00000  8950.00000  1.054380154252e-03
8950.00000  9000.00000  1.053305717953e-03
9000.00000  9050.00000  1.057603463147e-03
9050.00000  9100.00000  1.045784663864e-03
9100.00000  9150.00000  1.011760847745e-03
9150.00000  9200.00000  9.874069583125e-04
9200.00000  9250.00000  9.530249967608e-04
9250.00000  9300.00000  9.988676121631e-04
9300.00000  9350.00000  9.748718681634e-04
9350.00000  9400.00000  9.322525616567e-04
9400.00000  9450.00000  9.308199799253e-04
9450.00000  9500.00000  9.154197263136e-04
9500.00000  9550.00000  9.311781253582e-04
9550.00000  9600.00000  8.946472912095e-04
9600.00000  9650.00000  9.143452900152e-04
9650.00000  9700.00000  9.243733621344e-04
9700.00000  9750.00000  8.763818741352e-04
9750.00000  9800.00000  8.713678380755e-04
9800.00000  9850.00000  8.928565640454e-04
9850.00000  9900.00000  8.713678380755e-04
9900.00000  9950.00000  8.588327479265e-04
9950.00000  10000.00000  8.262415135390e-04
