300.00000  350.00000  5.064950466792e-06
350.00000  400.00000  8.682772228786e-06
400.00000  450.00000  1.302415834318e-05
450.00000  500.00000  1.447128704798e-05
500.00000  550.00000  1.088964350360e-04
550.00000  600.00000  7.959207876388e-06
600.00000  650.00000  3.509287109135e-05
650.00000  700.00000  1.700376228137e-05
700.00000  750.00000  2.821900974356e-05
750.00000  800.00000  3.038970280075e-05
800.00000  850.00000  8.067742529247e-05
850.00000  900.00000  1.989801969097e-05
900.00000  950.00000  1.989801969097e-05
950.00000  1000.00000  2.206871274817e-05
1000.00000  1050.00000  2.785722756736e-05
1050.00000  1100.00000  3.328396021035e-05
1100.00000  1150.00000  2.749544539116e-05
1150.00000  1200.00000  2.966613844835e-05
1200.00000  1250.00000  3.364574238655e-05
1250.00000  1300.00000  8.538059358307e-05
1300.00000  1350.00000  2.532475233396e-05
1350.00000  1400.00000  3.002792062455e-05
1400.00000  1450.00000  2.785722756736e-05
1450.00000  1500.00000  4.558455420113e-05
1500.00000  1550.00000  3.436930673895e-05
1550.00000  1600.00000  3.871069285334e-05
1600.00000  1650.00000  3.690178197234e-05
1650.00000  1700.00000  3.798712850094e-05
1700.00000  1750.00000  1.183027716172e-04
1750.00000  1800.00000  4.232851461533e-05
1800.00000  1850.00000  5.354376207752e-05
1850.00000  1900.00000  3.834891067714e-05
1900.00000  1950.00000  4.775524725833e-05
1950.00000  2000.00000  4.847881161072e-05
2000.00000  2050.00000  5.354376207752e-05
2050.00000  2100.00000  4.847881161072e-05
2100.00000  2150.00000  4.739346508213e-05
2150.00000  2200.00000  4.630811855353e-05
2200.00000  2250.00000  5.282019772512e-05
2250.00000  2300.00000  5.426732642992e-05
2300.00000  2350.00000  1.338594051938e-04
2350.00000  2400.00000  4.920237596312e-05
2400.00000  2450.00000  5.390554425372e-05
2450.00000  2500.00000  5.535267295851e-05
2500.00000  2550.00000  5.173485119652e-05
2550.00000  2600.00000  4.522277202493e-05
2600.00000  2650.00000  5.860871254431e-05
2650.00000  2700.00000  4.775524725833e-05
2700.00000  2750.00000  5.245841554892e-05
2750.00000  2800.00000  5.643801948711e-05
2800.00000  2850.00000  5.535267295851e-05
2850.00000  2900.00000  5.354376207752e-05
2900.00000  2950.00000  5.643801948711e-05
2950.00000  3000.00000  8.827485099266e-05
3000.00000  3050.00000  4.847881161072e-05
3050.00000  3100.00000  5.679980166331e-05
3100.00000  3150.00000  6.295009865870e-05
3150.00000  3200.00000  5.752336601571e-05
3200.00000  3250.00000  6.765326694929e-05
3250.00000  3300.00000  6.512079171590e-05
3300.00000  3350.00000  6.584435606830e-05
3350.00000  3400.00000  7.488891047328e-05
3400.00000  3450.00000  7.705960353048e-05
3450.00000  3500.00000  7.886851441148e-05
3500.00000  3550.00000  8.357168270207e-05
3550.00000  3600.00000  9.225445493086e-05
3600.00000  3650.00000  1.002136628072e-04
3650.00000  3700.00000  1.360300982510e-04
3700.00000  3750.00000  1.107053459170e-04
3750.00000  3800.00000  1.063639598026e-04
3800.00000  3850.00000  1.204734646744e-04
3850.00000  3900.00000  1.128760389742e-04
3900.00000  3950.00000  1.284326725508e-04
3950.00000  4000.00000  1.284326725508e-04
4000.00000  4050.00000  1.374772269558e-04
4050.00000  4100.00000  1.635255436421e-04
4100.00000  4150.00000  1.584605931754e-04
4150.00000  4200.00000  1.635255436421e-04
4200.00000  4250.00000  1.628019792897e-04
4250.00000  4300.00000  1.801675237473e-04
4300.00000  4350.00000  1.946388107953e-04
4350.00000  4400.00000  1.917445533857e-04
4400.00000  4450.00000  2.015126721431e-04
4450.00000  4500.00000  2.116425730767e-04
4500.00000  4550.00000  2.062158404337e-04
4550.00000  4600.00000  2.358819788820e-04
4600.00000  4650.00000  2.257520779484e-04
4650.00000  4700.00000  2.521621768110e-04
4700.00000  4750.00000  2.561417807492e-04
4750.00000  4800.00000  2.575889094540e-04
4800.00000  4850.00000  2.742308895592e-04
4850.00000  4900.00000  2.695277212686e-04
4900.00000  4950.00000  2.995556418931e-04
4950.00000  5000.00000  2.944906914263e-04
5000.00000  5050.00000  2.872550479024e-04
5050.00000  5100.00000  3.129415824125e-04
5100.00000  5150.00000  2.872550479024e-04
5150.00000  5200.00000  3.154740576459e-04
5200.00000  5250.00000  3.183683150555e-04
5250.00000  5300.00000  3.353720773369e-04
5300.00000  5350.00000  3.223479189937e-04
5350.00000  5400.00000  3.371809882179e-04
5400.00000  5450.00000  3.465873247991e-04
5450.00000  5500.00000  3.321160377511e-04
5500.00000  5550.00000  3.295835625177e-04
5550.00000  5600.00000  3.693796018996e-04
5600.00000  5650.00000  3.715502949568e-04
5650.00000  5700.00000  3.523758396182e-04
5700.00000  5750.00000  3.578025722612e-04
5750.00000  5800.00000  3.617821761994e-04
5800.00000  5850.00000  3.505669287373e-04
5850.00000  5900.00000  3.661235623138e-04
5900.00000  5950.00000  3.686560375472e-04
5950.00000  6000.00000  3.476726713277e-04
6000.00000  6050.00000  3.715502949568e-04
6050.00000  6100.00000  3.530994039706e-04
6100.00000  6150.00000  3.704649484282e-04
6150.00000  6200.00000  3.693796018996e-04
6200.00000  6250.00000  4.088138591054e-04
6250.00000  6300.00000  4.623576211829e-04
6300.00000  6350.00000  4.171348491579e-04
6350.00000  6400.00000  1.813252267112e-03
6400.00000  6450.00000  3.422459386847e-04
6450.00000  6500.00000  3.599732653184e-04
6500.00000  6550.00000  3.744445523664e-04
6550.00000  6600.00000  3.773388097760e-04
6600.00000  6650.00000  3.675706910186e-04
6650.00000  6700.00000  3.570790079088e-04
6700.00000  6750.00000  3.682942553710e-04
6750.00000  6800.00000  3.455019782705e-04
6800.00000  6850.00000  3.549083148516e-04
6850.00000  6900.00000  3.570790079088e-04
6900.00000  6950.00000  3.621439583756e-04
6950.00000  7000.00000  3.737209880140e-04
7000.00000  7050.00000  3.436930673895e-04
7050.00000  7100.00000  4.963651457456e-04
7100.00000  7150.00000  1.855942563903e-04
7150.00000  7200.00000  1.682287119327e-04
7200.00000  7250.00000  1.812528702759e-04
7250.00000  7300.00000  1.725700980471e-04
7300.00000  7350.00000  1.761879198091e-04
7350.00000  7400.00000  1.805293059235e-04
7400.00000  7450.00000  1.826999989807e-04
7450.00000  7500.00000  2.333495036486e-04
7500.00000  7550.00000  1.816146524521e-04
7550.00000  7600.00000  1.808910880997e-04
7600.00000  7650.00000  1.816146524521e-04
7650.00000  7700.00000  1.855942563903e-04
7700.00000  7750.00000  1.783586128663e-04
7750.00000  7800.00000  1.801675237473e-04
7800.00000  7850.00000  1.747407911043e-04
7850.00000  7900.00000  1.924681177381e-04
7900.00000  7950.00000  1.939152464429e-04
7950.00000  8000.00000  1.881267316237e-04
8000.00000  8050.00000  1.801675237473e-04
8050.00000  8100.00000  1.859560385665e-04
8100.00000  8150.00000  1.638873258183e-04
8150.00000  8200.00000  1.823382168045e-04
8200.00000  8250.00000  1.660580188755e-04
8250.00000  8300.00000  1.877649494475e-04
8300.00000  8350.00000  1.703994049899e-04
8350.00000  8400.00000  1.653344545231e-04
8400.00000  8450.00000  1.798057415711e-04
8450.00000  8500.00000  1.675051475803e-04
8500.00000  8550.00000  1.656962366993e-04
8550.00000  8600.00000  1.653344545231e-04
8600.00000  8650.00000  1.591841575278e-04
8650.00000  8700.00000  1.682287119327e-04
8700.00000  8750.00000  1.660580188755e-04
8750.00000  8800.00000  1.595459397040e-04
8800.00000  8850.00000  1.729318802233e-04
8850.00000  8900.00000  1.747407911043e-04
8900.00000  8950.00000  1.533956427086e-04
8950.00000  9000.00000  1.577370288230e-04
9000.00000  9050.00000  1.624401971135e-04
9050.00000  9100.00000  1.570134644706e-04
9100.00000  9150.00000  1.479689100656e-04
9150.00000  9200.00000  1.740172267519e-04
9200.00000  9250.00000  1.595459397040e-04
9250.00000  9300.00000  1.595459397040e-04
9300.00000  9350.00000  1.747407911043e-04
9350.00000  9400.00000  1.649726723469e-04
9400.00000  9450.00000  1.566516822944e-04
9450.00000  9500.00000  1.490542565942e-04
9500.00000  9550.00000  1.577370288230e-04
9550.00000  9600.00000  1.606312862325e-04
9600.00000  9650.00000  1.660580188755e-04
9650.00000  9700.00000  1.559281179420e-04
9700.00000  9750.00000  1.508631674752e-04
9750.00000  9800.00000  1.530338605324e-04
9800.00000  9850.00000  1.577370288230e-04
9850.00000  9900.00000  1.552045535896e-04
9900.00000  9950.00000  1.483306922418e-04
9950.00000  10000.00000  1.418186130702e-04
