300.00000  350.00000  1.447128704798e-06
350.00000  400.00000  1.085346528598e-06
400.00000  450.00000  7.235643523989e-07
450.00000  500.00000  2.894257409595e-06
500.00000  550.00000  9.044554404986e-06
550.00000  600.00000  1.085346528598e-06
600.00000  650.00000  2.170693057197e-06
650.00000  700.00000  1.447128704798e-06
700.00000  750.00000  1.447128704798e-06
750.00000  800.00000  1.447128704798e-06
800.00000  850.00000  5.788514819191e-06
850.00000  900.00000  7.235643523989e-07
900.00000  950.00000  3.617821761994e-07
950.00000  1000.00000  7.235643523989e-07
1000.00000  1050.00000  7.235643523989e-07
1050.00000  1100.00000  3.617821761994e-07
1100.00000  1150.00000  1.808910880997e-06
1150.00000  1200.00000  3.617821761994e-07
1200.00000  1250.00000  1.085346528598e-06
1250.00000  1300.00000  5.064950466792e-06
1300.00000  1350.00000  1.085346528598e-06
1350.00000  1400.00000  1.447128704798e-06
1400.00000  1450.00000  3.617821761994e-07
1450.00000  1500.00000  1.447128704798e-06
1500.00000  1550.00000  1.808910880997e-06
1550.00000  1600.00000  1.808910880997e-06
1600.00000  1650.00000  2.532475233396e-06
1650.00000  1700.00000  2.894257409595e-06
1700.00000  1750.00000  1.953623751477e-05
1750.00000  1800.00000  1.808910880997e-06
1800.00000  1850.00000  2.170693057197e-06
1850.00000  1900.00000  2.894257409595e-06
1900.00000  1950.00000  2.170693057197e-06
1950.00000  2000.00000  3.979603938194e-06
2000.00000  2050.00000  3.617821761994e-06
2050.00000  2100.00000  4.341386114393e-06
2100.00000  2150.00000  5.064950466792e-06
2150.00000  2200.00000  2.170693057197e-06
2200.00000  2250.00000  3.617821761994e-06
2250.00000  2300.00000  2.894257409595e-06
2300.00000  2350.00000  3.256039585795e-05
2350.00000  2400.00000  5.064950466792e-06
2400.00000  2450.00000  5.788514819191e-06
2450.00000  2500.00000  6.150296995390e-06
2500.00000  2550.00000  3.617821761994e-06
2550.00000  2600.00000  6.150296995390e-06
2600.00000  2650.00000  9.044554404986e-06
2650.00000  2700.00000  4.703168290593e-06
2700.00000  2750.00000  5.064950466792e-06
2750.00000  2800.00000  6.512079171590e-06
2800.00000  2850.00000  5.426732642992e-06
2850.00000  2900.00000  7.597425700188e-06
2900.00000  2950.00000  6.150296995390e-06
2950.00000  3000.00000  1.664198010517e-05
3000.00000  3050.00000  7.597425700188e-06
3050.00000  3100.00000  6.873861347789e-06
3100.00000  3150.00000  1.193881181458e-05
3150.00000  3200.00000  1.193881181458e-05
3200.00000  3250.00000  8.682772228786e-06
3250.00000  3300.00000  1.338594051938e-05
3300.00000  3350.00000  1.121524746218e-05
3350.00000  3400.00000  1.338594051938e-05
3400.00000  3450.00000  1.338594051938e-05
3450.00000  3500.00000  1.410950487178e-05
3500.00000  3550.00000  1.085346528598e-05
3550.00000  3600.00000  1.266237616698e-05
3600.00000  3650.00000  1.808910880997e-05
3650.00000  3700.00000  3.002792062455e-05
3700.00000  3750.00000  1.808910880997e-05
3750.00000  3800.00000  1.989801969097e-05
3800.00000  3850.00000  1.628019792897e-05
3850.00000  3900.00000  2.496297015776e-05
3900.00000  3950.00000  2.785722756736e-05
3950.00000  4000.00000  3.075148497695e-05
4000.00000  4050.00000  2.930435627215e-05
4050.00000  4100.00000  2.677188103876e-05
4100.00000  4150.00000  2.677188103876e-05
4150.00000  4200.00000  3.617821761994e-05
4200.00000  4250.00000  4.449920767253e-05
4250.00000  4300.00000  3.979603938194e-05
4300.00000  4350.00000  4.594633637733e-05
4350.00000  4400.00000  4.847881161072e-05
4400.00000  4450.00000  5.028772249172e-05
4450.00000  4500.00000  6.295009865870e-05
4500.00000  4550.00000  6.982396000649e-05
4550.00000  4600.00000  6.512079171590e-05
4600.00000  4650.00000  7.054752435889e-05
4650.00000  4700.00000  6.403544518730e-05
4700.00000  4750.00000  9.333980145945e-05
4750.00000  4800.00000  7.814495005908e-05
4800.00000  4850.00000  7.850673223528e-05
4850.00000  4900.00000  9.406336581185e-05
4900.00000  4950.00000  9.731940539765e-05
4950.00000  5000.00000  1.052786132740e-04
5000.00000  5050.00000  1.031079202168e-04
5050.00000  5100.00000  1.103435637408e-04
5100.00000  5150.00000  1.222823755554e-04
5150.00000  5200.00000  1.179409894410e-04
5200.00000  5250.00000  1.168556429124e-04
5250.00000  5300.00000  1.367536626034e-04
5300.00000  5350.00000  1.349447517224e-04
5350.00000  5400.00000  1.353065338986e-04
5400.00000  5450.00000  1.403714843654e-04
5450.00000  5500.00000  1.523102961800e-04
5500.00000  5550.00000  1.646108901707e-04
5550.00000  5600.00000  1.743790089281e-04
5600.00000  5650.00000  1.682287119327e-04
5650.00000  5700.00000  1.790821772187e-04
5700.00000  5750.00000  1.609930684087e-04
5750.00000  5800.00000  1.776350485139e-04
5800.00000  5850.00000  1.950005929715e-04
5850.00000  5900.00000  1.989801969097e-04
5900.00000  5950.00000  1.928298999143e-04
5950.00000  6000.00000  1.960859395001e-04
6000.00000  6050.00000  2.040451473765e-04
6050.00000  6100.00000  2.007891077907e-04
6100.00000  6150.00000  2.185164344245e-04
6150.00000  6200.00000  2.250285135960e-04
6200.00000  6250.00000  2.159839591911e-04
6250.00000  6300.00000  2.452883154632e-04
6300.00000  6350.00000  2.543328698682e-04
6350.00000  6400.00000  7.416534612088e-04
6400.00000  6450.00000  2.478207906966e-04
6450.00000  6500.00000  2.210489096579e-04
6500.00000  6550.00000  2.431176224060e-04
6550.00000  6600.00000  2.413087115250e-04
6600.00000  6650.00000  2.340730680010e-04
6650.00000  6700.00000  2.333495036486e-04
6700.00000  6750.00000  2.463736619918e-04
6750.00000  6800.00000  2.326259392962e-04
6800.00000  6850.00000  2.373291075868e-04
6850.00000  6900.00000  2.492679194014e-04
6900.00000  6950.00000  2.510768302824e-04
6950.00000  7000.00000  2.398615828202e-04
7000.00000  7050.00000  2.503532659300e-04
7050.00000  7100.00000  3.024498993027e-04
7100.00000  7150.00000  1.230059399078e-04
7150.00000  7200.00000  8.718950446406e-05
7200.00000  7250.00000  1.016607915120e-04
7250.00000  7300.00000  9.804296975005e-05
7300.00000  7350.00000  1.070875241550e-04
7350.00000  7400.00000  1.060021776264e-04
7400.00000  7450.00000  1.139613855028e-04
7450.00000  7500.00000  1.240912864364e-04
7500.00000  7550.00000  1.081728706836e-04
7550.00000  7600.00000  1.114289102694e-04
7600.00000  7650.00000  1.284326725508e-04
7650.00000  7700.00000  1.175792072648e-04
7700.00000  7750.00000  1.244530686126e-04
7750.00000  7800.00000  1.060021776264e-04
7800.00000  7850.00000  1.295180190794e-04
7850.00000  7900.00000  1.353065338986e-04
7900.00000  7950.00000  1.266237616698e-04
7950.00000  8000.00000  1.269855438460e-04
8000.00000  8050.00000  1.237295042602e-04
8050.00000  8100.00000  1.306033656080e-04
8100.00000  8150.00000  1.291562369032e-04
8150.00000  8200.00000  1.309651477842e-04
8200.00000  8250.00000  1.382007913082e-04
8250.00000  8300.00000  1.334976230176e-04
8300.00000  8350.00000  1.349447517224e-04
8350.00000  8400.00000  1.374772269558e-04
8400.00000  8450.00000  1.324122764890e-04
8450.00000  8500.00000  1.360300982510e-04
8500.00000  8550.00000  1.331358408414e-04
8550.00000  8600.00000  1.273473260222e-04
8600.00000  8650.00000  1.439893061274e-04
8650.00000  8700.00000  1.334976230176e-04
8700.00000  8750.00000  1.338594051938e-04
8750.00000  8800.00000  1.443510883036e-04
8800.00000  8850.00000  1.457982170084e-04
8850.00000  8900.00000  1.338594051938e-04
8900.00000  8950.00000  1.309651477842e-04
8950.00000  9000.00000  1.392861378368e-04
9000.00000  9050.00000  1.439893061274e-04
9050.00000  9100.00000  1.363918804272e-04
9100.00000  9150.00000  1.392861378368e-04
9150.00000  9200.00000  1.483306922418e-04
9200.00000  9250.00000  1.584605931754e-04
9250.00000  9300.00000  1.436275239512e-04
9300.00000  9350.00000  1.465217813608e-04
9350.00000  9400.00000  1.505013852990e-04
9400.00000  9450.00000  1.508631674752e-04
9450.00000  9500.00000  1.537574248848e-04
9500.00000  9550.00000  1.360300982510e-04
9550.00000  9600.00000  1.544809892372e-04
9600.00000  9650.00000  1.555663357658e-04
9650.00000  9700.00000  1.447128704798e-04
9700.00000  9750.00000  1.667815832279e-04
9750.00000  9800.00000  1.483306922418e-04
9800.00000  9850.00000  1.439893061274e-04
9850.00000  9900.00000  1.649726723469e-04
9900.00000  9950.00000  1.631637614659e-04
9950.00000  10000.00000  1.505013852990e-04
