300.00000  350.00000  2.693799250239e-06
350.00000  400.00000  1.423865317984e-05
400.00000  450.00000  8.466226215037e-06
450.00000  500.00000  8.466226215037e-06
500.00000  550.00000  8.466226215037e-05
550.00000  600.00000  7.696569286397e-06
600.00000  650.00000  2.732282096671e-05
650.00000  700.00000  4.617941571838e-06
700.00000  750.00000  1.616279550143e-05
750.00000  800.00000  1.423865317984e-05
800.00000  850.00000  3.424973332447e-05
850.00000  900.00000  1.077519700096e-05
900.00000  950.00000  1.116002546528e-05
950.00000  1000.00000  1.116002546528e-05
1000.00000  1050.00000  8.851054679357e-06
1050.00000  1100.00000  1.192968239392e-05
1100.00000  1150.00000  8.081397750717e-06
1150.00000  1200.00000  6.157255429118e-06
1200.00000  1250.00000  7.311740822077e-06
1250.00000  1300.00000  2.039590860895e-05
1300.00000  1350.00000  6.542083893438e-06
1350.00000  1400.00000  9.235883143677e-06
1400.00000  1450.00000  8.081397750717e-06
1450.00000  1500.00000  6.542083893438e-06
1500.00000  1550.00000  6.926912357758e-06
1550.00000  1600.00000  6.542083893438e-06
1600.00000  1650.00000  3.848284643199e-06
1650.00000  1700.00000  6.542083893438e-06
1700.00000  1750.00000  1.962625168031e-05
1750.00000  1800.00000  4.233113107519e-06
1800.00000  1850.00000  5.772426964798e-06
1850.00000  1900.00000  5.002770036158e-06
1900.00000  1950.00000  6.542083893438e-06
1950.00000  2000.00000  5.387598500478e-06
2000.00000  2050.00000  5.002770036158e-06
2050.00000  2100.00000  4.233113107519e-06
2100.00000  2150.00000  6.157255429118e-06
2150.00000  2200.00000  3.078627714559e-06
2200.00000  2250.00000  4.617941571838e-06
2250.00000  2300.00000  5.772426964798e-06
2300.00000  2350.00000  2.232005093055e-05
2350.00000  2400.00000  2.693799250239e-06
2400.00000  2450.00000  3.078627714559e-06
2450.00000  2500.00000  7.311740822077e-06
2500.00000  2550.00000  4.233113107519e-06
2550.00000  2600.00000  2.693799250239e-06
2600.00000  2650.00000  5.002770036158e-06
2650.00000  2700.00000  4.617941571838e-06
2700.00000  2750.00000  2.308970785919e-06
2750.00000  2800.00000  5.002770036158e-06
2800.00000  2850.00000  1.539313857279e-06
2850.00000  2900.00000  7.311740822077e-06
2900.00000  2950.00000  6.926912357758e-06
2950.00000  3000.00000  1.500831010847e-05
3000.00000  3050.00000  8.851054679357e-06
3050.00000  3100.00000  6.157255429118e-06
3100.00000  3150.00000  1.039036853664e-05
3150.00000  3200.00000  8.466226215037e-06
3200.00000  3250.00000  1.269933932256e-05
3250.00000  3300.00000  1.577796703711e-05
3300.00000  3350.00000  8.851054679357e-06
3350.00000  3400.00000  1.231451085824e-05
3400.00000  3450.00000  1.346899625120e-05
3450.00000  3500.00000  2.116556553759e-05
3500.00000  3550.00000  2.001108014463e-05
3550.00000  3600.00000  2.539867864511e-05
3600.00000  3650.00000  3.194076253855e-05
3650.00000  3700.00000  5.426081346910e-05
3700.00000  3750.00000  4.425527339678e-05
3750.00000  3800.00000  4.310078800383e-05
3800.00000  3850.00000  5.541529886206e-05
3850.00000  3900.00000  6.003324043390e-05
3900.00000  3950.00000  6.195738275550e-05
3950.00000  4000.00000  6.234221121982e-05
4000.00000  4050.00000  7.157809436350e-05
4050.00000  4100.00000  7.119326589918e-05
4100.00000  4150.00000  9.120434604381e-05
4150.00000  4200.00000  9.736160147293e-05
4200.00000  4250.00000  9.659194454429e-05
4250.00000  4300.00000  1.273782216899e-04
4300.00000  4350.00000  1.123699115814e-04
4350.00000  4400.00000  1.235299370467e-04
4400.00000  4450.00000  1.273782216899e-04
4450.00000  4500.00000  1.477741302988e-04
4500.00000  4550.00000  1.520072434063e-04
4550.00000  4600.00000  1.562403565139e-04
4600.00000  4650.00000  1.593189842284e-04
4650.00000  4700.00000  1.858721482665e-04
4700.00000  4750.00000  2.028046006966e-04
4750.00000  4800.00000  1.877962905881e-04
4800.00000  4850.00000  2.039590860895e-04
4850.00000  4900.00000  1.985714875891e-04
4900.00000  4950.00000  2.155039400191e-04
4950.00000  5000.00000  2.282032793417e-04
5000.00000  5050.00000  2.332060493778e-04
5050.00000  5100.00000  2.324363924492e-04
5100.00000  5150.00000  2.332060493778e-04
5150.00000  5200.00000  2.713040673455e-04
5200.00000  5250.00000  2.632226695948e-04
5250.00000  5300.00000  2.643771549877e-04
5300.00000  5350.00000  2.693799250239e-04
5350.00000  5400.00000  2.686102680953e-04
5400.00000  5450.00000  2.905454905615e-04
5450.00000  5500.00000  2.920848044188e-04
5500.00000  5550.00000  3.109413991705e-04
5550.00000  5600.00000  3.067082860629e-04
5600.00000  5650.00000  3.043993152770e-04
5650.00000  5700.00000  3.182531399925e-04
5700.00000  5750.00000  3.078627714559e-04
5750.00000  5800.00000  2.963179175263e-04
5800.00000  5850.00000  3.151745122780e-04
5850.00000  5900.00000  3.190227969212e-04
5900.00000  5950.00000  3.251800523503e-04
5950.00000  6000.00000  3.282586800648e-04
6000.00000  6050.00000  3.178683115282e-04
6050.00000  6100.00000  3.109413991705e-04
6100.00000  6150.00000  3.321069647080e-04
6150.00000  6200.00000  3.517332163884e-04
6200.00000  6250.00000  3.998367744283e-04
6250.00000  6300.00000  4.367803070030e-04
6300.00000  6350.00000  4.021457452143e-04
6350.00000  6400.00000  1.783679932123e-03
6400.00000  6450.00000  3.274890231362e-04
6450.00000  6500.00000  3.605842710677e-04
6500.00000  6550.00000  3.336462785653e-04
6550.00000  6600.00000  3.390338770658e-04
6600.00000  6650.00000  3.271041946719e-04
6650.00000  6700.00000  3.428821617090e-04
6700.00000  6750.00000  3.448063040306e-04
6750.00000  6800.00000  3.236407384930e-04
6800.00000  6850.00000  3.401883624588e-04
6850.00000  6900.00000  3.398035339944e-04
6900.00000  6950.00000  3.478849317452e-04
6950.00000  7000.00000  3.297979939221e-04
7000.00000  7050.00000  3.082475999202e-04
7050.00000  7100.00000  4.848838650430e-04
7100.00000  7150.00000  1.735576374083e-04
7150.00000  7200.00000  1.570100134425e-04
7200.00000  7250.00000  1.485437872275e-04
7250.00000  7300.00000  1.562403565139e-04
7300.00000  7350.00000  1.639369258003e-04
7350.00000  7400.00000  1.643217542646e-04
7400.00000  7450.00000  1.627824404073e-04
7450.00000  7500.00000  2.108859984473e-04
7500.00000  7550.00000  1.612431265500e-04
7550.00000  7600.00000  1.535465572636e-04
7600.00000  7650.00000  1.516224149420e-04
7650.00000  7700.00000  1.539313857279e-04
7700.00000  7750.00000  1.493134441561e-04
7750.00000  7800.00000  1.520072434063e-04
7800.00000  7850.00000  1.620127834787e-04
7850.00000  7900.00000  1.627824404073e-04
7900.00000  7950.00000  1.612431265500e-04
7950.00000  8000.00000  1.562403565139e-04
8000.00000  8050.00000  1.481589587631e-04
8050.00000  8100.00000  1.612431265500e-04
8100.00000  8150.00000  1.612431265500e-04
8150.00000  8200.00000  1.493134441561e-04
8200.00000  8250.00000  1.623976119430e-04
8250.00000  8300.00000  1.581644988355e-04
8300.00000  8350.00000  1.443106741200e-04
8350.00000  8400.00000  1.508527580134e-04
8400.00000  8450.00000  1.481589587631e-04
8450.00000  8500.00000  1.462348164415e-04
8500.00000  8550.00000  1.631672688716e-04
8550.00000  8600.00000  1.373837617622e-04
8600.00000  8650.00000  1.597038126927e-04
8650.00000  8700.00000  1.458499879772e-04
8700.00000  8750.00000  1.573948419068e-04
8750.00000  8800.00000  1.446955025843e-04
8800.00000  8850.00000  1.500831010847e-04
8850.00000  8900.00000  1.473893018345e-04
8900.00000  8950.00000  1.539313857279e-04
8950.00000  9000.00000  1.493134441561e-04
9000.00000  9050.00000  1.616279550143e-04
9050.00000  9100.00000  1.512375864777e-04
9100.00000  9150.00000  1.496982726204e-04
9150.00000  9200.00000  1.462348164415e-04
9200.00000  9250.00000  1.408472179411e-04
9250.00000  9300.00000  1.481589587631e-04
9300.00000  9350.00000  1.350747909763e-04
9350.00000  9400.00000  1.485437872275e-04
9400.00000  9450.00000  1.381534186908e-04
9450.00000  9500.00000  1.404623894768e-04
9500.00000  9550.00000  1.466196449059e-04
9550.00000  9600.00000  1.358444479049e-04
9600.00000  9650.00000  1.446955025843e-04
9650.00000  9700.00000  1.331506486547e-04
9700.00000  9750.00000  1.504679295491e-04
9750.00000  9800.00000  1.319961632617e-04
9800.00000  9850.00000  1.343051340476e-04
9850.00000  9900.00000  1.446955025843e-04
9900.00000  9950.00000  1.300720209401e-04
9950.00000  10000.00000  1.420017033340e-04
