300.00000  350.00000  0.000000000000e+00
350.00000  400.00000  1.437040985566e-06
400.00000  450.00000  7.185204927831e-07
450.00000  500.00000  1.077780739175e-06
500.00000  550.00000  3.017786069689e-05
550.00000  600.00000  7.185204927831e-07
600.00000  650.00000  9.340766406180e-06
650.00000  700.00000  2.155561478349e-06
700.00000  750.00000  6.825944681439e-06
750.00000  800.00000  3.233342217524e-06
800.00000  850.00000  2.155561478349e-05
850.00000  900.00000  2.874081971132e-06
900.00000  950.00000  2.514821724741e-06
950.00000  1000.00000  3.233342217524e-06
1000.00000  1050.00000  5.388903695873e-06
1050.00000  1100.00000  3.233342217524e-06
1100.00000  1150.00000  7.185204927831e-06
1150.00000  1200.00000  5.388903695873e-06
1200.00000  1250.00000  6.107424188656e-06
1250.00000  1300.00000  3.664454513194e-05
1300.00000  1350.00000  1.077780739175e-05
1350.00000  1400.00000  1.868153281236e-05
1400.00000  1450.00000  2.514821724741e-05
1450.00000  1500.00000  4.167418858142e-05
1500.00000  1550.00000  6.035572139378e-05
1550.00000  1600.00000  8.298911691645e-05
1600.00000  1650.00000  1.077780739175e-04
1650.00000  1700.00000  1.494522624989e-04
1700.00000  1750.00000  2.572303364163e-04
1750.00000  1800.00000  2.737563077504e-04
1800.00000  1850.00000  3.111193733751e-04
1850.00000  1900.00000  3.107601131287e-04
1900.00000  1950.00000  3.901566275812e-04
1950.00000  2000.00000  4.993717424843e-04
2000.00000  2050.00000  5.126643716007e-04
2050.00000  2100.00000  6.100238983728e-04
2100.00000  2150.00000  6.743314824769e-04
2150.00000  2200.00000  7.443872305233e-04
2200.00000  2250.00000  7.968392264965e-04
2250.00000  2300.00000  8.679727552820e-04
2300.00000  2350.00000  9.394655443139e-04
2350.00000  2400.00000  9.692841447644e-04
2400.00000  2450.00000  1.024969482955e-03
2450.00000  2500.00000  9.994620054613e-04
2500.00000  2550.00000  9.646137615613e-04
2550.00000  2600.00000  9.689248845180e-04
2600.00000  2650.00000  1.024969482955e-03
2650.00000  2700.00000  1.037902851825e-03
2700.00000  2750.00000  1.049758439956e-03
2750.00000  2800.00000  1.063051069073e-03
2800.00000  2850.00000  1.051554741188e-03
2850.00000  2900.00000  1.022813921477e-03
2900.00000  2950.00000  1.066643671537e-03
2950.00000  3000.00000  1.045447316999e-03
3000.00000  3050.00000  1.022095400984e-03
3050.00000  3100.00000  1.062691808826e-03
3100.00000  3150.00000  1.028921345665e-03
3150.00000  3200.00000  9.876064173304e-04
3200.00000  3250.00000  9.646137615613e-04
3250.00000  3300.00000  9.603026386046e-04
3300.00000  3350.00000  9.301247779077e-04
3350.00000  3400.00000  9.347951611108e-04
3400.00000  3450.00000  9.290469971685e-04
3450.00000  3500.00000  9.452137082562e-04
3500.00000  3550.00000  8.600690298614e-04
3550.00000  3600.00000  8.367171138459e-04
3600.00000  3650.00000  8.421060175418e-04
3650.00000  3700.00000  8.320467306428e-04
3700.00000  3750.00000  7.993540482212e-04
3750.00000  3800.00000  8.025873904387e-04
3800.00000  3850.00000  7.400761075666e-04
3850.00000  3900.00000  7.458242715089e-04
3900.00000  3950.00000  7.098982468697e-04
3950.00000  4000.00000  7.203167940151e-04
4000.00000  4050.00000  6.825944681439e-04
4050.00000  4100.00000  6.728944414914e-04
4100.00000  4150.00000  6.459499230120e-04
4150.00000  4200.00000  6.003238717203e-04
4200.00000  4250.00000  6.305017324172e-04
4250.00000  4300.00000  6.039164741842e-04
4300.00000  4350.00000  5.809238184151e-04
4350.00000  4400.00000  5.360162876162e-04
4400.00000  4450.00000  5.554163409213e-04
4450.00000  4500.00000  5.327829453987e-04
4500.00000  4550.00000  5.105088101224e-04
4550.00000  4600.00000  5.011680437162e-04
4600.00000  4650.00000  4.677568408018e-04
4650.00000  4700.00000  4.454827055255e-04
4700.00000  4750.00000  4.347048981338e-04
4750.00000  4800.00000  4.440456645400e-04
4800.00000  4850.00000  4.354234186266e-04
4850.00000  4900.00000  4.131492833503e-04
4900.00000  4950.00000  4.030899964513e-04
4950.00000  5000.00000  3.711158345225e-04
5000.00000  5050.00000  3.808158611750e-04
5050.00000  5100.00000  3.614158078699e-04
5100.00000  5150.00000  3.592602463915e-04
5150.00000  5200.00000  3.430935353039e-04
5200.00000  5250.00000  3.377046316081e-04
5250.00000  5300.00000  3.377046316081e-04
5300.00000  5350.00000  3.208194000277e-04
5350.00000  5400.00000  3.114786336215e-04
5400.00000  5450.00000  2.906415393308e-04
5450.00000  5500.00000  2.877674573596e-04
5500.00000  5550.00000  2.945934020411e-04
5550.00000  5600.00000  2.848933753885e-04
5600.00000  5650.00000  2.856118958813e-04
5650.00000  5700.00000  2.568710761700e-04
5700.00000  5750.00000  2.493266109957e-04
5750.00000  5800.00000  2.525599532133e-04
5800.00000  5850.00000  2.306450781834e-04
5850.00000  5900.00000  2.302858179370e-04
5900.00000  5950.00000  2.353154613865e-04
5950.00000  6000.00000  2.270524757195e-04
6000.00000  6050.00000  2.227413527628e-04
6050.00000  6100.00000  2.090894633999e-04
6100.00000  6150.00000  2.069339019215e-04
6150.00000  6200.00000  2.072931621679e-04
6200.00000  6250.00000  2.011857379793e-04
6250.00000  6300.00000  2.051376006896e-04
6300.00000  6350.00000  2.004672174865e-04
6350.00000  6400.00000  4.429678838008e-04
6400.00000  6450.00000  1.918449715731e-04
6450.00000  6500.00000  1.598708096442e-04
6500.00000  6550.00000  1.688523158040e-04
6550.00000  6600.00000  1.724449182679e-04
6600.00000  6650.00000  1.519670842236e-04
6650.00000  6700.00000  1.638226723545e-04
6700.00000  6750.00000  1.508893034845e-04
6750.00000  6800.00000  1.440633588030e-04
6800.00000  6850.00000  1.422670575711e-04
6850.00000  6900.00000  1.458596600350e-04
6900.00000  6950.00000  1.307707296865e-04
6950.00000  7000.00000  1.318485104257e-04
7000.00000  7050.00000  1.189151415556e-04
7050.00000  7100.00000  1.591522891515e-04
7100.00000  7150.00000  1.059817726855e-04
7150.00000  7200.00000  1.038262112072e-04
7200.00000  7250.00000  9.125210258345e-05
7250.00000  7300.00000  8.622245913397e-05
7300.00000  7350.00000  1.049039919463e-04
7350.00000  7400.00000  8.550393864119e-05
7400.00000  7450.00000  1.031076907144e-04
7450.00000  7500.00000  1.077780739175e-04
7500.00000  7550.00000  9.161136282984e-05
7550.00000  7600.00000  8.945580135150e-05
7600.00000  7650.00000  9.771878701850e-05
7650.00000  7700.00000  8.550393864119e-05
7700.00000  7750.00000  8.622245913397e-05
7750.00000  7800.00000  7.436687100305e-05
7800.00000  7850.00000  9.089284233706e-05
7850.00000  7900.00000  7.831873371336e-05
7900.00000  7950.00000  7.400761075666e-05
7950.00000  8000.00000  7.292983001748e-05
8000.00000  8050.00000  7.688169272779e-05
8050.00000  8100.00000  7.149278903192e-05
8100.00000  8150.00000  7.724095297418e-05
8150.00000  8200.00000  7.149278903192e-05
8200.00000  8250.00000  7.939651445253e-05
8250.00000  8300.00000  6.682240582883e-05
8300.00000  8350.00000  6.215202262574e-05
8350.00000  8400.00000  7.292983001748e-05
8400.00000  8450.00000  6.646314558244e-05
8450.00000  8500.00000  5.496681769791e-05
8500.00000  8550.00000  5.891868040821e-05
8550.00000  8600.00000  6.466684435048e-05
8600.00000  8650.00000  6.861870706079e-05
8650.00000  8700.00000  6.574462508965e-05
8700.00000  8750.00000  6.179276237935e-05
8750.00000  8800.00000  5.460755745152e-05
8800.00000  8850.00000  5.460755745152e-05
8850.00000  8900.00000  5.352977671234e-05
8900.00000  8950.00000  6.143350213295e-05
8950.00000  9000.00000  5.460755745152e-05
9000.00000  9050.00000  5.460755745152e-05
9050.00000  9100.00000  4.742235252368e-05
9100.00000  9150.00000  5.029643449482e-05
9150.00000  9200.00000  5.352977671234e-05
9200.00000  9250.00000  4.742235252368e-05
9250.00000  9300.00000  4.814087301647e-05
9300.00000  9350.00000  4.850013326286e-05
9350.00000  9400.00000  5.101495498760e-05
9400.00000  9450.00000  4.670383203090e-05
9450.00000  9500.00000  5.209273572677e-05
9500.00000  9550.00000  4.275196932059e-05
9550.00000  9600.00000  4.742235252368e-05
9600.00000  9650.00000  4.490753079894e-05
9650.00000  9700.00000  4.957791400203e-05
9700.00000  9750.00000  4.885939350925e-05
9750.00000  9800.00000  4.239270907420e-05
9800.00000  9850.00000  5.065569474121e-05
9850.00000  9900.00000  4.706309227729e-05
9900.00000  9950.00000  3.987788734946e-05
9950.00000  10000.00000  3.628528488555e-05
