10001.00000  11001.00000  2.147243239118e-04
11001.00000  12001.00000  1.792717458300e-04
12001.00000  13001.00000  1.417359102744e-04
13001.00000  14001.00000  1.202709180885e-04
14001.00000  15001.00000  9.992195669214e-05
15001.00000  16001.00000  7.901497990101e-05
16001.00000  17001.00000  7.265360440050e-05
17001.00000  18001.00000  6.186530676807e-05
18001.00000  19001.00000  5.356947789899e-05
19001.00000  20001.00000  4.891934960915e-05
20001.00000  21001.00000  4.292998437183e-05
21001.00000  22001.00000  3.374133087110e-05
22001.00000  23001.00000  3.336932060791e-05
23001.00000  24001.00000  2.912840360757e-05
24001.00000  25001.00000  2.790076973906e-05
25001.00000  26001.00000  2.477588352828e-05
26001.00000  27001.00000  2.220901271229e-05
27001.00000  28001.00000  1.997695113316e-05
28001.00000  29001.00000  1.938173471206e-05
29001.00000  30001.00000  1.659165773816e-05
30001.00000  31001.00000  1.569883310651e-05
31001.00000  32001.00000  1.465720436958e-05
32001.00000  33001.00000  1.287155510628e-05
33001.00000  34001.00000  1.305756023788e-05
34001.00000  35001.00000  1.093710173771e-05
35001.00000  36001.00000  1.071389557980e-05
36001.00000  37001.00000  1.019308121134e-05
37001.00000  38001.00000  9.300256579685e-06
38001.00000  39001.00000  7.514607316386e-06
39001.00000  40001.00000  7.328602184792e-06
40001.00000  41001.00000  7.142597053198e-06
41001.00000  42001.00000  6.249772421549e-06
42001.00000  43001.00000  6.398576526824e-06
43001.00000  44001.00000  6.175370368911e-06
44001.00000  45001.00000  5.654556000449e-06
45001.00000  46001.00000  5.914963184680e-06
46001.00000  47001.00000  5.840561132042e-06
47001.00000  48001.00000  4.947736500393e-06
48001.00000  49001.00000  4.910535474074e-06
49001.00000  50001.00000  4.650128289843e-06
50001.00000  51001.00000  4.129313921380e-06
51001.00000  52001.00000  3.645700579237e-06
52001.00000  53001.00000  3.980509816105e-06
53001.00000  54001.00000  3.682901605555e-06
54001.00000  55001.00000  4.426922131930e-06
55001.00000  56001.00000  3.348092368687e-06
56001.00000  57001.00000  3.124886210774e-06
57001.00000  58001.00000  3.199288263412e-06
58001.00000  59001.00000  2.715674921268e-06
59001.00000  60001.00000  2.827278000224e-06
60001.00000  61001.00000  3.236489289731e-06
61001.00000  62001.00000  2.380865684399e-06
62001.00000  63001.00000  2.455267737037e-06
63001.00000  64001.00000  2.604071842312e-06
64001.00000  65001.00000  1.822850289618e-06
65001.00000  66001.00000  2.343664658081e-06
66001.00000  67001.00000  2.343664658081e-06
67001.00000  68001.00000  2.120458500168e-06
68001.00000  69001.00000  1.897252342256e-06
69001.00000  70001.00000  1.674046184343e-06
70001.00000  71001.00000  1.450840026431e-06
71001.00000  72001.00000  1.860051315937e-06
72001.00000  73001.00000  1.116030789562e-06
73001.00000  74001.00000  1.748448236981e-06
74001.00000  75001.00000  1.339236947475e-06
75001.00000  76001.00000  1.599644131706e-06
76001.00000  77001.00000  1.413639000112e-06
77001.00000  78001.00000  7.812215526936e-07
78001.00000  79001.00000  1.711247210662e-06
79001.00000  80001.00000  1.190432842200e-06
80001.00000  81001.00000  1.413639000112e-06
81001.00000  82001.00000  1.450840026431e-06
82001.00000  83001.00000  5.952164210999e-07
83001.00000  84001.00000  1.190432842200e-06
84001.00000  85001.00000  1.227633868518e-06
85001.00000  86001.00000  1.041628736925e-06
86001.00000  87001.00000  4.464123158249e-07
87001.00000  88001.00000  9.672266842873e-07
88001.00000  89001.00000  9.300256579685e-07
89001.00000  90001.00000  7.440205263748e-07
90001.00000  91001.00000  1.041628736925e-06
91001.00000  92001.00000  8.184225790123e-07
92001.00000  93001.00000  1.004427710606e-06
93001.00000  94001.00000  9.300256579685e-07
94001.00000  95001.00000  9.300256579685e-07
95001.00000  96001.00000  4.092112895062e-07
96001.00000  97001.00000  5.580153947811e-07
97001.00000  98001.00000  6.324174474186e-07
98001.00000  99001.00000  6.696184737374e-07
99001.00000  100001.00000  5.580153947811e-07
100001.00000  101001.00000  6.696184737374e-07
101001.00000  102001.00000  7.440205263748e-07
102001.00000  103001.00000  4.464123158249e-07
103001.00000  104001.00000  5.208143684624e-07
104001.00000  105001.00000  7.812215526936e-07
105001.00000  106001.00000  5.580153947811e-07
106001.00000  107001.00000  5.208143684624e-07
107001.00000  108001.00000  5.580153947811e-07
108001.00000  109001.00000  5.208143684624e-07
109001.00000  110001.00000  3.348092368687e-07
110001.00000  111001.00000  7.440205263748e-07
111001.00000  112001.00000  6.324174474186e-07
112001.00000  113001.00000  5.580153947811e-07
113001.00000  114001.00000  3.720102631874e-07
114001.00000  115001.00000  6.696184737374e-07
115001.00000  116001.00000  4.464123158249e-07
116001.00000  117001.00000  3.348092368687e-07
117001.00000  118001.00000  4.092112895062e-07
118001.00000  119001.00000  2.976082105499e-07
119001.00000  120001.00000  3.348092368687e-07
120001.00000  121001.00000  4.092112895062e-07
121001.00000  122001.00000  4.092112895062e-07
122001.00000  123001.00000  3.720102631874e-07
123001.00000  124001.00000  3.348092368687e-07
124001.00000  125001.00000  3.720102631874e-07
125001.00000  126001.00000  2.976082105499e-07
126001.00000  127001.00000  4.092112895062e-07
127001.00000  128001.00000  3.348092368687e-07
128001.00000  129001.00000  2.232061579125e-07
129001.00000  130001.00000  2.976082105499e-07
130001.00000  131001.00000  2.604071842312e-07
131001.00000  132001.00000  2.604071842312e-07
132001.00000  133001.00000  3.720102631874e-07
133001.00000  134001.00000  2.232061579125e-07
134001.00000  135001.00000  4.092112895062e-07
135001.00000  136001.00000  2.232061579125e-07
136001.00000  137001.00000  4.464123158249e-07
137001.00000  138001.00000  3.720102631874e-07
138001.00000  139001.00000  2.604071842312e-07
139001.00000  140001.00000  2.976082105499e-07
140001.00000  141001.00000  2.604071842312e-07
141001.00000  142001.00000  1.860051315937e-07
142001.00000  143001.00000  3.720102631874e-07
143001.00000  144001.00000  2.232061579125e-07
144001.00000  145001.00000  2.604071842312e-07
145001.00000  146001.00000  2.232061579125e-07
146001.00000  147001.00000  1.116030789562e-07
147001.00000  148001.00000  3.348092368687e-07
148001.00000  149001.00000  1.116030789562e-07
149001.00000  150001.00000  2.232061579125e-07
150001.00000  151001.00000  3.720102631874e-08
151001.00000  152001.00000  2.604071842312e-07
152001.00000  153001.00000  2.604071842312e-07
153001.00000  154001.00000  7.440205263748e-08
154001.00000  155001.00000  1.116030789562e-07
155001.00000  156001.00000  7.440205263748e-08
156001.00000  157001.00000  2.232061579125e-07
157001.00000  158001.00000  2.232061579125e-07
158001.00000  159001.00000  1.116030789562e-07
159001.00000  160001.00000  1.860051315937e-07
160001.00000  161001.00000  7.440205263748e-08
161001.00000  162001.00000  7.440205263748e-08
162001.00000  163001.00000  2.232061579125e-07
163001.00000  164001.00000  1.488041052750e-07
164001.00000  165001.00000  2.232061579125e-07
165001.00000  166001.00000  1.488041052750e-07
166001.00000  167001.00000  2.232061579125e-07
167001.00000  168001.00000  1.116030789562e-07
168001.00000  169001.00000  1.860051315937e-07
169001.00000  170001.00000  1.116030789562e-07
170001.00000  171001.00000  1.860051315937e-07
171001.00000  172001.00000  1.488041052750e-07
172001.00000  173001.00000  1.860051315937e-07
173001.00000  174001.00000  7.440205263748e-08
174001.00000  175001.00000  7.440205263748e-08
175001.00000  176001.00000  3.720102631874e-08
176001.00000  177001.00000  1.116030789562e-07
177001.00000  178001.00000  1.116030789562e-07
178001.00000  179001.00000  7.440205263748e-08
179001.00000  180001.00000  7.440205263748e-08
180001.00000  181001.00000  1.488041052750e-07
181001.00000  182001.00000  7.440205263748e-08
182001.00000  183001.00000  1.116030789562e-07
183001.00000  184001.00000  1.116030789562e-07
184001.00000  185001.00000  1.488041052750e-07
185001.00000  186001.00000  1.488041052750e-07
186001.00000  187001.00000  1.488041052750e-07
187001.00000  188001.00000  7.440205263748e-08
188001.00000  189001.00000  7.440205263748e-08
189001.00000  190001.00000  7.440205263748e-08
190001.00000  191001.00000  1.488041052750e-07
191001.00000  192001.00000  1.860051315937e-07
192001.00000  193001.00000  1.116030789562e-07
193001.00000  194001.00000  3.720102631874e-08
194001.00000  195001.00000  1.116030789562e-07
195001.00000  196001.00000  7.440205263748e-08
196001.00000  197001.00000  7.440205263748e-08
197001.00000  198001.00000  1.116030789562e-07
198001.00000  199001.00000  1.116030789562e-07
