300.00000  350.00000  1.728274247528e-05
350.00000  400.00000  2.664422798272e-05
400.00000  450.00000  1.656262820548e-05
450.00000  500.00000  1.764279961018e-05
500.00000  550.00000  1.299806256995e-04
550.00000  600.00000  1.332211399136e-05
600.00000  650.00000  3.924622770428e-05
650.00000  700.00000  1.476234253097e-05
700.00000  750.00000  2.700428511762e-05
750.00000  800.00000  1.872297101489e-05
800.00000  850.00000  7.705222686896e-05
850.00000  900.00000  2.520399944312e-05
900.00000  950.00000  1.404222826116e-05
950.00000  1000.00000  1.692268534038e-05
1000.00000  1050.00000  2.232354236390e-05
1050.00000  1100.00000  1.584251393567e-05
1100.00000  1150.00000  1.476234253097e-05
1150.00000  1200.00000  1.728274247528e-05
1200.00000  1250.00000  2.052325668939e-05
1250.00000  1300.00000  4.140657051369e-05
1300.00000  1350.00000  2.088331382430e-05
1350.00000  1400.00000  2.304365663371e-05
1400.00000  1450.00000  1.872297101489e-05
1450.00000  1500.00000  2.664422798272e-05
1500.00000  1550.00000  2.520399944312e-05
1550.00000  1600.00000  2.088331382430e-05
1600.00000  1650.00000  1.692268534038e-05
1650.00000  1700.00000  2.124337095920e-05
1700.00000  1750.00000  5.760914158427e-05
1750.00000  1800.00000  2.412382803841e-05
1800.00000  1850.00000  2.556405657802e-05
1850.00000  1900.00000  1.764279961018e-05
1900.00000  1950.00000  2.016319955449e-05
1950.00000  2000.00000  2.520399944312e-05
2000.00000  2050.00000  2.304365663371e-05
2050.00000  2100.00000  2.268359949880e-05
2100.00000  2150.00000  2.412382803841e-05
2150.00000  2200.00000  2.052325668939e-05
2200.00000  2250.00000  2.952468506194e-05
2250.00000  2300.00000  3.240514214115e-05
2300.00000  2350.00000  6.697062709171e-05
2350.00000  2400.00000  2.664422798272e-05
2400.00000  2450.00000  2.556405657802e-05
2450.00000  2500.00000  2.592411371292e-05
2500.00000  2550.00000  3.024479933174e-05
2550.00000  2600.00000  2.304365663371e-05
2600.00000  2650.00000  2.196348522900e-05
2650.00000  2700.00000  1.980314241959e-05
2700.00000  2750.00000  2.088331382430e-05
2750.00000  2800.00000  2.700428511762e-05
2800.00000  2850.00000  2.916462792703e-05
2850.00000  2900.00000  2.700428511762e-05
2900.00000  2950.00000  2.196348522900e-05
2950.00000  3000.00000  3.816605629958e-05
3000.00000  3050.00000  2.592411371292e-05
3050.00000  3100.00000  2.592411371292e-05
3100.00000  3150.00000  2.772439938743e-05
3150.00000  3200.00000  2.880457079213e-05
3200.00000  3250.00000  2.124337095920e-05
3250.00000  3300.00000  2.304365663371e-05
3300.00000  3350.00000  2.700428511762e-05
3350.00000  3400.00000  2.304365663371e-05
3400.00000  3450.00000  2.808445652233e-05
3450.00000  3500.00000  2.592411371292e-05
3500.00000  3550.00000  2.412382803841e-05
3550.00000  3600.00000  2.808445652233e-05
3600.00000  3650.00000  2.808445652233e-05
3650.00000  3700.00000  4.068645624389e-05
3700.00000  3750.00000  2.592411371292e-05
3750.00000  3800.00000  2.664422798272e-05
3800.00000  3850.00000  2.628417084782e-05
3850.00000  3900.00000  2.880457079213e-05
3900.00000  3950.00000  3.240514214115e-05
3950.00000  4000.00000  2.808445652233e-05
4000.00000  4050.00000  3.168502787135e-05
4050.00000  4100.00000  3.096491360154e-05
4100.00000  4150.00000  2.628417084782e-05
4150.00000  4200.00000  2.664422798272e-05
4200.00000  4250.00000  3.096491360154e-05
4250.00000  4300.00000  3.312525641095e-05
4300.00000  4350.00000  3.744594202977e-05
4350.00000  4400.00000  2.772439938743e-05
4400.00000  4450.00000  3.096491360154e-05
4450.00000  4500.00000  3.384537068076e-05
4500.00000  4550.00000  3.276519927605e-05
4550.00000  4600.00000  3.492554208546e-05
4600.00000  4650.00000  3.672582775997e-05
4650.00000  4700.00000  2.952468506194e-05
4700.00000  4750.00000  3.240514214115e-05
4750.00000  4800.00000  3.996634197408e-05
4800.00000  4850.00000  2.772439938743e-05
4850.00000  4900.00000  3.744594202977e-05
4900.00000  4950.00000  2.952468506194e-05
4950.00000  5000.00000  3.996634197408e-05
5000.00000  5050.00000  4.140657051369e-05
5050.00000  5100.00000  3.204508500625e-05
5100.00000  5150.00000  3.528559922036e-05
5150.00000  5200.00000  3.564565635526e-05
5200.00000  5250.00000  3.708588489487e-05
5250.00000  5300.00000  3.276519927605e-05
5300.00000  5350.00000  4.464708472781e-05
5350.00000  5400.00000  3.564565635526e-05
5400.00000  5450.00000  4.716748467212e-05
5450.00000  5500.00000  3.276519927605e-05
5500.00000  5550.00000  3.744594202977e-05
5550.00000  5600.00000  4.104651337879e-05
5600.00000  5650.00000  3.636577062507e-05
5650.00000  5700.00000  3.852611343448e-05
5700.00000  5750.00000  4.320685618820e-05
5750.00000  5800.00000  3.276519927605e-05
5800.00000  5850.00000  3.744594202977e-05
5850.00000  5900.00000  3.852611343448e-05
5900.00000  5950.00000  4.212668478349e-05
5950.00000  6000.00000  4.536719899761e-05
6000.00000  6050.00000  4.428702759290e-05
6050.00000  6100.00000  4.608731326741e-05
6100.00000  6150.00000  4.788759894192e-05
6150.00000  6200.00000  5.976948439368e-05
6200.00000  6250.00000  7.525194119445e-05
6250.00000  6300.00000  1.108975975497e-04
6300.00000  6350.00000  1.155783403034e-04
6350.00000  6400.00000  7.712423829594e-04
6400.00000  6450.00000  4.392697045800e-05
6450.00000  6500.00000  3.888617056938e-05
6500.00000  6550.00000  4.212668478349e-05
6550.00000  6600.00000  5.472868450505e-05
6600.00000  6650.00000  4.464708472781e-05
6650.00000  6700.00000  4.536719899761e-05
6700.00000  6750.00000  3.960628483918e-05
6750.00000  6800.00000  4.968788461643e-05
6800.00000  6850.00000  4.680742753722e-05
6850.00000  6900.00000  5.148817029094e-05
6900.00000  6950.00000  5.688902731446e-05
6950.00000  7000.00000  4.500714186271e-05
7000.00000  7050.00000  4.644737040231e-05
7050.00000  7100.00000  1.281803400250e-04
7100.00000  7150.00000  2.592411371292e-05
7150.00000  7200.00000  1.836291387998e-05
7200.00000  7250.00000  1.872297101489e-05
7250.00000  7300.00000  2.052325668939e-05
7300.00000  7350.00000  2.520399944312e-05
7350.00000  7400.00000  2.556405657802e-05
7400.00000  7450.00000  2.520399944312e-05
7450.00000  7500.00000  5.292839883054e-05
7500.00000  7550.00000  2.052325668939e-05
7550.00000  7600.00000  2.592411371292e-05
7600.00000  7650.00000  2.556405657802e-05
7650.00000  7700.00000  2.628417084782e-05
7700.00000  7750.00000  2.340371376861e-05
7750.00000  7800.00000  2.340371376861e-05
7800.00000  7850.00000  2.304365663371e-05
7850.00000  7900.00000  2.664422798272e-05
7900.00000  7950.00000  2.376377090351e-05
7950.00000  8000.00000  2.808445652233e-05
8000.00000  8050.00000  2.268359949880e-05
8050.00000  8100.00000  2.376377090351e-05
8100.00000  8150.00000  2.556405657802e-05
8150.00000  8200.00000  2.592411371292e-05
8200.00000  8250.00000  2.124337095920e-05
8250.00000  8300.00000  2.952468506194e-05
8300.00000  8350.00000  2.268359949880e-05
8350.00000  8400.00000  2.160342809410e-05
8400.00000  8450.00000  2.304365663371e-05
8450.00000  8500.00000  2.844451365723e-05
8500.00000  8550.00000  1.872297101489e-05
8550.00000  8600.00000  2.484394230821e-05
8600.00000  8650.00000  2.124337095920e-05
8650.00000  8700.00000  2.916462792703e-05
8700.00000  8750.00000  2.448388517331e-05
8750.00000  8800.00000  1.836291387998e-05
8800.00000  8850.00000  2.484394230821e-05
8850.00000  8900.00000  3.024479933174e-05
8900.00000  8950.00000  2.484394230821e-05
8950.00000  9000.00000  2.520399944312e-05
9000.00000  9050.00000  2.844451365723e-05
9050.00000  9100.00000  2.340371376861e-05
9100.00000  9150.00000  2.628417084782e-05
9150.00000  9200.00000  2.952468506194e-05
9200.00000  9250.00000  2.844451365723e-05
9250.00000  9300.00000  3.204508500625e-05
9300.00000  9350.00000  3.096491360154e-05
9350.00000  9400.00000  2.664422798272e-05
9400.00000  9450.00000  2.844451365723e-05
9450.00000  9500.00000  2.988474219684e-05
9500.00000  9550.00000  2.664422798272e-05
9550.00000  9600.00000  3.132497073644e-05
9600.00000  9650.00000  2.772439938743e-05
9650.00000  9700.00000  2.880457079213e-05
9700.00000  9750.00000  2.664422798272e-05
9750.00000  9800.00000  2.844451365723e-05
9800.00000  9850.00000  3.096491360154e-05
9850.00000  9900.00000  2.772439938743e-05
9900.00000  9950.00000  2.628417084782e-05
9950.00000  10000.00000  3.276519927605e-05
