300.00000  350.00000  1.015317100944e-04
350.00000  400.00000  1.026042281587e-04
400.00000  450.00000  6.292105977678e-05
450.00000  500.00000  5.076585504718e-05
500.00000  550.00000  2.145036128754e-04
550.00000  600.00000  2.788546967380e-05
600.00000  650.00000  6.399357784116e-05
650.00000  700.00000  3.539309612444e-05
700.00000  750.00000  4.647578278967e-05
750.00000  800.00000  2.609793956651e-05
800.00000  850.00000  9.259405955788e-05
850.00000  900.00000  2.538292752359e-05
900.00000  950.00000  2.180786730900e-05
950.00000  1000.00000  2.538292752359e-05
1000.00000  1050.00000  2.323789139483e-05
1050.00000  1100.00000  2.216537333046e-05
1100.00000  1150.00000  2.216537333046e-05
1150.00000  1200.00000  2.073534924462e-05
1200.00000  1250.00000  2.252287935192e-05
1250.00000  1300.00000  4.826331289696e-05
1300.00000  1350.00000  2.252287935192e-05
1350.00000  1400.00000  2.395290343775e-05
1400.00000  1450.00000  2.538292752359e-05
1450.00000  1500.00000  2.609793956651e-05
1500.00000  1550.00000  1.894781913733e-05
1550.00000  1600.00000  2.288038537338e-05
1600.00000  1650.00000  1.930532515879e-05
1650.00000  1700.00000  2.323789139483e-05
1700.00000  1750.00000  4.826331289696e-05
1750.00000  1800.00000  2.145036128754e-05
1800.00000  1850.00000  1.787530107295e-05
1850.00000  1900.00000  1.322772279398e-05
1900.00000  1950.00000  1.751779505149e-05
1950.00000  2000.00000  1.859031311587e-05
2000.00000  2050.00000  1.430024085836e-05
2050.00000  2100.00000  1.287021677252e-05
2100.00000  2150.00000  1.680278300857e-05
2150.00000  2200.00000  1.894781913733e-05
2200.00000  2250.00000  1.322772279398e-05
2250.00000  2300.00000  1.465774687982e-05
2300.00000  2350.00000  3.289055397423e-05
2350.00000  2400.00000  1.394273483690e-05
2400.00000  2450.00000  1.573026494420e-05
2450.00000  2500.00000  1.608777096565e-05
2500.00000  2550.00000  1.179769870815e-05
2550.00000  2600.00000  1.179769870815e-05
2600.00000  2650.00000  9.652662579393e-06
2650.00000  2700.00000  1.179769870815e-05
2700.00000  2750.00000  1.430024085836e-05
2750.00000  2800.00000  1.322772279398e-05
2800.00000  2850.00000  1.108268666523e-05
2850.00000  2900.00000  1.501525290128e-05
2900.00000  2950.00000  1.108268666523e-05
2950.00000  3000.00000  1.573026494420e-05
3000.00000  3050.00000  1.179769870815e-05
3050.00000  3100.00000  1.144019268669e-05
3100.00000  3150.00000  1.787530107295e-05
3150.00000  3200.00000  1.179769870815e-05
3200.00000  3250.00000  1.322772279398e-05
3250.00000  3300.00000  8.937650536475e-06
3300.00000  3350.00000  1.322772279398e-05
3350.00000  3400.00000  1.108268666523e-05
3400.00000  3450.00000  1.465774687982e-05
3450.00000  3500.00000  1.001016860085e-05
3500.00000  3550.00000  1.108268666523e-05
3550.00000  3600.00000  1.537275892274e-05
3600.00000  3650.00000  1.287021677252e-05
3650.00000  3700.00000  2.180786730900e-05
3700.00000  3750.00000  1.179769870815e-05
3750.00000  3800.00000  1.036767462231e-05
3800.00000  3850.00000  1.394273483690e-05
3850.00000  3900.00000  1.179769870815e-05
3900.00000  3950.00000  1.251271075106e-05
3950.00000  4000.00000  1.358522881544e-05
4000.00000  4050.00000  1.072518064377e-05
4050.00000  4100.00000  1.251271075106e-05
4100.00000  4150.00000  1.430024085836e-05
4150.00000  4200.00000  1.251271075106e-05
4200.00000  4250.00000  1.430024085836e-05
4250.00000  4300.00000  1.144019268669e-05
4300.00000  4350.00000  1.251271075106e-05
4350.00000  4400.00000  1.394273483690e-05
4400.00000  4450.00000  1.036767462231e-05
4450.00000  4500.00000  1.001016860085e-05
4500.00000  4550.00000  1.215520472961e-05
4550.00000  4600.00000  1.358522881544e-05
4600.00000  4650.00000  9.652662579393e-06
4650.00000  4700.00000  1.322772279398e-05
4700.00000  4750.00000  1.430024085836e-05
4750.00000  4800.00000  9.652662579393e-06
4800.00000  4850.00000  1.358522881544e-05
4850.00000  4900.00000  1.501525290128e-05
4900.00000  4950.00000  1.251271075106e-05
4950.00000  5000.00000  1.215520472961e-05
5000.00000  5050.00000  1.358522881544e-05
5050.00000  5100.00000  7.865132472098e-06
5100.00000  5150.00000  1.215520472961e-05
5150.00000  5200.00000  1.287021677252e-05
5200.00000  5250.00000  9.652662579393e-06
5250.00000  5300.00000  1.430024085836e-05
5300.00000  5350.00000  1.179769870815e-05
5350.00000  5400.00000  1.358522881544e-05
5400.00000  5450.00000  1.001016860085e-05
5450.00000  5500.00000  1.465774687982e-05
5500.00000  5550.00000  1.430024085836e-05
5550.00000  5600.00000  1.251271075106e-05
5600.00000  5650.00000  1.322772279398e-05
5650.00000  5700.00000  7.865132472098e-06
5700.00000  5750.00000  1.144019268669e-05
5750.00000  5800.00000  1.644527698711e-05
5800.00000  5850.00000  9.652662579393e-06
5850.00000  5900.00000  1.215520472961e-05
5900.00000  5950.00000  1.465774687982e-05
5950.00000  6000.00000  1.322772279398e-05
6000.00000  6050.00000  1.287021677252e-05
6050.00000  6100.00000  1.358522881544e-05
6100.00000  6150.00000  1.573026494420e-05
6150.00000  6200.00000  7.865132472098e-06
6200.00000  6250.00000  2.538292752359e-05
6250.00000  6300.00000  2.609793956651e-05
6300.00000  6350.00000  2.109285526608e-05
6350.00000  6400.00000  2.087835165320e-04
6400.00000  6450.00000  1.251271075106e-05
6450.00000  6500.00000  1.430024085836e-05
6500.00000  6550.00000  1.072518064377e-05
6550.00000  6600.00000  1.215520472961e-05
6600.00000  6650.00000  1.394273483690e-05
6650.00000  6700.00000  1.358522881544e-05
6700.00000  6750.00000  1.251271075106e-05
6750.00000  6800.00000  1.215520472961e-05
6800.00000  6850.00000  1.108268666523e-05
6850.00000  6900.00000  1.251271075106e-05
6900.00000  6950.00000  1.358522881544e-05
6950.00000  7000.00000  1.501525290128e-05
7000.00000  7050.00000  1.036767462231e-05
7050.00000  7100.00000  3.181803590985e-05
7100.00000  7150.00000  8.580144515016e-06
7150.00000  7200.00000  6.792614407721e-06
7200.00000  7250.00000  6.435108386262e-06
7250.00000  7300.00000  9.295156557934e-06
7300.00000  7350.00000  8.937650536475e-06
7350.00000  7400.00000  8.222638493557e-06
7400.00000  7450.00000  7.150120429180e-06
7450.00000  7500.00000  1.287021677252e-05
7500.00000  7550.00000  7.150120429180e-06
7550.00000  7600.00000  6.792614407721e-06
7600.00000  7650.00000  8.580144515016e-06
7650.00000  7700.00000  7.507626450639e-06
7700.00000  7750.00000  8.580144515016e-06
7750.00000  7800.00000  4.647578278967e-06
7800.00000  7850.00000  7.865132472098e-06
7850.00000  7900.00000  5.720096343344e-06
7900.00000  7950.00000  6.792614407721e-06
7950.00000  8000.00000  6.077602364803e-06
8000.00000  8050.00000  4.290072257508e-06
8050.00000  8100.00000  7.865132472098e-06
8100.00000  8150.00000  6.435108386262e-06
8150.00000  8200.00000  9.295156557934e-06
8200.00000  8250.00000  6.077602364803e-06
8250.00000  8300.00000  6.077602364803e-06
8300.00000  8350.00000  1.144019268669e-05
8350.00000  8400.00000  1.036767462231e-05
8400.00000  8450.00000  4.290072257508e-06
8450.00000  8500.00000  6.435108386262e-06
8500.00000  8550.00000  1.001016860085e-05
8550.00000  8600.00000  7.150120429180e-06
8600.00000  8650.00000  9.295156557934e-06
8650.00000  8700.00000  7.150120429180e-06
8700.00000  8750.00000  7.150120429180e-06
8750.00000  8800.00000  1.036767462231e-05
8800.00000  8850.00000  5.720096343344e-06
8850.00000  8900.00000  1.001016860085e-05
8900.00000  8950.00000  5.005084300426e-06
8950.00000  9000.00000  6.077602364803e-06
9000.00000  9050.00000  7.150120429180e-06
9050.00000  9100.00000  1.001016860085e-05
9100.00000  9150.00000  7.150120429180e-06
9150.00000  9200.00000  7.507626450639e-06
9200.00000  9250.00000  8.937650536475e-06
9250.00000  9300.00000  8.222638493557e-06
9300.00000  9350.00000  6.792614407721e-06
9350.00000  9400.00000  8.580144515016e-06
9400.00000  9450.00000  8.222638493557e-06
9450.00000  9500.00000  1.215520472961e-05
9500.00000  9550.00000  1.001016860085e-05
9550.00000  9600.00000  7.507626450639e-06
9600.00000  9650.00000  8.937650536475e-06
9650.00000  9700.00000  8.937650536475e-06
9700.00000  9750.00000  6.077602364803e-06
9750.00000  9800.00000  7.507626450639e-06
9800.00000  9850.00000  9.295156557934e-06
9850.00000  9900.00000  6.435108386262e-06
9900.00000  9950.00000  9.652662579393e-06
9950.00000  10000.00000  5.720096343344e-06
