300.00000  350.00000  7.545484464827e-07
350.00000  400.00000  0.000000000000e+00
400.00000  450.00000  0.000000000000e+00
450.00000  500.00000  7.545484464827e-07
500.00000  550.00000  5.281839125379e-06
550.00000  600.00000  0.000000000000e+00
600.00000  650.00000  3.018193785931e-06
650.00000  700.00000  1.509096892965e-06
700.00000  750.00000  3.018193785931e-06
750.00000  800.00000  7.545484464827e-07
800.00000  850.00000  7.545484464827e-06
850.00000  900.00000  3.772742232413e-06
900.00000  950.00000  7.545484464827e-07
950.00000  1000.00000  4.527290678896e-06
1000.00000  1050.00000  4.527290678896e-06
1050.00000  1100.00000  7.545484464827e-06
1100.00000  1150.00000  9.809129804275e-06
1150.00000  1200.00000  2.263645339448e-06
1200.00000  1250.00000  8.300032911309e-06
1250.00000  1300.00000  2.339100184096e-05
1300.00000  1350.00000  7.545484464827e-06
1350.00000  1400.00000  1.433642048317e-05
1400.00000  1450.00000  1.131822669724e-05
1450.00000  1500.00000  1.660006582262e-05
1500.00000  1550.00000  2.112735650152e-05
1550.00000  1600.00000  1.358187203669e-05
1600.00000  1650.00000  1.282732359021e-05
1650.00000  1700.00000  1.207277514372e-05
1700.00000  1750.00000  6.262752105806e-05
1750.00000  1800.00000  2.263645339448e-05
1800.00000  1850.00000  1.810916271558e-05
1850.00000  1900.00000  1.961825960855e-05
1900.00000  1950.00000  1.886371116207e-05
1950.00000  2000.00000  2.112735650152e-05
2000.00000  2050.00000  1.660006582262e-05
2050.00000  2100.00000  3.395468009172e-05
2100.00000  2150.00000  2.037280805503e-05
2150.00000  2200.00000  2.188190494800e-05
2200.00000  2250.00000  2.339100184096e-05
2250.00000  2300.00000  3.169103475227e-05
2300.00000  2350.00000  8.677307134551e-05
2350.00000  2400.00000  2.640919562689e-05
2400.00000  2450.00000  2.339100184096e-05
2450.00000  2500.00000  3.320013164524e-05
2500.00000  2550.00000  2.716374407338e-05
2550.00000  2600.00000  2.716374407338e-05
2600.00000  2650.00000  3.923651921710e-05
2650.00000  2700.00000  2.791829251986e-05
2700.00000  2750.00000  3.169103475227e-05
2750.00000  2800.00000  3.093648630579e-05
2800.00000  2850.00000  3.697287387765e-05
2850.00000  2900.00000  4.376380989600e-05
2900.00000  2950.00000  4.225471300303e-05
2950.00000  3000.00000  6.640026329048e-05
3000.00000  3050.00000  5.130929436082e-05
3050.00000  3100.00000  7.017300552289e-05
3100.00000  3150.00000  5.734568193268e-05
3150.00000  3200.00000  6.187297261158e-05
3200.00000  3250.00000  6.790936018344e-05
3250.00000  3300.00000  7.470029620179e-05
3300.00000  3350.00000  9.205491047089e-05
3350.00000  3400.00000  1.116731700794e-04
3400.00000  3450.00000  1.131822669724e-04
3450.00000  3500.00000  1.207277514372e-04
3500.00000  3550.00000  1.116731700794e-04
3550.00000  3600.00000  1.335550750274e-04
3600.00000  3650.00000  1.456278501712e-04
3650.00000  3700.00000  1.773188849234e-04
3700.00000  3750.00000  1.697734004586e-04
3750.00000  3800.00000  1.561915284219e-04
3800.00000  3850.00000  1.916553054066e-04
3850.00000  3900.00000  1.924098538531e-04
3900.00000  3950.00000  2.195735979265e-04
3950.00000  4000.00000  2.369282121956e-04
4000.00000  4050.00000  2.369282121956e-04
4050.00000  4100.00000  2.459827935534e-04
4100.00000  4150.00000  2.588101171436e-04
4150.00000  4200.00000  2.557919233576e-04
4200.00000  4250.00000  2.791829251986e-04
4250.00000  4300.00000  2.754101829662e-04
4300.00000  4350.00000  2.980466363607e-04
4350.00000  4400.00000  3.425649947031e-04
4400.00000  4450.00000  3.259649288805e-04
4450.00000  4500.00000  3.403013493637e-04
4500.00000  4550.00000  3.644468996511e-04
4550.00000  4600.00000  3.870833530456e-04
4600.00000  4650.00000  3.531286729539e-04
4650.00000  4700.00000  3.923651921710e-04
4700.00000  4750.00000  3.863288045991e-04
4750.00000  4800.00000  4.210380331373e-04
4800.00000  4850.00000  4.572563585685e-04
4850.00000  4900.00000  3.953833859569e-04
4900.00000  4950.00000  4.293380660486e-04
4950.00000  5000.00000  4.270744207092e-04
5000.00000  5050.00000  4.625381976939e-04
5050.00000  5100.00000  4.263198722627e-04
5100.00000  5150.00000  4.625381976939e-04
5150.00000  5200.00000  4.685745852657e-04
5200.00000  5250.00000  4.685745852657e-04
5250.00000  5300.00000  4.791382635165e-04
5300.00000  5350.00000  4.391471958529e-04
5350.00000  5400.00000  4.708382306052e-04
5400.00000  5450.00000  5.093202013758e-04
5450.00000  5500.00000  4.836655541954e-04
5500.00000  5550.00000  5.387475907886e-04
5550.00000  5600.00000  5.176202342871e-04
5600.00000  5650.00000  4.866837479813e-04
5650.00000  5700.00000  5.206384280730e-04
5700.00000  5750.00000  5.372384938957e-04
5750.00000  5800.00000  5.221475249660e-04
5800.00000  5850.00000  5.312021063238e-04
5850.00000  5900.00000  5.191293311801e-04
5900.00000  5950.00000  5.010201684645e-04
5950.00000  6000.00000  4.904564902137e-04
6000.00000  6050.00000  5.078111044828e-04
6050.00000  6100.00000  4.987565231251e-04
6100.00000  6150.00000  4.904564902137e-04
6150.00000  6200.00000  5.153565889477e-04
6200.00000  6250.00000  5.425203330210e-04
6250.00000  6300.00000  5.923205304889e-04
6300.00000  6350.00000  5.530840112718e-04
6350.00000  6400.00000  1.901462085136e-03
6400.00000  6450.00000  5.017747169110e-04
6450.00000  6500.00000  5.138474920547e-04
6500.00000  6550.00000  4.897019417673e-04
6550.00000  6600.00000  5.130929436082e-04
6600.00000  6650.00000  4.821564573024e-04
6650.00000  6700.00000  4.836655541954e-04
6700.00000  6750.00000  4.919655871067e-04
6750.00000  6800.00000  5.244111703055e-04
6800.00000  6850.00000  4.897019417673e-04
6850.00000  6900.00000  5.146020405012e-04
6900.00000  6950.00000  5.138474920547e-04
6950.00000  7000.00000  4.497108741037e-04
7000.00000  7050.00000  4.353744536205e-04
7050.00000  7100.00000  6.496662124216e-04
7100.00000  7150.00000  2.912557003423e-04
7150.00000  7200.00000  2.822011189845e-04
7200.00000  7250.00000  2.497555357858e-04
7250.00000  7300.00000  2.852193127705e-04
7300.00000  7350.00000  2.573010202506e-04
7350.00000  7400.00000  2.324009215167e-04
7400.00000  7450.00000  2.588101171436e-04
7450.00000  7500.00000  3.161557990762e-04
7500.00000  7550.00000  2.625828593760e-04
7550.00000  7600.00000  3.010648301466e-04
7600.00000  7650.00000  2.686192469478e-04
7650.00000  7700.00000  2.542828264647e-04
7700.00000  7750.00000  2.656010531619e-04
7750.00000  7800.00000  2.867284096634e-04
7800.00000  7850.00000  2.663556016084e-04
7850.00000  7900.00000  2.701283438408e-04
7900.00000  7950.00000  2.791829251986e-04
7950.00000  8000.00000  2.618283109295e-04
8000.00000  8050.00000  2.731465376267e-04
8050.00000  8100.00000  2.708828922873e-04
8100.00000  8150.00000  2.640919562689e-04
8150.00000  8200.00000  2.512646326787e-04
8200.00000  8250.00000  2.573010202506e-04
8250.00000  8300.00000  2.610737624830e-04
8300.00000  8350.00000  2.678646985014e-04
8350.00000  8400.00000  2.859738612169e-04
8400.00000  8450.00000  2.656010531619e-04
8450.00000  8500.00000  2.610737624830e-04
8500.00000  8550.00000  2.784283767521e-04
8550.00000  8600.00000  2.505100842323e-04
8600.00000  8650.00000  2.686192469478e-04
8650.00000  8700.00000  2.459827935534e-04
8700.00000  8750.00000  2.791829251986e-04
8750.00000  8800.00000  2.686192469478e-04
8800.00000  8850.00000  2.482464388928e-04
8850.00000  8900.00000  2.391918575350e-04
8900.00000  8950.00000  2.490009873393e-04
8950.00000  9000.00000  2.580555686971e-04
9000.00000  9050.00000  2.610737624830e-04
9050.00000  9100.00000  2.573010202506e-04
9100.00000  9150.00000  2.203281463729e-04
9150.00000  9200.00000  2.580555686971e-04
9200.00000  9250.00000  2.573010202506e-04
9250.00000  9300.00000  2.135372103546e-04
9300.00000  9350.00000  2.225917917124e-04
9350.00000  9400.00000  2.474918904463e-04
9400.00000  9450.00000  2.391918575350e-04
9450.00000  9500.00000  2.308918246237e-04
9500.00000  9550.00000  2.301372761772e-04
9550.00000  9600.00000  2.391918575350e-04
9600.00000  9650.00000  2.142917588011e-04
9650.00000  9700.00000  2.293827277307e-04
9700.00000  9750.00000  2.316463730702e-04
9750.00000  9800.00000  2.082553712292e-04
9800.00000  9850.00000  2.180645010335e-04
9850.00000  9900.00000  2.293827277307e-04
9900.00000  9950.00000  2.459827935534e-04
9950.00000  10000.00000  2.210826948194e-04
