300.00000  350.00000  2.997415266638e-05
350.00000  400.00000  4.586406492325e-05
400.00000  450.00000  2.997415266638e-05
450.00000  500.00000  2.600167460216e-05
500.00000  550.00000  2.936022423827e-04
550.00000  600.00000  2.997415266638e-05
600.00000  650.00000  9.208926421598e-05
650.00000  700.00000  2.527940586321e-05
700.00000  750.00000  5.850376785486e-05
750.00000  800.00000  3.936364627271e-05
800.00000  850.00000  1.581768538298e-04
850.00000  900.00000  3.466889946954e-05
900.00000  950.00000  3.394663073060e-05
950.00000  1000.00000  3.322436199165e-05
1000.00000  1050.00000  4.694746803167e-05
1050.00000  1100.00000  4.008591501166e-05
1100.00000  1150.00000  3.828024316429e-05
1150.00000  1200.00000  4.225272122851e-05
1200.00000  1250.00000  4.405839307588e-05
1250.00000  1300.00000  1.343419854445e-04
1300.00000  1350.00000  4.586406492325e-05
1350.00000  1400.00000  4.766973677062e-05
1400.00000  1450.00000  4.766973677062e-05
1450.00000  1500.00000  6.103170844118e-05
1500.00000  1550.00000  4.911427424852e-05
1550.00000  1600.00000  5.344788668221e-05
1600.00000  1650.00000  5.344788668221e-05
1650.00000  1700.00000  6.067057407170e-05
1700.00000  1750.00000  1.877898721267e-04
1750.00000  1800.00000  6.825439583066e-05
1800.00000  1850.00000  7.439368011173e-05
1850.00000  1900.00000  7.403254574226e-05
1900.00000  1950.00000  6.536532087487e-05
1950.00000  2000.00000  7.222687389488e-05
2000.00000  2050.00000  7.150460515593e-05
2050.00000  2100.00000  7.403254574226e-05
2100.00000  2150.00000  7.078233641699e-05
2150.00000  2200.00000  8.089409876227e-05
2200.00000  2250.00000  8.703338304333e-05
2250.00000  2300.00000  8.775565178228e-05
2300.00000  2350.00000  2.080133968173e-04
2350.00000  2400.00000  7.403254574226e-05
2400.00000  2450.00000  6.644872398329e-05
2450.00000  2500.00000  8.197750187069e-05
2500.00000  2550.00000  7.583821758963e-05
2550.00000  2600.00000  8.703338304333e-05
2600.00000  2650.00000  7.800502380647e-05
2650.00000  2700.00000  6.717099272224e-05
2700.00000  2750.00000  7.728275506752e-05
2750.00000  2800.00000  7.981069565385e-05
2800.00000  2850.00000  6.680985835277e-05
2850.00000  2900.00000  7.006006767804e-05
2900.00000  2950.00000  8.053296439279e-05
2950.00000  3000.00000  1.108682514286e-04
3000.00000  3050.00000  6.392078339697e-05
3050.00000  3100.00000  7.403254574226e-05
3100.00000  3150.00000  7.692162069805e-05
3150.00000  3200.00000  7.908842691490e-05
3200.00000  3250.00000  6.789326146119e-05
3250.00000  3300.00000  5.850376785486e-05
3300.00000  3350.00000  5.669809600748e-05
3350.00000  3400.00000  7.764388943700e-05
3400.00000  3450.00000  6.897666456961e-05
3450.00000  3500.00000  6.355964902750e-05
3500.00000  3550.00000  6.500418650539e-05
3550.00000  3600.00000  6.825439583066e-05
3600.00000  3650.00000  6.969893330856e-05
3650.00000  3700.00000  8.703338304333e-05
3700.00000  3750.00000  5.922603659380e-05
3750.00000  3800.00000  5.814263348538e-05
3800.00000  3850.00000  5.922603659380e-05
3850.00000  3900.00000  5.489242416011e-05
3900.00000  3950.00000  5.489242416011e-05
3950.00000  4000.00000  4.947540861799e-05
4000.00000  4050.00000  5.633696163801e-05
4050.00000  4100.00000  5.597582726853e-05
4100.00000  4150.00000  5.633696163801e-05
4150.00000  4200.00000  5.164221483484e-05
4200.00000  4250.00000  5.453128979064e-05
4250.00000  4300.00000  4.658633366220e-05
4300.00000  4350.00000  4.116931812008e-05
4350.00000  4400.00000  4.839200550957e-05
4400.00000  4450.00000  3.755797442534e-05
4450.00000  4500.00000  3.972478064219e-05
4500.00000  4550.00000  4.080818375061e-05
4550.00000  4600.00000  4.803087114010e-05
4600.00000  4650.00000  3.900251190324e-05
4650.00000  4700.00000  4.766973677062e-05
4700.00000  4750.00000  3.539116820849e-05
4750.00000  4800.00000  4.189158685903e-05
4800.00000  4850.00000  4.441952744535e-05
4850.00000  4900.00000  3.864137753376e-05
4900.00000  4950.00000  3.719684005586e-05
4950.00000  5000.00000  4.694746803167e-05
5000.00000  5050.00000  3.611343694744e-05
5050.00000  5100.00000  4.008591501166e-05
5100.00000  5150.00000  4.116931812008e-05
5150.00000  5200.00000  4.116931812008e-05
5200.00000  5250.00000  3.358549636112e-05
5250.00000  5300.00000  3.683570568639e-05
5300.00000  5350.00000  3.611343694744e-05
5350.00000  5400.00000  3.719684005586e-05
5400.00000  5450.00000  3.755797442534e-05
5450.00000  5500.00000  2.708507771058e-05
5500.00000  5550.00000  3.105755577480e-05
5550.00000  5600.00000  2.889074955795e-05
5600.00000  5650.00000  3.105755577480e-05
5650.00000  5700.00000  3.214095888322e-05
5700.00000  5750.00000  3.141869014427e-05
5750.00000  5800.00000  2.816848081900e-05
5800.00000  5850.00000  3.972478064219e-05
5850.00000  5900.00000  2.600167460216e-05
5900.00000  5950.00000  3.033528703585e-05
5950.00000  6000.00000  2.564054023268e-05
6000.00000  6050.00000  2.744621208006e-05
6050.00000  6100.00000  2.455713712426e-05
6100.00000  6150.00000  2.275146527689e-05
6150.00000  6200.00000  2.564054023268e-05
6200.00000  6250.00000  2.852961518848e-05
6250.00000  6300.00000  2.564054023268e-05
6300.00000  6350.00000  2.094579342952e-05
6350.00000  6400.00000  2.643503584553e-04
6400.00000  6450.00000  2.672394334111e-05
6450.00000  6500.00000  2.347373401584e-05
6500.00000  6550.00000  2.419600275479e-05
6550.00000  6600.00000  2.419600275479e-05
6600.00000  6650.00000  2.130692779899e-05
6650.00000  6700.00000  1.697331536530e-05
6700.00000  6750.00000  2.022352469057e-05
6750.00000  6800.00000  2.275146527689e-05
6800.00000  6850.00000  1.950125595162e-05
6850.00000  6900.00000  1.914012158214e-05
6900.00000  6950.00000  2.455713712426e-05
6950.00000  7000.00000  2.130692779899e-05
7000.00000  7050.00000  1.877898721267e-05
7050.00000  7100.00000  4.839200550957e-05
7100.00000  7150.00000  2.202919653794e-05
7150.00000  7200.00000  1.877898721267e-05
7200.00000  7250.00000  1.805671847372e-05
7250.00000  7300.00000  2.239033090741e-05
7300.00000  7350.00000  1.661218099582e-05
7350.00000  7400.00000  1.552877788740e-05
7400.00000  7450.00000  1.805671847372e-05
7450.00000  7500.00000  2.780734644953e-05
7500.00000  7550.00000  1.408424040950e-05
7550.00000  7600.00000  1.191743419266e-05
7600.00000  7650.00000  1.697331536530e-05
7650.00000  7700.00000  1.733444973477e-05
7700.00000  7750.00000  1.300083730108e-05
7750.00000  7800.00000  1.083403108423e-05
7800.00000  7850.00000  1.552877788740e-05
7850.00000  7900.00000  1.805671847372e-05
7900.00000  7950.00000  1.300083730108e-05
7950.00000  8000.00000  9.389493606335e-06
8000.00000  8050.00000  1.263970293160e-05
8050.00000  8100.00000  1.047289671476e-05
8100.00000  8150.00000  1.300083730108e-05
8150.00000  8200.00000  1.227856856213e-05
8200.00000  8250.00000  1.047289671476e-05
8250.00000  8300.00000  1.661218099582e-05
8300.00000  8350.00000  1.011176234528e-05
8350.00000  8400.00000  1.480650914845e-05
8400.00000  8450.00000  1.877898721267e-05
8450.00000  8500.00000  1.516764351793e-05
8500.00000  8550.00000  1.047289671476e-05
8550.00000  8600.00000  1.552877788740e-05
8600.00000  8650.00000  1.408424040950e-05
8650.00000  8700.00000  1.480650914845e-05
8700.00000  8750.00000  1.444537477898e-05
8750.00000  8800.00000  1.336197167055e-05
8800.00000  8850.00000  1.155629982318e-05
8850.00000  8900.00000  1.444537477898e-05
8900.00000  8950.00000  1.047289671476e-05
8950.00000  9000.00000  1.408424040950e-05
9000.00000  9050.00000  1.480650914845e-05
9050.00000  9100.00000  1.083403108423e-05
9100.00000  9150.00000  1.227856856213e-05
9150.00000  9200.00000  1.300083730108e-05
9200.00000  9250.00000  1.155629982318e-05
9250.00000  9300.00000  1.011176234528e-05
9300.00000  9350.00000  1.047289671476e-05
9350.00000  9400.00000  1.011176234528e-05
9400.00000  9450.00000  1.047289671476e-05
9450.00000  9500.00000  7.944956128437e-06
9500.00000  9550.00000  9.389493606335e-06
9550.00000  9600.00000  7.222687389488e-06
9600.00000  9650.00000  1.083403108423e-05
9650.00000  9700.00000  1.155629982318e-05
9700.00000  9750.00000  1.119516545371e-05
9750.00000  9800.00000  1.047289671476e-05
9800.00000  9850.00000  8.306090497912e-06
9850.00000  9900.00000  1.227856856213e-05
9900.00000  9950.00000  8.667224867386e-06
9950.00000  10000.00000  6.500418650539e-06
