300.00000  350.00000  3.782083361487e-05
350.00000  400.00000  4.071528516703e-05
400.00000  450.00000  2.836562521115e-05
450.00000  500.00000  2.740080802710e-05
500.00000  550.00000  1.661415190939e-04
550.00000  600.00000  1.910338024425e-05
600.00000  650.00000  5.595939667506e-05
650.00000  700.00000  2.219079523321e-05
700.00000  750.00000  3.357563800504e-05
750.00000  800.00000  2.064708773873e-05
800.00000  850.00000  1.014987677624e-04
850.00000  900.00000  2.469931991175e-05
900.00000  950.00000  2.315561241727e-05
950.00000  1000.00000  2.257672210684e-05
1000.00000  1050.00000  2.412042960132e-05
1050.00000  1100.00000  2.527821022218e-05
1100.00000  1150.00000  2.392746616451e-05
1150.00000  1200.00000  2.161190492278e-05
1200.00000  1250.00000  2.450635647494e-05
1250.00000  1300.00000  8.586872938070e-05
1300.00000  1350.00000  2.894451552158e-05
1350.00000  1400.00000  2.566413709580e-05
1400.00000  1450.00000  3.048822301607e-05
1450.00000  1500.00000  4.013639485660e-05
1500.00000  1550.00000  3.126007676331e-05
1550.00000  1600.00000  3.357563800504e-05
1600.00000  1650.00000  3.743490674125e-05
1650.00000  1700.00000  3.318971113142e-05
1700.00000  1750.00000  1.177076964544e-04
1750.00000  1800.00000  4.399566359281e-05
1800.00000  1850.00000  4.283788297194e-05
1850.00000  1900.00000  4.843382263945e-05
1900.00000  1950.00000  4.245195609832e-05
1950.00000  2000.00000  4.148713891427e-05
2000.00000  2050.00000  5.132827419161e-05
2050.00000  2100.00000  4.438159046643e-05
2100.00000  2150.00000  5.017049357075e-05
2150.00000  2200.00000  5.267901824928e-05
2200.00000  2250.00000  5.055642044437e-05
2250.00000  2300.00000  4.881974951307e-05
2300.00000  2350.00000  1.626681772313e-04
2350.00000  2400.00000  5.595939667506e-05
2400.00000  2450.00000  6.020459228489e-05
2450.00000  2500.00000  5.904681166403e-05
2500.00000  2550.00000  5.248605481247e-05
2550.00000  2600.00000  5.518754292782e-05
2600.00000  2650.00000  5.267901824928e-05
2650.00000  2700.00000  5.518754292782e-05
2700.00000  2750.00000  5.171420106523e-05
2750.00000  2800.00000  5.402976230696e-05
2800.00000  2850.00000  5.480161605420e-05
2850.00000  2900.00000  5.653828698549e-05
2900.00000  2950.00000  6.097644603214e-05
2950.00000  3000.00000  8.258835095492e-05
3000.00000  3050.00000  5.074938388118e-05
3050.00000  3100.00000  5.711717729593e-05
3100.00000  3150.00000  5.692421385911e-05
3150.00000  3200.00000  5.885384822722e-05
3200.00000  3250.00000  5.731014073274e-05
3250.00000  3300.00000  5.325790855971e-05
3300.00000  3350.00000  5.383679887015e-05
3350.00000  3400.00000  5.248605481247e-05
3400.00000  3450.00000  4.592529796091e-05
3450.00000  3500.00000  5.480161605420e-05
3500.00000  3550.00000  4.978456669712e-05
3550.00000  3600.00000  4.997753013393e-05
3600.00000  3650.00000  5.210012793885e-05
3650.00000  3700.00000  6.753720288370e-05
3700.00000  3750.00000  5.094234731799e-05
3750.00000  3800.00000  4.650418827134e-05
3800.00000  3850.00000  4.534640765048e-05
3850.00000  3900.00000  4.843382263945e-05
3900.00000  3950.00000  4.978456669712e-05
3950.00000  4000.00000  4.727604201859e-05
4000.00000  4050.00000  4.592529796091e-05
4050.00000  4100.00000  4.534640765048e-05
4100.00000  4150.00000  4.573233452410e-05
4150.00000  4200.00000  4.418862702962e-05
4200.00000  4250.00000  4.225899266151e-05
4250.00000  4300.00000  4.264491953513e-05
4300.00000  4350.00000  3.627712612039e-05
4350.00000  4400.00000  4.631122483453e-05
4400.00000  4450.00000  3.782083361487e-05
4450.00000  4500.00000  4.360973671919e-05
4500.00000  4550.00000  4.032935829341e-05
4550.00000  4600.00000  3.704897986763e-05
4600.00000  4650.00000  3.589119924676e-05
4650.00000  4700.00000  4.032935829341e-05
4700.00000  4750.00000  3.917157767254e-05
4750.00000  4800.00000  3.299674769461e-05
4800.00000  4850.00000  3.897861423573e-05
4850.00000  4900.00000  3.511934549952e-05
4900.00000  4950.00000  3.280378425780e-05
4950.00000  5000.00000  3.801379705168e-05
5000.00000  5050.00000  3.376860144185e-05
5050.00000  5100.00000  4.476751734005e-05
5100.00000  5150.00000  3.241785738417e-05
5150.00000  5200.00000  3.627712612039e-05
5200.00000  5250.00000  3.203193051055e-05
5250.00000  5300.00000  3.299674769461e-05
5300.00000  5350.00000  3.318971113142e-05
5350.00000  5400.00000  3.299674769461e-05
5400.00000  5450.00000  3.801379705168e-05
5450.00000  5500.00000  3.454045518909e-05
5500.00000  5550.00000  2.836562521115e-05
5550.00000  5600.00000  2.933044239521e-05
5600.00000  5650.00000  3.454045518909e-05
5650.00000  5700.00000  2.836562521115e-05
5700.00000  5750.00000  2.990933270564e-05
5750.00000  5800.00000  2.701488115348e-05
5800.00000  5850.00000  2.817266177434e-05
5850.00000  5900.00000  2.817266177434e-05
5900.00000  5950.00000  2.759377146391e-05
5950.00000  6000.00000  2.489228334856e-05
6000.00000  6050.00000  2.605006396943e-05
6050.00000  6100.00000  2.701488115348e-05
6100.00000  6150.00000  2.566413709580e-05
6150.00000  6200.00000  2.489228334856e-05
6200.00000  6250.00000  2.392746616451e-05
6250.00000  6300.00000  2.952340583202e-05
6300.00000  6350.00000  2.373450272770e-05
6350.00000  6400.00000  3.243715372786e-04
6400.00000  6450.00000  2.431339303813e-05
6450.00000  6500.00000  2.296264898046e-05
6500.00000  6550.00000  2.238375867002e-05
6550.00000  6600.00000  2.469931991175e-05
6600.00000  6650.00000  2.373450272770e-05
6650.00000  6700.00000  2.238375867002e-05
6700.00000  6750.00000  2.257672210684e-05
6750.00000  6800.00000  2.373450272770e-05
6800.00000  6850.00000  2.585710053261e-05
6850.00000  6900.00000  2.238375867002e-05
6900.00000  6950.00000  1.987523399149e-05
6950.00000  7000.00000  2.084005117554e-05
7000.00000  7050.00000  1.755967274976e-05
7050.00000  7100.00000  5.595939667506e-05
7100.00000  7150.00000  2.296264898046e-05
7150.00000  7200.00000  2.006819742830e-05
7200.00000  7250.00000  2.276968554365e-05
7250.00000  7300.00000  1.910338024425e-05
7300.00000  7350.00000  2.006819742830e-05
7350.00000  7400.00000  1.601596525528e-05
7400.00000  7450.00000  2.238375867002e-05
7450.00000  7500.00000  2.527821022218e-05
7500.00000  7550.00000  1.620892869209e-05
7550.00000  7600.00000  1.254262339269e-05
7600.00000  7650.00000  2.141894148597e-05
7650.00000  7700.00000  1.871745337062e-05
7700.00000  7750.00000  1.813856306019e-05
7750.00000  7800.00000  1.794559962338e-05
7800.00000  7850.00000  1.659485556571e-05
7850.00000  7900.00000  1.640189212890e-05
7900.00000  7950.00000  1.427929432398e-05
7950.00000  8000.00000  1.659485556571e-05
8000.00000  8050.00000  1.524411150803e-05
8050.00000  8100.00000  1.350744057674e-05
8100.00000  8150.00000  1.582300181847e-05
8150.00000  8200.00000  1.543707494484e-05
8200.00000  8250.00000  1.717374587614e-05
8250.00000  8300.00000  1.987523399149e-05
8300.00000  8350.00000  1.312151370312e-05
8350.00000  8400.00000  1.678781900252e-05
8400.00000  8450.00000  1.505114807122e-05
8450.00000  8500.00000  1.717374587614e-05
8500.00000  8550.00000  1.505114807122e-05
8550.00000  8600.00000  1.563003838166e-05
8600.00000  8650.00000  1.427929432398e-05
8650.00000  8700.00000  1.427929432398e-05
8700.00000  8750.00000  1.563003838166e-05
8750.00000  8800.00000  1.408633088717e-05
8800.00000  8850.00000  1.466522119760e-05
8850.00000  8900.00000  1.389336745036e-05
8900.00000  8950.00000  1.408633088717e-05
8950.00000  9000.00000  1.370040401355e-05
9000.00000  9050.00000  1.331447713993e-05
9050.00000  9100.00000  1.524411150803e-05
9100.00000  9150.00000  9.455208403717e-06
9150.00000  9200.00000  1.350744057674e-05
9200.00000  9250.00000  1.292855026631e-05
9250.00000  9300.00000  9.455208403717e-06
9300.00000  9350.00000  1.234965995588e-05
9350.00000  9400.00000  1.312151370312e-05
9400.00000  9450.00000  1.466522119760e-05
9450.00000  9500.00000  1.698078243933e-05
9500.00000  9550.00000  1.234965995588e-05
9550.00000  9600.00000  1.099891589820e-05
9600.00000  9650.00000  1.427929432398e-05
9650.00000  9700.00000  1.273558682950e-05
9700.00000  9750.00000  1.003409871415e-05
9750.00000  9800.00000  9.455208403717e-06
9800.00000  9850.00000  1.408633088717e-05
9850.00000  9900.00000  1.080595246139e-05
9900.00000  9950.00000  1.273558682950e-05
9950.00000  10000.00000  1.061298902458e-05
