300.00000  350.00000  3.842491543631e-07
350.00000  400.00000  7.684983087263e-07
400.00000  450.00000  7.684983087263e-07
450.00000  500.00000  1.921245771816e-06
500.00000  550.00000  7.684983087263e-06
550.00000  600.00000  7.684983087263e-07
600.00000  650.00000  3.458242389268e-06
650.00000  700.00000  7.684983087263e-07
700.00000  750.00000  2.689744080542e-06
750.00000  800.00000  6.916484778536e-06
800.00000  850.00000  3.150843065778e-05
850.00000  900.00000  1.690696279198e-05
900.00000  950.00000  3.189267981214e-05
950.00000  1000.00000  6.378535962428e-05
1000.00000  1050.00000  9.952053098005e-05
1050.00000  1100.00000  1.767546110070e-04
1100.00000  1150.00000  2.482249537186e-04
1150.00000  1200.00000  3.961608781484e-04
1200.00000  1250.00000  5.214261024708e-04
1250.00000  1300.00000  6.801210032227e-04
1300.00000  1350.00000  6.578345522697e-04
1350.00000  1400.00000  8.265199310351e-04
1400.00000  1450.00000  9.379521858004e-04
1450.00000  1500.00000  1.073592137291e-03
1500.00000  1550.00000  1.220759563412e-03
1550.00000  1600.00000  1.258031731385e-03
1600.00000  1650.00000  1.339492552110e-03
1650.00000  1700.00000  1.424027366070e-03
1700.00000  1750.00000  1.566199553184e-03
1750.00000  1800.00000  1.498955951171e-03
1800.00000  1850.00000  1.403662160889e-03
1850.00000  1900.00000  1.366005743761e-03
1900.00000  1950.00000  1.419416376217e-03
1950.00000  2000.00000  1.440550079707e-03
2000.00000  2050.00000  1.472827008674e-03
2050.00000  2100.00000  1.451693305184e-03
2100.00000  2150.00000  1.396745676110e-03
2150.00000  2200.00000  1.405583406660e-03
2200.00000  2250.00000  1.357936511519e-03
2250.00000  2300.00000  1.329117824942e-03
2300.00000  2350.00000  1.417879379600e-03
2350.00000  2400.00000  1.267253711090e-03
2400.00000  2450.00000  1.258031731385e-03
2450.00000  2500.00000  1.173112668271e-03
2500.00000  2550.00000  1.087040857693e-03
2550.00000  2600.00000  1.080124372915e-03
2600.00000  2650.00000  1.025560992995e-03
2650.00000  2700.00000  9.990478013441e-04
2700.00000  2750.00000  9.314199501762e-04
2750.00000  2800.00000  9.133602399212e-04
2800.00000  2850.00000  8.976060245923e-04
2850.00000  2900.00000  8.468851362163e-04
2900.00000  2950.00000  8.441953921358e-04
2950.00000  3000.00000  8.365104090485e-04
3000.00000  3050.00000  7.419851170752e-04
3050.00000  3100.00000  7.293048949812e-04
3100.00000  3150.00000  7.108609355718e-04
3150.00000  3200.00000  6.747415150617e-04
3200.00000  3250.00000  6.317056097730e-04
3250.00000  3300.00000  6.028869231958e-04
3300.00000  3350.00000  5.955861892629e-04
3350.00000  3400.00000  5.875169570212e-04
3400.00000  3450.00000  5.925121960280e-04
3450.00000  3500.00000  5.494762907393e-04
3500.00000  3550.00000  5.160466143097e-04
3550.00000  3600.00000  4.814641904170e-04
3600.00000  3650.00000  4.707052140948e-04
3650.00000  3700.00000  5.075931329137e-04
3700.00000  3750.00000  4.269008104974e-04
3750.00000  3800.00000  4.199843257189e-04
3800.00000  3850.00000  3.965451273028e-04
3850.00000  3900.00000  3.696476864973e-04
3900.00000  3950.00000  3.738744271953e-04
3950.00000  4000.00000  3.634997000275e-04
4000.00000  4050.00000  3.346810134503e-04
4050.00000  4100.00000  3.358337609134e-04
4100.00000  4150.00000  3.312227710610e-04
4150.00000  4200.00000  3.212322930476e-04
4200.00000  4250.00000  3.073993234905e-04
4250.00000  4300.00000  2.839601250744e-04
4300.00000  4350.00000  2.758908928327e-04
4350.00000  4400.00000  2.674374114367e-04
4400.00000  4450.00000  2.647476673562e-04
4450.00000  4500.00000  2.439982130206e-04
4500.00000  4550.00000  2.489934520273e-04
4550.00000  4600.00000  2.455352096380e-04
4600.00000  4650.00000  2.167165230608e-04
4650.00000  4700.00000  2.159480247521e-04
4700.00000  4750.00000  2.178692705239e-04
4750.00000  4800.00000  2.013465568863e-04
4800.00000  4850.00000  2.178692705239e-04
4850.00000  4900.00000  1.802128533963e-04
4900.00000  4950.00000  2.024993043494e-04
4950.00000  5000.00000  1.921245771816e-04
5000.00000  5050.00000  1.767546110070e-04
5050.00000  5100.00000  1.694538770741e-04
5100.00000  5150.00000  1.752176143896e-04
5150.00000  5200.00000  1.732963686178e-04
5200.00000  5250.00000  1.656113855305e-04
5250.00000  5300.00000  1.629216414500e-04
5300.00000  5350.00000  1.490886718929e-04
5350.00000  5400.00000  1.475516752754e-04
5400.00000  5450.00000  1.613846448325e-04
5450.00000  5500.00000  1.598476482151e-04
5500.00000  5550.00000  1.394824430338e-04
5550.00000  5600.00000  1.352557023358e-04
5600.00000  5650.00000  1.287234667116e-04
5650.00000  5700.00000  1.260337226311e-04
5700.00000  5750.00000  1.214227327787e-04
5750.00000  5800.00000  1.214227327787e-04
5800.00000  5850.00000  1.183487395438e-04
5850.00000  5900.00000  1.275707192486e-04
5900.00000  5950.00000  1.014417767519e-04
5950.00000  6000.00000  1.195014870069e-04
6000.00000  6050.00000  1.037472716780e-04
6050.00000  6100.00000  1.102795073022e-04
6100.00000  6150.00000  9.452529197333e-05
6150.00000  6200.00000  9.529379028206e-05
6200.00000  6250.00000  9.644653774515e-05
6250.00000  6300.00000  9.952053098005e-05
6300.00000  6350.00000  1.179644903895e-04
6350.00000  6400.00000  4.411180292089e-04
6400.00000  6450.00000  8.953005296661e-05
6450.00000  6500.00000  8.953005296661e-05
6500.00000  6550.00000  7.569708340954e-05
6550.00000  6600.00000  8.299781734244e-05
6600.00000  6650.00000  8.184506987935e-05
6650.00000  6700.00000  7.838682749008e-05
6700.00000  6750.00000  9.644653774515e-05
6750.00000  6800.00000  7.031759524845e-05
6800.00000  6850.00000  7.070184440282e-05
6850.00000  6900.00000  7.147034271154e-05
6900.00000  6950.00000  7.454433594645e-05
6950.00000  7000.00000  7.262309017463e-05
7000.00000  7050.00000  7.377583763772e-05
7050.00000  7100.00000  1.125850022284e-04
7100.00000  7150.00000  5.917436977192e-05
7150.00000  7200.00000  5.571612738265e-05
7200.00000  7250.00000  6.224836300683e-05
7250.00000  7300.00000  5.417913076520e-05
7300.00000  7350.00000  5.264213414775e-05
7350.00000  7400.00000  4.918389175848e-05
7400.00000  7450.00000  4.803114429539e-05
7450.00000  7500.00000  6.378535962428e-05
7500.00000  7550.00000  3.996191205377e-05
7550.00000  7600.00000  4.726264598667e-05
7600.00000  7650.00000  5.533187822829e-05
7650.00000  7700.00000  4.457290190612e-05
7700.00000  7750.00000  6.032711723501e-05
7750.00000  7800.00000  4.265165613431e-05
7800.00000  7850.00000  5.033663922157e-05
7850.00000  7900.00000  4.764689514103e-05
7900.00000  7950.00000  4.841539344975e-05
7950.00000  8000.00000  3.804066628195e-05
8000.00000  8050.00000  4.803114429539e-05
8050.00000  8100.00000  4.265165613431e-05
8100.00000  8150.00000  3.804066628195e-05
8150.00000  8200.00000  4.534140021485e-05
8200.00000  8250.00000  3.727216797322e-05
8250.00000  8300.00000  4.073041036249e-05
8300.00000  8350.00000  4.803114429539e-05
8350.00000  8400.00000  3.573517135577e-05
8400.00000  8450.00000  3.304542727523e-05
8450.00000  8500.00000  2.843443742287e-05
8500.00000  8550.00000  3.573517135577e-05
8550.00000  8600.00000  3.381392558396e-05
8600.00000  8650.00000  3.073993234905e-05
8650.00000  8700.00000  3.880916459068e-05
8700.00000  8750.00000  4.073041036249e-05
8750.00000  8800.00000  3.266117812087e-05
8800.00000  8850.00000  4.265165613431e-05
8850.00000  8900.00000  3.688791881886e-05
8900.00000  8950.00000  3.765641712759e-05
8950.00000  9000.00000  2.612894249669e-05
9000.00000  9050.00000  3.381392558396e-05
9050.00000  9100.00000  2.920293573160e-05
9100.00000  9150.00000  3.342967642959e-05
9150.00000  9200.00000  2.689744080542e-05
9200.00000  9250.00000  3.227692896650e-05
9250.00000  9300.00000  3.035568319469e-05
9300.00000  9350.00000  2.574469334233e-05
9350.00000  9400.00000  2.766593911415e-05
9400.00000  9450.00000  2.420769672488e-05
9450.00000  9500.00000  2.920293573160e-05
9500.00000  9550.00000  2.689744080542e-05
9550.00000  9600.00000  2.881868657723e-05
9600.00000  9650.00000  2.497619503360e-05
9650.00000  9700.00000  2.728168995978e-05
9700.00000  9750.00000  2.612894249669e-05
9750.00000  9800.00000  2.651319165106e-05
9800.00000  9850.00000  2.805018826851e-05
9850.00000  9900.00000  2.267070010742e-05
9900.00000  9950.00000  2.536044418797e-05
9950.00000  10000.00000  2.612894249669e-05
