10001.00000  11001.00000  1.390337153535e-05
11001.00000  12001.00000  1.155021692149e-05
12001.00000  13001.00000  1.101132655190e-05
13001.00000  14001.00000  1.165799499541e-05
14001.00000  15001.00000  1.041854714535e-05
15001.00000  16001.00000  1.014910196056e-05
16001.00000  17001.00000  9.753915689531e-06
17001.00000  18001.00000  9.017432184428e-06
18001.00000  19001.00000  8.352800728603e-06
19001.00000  20001.00000  7.993540482212e-06
20001.00000  21001.00000  7.095389866233e-06
21001.00000  22001.00000  7.095389866233e-06
22001.00000  23001.00000  6.376869373450e-06
23001.00000  24001.00000  6.179276237935e-06
24001.00000  25001.00000  5.442792732832e-06
25001.00000  26001.00000  4.939828387884e-06
26001.00000  27001.00000  4.742235252368e-06
27001.00000  28001.00000  4.562605129173e-06
28001.00000  29001.00000  3.915936685668e-06
29001.00000  30001.00000  3.933899697987e-06
30001.00000  31001.00000  3.754269574792e-06
31001.00000  32001.00000  3.538713426957e-06
32001.00000  33001.00000  3.412972340720e-06
33001.00000  34001.00000  2.712414860256e-06
34001.00000  35001.00000  2.999823057369e-06
35001.00000  36001.00000  2.442969675463e-06
36001.00000  37001.00000  2.281302564586e-06
37001.00000  38001.00000  2.083709429071e-06
38001.00000  39001.00000  2.389080638504e-06
39001.00000  40001.00000  2.083709429071e-06
40001.00000  41001.00000  1.886116293556e-06
41001.00000  42001.00000  1.886116293556e-06
42001.00000  43001.00000  1.544819059484e-06
43001.00000  44001.00000  1.670560145721e-06
44001.00000  45001.00000  1.598708096442e-06
45001.00000  46001.00000  1.526856047164e-06
46001.00000  47001.00000  1.257410862370e-06
47001.00000  48001.00000  1.257410862370e-06
48001.00000  49001.00000  1.203521825412e-06
49001.00000  50001.00000  9.520396529376e-07
50001.00000  51001.00000  1.113706763814e-06
51001.00000  52001.00000  1.113706763814e-06
52001.00000  53001.00000  8.262985667006e-07
53001.00000  54001.00000  9.161136282984e-07
54001.00000  55001.00000  8.981506159789e-07
55001.00000  56001.00000  8.262985667006e-07
56001.00000  57001.00000  8.262985667006e-07
57001.00000  58001.00000  6.466684435048e-07
58001.00000  59001.00000  6.287054311852e-07
59001.00000  60001.00000  8.442615790201e-07
60001.00000  61001.00000  6.287054311852e-07
61001.00000  62001.00000  6.646314558244e-07
62001.00000  63001.00000  5.748163942265e-07
63001.00000  64001.00000  7.005574804635e-07
64001.00000  65001.00000  5.748163942265e-07
65001.00000  66001.00000  5.209273572677e-07
66001.00000  67001.00000  5.029643449482e-07
67001.00000  68001.00000  4.490753079894e-07
68001.00000  69001.00000  4.131492833503e-07
69001.00000  70001.00000  4.311122956699e-07
70001.00000  71001.00000  4.670383203090e-07
71001.00000  72001.00000  5.568533819069e-07
72001.00000  73001.00000  3.412972340720e-07
73001.00000  74001.00000  4.670383203090e-07
74001.00000  75001.00000  3.592602463915e-07
75001.00000  76001.00000  5.209273572677e-07
76001.00000  77001.00000  3.233342217524e-07
77001.00000  78001.00000  2.514821724741e-07
78001.00000  79001.00000  3.053712094328e-07
79001.00000  80001.00000  4.311122956699e-07
80001.00000  81001.00000  3.951862710307e-07
81001.00000  82001.00000  3.053712094328e-07
82001.00000  83001.00000  1.616671108762e-07
83001.00000  84001.00000  2.874081971132e-07
84001.00000  85001.00000  2.874081971132e-07
85001.00000  86001.00000  2.514821724741e-07
86001.00000  87001.00000  2.694451847937e-07
87001.00000  88001.00000  2.335191601545e-07
88001.00000  89001.00000  1.437040985566e-07
89001.00000  90001.00000  2.694451847937e-07
90001.00000  91001.00000  1.796301231958e-07
91001.00000  92001.00000  1.077780739175e-07
92001.00000  93001.00000  2.335191601545e-07
93001.00000  94001.00000  1.437040985566e-07
94001.00000  95001.00000  1.616671108762e-07
95001.00000  96001.00000  8.981506159789e-08
96001.00000  97001.00000  1.077780739175e-07
97001.00000  98001.00000  1.257410862370e-07
98001.00000  99001.00000  1.796301231958e-07
99001.00000  100001.00000  8.981506159789e-08
100001.00000  101001.00000  2.335191601545e-07
101001.00000  102001.00000  1.616671108762e-07
102001.00000  103001.00000  1.437040985566e-07
103001.00000  104001.00000  1.077780739175e-07
104001.00000  105001.00000  1.257410862370e-07
105001.00000  106001.00000  1.077780739175e-07
106001.00000  107001.00000  1.077780739175e-07
107001.00000  108001.00000  1.077780739175e-07
108001.00000  109001.00000  8.981506159789e-08
109001.00000  110001.00000  1.437040985566e-07
110001.00000  111001.00000  1.437040985566e-07
111001.00000  112001.00000  5.388903695873e-08
112001.00000  113001.00000  1.257410862370e-07
113001.00000  114001.00000  1.257410862370e-07
114001.00000  115001.00000  5.388903695873e-08
115001.00000  116001.00000  7.185204927831e-08
116001.00000  117001.00000  1.796301231958e-08
117001.00000  118001.00000  0.000000000000e+00
118001.00000  119001.00000  5.388903695873e-08
119001.00000  120001.00000  1.796301231958e-08
120001.00000  121001.00000  3.592602463915e-08
121001.00000  122001.00000  5.388903695873e-08
122001.00000  123001.00000  3.592602463915e-08
123001.00000  124001.00000  5.388903695873e-08
124001.00000  125001.00000  1.796301231958e-08
125001.00000  126001.00000  5.388903695873e-08
126001.00000  127001.00000  3.592602463915e-08
127001.00000  128001.00000  5.388903695873e-08
128001.00000  129001.00000  3.592602463915e-08
129001.00000  130001.00000  3.592602463915e-08
130001.00000  131001.00000  1.796301231958e-08
131001.00000  132001.00000  1.796301231958e-08
132001.00000  133001.00000  1.796301231958e-08
133001.00000  134001.00000  1.796301231958e-08
134001.00000  135001.00000  0.000000000000e+00
135001.00000  136001.00000  0.000000000000e+00
136001.00000  137001.00000  5.388903695873e-08
137001.00000  138001.00000  0.000000000000e+00
138001.00000  139001.00000  1.796301231958e-08
139001.00000  140001.00000  0.000000000000e+00
140001.00000  141001.00000  0.000000000000e+00
141001.00000  142001.00000  0.000000000000e+00
142001.00000  143001.00000  0.000000000000e+00
143001.00000  144001.00000  0.000000000000e+00
144001.00000  145001.00000  3.592602463915e-08
145001.00000  146001.00000  1.796301231958e-08
146001.00000  147001.00000  3.592602463915e-08
147001.00000  148001.00000  1.796301231958e-08
148001.00000  149001.00000  8.981506159789e-08
149001.00000  150001.00000  1.796301231958e-08
150001.00000  151001.00000  0.000000000000e+00
151001.00000  152001.00000  3.592602463915e-08
152001.00000  153001.00000  5.388903695873e-08
153001.00000  154001.00000  1.796301231958e-08
154001.00000  155001.00000  3.592602463915e-08
155001.00000  156001.00000  1.796301231958e-08
156001.00000  157001.00000  0.000000000000e+00
157001.00000  158001.00000  1.796301231958e-08
158001.00000  159001.00000  0.000000000000e+00
159001.00000  160001.00000  0.000000000000e+00
160001.00000  161001.00000  1.796301231958e-08
161001.00000  162001.00000  1.796301231958e-08
162001.00000  163001.00000  0.000000000000e+00
163001.00000  164001.00000  1.796301231958e-08
164001.00000  165001.00000  0.000000000000e+00
165001.00000  166001.00000  3.592602463915e-08
166001.00000  167001.00000  3.592602463915e-08
167001.00000  168001.00000  0.000000000000e+00
168001.00000  169001.00000  1.796301231958e-08
169001.00000  170001.00000  0.000000000000e+00
170001.00000  171001.00000  0.000000000000e+00
171001.00000  172001.00000  0.000000000000e+00
172001.00000  173001.00000  1.796301231958e-08
173001.00000  174001.00000  0.000000000000e+00
174001.00000  175001.00000  0.000000000000e+00
175001.00000  176001.00000  0.000000000000e+00
176001.00000  177001.00000  0.000000000000e+00
177001.00000  178001.00000  1.796301231958e-08
178001.00000  179001.00000  0.000000000000e+00
179001.00000  180001.00000  0.000000000000e+00
180001.00000  181001.00000  0.000000000000e+00
181001.00000  182001.00000  1.796301231958e-08
182001.00000  183001.00000  1.796301231958e-08
183001.00000  184001.00000  0.000000000000e+00
184001.00000  185001.00000  1.796301231958e-08
185001.00000  186001.00000  0.000000000000e+00
186001.00000  187001.00000  0.000000000000e+00
187001.00000  188001.00000  0.000000000000e+00
188001.00000  189001.00000  0.000000000000e+00
189001.00000  190001.00000  0.000000000000e+00
190001.00000  191001.00000  0.000000000000e+00
191001.00000  192001.00000  1.796301231958e-08
192001.00000  193001.00000  0.000000000000e+00
193001.00000  194001.00000  0.000000000000e+00
194001.00000  195001.00000  1.796301231958e-08
195001.00000  196001.00000  0.000000000000e+00
196001.00000  197001.00000  0.000000000000e+00
197001.00000  198001.00000  0.000000000000e+00
198001.00000  199001.00000  0.000000000000e+00
