300.00000  350.00000  1.955246117831e-01
350.00000  400.00000  1.555663493123e-01
400.00000  450.00000  1.268202779330e-01
450.00000  500.00000  1.063248873302e-01
500.00000  550.00000  9.089720612380e-02
550.00000  600.00000  7.819681986525e-02
600.00000  650.00000  6.848712421910e-02
650.00000  700.00000  6.051259340938e-02
700.00000  750.00000  5.394432103766e-02
750.00000  800.00000  4.838247905553e-02
800.00000  850.00000  4.396234036483e-02
850.00000  900.00000  3.994241621653e-02
900.00000  950.00000  3.646397016954e-02
950.00000  1000.00000  3.343791535567e-02
1000.00000  1050.00000  3.097942698846e-02
1050.00000  1100.00000  2.871225315383e-02
1100.00000  1150.00000  2.678461430280e-02
1150.00000  1200.00000  2.478528081379e-02
1200.00000  1250.00000  2.325689027014e-02
1250.00000  1300.00000  2.180444579853e-02
1300.00000  1350.00000  2.036958680414e-02
1350.00000  1400.00000  1.927658175738e-02
1400.00000  1450.00000  1.823749262434e-02
1450.00000  1500.00000  1.732536677202e-02
1500.00000  1550.00000  1.640473805159e-02
1550.00000  1600.00000  1.562073496200e-02
1600.00000  1650.00000  1.481760041915e-02
1650.00000  1700.00000  1.400634950219e-02
1700.00000  1750.00000  1.359473338663e-02
1750.00000  1800.00000  1.276724972145e-02
1800.00000  1850.00000  1.222828383117e-02
1850.00000  1900.00000  1.175695439181e-02
1900.00000  1950.00000  1.130224419467e-02
1950.00000  2000.00000  1.078975314374e-02
2000.00000  2050.00000  1.038702639030e-02
2050.00000  2100.00000  1.003551009256e-02
2100.00000  2150.00000  9.572683521304e-03
2150.00000  2200.00000  9.293441602532e-03
2200.00000  2250.00000  8.932069707651e-03
2250.00000  2300.00000  8.595240182101e-03
2300.00000  2350.00000  8.460160527276e-03
2350.00000  2400.00000  8.045452459675e-03
2400.00000  2450.00000  7.811816833519e-03
2450.00000  2500.00000  7.495278243243e-03
2500.00000  2550.00000  7.292948631510e-03
2550.00000  2600.00000  7.084821609699e-03
2600.00000  2650.00000  6.832827518295e-03
2650.00000  2700.00000  6.639967009690e-03
2700.00000  2750.00000  6.466624448348e-03
2750.00000  2800.00000  6.318597244349e-03
2800.00000  2850.00000  6.145641177013e-03
2850.00000  2900.00000  5.968820169624e-03
2900.00000  2950.00000  5.778665119056e-03
2950.00000  3000.00000  5.632183891077e-03
3000.00000  3050.00000  5.488987862143e-03
3050.00000  3100.00000  5.344052610185e-03
3100.00000  3150.00000  5.218055564483e-03
3150.00000  3200.00000  5.043746768129e-03
3200.00000  3250.00000  4.935721693670e-03
3250.00000  3300.00000  4.809144906960e-03
3300.00000  3350.00000  4.653967563864e-03
3350.00000  3400.00000  4.635222604611e-03
3400.00000  3450.00000  4.491446834669e-03
3450.00000  3500.00000  4.401393731452e-03
3500.00000  3550.00000  4.301291784100e-03
3550.00000  3600.00000  4.244863659338e-03
3600.00000  3650.00000  4.086401117197e-03
3650.00000  3700.00000  4.063597970889e-03
3700.00000  3750.00000  3.927938575057e-03
3750.00000  3800.00000  3.904169193736e-03
3800.00000  3850.00000  3.736044301465e-03
3850.00000  3900.00000  3.720971035261e-03
3900.00000  3950.00000  3.594587495554e-03
3950.00000  4000.00000  3.582026440385e-03
4000.00000  4050.00000  3.516515706500e-03
4050.00000  4100.00000  3.446753538557e-03
4100.00000  4150.00000  3.379890075654e-03
4150.00000  4200.00000  3.289643725435e-03
4200.00000  4250.00000  3.256405240986e-03
4250.00000  4300.00000  3.186256579039e-03
4300.00000  4350.00000  3.153211341592e-03
4350.00000  4400.00000  3.065283955405e-03
4400.00000  4450.00000  2.983153979295e-03
4450.00000  4500.00000  2.965954996063e-03
4500.00000  4550.00000  2.962476550016e-03
4550.00000  4600.00000  2.859669144627e-03
4600.00000  4650.00000  2.868172012742e-03
4650.00000  4700.00000  2.739083014998e-03
4700.00000  4750.00000  2.741981720038e-03
4750.00000  4800.00000  2.700047120471e-03
4800.00000  4850.00000  2.672799293103e-03
4850.00000  4900.00000  2.608641288236e-03
4900.00000  4950.00000  2.561102525594e-03
4950.00000  5000.00000  2.503901412822e-03
5000.00000  5050.00000  2.499263484759e-03
5050.00000  5100.00000  2.405345441490e-03
5100.00000  5150.00000  2.400707513428e-03
5150.00000  5200.00000  2.335196779543e-03
5200.00000  5250.00000  2.307948952175e-03
5250.00000  5300.00000  2.352975503783e-03
5300.00000  5350.00000  2.276836184755e-03
5350.00000  5400.00000  2.267753575632e-03
5400.00000  5450.00000  2.260216942530e-03
5450.00000  5500.00000  2.176734237402e-03
5500.00000  5550.00000  2.181372165465e-03
5550.00000  5600.00000  2.124171052692e-03
5600.00000  5650.00000  2.077212031058e-03
5650.00000  5700.00000  2.057307589789e-03
5700.00000  5750.00000  2.028320539398e-03
5750.00000  5800.00000  2.029286774411e-03
5800.00000  5850.00000  2.028707033403e-03
5850.00000  5900.00000  1.978462812724e-03
5900.00000  5950.00000  1.922421181967e-03
5950.00000  6000.00000  1.922421181967e-03
6000.00000  6050.00000  1.880486582401e-03
6050.00000  6100.00000  1.880679829403e-03
6100.00000  6150.00000  1.858456424103e-03
6150.00000  6200.00000  1.831208596735e-03
6200.00000  6250.00000  1.830435608725e-03
6250.00000  6300.00000  1.875075666328e-03
6300.00000  6350.00000  1.829662620714e-03
6350.00000  6400.00000  3.327713384949e-03
6400.00000  6450.00000  1.706371033049e-03
6450.00000  6500.00000  1.692843742866e-03
6500.00000  6550.00000  1.679896193691e-03
6550.00000  6600.00000  1.652068625315e-03
6600.00000  6650.00000  1.605882591692e-03
6650.00000  6700.00000  1.643179263195e-03
6700.00000  6750.00000  1.578634764324e-03
6750.00000  6800.00000  1.575736059284e-03
6800.00000  6850.00000  1.578248270318e-03
6850.00000  6900.00000  1.537279905765e-03
6900.00000  6950.00000  1.530709507676e-03
6950.00000  7000.00000  1.527810802637e-03
7000.00000  7050.00000  1.521240404548e-03
7050.00000  7100.00000  1.643565757201e-03
7100.00000  7150.00000  1.419399234173e-03
7150.00000  7200.00000  1.400267780914e-03
7200.00000  7250.00000  1.414374812105e-03
7250.00000  7300.00000  1.403359732956e-03
7300.00000  7350.00000  1.390991924789e-03
7350.00000  7400.00000  1.358526428350e-03
7400.00000  7450.00000  1.343453162147e-03
7450.00000  7500.00000  1.418239752157e-03
7500.00000  7550.00000  1.334370553024e-03
7550.00000  7600.00000  1.285092567358e-03
7600.00000  7650.00000  1.292435953458e-03
7650.00000  7700.00000  1.295527905499e-03
7700.00000  7750.00000  1.260936692032e-03
7750.00000  7800.00000  1.238133545724e-03
7800.00000  7850.00000  1.230017171615e-03
7850.00000  7900.00000  1.199677392205e-03
7900.00000  7950.00000  1.219968327479e-03
7950.00000  8000.00000  1.187116337035e-03
8000.00000  8050.00000  1.188082572048e-03
8050.00000  8100.00000  1.165472672743e-03
8100.00000  8150.00000  1.173009305845e-03
8150.00000  8200.00000  1.127982754236e-03
8200.00000  8250.00000  1.153684605583e-03
8250.00000  8300.00000  1.128948989249e-03
8300.00000  8350.00000  1.116774428085e-03
8350.00000  8400.00000  1.091459070743e-03
8400.00000  8450.00000  1.115421699067e-03
8450.00000  8500.00000  1.107305324957e-03
8500.00000  8550.00000  1.078898015573e-03
8550.00000  8600.00000  1.083729190639e-03
8600.00000  8650.00000  1.062472020351e-03
8650.00000  8700.00000  1.051843435208e-03
8700.00000  8750.00000  1.046432519135e-03
8750.00000  8800.00000  1.021696902801e-03
8800.00000  8850.00000  1.028847041897e-03
8850.00000  8900.00000  1.007203377605e-03
8900.00000  8950.00000  1.014933257709e-03
8950.00000  9000.00000  9.996667445031e-04
9000.00000  9050.00000  9.888449123569e-04
9050.00000  9100.00000  1.011261564660e-03
9100.00000  9150.00000  9.527077228688e-04
9150.00000  9200.00000  9.610173439810e-04
9200.00000  9250.00000  9.565726629210e-04
9250.00000  9300.00000  9.557996749105e-04
9300.00000  9350.00000  9.453643367696e-04
9350.00000  9400.00000  9.214017084459e-04
9400.00000  9450.00000  9.339627636156e-04
9450.00000  9500.00000  9.049757132240e-04
9500.00000  9550.00000  9.014972671771e-04
9550.00000  9600.00000  8.871969889839e-04
9600.00000  9650.00000  9.018837611823e-04
9650.00000  9700.00000  8.715439817725e-04
9700.00000  9750.00000  8.696115117464e-04
9750.00000  9800.00000  8.871969889839e-04
9800.00000  9850.00000  8.730899577933e-04
9850.00000  9900.00000  8.576301975845e-04
9900.00000  9950.00000  8.578234445871e-04
9950.00000  10000.00000  8.441029074018e-04
