10001.00000  11001.00000  4.030573429501e-05
11001.00000  12001.00000  4.198663004644e-05
12001.00000  13001.00000  4.649286120986e-05
13001.00000  14001.00000  4.892479548853e-05
14001.00000  15001.00000  5.180377650960e-05
15001.00000  16001.00000  5.344890852164e-05
16001.00000  17001.00000  5.639941702149e-05
17001.00000  18001.00000  5.466487566097e-05
18001.00000  19001.00000  5.446817509432e-05
19001.00000  20001.00000  5.378866404586e-05
20001.00000  21001.00000  5.021229010664e-05
21001.00000  22001.00000  4.738695469466e-05
22001.00000  23001.00000  4.423974562815e-05
23001.00000  24001.00000  4.112830030103e-05
24001.00000  25001.00000  3.908976715567e-05
25001.00000  26001.00000  3.740887140424e-05
26001.00000  27001.00000  3.376096998623e-05
27001.00000  28001.00000  3.204431049541e-05
28001.00000  29001.00000  2.891498329859e-05
29001.00000  30001.00000  2.726985128655e-05
30001.00000  31001.00000  2.684068641384e-05
31001.00000  32001.00000  2.626846658357e-05
32001.00000  33001.00000  2.222716403225e-05
33001.00000  34001.00000  2.161918046258e-05
34001.00000  35001.00000  2.063567762930e-05
35001.00000  36001.00000  1.850773513546e-05
36001.00000  37001.00000  1.750635043248e-05
37001.00000  38001.00000  1.641555638102e-05
38001.00000  39001.00000  1.469889689019e-05
39001.00000  40001.00000  1.376903966600e-05
40001.00000  41001.00000  1.332199292359e-05
41001.00000  42001.00000  1.301800113876e-05
42001.00000  43001.00000  1.198085269639e-05
43001.00000  44001.00000  1.090794051462e-05
44001.00000  45001.00000  9.870792072246e-06
45001.00000  46001.00000  1.037148442374e-05
46001.00000  47001.00000  9.763500854070e-06
47001.00000  48001.00000  8.404478757166e-06
48001.00000  49001.00000  8.404478757166e-06
49001.00000  50001.00000  8.350833148078e-06
50001.00000  51001.00000  7.653440229930e-06
51001.00000  52001.00000  7.099102269351e-06
52001.00000  53001.00000  6.455354960292e-06
53001.00000  54001.00000  6.133481305762e-06
54001.00000  55001.00000  6.187126914850e-06
55001.00000  56001.00000  5.632788954271e-06
56001.00000  57001.00000  5.775843911840e-06
57001.00000  58001.00000  5.006923514908e-06
58001.00000  59001.00000  4.989041645211e-06
59001.00000  60001.00000  4.828104817947e-06
60001.00000  61001.00000  4.702931730074e-06
61001.00000  62001.00000  4.434703684632e-06
62001.00000  63001.00000  5.006923514908e-06
63001.00000  64001.00000  4.184357508887e-06
64001.00000  65001.00000  4.255884987671e-06
65001.00000  66001.00000  3.826720114965e-06
66001.00000  67001.00000  3.576373939220e-06
67001.00000  68001.00000  3.504846460435e-06
68001.00000  69001.00000  3.200854675602e-06
69001.00000  70001.00000  2.896862890768e-06
70001.00000  71001.00000  3.111445327121e-06
71001.00000  72001.00000  2.878981021072e-06
72001.00000  73001.00000  2.557107366542e-06
73001.00000  74001.00000  2.539225496846e-06
74001.00000  75001.00000  2.664398584719e-06
75001.00000  76001.00000  2.253115581708e-06
76001.00000  77001.00000  2.253115581708e-06
77001.00000  78001.00000  2.378288669581e-06
78001.00000  79001.00000  2.288879321101e-06
79001.00000  80001.00000  1.913360057483e-06
80001.00000  81001.00000  2.396170539277e-06
81001.00000  82001.00000  1.967005666571e-06
82001.00000  83001.00000  1.555722663561e-06
83001.00000  84001.00000  1.859714448394e-06
84001.00000  85001.00000  1.627250142345e-06
85001.00000  86001.00000  1.752423230218e-06
86001.00000  87001.00000  1.752423230218e-06
87001.00000  88001.00000  1.609368272649e-06
88001.00000  89001.00000  1.823950709002e-06
89001.00000  90001.00000  1.144439660550e-06
90001.00000  91001.00000  1.412667705992e-06
91001.00000  92001.00000  1.573604533257e-06
92001.00000  93001.00000  1.663013881737e-06
93001.00000  94001.00000  1.466313315080e-06
94001.00000  95001.00000  1.305376487815e-06
95001.00000  96001.00000  9.656209635893e-07
96001.00000  97001.00000  1.287494618119e-06
97001.00000  98001.00000  1.108675921158e-06
98001.00000  99001.00000  1.072912181766e-06
99001.00000  100001.00000  1.072912181766e-06
100001.00000  101001.00000  1.305376487815e-06
101001.00000  102001.00000  9.656209635893e-07
102001.00000  103001.00000  1.019266572678e-06
103001.00000  104001.00000  9.119753545010e-07
104001.00000  105001.00000  9.119753545010e-07
105001.00000  106001.00000  9.835028332854e-07
106001.00000  107001.00000  8.762116151088e-07
107001.00000  108001.00000  9.298572241971e-07
108001.00000  109001.00000  4.649286120986e-07
109001.00000  110001.00000  8.404478757166e-07
110001.00000  111001.00000  6.616291787556e-07
111001.00000  112001.00000  8.762116151088e-07
112001.00000  113001.00000  8.940934848049e-07
113001.00000  114001.00000  7.868022666283e-07
114001.00000  115001.00000  6.437473090595e-07
115001.00000  116001.00000  9.298572241971e-07
116001.00000  117001.00000  7.510385272361e-07
117001.00000  118001.00000  6.973929181478e-07
118001.00000  119001.00000  6.973929181478e-07
119001.00000  120001.00000  3.576373939220e-07
120001.00000  121001.00000  6.437473090595e-07
121001.00000  122001.00000  6.079835696674e-07
122001.00000  123001.00000  3.218736545298e-07
123001.00000  124001.00000  7.152747878439e-07
124001.00000  125001.00000  8.046841363244e-07
125001.00000  126001.00000  6.079835696674e-07
126001.00000  127001.00000  5.364560908830e-07
127001.00000  128001.00000  7.510385272361e-07
128001.00000  129001.00000  5.185742211869e-07
129001.00000  130001.00000  3.576373939220e-07
130001.00000  131001.00000  3.397555242259e-07
131001.00000  132001.00000  5.543379605791e-07
132001.00000  133001.00000  5.543379605791e-07
133001.00000  134001.00000  5.185742211869e-07
134001.00000  135001.00000  5.006923514908e-07
135001.00000  136001.00000  3.576373939220e-07
136001.00000  137001.00000  4.291648727064e-07
137001.00000  138001.00000  5.722198302752e-07
138001.00000  139001.00000  3.755192636181e-07
139001.00000  140001.00000  4.470467424025e-07
140001.00000  141001.00000  3.755192636181e-07
141001.00000  142001.00000  5.006923514908e-07
142001.00000  143001.00000  3.934011333142e-07
143001.00000  144001.00000  3.755192636181e-07
144001.00000  145001.00000  2.861099151376e-07
145001.00000  146001.00000  2.503461757454e-07
146001.00000  147001.00000  4.649286120986e-07
147001.00000  148001.00000  3.218736545298e-07
148001.00000  149001.00000  2.503461757454e-07
149001.00000  150001.00000  3.576373939220e-07
150001.00000  151001.00000  3.039917848337e-07
151001.00000  152001.00000  2.861099151376e-07
152001.00000  153001.00000  1.788186969610e-07
153001.00000  154001.00000  2.145824363532e-07
154001.00000  155001.00000  2.861099151376e-07
155001.00000  156001.00000  2.682280454415e-07
156001.00000  157001.00000  2.145824363532e-07
157001.00000  158001.00000  2.324643060493e-07
158001.00000  159001.00000  2.324643060493e-07
159001.00000  160001.00000  2.682280454415e-07
160001.00000  161001.00000  1.788186969610e-07
161001.00000  162001.00000  2.503461757454e-07
162001.00000  163001.00000  1.609368272649e-07
163001.00000  164001.00000  3.039917848337e-07
164001.00000  165001.00000  3.039917848337e-07
165001.00000  166001.00000  1.609368272649e-07
166001.00000  167001.00000  2.324643060493e-07
167001.00000  168001.00000  2.145824363532e-07
168001.00000  169001.00000  2.145824363532e-07
169001.00000  170001.00000  2.145824363532e-07
170001.00000  171001.00000  2.145824363532e-07
171001.00000  172001.00000  1.072912181766e-07
172001.00000  173001.00000  2.145824363532e-07
173001.00000  174001.00000  1.967005666571e-07
174001.00000  175001.00000  1.609368272649e-07
175001.00000  176001.00000  1.430549575688e-07
176001.00000  177001.00000  7.152747878439e-08
177001.00000  178001.00000  2.145824363532e-07
178001.00000  179001.00000  1.609368272649e-07
179001.00000  180001.00000  1.072912181766e-07
180001.00000  181001.00000  7.152747878439e-08
181001.00000  182001.00000  7.152747878439e-08
182001.00000  183001.00000  1.430549575688e-07
183001.00000  184001.00000  1.251730878727e-07
184001.00000  185001.00000  3.576373939220e-08
185001.00000  186001.00000  1.430549575688e-07
186001.00000  187001.00000  3.576373939220e-08
187001.00000  188001.00000  7.152747878439e-08
188001.00000  189001.00000  1.609368272649e-07
189001.00000  190001.00000  7.152747878439e-08
190001.00000  191001.00000  3.576373939220e-08
191001.00000  192001.00000  1.251730878727e-07
192001.00000  193001.00000  1.430549575688e-07
193001.00000  194001.00000  1.251730878727e-07
194001.00000  195001.00000  5.364560908830e-08
195001.00000  196001.00000  7.152747878439e-08
196001.00000  197001.00000  1.788186969610e-08
197001.00000  198001.00000  7.152747878439e-08
198001.00000  199001.00000  7.152747878439e-08
