300.00000  350.00000  0.000000000000e+00
350.00000  400.00000  0.000000000000e+00
400.00000  450.00000  0.000000000000e+00
450.00000  500.00000  2.435781405525e-06
500.00000  550.00000  1.217890702763e-05
550.00000  600.00000  8.119271351751e-07
600.00000  650.00000  4.871562811051e-06
650.00000  700.00000  8.119271351751e-07
700.00000  750.00000  2.435781405525e-06
750.00000  800.00000  2.435781405525e-06
800.00000  850.00000  1.217890702763e-05
850.00000  900.00000  1.623854270350e-06
900.00000  950.00000  8.119271351751e-07
950.00000  1000.00000  3.247708540701e-06
1000.00000  1050.00000  1.623854270350e-06
1050.00000  1100.00000  8.119271351751e-07
1100.00000  1150.00000  8.119271351751e-07
1150.00000  1200.00000  4.059635675876e-06
1200.00000  1250.00000  8.119271351751e-07
1250.00000  1300.00000  9.743125622102e-06
1300.00000  1350.00000  2.435781405525e-06
1350.00000  1400.00000  1.623854270350e-06
1400.00000  1450.00000  1.623854270350e-06
1450.00000  1500.00000  8.119271351751e-07
1500.00000  1550.00000  8.119271351751e-07
1550.00000  1600.00000  3.247708540701e-06
1600.00000  1650.00000  3.247708540701e-06
1650.00000  1700.00000  1.623854270350e-06
1700.00000  1750.00000  2.516974119043e-05
1750.00000  1800.00000  4.059635675876e-06
1800.00000  1850.00000  1.623854270350e-06
1850.00000  1900.00000  3.247708540701e-06
1900.00000  1950.00000  4.059635675876e-06
1950.00000  2000.00000  2.435781405525e-06
2000.00000  2050.00000  3.247708540701e-06
2050.00000  2100.00000  4.059635675876e-06
2100.00000  2150.00000  7.307344216576e-06
2150.00000  2200.00000  5.683489946226e-06
2200.00000  2250.00000  1.623854270350e-06
2250.00000  2300.00000  3.247708540701e-06
2300.00000  2350.00000  3.004130400148e-05
2350.00000  2400.00000  4.059635675876e-06
2400.00000  2450.00000  9.743125622102e-06
2450.00000  2500.00000  5.683489946226e-06
2500.00000  2550.00000  6.495417081401e-06
2550.00000  2600.00000  1.217890702763e-05
2600.00000  2650.00000  1.055505275728e-05
2650.00000  2700.00000  9.743125622102e-06
2700.00000  2750.00000  8.931198486926e-06
2750.00000  2800.00000  9.743125622102e-06
2800.00000  2850.00000  6.495417081401e-06
2850.00000  2900.00000  1.136697989245e-05
2900.00000  2950.00000  8.119271351751e-06
2950.00000  3000.00000  2.192203264973e-05
3000.00000  3050.00000  1.623854270350e-05
3050.00000  3100.00000  1.055505275728e-05
3100.00000  3150.00000  8.931198486926e-06
3150.00000  3200.00000  8.119271351751e-06
3200.00000  3250.00000  1.542661556833e-05
3250.00000  3300.00000  7.307344216576e-06
3300.00000  3350.00000  1.380276129798e-05
3350.00000  3400.00000  1.786239697385e-05
3400.00000  3450.00000  2.192203264973e-05
3450.00000  3500.00000  1.217890702763e-05
3500.00000  3550.00000  1.299083416280e-05
3550.00000  3600.00000  1.217890702763e-05
3600.00000  3650.00000  2.111010551455e-05
3650.00000  3700.00000  3.085323113665e-05
3700.00000  3750.00000  2.679359546078e-05
3750.00000  3800.00000  1.948625124420e-05
3800.00000  3850.00000  2.111010551455e-05
3850.00000  3900.00000  2.679359546078e-05
3900.00000  3950.00000  2.273395978490e-05
3950.00000  4000.00000  3.247708540701e-05
4000.00000  4050.00000  2.679359546078e-05
4050.00000  4100.00000  3.085323113665e-05
4100.00000  4150.00000  3.734864821806e-05
4150.00000  4200.00000  2.922937686630e-05
4200.00000  4250.00000  4.627984670498e-05
4250.00000  4300.00000  3.572479394771e-05
4300.00000  4350.00000  4.465599243463e-05
4350.00000  4400.00000  4.222021102911e-05
4400.00000  4450.00000  5.277526378638e-05
4450.00000  4500.00000  4.627984670498e-05
4500.00000  4550.00000  4.871562811051e-05
4550.00000  4600.00000  7.226151503059e-05
4600.00000  4650.00000  7.956885924716e-05
4650.00000  4700.00000  5.927068086778e-05
4700.00000  4750.00000  7.144958789541e-05
4750.00000  4800.00000  7.307344216576e-05
4800.00000  4850.00000  1.006789647617e-04
4850.00000  4900.00000  7.713307784164e-05
4900.00000  4950.00000  7.388536930094e-05
4950.00000  5000.00000  9.012391200444e-05
5000.00000  5050.00000  8.119271351751e-05
5050.00000  5100.00000  9.661932908584e-05
5100.00000  5150.00000  8.931198486926e-05
5150.00000  5200.00000  1.087982361135e-04
5200.00000  5250.00000  1.055505275728e-04
5250.00000  5300.00000  1.193532888707e-04
5300.00000  5350.00000  1.063624547079e-04
5350.00000  5400.00000  1.250367788170e-04
5400.00000  5450.00000  1.282844873577e-04
5450.00000  5500.00000  9.824318335619e-05
5500.00000  5550.00000  1.177294346004e-04
5550.00000  5600.00000  1.217890702763e-04
5600.00000  5650.00000  1.217890702763e-04
5650.00000  5700.00000  1.242248516818e-04
5700.00000  5750.00000  1.364037587094e-04
5750.00000  5800.00000  1.226009974114e-04
5800.00000  5850.00000  1.396514672501e-04
5850.00000  5900.00000  1.510184471426e-04
5900.00000  5950.00000  1.290964144928e-04
5950.00000  6000.00000  1.420872486556e-04
6000.00000  6050.00000  1.526423014129e-04
6050.00000  6100.00000  1.347799044391e-04
6100.00000  6150.00000  1.347799044391e-04
6150.00000  6200.00000  1.307202687632e-04
6200.00000  6250.00000  1.323441230335e-04
6250.00000  6300.00000  1.721285526571e-04
6300.00000  6350.00000  1.510184471426e-04
6350.00000  6400.00000  4.603626856443e-04
6400.00000  6450.00000  1.453349571963e-04
6450.00000  6500.00000  1.372156858446e-04
6500.00000  6550.00000  1.364037587094e-04
6550.00000  6600.00000  1.396514672501e-04
6600.00000  6650.00000  1.445230300612e-04
6650.00000  6700.00000  1.339679773039e-04
6700.00000  6750.00000  1.583257913592e-04
6750.00000  6800.00000  1.445230300612e-04
6800.00000  6850.00000  1.331560501687e-04
6850.00000  6900.00000  1.161055803300e-04
6900.00000  6950.00000  1.290964144928e-04
6950.00000  7000.00000  1.242248516818e-04
7000.00000  7050.00000  1.307202687632e-04
7050.00000  7100.00000  1.859313139551e-04
7100.00000  7150.00000  6.333031654366e-05
7150.00000  7200.00000  5.358719092156e-05
7200.00000  7250.00000  5.602297232708e-05
7250.00000  7300.00000  5.277526378638e-05
7300.00000  7350.00000  5.521104519191e-05
7350.00000  7400.00000  5.033948238086e-05
7400.00000  7450.00000  6.576609794919e-05
7450.00000  7500.00000  6.820187935471e-05
7500.00000  7550.00000  5.764682659743e-05
7550.00000  7600.00000  7.144958789541e-05
7600.00000  7650.00000  5.196333665121e-05
7650.00000  7700.00000  4.627984670498e-05
7700.00000  7750.00000  6.251838940849e-05
7750.00000  7800.00000  5.764682659743e-05
7800.00000  7850.00000  6.901380648989e-05
7850.00000  7900.00000  6.333031654366e-05
7900.00000  7950.00000  5.927068086778e-05
7950.00000  8000.00000  5.521104519191e-05
8000.00000  8050.00000  5.115140951603e-05
8050.00000  8100.00000  6.089453513813e-05
8100.00000  8150.00000  6.576609794919e-05
8150.00000  8200.00000  4.059635675876e-05
8200.00000  8250.00000  7.063766076024e-05
8250.00000  8300.00000  6.576609794919e-05
8300.00000  8350.00000  6.170646227331e-05
8350.00000  8400.00000  5.033948238086e-05
8400.00000  8450.00000  5.521104519191e-05
8450.00000  8500.00000  6.170646227331e-05
8500.00000  8550.00000  5.033948238086e-05
8550.00000  8600.00000  6.251838940849e-05
8600.00000  8650.00000  5.358719092156e-05
8650.00000  8700.00000  6.008260800296e-05
8700.00000  8750.00000  4.709177384016e-05
8750.00000  8800.00000  5.602297232708e-05
8800.00000  8850.00000  6.008260800296e-05
8850.00000  8900.00000  5.521104519191e-05
8900.00000  8950.00000  6.738995221954e-05
8950.00000  9000.00000  5.033948238086e-05
9000.00000  9050.00000  5.764682659743e-05
9050.00000  9100.00000  6.495417081401e-05
9100.00000  9150.00000  6.089453513813e-05
9150.00000  9200.00000  6.495417081401e-05
9200.00000  9250.00000  5.277526378638e-05
9250.00000  9300.00000  6.008260800296e-05
9300.00000  9350.00000  5.927068086778e-05
9350.00000  9400.00000  5.521104519191e-05
9400.00000  9450.00000  4.952755524568e-05
9450.00000  9500.00000  4.871562811051e-05
9500.00000  9550.00000  5.764682659743e-05
9550.00000  9600.00000  5.277526378638e-05
9600.00000  9650.00000  5.927068086778e-05
9650.00000  9700.00000  4.546791956981e-05
9700.00000  9750.00000  6.170646227331e-05
9750.00000  9800.00000  5.115140951603e-05
9800.00000  9850.00000  4.546791956981e-05
9850.00000  9900.00000  5.764682659743e-05
9900.00000  9950.00000  5.439911805673e-05
9950.00000  10000.00000  5.845875373261e-05
