300.00000  350.00000  6.116049053230e-05
350.00000  400.00000  9.770761292356e-05
400.00000  450.00000  7.309424478251e-05
450.00000  500.00000  7.980698154825e-05
500.00000  550.00000  4.266317144449e-04
550.00000  600.00000  5.892291161039e-05
600.00000  650.00000  1.200834021427e-04
650.00000  700.00000  6.339806945422e-05
700.00000  750.00000  8.353627975144e-05
750.00000  800.00000  6.116049053230e-05
800.00000  850.00000  1.827356119563e-04
850.00000  900.00000  7.160252550123e-05
900.00000  950.00000  4.997259592274e-05
950.00000  1000.00000  5.444775376656e-05
1000.00000  1050.00000  5.519361340720e-05
1050.00000  1100.00000  6.488978873549e-05
1100.00000  1150.00000  6.712736765741e-05
1150.00000  1200.00000  6.488978873549e-05
1200.00000  1250.00000  6.190635017294e-05
1250.00000  1300.00000  1.499177877682e-04
1300.00000  1350.00000  5.071845556337e-05
1350.00000  1400.00000  5.444775376656e-05
1400.00000  1450.00000  5.221017484465e-05
1450.00000  1500.00000  6.712736765741e-05
1500.00000  1550.00000  5.817705196975e-05
1550.00000  1600.00000  5.295603448529e-05
1600.00000  1650.00000  4.848087664146e-05
1650.00000  1700.00000  7.011080621996e-05
1700.00000  1750.00000  1.797521733937e-04
1750.00000  1800.00000  6.861908693868e-05
1800.00000  1850.00000  6.041463089167e-05
1850.00000  1900.00000  8.279042011080e-05
1900.00000  1950.00000  6.861908693868e-05
1950.00000  2000.00000  6.190635017294e-05
2000.00000  2050.00000  7.011080621996e-05
2050.00000  2100.00000  7.011080621996e-05
2100.00000  2150.00000  7.682354298570e-05
2150.00000  2200.00000  6.787322729805e-05
2200.00000  2250.00000  6.041463089167e-05
2250.00000  2300.00000  6.339806945422e-05
2300.00000  2350.00000  1.879566294407e-04
2350.00000  2400.00000  7.085666586060e-05
2400.00000  2450.00000  7.831526226698e-05
2450.00000  2500.00000  7.980698154825e-05
2500.00000  2550.00000  7.234838514187e-05
2550.00000  2600.00000  6.414392909486e-05
2600.00000  2650.00000  6.041463089167e-05
2650.00000  2700.00000  6.339806945422e-05
2700.00000  2750.00000  6.488978873549e-05
2750.00000  2800.00000  6.414392909486e-05
2800.00000  2850.00000  5.370189412593e-05
2850.00000  2900.00000  5.743119232912e-05
2900.00000  2950.00000  6.339806945422e-05
2950.00000  3000.00000  9.621589364228e-05
3000.00000  3050.00000  6.265220981358e-05
3050.00000  3100.00000  5.444775376656e-05
3100.00000  3150.00000  6.190635017294e-05
3150.00000  3200.00000  5.370189412593e-05
3200.00000  3250.00000  5.966877125103e-05
3250.00000  3300.00000  5.221017484465e-05
3300.00000  3350.00000  5.892291161039e-05
3350.00000  3400.00000  5.668533268848e-05
3400.00000  3450.00000  5.743119232912e-05
3450.00000  3500.00000  5.892291161039e-05
3500.00000  3550.00000  6.563564837613e-05
3550.00000  3600.00000  5.444775376656e-05
3600.00000  3650.00000  5.295603448529e-05
3650.00000  3700.00000  7.533182370442e-05
3700.00000  3750.00000  5.966877125103e-05
3750.00000  3800.00000  4.698915736019e-05
3800.00000  3850.00000  5.146431520401e-05
3850.00000  3900.00000  5.221017484465e-05
3900.00000  3950.00000  4.773501700082e-05
3950.00000  4000.00000  6.339806945422e-05
4000.00000  4050.00000  5.743119232912e-05
4050.00000  4100.00000  5.593947304784e-05
4100.00000  4150.00000  5.071845556337e-05
4150.00000  4200.00000  4.624329771955e-05
4200.00000  4250.00000  5.295603448529e-05
4250.00000  4300.00000  4.549743807891e-05
4300.00000  4350.00000  4.475157843827e-05
4350.00000  4400.00000  4.475157843827e-05
4400.00000  4450.00000  6.339806945422e-05
4450.00000  4500.00000  4.176813987572e-05
4500.00000  4550.00000  4.176813987572e-05
4550.00000  4600.00000  4.848087664146e-05
4600.00000  4650.00000  4.475157843827e-05
4650.00000  4700.00000  5.071845556337e-05
4700.00000  4750.00000  5.817705196975e-05
4750.00000  4800.00000  6.414392909486e-05
4800.00000  4850.00000  4.251399951636e-05
4850.00000  4900.00000  4.475157843827e-05
4900.00000  4950.00000  4.176813987572e-05
4950.00000  5000.00000  5.593947304784e-05
5000.00000  5050.00000  4.475157843827e-05
5050.00000  5100.00000  3.505540310998e-05
5100.00000  5150.00000  4.475157843827e-05
5150.00000  5200.00000  4.773501700082e-05
5200.00000  5250.00000  4.549743807891e-05
5250.00000  5300.00000  4.475157843827e-05
5300.00000  5350.00000  3.729298203189e-05
5350.00000  5400.00000  3.803884167253e-05
5400.00000  5450.00000  4.176813987572e-05
5450.00000  5500.00000  4.102228023508e-05
5500.00000  5550.00000  3.430954346934e-05
5550.00000  5600.00000  5.892291161039e-05
5600.00000  5650.00000  3.505540310998e-05
5650.00000  5700.00000  3.729298203189e-05
5700.00000  5750.00000  4.549743807891e-05
5750.00000  5800.00000  4.102228023508e-05
5800.00000  5850.00000  3.803884167253e-05
5850.00000  5900.00000  4.400571879763e-05
5900.00000  5950.00000  3.953056095381e-05
5950.00000  6000.00000  4.698915736019e-05
6000.00000  6050.00000  3.580126275062e-05
6050.00000  6100.00000  4.325985915700e-05
6100.00000  6150.00000  4.922673628210e-05
6150.00000  6200.00000  3.953056095381e-05
6200.00000  6250.00000  6.563564837613e-05
6250.00000  6300.00000  8.801143759527e-05
6300.00000  6350.00000  5.593947304784e-05
6350.00000  6400.00000  4.967425206648e-04
6400.00000  6450.00000  2.759680670360e-05
6450.00000  6500.00000  3.580126275062e-05
6500.00000  6550.00000  4.251399951636e-05
6550.00000  6600.00000  4.027642059444e-05
6600.00000  6650.00000  3.878470131317e-05
6650.00000  6700.00000  3.803884167253e-05
6700.00000  6750.00000  3.580126275062e-05
6750.00000  6800.00000  3.580126275062e-05
6800.00000  6850.00000  4.325985915700e-05
6850.00000  6900.00000  4.475157843827e-05
6900.00000  6950.00000  3.580126275062e-05
6950.00000  7000.00000  3.058024526615e-05
7000.00000  7050.00000  3.058024526615e-05
7050.00000  7100.00000  8.577385867335e-05
7100.00000  7150.00000  2.386750850041e-05
7150.00000  7200.00000  1.715477173467e-05
7200.00000  7250.00000  2.610508742233e-05
7250.00000  7300.00000  2.088406993786e-05
7300.00000  7350.00000  2.685094706296e-05
7350.00000  7400.00000  1.640891209403e-05
7400.00000  7450.00000  2.386750850041e-05
7450.00000  7500.00000  4.773501700082e-05
7500.00000  7550.00000  1.864649101595e-05
7550.00000  7600.00000  2.013821029722e-05
7600.00000  7650.00000  1.640891209403e-05
7650.00000  7700.00000  2.535922778169e-05
7700.00000  7750.00000  2.610508742233e-05
7750.00000  7800.00000  2.535922778169e-05
7800.00000  7850.00000  2.834266634424e-05
7850.00000  7900.00000  2.162992957850e-05
7900.00000  7950.00000  2.013821029722e-05
7950.00000  8000.00000  1.939235065658e-05
8000.00000  8050.00000  1.417133317212e-05
8050.00000  8100.00000  1.491719281276e-05
8100.00000  8150.00000  2.386750850041e-05
8150.00000  8200.00000  1.640891209403e-05
8200.00000  8250.00000  1.417133317212e-05
8250.00000  8300.00000  1.864649101595e-05
8300.00000  8350.00000  2.162992957850e-05
8350.00000  8400.00000  1.864649101595e-05
8400.00000  8450.00000  2.237578921914e-05
8450.00000  8500.00000  1.864649101595e-05
8500.00000  8550.00000  1.491719281276e-05
8550.00000  8600.00000  1.864649101595e-05
8600.00000  8650.00000  1.939235065658e-05
8650.00000  8700.00000  2.237578921914e-05
8700.00000  8750.00000  2.610508742233e-05
8750.00000  8800.00000  2.013821029722e-05
8800.00000  8850.00000  2.386750850041e-05
8850.00000  8900.00000  2.088406993786e-05
8900.00000  8950.00000  1.640891209403e-05
8950.00000  9000.00000  2.013821029722e-05
9000.00000  9050.00000  1.939235065658e-05
9050.00000  9100.00000  1.715477173467e-05
9100.00000  9150.00000  2.535922778169e-05
9150.00000  9200.00000  2.535922778169e-05
9200.00000  9250.00000  2.237578921914e-05
9250.00000  9300.00000  1.417133317212e-05
9300.00000  9350.00000  1.715477173467e-05
9350.00000  9400.00000  2.461336814105e-05
9400.00000  9450.00000  2.162992957850e-05
9450.00000  9500.00000  1.566305245340e-05
9500.00000  9550.00000  1.417133317212e-05
9550.00000  9600.00000  2.759680670360e-05
9600.00000  9650.00000  1.939235065658e-05
9650.00000  9700.00000  1.715477173467e-05
9700.00000  9750.00000  2.685094706296e-05
9750.00000  9800.00000  1.864649101595e-05
9800.00000  9850.00000  1.939235065658e-05
9850.00000  9900.00000  2.088406993786e-05
9900.00000  9950.00000  1.640891209403e-05
9950.00000  10000.00000  2.013821029722e-05
