300.00000  350.00000  7.546814415309e-06
350.00000  400.00000  1.760923363572e-05
400.00000  450.00000  8.707862786896e-06
450.00000  500.00000  1.277153208745e-05
500.00000  550.00000  9.404491809847e-05
550.00000  600.00000  1.025592728234e-05
600.00000  650.00000  2.593008029876e-05
650.00000  700.00000  9.288386972689e-06
700.00000  750.00000  2.225342712207e-05
750.00000  800.00000  1.509362883062e-05
800.00000  850.00000  5.708487826965e-05
850.00000  900.00000  1.064294340621e-05
900.00000  950.00000  1.257802402552e-05
950.00000  1000.00000  1.354556433517e-05
1000.00000  1050.00000  1.277153208745e-05
1050.00000  1100.00000  1.431959658289e-05
1100.00000  1150.00000  1.238451596358e-05
1150.00000  1200.00000  1.644818526414e-05
1200.00000  1250.00000  1.393258045903e-05
1250.00000  1300.00000  3.754056401462e-05
1300.00000  1350.00000  1.219100790165e-05
1350.00000  1400.00000  1.354556433517e-05
1400.00000  1450.00000  1.451310464483e-05
1450.00000  1500.00000  1.857677394538e-05
1500.00000  1550.00000  1.799624975958e-05
1550.00000  1600.00000  1.760923363572e-05
1600.00000  1650.00000  1.973782231696e-05
1650.00000  1700.00000  1.451310464483e-05
1700.00000  1750.00000  4.702245904924e-05
1750.00000  1800.00000  1.373907239710e-05
1800.00000  1850.00000  1.470661270676e-05
1850.00000  1900.00000  1.470661270676e-05
1900.00000  1950.00000  2.012483844083e-05
1950.00000  2000.00000  1.722221751186e-05
2000.00000  2050.00000  1.857677394538e-05
2050.00000  2100.00000  1.702870944993e-05
2100.00000  2150.00000  1.973782231696e-05
2150.00000  2200.00000  1.896379006924e-05
2200.00000  2250.00000  1.973782231696e-05
2250.00000  2300.00000  1.838326588345e-05
2300.00000  2350.00000  5.998749919861e-05
2350.00000  2400.00000  1.644818526414e-05
2400.00000  2450.00000  2.089887068855e-05
2450.00000  2500.00000  2.418850774138e-05
2500.00000  2550.00000  1.799624975958e-05
2550.00000  2600.00000  2.167290293627e-05
2600.00000  2650.00000  1.838326588345e-05
2650.00000  2700.00000  1.857677394538e-05
2700.00000  2750.00000  1.877028200731e-05
2750.00000  2800.00000  2.128588681241e-05
2800.00000  2850.00000  2.070536262662e-05
2850.00000  2900.00000  1.780274169765e-05
2900.00000  2950.00000  2.128588681241e-05
2950.00000  3000.00000  3.483145114758e-05
3000.00000  3050.00000  1.818975782152e-05
3050.00000  3100.00000  1.799624975958e-05
3100.00000  3150.00000  1.741572557379e-05
3150.00000  3200.00000  2.244693518400e-05
3200.00000  3250.00000  2.341447549365e-05
3250.00000  3300.00000  1.935080619310e-05
3300.00000  3350.00000  2.128588681241e-05
3350.00000  3400.00000  2.089887068855e-05
3400.00000  3450.00000  2.380149161751e-05
3450.00000  3500.00000  2.380149161751e-05
3500.00000  3550.00000  2.418850774138e-05
3550.00000  3600.00000  2.167290293627e-05
3600.00000  3650.00000  2.244693518400e-05
3650.00000  3700.00000  4.063669300551e-05
3700.00000  3750.00000  2.380149161751e-05
3750.00000  3800.00000  2.283395130786e-05
3800.00000  3850.00000  2.728463673227e-05
3850.00000  3900.00000  2.399499967945e-05
3900.00000  3950.00000  2.689762060841e-05
3950.00000  4000.00000  2.573657223682e-05
4000.00000  4050.00000  2.612358836069e-05
4050.00000  4100.00000  2.322096743172e-05
4100.00000  4150.00000  2.631709642262e-05
4150.00000  4200.00000  2.805866898000e-05
4200.00000  4250.00000  2.670411254648e-05
4250.00000  4300.00000  3.096128990896e-05
4300.00000  4350.00000  2.670411254648e-05
4350.00000  4400.00000  2.728463673227e-05
4400.00000  4450.00000  3.115479797089e-05
4450.00000  4500.00000  2.844568510386e-05
4500.00000  4550.00000  2.767165285613e-05
4550.00000  4600.00000  2.767165285613e-05
4600.00000  4650.00000  2.921971735158e-05
4650.00000  4700.00000  3.076778184703e-05
4700.00000  4750.00000  2.612358836069e-05
4750.00000  4800.00000  2.941322541351e-05
4800.00000  4850.00000  2.747814479420e-05
4850.00000  4900.00000  2.921971735158e-05
4900.00000  4950.00000  2.670411254648e-05
4950.00000  5000.00000  2.960673347544e-05
5000.00000  5050.00000  3.096128990896e-05
5050.00000  5100.00000  2.999374959931e-05
5100.00000  5150.00000  2.728463673227e-05
5150.00000  5200.00000  3.154181409475e-05
5200.00000  5250.00000  3.308987859020e-05
5250.00000  5300.00000  3.115479797089e-05
5300.00000  5350.00000  3.192883021862e-05
5350.00000  5400.00000  3.599249951917e-05
5400.00000  5450.00000  3.908862851006e-05
5450.00000  5500.00000  3.483145114758e-05
5500.00000  5550.00000  3.347689471407e-05
5550.00000  5600.00000  3.328338665213e-05
5600.00000  5650.00000  3.328338665213e-05
5650.00000  5700.00000  3.657302370496e-05
5700.00000  5750.00000  3.289637052827e-05
5750.00000  5800.00000  3.618600758110e-05
5800.00000  5850.00000  3.715354789075e-05
5850.00000  5900.00000  3.870161238620e-05
5900.00000  5950.00000  3.405741889986e-05
5950.00000  6000.00000  3.812108820041e-05
6000.00000  6050.00000  3.212233828055e-05
6050.00000  6100.00000  4.005616881972e-05
6100.00000  6150.00000  4.450685424413e-05
6150.00000  6200.00000  4.624842680151e-05
6200.00000  6250.00000  7.527463609116e-05
6250.00000  6300.00000  9.481895034620e-05
6300.00000  6350.00000  9.888261964675e-05
6350.00000  6400.00000  8.078961585620e-04
6400.00000  6450.00000  3.870161238620e-05
6450.00000  6500.00000  4.179774137710e-05
6500.00000  6550.00000  4.257177362482e-05
6550.00000  6600.00000  4.218475750096e-05
6600.00000  6650.00000  4.141072525324e-05
6650.00000  6700.00000  3.889512044813e-05
6700.00000  6750.00000  3.850810432427e-05
6750.00000  6800.00000  4.489387036799e-05
6800.00000  6850.00000  4.353931393448e-05
6850.00000  6900.00000  4.276528168675e-05
6900.00000  6950.00000  4.876403160662e-05
6950.00000  7000.00000  4.489387036799e-05
7000.00000  7050.00000  4.470036230606e-05
7050.00000  7100.00000  1.352621352898e-04
7100.00000  7150.00000  2.670411254648e-05
7150.00000  7200.00000  2.438201580331e-05
7200.00000  7250.00000  2.051185456469e-05
7250.00000  7300.00000  2.341447549365e-05
7300.00000  7350.00000  2.322096743172e-05
7350.00000  7400.00000  2.476903192717e-05
7400.00000  7450.00000  2.554306417489e-05
7450.00000  7500.00000  5.398874927875e-05
7500.00000  7550.00000  2.244693518400e-05
7550.00000  7600.00000  2.031834650276e-05
7600.00000  7650.00000  2.534955611296e-05
7650.00000  7700.00000  2.205991906014e-05
7700.00000  7750.00000  2.593008029876e-05
7750.00000  7800.00000  2.283395130786e-05
7800.00000  7850.00000  2.457552386524e-05
7850.00000  7900.00000  2.476903192717e-05
7900.00000  7950.00000  2.476903192717e-05
7950.00000  8000.00000  2.283395130786e-05
8000.00000  8050.00000  2.709112867034e-05
8050.00000  8100.00000  2.438201580331e-05
8100.00000  8150.00000  2.534955611296e-05
8150.00000  8200.00000  2.360798355558e-05
8200.00000  8250.00000  2.980024153738e-05
8250.00000  8300.00000  2.960673347544e-05
8300.00000  8350.00000  2.418850774138e-05
8350.00000  8400.00000  2.302745936979e-05
8400.00000  8450.00000  2.186641099820e-05
8450.00000  8500.00000  2.128588681241e-05
8500.00000  8550.00000  2.380149161751e-05
8550.00000  8600.00000  2.225342712207e-05
8600.00000  8650.00000  2.573657223682e-05
8650.00000  8700.00000  2.883270122772e-05
8700.00000  8750.00000  2.418850774138e-05
8750.00000  8800.00000  3.057427378510e-05
8800.00000  8850.00000  2.631709642262e-05
8850.00000  8900.00000  2.573657223682e-05
8900.00000  8950.00000  2.670411254648e-05
8950.00000  9000.00000  2.515604805103e-05
9000.00000  9050.00000  2.863919316579e-05
9050.00000  9100.00000  2.651060448455e-05
9100.00000  9150.00000  2.476903192717e-05
9150.00000  9200.00000  2.360798355558e-05
9200.00000  9250.00000  2.554306417489e-05
9250.00000  9300.00000  2.534955611296e-05
9300.00000  9350.00000  2.476903192717e-05
9350.00000  9400.00000  2.825217704193e-05
9400.00000  9450.00000  2.844568510386e-05
9450.00000  9500.00000  3.076778184703e-05
9500.00000  9550.00000  2.709112867034e-05
9550.00000  9600.00000  3.134830603282e-05
9600.00000  9650.00000  2.844568510386e-05
9650.00000  9700.00000  2.844568510386e-05
9700.00000  9750.00000  2.786516091807e-05
9750.00000  9800.00000  2.786516091807e-05
9800.00000  9850.00000  3.057427378510e-05
9850.00000  9900.00000  2.883270122772e-05
9900.00000  9950.00000  2.844568510386e-05
9950.00000  10000.00000  2.612358836069e-05
