300.00000  350.00000  6.754431421687e-05
350.00000  400.00000  1.013164713253e-04
400.00000  450.00000  7.558530400459e-05
450.00000  500.00000  7.880169991968e-05
500.00000  550.00000  5.146233464142e-04
550.00000  600.00000  6.432791830178e-05
600.00000  650.00000  1.527788059667e-04
650.00000  700.00000  4.905003770511e-05
700.00000  750.00000  9.086318460126e-05
750.00000  800.00000  7.317300706827e-05
800.00000  850.00000  2.331887038439e-04
850.00000  900.00000  6.271972034423e-05
900.00000  950.00000  6.191562136546e-05
950.00000  1000.00000  6.674021523809e-05
1000.00000  1050.00000  8.845088766494e-05
1050.00000  1100.00000  5.628692851406e-05
1100.00000  1150.00000  5.065823566265e-05
1150.00000  1200.00000  7.397710604704e-05
1200.00000  1250.00000  6.513201728055e-05
1250.00000  1300.00000  1.688607855422e-04
1300.00000  1350.00000  6.271972034423e-05
1350.00000  1400.00000  6.191562136546e-05
1400.00000  1450.00000  6.915251217441e-05
1450.00000  1500.00000  8.523449174985e-05
1500.00000  1550.00000  6.352381932300e-05
1550.00000  1600.00000  8.362629379231e-05
1600.00000  1650.00000  5.869922545037e-05
1650.00000  1700.00000  6.593611625932e-05
1700.00000  1750.00000  1.608197957544e-04
1750.00000  1800.00000  5.869922545037e-05
1800.00000  1850.00000  7.397710604704e-05
1850.00000  1900.00000  7.558530400459e-05
1900.00000  1950.00000  7.638940298336e-05
1950.00000  2000.00000  8.523449174985e-05
2000.00000  2050.00000  8.443039277108e-05
2050.00000  2100.00000  9.568777847389e-05
2100.00000  2150.00000  8.282219481354e-05
2150.00000  2200.00000  8.925498664372e-05
2200.00000  2250.00000  7.880169991968e-05
2250.00000  2300.00000  8.925498664372e-05
2300.00000  2350.00000  1.664484886058e-04
2350.00000  2400.00000  1.037287682616e-04
2400.00000  2450.00000  8.443039277108e-05
2450.00000  2500.00000  8.523449174985e-05
2500.00000  2550.00000  7.880169991968e-05
2550.00000  2600.00000  8.523449174985e-05
2600.00000  2650.00000  7.317300706827e-05
2650.00000  2700.00000  8.443039277108e-05
2700.00000  2750.00000  7.397710604704e-05
2750.00000  2800.00000  9.247138255880e-05
2800.00000  2850.00000  8.040989787722e-05
2850.00000  2900.00000  8.523449174985e-05
2900.00000  2950.00000  1.053369662192e-04
2950.00000  3000.00000  1.045328672404e-04
3000.00000  3050.00000  1.021205703041e-04
3050.00000  3100.00000  8.684268970740e-05
3100.00000  3150.00000  9.247138255880e-05
3150.00000  3200.00000  1.077492631555e-04
3200.00000  3250.00000  8.523449174985e-05
3250.00000  3300.00000  1.117697580493e-04
3300.00000  3350.00000  8.684268970740e-05
3350.00000  3400.00000  1.021205703041e-04
3400.00000  3450.00000  1.037287682616e-04
3450.00000  3500.00000  1.117697580493e-04
3500.00000  3550.00000  1.077492631555e-04
3550.00000  3600.00000  1.013164713253e-04
3600.00000  3650.00000  1.157902529432e-04
3650.00000  3700.00000  9.970827336775e-05
3700.00000  3750.00000  1.141820549857e-04
3750.00000  3800.00000  1.157902529432e-04
3800.00000  3850.00000  1.310681335399e-04
3850.00000  3900.00000  1.294599355823e-04
3900.00000  3950.00000  1.254394406885e-04
3950.00000  4000.00000  1.190066488583e-04
4000.00000  4050.00000  1.318722325186e-04
4050.00000  4100.00000  1.383050243488e-04
4100.00000  4150.00000  1.447378161790e-04
4150.00000  4200.00000  1.173984509007e-04
4200.00000  4250.00000  1.423255192427e-04
4250.00000  4300.00000  1.503665090304e-04
4300.00000  4350.00000  1.294599355823e-04
4350.00000  4400.00000  1.439337172002e-04
4400.00000  4450.00000  1.407173212851e-04
4450.00000  4500.00000  1.592115977969e-04
4500.00000  4550.00000  1.479542120941e-04
4550.00000  4600.00000  1.648402906483e-04
4600.00000  4650.00000  1.600156967757e-04
4650.00000  4700.00000  1.439337172002e-04
4700.00000  4750.00000  1.624279937120e-04
4750.00000  4800.00000  1.744894783936e-04
4800.00000  4850.00000  1.423255192427e-04
4850.00000  4900.00000  1.495624100516e-04
4900.00000  4950.00000  1.801181712450e-04
4950.00000  5000.00000  1.785099732874e-04
5000.00000  5050.00000  1.688607855422e-04
5050.00000  5100.00000  1.592115977969e-04
5100.00000  5150.00000  1.680566865634e-04
5150.00000  5200.00000  1.648402906483e-04
5200.00000  5250.00000  1.672525875846e-04
5250.00000  5300.00000  1.479542120941e-04
5300.00000  5350.00000  1.728812804360e-04
5350.00000  5400.00000  1.503665090304e-04
5400.00000  5450.00000  1.584074988181e-04
5450.00000  5500.00000  1.809222702237e-04
5500.00000  5550.00000  1.680566865634e-04
5550.00000  5600.00000  1.696648845209e-04
5600.00000  5650.00000  1.728812804360e-04
5650.00000  5700.00000  1.672525875846e-04
5700.00000  5750.00000  1.841386661388e-04
5750.00000  5800.00000  1.817263692025e-04
5800.00000  5850.00000  1.785099732874e-04
5850.00000  5900.00000  1.600156967757e-04
5900.00000  5950.00000  1.680566865634e-04
5950.00000  6000.00000  1.793140722662e-04
6000.00000  6050.00000  1.696648845209e-04
6050.00000  6100.00000  1.576033998394e-04
6100.00000  6150.00000  1.769017753299e-04
6150.00000  6200.00000  1.439337172002e-04
6200.00000  6250.00000  1.785099732874e-04
6250.00000  6300.00000  1.391091233276e-04
6300.00000  6350.00000  1.559952018818e-04
6350.00000  6400.00000  4.012453904073e-04
6400.00000  6450.00000  1.407173212851e-04
6450.00000  6500.00000  1.576033998394e-04
6500.00000  6550.00000  1.503665090304e-04
6550.00000  6600.00000  1.302640345611e-04
6600.00000  6650.00000  1.342845294550e-04
6650.00000  6700.00000  1.471501131153e-04
6700.00000  6750.00000  1.479542120941e-04
6750.00000  6800.00000  1.350886284337e-04
6800.00000  6850.00000  1.206148468158e-04
6850.00000  6900.00000  1.455419151578e-04
6900.00000  6950.00000  1.334804304762e-04
6950.00000  7000.00000  1.222230447734e-04
7000.00000  7050.00000  1.391091233276e-04
7050.00000  7100.00000  1.439337172002e-04
7100.00000  7150.00000  6.995661115318e-05
7150.00000  7200.00000  6.191562136546e-05
7200.00000  7250.00000  6.754431421687e-05
7250.00000  7300.00000  7.076071013195e-05
7300.00000  7350.00000  8.040989787722e-05
7350.00000  7400.00000  5.548282953528e-05
7400.00000  7450.00000  6.271972034423e-05
7450.00000  7500.00000  8.201809583477e-05
7500.00000  7550.00000  6.834841319564e-05
7550.00000  7600.00000  6.271972034423e-05
7600.00000  7650.00000  6.271972034423e-05
7650.00000  7700.00000  5.387463157774e-05
7700.00000  7750.00000  6.030742340792e-05
7750.00000  7800.00000  6.593611625932e-05
7800.00000  7850.00000  6.834841319564e-05
7850.00000  7900.00000  4.824593872633e-05
7900.00000  7950.00000  5.548282953528e-05
7950.00000  8000.00000  6.432791830178e-05
8000.00000  8050.00000  5.628692851406e-05
8050.00000  8100.00000  6.271972034423e-05
8100.00000  8150.00000  6.030742340792e-05
8150.00000  8200.00000  5.307053259897e-05
8200.00000  8250.00000  6.432791830178e-05
8250.00000  8300.00000  5.146233464142e-05
8300.00000  8350.00000  4.985413668388e-05
8350.00000  8400.00000  5.950332442914e-05
8400.00000  8450.00000  5.709102749283e-05
8450.00000  8500.00000  5.146233464142e-05
8500.00000  8550.00000  5.467873055651e-05
8550.00000  8600.00000  5.387463157774e-05
8600.00000  8650.00000  6.191562136546e-05
8650.00000  8700.00000  5.387463157774e-05
8700.00000  8750.00000  5.467873055651e-05
8750.00000  8800.00000  5.146233464142e-05
8800.00000  8850.00000  4.502954281124e-05
8850.00000  8900.00000  4.824593872633e-05
8900.00000  8950.00000  5.226643362019e-05
8950.00000  9000.00000  5.307053259897e-05
9000.00000  9050.00000  5.869922545037e-05
9050.00000  9100.00000  5.548282953528e-05
9100.00000  9150.00000  5.467873055651e-05
9150.00000  9200.00000  4.181314689616e-05
9200.00000  9250.00000  5.387463157774e-05
9250.00000  9300.00000  5.387463157774e-05
9300.00000  9350.00000  3.859675098107e-05
9350.00000  9400.00000  3.698855302352e-05
9400.00000  9450.00000  4.663774076879e-05
9450.00000  9500.00000  4.663774076879e-05
9500.00000  9550.00000  3.377215710843e-05
9550.00000  9600.00000  4.261724587493e-05
9600.00000  9650.00000  4.422544383247e-05
9650.00000  9700.00000  4.100904791738e-05
9700.00000  9750.00000  4.261724587493e-05
9750.00000  9800.00000  4.261724587493e-05
9800.00000  9850.00000  3.940084995984e-05
9850.00000  9900.00000  3.377215710843e-05
9900.00000  9950.00000  4.583364179002e-05
9950.00000  10000.00000  4.181314689616e-05
