10001.00000  11001.00000  4.528432185964e-04
11001.00000  12001.00000  3.595721041245e-04
12001.00000  13001.00000  2.901369411287e-04
13001.00000  14001.00000  2.365658394833e-04
14001.00000  15001.00000  1.964273726999e-04
15001.00000  16001.00000  1.637824826347e-04
16001.00000  17001.00000  1.379136991764e-04
17001.00000  18001.00000  1.150742339660e-04
18001.00000  19001.00000  9.817382689930e-05
19001.00000  20001.00000  8.450203533354e-05
20001.00000  21001.00000  7.445745377502e-05
21001.00000  22001.00000  6.341638595078e-05
22001.00000  23001.00000  5.624168483756e-05
23001.00000  24001.00000  4.787120020546e-05
24001.00000  25001.00000  4.348666063627e-05
25001.00000  26001.00000  3.910212106708e-05
26001.00000  27001.00000  3.575392721424e-05
27001.00000  28001.00000  3.061205808309e-05
28001.00000  29001.00000  2.618765906327e-05
29001.00000  30001.00000  2.519117279755e-05
30001.00000  31001.00000  2.124508718527e-05
31001.00000  32001.00000  2.136466553716e-05
32001.00000  33001.00000  1.773745552992e-05
33001.00000  34001.00000  1.662139091230e-05
34001.00000  35001.00000  1.375151046701e-05
35001.00000  36001.00000  1.331305651010e-05
36001.00000  37001.00000  1.231657024437e-05
37001.00000  38001.00000  1.175853793556e-05
38001.00000  39001.00000  1.048303551543e-05
39001.00000  40001.00000  9.446689799080e-06
40001.00000  41001.00000  7.971890125806e-06
41001.00000  42001.00000  7.692873971402e-06
42001.00000  43001.00000  7.493576718257e-06
43001.00000  44001.00000  6.855825508193e-06
44001.00000  45001.00000  7.055122761338e-06
45001.00000  46001.00000  5.739760890580e-06
46001.00000  47001.00000  6.218074298128e-06
47001.00000  48001.00000  4.623696272967e-06
48001.00000  49001.00000  4.424399019822e-06
49001.00000  50001.00000  4.543977371709e-06
50001.00000  51001.00000  4.623696272967e-06
51001.00000  52001.00000  3.946085612274e-06
52001.00000  53001.00000  4.185242316048e-06
53001.00000  54001.00000  3.587350556613e-06
54001.00000  55001.00000  2.949599346548e-06
55001.00000  56001.00000  2.830020994661e-06
56001.00000  57001.00000  2.551004840258e-06
57001.00000  58001.00000  2.431426488371e-06
58001.00000  59001.00000  2.192269784597e-06
59001.00000  60001.00000  1.913253630193e-06
60001.00000  61001.00000  2.192269784597e-06
61001.00000  62001.00000  2.152410333968e-06
62001.00000  63001.00000  1.674096926419e-06
63001.00000  64001.00000  1.634237475790e-06
64001.00000  65001.00000  1.753815827677e-06
65001.00000  66001.00000  1.275502420129e-06
66001.00000  67001.00000  1.195783518871e-06
67001.00000  68001.00000  1.195783518871e-06
68001.00000  69001.00000  1.036345716355e-06
69001.00000  70001.00000  1.395080772016e-06
70001.00000  71001.00000  8.769079138386e-07
71001.00000  72001.00000  8.370484632096e-07
72001.00000  73001.00000  1.315361870758e-06
73001.00000  74001.00000  6.776106606935e-07
74001.00000  75001.00000  8.769079138386e-07
75001.00000  76001.00000  5.580323088064e-07
76001.00000  77001.00000  7.174701113225e-07
77001.00000  78001.00000  5.181728581774e-07
78001.00000  79001.00000  8.769079138386e-07
79001.00000  80001.00000  4.384539569193e-07
80001.00000  81001.00000  5.580323088064e-07
81001.00000  82001.00000  3.985945062903e-07
82001.00000  83001.00000  4.783134075483e-07
83001.00000  84001.00000  2.391567037742e-07
84001.00000  85001.00000  4.384539569193e-07
85001.00000  86001.00000  2.790161544032e-07
86001.00000  87001.00000  5.580323088064e-07
87001.00000  88001.00000  3.188756050322e-07
88001.00000  89001.00000  4.384539569193e-07
89001.00000  90001.00000  4.783134075483e-07
90001.00000  91001.00000  2.790161544032e-07
91001.00000  92001.00000  2.790161544032e-07
92001.00000  93001.00000  1.594378025161e-07
93001.00000  94001.00000  2.790161544032e-07
94001.00000  95001.00000  3.985945062903e-07
95001.00000  96001.00000  3.587350556613e-07
96001.00000  97001.00000  1.992972531451e-07
97001.00000  98001.00000  1.195783518871e-07
98001.00000  99001.00000  1.992972531451e-07
99001.00000  100001.00000  2.391567037742e-07
100001.00000  101001.00000  3.188756050322e-07
101001.00000  102001.00000  3.985945062903e-08
102001.00000  103001.00000  1.594378025161e-07
103001.00000  104001.00000  2.790161544032e-07
104001.00000  105001.00000  1.195783518871e-07
105001.00000  106001.00000  1.594378025161e-07
106001.00000  107001.00000  2.391567037742e-07
107001.00000  108001.00000  2.790161544032e-07
108001.00000  109001.00000  1.992972531451e-07
109001.00000  110001.00000  7.971890125806e-08
110001.00000  111001.00000  7.971890125806e-08
111001.00000  112001.00000  1.195783518871e-07
112001.00000  113001.00000  2.391567037742e-07
113001.00000  114001.00000  1.594378025161e-07
114001.00000  115001.00000  1.195783518871e-07
115001.00000  116001.00000  1.195783518871e-07
116001.00000  117001.00000  7.971890125806e-08
117001.00000  118001.00000  0.000000000000e+00
118001.00000  119001.00000  7.971890125806e-08
119001.00000  120001.00000  7.971890125806e-08
120001.00000  121001.00000  1.195783518871e-07
121001.00000  122001.00000  1.594378025161e-07
122001.00000  123001.00000  0.000000000000e+00
123001.00000  124001.00000  0.000000000000e+00
124001.00000  125001.00000  3.985945062903e-08
125001.00000  126001.00000  7.971890125806e-08
126001.00000  127001.00000  1.195783518871e-07
127001.00000  128001.00000  3.985945062903e-08
128001.00000  129001.00000  3.985945062903e-08
129001.00000  130001.00000  0.000000000000e+00
130001.00000  131001.00000  3.985945062903e-08
131001.00000  132001.00000  3.985945062903e-08
132001.00000  133001.00000  7.971890125806e-08
133001.00000  134001.00000  1.594378025161e-07
134001.00000  135001.00000  7.971890125806e-08
135001.00000  136001.00000  0.000000000000e+00
136001.00000  137001.00000  7.971890125806e-08
137001.00000  138001.00000  3.985945062903e-08
138001.00000  139001.00000  3.985945062903e-08
139001.00000  140001.00000  0.000000000000e+00
140001.00000  141001.00000  0.000000000000e+00
141001.00000  142001.00000  0.000000000000e+00
142001.00000  143001.00000  3.985945062903e-08
143001.00000  144001.00000  0.000000000000e+00
144001.00000  145001.00000  3.985945062903e-08
145001.00000  146001.00000  1.594378025161e-07
146001.00000  147001.00000  0.000000000000e+00
147001.00000  148001.00000  0.000000000000e+00
148001.00000  149001.00000  0.000000000000e+00
149001.00000  150001.00000  0.000000000000e+00
150001.00000  151001.00000  0.000000000000e+00
151001.00000  152001.00000  3.985945062903e-08
152001.00000  153001.00000  0.000000000000e+00
153001.00000  154001.00000  3.985945062903e-08
154001.00000  155001.00000  0.000000000000e+00
155001.00000  156001.00000  3.985945062903e-08
156001.00000  157001.00000  3.985945062903e-08
157001.00000  158001.00000  3.985945062903e-08
158001.00000  159001.00000  0.000000000000e+00
159001.00000  160001.00000  0.000000000000e+00
160001.00000  161001.00000  0.000000000000e+00
161001.00000  162001.00000  0.000000000000e+00
162001.00000  163001.00000  3.985945062903e-08
163001.00000  164001.00000  0.000000000000e+00
164001.00000  165001.00000  0.000000000000e+00
165001.00000  166001.00000  3.985945062903e-08
166001.00000  167001.00000  0.000000000000e+00
167001.00000  168001.00000  0.000000000000e+00
168001.00000  169001.00000  0.000000000000e+00
169001.00000  170001.00000  3.985945062903e-08
170001.00000  171001.00000  3.985945062903e-08
171001.00000  172001.00000  3.985945062903e-08
172001.00000  173001.00000  0.000000000000e+00
173001.00000  174001.00000  3.985945062903e-08
174001.00000  175001.00000  3.985945062903e-08
175001.00000  176001.00000  3.985945062903e-08
176001.00000  177001.00000  3.985945062903e-08
177001.00000  178001.00000  0.000000000000e+00
178001.00000  179001.00000  0.000000000000e+00
179001.00000  180001.00000  0.000000000000e+00
180001.00000  181001.00000  0.000000000000e+00
181001.00000  182001.00000  0.000000000000e+00
182001.00000  183001.00000  0.000000000000e+00
183001.00000  184001.00000  0.000000000000e+00
184001.00000  185001.00000  0.000000000000e+00
185001.00000  186001.00000  0.000000000000e+00
186001.00000  187001.00000  0.000000000000e+00
187001.00000  188001.00000  0.000000000000e+00
188001.00000  189001.00000  0.000000000000e+00
189001.00000  190001.00000  0.000000000000e+00
190001.00000  191001.00000  0.000000000000e+00
191001.00000  192001.00000  0.000000000000e+00
192001.00000  193001.00000  3.985945062903e-08
193001.00000  194001.00000  0.000000000000e+00
194001.00000  195001.00000  0.000000000000e+00
195001.00000  196001.00000  0.000000000000e+00
196001.00000  197001.00000  0.000000000000e+00
197001.00000  198001.00000  3.985945062903e-08
198001.00000  199001.00000  0.000000000000e+00
