300.00000  350.00000  1.665422697848e-05
350.00000  400.00000  1.805880033812e-05
400.00000  450.00000  1.163789355123e-05
450.00000  500.00000  1.304246691086e-05
500.00000  550.00000  9.230053506148e-05
550.00000  600.00000  1.023332019160e-05
600.00000  650.00000  3.250584060861e-05
650.00000  700.00000  1.163789355123e-05
700.00000  750.00000  2.407840045082e-05
750.00000  800.00000  1.384508025922e-05
800.00000  850.00000  5.979469445287e-05
850.00000  900.00000  1.003266685451e-05
900.00000  950.00000  1.364442692213e-05
950.00000  1000.00000  1.223985356250e-05
1000.00000  1050.00000  1.846010701230e-05
1050.00000  1100.00000  1.645357364139e-05
1100.00000  1150.00000  1.264116023668e-05
1150.00000  1200.00000  1.484834694467e-05
1200.00000  1250.00000  1.705553365267e-05
1250.00000  1300.00000  5.638358772234e-05
1300.00000  1350.00000  1.565096029303e-05
1350.00000  1400.00000  1.886141368648e-05
1400.00000  1450.00000  2.126925373156e-05
1450.00000  1500.00000  2.347644043955e-05
1500.00000  1550.00000  2.046664038320e-05
1550.00000  1600.00000  2.187121374283e-05
1600.00000  1650.00000  1.926272036066e-05
1650.00000  1700.00000  2.207186707992e-05
1700.00000  1750.00000  9.330380174693e-05
1750.00000  1800.00000  1.966402703484e-05
1800.00000  1850.00000  2.989734722644e-05
1850.00000  1900.00000  2.447970712500e-05
1900.00000  1950.00000  2.267382709119e-05
1950.00000  2000.00000  2.347644043955e-05
2000.00000  2050.00000  2.849277386681e-05
2050.00000  2100.00000  2.829212052972e-05
2100.00000  2150.00000  3.029865390062e-05
2150.00000  2200.00000  3.350910729406e-05
2200.00000  2250.00000  2.869342720390e-05
2250.00000  2300.00000  3.069996057480e-05
2300.00000  2350.00000  1.205926555912e-04
2350.00000  2400.00000  3.411106730533e-05
2400.00000  2450.00000  3.290714728279e-05
2450.00000  2500.00000  3.832478738422e-05
2500.00000  2550.00000  3.411106730533e-05
2550.00000  2600.00000  3.391041396824e-05
2600.00000  2650.00000  3.451237397951e-05
2650.00000  2700.00000  3.932805406968e-05
2700.00000  2750.00000  3.671956068750e-05
2750.00000  2800.00000  3.230518727152e-05
2800.00000  2850.00000  3.792348071004e-05
2850.00000  2900.00000  3.551564066496e-05
2900.00000  2950.00000  4.193654745185e-05
2950.00000  3000.00000  6.641625457685e-05
3000.00000  3050.00000  4.233785412603e-05
3050.00000  3100.00000  4.153524077767e-05
3100.00000  3150.00000  3.892674739549e-05
3150.00000  3200.00000  3.852544072131e-05
3200.00000  3250.00000  4.494634750820e-05
3250.00000  3300.00000  4.113393410349e-05
3300.00000  3350.00000  4.534765418238e-05
3350.00000  3400.00000  4.334112081148e-05
3400.00000  3450.00000  4.715353421619e-05
3450.00000  3500.00000  4.594961419365e-05
3500.00000  3550.00000  4.314046747439e-05
3550.00000  3600.00000  4.675222754201e-05
3600.00000  3650.00000  4.314046747439e-05
3650.00000  3700.00000  7.725153477972e-05
3700.00000  3750.00000  4.855810757582e-05
3750.00000  3800.00000  5.036398760963e-05
3800.00000  3850.00000  5.417640101435e-05
3850.00000  3900.00000  4.916006758709e-05
3900.00000  3950.00000  5.056464094673e-05
3950.00000  4000.00000  4.875876091291e-05
4000.00000  4050.00000  5.417640101435e-05
4050.00000  4100.00000  5.477836102562e-05
4100.00000  4150.00000  5.437705435144e-05
4150.00000  4200.00000  4.695288087910e-05
4200.00000  4250.00000  5.196921430636e-05
4250.00000  4300.00000  6.019600112705e-05
4300.00000  4350.00000  5.558097437398e-05
4350.00000  4400.00000  5.638358772234e-05
4400.00000  4450.00000  5.738685440779e-05
4450.00000  4500.00000  5.417640101435e-05
4500.00000  4550.00000  5.899208110451e-05
4550.00000  4600.00000  6.019600112705e-05
4600.00000  4650.00000  6.280449450923e-05
4650.00000  4700.00000  6.160057448668e-05
4700.00000  4750.00000  5.477836102562e-05
4750.00000  4800.00000  6.019600112705e-05
4800.00000  4850.00000  5.056464094673e-05
4850.00000  4900.00000  6.059730780123e-05
4900.00000  4950.00000  5.939338777869e-05
4950.00000  5000.00000  5.678489439652e-05
5000.00000  5050.00000  6.160057448668e-05
5050.00000  5100.00000  6.320580118341e-05
5100.00000  5150.00000  6.420906786886e-05
5150.00000  5200.00000  6.561364122849e-05
5200.00000  5250.00000  5.658424105943e-05
5250.00000  5300.00000  6.240318783505e-05
5300.00000  5350.00000  6.942605463320e-05
5350.00000  5400.00000  6.440972120595e-05
5400.00000  5450.00000  6.982736130738e-05
5450.00000  5500.00000  5.718620107070e-05
5500.00000  5550.00000  6.139992114959e-05
5550.00000  5600.00000  6.320580118341e-05
5600.00000  5650.00000  6.420906786886e-05
5650.00000  5700.00000  6.260384117214e-05
5700.00000  5750.00000  6.721886792521e-05
5750.00000  5800.00000  6.340645452050e-05
5800.00000  5850.00000  6.340645452050e-05
5850.00000  5900.00000  6.802148127357e-05
5900.00000  5950.00000  6.280449450923e-05
5950.00000  6000.00000  6.561364122849e-05
6000.00000  6050.00000  6.641625457685e-05
6050.00000  6100.00000  5.859077443033e-05
6100.00000  6150.00000  6.380776119468e-05
6150.00000  6200.00000  6.741952126230e-05
6200.00000  6250.00000  7.042932131865e-05
6250.00000  6300.00000  9.009334835349e-05
6300.00000  6350.00000  8.768550830841e-05
6350.00000  6400.00000  8.355204956435e-04
6400.00000  6450.00000  6.782082793648e-05
6450.00000  6500.00000  6.922540129611e-05
6500.00000  6550.00000  5.939338777869e-05
6550.00000  6600.00000  6.581429456558e-05
6600.00000  6650.00000  6.180122782378e-05
6650.00000  6700.00000  5.899208110451e-05
6700.00000  6750.00000  5.919273444160e-05
6750.00000  6800.00000  6.601494790267e-05
6800.00000  6850.00000  6.280449450923e-05
6850.00000  6900.00000  6.922540129611e-05
6900.00000  6950.00000  6.200188116087e-05
6950.00000  7000.00000  5.839012109324e-05
7000.00000  7050.00000  6.802148127357e-05
7050.00000  7100.00000  1.502893494805e-04
7100.00000  7150.00000  4.574896085656e-05
7150.00000  7200.00000  4.173589411476e-05
7200.00000  7250.00000  4.293981413730e-05
7250.00000  7300.00000  4.374242748566e-05
7300.00000  7350.00000  3.752217403586e-05
7350.00000  7400.00000  3.772282737295e-05
7400.00000  7450.00000  4.093328076640e-05
7450.00000  7500.00000  6.982736130738e-05
7500.00000  7550.00000  4.434438749693e-05
7550.00000  7600.00000  4.293981413730e-05
7600.00000  7650.00000  3.892674739549e-05
7650.00000  7700.00000  4.293981413730e-05
7700.00000  7750.00000  3.671956068750e-05
7750.00000  7800.00000  4.414373415984e-05
7800.00000  7850.00000  4.314046747439e-05
7850.00000  7900.00000  3.591694733914e-05
7900.00000  7950.00000  4.615026753074e-05
7950.00000  8000.00000  4.253850746312e-05
8000.00000  8050.00000  3.551564066496e-05
8050.00000  8100.00000  3.952870740677e-05
8100.00000  8150.00000  4.013066741804e-05
8150.00000  8200.00000  3.792348071004e-05
8200.00000  8250.00000  4.033132075513e-05
8250.00000  8300.00000  4.113393410349e-05
8300.00000  8350.00000  3.451237397951e-05
8350.00000  8400.00000  3.812413404713e-05
8400.00000  8450.00000  3.752217403586e-05
8450.00000  8500.00000  3.872609405840e-05
8500.00000  8550.00000  3.431172064242e-05
8550.00000  8600.00000  3.651890735041e-05
8600.00000  8650.00000  3.571629400205e-05
8650.00000  8700.00000  3.491368065369e-05
8700.00000  8750.00000  3.872609405840e-05
8750.00000  8800.00000  4.293981413730e-05
8800.00000  8850.00000  3.270649394570e-05
8850.00000  8900.00000  3.290714728279e-05
8900.00000  8950.00000  3.551564066496e-05
8950.00000  9000.00000  3.792348071004e-05
9000.00000  9050.00000  4.013066741804e-05
9050.00000  9100.00000  4.354177414857e-05
9100.00000  9150.00000  3.491368065369e-05
9150.00000  9200.00000  3.270649394570e-05
9200.00000  9250.00000  3.350910729406e-05
9250.00000  9300.00000  3.591694733914e-05
9300.00000  9350.00000  4.013066741804e-05
9350.00000  9400.00000  3.350910729406e-05
9400.00000  9450.00000  3.872609405840e-05
9450.00000  9500.00000  3.932805406968e-05
9500.00000  9550.00000  3.692021402459e-05
9550.00000  9600.00000  3.832478738422e-05
9600.00000  9650.00000  3.591694733914e-05
9650.00000  9700.00000  3.471302731660e-05
9700.00000  9750.00000  3.009800056353e-05
9750.00000  9800.00000  3.892674739549e-05
9800.00000  9850.00000  3.671956068750e-05
9850.00000  9900.00000  3.270649394570e-05
9900.00000  9950.00000  3.451237397951e-05
9950.00000  10000.00000  3.411106730533e-05
