300.00000  350.00000  0.000000000000e+00
350.00000  400.00000  0.000000000000e+00
400.00000  450.00000  0.000000000000e+00
450.00000  500.00000  0.000000000000e+00
500.00000  550.00000  4.458210844156e-06
550.00000  600.00000  0.000000000000e+00
600.00000  650.00000  1.486070281385e-06
650.00000  700.00000  7.430351406926e-07
700.00000  750.00000  0.000000000000e+00
750.00000  800.00000  0.000000000000e+00
800.00000  850.00000  8.173386547619e-06
850.00000  900.00000  1.486070281385e-06
900.00000  950.00000  7.430351406926e-07
950.00000  1000.00000  1.486070281385e-06
1000.00000  1050.00000  2.229105422078e-06
1050.00000  1100.00000  1.486070281385e-06
1100.00000  1150.00000  5.944281125541e-06
1150.00000  1200.00000  5.944281125541e-06
1200.00000  1250.00000  5.201245984848e-06
1250.00000  1300.00000  2.154801908009e-05
1300.00000  1350.00000  6.687316266234e-06
1350.00000  1400.00000  5.944281125541e-06
1400.00000  1450.00000  6.687316266234e-06
1450.00000  1500.00000  8.916421688312e-06
1500.00000  1550.00000  1.114552711039e-05
1550.00000  1600.00000  6.687316266234e-06
1600.00000  1650.00000  1.188856225108e-05
1650.00000  1700.00000  1.040249196970e-05
1700.00000  1750.00000  3.269354619048e-05
1750.00000  1800.00000  1.783284337662e-05
1800.00000  1850.00000  1.188856225108e-05
1850.00000  1900.00000  1.114552711039e-05
1900.00000  1950.00000  6.687316266234e-06
1950.00000  2000.00000  8.173386547619e-06
2000.00000  2050.00000  1.114552711039e-05
2050.00000  2100.00000  1.857587851732e-05
2100.00000  2150.00000  1.708980823593e-05
2150.00000  2200.00000  1.634677309524e-05
2200.00000  2250.00000  1.708980823593e-05
2250.00000  2300.00000  8.916421688312e-06
2300.00000  2350.00000  4.086693273809e-05
2350.00000  2400.00000  1.263159739177e-05
2400.00000  2450.00000  1.337463253247e-05
2450.00000  2500.00000  1.634677309524e-05
2500.00000  2550.00000  1.188856225108e-05
2550.00000  2600.00000  1.263159739177e-05
2600.00000  2650.00000  2.229105422078e-05
2650.00000  2700.00000  1.337463253247e-05
2700.00000  2750.00000  1.560373795455e-05
2750.00000  2800.00000  1.931891365801e-05
2800.00000  2850.00000  1.857587851732e-05
2850.00000  2900.00000  2.823533534632e-05
2900.00000  2950.00000  2.154801908009e-05
2950.00000  3000.00000  2.749230020563e-05
3000.00000  3050.00000  1.634677309524e-05
3050.00000  3100.00000  2.080498393939e-05
3100.00000  3150.00000  2.080498393939e-05
3150.00000  3200.00000  2.080498393939e-05
3200.00000  3250.00000  1.708980823593e-05
3250.00000  3300.00000  1.040249196970e-05
3300.00000  3350.00000  2.377712450216e-05
3350.00000  3400.00000  1.783284337662e-05
3400.00000  3450.00000  1.634677309524e-05
3450.00000  3500.00000  1.337463253247e-05
3500.00000  3550.00000  2.303408936147e-05
3550.00000  3600.00000  1.486070281385e-05
3600.00000  3650.00000  1.931891365801e-05
3650.00000  3700.00000  3.195051104978e-05
3700.00000  3750.00000  2.303408936147e-05
3750.00000  3800.00000  1.783284337662e-05
3800.00000  3850.00000  2.080498393939e-05
3850.00000  3900.00000  1.263159739177e-05
3900.00000  3950.00000  1.411766767316e-05
3950.00000  4000.00000  1.708980823593e-05
4000.00000  4050.00000  2.303408936147e-05
4050.00000  4100.00000  2.154801908009e-05
4100.00000  4150.00000  1.560373795455e-05
4150.00000  4200.00000  2.452015964286e-05
4200.00000  4250.00000  1.783284337662e-05
4250.00000  4300.00000  1.263159739177e-05
4300.00000  4350.00000  2.972140562771e-05
4350.00000  4400.00000  1.486070281385e-05
4400.00000  4450.00000  2.006194879870e-05
4450.00000  4500.00000  2.006194879870e-05
4500.00000  4550.00000  1.486070281385e-05
4550.00000  4600.00000  1.857587851732e-05
4600.00000  4650.00000  1.783284337662e-05
4650.00000  4700.00000  1.560373795455e-05
4700.00000  4750.00000  2.452015964286e-05
4750.00000  4800.00000  2.154801908009e-05
4800.00000  4850.00000  2.600622992424e-05
4850.00000  4900.00000  1.634677309524e-05
4900.00000  4950.00000  2.823533534632e-05
4950.00000  5000.00000  2.229105422078e-05
5000.00000  5050.00000  2.229105422078e-05
5050.00000  5100.00000  1.931891365801e-05
5100.00000  5150.00000  1.857587851732e-05
5150.00000  5200.00000  1.486070281385e-05
5200.00000  5250.00000  2.229105422078e-05
5250.00000  5300.00000  3.046444076840e-05
5300.00000  5350.00000  2.006194879870e-05
5350.00000  5400.00000  2.303408936147e-05
5400.00000  5450.00000  2.526319478355e-05
5450.00000  5500.00000  3.195051104978e-05
5500.00000  5550.00000  1.634677309524e-05
5550.00000  5600.00000  2.006194879870e-05
5600.00000  5650.00000  2.377712450216e-05
5650.00000  5700.00000  1.857587851732e-05
5700.00000  5750.00000  2.154801908009e-05
5750.00000  5800.00000  1.708980823593e-05
5800.00000  5850.00000  3.417961647186e-05
5850.00000  5900.00000  2.303408936147e-05
5900.00000  5950.00000  2.674926506493e-05
5950.00000  6000.00000  2.600622992424e-05
6000.00000  6050.00000  2.303408936147e-05
6050.00000  6100.00000  1.337463253247e-05
6100.00000  6150.00000  2.600622992424e-05
6150.00000  6200.00000  2.897837048701e-05
6200.00000  6250.00000  3.046444076840e-05
6250.00000  6300.00000  3.269354619048e-05
6300.00000  6350.00000  4.681121386364e-05
6350.00000  6400.00000  2.927558454329e-04
6400.00000  6450.00000  1.783284337662e-05
6450.00000  6500.00000  2.526319478355e-05
6500.00000  6550.00000  2.303408936147e-05
6550.00000  6600.00000  2.080498393939e-05
6600.00000  6650.00000  2.080498393939e-05
6650.00000  6700.00000  1.857587851732e-05
6700.00000  6750.00000  1.857587851732e-05
6750.00000  6800.00000  2.749230020563e-05
6800.00000  6850.00000  1.857587851732e-05
6850.00000  6900.00000  2.006194879870e-05
6900.00000  6950.00000  2.749230020563e-05
6950.00000  7000.00000  2.526319478355e-05
7000.00000  7050.00000  3.269354619048e-05
7050.00000  7100.00000  5.424156527056e-05
7100.00000  7150.00000  1.188856225108e-05
7150.00000  7200.00000  8.916421688312e-06
7200.00000  7250.00000  1.263159739177e-05
7250.00000  7300.00000  1.708980823593e-05
7300.00000  7350.00000  1.634677309524e-05
7350.00000  7400.00000  1.188856225108e-05
7400.00000  7450.00000  1.783284337662e-05
7450.00000  7500.00000  2.154801908009e-05
7500.00000  7550.00000  1.263159739177e-05
7550.00000  7600.00000  1.114552711039e-05
7600.00000  7650.00000  5.201245984848e-06
7650.00000  7700.00000  7.430351406926e-06
7700.00000  7750.00000  1.411766767316e-05
7750.00000  7800.00000  1.560373795455e-05
7800.00000  7850.00000  7.430351406926e-06
7850.00000  7900.00000  1.114552711039e-05
7900.00000  7950.00000  8.916421688312e-06
7950.00000  8000.00000  1.263159739177e-05
8000.00000  8050.00000  1.263159739177e-05
8050.00000  8100.00000  8.173386547619e-06
8100.00000  8150.00000  7.430351406926e-06
8150.00000  8200.00000  1.337463253247e-05
8200.00000  8250.00000  1.411766767316e-05
8250.00000  8300.00000  1.411766767316e-05
8300.00000  8350.00000  1.337463253247e-05
8350.00000  8400.00000  8.916421688312e-06
8400.00000  8450.00000  1.040249196970e-05
8450.00000  8500.00000  8.916421688312e-06
8500.00000  8550.00000  1.188856225108e-05
8550.00000  8600.00000  1.337463253247e-05
8600.00000  8650.00000  9.659456829004e-06
8650.00000  8700.00000  1.337463253247e-05
8700.00000  8750.00000  9.659456829004e-06
8750.00000  8800.00000  8.173386547619e-06
8800.00000  8850.00000  1.040249196970e-05
8850.00000  8900.00000  1.040249196970e-05
8900.00000  8950.00000  8.916421688312e-06
8950.00000  9000.00000  8.173386547619e-06
9000.00000  9050.00000  8.173386547619e-06
9050.00000  9100.00000  1.040249196970e-05
9100.00000  9150.00000  7.430351406926e-06
9150.00000  9200.00000  5.944281125541e-06
9200.00000  9250.00000  9.659456829004e-06
9250.00000  9300.00000  1.040249196970e-05
9300.00000  9350.00000  1.486070281385e-05
9350.00000  9400.00000  9.659456829004e-06
9400.00000  9450.00000  1.486070281385e-05
9450.00000  9500.00000  1.486070281385e-05
9500.00000  9550.00000  8.173386547619e-06
9550.00000  9600.00000  6.687316266234e-06
9600.00000  9650.00000  1.114552711039e-05
9650.00000  9700.00000  8.173386547619e-06
9700.00000  9750.00000  1.040249196970e-05
9750.00000  9800.00000  1.486070281385e-05
9800.00000  9850.00000  1.040249196970e-05
9850.00000  9900.00000  1.263159739177e-05
9900.00000  9950.00000  1.040249196970e-05
9950.00000  10000.00000  1.337463253247e-05
