300.00000  350.00000  1.929815196310e-07
350.00000  400.00000  3.859630392619e-06
400.00000  450.00000  3.280685833726e-06
450.00000  500.00000  3.898226696545e-05
500.00000  550.00000  1.406835278110e-04
550.00000  600.00000  5.866638196781e-05
600.00000  650.00000  1.891218892383e-04
650.00000  700.00000  3.788227230356e-04
700.00000  750.00000  5.499973309482e-04
750.00000  800.00000  8.248030149027e-04
800.00000  850.00000  1.223888797500e-03
850.00000  900.00000  1.267309639416e-03
900.00000  950.00000  1.391589738059e-03
950.00000  1000.00000  1.641307824461e-03
1000.00000  1050.00000  1.864973405714e-03
1050.00000  1100.00000  1.987323689160e-03
1100.00000  1150.00000  2.140551015747e-03
1150.00000  1200.00000  2.170849114329e-03
1200.00000  1250.00000  2.169112280652e-03
1250.00000  1300.00000  2.072621520836e-03
1300.00000  1350.00000  1.899324116208e-03
1350.00000  1400.00000  1.973236038227e-03
1400.00000  1450.00000  1.919780157289e-03
1450.00000  1500.00000  1.867482165469e-03
1500.00000  1550.00000  1.798587762961e-03
1550.00000  1600.00000  1.702868929224e-03
1600.00000  1650.00000  1.586694054406e-03
1650.00000  1700.00000  1.510466354151e-03
1700.00000  1750.00000  1.451799972184e-03
1750.00000  1800.00000  1.356274119966e-03
1800.00000  1850.00000  1.185485475093e-03
1850.00000  1900.00000  1.164643470973e-03
1900.00000  1950.00000  1.112152497633e-03
1950.00000  2000.00000  1.066222895961e-03
2000.00000  2050.00000  1.013924904141e-03
2050.00000  2100.00000  9.778373599701e-04
2100.00000  2150.00000  9.193639595219e-04
2150.00000  2200.00000  8.543291874062e-04
2200.00000  2250.00000  7.771365795539e-04
2250.00000  2300.00000  7.572594830319e-04
2300.00000  2350.00000  7.387332571473e-04
2350.00000  2400.00000  6.706107807176e-04
2400.00000  2450.00000  6.231373268884e-04
2450.00000  2500.00000  5.885936348744e-04
2500.00000  2550.00000  5.804884110499e-04
2550.00000  2600.00000  5.420850886434e-04
2600.00000  2650.00000  4.870853555485e-04
2650.00000  2700.00000  4.758924274099e-04
2700.00000  2750.00000  4.365241974052e-04
2750.00000  2800.00000  4.245593431881e-04
2800.00000  2850.00000  4.091208216176e-04
2850.00000  2900.00000  3.882788174975e-04
2900.00000  2950.00000  3.568228297976e-04
2950.00000  3000.00000  3.355948626382e-04
3000.00000  3050.00000  3.328931213634e-04
3050.00000  3100.00000  3.203493225874e-04
3100.00000  3150.00000  3.056827270954e-04
3150.00000  3200.00000  2.823319632201e-04
3200.00000  3250.00000  2.667004601300e-04
3250.00000  3300.00000  2.591741808644e-04
3300.00000  3350.00000  2.404549734602e-04
3350.00000  3400.00000  2.375602506657e-04
3400.00000  3450.00000  2.321567681160e-04
3450.00000  3500.00000  2.074551336033e-04
3500.00000  3550.00000  2.059112814462e-04
3550.00000  3600.00000  1.976130761021e-04
3600.00000  3650.00000  1.794728132568e-04
3650.00000  3700.00000  1.887359261991e-04
3700.00000  3750.00000  1.667360329611e-04
3750.00000  3800.00000  1.626834210489e-04
3800.00000  3850.00000  1.595957167348e-04
3850.00000  3900.00000  1.636483286471e-04
3900.00000  3950.00000  1.511045298710e-04
3950.00000  4000.00000  1.387537126147e-04
4000.00000  4050.00000  1.339291746239e-04
4050.00000  4100.00000  1.292976181527e-04
4100.00000  4150.00000  1.105784107485e-04
4150.00000  4200.00000  1.208064312890e-04
4200.00000  4250.00000  1.206134497693e-04
4250.00000  4300.00000  1.154029487393e-04
4300.00000  4350.00000  1.032451130026e-04
4350.00000  4400.00000  1.092275401111e-04
4400.00000  4450.00000  1.044030021203e-04
4450.00000  4500.00000  1.049819466792e-04
4500.00000  4550.00000  9.745566741363e-05
4550.00000  4600.00000  1.040170390811e-04
4600.00000  4650.00000  9.687672285474e-05
4650.00000  4700.00000  8.549081319651e-05
4700.00000  4750.00000  8.163118280389e-05
4750.00000  4800.00000  8.394696103947e-05
4800.00000  4850.00000  7.950838608795e-05
4850.00000  4900.00000  8.182416432353e-05
4900.00000  4950.00000  8.664870231430e-05
4950.00000  5000.00000  7.661366329349e-05
5000.00000  5050.00000  6.928036554751e-05
5050.00000  5100.00000  6.715756883157e-05
5100.00000  5150.00000  7.429788505792e-05
5150.00000  5200.00000  6.908738402788e-05
5200.00000  5250.00000  6.542073515489e-05
5250.00000  5300.00000  6.580669819416e-05
5300.00000  5350.00000  7.063123618493e-05
5350.00000  5400.00000  7.256105138124e-05
5400.00000  5450.00000  7.082421770456e-05
5450.00000  5500.00000  5.924532652670e-05
5500.00000  5550.00000  6.696458731194e-05
5550.00000  5600.00000  5.866638196781e-05
5600.00000  5650.00000  5.963128956597e-05
5650.00000  5700.00000  5.673656677150e-05
5700.00000  5750.00000  5.808743740892e-05
5750.00000  5800.00000  5.673656677150e-05
5800.00000  5850.00000  5.847340044818e-05
5850.00000  5900.00000  6.040321564449e-05
5900.00000  5950.00000  5.210501030036e-05
5950.00000  6000.00000  5.152606574147e-05
6000.00000  6050.00000  4.921028750589e-05
6050.00000  6100.00000  5.249097333962e-05
6100.00000  6150.00000  5.249097333962e-05
6150.00000  6200.00000  5.287693637888e-05
6200.00000  6250.00000  5.924532652670e-05
6250.00000  6300.00000  6.947334706714e-05
6300.00000  6350.00000  6.696458731194e-05
6350.00000  6400.00000  3.869279468601e-04
6400.00000  6450.00000  4.110506368139e-05
6450.00000  6500.00000  4.535065711327e-05
6500.00000  6550.00000  4.535065711327e-05
6550.00000  6600.00000  3.975419304398e-05
6600.00000  6650.00000  3.975419304398e-05
6650.00000  6700.00000  4.264891583844e-05
6700.00000  6750.00000  4.515767559364e-05
6750.00000  6800.00000  4.129804520102e-05
6800.00000  6850.00000  4.187698975992e-05
6850.00000  6900.00000  4.805239838811e-05
6900.00000  6950.00000  4.033313760287e-05
6950.00000  7000.00000  4.071910064213e-05
7000.00000  7050.00000  3.782437784767e-05
7050.00000  7100.00000  7.313999594013e-05
7100.00000  7150.00000  2.894722794464e-05
7150.00000  7200.00000  3.415772897468e-05
7200.00000  7250.00000  2.894722794464e-05
7250.00000  7300.00000  2.740337578760e-05
7300.00000  7350.00000  2.740337578760e-05
7350.00000  7400.00000  2.663144970907e-05
7400.00000  7450.00000  2.624548666981e-05
7450.00000  7500.00000  3.743841480841e-05
7500.00000  7550.00000  2.605250515018e-05
7550.00000  7600.00000  2.778933882686e-05
7600.00000  7650.00000  2.335076387535e-05
7650.00000  7700.00000  2.624548666981e-05
7700.00000  7750.00000  2.373672691461e-05
7750.00000  7800.00000  2.450865299313e-05
7800.00000  7850.00000  2.933319098391e-05
7850.00000  7900.00000  2.875424642501e-05
7900.00000  7950.00000  2.566654211092e-05
7950.00000  8000.00000  2.373672691461e-05
8000.00000  8050.00000  2.528057907166e-05
8050.00000  8100.00000  2.663144970907e-05
8100.00000  8150.00000  2.605250515018e-05
8150.00000  8200.00000  2.142094867904e-05
8200.00000  8250.00000  2.392970843424e-05
8250.00000  8300.00000  2.663144970907e-05
8300.00000  8350.00000  2.315778235571e-05
8350.00000  8400.00000  2.624548666981e-05
8400.00000  8450.00000  2.199989323793e-05
8450.00000  8500.00000  2.142094867904e-05
8500.00000  8550.00000  2.026305956125e-05
8550.00000  8600.00000  2.238585627719e-05
8600.00000  8650.00000  2.084200412014e-05
8650.00000  8700.00000  2.431567147350e-05
8700.00000  8750.00000  2.315778235571e-05
8750.00000  8800.00000  2.180691171830e-05
8800.00000  8850.00000  2.257883779682e-05
8850.00000  8900.00000  2.354374539498e-05
8900.00000  8950.00000  2.199989323793e-05
8950.00000  9000.00000  2.528057907166e-05
9000.00000  9050.00000  2.219287475756e-05
9050.00000  9100.00000  2.257883779682e-05
9100.00000  9150.00000  1.910517044346e-05
9150.00000  9200.00000  2.412268995387e-05
9200.00000  9250.00000  2.103498563977e-05
9250.00000  9300.00000  2.064902260051e-05
9300.00000  9350.00000  2.180691171830e-05
9350.00000  9400.00000  1.794728132568e-05
9400.00000  9450.00000  1.910517044346e-05
9450.00000  9500.00000  2.180691171830e-05
9500.00000  9550.00000  1.929815196310e-05
9550.00000  9600.00000  1.852622588457e-05
9600.00000  9650.00000  1.949113348273e-05
9650.00000  9700.00000  2.122796715941e-05
9700.00000  9750.00000  2.199989323793e-05
9750.00000  9800.00000  1.891218892383e-05
9800.00000  9850.00000  1.833324436494e-05
9850.00000  9900.00000  2.064902260051e-05
9900.00000  9950.00000  1.563150309011e-05
9950.00000  10000.00000  2.354374539498e-05
