10001.00000  11001.00000  6.778170053575e-04
11001.00000  12001.00000  5.755540321095e-04
12001.00000  13001.00000  4.914200878676e-04
13001.00000  14001.00000  4.236694885991e-04
14001.00000  15001.00000  3.664130588604e-04
15001.00000  16001.00000  3.237240613944e-04
16001.00000  17001.00000  2.806437899212e-04
17001.00000  18001.00000  2.557025801209e-04
18001.00000  19001.00000  2.235177848516e-04
19001.00000  20001.00000  2.041948684898e-04
20001.00000  21001.00000  1.828754514240e-04
21001.00000  22001.00000  1.640441357381e-04
22001.00000  23001.00000  1.515935961716e-04
23001.00000  24001.00000  1.380795939186e-04
24001.00000  25001.00000  1.247662450027e-04
25001.00000  26001.00000  1.154659628285e-04
26001.00000  27001.00000  1.062158439887e-04
27001.00000  28001.00000  9.593236046281e-05
28001.00000  29001.00000  8.879913432926e-05
29001.00000  30001.00000  8.121443818725e-05
30001.00000  31001.00000  7.564630808300e-05
31001.00000  32001.00000  7.095101999509e-05
32001.00000  33001.00000  6.405857786604e-05
33001.00000  34001.00000  5.858074176348e-05
34001.00000  35001.00000  5.602241171558e-05
35001.00000  36001.00000  5.449744635369e-05
36001.00000  37001.00000  4.995264826860e-05
37001.00000  38001.00000  4.475572683796e-05
38001.00000  39001.00000  4.289968346988e-05
39001.00000  40001.00000  3.955880540733e-05
40001.00000  41001.00000  3.716099802910e-05
41001.00000  42001.00000  3.530495466102e-05
42001.00000  43001.00000  3.265633061143e-05
43001.00000  44001.00000  3.133201858663e-05
44001.00000  45001.00000  2.908470121122e-05
45001.00000  46001.00000  2.808143452577e-05
46001.00000  47001.00000  2.650630582961e-05
47001.00000  48001.00000  2.381755111260e-05
48001.00000  49001.00000  2.224242241645e-05
49001.00000  50001.00000  2.041647704893e-05
50001.00000  51001.00000  2.066729372029e-05
51001.00000  52001.00000  1.898180568873e-05
52001.00000  53001.00000  1.800863700384e-05
53001.00000  54001.00000  1.744680765999e-05
54001.00000  55001.00000  1.556066629134e-05
55001.00000  56001.00000  1.624288763745e-05
56001.00000  57001.00000  1.451726893847e-05
57001.00000  58001.00000  1.405576626317e-05
58001.00000  59001.00000  1.217965756137e-05
59001.00000  60001.00000  1.259099690241e-05
60001.00000  61001.00000  1.128675021132e-05
61001.00000  62001.00000  1.117639087592e-05
62001.00000  63001.00000  1.069482286691e-05
63001.00000  64001.00000  1.003266685451e-05
64001.00000  65001.00000  9.651425514038e-06
65001.00000  66001.00000  9.390576175820e-06
66001.00000  67001.00000  8.507701492624e-06
67001.00000  68001.00000  8.467570825206e-06
68001.00000  69001.00000  7.735186144826e-06
69001.00000  70001.00000  7.233552802101e-06
70001.00000  71001.00000  7.584696142009e-06
71001.00000  72001.00000  6.912507462757e-06
72001.00000  73001.00000  6.380776119468e-06
73001.00000  74001.00000  6.290482117777e-06
74001.00000  75001.00000  6.109894114396e-06
75001.00000  76001.00000  5.477836102562e-06
76001.00000  77001.00000  5.447738101998e-06
77001.00000  78001.00000  4.875876091291e-06
78001.00000  79001.00000  5.196921430636e-06
79001.00000  80001.00000  5.166823430072e-06
80001.00000  81001.00000  4.113393410349e-06
81001.00000  82001.00000  4.494634750820e-06
82001.00000  83001.00000  3.932805406968e-06
83001.00000  84001.00000  4.143491410912e-06
84001.00000  85001.00000  3.852544072131e-06
85001.00000  86001.00000  3.501400732224e-06
86001.00000  87001.00000  3.511433399078e-06
87001.00000  88001.00000  3.140224725461e-06
88001.00000  89001.00000  3.501400732224e-06
89001.00000  90001.00000  3.160290059170e-06
90001.00000  91001.00000  2.899440720953e-06
91001.00000  92001.00000  2.548297381045e-06
92001.00000  93001.00000  2.498134046773e-06
93001.00000  94001.00000  2.528232047336e-06
94001.00000  95001.00000  2.558330047900e-06
95001.00000  96001.00000  2.327578710246e-06
96001.00000  97001.00000  2.106860039447e-06
97001.00000  98001.00000  2.096827372592e-06
98001.00000  99001.00000  2.096827372592e-06
99001.00000  100001.00000  1.665422697848e-06
100001.00000  101001.00000  1.986468037193e-06
101001.00000  102001.00000  1.876108701793e-06
102001.00000  103001.00000  1.725618698976e-06
103001.00000  104001.00000  1.835978034375e-06
104001.00000  105001.00000  1.665422697848e-06
105001.00000  106001.00000  1.675455364703e-06
106001.00000  107001.00000  1.565096029303e-06
107001.00000  108001.00000  1.514932695031e-06
108001.00000  109001.00000  1.334344691650e-06
109001.00000  110001.00000  1.193887355687e-06
110001.00000  111001.00000  1.234018023105e-06
111001.00000  112001.00000  1.324312024795e-06
112001.00000  113001.00000  1.274148690523e-06
113001.00000  114001.00000  1.274148690523e-06
114001.00000  115001.00000  1.183854688832e-06
115001.00000  116001.00000  1.003266685451e-06
116001.00000  117001.00000  9.731686848874e-07
117001.00000  118001.00000  9.531033511783e-07
118001.00000  119001.00000  8.628093494878e-07
119001.00000  120001.00000  9.731686848874e-07
120001.00000  121001.00000  9.129726837603e-07
121001.00000  122001.00000  6.721886792521e-07
122001.00000  123001.00000  8.126460152152e-07
123001.00000  124001.00000  8.226786820697e-07
124001.00000  125001.00000  7.925806815062e-07
125001.00000  126001.00000  8.226786820697e-07
126001.00000  127001.00000  5.116660095800e-07
127001.00000  128001.00000  7.223520135246e-07
128001.00000  129001.00000  5.818946775615e-07
129001.00000  130001.00000  5.919273444160e-07
130001.00000  131001.00000  5.417640101435e-07
131001.00000  132001.00000  5.919273444160e-07
132001.00000  133001.00000  5.718620107070e-07
133001.00000  134001.00000  4.916006758709e-07
134001.00000  135001.00000  4.715353421619e-07
135001.00000  136001.00000  4.615026753074e-07
136001.00000  137001.00000  4.314046747439e-07
137001.00000  138001.00000  4.916006758709e-07
138001.00000  139001.00000  4.213720078894e-07
139001.00000  140001.00000  3.411106730533e-07
140001.00000  141001.00000  3.009800056353e-07
141001.00000  142001.00000  3.210453393443e-07
142001.00000  143001.00000  3.310780061988e-07
143001.00000  144001.00000  3.812413404713e-07
144001.00000  145001.00000  4.213720078894e-07
145001.00000  146001.00000  3.009800056353e-07
146001.00000  147001.00000  3.712086736168e-07
147001.00000  148001.00000  2.307513376537e-07
148001.00000  149001.00000  3.110126724898e-07
149001.00000  150001.00000  3.110126724898e-07
150001.00000  151001.00000  2.508166713627e-07
151001.00000  152001.00000  3.310780061988e-07
152001.00000  153001.00000  3.712086736168e-07
153001.00000  154001.00000  1.805880033812e-07
154001.00000  155001.00000  2.909473387808e-07
155001.00000  156001.00000  1.805880033812e-07
156001.00000  157001.00000  1.805880033812e-07
157001.00000  158001.00000  2.106860039447e-07
158001.00000  159001.00000  1.103593353996e-07
159001.00000  160001.00000  1.404573359631e-07
160001.00000  161001.00000  1.805880033812e-07
161001.00000  162001.00000  2.508166713627e-07
162001.00000  163001.00000  2.006533370902e-07
163001.00000  164001.00000  1.404573359631e-07
164001.00000  165001.00000  1.504900028176e-07
165001.00000  166001.00000  2.006533370902e-07
166001.00000  167001.00000  1.605226696721e-07
167001.00000  168001.00000  1.805880033812e-07
168001.00000  169001.00000  1.404573359631e-07
169001.00000  170001.00000  1.504900028176e-07
170001.00000  171001.00000  1.605226696721e-07
171001.00000  172001.00000  1.404573359631e-07
172001.00000  173001.00000  1.304246691086e-07
173001.00000  174001.00000  1.404573359631e-07
174001.00000  175001.00000  9.029400169058e-08
175001.00000  176001.00000  1.805880033812e-07
176001.00000  177001.00000  1.103593353996e-07
177001.00000  178001.00000  8.026133483607e-08
178001.00000  179001.00000  1.203920022541e-07
179001.00000  180001.00000  8.026133483607e-08
180001.00000  181001.00000  6.019600112705e-08
181001.00000  182001.00000  1.103593353996e-07
182001.00000  183001.00000  8.026133483607e-08
183001.00000  184001.00000  6.019600112705e-08
184001.00000  185001.00000  1.003266685451e-07
185001.00000  186001.00000  5.016333427254e-08
186001.00000  187001.00000  4.013066741804e-08
187001.00000  188001.00000  7.022866798156e-08
188001.00000  189001.00000  5.016333427254e-08
189001.00000  190001.00000  9.029400169058e-08
190001.00000  191001.00000  9.029400169058e-08
191001.00000  192001.00000  7.022866798156e-08
192001.00000  193001.00000  4.013066741804e-08
193001.00000  194001.00000  9.029400169058e-08
194001.00000  195001.00000  5.016333427254e-08
195001.00000  196001.00000  4.013066741804e-08
196001.00000  197001.00000  9.029400169058e-08
197001.00000  198001.00000  6.019600112705e-08
198001.00000  199001.00000  6.019600112705e-08
