300.00000  350.00000  7.899796863094e-01
350.00000  400.00000  5.920596387858e-01
400.00000  450.00000  4.600873780172e-01
450.00000  500.00000  3.680337291786e-01
500.00000  550.00000  3.017875132335e-01
550.00000  600.00000  2.506613478535e-01
600.00000  650.00000  2.124088751351e-01
650.00000  700.00000  1.815682983012e-01
700.00000  750.00000  1.579696031467e-01
750.00000  800.00000  1.376709922359e-01
800.00000  850.00000  1.218296473617e-01
850.00000  900.00000  1.076859124136e-01
900.00000  950.00000  9.669937743038e-02
950.00000  1000.00000  8.671447932879e-02
1000.00000  1050.00000  7.869812868469e-02
1050.00000  1100.00000  7.172031162206e-02
1100.00000  1150.00000  6.543448854807e-02
1150.00000  1200.00000  5.986127820676e-02
1200.00000  1250.00000  5.491241790434e-02
1250.00000  1300.00000  5.087874045150e-02
1300.00000  1350.00000  4.694273073359e-02
1350.00000  1400.00000  4.352797733436e-02
1400.00000  1450.00000  4.058709331574e-02
1450.00000  1500.00000  3.757856534737e-02
1500.00000  1550.00000  3.542661958762e-02
1550.00000  1600.00000  3.321932877808e-02
1600.00000  1650.00000  3.102578379789e-02
1650.00000  1700.00000  2.936362364223e-02
1700.00000  1750.00000  2.768265340428e-02
1750.00000  1800.00000  2.606462459551e-02
1800.00000  1850.00000  2.457718116568e-02
1850.00000  1900.00000  2.332703415850e-02
1900.00000  1950.00000  2.194413137828e-02
1950.00000  2000.00000  2.107850586087e-02
2000.00000  2050.00000  2.000307557952e-02
2050.00000  2100.00000  1.903110075074e-02
2100.00000  2150.00000  1.816113444511e-02
2150.00000  2200.00000  1.743658454483e-02
2200.00000  2250.00000  1.660279147436e-02
2250.00000  2300.00000  1.576393415097e-02
2300.00000  2350.00000  1.532406761140e-02
2350.00000  2400.00000  1.459951771112e-02
2400.00000  2450.00000  1.399759507804e-02
2450.00000  2500.00000  1.340941827431e-02
2500.00000  2550.00000  1.281617721767e-02
2550.00000  2600.00000  1.227321695790e-02
2600.00000  2650.00000  1.184347892418e-02
2650.00000  2700.00000  1.158411682807e-02
2700.00000  2750.00000  1.099630175670e-02
2750.00000  2800.00000  1.066929571084e-02
2800.00000  2850.00000  1.021640680662e-02
2850.00000  2900.00000  9.838034766833e-03
2900.00000  2950.00000  9.632932523468e-03
2950.00000  3000.00000  9.239005992561e-03
3000.00000  3050.00000  8.943470661293e-03
3050.00000  3100.00000  8.632380838905e-03
3100.00000  3150.00000  8.468154351272e-03
3150.00000  3200.00000  8.133551926030e-03
3200.00000  3250.00000  7.881786209307e-03
3250.00000  3300.00000  7.565270401645e-03
3300.00000  3350.00000  7.397788322848e-03
3350.00000  3400.00000  7.186536629506e-03
3400.00000  3450.00000  6.981434386141e-03
3450.00000  3500.00000  6.744499695834e-03
3500.00000  3550.00000  6.583528799366e-03
3550.00000  3600.00000  6.340082926730e-03
3600.00000  3650.00000  6.252181965288e-03
3650.00000  3700.00000  6.093381462930e-03
3700.00000  3750.00000  5.912877019475e-03
3750.00000  3800.00000  5.727670055448e-03
3800.00000  3850.00000  5.550059470806e-03
3850.00000  3900.00000  5.479883394593e-03
3900.00000  3950.00000  5.266823039493e-03
3950.00000  4000.00000  5.141301913483e-03
4000.00000  4050.00000  5.083424737225e-03
4050.00000  4100.00000  4.927518093679e-03
4100.00000  4150.00000  4.716266400337e-03
4150.00000  4200.00000  4.698541515108e-03
4200.00000  4250.00000  4.582425430240e-03
4250.00000  4300.00000  4.462692021856e-03
4300.00000  4350.00000  4.290869154840e-03
4350.00000  4400.00000  4.265547890227e-03
4400.00000  4450.00000  4.161007240610e-03
4450.00000  4500.00000  4.031507058733e-03
4500.00000  4550.00000  4.003653667658e-03
4550.00000  4600.00000  3.870174429913e-03
4600.00000  4650.00000  3.857152065255e-03
4650.00000  4700.00000  3.775038821439e-03
4700.00000  4750.00000  3.623834698464e-03
4750.00000  4800.00000  3.619493910245e-03
4800.00000  4850.00000  3.468289787270e-03
4850.00000  4900.00000  3.450203169690e-03
4900.00000  4950.00000  3.343853858315e-03
4950.00000  5000.00000  3.290679202628e-03
5000.00000  5050.00000  3.195543594154e-03
5050.00000  5100.00000  3.102940112141e-03
5100.00000  5150.00000  3.086662156318e-03
5150.00000  5200.00000  3.091364676889e-03
5200.00000  5250.00000  3.048680259399e-03
5250.00000  5300.00000  2.943416145079e-03
5300.00000  5350.00000  2.949203862705e-03
5350.00000  5400.00000  2.874686998273e-03
5400.00000  5450.00000  2.781360051556e-03
5450.00000  5500.00000  2.752783195779e-03
5500.00000  5550.00000  2.625453408011e-03
5550.00000  5600.00000  2.600132143398e-03
5600.00000  5650.00000  2.549127881820e-03
5650.00000  5700.00000  2.517295434878e-03
5700.00000  5750.00000  2.438437782227e-03
5750.00000  5800.00000  2.441693373391e-03
5800.00000  5850.00000  2.371879029530e-03
5850.00000  5900.00000  2.327024217930e-03
5900.00000  5950.00000  2.312193191514e-03
5950.00000  6000.00000  2.250336959388e-03
6000.00000  6050.00000  2.300979488614e-03
6050.00000  6100.00000  2.236591130026e-03
6100.00000  6150.00000  2.184863403746e-03
6150.00000  6200.00000  2.174373165549e-03
6200.00000  6250.00000  2.132050480410e-03
6250.00000  6300.00000  2.123007171620e-03
6300.00000  6350.00000  2.093345118787e-03
6350.00000  6400.00000  2.542616699491e-03
6400.00000  6450.00000  1.949737375197e-03
6450.00000  6500.00000  1.913925872387e-03
6500.00000  6550.00000  1.904882563597e-03
6550.00000  6600.00000  1.911393745926e-03
6600.00000  6650.00000  1.872688384303e-03
6650.00000  6700.00000  1.879561298984e-03
6700.00000  6750.00000  1.776829311126e-03
6750.00000  6800.00000  1.790213408135e-03
6800.00000  6850.00000  1.739209146558e-03
6850.00000  6900.00000  1.738123949503e-03
6900.00000  6950.00000  1.703397643748e-03
6950.00000  7000.00000  1.707014967264e-03
7000.00000  7050.00000  1.644435270435e-03
7050.00000  7100.00000  1.652031649819e-03
7100.00000  7150.00000  1.594516205912e-03
7150.00000  7200.00000  1.544958873741e-03
7200.00000  7250.00000  1.529042650270e-03
7250.00000  7300.00000  1.528680917919e-03
7300.00000  7350.00000  1.479485318099e-03
7350.00000  7400.00000  1.481655712209e-03
7400.00000  7450.00000  1.456696179948e-03
7450.00000  7500.00000  1.462483897573e-03
7500.00000  7550.00000  1.406415383073e-03
7550.00000  7600.00000  1.352878995035e-03
7600.00000  7650.00000  1.386520103735e-03
7650.00000  7700.00000  1.336962771564e-03
7700.00000  7750.00000  1.397010341931e-03
7750.00000  7800.00000  1.368071753802e-03
7800.00000  7850.00000  1.325749068664e-03
7850.00000  7900.00000  1.309471112841e-03
7900.00000  7950.00000  1.275106539438e-03
7950.00000  8000.00000  1.273297877680e-03
8000.00000  8050.00000  1.227357869025e-03
8050.00000  8100.00000  1.220123221992e-03
8100.00000  8150.00000  1.192993295621e-03
8150.00000  8200.00000  1.213250307312e-03
8200.00000  8250.00000  1.141265569341e-03
8250.00000  8300.00000  1.202760069115e-03
8300.00000  8350.00000  1.174906678041e-03
8350.00000  8400.00000  1.184673451534e-03
8400.00000  8450.00000  1.122093754705e-03
8450.00000  8500.00000  1.111965248860e-03
8500.00000  8550.00000  1.097857687147e-03
8550.00000  8600.00000  1.085558787192e-03
8600.00000  8650.00000  1.075792013699e-03
8650.00000  8700.00000  1.061684451986e-03
8700.00000  8750.00000  1.029128540340e-03
8750.00000  8800.00000  1.056981931415e-03
8800.00000  8850.00000  1.011765387463e-03
8850.00000  8900.00000  9.864441228501e-04
8900.00000  8950.00000  1.010318458057e-03
8950.00000  9000.00000  9.998282198598e-04
9000.00000  9050.00000  9.661871111597e-04
9050.00000  9100.00000  9.354398612726e-04
9100.00000  9150.00000  9.777625464113e-04
9150.00000  9200.00000  9.314608054048e-04
9200.00000  9250.00000  9.441214377113e-04
9250.00000  9300.00000  9.578672670726e-04
9300.00000  9350.00000  9.318225377564e-04
9350.00000  9400.00000  9.220557642629e-04
9400.00000  9450.00000  9.325460024596e-04
9450.00000  9500.00000  8.837121349918e-04
9500.00000  9550.00000  8.989048937596e-04
9550.00000  9600.00000  8.685193762241e-04
9600.00000  9650.00000  8.703280379821e-04
9650.00000  9700.00000  8.442833086659e-04
9700.00000  9750.00000  8.366869292821e-04
9750.00000  9800.00000  8.395807880950e-04
9800.00000  9850.00000  8.131743264272e-04
9850.00000  9900.00000  8.620081938950e-04
9900.00000  9950.00000  8.507944909950e-04
9950.00000  10000.00000  7.737455001013e-04
