10001.00000  11001.00000  2.090384850260e-05
11001.00000  12001.00000  2.042063425150e-05
12001.00000  13001.00000  2.039164139643e-05
13001.00000  14001.00000  1.942521289423e-05
14001.00000  15001.00000  1.840079868190e-05
15001.00000  16001.00000  1.819784869644e-05
16001.00000  17001.00000  1.717343448411e-05
17001.00000  18001.00000  1.674820594314e-05
18001.00000  19001.00000  1.537587747001e-05
19001.00000  20001.00000  1.471870608852e-05
20001.00000  21001.00000  1.406153470702e-05
21001.00000  22001.00000  1.361697759601e-05
22001.00000  23001.00000  1.298879906958e-05
23001.00000  24001.00000  1.173244201672e-05
24001.00000  25001.00000  1.122989919557e-05
25001.00000  26001.00000  1.022481355328e-05
26001.00000  27001.00000  9.557977886764e-06
27001.00000  28001.00000  9.007113640510e-06
28001.00000  29001.00000  8.900806505268e-06
29001.00000  30001.00000  8.359606544035e-06
30001.00000  31001.00000  7.886056577957e-06
31001.00000  32001.00000  6.832649510558e-06
32001.00000  33001.00000  7.132242346241e-06
33001.00000  34001.00000  6.214135269150e-06
34001.00000  35001.00000  6.320442404392e-06
35001.00000  36001.00000  6.146485273996e-06
36001.00000  37001.00000  5.547299602632e-06
37001.00000  38001.00000  5.180056771795e-06
38001.00000  39001.00000  4.977106786333e-06
39001.00000  40001.00000  4.687178235673e-06
40001.00000  41001.00000  4.136313989419e-06
41001.00000  42001.00000  4.339263974881e-06
42001.00000  43001.00000  3.537128318054e-06
43001.00000  44001.00000  3.846385438758e-06
44001.00000  45001.00000  3.305185477526e-06
45001.00000  46001.00000  3.440485467834e-06
46001.00000  47001.00000  3.150556917174e-06
47001.00000  48001.00000  3.005592641844e-06
48001.00000  49001.00000  3.121564062108e-06
49001.00000  50001.00000  2.831635511448e-06
50001.00000  51001.00000  2.648014096030e-06
51001.00000  52001.00000  2.648014096030e-06
52001.00000  53001.00000  2.522378390744e-06
53001.00000  54001.00000  2.300099835237e-06
54001.00000  55001.00000  2.280771265193e-06
55001.00000  56001.00000  2.097149849775e-06
56001.00000  57001.00000  2.029499854621e-06
57001.00000  58001.00000  1.758899874005e-06
58001.00000  59001.00000  2.019835569599e-06
59001.00000  60001.00000  1.884535579291e-06
60001.00000  61001.00000  1.845878439203e-06
61001.00000  62001.00000  1.729907018939e-06
62001.00000  63001.00000  1.826549869159e-06
63001.00000  64001.00000  1.691249878851e-06
64001.00000  65001.00000  1.381992758147e-06
65001.00000  66001.00000  1.662257023785e-06
66001.00000  67001.00000  1.266021337883e-06
67001.00000  68001.00000  1.285349907927e-06
68001.00000  69001.00000  1.468971323345e-06
69001.00000  70001.00000  1.381992758147e-06
70001.00000  71001.00000  1.275685622905e-06
71001.00000  72001.00000  1.208035627751e-06
72001.00000  73001.00000  1.159714202641e-06
73001.00000  74001.00000  8.891142220246e-07
74001.00000  75001.00000  8.987785070466e-07
75001.00000  76001.00000  1.014749927311e-06
76001.00000  77001.00000  9.954213572666e-07
77001.00000  78001.00000  9.277713621126e-07
78001.00000  79001.00000  8.504570819365e-07
79001.00000  80001.00000  7.538142317165e-07
80001.00000  81001.00000  8.794499370026e-07
81001.00000  82001.00000  7.054928066065e-07
82001.00000  83001.00000  8.601213669586e-07
83001.00000  84001.00000  8.504570819365e-07
84001.00000  85001.00000  7.538142317165e-07
85001.00000  86001.00000  7.054928066065e-07
86001.00000  87001.00000  6.958285215844e-07
87001.00000  88001.00000  6.281785264304e-07
88001.00000  89001.00000  5.701928162984e-07
89001.00000  90001.00000  5.605285312764e-07
90001.00000  91001.00000  5.605285312764e-07
91001.00000  92001.00000  5.315356762103e-07
92001.00000  93001.00000  6.668356665184e-07
93001.00000  94001.00000  5.701928162984e-07
94001.00000  95001.00000  4.832142511003e-07
95001.00000  96001.00000  4.638856810563e-07
96001.00000  97001.00000  4.928785361223e-07
97001.00000  98001.00000  5.508642462544e-07
98001.00000  99001.00000  4.252285409683e-07
99001.00000  100001.00000  4.542213960343e-07
100001.00000  101001.00000  3.672428308362e-07
101001.00000  102001.00000  4.928785361223e-07
102001.00000  103001.00000  4.155642559463e-07
103001.00000  104001.00000  2.705999806162e-07
104001.00000  105001.00000  3.092571207042e-07
105001.00000  106001.00000  4.638856810563e-07
106001.00000  107001.00000  3.285856907482e-07
107001.00000  108001.00000  4.445571110123e-07
108001.00000  109001.00000  3.865714008802e-07
109001.00000  110001.00000  2.899285506602e-07
110001.00000  111001.00000  3.769071158582e-07
111001.00000  112001.00000  2.222785555061e-07
112001.00000  113001.00000  2.126142704841e-07
113001.00000  114001.00000  3.189214057262e-07
114001.00000  115001.00000  3.189214057262e-07
115001.00000  116001.00000  3.092571207042e-07
116001.00000  117001.00000  3.672428308362e-07
117001.00000  118001.00000  2.802642656382e-07
118001.00000  119001.00000  2.416071255502e-07
119001.00000  120001.00000  3.189214057262e-07
120001.00000  121001.00000  2.512714105722e-07
121001.00000  122001.00000  1.836214154181e-07
122001.00000  123001.00000  2.416071255502e-07
123001.00000  124001.00000  2.705999806162e-07
124001.00000  125001.00000  1.352999903081e-07
125001.00000  126001.00000  2.416071255502e-07
126001.00000  127001.00000  1.836214154181e-07
127001.00000  128001.00000  1.642928453741e-07
128001.00000  129001.00000  2.126142704841e-07
129001.00000  130001.00000  2.222785555061e-07
130001.00000  131001.00000  1.256357052861e-07
131001.00000  132001.00000  1.449642753301e-07
132001.00000  133001.00000  1.352999903081e-07
133001.00000  134001.00000  2.029499854621e-07
134001.00000  135001.00000  2.222785555061e-07
135001.00000  136001.00000  1.739571303961e-07
136001.00000  137001.00000  2.222785555061e-07
137001.00000  138001.00000  1.739571303961e-07
138001.00000  139001.00000  2.029499854621e-07
139001.00000  140001.00000  1.932857004401e-07
140001.00000  141001.00000  8.697856519806e-08
141001.00000  142001.00000  2.126142704841e-07
142001.00000  143001.00000  8.697856519806e-08
143001.00000  144001.00000  1.256357052861e-07
144001.00000  145001.00000  8.697856519806e-08
145001.00000  146001.00000  1.256357052861e-07
146001.00000  147001.00000  1.159714202641e-07
147001.00000  148001.00000  1.256357052861e-07
148001.00000  149001.00000  1.159714202641e-07
149001.00000  150001.00000  5.798571013204e-08
150001.00000  151001.00000  3.865714008802e-08
151001.00000  152001.00000  1.256357052861e-07
152001.00000  153001.00000  1.063071352421e-07
153001.00000  154001.00000  3.865714008802e-08
154001.00000  155001.00000  6.764999515404e-08
155001.00000  156001.00000  8.697856519806e-08
156001.00000  157001.00000  1.063071352421e-07
157001.00000  158001.00000  7.731428017605e-08
158001.00000  159001.00000  6.764999515404e-08
159001.00000  160001.00000  5.798571013204e-08
160001.00000  161001.00000  8.697856519806e-08
161001.00000  162001.00000  2.899285506602e-08
162001.00000  163001.00000  5.798571013204e-08
163001.00000  164001.00000  2.899285506602e-08
164001.00000  165001.00000  6.764999515404e-08
165001.00000  166001.00000  1.932857004401e-08
166001.00000  167001.00000  9.664285022006e-09
167001.00000  168001.00000  2.899285506602e-08
168001.00000  169001.00000  1.932857004401e-08
169001.00000  170001.00000  1.932857004401e-08
170001.00000  171001.00000  8.697856519806e-08
171001.00000  172001.00000  1.932857004401e-08
172001.00000  173001.00000  5.798571013204e-08
173001.00000  174001.00000  3.865714008802e-08
174001.00000  175001.00000  1.932857004401e-08
175001.00000  176001.00000  9.664285022006e-09
176001.00000  177001.00000  1.932857004401e-08
177001.00000  178001.00000  9.664285022006e-09
178001.00000  179001.00000  3.865714008802e-08
179001.00000  180001.00000  4.832142511003e-08
180001.00000  181001.00000  9.664285022006e-09
181001.00000  182001.00000  2.899285506602e-08
182001.00000  183001.00000  1.932857004401e-08
183001.00000  184001.00000  2.899285506602e-08
184001.00000  185001.00000  1.932857004401e-08
185001.00000  186001.00000  0.000000000000e+00
186001.00000  187001.00000  0.000000000000e+00
187001.00000  188001.00000  9.664285022006e-09
188001.00000  189001.00000  9.664285022006e-09
189001.00000  190001.00000  0.000000000000e+00
190001.00000  191001.00000  0.000000000000e+00
191001.00000  192001.00000  0.000000000000e+00
192001.00000  193001.00000  9.664285022006e-09
193001.00000  194001.00000  0.000000000000e+00
194001.00000  195001.00000  0.000000000000e+00
195001.00000  196001.00000  0.000000000000e+00
196001.00000  197001.00000  0.000000000000e+00
197001.00000  198001.00000  0.000000000000e+00
198001.00000  199001.00000  0.000000000000e+00
