10001.00000  11001.00000  2.561574006317e-04
11001.00000  12001.00000  2.201363229826e-04
12001.00000  13001.00000  1.912363650297e-04
13001.00000  14001.00000  1.689647491550e-04
14001.00000  15001.00000  1.506063673059e-04
15001.00000  16001.00000  1.352819496151e-04
16001.00000  17001.00000  1.197449611870e-04
17001.00000  18001.00000  1.101406287881e-04
18001.00000  19001.00000  9.877775665416e-05
19001.00000  20001.00000  8.904781427416e-05
20001.00000  21001.00000  8.371422123169e-05
21001.00000  22001.00000  7.659310153551e-05
22001.00000  23001.00000  6.968455257652e-05
23001.00000  24001.00000  6.491137329577e-05
24001.00000  25001.00000  5.918162569761e-05
25001.00000  26001.00000  5.542298857168e-05
26001.00000  27001.00000  5.222476520745e-05
27001.00000  28001.00000  4.861106267505e-05
28001.00000  29001.00000  4.673657526520e-05
29001.00000  30001.00000  4.349970267603e-05
30001.00000  31001.00000  4.079425692985e-05
31001.00000  32001.00000  3.899706796989e-05
32001.00000  33001.00000  3.658149141080e-05
33001.00000  34001.00000  3.387604566463e-05
34001.00000  35001.00000  3.260062124143e-05
35001.00000  36001.00000  3.137350834941e-05
36001.00000  37001.00000  2.941206018343e-05
37001.00000  38001.00000  2.816562267895e-05
38001.00000  39001.00000  2.679357519338e-05
39001.00000  40001.00000  2.659066676242e-05
40001.00000  41001.00000  2.406880483474e-05
41001.00000  42001.00000  2.167255288812e-05
42001.00000  43001.00000  2.179816286919e-05
43001.00000  44001.00000  2.078362071438e-05
44001.00000  45001.00000  2.055172536471e-05
45001.00000  46001.00000  1.906373020431e-05
46001.00000  47001.00000  1.788492884347e-05
47001.00000  48001.00000  1.785594192477e-05
48001.00000  49001.00000  1.756607273768e-05
49001.00000  50001.00000  1.626166139577e-05
50001.00000  51001.00000  1.507319772870e-05
51001.00000  52001.00000  1.491860082892e-05
52001.00000  53001.00000  1.405865557388e-05
53001.00000  54001.00000  1.430021322979e-05
54001.00000  55001.00000  1.283154268187e-05
55001.00000  56001.00000  1.253201118854e-05
56001.00000  57001.00000  1.296681496918e-05
57001.00000  58001.00000  1.168172823974e-05
58001.00000  59001.00000  1.176868899587e-05
59001.00000  60001.00000  1.108266525309e-05
60001.00000  61001.00000  1.069617300363e-05
61001.00000  62001.00000  1.068651069740e-05
62001.00000  63001.00000  1.001014926085e-05
63001.00000  64001.00000  1.008744771074e-05
64001.00000  65001.00000  9.642981623872e-06
65001.00000  66001.00000  9.179190924528e-06
66001.00000  67001.00000  8.609114856583e-06
67001.00000  68001.00000  8.377219506911e-06
68001.00000  69001.00000  8.551141019165e-06
69001.00000  70001.00000  8.415868731857e-06
70001.00000  71001.00000  8.212960300893e-06
71001.00000  72001.00000  7.285378902204e-06
72001.00000  73001.00000  7.594572701767e-06
73001.00000  74001.00000  7.546261170585e-06
74001.00000  75001.00000  7.285378902204e-06
75001.00000  76001.00000  7.063145858768e-06
76001.00000  77001.00000  6.666991303078e-06
77001.00000  78001.00000  6.493069790824e-06
78001.00000  79001.00000  6.029279091479e-06
79001.00000  80001.00000  6.270836747388e-06
80001.00000  81001.00000  6.019616785243e-06
81001.00000  82001.00000  5.710422985680e-06
82001.00000  83001.00000  5.546163779662e-06
83001.00000  84001.00000  5.584813004607e-06
84001.00000  85001.00000  5.285281511281e-06
85001.00000  86001.00000  5.352917654935e-06
86001.00000  87001.00000  5.063048467845e-06
87001.00000  88001.00000  4.985750017954e-06
88001.00000  89001.00000  4.715205443336e-06
89001.00000  90001.00000  4.657231605918e-06
90001.00000  91001.00000  4.724867749573e-06
91001.00000  92001.00000  4.724867749573e-06
92001.00000  93001.00000  3.961545556901e-06
93001.00000  94001.00000  4.444660868719e-06
94001.00000  95001.00000  4.338375500119e-06
95001.00000  96001.00000  4.290063968937e-06
96001.00000  97001.00000  3.652351757338e-06
97001.00000  98001.00000  4.154791681628e-06
98001.00000  99001.00000  3.806948657120e-06
99001.00000  100001.00000  3.980870169374e-06
100001.00000  101001.00000  3.806948657120e-06
101001.00000  102001.00000  3.333495651539e-06
102001.00000  103001.00000  3.633027144866e-06
103001.00000  104001.00000  3.217547976703e-06
104001.00000  105001.00000  3.111262608103e-06
105001.00000  106001.00000  3.323833345303e-06
106001.00000  107001.00000  3.275521814121e-06
107001.00000  108001.00000  3.207885670467e-06
108001.00000  109001.00000  3.111262608103e-06
109001.00000  110001.00000  3.033964158212e-06
110001.00000  111001.00000  2.947003402085e-06
111001.00000  112001.00000  2.715108052413e-06
112001.00000  113001.00000  2.463888090268e-06
113001.00000  114001.00000  2.889029564667e-06
114001.00000  115001.00000  2.937341095849e-06
115001.00000  116001.00000  2.531524233922e-06
116001.00000  117001.00000  2.492875008977e-06
117001.00000  118001.00000  2.608822683813e-06
118001.00000  119001.00000  2.579835765104e-06
119001.00000  120001.00000  2.386589640377e-06
120001.00000  121001.00000  2.212668128123e-06
121001.00000  122001.00000  2.425238865323e-06
122001.00000  123001.00000  2.512199621450e-06
123001.00000  124001.00000  2.116045065760e-06
124001.00000  125001.00000  1.777864347487e-06
125001.00000  126001.00000  2.145031984469e-06
126001.00000  127001.00000  1.942123553505e-06
127001.00000  128001.00000  2.058071228341e-06
128001.00000  129001.00000  2.000097390923e-06
129001.00000  130001.00000  2.174018903178e-06
130001.00000  131001.00000  1.961448165978e-06
131001.00000  132001.00000  1.719890510069e-06
132001.00000  133001.00000  1.777864347487e-06
133001.00000  134001.00000  2.096720453287e-06
134001.00000  135001.00000  1.758539735015e-06
135001.00000  136001.00000  1.855162797378e-06
136001.00000  137001.00000  1.710228203833e-06
137001.00000  138001.00000  1.468670547924e-06
138001.00000  139001.00000  1.487995160397e-06
139001.00000  140001.00000  1.681241285124e-06
140001.00000  141001.00000  1.681241285124e-06
141001.00000  142001.00000  1.681241285124e-06
142001.00000  143001.00000  1.545968997815e-06
143001.00000  144001.00000  1.671578978888e-06
144001.00000  145001.00000  1.536306691579e-06
145001.00000  146001.00000  1.352722873088e-06
146001.00000  147001.00000  1.565293610288e-06
147001.00000  148001.00000  1.352722873088e-06
148001.00000  149001.00000  1.401034404270e-06
149001.00000  150001.00000  1.333398260616e-06
150001.00000  151001.00000  1.430021322979e-06
151001.00000  152001.00000  1.198125973307e-06
152001.00000  153001.00000  1.149814442125e-06
153001.00000  154001.00000  1.265762116961e-06
154001.00000  155001.00000  1.198125973307e-06
155001.00000  156001.00000  1.111165217180e-06
156001.00000  157001.00000  1.062853685998e-06
157001.00000  158001.00000  1.227112892016e-06
158001.00000  159001.00000  1.062853685998e-06
159001.00000  160001.00000  1.014542154816e-06
160001.00000  161001.00000  1.014542154816e-06
161001.00000  162001.00000  1.246437504489e-06
162001.00000  163001.00000  1.198125973307e-06
163001.00000  164001.00000  1.178801360834e-06
164001.00000  165001.00000  1.004879848580e-06
165001.00000  166001.00000  1.207788279543e-06
166001.00000  167001.00000  1.053191379762e-06
167001.00000  168001.00000  1.149814442125e-06
168001.00000  169001.00000  8.985944799801e-07
169001.00000  170001.00000  8.309583363257e-07
170001.00000  171001.00000  9.952175423435e-07
171001.00000  172001.00000  1.140152135889e-06
172001.00000  173001.00000  1.043529073525e-06
173001.00000  174001.00000  9.662306236345e-07
174001.00000  175001.00000  9.565683173982e-07
175001.00000  176001.00000  8.889321737437e-07
176001.00000  177001.00000  8.406206425620e-07
177001.00000  178001.00000  8.792698675074e-07
178001.00000  179001.00000  6.956860490168e-07
179001.00000  180001.00000  7.536598864349e-07
180001.00000  181001.00000  7.343352739622e-07
181001.00000  182001.00000  7.633221926713e-07
182001.00000  183001.00000  8.985944799801e-07
183001.00000  184001.00000  7.246729677259e-07
184001.00000  185001.00000  7.246729677259e-07
185001.00000  186001.00000  7.633221926713e-07
186001.00000  187001.00000  6.763614365442e-07
187001.00000  188001.00000  7.729844989076e-07
188001.00000  189001.00000  6.183875991261e-07
189001.00000  190001.00000  6.377122115988e-07
190001.00000  191001.00000  7.053483552532e-07
191001.00000  192001.00000  6.473745178351e-07
192001.00000  193001.00000  7.150106614895e-07
193001.00000  194001.00000  7.246729677259e-07
194001.00000  195001.00000  6.183875991261e-07
195001.00000  196001.00000  5.700760679444e-07
196001.00000  197001.00000  6.666991303078e-07
197001.00000  198001.00000  5.024399242899e-07
198001.00000  199001.00000  6.377122115988e-07
