300.00000  350.00000  5.214531494727e-06
350.00000  400.00000  1.545046368808e-05
400.00000  450.00000  8.497755028444e-06
450.00000  500.00000  8.690885824545e-06
500.00000  550.00000  1.064150686516e-04
550.00000  600.00000  9.077147416747e-06
600.00000  650.00000  3.862615922020e-05
650.00000  700.00000  1.178097856216e-05
700.00000  750.00000  2.259630314382e-05
750.00000  800.00000  1.409854811537e-05
800.00000  850.00000  5.890489281080e-05
850.00000  900.00000  1.313289413487e-05
900.00000  950.00000  1.525733289198e-05
950.00000  1000.00000  1.178097856216e-05
1000.00000  1050.00000  1.506420209588e-05
1050.00000  1100.00000  1.409854811537e-05
1100.00000  1150.00000  1.680237926079e-05
1150.00000  1200.00000  1.776803324129e-05
1200.00000  1250.00000  1.776803324129e-05
1250.00000  1300.00000  5.465601529658e-05
1300.00000  1350.00000  1.911994881400e-05
1350.00000  1400.00000  1.699551005689e-05
1400.00000  1450.00000  1.989247199840e-05
1450.00000  1500.00000  2.414134951262e-05
1500.00000  1550.00000  2.105125677501e-05
1550.00000  1600.00000  2.336882632822e-05
1600.00000  1650.00000  2.298256473602e-05
1650.00000  1700.00000  2.530013428923e-05
1700.00000  1750.00000  7.821797242090e-05
1750.00000  1800.00000  2.394821871652e-05
1800.00000  1850.00000  2.221004155161e-05
1850.00000  1900.00000  2.510700349313e-05
1900.00000  1950.00000  2.587952667753e-05
1950.00000  2000.00000  3.032153498786e-05
2000.00000  2050.00000  3.225284294887e-05
2050.00000  2100.00000  3.012840419175e-05
2100.00000  2150.00000  2.916275021125e-05
2150.00000  2200.00000  2.877648861905e-05
2200.00000  2250.00000  3.437728170598e-05
2250.00000  2300.00000  3.379788931767e-05
2300.00000  2350.00000  1.062219378555e-04
2350.00000  2400.00000  3.283223533717e-05
2400.00000  2450.00000  3.148031976446e-05
2450.00000  2500.00000  3.379788931767e-05
2500.00000  2550.00000  3.688798205529e-05
2550.00000  2600.00000  3.457041250208e-05
2600.00000  2650.00000  4.152312116171e-05
2650.00000  2700.00000  3.379788931767e-05
2700.00000  2750.00000  3.630858966699e-05
2750.00000  2800.00000  3.688798205529e-05
2800.00000  2850.00000  3.920555160850e-05
2850.00000  2900.00000  4.075059797731e-05
2900.00000  2950.00000  3.688798205529e-05
2950.00000  3000.00000  6.991334818856e-05
3000.00000  3050.00000  3.785363603579e-05
3050.00000  3100.00000  4.171625195781e-05
3100.00000  3150.00000  4.094372877341e-05
3150.00000  3200.00000  4.712391424864e-05
3200.00000  3250.00000  4.017120558901e-05
3250.00000  3300.00000  3.804676683190e-05
3300.00000  3350.00000  3.862615922020e-05
3350.00000  3400.00000  4.190938275391e-05
3400.00000  3450.00000  4.190938275391e-05
3450.00000  3500.00000  4.055746718121e-05
3500.00000  3550.00000  4.384069071492e-05
3550.00000  3600.00000  4.538573708373e-05
3600.00000  3650.00000  4.770330663694e-05
3650.00000  3700.00000  8.323937311953e-05
3700.00000  3750.00000  4.886209141355e-05
3750.00000  3800.00000  4.615826026814e-05
3800.00000  3850.00000  4.770330663694e-05
3850.00000  3900.00000  4.982774539406e-05
3900.00000  3950.00000  5.021400698626e-05
3950.00000  4000.00000  5.311096892777e-05
4000.00000  4050.00000  5.542853848098e-05
4050.00000  4100.00000  5.214531494727e-05
4100.00000  4150.00000  5.214531494727e-05
4150.00000  4200.00000  5.446288450048e-05
4200.00000  4250.00000  5.060026857846e-05
4250.00000  4300.00000  5.291783813167e-05
4300.00000  4350.00000  5.349723051997e-05
4350.00000  4400.00000  5.195218415117e-05
4400.00000  4450.00000  5.639419246149e-05
4450.00000  4500.00000  5.851863121860e-05
4500.00000  4550.00000  5.446288450048e-05
4550.00000  4600.00000  5.929115440300e-05
4600.00000  4650.00000  6.083620077181e-05
4650.00000  4700.00000  6.025680838351e-05
4700.00000  4750.00000  5.600793086929e-05
4750.00000  4800.00000  5.484914609268e-05
4800.00000  4850.00000  5.098653017066e-05
4850.00000  4900.00000  6.276750873282e-05
4900.00000  4950.00000  6.238124714062e-05
4950.00000  5000.00000  6.083620077181e-05
5000.00000  5050.00000  5.832550042250e-05
5050.00000  5100.00000  6.064306997571e-05
5100.00000  5150.00000  6.199498554842e-05
5150.00000  5200.00000  5.562166927709e-05
5200.00000  5250.00000  6.585760147044e-05
5250.00000  5300.00000  6.469881669383e-05
5300.00000  5350.00000  6.334690112112e-05
5350.00000  5400.00000  5.755297723810e-05
5400.00000  5450.00000  8.323937311953e-05
5450.00000  5500.00000  6.663012465484e-05
5500.00000  5550.00000  6.682325545094e-05
5550.00000  5600.00000  7.049274057686e-05
5600.00000  5650.00000  5.851863121860e-05
5650.00000  5700.00000  6.392629350943e-05
5700.00000  5750.00000  5.948428519911e-05
5750.00000  5800.00000  5.987054679131e-05
5800.00000  5850.00000  6.334690112112e-05
5850.00000  5900.00000  6.547133987824e-05
5900.00000  5950.00000  6.585760147044e-05
5950.00000  6000.00000  6.836830181975e-05
6000.00000  6050.00000  5.871176201470e-05
6050.00000  6100.00000  6.469881669383e-05
6100.00000  6150.00000  7.802484162480e-05
6150.00000  6200.00000  7.783171082870e-05
6200.00000  6250.00000  8.961268939086e-05
6250.00000  6300.00000  1.317152029409e-04
6300.00000  6350.00000  1.338396416980e-04
6350.00000  6400.00000  1.070137741196e-03
6400.00000  6450.00000  6.180185475232e-05
6450.00000  6500.00000  6.102933156791e-05
6500.00000  6550.00000  5.735984644199e-05
6550.00000  6600.00000  6.508507828603e-05
6600.00000  6650.00000  6.044993917961e-05
6650.00000  6700.00000  6.508507828603e-05
6700.00000  6750.00000  6.489194748993e-05
6750.00000  6800.00000  6.836830181975e-05
6800.00000  6850.00000  6.566447067434e-05
6850.00000  6900.00000  6.952708659636e-05
6900.00000  6950.00000  6.875456341195e-05
6950.00000  7000.00000  6.682325545094e-05
7000.00000  7050.00000  6.411942430553e-05
7050.00000  7100.00000  1.840536486842e-04
7100.00000  7150.00000  4.268190593832e-05
7150.00000  7200.00000  3.997807479291e-05
7200.00000  7250.00000  4.036433638511e-05
7250.00000  7300.00000  3.978494399680e-05
7300.00000  7350.00000  4.075059797731e-05
7350.00000  7400.00000  3.843302842410e-05
7400.00000  7450.00000  4.422695230713e-05
7450.00000  7500.00000  7.860423401310e-05
7500.00000  7550.00000  4.248877514222e-05
7550.00000  7600.00000  3.804676683190e-05
7600.00000  7650.00000  3.630858966699e-05
7650.00000  7700.00000  3.746737444359e-05
7700.00000  7750.00000  4.635139106424e-05
7750.00000  7800.00000  3.978494399680e-05
7800.00000  7850.00000  4.268190593832e-05
7850.00000  7900.00000  4.287503673442e-05
7900.00000  7950.00000  4.306816753052e-05
7950.00000  8000.00000  4.229564434612e-05
8000.00000  8050.00000  4.596512947204e-05
8050.00000  8100.00000  3.688798205529e-05
8100.00000  8150.00000  3.901242081240e-05
8150.00000  8200.00000  3.669485125919e-05
8200.00000  8250.00000  4.248877514222e-05
8250.00000  8300.00000  4.132999036561e-05
8300.00000  8350.00000  3.959181320070e-05
8350.00000  8400.00000  3.823989762800e-05
8400.00000  8450.00000  3.978494399680e-05
8450.00000  8500.00000  4.577199867593e-05
8500.00000  8550.00000  3.766050523969e-05
8550.00000  8600.00000  4.113685956951e-05
8600.00000  8650.00000  3.939868240460e-05
8650.00000  8700.00000  4.094372877341e-05
8700.00000  8750.00000  3.321849692937e-05
8750.00000  8800.00000  4.113685956951e-05
8800.00000  8850.00000  3.920555160850e-05
8850.00000  8900.00000  3.785363603579e-05
8900.00000  8950.00000  3.727424364749e-05
8950.00000  9000.00000  3.708111285139e-05
9000.00000  9050.00000  4.442008310323e-05
9050.00000  9100.00000  3.746737444359e-05
9100.00000  9150.00000  3.746737444359e-05
9150.00000  9200.00000  3.766050523969e-05
9200.00000  9250.00000  3.823989762800e-05
9250.00000  9300.00000  3.650172046309e-05
9300.00000  9350.00000  3.862615922020e-05
9350.00000  9400.00000  4.132999036561e-05
9400.00000  9450.00000  4.094372877341e-05
9450.00000  9500.00000  3.997807479291e-05
9500.00000  9550.00000  3.727424364749e-05
9550.00000  9600.00000  3.862615922020e-05
9600.00000  9650.00000  3.978494399680e-05
9650.00000  9700.00000  3.978494399680e-05
9700.00000  9750.00000  3.321849692937e-05
9750.00000  9800.00000  3.746737444359e-05
9800.00000  9850.00000  3.360475852157e-05
9850.00000  9900.00000  3.881929001630e-05
9900.00000  9950.00000  3.997807479291e-05
9950.00000  10000.00000  3.901242081240e-05
