300.00000  350.00000  1.690598067390e-05
350.00000  400.00000  2.733733045142e-05
400.00000  450.00000  1.474777037511e-05
450.00000  500.00000  1.942389268917e-05
500.00000  550.00000  1.312911265101e-04
550.00000  600.00000  1.151045492691e-05
600.00000  650.00000  3.848808366187e-05
650.00000  700.00000  2.338061157029e-05
700.00000  750.00000  2.230150642089e-05
750.00000  800.00000  2.374031328676e-05
800.00000  850.00000  6.510601068035e-05
850.00000  900.00000  1.834478753977e-05
900.00000  950.00000  1.942389268917e-05
950.00000  1000.00000  2.122240127150e-05
1000.00000  1050.00000  1.942389268917e-05
1050.00000  1100.00000  1.978359440563e-05
1100.00000  1150.00000  1.618657724097e-05
1150.00000  1200.00000  1.546717380804e-05
1200.00000  1250.00000  1.798508582330e-05
1250.00000  1300.00000  5.035824030524e-05
1300.00000  1350.00000  2.338061157029e-05
1350.00000  1400.00000  2.445971671969e-05
1400.00000  1450.00000  2.445971671969e-05
1450.00000  1500.00000  2.733733045142e-05
1500.00000  1550.00000  1.978359440563e-05
1550.00000  1600.00000  2.194180470443e-05
1600.00000  1650.00000  2.733733045142e-05
1650.00000  1700.00000  1.906419097270e-05
1700.00000  1750.00000  6.654481754622e-05
1750.00000  1800.00000  2.374031328676e-05
1800.00000  1850.00000  2.733733045142e-05
1850.00000  1900.00000  2.086269955503e-05
1900.00000  1950.00000  1.906419097270e-05
1950.00000  2000.00000  2.445971671969e-05
2000.00000  2050.00000  2.230150642089e-05
2050.00000  2100.00000  2.553882186909e-05
2100.00000  2150.00000  2.589852358555e-05
2150.00000  2200.00000  2.158210298796e-05
2200.00000  2250.00000  2.589852358555e-05
2250.00000  2300.00000  2.985524246668e-05
2300.00000  2350.00000  7.086123814381e-05
2350.00000  2400.00000  2.481941843616e-05
2400.00000  2450.00000  2.661792701849e-05
2450.00000  2500.00000  2.733733045142e-05
2500.00000  2550.00000  2.589852358555e-05
2550.00000  2600.00000  2.338061157029e-05
2600.00000  2650.00000  2.949554075021e-05
2650.00000  2700.00000  2.625822530202e-05
2700.00000  2750.00000  2.625822530202e-05
2750.00000  2800.00000  2.374031328676e-05
2800.00000  2850.00000  2.410001500322e-05
2850.00000  2900.00000  2.266120813736e-05
2900.00000  2950.00000  2.302090985383e-05
2950.00000  3000.00000  4.172539911006e-05
3000.00000  3050.00000  3.057464589961e-05
3050.00000  3100.00000  2.661792701849e-05
3100.00000  3150.00000  2.517912015262e-05
3150.00000  3200.00000  2.481941843616e-05
3200.00000  3250.00000  2.266120813736e-05
3250.00000  3300.00000  2.445971671969e-05
3300.00000  3350.00000  3.309255791487e-05
3350.00000  3400.00000  3.453136478074e-05
3400.00000  3450.00000  2.733733045142e-05
3450.00000  3500.00000  3.381196134781e-05
3500.00000  3550.00000  2.985524246668e-05
3550.00000  3600.00000  2.949554075021e-05
3600.00000  3650.00000  3.165375104901e-05
3650.00000  3700.00000  4.208510082653e-05
3700.00000  3750.00000  2.517912015262e-05
3750.00000  3800.00000  3.417166306427e-05
3800.00000  3850.00000  2.877613731728e-05
3850.00000  3900.00000  2.877613731728e-05
3900.00000  3950.00000  2.589852358555e-05
3950.00000  4000.00000  3.273285619841e-05
4000.00000  4050.00000  3.273285619841e-05
4050.00000  4100.00000  2.625822530202e-05
4100.00000  4150.00000  3.021494418315e-05
4150.00000  4200.00000  2.589852358555e-05
4200.00000  4250.00000  3.201345276548e-05
4250.00000  4300.00000  3.129404933254e-05
4300.00000  4350.00000  2.589852358555e-05
4350.00000  4400.00000  3.057464589961e-05
4400.00000  4450.00000  2.661792701849e-05
4450.00000  4500.00000  2.374031328676e-05
4500.00000  4550.00000  3.525076821367e-05
4550.00000  4600.00000  2.733733045142e-05
4600.00000  4650.00000  2.733733045142e-05
4650.00000  4700.00000  3.273285619841e-05
4700.00000  4750.00000  3.525076821367e-05
4750.00000  4800.00000  3.057464589961e-05
4800.00000  4850.00000  3.129404933254e-05
4850.00000  4900.00000  3.525076821367e-05
4900.00000  4950.00000  3.165375104901e-05
4950.00000  5000.00000  3.417166306427e-05
5000.00000  5050.00000  3.489106649720e-05
5050.00000  5100.00000  3.057464589961e-05
5100.00000  5150.00000  3.093434761608e-05
5150.00000  5200.00000  3.740897851247e-05
5200.00000  5250.00000  3.273285619841e-05
5250.00000  5300.00000  3.165375104901e-05
5300.00000  5350.00000  3.309255791487e-05
5350.00000  5400.00000  3.417166306427e-05
5400.00000  5450.00000  4.280450425946e-05
5450.00000  5500.00000  3.668957507953e-05
5500.00000  5550.00000  3.848808366187e-05
5550.00000  5600.00000  4.460301284179e-05
5600.00000  5650.00000  3.848808366187e-05
5650.00000  5700.00000  3.812838194540e-05
5700.00000  5750.00000  3.884778537833e-05
5750.00000  5800.00000  4.028659224420e-05
5800.00000  5850.00000  4.028659224420e-05
5850.00000  5900.00000  4.208510082653e-05
5900.00000  5950.00000  3.453136478074e-05
5950.00000  6000.00000  4.028659224420e-05
6000.00000  6050.00000  3.992689052773e-05
6050.00000  6100.00000  4.280450425946e-05
6100.00000  6150.00000  5.503436261930e-05
6150.00000  6200.00000  5.719257291810e-05
6200.00000  6250.00000  7.373885187554e-05
6250.00000  6300.00000  1.025149891928e-04
6300.00000  6350.00000  1.007164806105e-04
6350.00000  6400.00000  7.722795852526e-04
6400.00000  6450.00000  4.280450425946e-05
6450.00000  6500.00000  4.424331112532e-05
6500.00000  6550.00000  4.640152142412e-05
6550.00000  6600.00000  3.992689052773e-05
6600.00000  6650.00000  3.992689052773e-05
6650.00000  6700.00000  4.712092485705e-05
6700.00000  6750.00000  4.676122314058e-05
6750.00000  6800.00000  4.604181970765e-05
6800.00000  6850.00000  4.963883687231e-05
6850.00000  6900.00000  4.963883687231e-05
6900.00000  6950.00000  4.963883687231e-05
6950.00000  7000.00000  4.891943343938e-05
7000.00000  7050.00000  4.388360940886e-05
7050.00000  7100.00000  1.125866372539e-04
7100.00000  7150.00000  2.517912015262e-05
7150.00000  7200.00000  1.978359440563e-05
7200.00000  7250.00000  2.374031328676e-05
7250.00000  7300.00000  2.481941843616e-05
7300.00000  7350.00000  1.942389268917e-05
7350.00000  7400.00000  2.697762873495e-05
7400.00000  7450.00000  3.237315448194e-05
7450.00000  7500.00000  5.035824030524e-05
7500.00000  7550.00000  2.374031328676e-05
7550.00000  7600.00000  2.553882186909e-05
7600.00000  7650.00000  1.942389268917e-05
7650.00000  7700.00000  2.553882186909e-05
7700.00000  7750.00000  2.553882186909e-05
7750.00000  7800.00000  2.374031328676e-05
7800.00000  7850.00000  2.302090985383e-05
7850.00000  7900.00000  2.302090985383e-05
7900.00000  7950.00000  2.338061157029e-05
7950.00000  8000.00000  2.374031328676e-05
8000.00000  8050.00000  2.589852358555e-05
8050.00000  8100.00000  2.410001500322e-05
8100.00000  8150.00000  2.589852358555e-05
8150.00000  8200.00000  2.805673388435e-05
8200.00000  8250.00000  1.906419097270e-05
8250.00000  8300.00000  2.625822530202e-05
8300.00000  8350.00000  2.589852358555e-05
8350.00000  8400.00000  2.589852358555e-05
8400.00000  8450.00000  2.266120813736e-05
8450.00000  8500.00000  2.410001500322e-05
8500.00000  8550.00000  2.374031328676e-05
8550.00000  8600.00000  2.517912015262e-05
8600.00000  8650.00000  2.661792701849e-05
8650.00000  8700.00000  2.374031328676e-05
8700.00000  8750.00000  2.913583903375e-05
8750.00000  8800.00000  2.374031328676e-05
8800.00000  8850.00000  2.553882186909e-05
8850.00000  8900.00000  2.194180470443e-05
8900.00000  8950.00000  2.589852358555e-05
8950.00000  9000.00000  2.625822530202e-05
9000.00000  9050.00000  2.338061157029e-05
9050.00000  9100.00000  2.769703216788e-05
9100.00000  9150.00000  2.589852358555e-05
9150.00000  9200.00000  2.086269955503e-05
9200.00000  9250.00000  2.913583903375e-05
9250.00000  9300.00000  2.517912015262e-05
9300.00000  9350.00000  2.517912015262e-05
9350.00000  9400.00000  2.949554075021e-05
9400.00000  9450.00000  2.661792701849e-05
9450.00000  9500.00000  2.949554075021e-05
9500.00000  9550.00000  2.230150642089e-05
9550.00000  9600.00000  2.877613731728e-05
9600.00000  9650.00000  3.273285619841e-05
9650.00000  9700.00000  3.237315448194e-05
9700.00000  9750.00000  2.553882186909e-05
9750.00000  9800.00000  3.129404933254e-05
9800.00000  9850.00000  3.201345276548e-05
9850.00000  9900.00000  2.481941843616e-05
9900.00000  9950.00000  2.697762873495e-05
9950.00000  10000.00000  2.517912015262e-05
