300.00000  350.00000  3.461033916490e-06
350.00000  400.00000  1.422869499001e-05
400.00000  450.00000  5.383830536762e-06
450.00000  500.00000  9.998542425416e-06
500.00000  550.00000  8.844864453252e-05
550.00000  600.00000  6.537508508926e-06
600.00000  650.00000  2.538091538759e-05
650.00000  700.00000  9.613983101361e-06
700.00000  750.00000  1.345957634191e-05
750.00000  800.00000  1.115222039758e-05
800.00000  850.00000  4.153240699788e-05
850.00000  900.00000  8.460305129198e-06
900.00000  950.00000  8.460305129198e-06
950.00000  1000.00000  8.844864453252e-06
1000.00000  1050.00000  7.306627157035e-06
1050.00000  1100.00000  7.691186481089e-06
1100.00000  1150.00000  8.844864453252e-06
1150.00000  1200.00000  6.152949184871e-06
1200.00000  1250.00000  1.961252552678e-05
1250.00000  1300.00000  3.960961037761e-05
1300.00000  1350.00000  2.076620349894e-05
1350.00000  1400.00000  3.191842389652e-05
1400.00000  1450.00000  7.729642413495e-05
1450.00000  1500.00000  1.115222039758e-04
1500.00000  1550.00000  1.461325431407e-04
1550.00000  1600.00000  2.088157129616e-04
1600.00000  1650.00000  2.749599166989e-04
1650.00000  1700.00000  3.818674087861e-04
1700.00000  1750.00000  5.322301044914e-04
1750.00000  1800.00000  5.314609858433e-04
1800.00000  1850.00000  6.237552236163e-04
1850.00000  1900.00000  6.268316982088e-04
1900.00000  1950.00000  7.752715972938e-04
1950.00000  2000.00000  8.456459535957e-04
2000.00000  2050.00000  9.598600728399e-04
2050.00000  2100.00000  1.104454378684e-03
2100.00000  2150.00000  1.192518463893e-03
2150.00000  2200.00000  1.265200176139e-03
2200.00000  2250.00000  1.340189244330e-03
2250.00000  2300.00000  1.424407736298e-03
2300.00000  2350.00000  1.630531533991e-03
2350.00000  2400.00000  1.542852008106e-03
2400.00000  2450.00000  1.583615296456e-03
2450.00000  2500.00000  1.560541737013e-03
2500.00000  2550.00000  1.453634244926e-03
2550.00000  2600.00000  1.453634244926e-03
2600.00000  2650.00000  1.490167380711e-03
2650.00000  2700.00000  1.490167380711e-03
2700.00000  2750.00000  1.481707075582e-03
2750.00000  2800.00000  1.495551211248e-03
2800.00000  2850.00000  1.491705618007e-03
2850.00000  2900.00000  1.510933584210e-03
2900.00000  2950.00000  1.501704160433e-03
2950.00000  3000.00000  1.527469635144e-03
3000.00000  3050.00000  1.454018804250e-03
3050.00000  3100.00000  1.438636431288e-03
3100.00000  3150.00000  1.470170295860e-03
3150.00000  3200.00000  1.349418668107e-03
3200.00000  3250.00000  1.291734769499e-03
3250.00000  3300.00000  1.327114227312e-03
3300.00000  3350.00000  1.283274464370e-03
3350.00000  3400.00000  1.230589836974e-03
3400.00000  3450.00000  1.209439074151e-03
3450.00000  3500.00000  1.197902294430e-03
3500.00000  3550.00000  1.145986785682e-03
3550.00000  3600.00000  1.163676514589e-03
3600.00000  3650.00000  1.116375717730e-03
3650.00000  3700.00000  1.080996259917e-03
3700.00000  3750.00000  1.018313090096e-03
3750.00000  3800.00000  1.019082208744e-03
3800.00000  3850.00000  9.848564289035e-04
3850.00000  3900.00000  9.383247506929e-04
3900.00000  3950.00000  9.214041404345e-04
3950.00000  4000.00000  8.875629199177e-04
4000.00000  4050.00000  8.664121570947e-04
4050.00000  4100.00000  8.533371400768e-04
4100.00000  4150.00000  8.187268009119e-04
4150.00000  4200.00000  8.260334280690e-04
4200.00000  4250.00000  7.645039362203e-04
4250.00000  4300.00000  7.406612581289e-04
4300.00000  4350.00000  7.268171224629e-04
4350.00000  4400.00000  6.841310374929e-04
4400.00000  4450.00000  6.749016137156e-04
4450.00000  4500.00000  6.425986304950e-04
4500.00000  4550.00000  6.245243422644e-04
4550.00000  4600.00000  5.941441556641e-04
4600.00000  4650.00000  6.006816641731e-04
4650.00000  4700.00000  5.729933928411e-04
4700.00000  4750.00000  5.456896808333e-04
4750.00000  4800.00000  5.391521723243e-04
4800.00000  4850.00000  5.264617146305e-04
4850.00000  4900.00000  4.876212229010e-04
4900.00000  4950.00000  4.976197653265e-04
4950.00000  5000.00000  4.714697312908e-04
5000.00000  5050.00000  4.772381211516e-04
5050.00000  5100.00000  4.660859007540e-04
5100.00000  5150.00000  4.476270531994e-04
5150.00000  5200.00000  4.337829175334e-04
5200.00000  5250.00000  4.114784767383e-04
5250.00000  5300.00000  4.068637648496e-04
5300.00000  5350.00000  3.987880190445e-04
5350.00000  5400.00000  3.545636967782e-04
5400.00000  5450.00000  3.722534256847e-04
5450.00000  5500.00000  3.522563408339e-04
5500.00000  5550.00000  3.668695951479e-04
5550.00000  5600.00000  3.403350017882e-04
5600.00000  5650.00000  3.387967644920e-04
5650.00000  5700.00000  3.168768830209e-04
5700.00000  5750.00000  3.003408320865e-04
5750.00000  5800.00000  3.099548151879e-04
5800.00000  5850.00000  2.934187642535e-04
5850.00000  5900.00000  2.814974252079e-04
5900.00000  5950.00000  2.826511031800e-04
5950.00000  6000.00000  2.580393064405e-04
6000.00000  6050.00000  2.730371200787e-04
6050.00000  6100.00000  2.664996115697e-04
6100.00000  6150.00000  2.515017979316e-04
6150.00000  6200.00000  2.468870860430e-04
6200.00000  6250.00000  2.330429503770e-04
6250.00000  6300.00000  2.399650182100e-04
6300.00000  6350.00000  2.222752893035e-04
6350.00000  6400.00000  6.383684779304e-04
6400.00000  6450.00000  2.122767468781e-04
6450.00000  6500.00000  2.007399671564e-04
6500.00000  6550.00000  2.011245264805e-04
6550.00000  6600.00000  1.995862891843e-04
6600.00000  6650.00000  1.822811196018e-04
6650.00000  6700.00000  1.988171705362e-04
6700.00000  6750.00000  1.853575941942e-04
6750.00000  6800.00000  1.680524246118e-04
6800.00000  6850.00000  1.738208144726e-04
6850.00000  6900.00000  1.622840347510e-04
6900.00000  6950.00000  1.722825771764e-04
6950.00000  7000.00000  1.472862211129e-04
7000.00000  7050.00000  1.415178312520e-04
7050.00000  7100.00000  2.168914587667e-04
7100.00000  7150.00000  1.392104753077e-04
7150.00000  7200.00000  1.372876786874e-04
7200.00000  7250.00000  1.357494413912e-04
7250.00000  7300.00000  1.219053057253e-04
7300.00000  7350.00000  1.199825091050e-04
7350.00000  7400.00000  1.288273735582e-04
7400.00000  7450.00000  1.280582549101e-04
7450.00000  7500.00000  1.326729667988e-04
7500.00000  7550.00000  1.199825091050e-04
7550.00000  7600.00000  1.169060345126e-04
7600.00000  7650.00000  1.130604412720e-04
7650.00000  7700.00000  1.080611700593e-04
7700.00000  7750.00000  9.844718695794e-05
7750.00000  7800.00000  1.026773395225e-04
7800.00000  7850.00000  1.069074920871e-04
7850.00000  7900.00000  1.061383734390e-04
7900.00000  7950.00000  1.003699835782e-04
7950.00000  8000.00000  1.015236615504e-04
8000.00000  8050.00000  9.690894966172e-05
8050.00000  8100.00000  8.691040723631e-05
8100.00000  8150.00000  9.190967844901e-05
8150.00000  8200.00000  8.729496656036e-05
8200.00000  8250.00000  9.498615304145e-05
8250.00000  8300.00000  9.152511912496e-05
8300.00000  8350.00000  7.614274616278e-05
8350.00000  8400.00000  8.383393264387e-05
8400.00000  8450.00000  7.921922075522e-05
8450.00000  8500.00000  6.922067832980e-05
8500.00000  8550.00000  7.114347495007e-05
8550.00000  8600.00000  8.921776318063e-05
8600.00000  8650.00000  7.268171224629e-05
8650.00000  8700.00000  7.229715292224e-05
8700.00000  8750.00000  7.268171224629e-05
8750.00000  8800.00000  7.960378007927e-05
8800.00000  8850.00000  6.922067832980e-05
8850.00000  8900.00000  6.537508508926e-05
8900.00000  8950.00000  6.614420373737e-05
8950.00000  9000.00000  6.114493252466e-05
9000.00000  9050.00000  5.883757658033e-05
9050.00000  9100.00000  6.306772914493e-05
9100.00000  9150.00000  6.460596644115e-05
9150.00000  9200.00000  6.422140711709e-05
9200.00000  9250.00000  6.998979697791e-05
9250.00000  9300.00000  6.306772914493e-05
9300.00000  9350.00000  5.960669522844e-05
9350.00000  9400.00000  5.922213590439e-05
9400.00000  9450.00000  5.230006807141e-05
9450.00000  9500.00000  5.306918671951e-05
9500.00000  9550.00000  5.460742401573e-05
9550.00000  9600.00000  5.806845793222e-05
9600.00000  9650.00000  5.460742401573e-05
9650.00000  9700.00000  5.306918671951e-05
9700.00000  9750.00000  3.768681375734e-05
9750.00000  9800.00000  4.499344091437e-05
9800.00000  9850.00000  4.691623753464e-05
9850.00000  9900.00000  4.537800023843e-05
9900.00000  9950.00000  4.845447483086e-05
9950.00000  10000.00000  5.153094942330e-05
