10001.00000  11001.00000  1.542116613385e-04
11001.00000  12001.00000  1.367927655996e-04
12001.00000  13001.00000  1.224947553473e-04
13001.00000  14001.00000  1.078338514337e-04
14001.00000  15001.00000  9.386244547644e-05
15001.00000  16001.00000  8.117931201655e-05
16001.00000  17001.00000  7.274203439301e-05
17001.00000  18001.00000  6.294390553988e-05
18001.00000  19001.00000  5.552273016778e-05
19001.00000  20001.00000  5.131316369754e-05
20001.00000  21001.00000  4.574274599770e-05
21001.00000  22001.00000  3.951911970765e-05
22001.00000  23001.00000  3.625307675661e-05
23001.00000  24001.00000  3.115442081636e-05
24001.00000  25001.00000  3.028347602942e-05
25001.00000  26001.00000  2.605576487612e-05
26001.00000  27001.00000  2.438645403447e-05
27001.00000  28001.00000  2.266270914364e-05
28001.00000  29001.00000  2.021317693036e-05
29001.00000  30001.00000  1.892490443300e-05
30001.00000  31001.00000  1.776364471708e-05
31001.00000  32001.00000  1.569515084808e-05
32001.00000  33001.00000  1.422543152011e-05
33001.00000  34001.00000  1.331819736704e-05
34001.00000  35001.00000  1.259241004459e-05
35001.00000  36001.00000  1.186662272213e-05
36001.00000  37001.00000  1.094124388600e-05
37001.00000  38001.00000  1.072350768927e-05
38001.00000  39001.00000  1.039690339416e-05
39001.00000  40001.00000  8.709447869455e-06
40001.00000  41001.00000  8.146962694553e-06
41001.00000  42001.00000  8.110673328430e-06
42001.00000  43001.00000  7.021992344748e-06
43001.00000  44001.00000  7.112715760055e-06
44001.00000  45001.00000  6.314349705355e-06
45001.00000  46001.00000  6.640954000460e-06
46001.00000  47001.00000  5.770009213514e-06
47001.00000  48001.00000  5.243813404735e-06
48001.00000  49001.00000  5.461549601471e-06
49001.00000  50001.00000  4.717617595955e-06
50001.00000  51001.00000  4.536170765341e-06
51001.00000  52001.00000  4.753906962078e-06
52001.00000  53001.00000  4.046264322684e-06
53001.00000  54001.00000  4.064409005746e-06
54001.00000  55001.00000  3.901106858193e-06
55001.00000  56001.00000  3.574502563089e-06
56001.00000  57001.00000  3.229753584923e-06
57001.00000  58001.00000  3.102740803493e-06
58001.00000  59001.00000  2.866859923696e-06
59001.00000  60001.00000  2.939438655941e-06
60001.00000  61001.00000  2.522110945530e-06
61001.00000  62001.00000  2.431387530223e-06
62001.00000  63001.00000  2.358808797977e-06
63001.00000  64001.00000  2.431387530223e-06
64001.00000  65001.00000  2.413242847162e-06
65001.00000  66001.00000  2.231796016548e-06
66001.00000  67001.00000  1.977770453689e-06
67001.00000  68001.00000  1.669310841646e-06
68001.00000  69001.00000  1.778178940014e-06
69001.00000  70001.00000  1.633021475523e-06
70001.00000  71001.00000  1.760034256952e-06
71001.00000  72001.00000  1.578587426339e-06
72001.00000  73001.00000  1.506008694093e-06
73001.00000  74001.00000  1.723744890830e-06
74001.00000  75001.00000  1.796323623075e-06
75001.00000  76001.00000  1.378995912664e-06
76001.00000  77001.00000  1.542298060216e-06
77001.00000  78001.00000  1.542298060216e-06
78001.00000  79001.00000  1.651166158584e-06
79001.00000  80001.00000  1.506008694093e-06
80001.00000  81001.00000  1.179404398989e-06
81001.00000  82001.00000  1.124970349805e-06
82001.00000  83001.00000  1.197549082050e-06
83001.00000  84001.00000  1.179404398989e-06
84001.00000  85001.00000  9.798128853137e-07
85001.00000  86001.00000  8.528001038842e-07
86001.00000  87001.00000  9.072341530683e-07
87001.00000  88001.00000  7.802213716387e-07
88001.00000  89001.00000  9.435235191910e-07
89001.00000  90001.00000  8.528001038842e-07
90001.00000  91001.00000  7.620766885773e-07
91001.00000  92001.00000  8.165107377614e-07
92001.00000  93001.00000  7.983660547001e-07
93001.00000  94001.00000  6.894979563319e-07
94001.00000  95001.00000  6.532085902091e-07
95001.00000  96001.00000  5.806298579637e-07
96001.00000  97001.00000  6.350639071478e-07
97001.00000  98001.00000  6.169192240864e-07
98001.00000  99001.00000  5.261958087796e-07
99001.00000  100001.00000  7.620766885773e-07
100001.00000  101001.00000  5.987745410250e-07
101001.00000  102001.00000  5.261958087796e-07
102001.00000  103001.00000  4.536170765341e-07
103001.00000  104001.00000  6.169192240864e-07
104001.00000  105001.00000  4.717617595955e-07
105001.00000  106001.00000  5.261958087796e-07
106001.00000  107001.00000  4.173277104114e-07
107001.00000  108001.00000  5.261958087796e-07
108001.00000  109001.00000  2.358808797977e-07
109001.00000  110001.00000  3.991830273500e-07
110001.00000  111001.00000  5.443404918410e-07
111001.00000  112001.00000  3.266042951046e-07
112001.00000  113001.00000  3.810383442887e-07
113001.00000  114001.00000  3.991830273500e-07
114001.00000  115001.00000  4.717617595955e-07
115001.00000  116001.00000  4.173277104114e-07
116001.00000  117001.00000  2.540255628591e-07
117001.00000  118001.00000  1.995915136750e-07
118001.00000  119001.00000  3.084596120432e-07
119001.00000  120001.00000  3.084596120432e-07
120001.00000  121001.00000  3.266042951046e-07
121001.00000  122001.00000  2.540255628591e-07
122001.00000  123001.00000  3.266042951046e-07
123001.00000  124001.00000  2.177361967364e-07
124001.00000  125001.00000  2.177361967364e-07
125001.00000  126001.00000  2.177361967364e-07
126001.00000  127001.00000  1.451574644909e-07
127001.00000  128001.00000  2.540255628591e-07
128001.00000  129001.00000  2.177361967364e-07
129001.00000  130001.00000  2.358808797977e-07
130001.00000  131001.00000  3.084596120432e-07
131001.00000  132001.00000  1.633021475523e-07
132001.00000  133001.00000  1.633021475523e-07
133001.00000  134001.00000  1.814468306137e-07
134001.00000  135001.00000  1.814468306137e-07
135001.00000  136001.00000  9.072341530683e-08
136001.00000  137001.00000  1.633021475523e-07
137001.00000  138001.00000  2.177361967364e-07
138001.00000  139001.00000  1.451574644909e-07
139001.00000  140001.00000  1.995915136750e-07
140001.00000  141001.00000  1.633021475523e-07
141001.00000  142001.00000  1.270127814296e-07
142001.00000  143001.00000  7.257873224546e-08
143001.00000  144001.00000  1.451574644909e-07
144001.00000  145001.00000  1.814468306137e-07
145001.00000  146001.00000  1.451574644909e-07
146001.00000  147001.00000  1.270127814296e-07
147001.00000  148001.00000  5.443404918410e-08
148001.00000  149001.00000  1.451574644909e-07
149001.00000  150001.00000  1.088680983682e-07
150001.00000  151001.00000  1.451574644909e-07
151001.00000  152001.00000  9.072341530683e-08
152001.00000  153001.00000  7.257873224546e-08
153001.00000  154001.00000  9.072341530683e-08
154001.00000  155001.00000  1.814468306137e-07
155001.00000  156001.00000  7.257873224546e-08
156001.00000  157001.00000  1.088680983682e-07
157001.00000  158001.00000  1.451574644909e-07
158001.00000  159001.00000  3.628936612273e-08
159001.00000  160001.00000  3.628936612273e-08
160001.00000  161001.00000  3.628936612273e-08
161001.00000  162001.00000  1.088680983682e-07
162001.00000  163001.00000  9.072341530683e-08
163001.00000  164001.00000  1.451574644909e-07
164001.00000  165001.00000  1.270127814296e-07
165001.00000  166001.00000  9.072341530683e-08
166001.00000  167001.00000  7.257873224546e-08
167001.00000  168001.00000  3.628936612273e-08
168001.00000  169001.00000  3.628936612273e-08
169001.00000  170001.00000  3.628936612273e-08
170001.00000  171001.00000  5.443404918410e-08
171001.00000  172001.00000  5.443404918410e-08
172001.00000  173001.00000  3.628936612273e-08
173001.00000  174001.00000  3.628936612273e-08
174001.00000  175001.00000  5.443404918410e-08
175001.00000  176001.00000  3.628936612273e-08
176001.00000  177001.00000  3.628936612273e-08
177001.00000  178001.00000  7.257873224546e-08
178001.00000  179001.00000  1.814468306137e-08
179001.00000  180001.00000  3.628936612273e-08
180001.00000  181001.00000  0.000000000000e+00
181001.00000  182001.00000  3.628936612273e-08
182001.00000  183001.00000  0.000000000000e+00
183001.00000  184001.00000  1.814468306137e-08
184001.00000  185001.00000  3.628936612273e-08
185001.00000  186001.00000  0.000000000000e+00
186001.00000  187001.00000  0.000000000000e+00
187001.00000  188001.00000  3.628936612273e-08
188001.00000  189001.00000  0.000000000000e+00
189001.00000  190001.00000  1.814468306137e-08
190001.00000  191001.00000  0.000000000000e+00
191001.00000  192001.00000  1.814468306137e-08
192001.00000  193001.00000  1.814468306137e-08
193001.00000  194001.00000  0.000000000000e+00
194001.00000  195001.00000  1.814468306137e-08
195001.00000  196001.00000  0.000000000000e+00
196001.00000  197001.00000  0.000000000000e+00
197001.00000  198001.00000  0.000000000000e+00
198001.00000  199001.00000  0.000000000000e+00
