300.00000  350.00000  0.000000000000e+00
350.00000  400.00000  7.725231844040e-07
400.00000  450.00000  0.000000000000e+00
450.00000  500.00000  9.656539805050e-07
500.00000  550.00000  1.487107129978e-05
550.00000  600.00000  5.793923883030e-07
600.00000  650.00000  4.828269902525e-06
650.00000  700.00000  5.793923883030e-07
700.00000  750.00000  4.828269902525e-06
750.00000  800.00000  2.124438757111e-06
800.00000  850.00000  1.989247199840e-05
850.00000  900.00000  1.545046368808e-06
900.00000  950.00000  1.158784776606e-06
950.00000  1000.00000  2.317569553212e-06
1000.00000  1050.00000  2.124438757111e-06
1050.00000  1100.00000  2.510700349313e-06
1100.00000  1150.00000  3.476354329818e-06
1150.00000  1200.00000  4.442008310323e-06
1200.00000  1250.00000  5.214531494727e-06
1250.00000  1300.00000  2.626578826973e-05
1300.00000  1350.00000  7.338970251838e-06
1350.00000  1400.00000  9.849670601151e-06
1400.00000  1450.00000  1.525733289198e-05
1450.00000  1500.00000  2.298256473602e-05
1500.00000  1550.00000  4.055746718121e-05
1550.00000  1600.00000  5.117966096676e-05
1600.00000  1650.00000  8.304624232343e-05
1650.00000  1700.00000  1.087326382049e-04
1700.00000  1750.00000  1.827017331115e-04
1750.00000  1800.00000  1.859849566453e-04
1800.00000  1850.00000  2.093537829735e-04
1850.00000  1900.00000  2.193965843707e-04
1900.00000  1950.00000  2.645891906584e-04
1950.00000  2000.00000  3.242666066536e-04
2000.00000  2050.00000  3.802745375229e-04
2050.00000  2100.00000  4.331923756545e-04
2100.00000  2150.00000  4.859170829901e-04
2150.00000  2200.00000  5.353585667919e-04
2200.00000  2250.00000  5.954222443794e-04
2250.00000  2300.00000  6.466019053461e-04
2300.00000  2350.00000  7.269443165241e-04
2350.00000  2400.00000  7.315794556306e-04
2400.00000  2450.00000  7.987889726737e-04
2450.00000  2500.00000  7.872011249076e-04
2500.00000  2550.00000  7.441329573771e-04
2550.00000  2600.00000  8.121149976047e-04
2600.00000  2650.00000  8.184883138760e-04
2650.00000  2700.00000  8.335525159719e-04
2700.00000  2750.00000  8.671572744934e-04
2750.00000  2800.00000  8.571144730962e-04
2800.00000  2850.00000  8.841527845503e-04
2850.00000  2900.00000  8.856978309191e-04
2900.00000  2950.00000  8.924574087827e-04
2950.00000  3000.00000  9.328217451678e-04
3000.00000  3050.00000  9.108048344123e-04
3050.00000  3100.00000  9.034658641604e-04
3100.00000  3150.00000  8.789382530556e-04
3150.00000  3200.00000  9.121567499850e-04
3200.00000  3250.00000  8.775863374829e-04
3250.00000  3300.00000  8.715992828038e-04
3300.00000  3350.00000  8.455266253301e-04
3350.00000  3400.00000  8.609770890182e-04
3400.00000  3450.00000  8.478441948833e-04
3450.00000  3500.00000  8.306555540304e-04
3500.00000  3550.00000  8.405052246315e-04
3550.00000  3600.00000  8.146256979540e-04
3600.00000  3650.00000  8.028447193918e-04
3650.00000  3700.00000  7.987889726737e-04
3700.00000  3750.00000  7.555276743471e-04
3750.00000  3800.00000  7.273305781163e-04
3800.00000  3850.00000  7.163221227386e-04
3850.00000  3900.00000  7.213435234372e-04
3900.00000  3950.00000  7.101419372633e-04
3950.00000  4000.00000  6.977815663129e-04
4000.00000  4050.00000  6.904425960610e-04
4050.00000  4100.00000  6.724814320236e-04
4100.00000  4150.00000  6.311514416580e-04
4150.00000  4200.00000  6.344346651918e-04
4200.00000  4250.00000  5.946497211950e-04
4250.00000  4300.00000  6.135765392128e-04
4300.00000  4350.00000  5.911733668651e-04
4350.00000  4400.00000  5.863450969626e-04
4400.00000  4450.00000  5.631694014305e-04
4450.00000  4500.00000  5.637487938188e-04
4500.00000  4550.00000  5.525472076449e-04
4550.00000  4600.00000  5.204874954922e-04
4600.00000  4650.00000  5.231913266376e-04
4650.00000  4700.00000  5.204874954922e-04
4700.00000  4750.00000  5.141141792208e-04
4750.00000  4800.00000  4.986637155328e-04
4800.00000  4850.00000  4.772261971655e-04
4850.00000  4900.00000  4.579131175554e-04
4900.00000  4950.00000  4.681490497488e-04
4950.00000  5000.00000  4.596512947204e-04
5000.00000  5050.00000  4.530848476529e-04
5050.00000  5100.00000  4.308748061013e-04
5100.00000  5150.00000  4.241152282378e-04
5150.00000  5200.00000  4.142655576366e-04
5200.00000  5250.00000  4.233427050534e-04
5250.00000  5300.00000  4.127205112678e-04
5300.00000  5350.00000  3.980425707641e-04
5350.00000  5400.00000  3.881929001630e-04
5400.00000  5450.00000  3.995876171329e-04
5450.00000  5500.00000  3.719699132905e-04
5500.00000  5550.00000  3.796951451345e-04
5550.00000  5600.00000  3.607683271167e-04
5600.00000  5650.00000  3.758325292125e-04
5650.00000  5700.00000  3.470560405935e-04
5700.00000  5750.00000  3.611545887089e-04
5750.00000  5800.00000  3.453178634286e-04
5800.00000  5850.00000  3.285154841678e-04
5850.00000  5900.00000  3.418415090988e-04
5900.00000  5950.00000  3.194383367510e-04
5950.00000  6000.00000  3.196314675471e-04
6000.00000  6050.00000  3.333437540703e-04
6050.00000  6100.00000  3.182795519744e-04
6100.00000  6150.00000  3.180864211783e-04
6150.00000  6200.00000  2.941382024618e-04
6200.00000  6250.00000  3.246528682458e-04
6250.00000  6300.00000  3.955318704148e-04
6300.00000  6350.00000  3.626996350777e-04
6350.00000  6400.00000  1.677534094933e-03
6400.00000  6450.00000  2.732800764829e-04
6450.00000  6500.00000  2.790740003659e-04
6500.00000  6550.00000  2.622716211051e-04
6550.00000  6600.00000  2.605334439402e-04
6600.00000  6650.00000  2.518425581157e-04
6650.00000  6700.00000  2.597609207558e-04
6700.00000  6750.00000  2.506837733391e-04
6750.00000  6800.00000  2.514562965235e-04
6800.00000  6850.00000  2.516494273196e-04
6850.00000  6900.00000  2.568639588143e-04
6900.00000  6950.00000  2.489455961742e-04
6950.00000  7000.00000  2.439241954756e-04
7000.00000  7050.00000  2.369714868159e-04
7050.00000  7100.00000  3.702317361256e-04
7100.00000  7150.00000  1.747833704714e-04
7150.00000  7200.00000  1.703413621611e-04
7200.00000  7250.00000  1.672512694235e-04
7250.00000  7300.00000  1.742039780831e-04
7300.00000  7350.00000  1.635817842975e-04
7350.00000  7400.00000  1.713070161416e-04
7400.00000  7450.00000  1.614573455404e-04
7450.00000  7500.00000  2.176584072058e-04
7500.00000  7550.00000  1.548908984730e-04
7550.00000  7600.00000  1.539252444925e-04
7600.00000  7650.00000  1.566290756379e-04
7650.00000  7700.00000  1.512214133471e-04
7700.00000  7750.00000  1.541183752886e-04
7750.00000  7800.00000  1.630023919092e-04
7800.00000  7850.00000  1.467794050368e-04
7850.00000  7900.00000  1.433030507069e-04
7900.00000  7950.00000  1.419511351342e-04
7950.00000  8000.00000  1.463931434446e-04
8000.00000  8050.00000  1.523801981237e-04
8050.00000  8100.00000  1.429167891147e-04
8100.00000  8150.00000  1.477450590173e-04
8150.00000  8200.00000  1.344190340863e-04
8200.00000  8250.00000  1.450412278718e-04
8250.00000  8300.00000  1.373159960278e-04
8300.00000  8350.00000  1.328739877175e-04
8350.00000  8400.00000  1.315220721448e-04
8400.00000  8450.00000  1.284319794072e-04
8450.00000  8500.00000  1.359640804551e-04
8500.00000  8550.00000  1.322945953292e-04
8550.00000  8600.00000  1.344190340863e-04
8600.00000  8650.00000  1.359640804551e-04
8650.00000  8700.00000  1.266938022422e-04
8700.00000  8750.00000  1.230243171163e-04
8750.00000  8800.00000  1.326808569214e-04
8800.00000  8850.00000  1.284319794072e-04
8850.00000  8900.00000  1.315220721448e-04
8900.00000  8950.00000  1.149128236801e-04
8950.00000  9000.00000  1.226380555241e-04
9000.00000  9050.00000  1.120158617386e-04
9050.00000  9100.00000  1.143334312918e-04
9100.00000  9150.00000  1.208998783592e-04
9150.00000  9200.00000  1.199342243787e-04
9200.00000  9250.00000  1.160716084567e-04
9250.00000  9300.00000  1.120158617386e-04
9300.00000  9350.00000  1.195479627865e-04
9350.00000  9400.00000  1.180029164177e-04
9400.00000  9450.00000  1.203204859709e-04
9450.00000  9500.00000  1.129815157191e-04
9500.00000  9550.00000  1.181960472138e-04
9550.00000  9600.00000  1.106639461659e-04
9600.00000  9650.00000  1.149128236801e-04
9650.00000  9700.00000  1.077669842244e-04
9700.00000  9750.00000  1.125952541269e-04
9750.00000  9800.00000  1.008142755647e-04
9800.00000  9850.00000  9.984862158421e-05
9850.00000  9900.00000  1.102776845737e-04
9900.00000  9950.00000  1.006211447686e-04
9950.00000  10000.00000  1.089257690010e-04
