10001.00000  11001.00000  9.420983199075e-04
11001.00000  12001.00000  8.049338400718e-04
12001.00000  13001.00000  7.075246620354e-04
13001.00000  14001.00000  6.259867118177e-04
14001.00000  15001.00000  5.541607173092e-04
15001.00000  16001.00000  5.012566245797e-04
16001.00000  17001.00000  4.508529260140e-04
17001.00000  18001.00000  4.091571638793e-04
18001.00000  19001.00000  3.799537185314e-04
19001.00000  20001.00000  3.427374270219e-04
20001.00000  21001.00000  3.170963193048e-04
21001.00000  22001.00000  2.928164300321e-04
22001.00000  23001.00000  2.706604276938e-04
23001.00000  24001.00000  2.534665975567e-04
24001.00000  25001.00000  2.338592595397e-04
25001.00000  26001.00000  2.200539944661e-04
26001.00000  27001.00000  2.046075440342e-04
27001.00000  28001.00000  1.953203657120e-04
28001.00000  29001.00000  1.831949021229e-04
29001.00000  30001.00000  1.704033103589e-04
30001.00000  31001.00000  1.632110568766e-04
31001.00000  32001.00000  1.532384423164e-04
32001.00000  33001.00000  1.451290558397e-04
33001.00000  34001.00000  1.382360773344e-04
34001.00000  35001.00000  1.312755206085e-04
35001.00000  36001.00000  1.250197081836e-04
36001.00000  37001.00000  1.170937483057e-04
37001.00000  38001.00000  1.141492686921e-04
38001.00000  39001.00000  1.084437360638e-04
39001.00000  40001.00000  1.041380380059e-04
40001.00000  41001.00000  9.812357636895e-05
41001.00000  42001.00000  9.208980666897e-05
42001.00000  43001.00000  9.073824225617e-05
43001.00000  44001.00000  8.586295633859e-05
44001.00000  45001.00000  8.345910249012e-05
45001.00000  46001.00000  8.072701156997e-05
46001.00000  47001.00000  7.780184001942e-05
47001.00000  48001.00000  7.393057337991e-05
48001.00000  49001.00000  7.201907513896e-05
49001.00000  50001.00000  6.807057624729e-05
50001.00000  51001.00000  6.620734816394e-05
51001.00000  52001.00000  6.375522415786e-05
52001.00000  53001.00000  6.074316632363e-05
53001.00000  54001.00000  5.915990515436e-05
54001.00000  55001.00000  5.756698995356e-05
55001.00000  56001.00000  5.740287141773e-05
56001.00000  57001.00000  5.452597002478e-05
57001.00000  58001.00000  5.209315408174e-05
58001.00000  59001.00000  5.092501626783e-05
59001.00000  60001.00000  4.860804870304e-05
60001.00000  61001.00000  4.755575926736e-05
61001.00000  62001.00000  4.664828030448e-05
62001.00000  63001.00000  4.504571107217e-05
63001.00000  64001.00000  4.241016046722e-05
64001.00000  65001.00000  4.136752506306e-05
65001.00000  66001.00000  4.053727835234e-05
66001.00000  67001.00000  3.890574702547e-05
67001.00000  68001.00000  3.794034387347e-05
68001.00000  69001.00000  3.772795518003e-05
69001.00000  70001.00000  3.563303034020e-05
70001.00000  71001.00000  3.483174572404e-05
71001.00000  72001.00000  3.533375536308e-05
72001.00000  73001.00000  3.303609586133e-05
73001.00000  74001.00000  3.256304831685e-05
74001.00000  75001.00000  3.150110484965e-05
75001.00000  76001.00000  3.029435090966e-05
76001.00000  77001.00000  2.987922755430e-05
77001.00000  78001.00000  2.992749771190e-05
78001.00000  79001.00000  2.836354460566e-05
79001.00000  80001.00000  2.783257287207e-05
80001.00000  81001.00000  2.732090920151e-05
81001.00000  82001.00000  2.661616490055e-05
82001.00000  83001.00000  2.605623107239e-05
83001.00000  84001.00000  2.517771420407e-05
84001.00000  85001.00000  2.433781346184e-05
85001.00000  86001.00000  2.512944404647e-05
86001.00000  87001.00000  2.370064738152e-05
87001.00000  88001.00000  2.366203125544e-05
88001.00000  89001.00000  2.299590308056e-05
89001.00000  90001.00000  2.156710641561e-05
90001.00000  91001.00000  2.117129112329e-05
91001.00000  92001.00000  2.146091206889e-05
92001.00000  93001.00000  2.034104441257e-05
93001.00000  94001.00000  2.005142346697e-05
94001.00000  95001.00000  1.995488315177e-05
95001.00000  96001.00000  2.009969362457e-05
96001.00000  97001.00000  1.904740418890e-05
97001.00000  98001.00000  1.863228083354e-05
98001.00000  99001.00000  1.843920020314e-05
99001.00000  100001.00000  1.843920020314e-05
100001.00000  101001.00000  1.760895349242e-05
101001.00000  102001.00000  1.742552689354e-05
102001.00000  103001.00000  1.737725673594e-05
103001.00000  104001.00000  1.634427536330e-05
104001.00000  105001.00000  1.565883912539e-05
105001.00000  106001.00000  1.552368268411e-05
106001.00000  107001.00000  1.535956414827e-05
107001.00000  108001.00000  1.596776813403e-05
108001.00000  109001.00000  1.536921817979e-05
109001.00000  110001.00000  1.519544561243e-05
110001.00000  111001.00000  1.444243115387e-05
111001.00000  112001.00000  1.420108036587e-05
112001.00000  113001.00000  1.354460622251e-05
113001.00000  114001.00000  1.375699491595e-05
114001.00000  115001.00000  1.363149250619e-05
115001.00000  116001.00000  1.250197081836e-05
116001.00000  117001.00000  1.255024097596e-05
117001.00000  118001.00000  1.267574338572e-05
118001.00000  119001.00000  1.255024097596e-05
119001.00000  120001.00000  1.216407971516e-05
120001.00000  121001.00000  1.186480473804e-05
121001.00000  122001.00000  1.175861039132e-05
122001.00000  123001.00000  1.183584264348e-05
123001.00000  124001.00000  1.111179027948e-05
124001.00000  125001.00000  1.117936850012e-05
125001.00000  126001.00000  1.096697980668e-05
126001.00000  127001.00000  1.122763865772e-05
127001.00000  128001.00000  1.118902253164e-05
128001.00000  129001.00000  1.060012660892e-05
129001.00000  130001.00000  9.895382307966e-06
130001.00000  131001.00000  9.866420213407e-06
131001.00000  132001.00000  9.654031519967e-06
132001.00000  133001.00000  1.044566210460e-05
133001.00000  134001.00000  1.004019278077e-05
134001.00000  135001.00000  9.190638007009e-06
135001.00000  136001.00000  9.441642826528e-06
136001.00000  137001.00000  9.200292038529e-06
137001.00000  138001.00000  8.650012241891e-06
138001.00000  139001.00000  9.277524290689e-06
139001.00000  140001.00000  8.650012241891e-06
140001.00000  141001.00000  8.640358210371e-06
141001.00000  142001.00000  8.090078413733e-06
142001.00000  143001.00000  7.983884067013e-06
143001.00000  144001.00000  8.176964697412e-06
144001.00000  145001.00000  7.752187310534e-06
145001.00000  146001.00000  7.858381657253e-06
146001.00000  147001.00000  7.539798617094e-06
147001.00000  148001.00000  8.041808256133e-06
148001.00000  149001.00000  7.288793797575e-06
149001.00000  150001.00000  7.375680081255e-06
150001.00000  151001.00000  7.375680081255e-06
151001.00000  152001.00000  7.250177671495e-06
152001.00000  153001.00000  7.047443009576e-06
153001.00000  154001.00000  6.613011591178e-06
154001.00000  155001.00000  6.902632536777e-06
155001.00000  156001.00000  6.999172851976e-06
156001.00000  157001.00000  6.448893055338e-06
157001.00000  158001.00000  6.072385826059e-06
158001.00000  159001.00000  6.120655983659e-06
159001.00000  160001.00000  6.419930960778e-06
160001.00000  161001.00000  6.362006771658e-06
161001.00000  162001.00000  6.246158393419e-06
162001.00000  163001.00000  6.506817244458e-06
163001.00000  164001.00000  6.197888235819e-06
164001.00000  165001.00000  5.908267290220e-06
165001.00000  166001.00000  5.821381006540e-06
166001.00000  167001.00000  5.898613258700e-06
167001.00000  168001.00000  5.753802785901e-06
168001.00000  169001.00000  5.184214926222e-06
169001.00000  170001.00000  5.599338281581e-06
170001.00000  171001.00000  5.859997132620e-06
171001.00000  172001.00000  5.589684250061e-06
172001.00000  173001.00000  5.357987493582e-06
173001.00000  174001.00000  5.541414092461e-06
174001.00000  175001.00000  5.184214926222e-06
175001.00000  176001.00000  5.406257651182e-06
176001.00000  177001.00000  4.460162562225e-06
177001.00000  178001.00000  4.962172201263e-06
178001.00000  179001.00000  4.711167381744e-06
179001.00000  180001.00000  5.000788327343e-06
180001.00000  181001.00000  4.807707696944e-06
181001.00000  182001.00000  4.875285917583e-06
182001.00000  183001.00000  4.769091570864e-06
183001.00000  184001.00000  5.184214926222e-06
184001.00000  185001.00000  4.701513350224e-06
185001.00000  186001.00000  4.740129476304e-06
186001.00000  187001.00000  4.643589161104e-06
187001.00000  188001.00000  4.672551255664e-06
188001.00000  189001.00000  4.411892404625e-06
189001.00000  190001.00000  4.363622247025e-06
190001.00000  191001.00000  4.064347269906e-06
191001.00000  192001.00000  3.900228734067e-06
192001.00000  193001.00000  4.267081931826e-06
193001.00000  194001.00000  3.871266639507e-06
194001.00000  195001.00000  4.025731143826e-06
195001.00000  196001.00000  3.890574702547e-06
196001.00000  197001.00000  4.296044026385e-06
197001.00000  198001.00000  3.629915851508e-06
198001.00000  199001.00000  4.045039206866e-06
