10001.00000  11001.00000  1.560899499561e-05
11001.00000  12001.00000  1.369842516935e-05
12001.00000  13001.00000  1.205821899776e-05
13001.00000  14001.00000  1.027381887702e-05
14001.00000  15001.00000  9.859261273206e-06
15001.00000  16001.00000  8.255103588900e-06
16001.00000  17001.00000  6.993406533828e-06
17001.00000  18001.00000  7.227721701198e-06
18001.00000  19001.00000  6.128242838921e-06
19001.00000  20001.00000  5.857879184263e-06
20001.00000  21001.00000  4.235697256313e-06
21001.00000  22001.00000  4.145576038094e-06
22001.00000  23001.00000  4.109527550806e-06
23001.00000  24001.00000  3.785091165216e-06
24001.00000  25001.00000  3.442630535982e-06
25001.00000  26001.00000  2.811782008446e-06
26001.00000  27001.00000  2.703636546583e-06
27001.00000  28001.00000  2.721660790227e-06
28001.00000  29001.00000  2.415248648281e-06
29001.00000  30001.00000  2.253030455486e-06
30001.00000  31001.00000  2.415248648281e-06
31001.00000  32001.00000  1.712303146169e-06
32001.00000  33001.00000  1.550084953374e-06
33001.00000  34001.00000  1.586133440662e-06
34001.00000  35001.00000  1.477987978799e-06
35001.00000  36001.00000  1.496012222443e-06
36001.00000  37001.00000  1.243672811428e-06
37001.00000  38001.00000  1.333794029648e-06
38001.00000  39001.00000  1.099478862277e-06
39001.00000  40001.00000  7.570182330432e-07
40001.00000  41001.00000  8.291152076188e-07
41001.00000  42001.00000  9.552849131260e-07
42001.00000  43001.00000  1.045406131345e-06
43001.00000  44001.00000  7.930667203310e-07
44001.00000  45001.00000  6.849212584677e-07
45001.00000  46001.00000  7.930667203310e-07
46001.00000  47001.00000  7.930667203310e-07
47001.00000  48001.00000  8.110909639749e-07
48001.00000  49001.00000  5.948000402482e-07
49001.00000  50001.00000  6.308485275360e-07
50001.00000  51001.00000  7.930667203310e-07
51001.00000  52001.00000  5.587515529605e-07
52001.00000  53001.00000  4.866545783849e-07
53001.00000  54001.00000  7.209697457555e-07
54001.00000  55001.00000  5.767757966044e-07
55001.00000  56001.00000  3.424606292338e-07
56001.00000  57001.00000  4.866545783849e-07
57001.00000  58001.00000  4.866545783849e-07
58001.00000  59001.00000  3.785091165216e-07
59001.00000  60001.00000  5.948000402482e-07
60001.00000  61001.00000  3.785091165216e-07
61001.00000  62001.00000  4.686303347410e-07
62001.00000  63001.00000  3.244363855900e-07
63001.00000  64001.00000  2.162909237266e-07
64001.00000  65001.00000  1.622181927950e-07
65001.00000  66001.00000  3.785091165216e-07
66001.00000  67001.00000  1.982666800827e-07
67001.00000  68001.00000  2.343151673705e-07
68001.00000  69001.00000  2.703636546583e-07
69001.00000  70001.00000  2.343151673705e-07
70001.00000  71001.00000  1.982666800827e-07
71001.00000  72001.00000  1.622181927950e-07
72001.00000  73001.00000  2.162909237266e-07
73001.00000  74001.00000  1.441939491511e-07
74001.00000  75001.00000  9.012121821943e-08
75001.00000  76001.00000  1.441939491511e-07
76001.00000  77001.00000  1.982666800827e-07
77001.00000  78001.00000  2.162909237266e-07
78001.00000  79001.00000  1.441939491511e-07
79001.00000  80001.00000  1.982666800827e-07
80001.00000  81001.00000  2.703636546583e-07
81001.00000  82001.00000  1.982666800827e-07
82001.00000  83001.00000  3.064121419461e-07
83001.00000  84001.00000  1.802424364389e-07
84001.00000  85001.00000  1.441939491511e-07
85001.00000  86001.00000  1.261697055072e-07
86001.00000  87001.00000  1.261697055072e-07
87001.00000  88001.00000  1.802424364389e-07
88001.00000  89001.00000  1.261697055072e-07
89001.00000  90001.00000  1.441939491511e-07
90001.00000  91001.00000  1.441939491511e-07
91001.00000  92001.00000  1.081454618633e-07
92001.00000  93001.00000  9.012121821943e-08
93001.00000  94001.00000  1.261697055072e-07
94001.00000  95001.00000  1.081454618633e-07
95001.00000  96001.00000  1.261697055072e-07
96001.00000  97001.00000  5.407273093166e-08
97001.00000  98001.00000  7.209697457555e-08
98001.00000  99001.00000  1.081454618633e-07
99001.00000  100001.00000  9.012121821943e-08
100001.00000  101001.00000  1.802424364389e-08
101001.00000  102001.00000  1.081454618633e-07
102001.00000  103001.00000  1.081454618633e-07
103001.00000  104001.00000  5.407273093166e-08
104001.00000  105001.00000  7.209697457555e-08
105001.00000  106001.00000  9.012121821943e-08
106001.00000  107001.00000  5.407273093166e-08
107001.00000  108001.00000  7.209697457555e-08
108001.00000  109001.00000  1.081454618633e-07
109001.00000  110001.00000  1.081454618633e-07
110001.00000  111001.00000  1.802424364389e-08
111001.00000  112001.00000  7.209697457555e-08
112001.00000  113001.00000  5.407273093166e-08
113001.00000  114001.00000  7.209697457555e-08
114001.00000  115001.00000  3.604848728777e-08
115001.00000  116001.00000  1.802424364389e-08
116001.00000  117001.00000  3.604848728777e-08
117001.00000  118001.00000  1.081454618633e-07
118001.00000  119001.00000  1.081454618633e-07
119001.00000  120001.00000  5.407273093166e-08
120001.00000  121001.00000  5.407273093166e-08
121001.00000  122001.00000  3.604848728777e-08
122001.00000  123001.00000  1.802424364389e-08
123001.00000  124001.00000  0.000000000000e+00
124001.00000  125001.00000  3.604848728777e-08
125001.00000  126001.00000  3.604848728777e-08
126001.00000  127001.00000  1.802424364389e-08
127001.00000  128001.00000  1.081454618633e-07
128001.00000  129001.00000  0.000000000000e+00
129001.00000  130001.00000  5.407273093166e-08
130001.00000  131001.00000  1.802424364389e-08
131001.00000  132001.00000  3.604848728777e-08
132001.00000  133001.00000  0.000000000000e+00
133001.00000  134001.00000  5.407273093166e-08
134001.00000  135001.00000  1.802424364389e-08
135001.00000  136001.00000  0.000000000000e+00
136001.00000  137001.00000  1.802424364389e-08
137001.00000  138001.00000  3.604848728777e-08
138001.00000  139001.00000  1.802424364389e-08
139001.00000  140001.00000  3.604848728777e-08
140001.00000  141001.00000  3.604848728777e-08
141001.00000  142001.00000  0.000000000000e+00
142001.00000  143001.00000  1.802424364389e-08
143001.00000  144001.00000  1.802424364389e-08
144001.00000  145001.00000  0.000000000000e+00
145001.00000  146001.00000  1.802424364389e-08
146001.00000  147001.00000  1.802424364389e-08
147001.00000  148001.00000  0.000000000000e+00
148001.00000  149001.00000  5.407273093166e-08
149001.00000  150001.00000  5.407273093166e-08
150001.00000  151001.00000  3.604848728777e-08
151001.00000  152001.00000  0.000000000000e+00
152001.00000  153001.00000  1.802424364389e-08
153001.00000  154001.00000  5.407273093166e-08
154001.00000  155001.00000  3.604848728777e-08
155001.00000  156001.00000  1.802424364389e-08
156001.00000  157001.00000  1.802424364389e-08
157001.00000  158001.00000  3.604848728777e-08
158001.00000  159001.00000  0.000000000000e+00
159001.00000  160001.00000  0.000000000000e+00
160001.00000  161001.00000  1.802424364389e-08
161001.00000  162001.00000  0.000000000000e+00
162001.00000  163001.00000  1.802424364389e-08
163001.00000  164001.00000  3.604848728777e-08
164001.00000  165001.00000  0.000000000000e+00
165001.00000  166001.00000  3.604848728777e-08
166001.00000  167001.00000  0.000000000000e+00
167001.00000  168001.00000  0.000000000000e+00
168001.00000  169001.00000  0.000000000000e+00
169001.00000  170001.00000  0.000000000000e+00
170001.00000  171001.00000  0.000000000000e+00
171001.00000  172001.00000  0.000000000000e+00
172001.00000  173001.00000  0.000000000000e+00
173001.00000  174001.00000  0.000000000000e+00
174001.00000  175001.00000  0.000000000000e+00
175001.00000  176001.00000  1.802424364389e-08
176001.00000  177001.00000  0.000000000000e+00
177001.00000  178001.00000  1.802424364389e-08
178001.00000  179001.00000  0.000000000000e+00
179001.00000  180001.00000  1.802424364389e-08
180001.00000  181001.00000  3.604848728777e-08
181001.00000  182001.00000  0.000000000000e+00
182001.00000  183001.00000  0.000000000000e+00
183001.00000  184001.00000  1.802424364389e-08
184001.00000  185001.00000  0.000000000000e+00
185001.00000  186001.00000  0.000000000000e+00
186001.00000  187001.00000  1.802424364389e-08
187001.00000  188001.00000  0.000000000000e+00
188001.00000  189001.00000  0.000000000000e+00
189001.00000  190001.00000  0.000000000000e+00
190001.00000  191001.00000  0.000000000000e+00
191001.00000  192001.00000  0.000000000000e+00
192001.00000  193001.00000  0.000000000000e+00
193001.00000  194001.00000  0.000000000000e+00
194001.00000  195001.00000  0.000000000000e+00
195001.00000  196001.00000  0.000000000000e+00
196001.00000  197001.00000  0.000000000000e+00
197001.00000  198001.00000  0.000000000000e+00
198001.00000  199001.00000  0.000000000000e+00
