300.00000  350.00000  1.304014724450e-01
350.00000  400.00000  1.037339351918e-01
400.00000  450.00000  8.493309660478e-02
450.00000  500.00000  7.111928644808e-02
500.00000  550.00000  6.045609258087e-02
550.00000  600.00000  5.233427234568e-02
600.00000  650.00000  4.568470812376e-02
650.00000  700.00000  4.044641775489e-02
700.00000  750.00000  3.614370179320e-02
750.00000  800.00000  3.236666749098e-02
800.00000  850.00000  2.924191072512e-02
850.00000  900.00000  2.664611630456e-02
900.00000  950.00000  2.433574155154e-02
950.00000  1000.00000  2.235285643733e-02
1000.00000  1050.00000  2.071791700302e-02
1050.00000  1100.00000  1.906599519498e-02
1100.00000  1150.00000  1.780601885331e-02
1150.00000  1200.00000  1.658695459380e-02
1200.00000  1250.00000  1.553404742269e-02
1250.00000  1300.00000  1.454829782042e-02
1300.00000  1350.00000  1.374568768027e-02
1350.00000  1400.00000  1.293632318694e-02
1400.00000  1450.00000  1.211074824596e-02
1450.00000  1500.00000  1.153585629898e-02
1500.00000  1550.00000  1.085135084885e-02
1550.00000  1600.00000  1.040980913193e-02
1600.00000  1650.00000  9.909986996089e-03
1650.00000  1700.00000  9.371761537838e-03
1700.00000  1750.00000  8.985219554017e-03
1750.00000  1800.00000  8.584203956224e-03
1800.00000  1850.00000  8.191679545295e-03
1850.00000  1900.00000  7.784681520393e-03
1900.00000  1950.00000  7.622191080864e-03
1950.00000  2000.00000  7.247613951260e-03
2000.00000  2050.00000  6.922247109162e-03
2050.00000  2100.00000  6.679476357467e-03
2100.00000  2150.00000  6.426863548270e-03
2150.00000  2200.00000  6.272478332565e-03
2200.00000  2250.00000  5.959848270763e-03
2250.00000  2300.00000  5.743130024217e-03
2300.00000  2350.00000  5.564815100078e-03
2350.00000  2400.00000  5.341535481865e-03
2400.00000  2450.00000  5.262413058817e-03
2450.00000  2500.00000  5.076571855412e-03
2500.00000  2550.00000  4.914853341961e-03
2550.00000  2600.00000  4.730363009194e-03
2600.00000  2650.00000  4.571539218538e-03
2650.00000  2700.00000  4.462890622985e-03
2700.00000  2750.00000  4.311979074634e-03
2750.00000  2800.00000  4.212207628985e-03
2800.00000  2850.00000  4.092945049853e-03
2850.00000  2900.00000  3.953419411160e-03
2900.00000  2950.00000  3.845542741686e-03
2950.00000  3000.00000  3.791121953150e-03
3000.00000  3050.00000  3.672438318577e-03
3050.00000  3100.00000  3.637894626563e-03
3100.00000  3150.00000  3.513614527921e-03
3150.00000  3200.00000  3.436807883108e-03
3200.00000  3250.00000  3.369650314276e-03
3250.00000  3300.00000  3.263317496959e-03
3300.00000  3350.00000  3.193072223814e-03
3350.00000  3400.00000  3.105265632382e-03
3400.00000  3450.00000  3.019388856146e-03
3450.00000  3500.00000  2.972687328395e-03
3500.00000  3550.00000  2.892214034709e-03
3550.00000  3600.00000  2.841073932007e-03
3600.00000  3650.00000  2.798232034649e-03
3650.00000  3700.00000  2.800740794404e-03
3700.00000  3750.00000  2.685144864145e-03
3750.00000  3800.00000  2.684565919586e-03
3800.00000  3850.00000  2.643653837424e-03
3850.00000  3900.00000  2.530373685401e-03
3900.00000  3950.00000  2.507022921526e-03
3950.00000  4000.00000  2.469777488237e-03
4000.00000  4050.00000  2.361900818763e-03
4050.00000  4100.00000  2.381391952246e-03
4100.00000  4150.00000  2.366146412195e-03
4150.00000  4200.00000  2.337971110329e-03
4200.00000  4250.00000  2.301304621599e-03
4250.00000  4300.00000  2.244761036347e-03
4300.00000  4350.00000  2.216392752962e-03
4350.00000  4400.00000  2.176638559918e-03
4400.00000  4450.00000  2.150393073248e-03
4450.00000  4500.00000  2.117972177950e-03
4500.00000  4550.00000  2.040972551617e-03
4550.00000  4600.00000  2.078025003386e-03
4600.00000  4650.00000  2.078989910984e-03
4650.00000  4700.00000  2.007586748721e-03
4700.00000  4750.00000  2.014341101908e-03
4750.00000  4800.00000  1.945253717880e-03
4800.00000  4850.00000  1.951429126508e-03
4850.00000  4900.00000  1.920359101848e-03
4900.00000  4950.00000  1.927499418074e-03
4950.00000  5000.00000  1.883499631598e-03
5000.00000  5050.00000  1.850113828702e-03
5050.00000  5100.00000  1.860148867723e-03
5100.00000  5150.00000  1.795307077127e-03
5150.00000  5200.00000  1.850692773261e-03
5200.00000  5250.00000  1.790868502175e-03
5250.00000  5300.00000  1.741079270110e-03
5300.00000  5350.00000  1.773307183889e-03
5350.00000  5400.00000  1.775044017566e-03
5400.00000  5450.00000  1.707114522655e-03
5450.00000  5500.00000  1.658097216669e-03
5500.00000  5550.00000  1.710781171528e-03
5550.00000  5600.00000  1.658290198189e-03
5600.00000  5650.00000  1.684921647898e-03
5650.00000  5700.00000  1.672184867602e-03
5700.00000  5750.00000  1.626062284410e-03
5750.00000  5800.00000  1.606957113967e-03
5800.00000  5850.00000  1.630693840882e-03
5850.00000  5900.00000  1.587465980484e-03
5900.00000  5950.00000  1.586308091366e-03
5950.00000  6000.00000  1.554273159108e-03
6000.00000  6050.00000  1.535360970184e-03
6050.00000  6100.00000  1.514325984544e-03
6100.00000  6150.00000  1.521659282290e-03
6150.00000  6200.00000  1.512589150867e-03
6200.00000  6250.00000  1.499659389052e-03
6250.00000  6300.00000  1.503133056406e-03
6300.00000  6350.00000  1.469554271990e-03
6350.00000  6400.00000  1.751693253690e-03
6400.00000  6450.00000  1.421115910562e-03
6450.00000  6500.00000  1.411852797620e-03
6500.00000  6550.00000  1.448326304830e-03
6550.00000  6600.00000  1.385993273990e-03
6600.00000  6650.00000  1.395063405412e-03
6650.00000  6700.00000  1.387344144627e-03
6700.00000  6750.00000  1.358396916682e-03
6750.00000  6800.00000  1.386765200068e-03
6800.00000  6850.00000  1.377888050165e-03
6850.00000  6900.00000  1.321730427952e-03
6900.00000  6950.00000  1.306677869421e-03
6950.00000  7000.00000  1.317291853001e-03
7000.00000  7050.00000  1.325397076825e-03
7050.00000  7100.00000  1.344695228789e-03
7100.00000  7150.00000  1.109836719398e-03
7150.00000  7200.00000  1.102310440132e-03
7200.00000  7250.00000  1.094205216308e-03
7250.00000  7300.00000  1.099222735818e-03
7300.00000  7350.00000  1.087450863120e-03
7350.00000  7400.00000  1.086292974003e-03
7400.00000  7450.00000  1.091117511993e-03
7450.00000  7500.00000  1.068345692677e-03
7500.00000  7550.00000  1.051749281989e-03
7550.00000  7600.00000  1.074521101305e-03
7600.00000  7650.00000  1.030135351790e-03
7650.00000  7700.00000  1.059082579735e-03
7700.00000  7750.00000  1.050205429832e-03
7750.00000  7800.00000  9.957846412957e-04
7800.00000  7850.00000  1.025503795319e-03
7850.00000  7900.00000  1.015275774778e-03
7900.00000  7950.00000  1.003503902081e-03
7950.00000  8000.00000  9.741707110971e-04
8000.00000  8050.00000  9.627848014388e-04
8050.00000  8100.00000  9.977144564920e-04
8100.00000  8150.00000  1.002924957522e-03
8150.00000  8200.00000  9.784163045289e-04
8200.00000  8250.00000  9.718549328615e-04
8250.00000  8300.00000  9.687672285474e-04
8300.00000  8350.00000  9.407849082009e-04
8350.00000  8400.00000  9.178201073648e-04
8400.00000  8450.00000  9.589251710462e-04
8450.00000  8500.00000  9.160832736881e-04
8500.00000  8550.00000  9.147324030507e-04
8550.00000  8600.00000  9.147324030507e-04
8600.00000  8650.00000  9.102938280992e-04
8650.00000  8700.00000  9.336445919746e-04
8700.00000  8750.00000  8.888728794202e-04
8750.00000  8800.00000  8.672589492215e-04
8800.00000  8850.00000  8.873290272631e-04
8850.00000  8900.00000  9.014166781962e-04
8900.00000  8950.00000  8.691887644178e-04
8950.00000  9000.00000  8.678378937804e-04
9000.00000  9050.00000  8.670659677019e-04
9050.00000  9100.00000  8.809606371153e-04
9100.00000  9150.00000  8.643642264271e-04
9150.00000  9200.00000  8.099434378911e-04
9200.00000  9250.00000  8.520134091707e-04
9250.00000  9300.00000  8.400485549536e-04
9300.00000  9350.00000  8.141890313230e-04
9350.00000  9400.00000  8.319433311291e-04
9400.00000  9450.00000  8.263468670598e-04
9450.00000  9500.00000  8.161188465193e-04
9500.00000  9550.00000  8.095574748519e-04
9550.00000  9600.00000  8.334871832861e-04
9600.00000  9650.00000  8.002943619096e-04
9650.00000  9700.00000  7.802242838680e-04
9700.00000  9750.00000  8.138030682837e-04
9750.00000  9800.00000  8.039610107826e-04
9800.00000  9850.00000  7.835049697017e-04
9850.00000  9900.00000  8.012592695077e-04
9900.00000  9950.00000  7.935400087225e-04
9950.00000  10000.00000  7.966277130366e-04
