10001.00000  11001.00000  5.306494512290e-06
11001.00000  12001.00000  4.689011514497e-06
12001.00000  13001.00000  3.975046798298e-06
13001.00000  14001.00000  3.618064440198e-06
14001.00000  15001.00000  2.933044239521e-06
15001.00000  16001.00000  2.653247256145e-06
16001.00000  17001.00000  2.576061881421e-06
17001.00000  18001.00000  2.315561241727e-06
18001.00000  19001.00000  2.354153929089e-06
19001.00000  20001.00000  1.987523399149e-06
20001.00000  21001.00000  1.727022759455e-06
21001.00000  22001.00000  1.611244697368e-06
22001.00000  23001.00000  1.321799542152e-06
23001.00000  24001.00000  1.370040401355e-06
24001.00000  25001.00000  1.466522119760e-06
25001.00000  26001.00000  1.408633088717e-06
26001.00000  27001.00000  9.744653558933e-07
27001.00000  28001.00000  1.099891589820e-06
28001.00000  29001.00000  1.090243417980e-06
29001.00000  30001.00000  9.744653558933e-07
30001.00000  31001.00000  9.262244966907e-07
31001.00000  32001.00000  6.560756851559e-07
32001.00000  33001.00000  7.911500909233e-07
33001.00000  34001.00000  6.753720288370e-07
34001.00000  35001.00000  7.332610598801e-07
35001.00000  36001.00000  6.946683725180e-07
36001.00000  37001.00000  5.692421385912e-07
37001.00000  38001.00000  5.885384822722e-07
38001.00000  39001.00000  4.824085920264e-07
39001.00000  40001.00000  4.534640765048e-07
40001.00000  41001.00000  4.631122483453e-07
41001.00000  42001.00000  4.438159046643e-07
42001.00000  43001.00000  4.631122483453e-07
43001.00000  44001.00000  4.341677328238e-07
44001.00000  45001.00000  3.280378425780e-07
45001.00000  46001.00000  4.341677328238e-07
46001.00000  47001.00000  3.087414988969e-07
47001.00000  48001.00000  4.824085920264e-07
48001.00000  49001.00000  3.569823580995e-07
49001.00000  50001.00000  3.666305299401e-07
50001.00000  51001.00000  2.894451552158e-07
51001.00000  52001.00000  3.376860144185e-07
52001.00000  53001.00000  3.569823580995e-07
53001.00000  54001.00000  1.929634368106e-07
54001.00000  55001.00000  2.605006396943e-07
55001.00000  56001.00000  2.122597804916e-07
56001.00000  57001.00000  2.219079523321e-07
57001.00000  58001.00000  1.833152649700e-07
58001.00000  59001.00000  1.929634368106e-07
59001.00000  60001.00000  2.122597804916e-07
60001.00000  61001.00000  1.929634368106e-07
61001.00000  62001.00000  2.605006396943e-07
62001.00000  63001.00000  2.412042960132e-07
63001.00000  64001.00000  1.833152649700e-07
64001.00000  65001.00000  1.640189212890e-07
65001.00000  66001.00000  1.929634368106e-07
66001.00000  67001.00000  2.605006396943e-07
67001.00000  68001.00000  1.447225776079e-07
68001.00000  69001.00000  1.736670931295e-07
69001.00000  70001.00000  1.543707494484e-07
70001.00000  71001.00000  1.061298902458e-07
71001.00000  72001.00000  1.736670931295e-07
72001.00000  73001.00000  1.254262339269e-07
73001.00000  74001.00000  1.447225776079e-07
74001.00000  75001.00000  9.648171840528e-08
75001.00000  76001.00000  7.718537472422e-08
76001.00000  77001.00000  8.683354656475e-08
77001.00000  78001.00000  1.543707494484e-07
78001.00000  79001.00000  9.648171840528e-08
79001.00000  80001.00000  7.718537472422e-08
80001.00000  81001.00000  1.254262339269e-07
81001.00000  82001.00000  9.648171840528e-08
82001.00000  83001.00000  1.350744057674e-07
83001.00000  84001.00000  8.683354656475e-08
84001.00000  85001.00000  9.648171840528e-08
85001.00000  86001.00000  1.254262339269e-07
86001.00000  87001.00000  1.157780620863e-07
87001.00000  88001.00000  7.718537472422e-08
88001.00000  89001.00000  6.753720288370e-08
89001.00000  90001.00000  7.718537472422e-08
90001.00000  91001.00000  2.894451552158e-08
91001.00000  92001.00000  4.824085920264e-08
92001.00000  93001.00000  8.683354656475e-08
93001.00000  94001.00000  5.788903104317e-08
94001.00000  95001.00000  2.894451552158e-08
95001.00000  96001.00000  4.824085920264e-08
96001.00000  97001.00000  5.788903104317e-08
97001.00000  98001.00000  7.718537472422e-08
98001.00000  99001.00000  6.753720288370e-08
99001.00000  100001.00000  8.683354656475e-08
100001.00000  101001.00000  1.929634368106e-08
101001.00000  102001.00000  7.718537472422e-08
102001.00000  103001.00000  6.753720288370e-08
103001.00000  104001.00000  8.683354656475e-08
104001.00000  105001.00000  1.157780620863e-07
105001.00000  106001.00000  7.718537472422e-08
106001.00000  107001.00000  3.859268736211e-08
107001.00000  108001.00000  3.859268736211e-08
108001.00000  109001.00000  5.788903104317e-08
109001.00000  110001.00000  2.894451552158e-08
110001.00000  111001.00000  6.753720288370e-08
111001.00000  112001.00000  3.859268736211e-08
112001.00000  113001.00000  6.753720288370e-08
113001.00000  114001.00000  1.929634368106e-08
114001.00000  115001.00000  2.894451552158e-08
115001.00000  116001.00000  3.859268736211e-08
116001.00000  117001.00000  2.894451552158e-08
117001.00000  118001.00000  6.753720288370e-08
118001.00000  119001.00000  2.894451552158e-08
119001.00000  120001.00000  4.824085920264e-08
120001.00000  121001.00000  5.788903104317e-08
121001.00000  122001.00000  1.929634368106e-08
122001.00000  123001.00000  4.824085920264e-08
123001.00000  124001.00000  3.859268736211e-08
124001.00000  125001.00000  2.894451552158e-08
125001.00000  126001.00000  3.859268736211e-08
126001.00000  127001.00000  9.648171840528e-09
127001.00000  128001.00000  1.929634368106e-08
128001.00000  129001.00000  3.859268736211e-08
129001.00000  130001.00000  2.894451552158e-08
130001.00000  131001.00000  2.894451552158e-08
131001.00000  132001.00000  4.824085920264e-08
132001.00000  133001.00000  1.929634368106e-08
133001.00000  134001.00000  1.929634368106e-08
134001.00000  135001.00000  1.929634368106e-08
135001.00000  136001.00000  1.929634368106e-08
136001.00000  137001.00000  1.929634368106e-08
137001.00000  138001.00000  9.648171840528e-09
138001.00000  139001.00000  2.894451552158e-08
139001.00000  140001.00000  9.648171840528e-09
140001.00000  141001.00000  2.894451552158e-08
141001.00000  142001.00000  9.648171840528e-09
142001.00000  143001.00000  9.648171840528e-09
143001.00000  144001.00000  1.929634368106e-08
144001.00000  145001.00000  9.648171840528e-09
145001.00000  146001.00000  0.000000000000e+00
146001.00000  147001.00000  3.859268736211e-08
147001.00000  148001.00000  0.000000000000e+00
148001.00000  149001.00000  9.648171840528e-09
149001.00000  150001.00000  0.000000000000e+00
150001.00000  151001.00000  9.648171840528e-09
151001.00000  152001.00000  1.929634368106e-08
152001.00000  153001.00000  9.648171840528e-09
153001.00000  154001.00000  9.648171840528e-09
154001.00000  155001.00000  0.000000000000e+00
155001.00000  156001.00000  0.000000000000e+00
156001.00000  157001.00000  0.000000000000e+00
157001.00000  158001.00000  9.648171840528e-09
158001.00000  159001.00000  9.648171840528e-09
159001.00000  160001.00000  0.000000000000e+00
160001.00000  161001.00000  9.648171840528e-09
161001.00000  162001.00000  0.000000000000e+00
162001.00000  163001.00000  0.000000000000e+00
163001.00000  164001.00000  0.000000000000e+00
164001.00000  165001.00000  9.648171840528e-09
165001.00000  166001.00000  0.000000000000e+00
166001.00000  167001.00000  0.000000000000e+00
167001.00000  168001.00000  0.000000000000e+00
168001.00000  169001.00000  0.000000000000e+00
169001.00000  170001.00000  0.000000000000e+00
170001.00000  171001.00000  1.929634368106e-08
171001.00000  172001.00000  0.000000000000e+00
172001.00000  173001.00000  0.000000000000e+00
173001.00000  174001.00000  0.000000000000e+00
174001.00000  175001.00000  1.929634368106e-08
175001.00000  176001.00000  0.000000000000e+00
176001.00000  177001.00000  0.000000000000e+00
177001.00000  178001.00000  0.000000000000e+00
178001.00000  179001.00000  0.000000000000e+00
179001.00000  180001.00000  0.000000000000e+00
180001.00000  181001.00000  0.000000000000e+00
181001.00000  182001.00000  0.000000000000e+00
182001.00000  183001.00000  0.000000000000e+00
183001.00000  184001.00000  0.000000000000e+00
184001.00000  185001.00000  0.000000000000e+00
185001.00000  186001.00000  0.000000000000e+00
186001.00000  187001.00000  0.000000000000e+00
187001.00000  188001.00000  0.000000000000e+00
188001.00000  189001.00000  0.000000000000e+00
189001.00000  190001.00000  0.000000000000e+00
190001.00000  191001.00000  0.000000000000e+00
191001.00000  192001.00000  0.000000000000e+00
192001.00000  193001.00000  0.000000000000e+00
193001.00000  194001.00000  0.000000000000e+00
194001.00000  195001.00000  0.000000000000e+00
195001.00000  196001.00000  0.000000000000e+00
196001.00000  197001.00000  0.000000000000e+00
197001.00000  198001.00000  0.000000000000e+00
198001.00000  199001.00000  0.000000000000e+00
