300.00000  350.00000  2.536293698109e-05
350.00000  400.00000  3.949371615627e-05
400.00000  450.00000  2.826155835036e-05
450.00000  500.00000  2.898621369268e-05
500.00000  550.00000  2.257301391317e-04
550.00000  600.00000  2.536293698109e-05
600.00000  650.00000  7.174087888937e-05
650.00000  700.00000  3.260949040426e-05
700.00000  750.00000  4.746492492176e-05
750.00000  800.00000  3.550811177353e-05
800.00000  850.00000  1.137708887438e-04
850.00000  900.00000  3.840673314280e-05
900.00000  950.00000  2.862388602152e-05
950.00000  1000.00000  2.318897095414e-05
1000.00000  1050.00000  2.971086903499e-05
1050.00000  1100.00000  2.717457533688e-05
1100.00000  1150.00000  2.826155835036e-05
1150.00000  1200.00000  3.514578410237e-05
1200.00000  1250.00000  3.369647341774e-05
1250.00000  1300.00000  8.587165806455e-05
1300.00000  1350.00000  4.637794190828e-05
1350.00000  1400.00000  5.978406574115e-05
1400.00000  1450.00000  7.608881094328e-05
1450.00000  1500.00000  1.405831364095e-04
1500.00000  1550.00000  1.692070224310e-04
1550.00000  1600.00000  2.634122169322e-04
1600.00000  1650.00000  3.601537051315e-04
1650.00000  1700.00000  4.713883001772e-04
1700.00000  1750.00000  6.873355921876e-04
1750.00000  1800.00000  7.659606968290e-04
1800.00000  1850.00000  8.677747724245e-04
1850.00000  1900.00000  9.076308162519e-04
1900.00000  1950.00000  1.124302763605e-03
1950.00000  2000.00000  1.332641174521e-03
2000.00000  2050.00000  1.518152942154e-03
2050.00000  2100.00000  1.682287377189e-03
2100.00000  2150.00000  1.879393630299e-03
2150.00000  2200.00000  2.076862211080e-03
2200.00000  2250.00000  2.335201840616e-03
2250.00000  2300.00000  2.417087894298e-03
2300.00000  2350.00000  2.681587094244e-03
2350.00000  2400.00000  2.798981259699e-03
2400.00000  2450.00000  2.992101908427e-03
2450.00000  2500.00000  2.968550609801e-03
2500.00000  2550.00000  2.927607582960e-03
2550.00000  2600.00000  3.117104954976e-03
2600.00000  2650.00000  3.153337722092e-03
2650.00000  2700.00000  3.351168630545e-03
2700.00000  2750.00000  3.368198031089e-03
2750.00000  2800.00000  3.510592805854e-03
2800.00000  2850.00000  3.492114094625e-03
2850.00000  2900.00000  3.624363694598e-03
2900.00000  2950.00000  3.655886201989e-03
2950.00000  3000.00000  3.717481906086e-03
3000.00000  3050.00000  3.833064433185e-03
3050.00000  3100.00000  3.785961835935e-03
3100.00000  3150.00000  3.821107620037e-03
3150.00000  3200.00000  3.805527530177e-03
3200.00000  3250.00000  3.862775302220e-03
3250.00000  3300.00000  3.767120797034e-03
3300.00000  3350.00000  3.780889248539e-03
3350.00000  3400.00000  3.830890467158e-03
3400.00000  3450.00000  3.807339168533e-03
3450.00000  3500.00000  3.809875462231e-03
3500.00000  3550.00000  3.809875462231e-03
3550.00000  3600.00000  3.841760297293e-03
3600.00000  3650.00000  3.768570107719e-03
3650.00000  3700.00000  3.751178379504e-03
3700.00000  3750.00000  3.808426151547e-03
3750.00000  3800.00000  3.743931826080e-03
3800.00000  3850.00000  3.693930607460e-03
3850.00000  3900.00000  3.653712235962e-03
3900.00000  3950.00000  3.602986362000e-03
3950.00000  4000.00000  3.572550837622e-03
4000.00000  4050.00000  3.490664783941e-03
4050.00000  4100.00000  3.413488989984e-03
4100.00000  4150.00000  3.440301237650e-03
4150.00000  4200.00000  3.338487162054e-03
4200.00000  4250.00000  3.327617331919e-03
4250.00000  4300.00000  3.330153625617e-03
4300.00000  4350.00000  3.266746283165e-03
4350.00000  4400.00000  3.192831438248e-03
4400.00000  4450.00000  3.222904634954e-03
4450.00000  4500.00000  3.167468501267e-03
4500.00000  4550.00000  3.157323326475e-03
4550.00000  4600.00000  3.088118741284e-03
4600.00000  4650.00000  3.018189500750e-03
4650.00000  4700.00000  3.018551828421e-03
4700.00000  4750.00000  2.963478022405e-03
4750.00000  4800.00000  2.935216464055e-03
4800.00000  4850.00000  2.847533167634e-03
4850.00000  4900.00000  2.829054456405e-03
4900.00000  4950.00000  2.834851699144e-03
4950.00000  5000.00000  2.730863657521e-03
5000.00000  5050.00000  2.720718482729e-03
5050.00000  5100.00000  2.710935635608e-03
5100.00000  5150.00000  2.635933807678e-03
5150.00000  5200.00000  2.605135955629e-03
5200.00000  5250.00000  2.554410081667e-03
5250.00000  5300.00000  2.546801200573e-03
5300.00000  5350.00000  2.551149132627e-03
5350.00000  5400.00000  2.499698603322e-03
5400.00000  5450.00000  2.426508413748e-03
5450.00000  5500.00000  2.426870741419e-03
5500.00000  5550.00000  2.322882699797e-03
5550.00000  5600.00000  2.318534767743e-03
5600.00000  5650.00000  2.307664937608e-03
5650.00000  5700.00000  2.282302000627e-03
5700.00000  5750.00000  2.252228803921e-03
5750.00000  5800.00000  2.249330182552e-03
5800.00000  5850.00000  2.210561121738e-03
5850.00000  5900.00000  2.176139992978e-03
5900.00000  5950.00000  2.150414728325e-03
5950.00000  6000.00000  2.142081191889e-03
6000.00000  6050.00000  2.078311521765e-03
6050.00000  6100.00000  2.042803409991e-03
6100.00000  6150.00000  1.970700203431e-03
6150.00000  6200.00000  1.989178914660e-03
6200.00000  6250.00000  2.004396676849e-03
6250.00000  6300.00000  1.976135118498e-03
6300.00000  6350.00000  1.902582601253e-03
6350.00000  6400.00000  2.154762660379e-03
6400.00000  6450.00000  1.875045698245e-03
6450.00000  6500.00000  1.875408025916e-03
6500.00000  6550.00000  1.826493790310e-03
6550.00000  6600.00000  1.801855508671e-03
6600.00000  6650.00000  1.768883690596e-03
6650.00000  6700.00000  1.692794879652e-03
6700.00000  6750.00000  1.738085838547e-03
6750.00000  6800.00000  1.689171602941e-03
6800.00000  6850.00000  1.682649704860e-03
6850.00000  6900.00000  1.641706678019e-03
6900.00000  6950.00000  1.603299944876e-03
6950.00000  7000.00000  1.576487697210e-03
7000.00000  7050.00000  1.599676668165e-03
7050.00000  7100.00000  1.625039605146e-03
7100.00000  7150.00000  1.414164900531e-03
7150.00000  7200.00000  1.388077308208e-03
7200.00000  7250.00000  1.381193082456e-03
7250.00000  7300.00000  1.370323252321e-03
7300.00000  7350.00000  1.382642393141e-03
7350.00000  7400.00000  1.355467817804e-03
7400.00000  7450.00000  1.334452812877e-03
7450.00000  7500.00000  1.297133062747e-03
7500.00000  7550.00000  1.289524181653e-03
7550.00000  7600.00000  1.271407798095e-03
7600.00000  7650.00000  1.247856499470e-03
7650.00000  7700.00000  1.292785130693e-03
7700.00000  7750.00000  1.242783912074e-03
7750.00000  7800.00000  1.226116839200e-03
7800.00000  7850.00000  1.223580545502e-03
7850.00000  7900.00000  1.198579936192e-03
7900.00000  7950.00000  1.172130016198e-03
7950.00000  8000.00000  1.194232004138e-03
8000.00000  8050.00000  1.176115620580e-03
8050.00000  8100.00000  1.164158807432e-03
8100.00000  8150.00000  1.114882244155e-03
8150.00000  8200.00000  1.129375351001e-03
8200.00000  8250.00000  1.098939826624e-03
8250.00000  8300.00000  1.098215171281e-03
8300.00000  8350.00000  1.085896030462e-03
8350.00000  8400.00000  1.095678877583e-03
8400.00000  8450.00000  1.062344731837e-03
8450.00000  8500.00000  1.063431714850e-03
8500.00000  8550.00000  1.047851624990e-03
8550.00000  8600.00000  1.057996799783e-03
8600.00000  8650.00000  1.019590066640e-03
8650.00000  8700.00000  1.031546879788e-03
8700.00000  8750.00000  9.793716951413e-04
8750.00000  8800.00000  1.025387309378e-03
8800.00000  8850.00000  9.992997170550e-04
8850.00000  8900.00000  9.851689378798e-04
8900.00000  8950.00000  9.601683285699e-04
8950.00000  9000.00000  9.449505663813e-04
9000.00000  9050.00000  9.514724644621e-04
9050.00000  9100.00000  9.069061609096e-04
9100.00000  9150.00000  9.333560809042e-04
9150.00000  9200.00000  9.250225444675e-04
9200.00000  9250.00000  9.224862507694e-04
9250.00000  9300.00000  9.108917652924e-04
9300.00000  9350.00000  8.728473598207e-04
9350.00000  9400.00000  8.913260710498e-04
9400.00000  9450.00000  8.844418452978e-04
9450.00000  9500.00000  8.540063209205e-04
9500.00000  9550.00000  8.848041729690e-04
9550.00000  9600.00000  8.764706365323e-04
9600.00000  9650.00000  8.583542529744e-04
9650.00000  9700.00000  8.449481291415e-04
9700.00000  9750.00000  8.380639033895e-04
9750.00000  9800.00000  8.235707965432e-04
9800.00000  9850.00000  8.166865707912e-04
9850.00000  9900.00000  7.869757017562e-04
9900.00000  9950.00000  8.014688086025e-04
9950.00000  10000.00000  8.069037236699e-04
