300.00000  350.00000  2.845851233203e-04
350.00000  400.00000  2.777058391687e-04
400.00000  450.00000  2.389646073681e-04
450.00000  500.00000  2.128957411098e-04
500.00000  550.00000  2.588783246488e-04
550.00000  600.00000  9.594791053418e-05
600.00000  650.00000  1.274477905963e-04
650.00000  700.00000  9.920651881647e-05
700.00000  750.00000  9.522377536034e-05
750.00000  800.00000  8.255140981809e-05
800.00000  850.00000  1.632924817016e-04
850.00000  900.00000  7.386178773197e-05
900.00000  950.00000  8.581001810038e-05
950.00000  1000.00000  8.291347740501e-05
1000.00000  1050.00000  6.879284151507e-05
1050.00000  1100.00000  7.132731462352e-05
1100.00000  1150.00000  7.168938221044e-05
1150.00000  1200.00000  8.110313947040e-05
1200.00000  1250.00000  7.675832842734e-05
1250.00000  1300.00000  1.285339933571e-04
1300.00000  1350.00000  7.168938221044e-05
1350.00000  1400.00000  6.879284151507e-05
1400.00000  1450.00000  7.893073394887e-05
1450.00000  1500.00000  8.653415327422e-05
1500.00000  1550.00000  8.074107188348e-05
1550.00000  1600.00000  8.725828844807e-05
1600.00000  1650.00000  1.082582084895e-04
1650.00000  1700.00000  9.993065399032e-05
1700.00000  1750.00000  1.955164969376e-04
1750.00000  1800.00000  1.158616278149e-04
1800.00000  1850.00000  1.183961009233e-04
1850.00000  1900.00000  1.183961009233e-04
1900.00000  1950.00000  1.310684664656e-04
1950.00000  2000.00000  1.299822637048e-04
2000.00000  2050.00000  1.350512099217e-04
2050.00000  2100.00000  1.480856430509e-04
2100.00000  2150.00000  1.498959809855e-04
2150.00000  2200.00000  1.509821837462e-04
2200.00000  2250.00000  1.850165369169e-04
2250.00000  2300.00000  1.784993203523e-04
2300.00000  2350.00000  3.280332337508e-04
2350.00000  2400.00000  2.110854031752e-04
2400.00000  2450.00000  2.186888225005e-04
2450.00000  2500.00000  2.233957011305e-04
2500.00000  2550.00000  2.103612680014e-04
2550.00000  2600.00000  2.400508101289e-04
2600.00000  2650.00000  2.451197563458e-04
2650.00000  2700.00000  2.433094184112e-04
2700.00000  2750.00000  2.722748253649e-04
2750.00000  2800.00000  2.653955412134e-04
2800.00000  2850.00000  2.939988805802e-04
2850.00000  2900.00000  3.171712061432e-04
2900.00000  2950.00000  3.215160171862e-04
2950.00000  3000.00000  3.569986407045e-04
3000.00000  3050.00000  3.541021000092e-04
3050.00000  3100.00000  3.410676668800e-04
3100.00000  3150.00000  3.779985607460e-04
3150.00000  3200.00000  4.058777649389e-04
3200.00000  3250.00000  3.718434117683e-04
3250.00000  3300.00000  4.279638877411e-04
3300.00000  3350.00000  4.377397125880e-04
3350.00000  3400.00000  4.431707263918e-04
3400.00000  3450.00000  4.703257954109e-04
3450.00000  3500.00000  4.916877830393e-04
3500.00000  3550.00000  4.880671071701e-04
3550.00000  3600.00000  5.387565693391e-04
3600.00000  3650.00000  5.452737859037e-04
3650.00000  3700.00000  5.778598687266e-04
3700.00000  3750.00000  5.478082590121e-04
3750.00000  3800.00000  5.782219363135e-04
3800.00000  3850.00000  6.100838839626e-04
3850.00000  3900.00000  6.303596688302e-04
3900.00000  3950.00000  6.104459515495e-04
3950.00000  4000.00000  6.723595089131e-04
4000.00000  4050.00000  6.477389130025e-04
4050.00000  4100.00000  6.669284951093e-04
4100.00000  4150.00000  6.977042399976e-04
4150.00000  4200.00000  6.853939420423e-04
4200.00000  4250.00000  6.940835641284e-04
4250.00000  4300.00000  7.154455517568e-04
4300.00000  4350.00000  7.426006207759e-04
4350.00000  4400.00000  7.701177573819e-04
4400.00000  4450.00000  7.712039601427e-04
4450.00000  4500.00000  7.791694470549e-04
4500.00000  4550.00000  8.121175974648e-04
4550.00000  4600.00000  7.871349339672e-04
4600.00000  4650.00000  7.885832043149e-04
4650.00000  4700.00000  8.157382733340e-04
4700.00000  4750.00000  8.088589891825e-04
4750.00000  4800.00000  8.208072195509e-04
4800.00000  4850.00000  8.432554099400e-04
4850.00000  4900.00000  8.476002209831e-04
4900.00000  4950.00000  8.208072195509e-04
4950.00000  5000.00000  8.577381134169e-04
5000.00000  5050.00000  8.606346541123e-04
5050.00000  5100.00000  8.436174775270e-04
5100.00000  5150.00000  8.932207369352e-04
5150.00000  5200.00000  8.403588692447e-04
5200.00000  5250.00000  8.867035203706e-04
5250.00000  5300.00000  8.504967616785e-04
5300.00000  5350.00000  8.671518706768e-04
5350.00000  5400.00000  8.649794651553e-04
5400.00000  5450.00000  9.243585494104e-04
5450.00000  5500.00000  9.279792252796e-04
5500.00000  5550.00000  9.019103590213e-04
5550.00000  5600.00000  9.008241562605e-04
5600.00000  5650.00000  8.783759658714e-04
5650.00000  5700.00000  8.993758859129e-04
5700.00000  5750.00000  9.174792652589e-04
5750.00000  5800.00000  9.029965617821e-04
5800.00000  5850.00000  9.011862238475e-04
5850.00000  5900.00000  8.932207369352e-04
5900.00000  5950.00000  8.993758859129e-04
5950.00000  6000.00000  8.559277754823e-04
6000.00000  6050.00000  9.019103590213e-04
6050.00000  6100.00000  8.754794251760e-04
6100.00000  6150.00000  8.935828045221e-04
6150.00000  6200.00000  8.733070196545e-04
6200.00000  6250.00000  8.990138183259e-04
6250.00000  6300.00000  9.102379135205e-04
6300.00000  6350.00000  9.174792652589e-04
6350.00000  6400.00000  2.143802182162e-03
6400.00000  6450.00000  8.396347340708e-04
6450.00000  6500.00000  8.323933823324e-04
6500.00000  6550.00000  8.769276955237e-04
6550.00000  6600.00000  8.392726664839e-04
6600.00000  6650.00000  8.396347340708e-04
6650.00000  6700.00000  8.276865037024e-04
6700.00000  6750.00000  8.461519506354e-04
6750.00000  6800.00000  8.273244361155e-04
6800.00000  6850.00000  8.052383133133e-04
6850.00000  6900.00000  8.124796650517e-04
6900.00000  6950.00000  8.056003809002e-04
6950.00000  7000.00000  8.313071795716e-04
7000.00000  7050.00000  8.175486112686e-04
7050.00000  7100.00000  8.997379534998e-04
7100.00000  7150.00000  5.782219363135e-04
7150.00000  7200.00000  5.293428120791e-04
7200.00000  7250.00000  5.217393927538e-04
7250.00000  7300.00000  5.398427720999e-04
7300.00000  7350.00000  5.550496107506e-04
7350.00000  7400.00000  5.387565693391e-04
7400.00000  7450.00000  5.300669472530e-04
7450.00000  7500.00000  5.641013004236e-04
7500.00000  7550.00000  5.445496507298e-04
7550.00000  7600.00000  5.336876231222e-04
7600.00000  7650.00000  5.094290947985e-04
7650.00000  7700.00000  5.271704065576e-04
7700.00000  7750.00000  5.170325141238e-04
7750.00000  7800.00000  5.050842837554e-04
7800.00000  7850.00000  5.271704065576e-04
7850.00000  7900.00000  5.268083389707e-04
7900.00000  7950.00000  5.340496907091e-04
7950.00000  8000.00000  5.264462713838e-04
8000.00000  8050.00000  5.387565693391e-04
8050.00000  8100.00000  5.195669872323e-04
8100.00000  8150.00000  4.797395526709e-04
8150.00000  8200.00000  5.047222161685e-04
8200.00000  8250.00000  4.887912423439e-04
8250.00000  8300.00000  5.101532299723e-04
8300.00000  8350.00000  4.963946616693e-04
8350.00000  8400.00000  5.021877430600e-04
8400.00000  8450.00000  4.612741057379e-04
8450.00000  8500.00000  4.696016602371e-04
8500.00000  8550.00000  4.790154174971e-04
8550.00000  8600.00000  4.815498906055e-04
8600.00000  8650.00000  4.985670671908e-04
8650.00000  8700.00000  4.815498906055e-04
8700.00000  8750.00000  4.963946616693e-04
8750.00000  8800.00000  4.887912423439e-04
8800.00000  8850.00000  4.927739858001e-04
8850.00000  8900.00000  4.743085388671e-04
8900.00000  8950.00000  4.706878629979e-04
8950.00000  9000.00000  5.032739458208e-04
9000.00000  9050.00000  4.677913223025e-04
9050.00000  9100.00000  4.616361733248e-04
9100.00000  9150.00000  4.486017401957e-04
9150.00000  9200.00000  4.294121580888e-04
9200.00000  9250.00000  4.706878629979e-04
9250.00000  9300.00000  4.659809843679e-04
9300.00000  9350.00000  4.507741457172e-04
9350.00000  9400.00000  4.377397125880e-04
9400.00000  9450.00000  4.576534298687e-04
9450.00000  9500.00000  4.366535098273e-04
9500.00000  9550.00000  4.583775650425e-04
9550.00000  9600.00000  4.471534698480e-04
9600.00000  9650.00000  4.493258753695e-04
9650.00000  9700.00000  4.337569691319e-04
9700.00000  9750.00000  4.152915221989e-04
9750.00000  9800.00000  4.152915221989e-04
9800.00000  9850.00000  4.435327939788e-04
9850.00000  9900.00000  4.254294146327e-04
9900.00000  9950.00000  4.297742256757e-04
9950.00000  10000.00000  4.435327939788e-04
