300.00000  350.00000  0.000000000000e+00
350.00000  400.00000  0.000000000000e+00
400.00000  450.00000  0.000000000000e+00
450.00000  500.00000  0.000000000000e+00
500.00000  550.00000  3.990652079909e-06
550.00000  600.00000  0.000000000000e+00
600.00000  650.00000  1.596260831964e-06
650.00000  700.00000  0.000000000000e+00
700.00000  750.00000  2.394391247945e-06
750.00000  800.00000  7.981304159818e-07
800.00000  850.00000  7.183173743836e-06
850.00000  900.00000  2.394391247945e-06
900.00000  950.00000  2.394391247945e-06
950.00000  1000.00000  3.990652079909e-06
1000.00000  1050.00000  5.586912911872e-06
1050.00000  1100.00000  6.385043327854e-06
1100.00000  1150.00000  3.990652079909e-06
1150.00000  1200.00000  3.192521663927e-06
1200.00000  1250.00000  3.990652079909e-06
1250.00000  1300.00000  1.516447790365e-05
1300.00000  1350.00000  6.385043327854e-06
1350.00000  1400.00000  7.183173743836e-06
1400.00000  1450.00000  7.981304159818e-06
1450.00000  1500.00000  7.183173743836e-06
1500.00000  1550.00000  2.394391247945e-06
1550.00000  1600.00000  1.197195623973e-05
1600.00000  1650.00000  4.788782495891e-06
1650.00000  1700.00000  1.037569540776e-05
1700.00000  1750.00000  4.150278163105e-05
1750.00000  1800.00000  1.277008665571e-05
1800.00000  1850.00000  1.835699956758e-05
1850.00000  1900.00000  8.779434575799e-06
1900.00000  1950.00000  1.037569540776e-05
1950.00000  2000.00000  1.037569540776e-05
2000.00000  2050.00000  1.037569540776e-05
2050.00000  2100.00000  1.117382582374e-05
2100.00000  2150.00000  1.835699956758e-05
2150.00000  2200.00000  1.277008665571e-05
2200.00000  2250.00000  1.755886915160e-05
2250.00000  2300.00000  1.676073873562e-05
2300.00000  2350.00000  4.469530329498e-05
2350.00000  2400.00000  1.516447790365e-05
2400.00000  2450.00000  1.277008665571e-05
2450.00000  2500.00000  1.835699956758e-05
2500.00000  2550.00000  1.835699956758e-05
2550.00000  2600.00000  1.356821707169e-05
2600.00000  2650.00000  1.915512998356e-05
2650.00000  2700.00000  1.037569540776e-05
2700.00000  2750.00000  1.197195623973e-05
2750.00000  2800.00000  1.596260831964e-05
2800.00000  2850.00000  1.596260831964e-05
2850.00000  2900.00000  1.516447790365e-05
2900.00000  2950.00000  2.234765164749e-05
2950.00000  3000.00000  2.633830372740e-05
3000.00000  3050.00000  2.234765164749e-05
3050.00000  3100.00000  1.915512998356e-05
3100.00000  3150.00000  1.676073873562e-05
3150.00000  3200.00000  1.995326039954e-05
3200.00000  3250.00000  2.154952123151e-05
3250.00000  3300.00000  1.277008665571e-05
3300.00000  3350.00000  1.436634748767e-05
3350.00000  3400.00000  1.755886915160e-05
3400.00000  3450.00000  2.234765164749e-05
3450.00000  3500.00000  1.915512998356e-05
3500.00000  3550.00000  2.474204289543e-05
3550.00000  3600.00000  1.436634748767e-05
3600.00000  3650.00000  1.835699956758e-05
3650.00000  3700.00000  2.633830372740e-05
3700.00000  3750.00000  1.995326039954e-05
3750.00000  3800.00000  1.596260831964e-05
3800.00000  3850.00000  2.873269497534e-05
3850.00000  3900.00000  1.755886915160e-05
3900.00000  3950.00000  1.755886915160e-05
3950.00000  4000.00000  2.394391247945e-05
4000.00000  4050.00000  2.154952123151e-05
4050.00000  4100.00000  1.835699956758e-05
4100.00000  4150.00000  1.516447790365e-05
4150.00000  4200.00000  1.835699956758e-05
4200.00000  4250.00000  1.915512998356e-05
4250.00000  4300.00000  1.356821707169e-05
4300.00000  4350.00000  1.755886915160e-05
4350.00000  4400.00000  2.474204289543e-05
4400.00000  4450.00000  1.676073873562e-05
4450.00000  4500.00000  1.915512998356e-05
4500.00000  4550.00000  1.676073873562e-05
4550.00000  4600.00000  1.596260831964e-05
4600.00000  4650.00000  2.075139081553e-05
4650.00000  4700.00000  2.554017331142e-05
4700.00000  4750.00000  2.394391247945e-05
4750.00000  4800.00000  2.314578206347e-05
4800.00000  4850.00000  2.154952123151e-05
4850.00000  4900.00000  1.516447790365e-05
4900.00000  4950.00000  1.516447790365e-05
4950.00000  5000.00000  3.032895580731e-05
5000.00000  5050.00000  2.394391247945e-05
5050.00000  5100.00000  2.234765164749e-05
5100.00000  5150.00000  1.277008665571e-05
5150.00000  5200.00000  1.995326039954e-05
5200.00000  5250.00000  1.516447790365e-05
5250.00000  5300.00000  2.953082539133e-05
5300.00000  5350.00000  1.755886915160e-05
5350.00000  5400.00000  2.554017331142e-05
5400.00000  5450.00000  2.075139081553e-05
5450.00000  5500.00000  2.314578206347e-05
5500.00000  5550.00000  1.915512998356e-05
5550.00000  5600.00000  2.953082539133e-05
5600.00000  5650.00000  1.596260831964e-05
5650.00000  5700.00000  1.516447790365e-05
5700.00000  5750.00000  1.516447790365e-05
5750.00000  5800.00000  1.676073873562e-05
5800.00000  5850.00000  2.793456455936e-05
5850.00000  5900.00000  2.154952123151e-05
5900.00000  5950.00000  1.676073873562e-05
5950.00000  6000.00000  1.915512998356e-05
6000.00000  6050.00000  1.117382582374e-05
6050.00000  6100.00000  2.953082539133e-05
6100.00000  6150.00000  2.554017331142e-05
6150.00000  6200.00000  2.713643414338e-05
6200.00000  6250.00000  2.554017331142e-05
6250.00000  6300.00000  4.230091204703e-05
6300.00000  6350.00000  5.826352036667e-05
6350.00000  6400.00000  2.713643414338e-04
6400.00000  6450.00000  1.835699956758e-05
6450.00000  6500.00000  2.075139081553e-05
6500.00000  6550.00000  2.234765164749e-05
6550.00000  6600.00000  2.633830372740e-05
6600.00000  6650.00000  1.596260831964e-05
6650.00000  6700.00000  2.234765164749e-05
6700.00000  6750.00000  2.075139081553e-05
6750.00000  6800.00000  2.075139081553e-05
6800.00000  6850.00000  2.633830372740e-05
6850.00000  6900.00000  1.835699956758e-05
6900.00000  6950.00000  1.755886915160e-05
6950.00000  7000.00000  2.075139081553e-05
7000.00000  7050.00000  2.075139081553e-05
7050.00000  7100.00000  4.389717287900e-05
7100.00000  7150.00000  5.586912911872e-06
7150.00000  7200.00000  1.356821707169e-05
7200.00000  7250.00000  9.577564991781e-06
7250.00000  7300.00000  1.277008665571e-05
7300.00000  7350.00000  6.385043327854e-06
7350.00000  7400.00000  5.586912911872e-06
7400.00000  7450.00000  4.788782495891e-06
7450.00000  7500.00000  2.075139081553e-05
7500.00000  7550.00000  6.385043327854e-06
7550.00000  7600.00000  1.037569540776e-05
7600.00000  7650.00000  1.197195623973e-05
7650.00000  7700.00000  1.037569540776e-05
7700.00000  7750.00000  1.197195623973e-05
7750.00000  7800.00000  1.516447790365e-05
7800.00000  7850.00000  1.037569540776e-05
7850.00000  7900.00000  6.385043327854e-06
7900.00000  7950.00000  8.779434575799e-06
7950.00000  8000.00000  1.117382582374e-05
8000.00000  8050.00000  7.183173743836e-06
8050.00000  8100.00000  5.586912911872e-06
8100.00000  8150.00000  7.183173743836e-06
8150.00000  8200.00000  1.037569540776e-05
8200.00000  8250.00000  1.277008665571e-05
8250.00000  8300.00000  1.356821707169e-05
8300.00000  8350.00000  8.779434575799e-06
8350.00000  8400.00000  1.037569540776e-05
8400.00000  8450.00000  1.117382582374e-05
8450.00000  8500.00000  1.117382582374e-05
8500.00000  8550.00000  1.037569540776e-05
8550.00000  8600.00000  1.037569540776e-05
8600.00000  8650.00000  1.117382582374e-05
8650.00000  8700.00000  5.586912911872e-06
8700.00000  8750.00000  8.779434575799e-06
8750.00000  8800.00000  6.385043327854e-06
8800.00000  8850.00000  1.676073873562e-05
8850.00000  8900.00000  1.277008665571e-05
8900.00000  8950.00000  6.385043327854e-06
8950.00000  9000.00000  7.183173743836e-06
9000.00000  9050.00000  8.779434575799e-06
9050.00000  9100.00000  8.779434575799e-06
9100.00000  9150.00000  1.037569540776e-05
9150.00000  9200.00000  1.755886915160e-05
9200.00000  9250.00000  8.779434575799e-06
9250.00000  9300.00000  1.277008665571e-05
9300.00000  9350.00000  1.037569540776e-05
9350.00000  9400.00000  5.586912911872e-06
9400.00000  9450.00000  3.990652079909e-06
9450.00000  9500.00000  4.788782495891e-06
9500.00000  9550.00000  1.037569540776e-05
9550.00000  9600.00000  1.117382582374e-05
9600.00000  9650.00000  7.981304159818e-06
9650.00000  9700.00000  1.117382582374e-05
9700.00000  9750.00000  1.197195623973e-05
9750.00000  9800.00000  7.183173743836e-06
9800.00000  9850.00000  8.779434575799e-06
9850.00000  9900.00000  1.037569540776e-05
9900.00000  9950.00000  7.981304159818e-06
9950.00000  10000.00000  1.197195623973e-05
