300.00000  350.00000  5.994189428636e-06
350.00000  400.00000  1.566223689418e-05
400.00000  450.00000  1.218173980658e-05
450.00000  500.00000  1.237510075589e-05
500.00000  550.00000  9.880744509785e-05
550.00000  600.00000  9.281325566921e-06
600.00000  650.00000  3.190455663629e-05
650.00000  700.00000  9.668047465543e-06
700.00000  750.00000  2.417011866386e-05
750.00000  800.00000  1.527551499556e-05
800.00000  850.00000  6.922321985329e-05
850.00000  900.00000  1.546887594487e-05
900.00000  950.00000  1.508215404625e-05
950.00000  1000.00000  1.469543214762e-05
1000.00000  1050.00000  1.546887594487e-05
1050.00000  1100.00000  1.701576353936e-05
1100.00000  1150.00000  1.778920733660e-05
1150.00000  1200.00000  2.107634347488e-05
1200.00000  1250.00000  2.242987012006e-05
1250.00000  1300.00000  7.135019029570e-05
1300.00000  1350.00000  2.881078144732e-05
1350.00000  1400.00000  4.273276979770e-05
1400.00000  1450.00000  5.626803624946e-05
1450.00000  1500.00000  8.546553959540e-05
1500.00000  1550.00000  1.067352440196e-04
1550.00000  1600.00000  1.397999663517e-04
1600.00000  1650.00000  1.958746416519e-04
1650.00000  1700.00000  2.579435063807e-04
1700.00000  1750.00000  3.975501117831e-04
1750.00000  1800.00000  4.106986563363e-04
1800.00000  1850.00000  4.484040414519e-04
1850.00000  1900.00000  4.513044556915e-04
1900.00000  1950.00000  5.588131435084e-04
1950.00000  2000.00000  6.377044108272e-04
2000.00000  2050.00000  7.394122701647e-04
2050.00000  2100.00000  8.161765670411e-04
2100.00000  2150.00000  8.701242718988e-04
2150.00000  2200.00000  1.000836273633e-03
2200.00000  2250.00000  1.050336676657e-03
2250.00000  2300.00000  1.106991434805e-03
2300.00000  2350.00000  1.306346573544e-03
2350.00000  2400.00000  1.202318382815e-03
2400.00000  2450.00000  1.308473543987e-03
2450.00000  2500.00000  1.237703436539e-03
2500.00000  2550.00000  1.209086016041e-03
2550.00000  2600.00000  1.241183933626e-03
2600.00000  2650.00000  1.278695957793e-03
2650.00000  2700.00000  1.301899271710e-03
2700.00000  2750.00000  1.323362337083e-03
2750.00000  2800.00000  1.317561508604e-03
2800.00000  2850.00000  1.332643662650e-03
2850.00000  2900.00000  1.333223745498e-03
2900.00000  2950.00000  1.318141591452e-03
2950.00000  3000.00000  1.374216266752e-03
3000.00000  3050.00000  1.312727484871e-03
3050.00000  3100.00000  1.318141591452e-03
3100.00000  3150.00000  1.281596372032e-03
3150.00000  3200.00000  1.294938277535e-03
3200.00000  3250.00000  1.248531649700e-03
3250.00000  3300.00000  1.221074394898e-03
3300.00000  3350.00000  1.217593897810e-03
3350.00000  3400.00000  1.202511743764e-03
3400.00000  3450.00000  1.198837885727e-03
3450.00000  3500.00000  1.167320050990e-03
3500.00000  3550.00000  1.124974003091e-03
3550.00000  3600.00000  1.110278570943e-03
3600.00000  3650.00000  1.092876085505e-03
3650.00000  3700.00000  1.098096831136e-03
3700.00000  3750.00000  1.037961575901e-03
3750.00000  3800.00000  1.029647055080e-03
3800.00000  3850.00000  9.818869006005e-04
3850.00000  3900.00000  9.704786045912e-04
3900.00000  3950.00000  9.644844151625e-04
3950.00000  4000.00000  9.277458347935e-04
4000.00000  4050.00000  9.159508168855e-04
4050.00000  4100.00000  8.985483314475e-04
4100.00000  4150.00000  8.668371357606e-04
4150.00000  4200.00000  8.273915021011e-04
4200.00000  4250.00000  7.947135016676e-04
4250.00000  4300.00000  8.121159871056e-04
4300.00000  4350.00000  7.554612289575e-04
4350.00000  4400.00000  7.548811461096e-04
4400.00000  4450.00000  7.262637256116e-04
4450.00000  4500.00000  6.947458908739e-04
4500.00000  4550.00000  6.823707901180e-04
4550.00000  4600.00000  6.632280561362e-04
4600.00000  4650.00000  6.583940324035e-04
4650.00000  4700.00000  6.533666477214e-04
4700.00000  4750.00000  6.257160319699e-04
4750.00000  4800.00000  6.174015111496e-04
4800.00000  4850.00000  5.955517238774e-04
4850.00000  4900.00000  5.912977829926e-04
4900.00000  4950.00000  5.843367888174e-04
4950.00000  5000.00000  5.425708237663e-04
5000.00000  5050.00000  5.298090011117e-04
5050.00000  5100.00000  5.226546459872e-04
5100.00000  5150.00000  4.988712492220e-04
5150.00000  5200.00000  4.911368112496e-04
5200.00000  5250.00000  4.737343258116e-04
5250.00000  5300.00000  4.727675210650e-04
5300.00000  5350.00000  4.526579823367e-04
5350.00000  5400.00000  4.663866097378e-04
5400.00000  5450.00000  4.368023844932e-04
5450.00000  5500.00000  4.234604789908e-04
5500.00000  5550.00000  4.224936742442e-04
5550.00000  5600.00000  3.942629756448e-04
5600.00000  5650.00000  3.948430584928e-04
5650.00000  5700.00000  4.047044669076e-04
5700.00000  5750.00000  3.753136026124e-04
5750.00000  5800.00000  3.894289519121e-04
5800.00000  5850.00000  3.656455551468e-04
5850.00000  5900.00000  3.569443124278e-04
5900.00000  5950.00000  3.447625726213e-04
5950.00000  6000.00000  3.474696259116e-04
6000.00000  6050.00000  3.306472233216e-04
6050.00000  6100.00000  3.223327025012e-04
6100.00000  6150.00000  3.043501342153e-04
6150.00000  6200.00000  3.018364418742e-04
6200.00000  6250.00000  2.952621695977e-04
6250.00000  6300.00000  2.937152820032e-04
6300.00000  6350.00000  2.894613411183e-04
6350.00000  6400.00000  8.534952302581e-04
6400.00000  6450.00000  2.730256604269e-04
6450.00000  6500.00000  2.745725480214e-04
6500.00000  6550.00000  2.647111396066e-04
6550.00000  6600.00000  2.480820979658e-04
6600.00000  6650.00000  2.567833406848e-04
6650.00000  6700.00000  2.492422636617e-04
6700.00000  6750.00000  2.440215180303e-04
6750.00000  6800.00000  2.353202753113e-04
6800.00000  6850.00000  2.254588668965e-04
6850.00000  6900.00000  2.212049260116e-04
6900.00000  6950.00000  2.235252574033e-04
6950.00000  7000.00000  2.128904051912e-04
7000.00000  7050.00000  1.954879197533e-04
7050.00000  7100.00000  2.610372815697e-04
7100.00000  7150.00000  1.865933160850e-04
7150.00000  7200.00000  1.740248543798e-04
7200.00000  7250.00000  1.662904164073e-04
7250.00000  7300.00000  1.800190438084e-04
7300.00000  7350.00000  1.695775525456e-04
7350.00000  7400.00000  1.699642744442e-04
7400.00000  7450.00000  1.639700850156e-04
7450.00000  7500.00000  1.923941445643e-04
7500.00000  7550.00000  1.626165583704e-04
7550.00000  7600.00000  1.670638602046e-04
7600.00000  7650.00000  1.556555641952e-04
7650.00000  7700.00000  1.535285937528e-04
7700.00000  7750.00000  1.543020375501e-04
7750.00000  7800.00000  1.604895879280e-04
7800.00000  7850.00000  1.485012090707e-04
7850.00000  7900.00000  1.434738243887e-04
7900.00000  7950.00000  1.363194692642e-04
7950.00000  8000.00000  1.399933273011e-04
8000.00000  8050.00000  1.368995521121e-04
8050.00000  8100.00000  1.289717531903e-04
8100.00000  8150.00000  1.341924988217e-04
8150.00000  8200.00000  1.235576466096e-04
8200.00000  8250.00000  1.214306761672e-04
8250.00000  8300.00000  1.305186407848e-04
8300.00000  8350.00000  1.218173980658e-04
8350.00000  8400.00000  1.164032914851e-04
8400.00000  8450.00000  1.154364867386e-04
8450.00000  8500.00000  1.098290192086e-04
8500.00000  8550.00000  1.216240371165e-04
8550.00000  8600.00000  1.202705104714e-04
8600.00000  8650.00000  1.136962381948e-04
8650.00000  8700.00000  1.165966524344e-04
8700.00000  8750.00000  1.061551611717e-04
8750.00000  8800.00000  1.102157411072e-04
8800.00000  8850.00000  9.880744509785e-05
8850.00000  8900.00000  9.590703085818e-05
8900.00000  8950.00000  1.107958239551e-04
8950.00000  9000.00000  1.078954097155e-04
9000.00000  9050.00000  1.030613859827e-04
9050.00000  9100.00000  1.007410545910e-04
9100.00000  9150.00000  1.003543326923e-04
9150.00000  9200.00000  1.028680250334e-04
9200.00000  9250.00000  9.378006041576e-05
9250.00000  9300.00000  9.648711370612e-05
9300.00000  9350.00000  8.797923193644e-05
9350.00000  9400.00000  8.875267573368e-05
9400.00000  9450.00000  8.295184725436e-05
9450.00000  9500.00000  8.275848630504e-05
9500.00000  9550.00000  8.662570529126e-05
9550.00000  9600.00000  9.378006041576e-05
9600.00000  9650.00000  8.082487681194e-05
9650.00000  9700.00000  8.681906624057e-05
9700.00000  9750.00000  8.043815491331e-05
9750.00000  9800.00000  8.391865200091e-05
9800.00000  9850.00000  7.792446257227e-05
9850.00000  9900.00000  7.966471111607e-05
9900.00000  9950.00000  7.715101877503e-05
9950.00000  10000.00000  7.657093592710e-05
