10001.00000  11001.00000  4.032098004291e-04
11001.00000  12001.00000  3.409720265962e-04
12001.00000  13001.00000  2.847269850465e-04
13001.00000  14001.00000  2.451063604632e-04
14001.00000  15001.00000  2.074893301071e-04
15001.00000  16001.00000  1.876158414209e-04
16001.00000  17001.00000  1.627243419674e-04
17001.00000  18001.00000  1.429230548750e-04
18001.00000  19001.00000  1.278870729716e-04
19001.00000  20001.00000  1.127247382791e-04
20001.00000  21001.00000  1.031219263072e-04
21001.00000  22001.00000  9.274294720228e-05
22001.00000  23001.00000  8.164195215958e-05
23001.00000  24001.00000  7.368172644603e-05
24001.00000  25001.00000  6.821245571768e-05
25001.00000  26001.00000  6.324859614574e-05
26001.00000  27001.00000  5.711146067498e-05
27001.00000  28001.00000  5.294181863455e-05
28001.00000  29001.00000  5.180464353261e-05
29001.00000  30001.00000  4.536065128831e-05
30001.00000  31001.00000  4.305020028755e-05
31001.00000  32001.00000  4.025238852882e-05
32001.00000  33001.00000  3.561343612886e-05
33001.00000  34001.00000  3.391669867518e-05
34001.00000  35001.00000  3.178675165886e-05
35001.00000  36001.00000  2.945825025966e-05
36001.00000  37001.00000  2.718390005579e-05
37001.00000  38001.00000  2.736440404022e-05
38001.00000  39001.00000  2.449439068772e-05
39001.00000  40001.00000  2.335721558578e-05
40001.00000  41001.00000  2.337526598423e-05
41001.00000  42001.00000  2.218393968696e-05
42001.00000  43001.00000  2.070380701460e-05
43001.00000  44001.00000  1.871826318582e-05
44001.00000  45001.00000  1.758108808389e-05
45001.00000  46001.00000  1.722008011502e-05
46001.00000  47001.00000  1.617315700530e-05
47001.00000  48001.00000  1.532478827846e-05
48001.00000  49001.00000  1.438616755940e-05
49001.00000  50001.00000  1.453057074695e-05
50001.00000  51001.00000  1.353779883256e-05
51001.00000  52001.00000  1.281578289483e-05
52001.00000  53001.00000  1.223817014464e-05
53001.00000  54001.00000  1.133565022247e-05
54001.00000  55001.00000  1.131759982402e-05
55001.00000  56001.00000  1.128149902714e-05
56001.00000  57001.00000  1.137175101935e-05
57001.00000  58001.00000  9.783315956333e-06
58001.00000  59001.00000  9.656963167229e-06
59001.00000  60001.00000  8.375384877746e-06
60001.00000  61001.00000  8.591989659067e-06
61001.00000  62001.00000  8.537838463737e-06
62001.00000  63001.00000  8.194880893312e-06
63001.00000  64001.00000  7.797772127557e-06
64001.00000  65001.00000  7.743620932227e-06
65001.00000  66001.00000  7.436764158688e-06
66001.00000  67001.00000  6.805000213169e-06
67001.00000  68001.00000  6.841101010056e-06
68001.00000  69001.00000  5.830278697224e-06
69001.00000  70001.00000  5.631724314347e-06
70001.00000  71001.00000  5.740026705007e-06
71001.00000  72001.00000  5.740026705007e-06
72001.00000  73001.00000  5.830278697224e-06
73001.00000  74001.00000  5.740026705007e-06
74001.00000  75001.00000  4.981909970384e-06
75001.00000  76001.00000  5.018010767270e-06
76001.00000  77001.00000  4.693103595289e-06
77001.00000  78001.00000  3.953037259109e-06
78001.00000  79001.00000  4.476498813968e-06
79001.00000  80001.00000  4.151591641986e-06
80001.00000  81001.00000  3.989138055995e-06
81001.00000  82001.00000  4.458448415524e-06
82001.00000  83001.00000  4.332095626420e-06
83001.00000  84001.00000  4.458448415524e-06
84001.00000  85001.00000  3.303222915146e-06
85001.00000  86001.00000  3.357374110476e-06
86001.00000  87001.00000  3.158819727598e-06
87001.00000  88001.00000  3.212970922928e-06
88001.00000  89001.00000  3.772533274674e-06
89001.00000  90001.00000  3.303222915146e-06
90001.00000  91001.00000  2.906114149390e-06
91001.00000  92001.00000  3.176870126042e-06
92001.00000  93001.00000  3.465676501136e-06
93001.00000  94001.00000  3.032466938494e-06
94001.00000  95001.00000  3.212970922928e-06
95001.00000  96001.00000  3.050517336938e-06
96001.00000  97001.00000  2.635358172739e-06
97001.00000  98001.00000  2.382652594531e-06
98001.00000  99001.00000  2.364602196088e-06
99001.00000  100001.00000  2.942214946277e-06
100001.00000  101001.00000  2.166047813210e-06
101001.00000  102001.00000  2.815862157173e-06
102001.00000  103001.00000  2.184098211654e-06
103001.00000  104001.00000  2.003594227219e-06
104001.00000  105001.00000  1.768939047455e-06
105001.00000  106001.00000  1.859191039672e-06
106001.00000  107001.00000  2.147997414767e-06
107001.00000  108001.00000  1.732838250568e-06
108001.00000  109001.00000  2.057745422550e-06
109001.00000  110001.00000  1.534283867691e-06
110001.00000  111001.00000  2.021644625663e-06
111001.00000  112001.00000  1.768939047455e-06
112001.00000  113001.00000  1.877241438116e-06
113001.00000  114001.00000  1.949443031889e-06
114001.00000  115001.00000  2.003594227219e-06
115001.00000  116001.00000  1.949443031889e-06
116001.00000  117001.00000  1.895291836559e-06
117001.00000  118001.00000  1.642586258351e-06
118001.00000  119001.00000  1.498183070804e-06
119001.00000  120001.00000  1.534283867691e-06
120001.00000  121001.00000  1.245477492596e-06
121001.00000  122001.00000  1.353779883256e-06
122001.00000  123001.00000  1.281578289483e-06
123001.00000  124001.00000  1.534283867691e-06
124001.00000  125001.00000  1.064973508162e-06
125001.00000  126001.00000  1.281578289483e-06
126001.00000  127001.00000  1.083023906605e-06
127001.00000  128001.00000  1.119124703492e-06
128001.00000  129001.00000  1.389880680143e-06
129001.00000  130001.00000  8.844695237275e-07
130001.00000  131001.00000  8.483687268407e-07
131001.00000  132001.00000  1.263527891039e-06
132001.00000  133001.00000  1.209376695709e-06
133001.00000  134001.00000  9.927719143880e-07
134001.00000  135001.00000  1.209376695709e-06
135001.00000  136001.00000  1.010822312831e-06
136001.00000  137001.00000  9.386207190578e-07
137001.00000  138001.00000  9.025199221709e-07
138001.00000  139001.00000  1.245477492596e-06
139001.00000  140001.00000  9.205703206143e-07
140001.00000  141001.00000  1.155225500379e-06
141001.00000  142001.00000  9.747215159446e-07
142001.00000  143001.00000  6.317639455196e-07
143001.00000  144001.00000  9.927719143880e-07
144001.00000  145001.00000  9.386207190578e-07
145001.00000  146001.00000  9.025199221709e-07
146001.00000  147001.00000  4.332095626420e-07
147001.00000  148001.00000  7.581167346236e-07
148001.00000  149001.00000  7.581167346236e-07
149001.00000  150001.00000  6.317639455196e-07
150001.00000  151001.00000  7.581167346236e-07
151001.00000  152001.00000  7.400663361802e-07
152001.00000  153001.00000  7.581167346236e-07
153001.00000  154001.00000  4.693103595289e-07
154001.00000  155001.00000  4.873607579723e-07
155001.00000  156001.00000  7.039655392933e-07
156001.00000  157001.00000  7.942175315104e-07
157001.00000  158001.00000  7.581167346236e-07
158001.00000  159001.00000  4.873607579723e-07
159001.00000  160001.00000  5.776127501894e-07
160001.00000  161001.00000  7.400663361802e-07
161001.00000  162001.00000  5.234615548591e-07
162001.00000  163001.00000  6.498143439631e-07
163001.00000  164001.00000  6.859151408499e-07
164001.00000  165001.00000  5.234615548591e-07
165001.00000  166001.00000  4.512599610855e-07
166001.00000  167001.00000  5.776127501894e-07
167001.00000  168001.00000  5.234615548591e-07
168001.00000  169001.00000  6.678647424065e-07
169001.00000  170001.00000  4.693103595289e-07
170001.00000  171001.00000  4.512599610855e-07
171001.00000  172001.00000  4.512599610855e-07
172001.00000  173001.00000  5.234615548591e-07
173001.00000  174001.00000  4.512599610855e-07
174001.00000  175001.00000  5.415119533026e-07
175001.00000  176001.00000  4.873607579723e-07
176001.00000  177001.00000  3.790583673118e-07
177001.00000  178001.00000  4.693103595289e-07
178001.00000  179001.00000  3.971087657552e-07
179001.00000  180001.00000  3.790583673118e-07
180001.00000  181001.00000  3.971087657552e-07
181001.00000  182001.00000  3.790583673118e-07
182001.00000  183001.00000  4.873607579723e-07
183001.00000  184001.00000  3.610079688684e-07
184001.00000  185001.00000  3.790583673118e-07
185001.00000  186001.00000  2.166047813210e-07
186001.00000  187001.00000  2.527055782079e-07
187001.00000  188001.00000  2.346551797644e-07
188001.00000  189001.00000  3.790583673118e-07
189001.00000  190001.00000  3.068567735381e-07
190001.00000  191001.00000  4.332095626420e-07
191001.00000  192001.00000  3.429575704250e-07
192001.00000  193001.00000  3.971087657552e-07
193001.00000  194001.00000  3.068567735381e-07
194001.00000  195001.00000  2.527055782079e-07
195001.00000  196001.00000  3.790583673118e-07
196001.00000  197001.00000  1.444031875473e-07
197001.00000  198001.00000  3.429575704250e-07
198001.00000  199001.00000  2.707559766513e-07
