300.00000  350.00000  1.174915159304e-01
350.00000  400.00000  9.297172238700e-02
400.00000  450.00000  7.610227007204e-02
450.00000  500.00000  6.360571294060e-02
500.00000  550.00000  5.433241959674e-02
550.00000  600.00000  4.697640413050e-02
600.00000  650.00000  4.095269167065e-02
650.00000  700.00000  3.618678161335e-02
700.00000  750.00000  3.225063412561e-02
750.00000  800.00000  2.904014187011e-02
800.00000  850.00000  2.627878182636e-02
850.00000  900.00000  2.387657274554e-02
900.00000  950.00000  2.179074934599e-02
950.00000  1000.00000  1.995474485439e-02
1000.00000  1050.00000  1.838771656887e-02
1050.00000  1100.00000  1.706799158650e-02
1100.00000  1150.00000  1.587327281214e-02
1150.00000  1200.00000  1.485174375321e-02
1200.00000  1250.00000  1.394477146693e-02
1250.00000  1300.00000  1.309159442188e-02
1300.00000  1350.00000  1.231175693230e-02
1350.00000  1400.00000  1.148663855622e-02
1400.00000  1450.00000  1.086044646782e-02
1450.00000  1500.00000  1.030101466077e-02
1500.00000  1550.00000  9.731133418387e-03
1550.00000  1600.00000  9.317800198102e-03
1600.00000  1650.00000  8.874086212094e-03
1650.00000  1700.00000  8.405216178035e-03
1700.00000  1750.00000  8.047226263463e-03
1750.00000  1800.00000  7.706652074464e-03
1800.00000  1850.00000  7.240297645211e-03
1850.00000  1900.00000  6.982544906719e-03
1900.00000  1950.00000  6.724211644041e-03
1950.00000  2000.00000  6.445173018736e-03
2000.00000  2050.00000  6.145429030805e-03
2050.00000  2100.00000  5.938181896477e-03
2100.00000  2150.00000  5.670560246826e-03
2150.00000  2200.00000  5.488662668611e-03
2200.00000  2250.00000  5.358818759056e-03
2250.00000  2300.00000  5.131253278225e-03
2300.00000  2350.00000  4.995410618749e-03
2350.00000  2400.00000  4.809642879295e-03
2400.00000  2450.00000  4.617876389922e-03
2450.00000  2500.00000  4.484162319127e-03
2500.00000  2550.00000  4.355672966005e-03
2550.00000  2600.00000  4.214218572734e-03
2600.00000  2650.00000  4.101209864566e-03
2650.00000  2700.00000  3.933438374872e-03
2700.00000  2750.00000  3.851003940489e-03
2750.00000  2800.00000  3.681103862114e-03
2800.00000  2850.00000  3.634081403064e-03
2850.00000  2900.00000  3.508301162809e-03
2900.00000  2950.00000  3.394711930456e-03
2950.00000  3000.00000  3.297957899490e-03
3000.00000  3050.00000  3.249580884007e-03
3050.00000  3100.00000  3.165017860944e-03
3100.00000  3150.00000  3.095354958648e-03
3150.00000  3200.00000  3.031110282087e-03
3200.00000  3250.00000  2.945386210652e-03
3250.00000  3300.00000  2.856566010226e-03
3300.00000  3350.00000  2.834506091165e-03
3350.00000  3400.00000  2.757876898641e-03
3400.00000  3450.00000  2.681441214178e-03
3450.00000  3500.00000  2.611971819945e-03
3500.00000  3550.00000  2.573657223682e-03
3550.00000  3600.00000  2.468001821868e-03
3600.00000  3650.00000  2.397371379263e-03
3650.00000  3700.00000  2.384212831052e-03
3700.00000  3750.00000  2.319194122243e-03
3750.00000  3800.00000  2.302358920855e-03
3800.00000  3850.00000  2.220698518720e-03
3850.00000  3900.00000  2.196316502917e-03
3900.00000  3950.00000  2.118719770083e-03
3950.00000  4000.00000  2.097240375208e-03
4000.00000  4050.00000  2.023707311675e-03
4050.00000  4100.00000  2.016741021445e-03
4100.00000  4150.00000  1.980748521926e-03
4150.00000  4200.00000  1.970492594643e-03
4200.00000  4250.00000  1.908763522888e-03
4250.00000  4300.00000  1.901797232658e-03
4300.00000  4350.00000  1.824781024009e-03
4350.00000  4400.00000  1.786079411623e-03
4400.00000  4450.00000  1.767115621554e-03
4450.00000  4500.00000  1.753957073343e-03
4500.00000  4550.00000  1.698613767630e-03
4550.00000  4600.00000  1.667458969660e-03
4600.00000  4650.00000  1.660105663306e-03
4650.00000  4700.00000  1.584056994967e-03
4700.00000  4750.00000  1.579993325667e-03
4750.00000  4800.00000  1.553676229244e-03
4800.00000  4850.00000  1.519038286158e-03
4850.00000  4900.00000  1.518651270035e-03
4900.00000  4950.00000  1.450536432235e-03
4950.00000  5000.00000  1.455567641845e-03
5000.00000  5050.00000  1.448601351616e-03
5050.00000  5100.00000  1.411060787601e-03
5100.00000  5150.00000  1.386678771798e-03
5150.00000  5200.00000  1.393645062027e-03
5200.00000  5250.00000  1.326110748413e-03
5250.00000  5300.00000  1.320305506555e-03
5300.00000  5350.00000  1.332303006395e-03
5350.00000  5400.00000  1.310630103459e-03
5400.00000  5450.00000  1.285087039284e-03
5450.00000  5500.00000  1.245224378526e-03
5500.00000  5550.00000  1.263027120224e-03
5550.00000  5600.00000  1.214263088617e-03
5600.00000  5650.00000  1.196847363043e-03
5650.00000  5700.00000  1.170530266621e-03
5700.00000  5750.00000  1.166079581196e-03
5750.00000  5800.00000  1.160661355462e-03
5800.00000  5850.00000  1.153114541047e-03
5850.00000  5900.00000  1.115573977032e-03
5900.00000  5950.00000  1.118476597961e-03
5950.00000  6000.00000  1.101834904635e-03
6000.00000  6050.00000  1.088095832238e-03
6050.00000  6100.00000  1.098738775644e-03
6100.00000  6150.00000  1.081323050070e-03
6150.00000  6200.00000  1.064294340621e-03
6200.00000  6250.00000  1.056167002019e-03
6250.00000  6300.00000  1.087321799990e-03
6300.00000  6350.00000  1.060037163258e-03
6350.00000  6400.00000  1.781048202013e-03
6400.00000  6450.00000  9.698624063982e-04
6450.00000  6500.00000  9.553493017534e-04
6500.00000  6550.00000  9.654117209738e-04
6550.00000  6600.00000  9.481895034620e-04
6600.00000  6650.00000  9.338699068791e-04
6650.00000  6700.00000  9.286451892069e-04
6700.00000  6750.00000  9.009735363508e-04
6750.00000  6800.00000  9.087138588280e-04
6800.00000  6850.00000  9.011670444127e-04
6850.00000  6900.00000  8.868474478298e-04
6900.00000  6950.00000  8.839448269009e-04
6950.00000  7000.00000  8.814292220958e-04
7000.00000  7050.00000  8.647875287697e-04
7050.00000  7100.00000  9.373530519938e-04
7100.00000  7150.00000  8.313106340556e-04
7150.00000  7200.00000  8.229897873926e-04
7200.00000  7250.00000  7.794504734581e-04
7250.00000  7300.00000  7.976402312796e-04
7300.00000  7350.00000  7.831271266348e-04
7350.00000  7400.00000  7.637763204417e-04
7400.00000  7450.00000  7.746127719098e-04
7450.00000  7500.00000  7.786764412104e-04
7500.00000  7550.00000  7.364916837094e-04
7550.00000  7600.00000  7.277838209225e-04
7600.00000  7650.00000  7.368786998333e-04
7650.00000  7700.00000  7.188824500737e-04
7700.00000  7750.00000  7.250747080555e-04
7750.00000  7800.00000  7.012732164380e-04
7800.00000  7850.00000  7.142382565874e-04
7850.00000  7900.00000  7.039823293050e-04
7900.00000  7950.00000  6.939199100846e-04
7950.00000  8000.00000  6.525091848314e-04
8000.00000  8050.00000  6.881146682267e-04
8050.00000  8100.00000  6.596689831228e-04
8100.00000  8150.00000  6.619910798660e-04
8150.00000  8200.00000  6.639261604853e-04
8200.00000  8250.00000  6.544442654507e-04
8250.00000  8300.00000  6.521221687075e-04
8300.00000  8350.00000  6.314168060809e-04
8350.00000  8400.00000  6.389636204962e-04
8400.00000  8450.00000  6.283206770900e-04
8450.00000  8500.00000  6.136140643832e-04
8500.00000  8550.00000  6.356739834434e-04
8550.00000  8600.00000  6.089698708969e-04
8600.00000  8650.00000  6.062607580299e-04
8650.00000  8700.00000  5.890385405180e-04
8700.00000  8750.00000  6.008425322958e-04
8750.00000  8800.00000  6.083893467111e-04
8800.00000  8850.00000  5.834268067220e-04
8850.00000  8900.00000  5.745254358732e-04
8900.00000  8950.00000  5.942632581901e-04
8950.00000  9000.00000  5.710422907584e-04
9000.00000  9050.00000  5.679461617675e-04
9050.00000  9100.00000  5.449187023977e-04
9100.00000  9150.00000  5.528525329369e-04
9150.00000  9200.00000  5.478213233267e-04
9200.00000  9250.00000  5.362108396108e-04
9250.00000  9300.00000  5.385329363540e-04
9300.00000  9350.00000  5.420160814688e-04
9350.00000  9400.00000  5.362108396108e-04
9400.00000  9450.00000  5.282770090717e-04
9450.00000  9500.00000  5.410485411591e-04
9500.00000  9550.00000  5.095067270644e-04
9550.00000  9600.00000  5.246003558950e-04
9600.00000  9650.00000  5.114418076837e-04
9650.00000  9700.00000  5.118288238075e-04
9700.00000  9750.00000  5.164730172939e-04
9750.00000  9800.00000  4.982832594724e-04
9800.00000  9850.00000  5.060235819496e-04
9850.00000  9900.00000  4.835766467656e-04
9900.00000  9950.00000  4.944130982337e-04
9950.00000  10000.00000  4.764168484742e-04
