10001.00000  11001.00000  1.055079227130e-04
11001.00000  12001.00000  9.131905952660e-05
12001.00000  13001.00000  8.008782041040e-05
13001.00000  14001.00000  6.891457392302e-05
14001.00000  15001.00000  6.170415707217e-05
15001.00000  16001.00000  5.349820009311e-05
16001.00000  17001.00000  4.741863950439e-05
17001.00000  18001.00000  4.237328079642e-05
18001.00000  19001.00000  3.613907319750e-05
19001.00000  20001.00000  3.469892291496e-05
20001.00000  21001.00000  3.007884348505e-05
21001.00000  22001.00000  2.735318993017e-05
22001.00000  23001.00000  2.339036029365e-05
23001.00000  24001.00000  2.231749666034e-05
24001.00000  25001.00000  2.051005972856e-05
25001.00000  26001.00000  1.879927717816e-05
26001.00000  27001.00000  1.789072599320e-05
27001.00000  28001.00000  1.630559413859e-05
28001.00000  29001.00000  1.423719037708e-05
29001.00000  30001.00000  1.394722723295e-05
30001.00000  31001.00000  1.330930831585e-05
31001.00000  32001.00000  1.214945573930e-05
32001.00000  33001.00000  1.132789349758e-05
33001.00000  34001.00000  1.049666581773e-05
34001.00000  35001.00000  1.015837548290e-05
35001.00000  36001.00000  8.950195715668e-06
36001.00000  37001.00000  8.959861153806e-06
37001.00000  38001.00000  8.350938551120e-06
38001.00000  39001.00000  7.838670329813e-06
39001.00000  40001.00000  6.920453706715e-06
40001.00000  41001.00000  7.055769840646e-06
41001.00000  42001.00000  6.785137572785e-06
42001.00000  43001.00000  6.369523732857e-06
43001.00000  44001.00000  5.712273939482e-06
44001.00000  45001.00000  5.915248140377e-06
45001.00000  46001.00000  5.596288681827e-06
46001.00000  47001.00000  5.093685898658e-06
47001.00000  48001.00000  4.948704326590e-06
48001.00000  49001.00000  4.620079429902e-06
49001.00000  50001.00000  4.629744868040e-06
50001.00000  51001.00000  4.136807523009e-06
51001.00000  52001.00000  3.962829636527e-06
52001.00000  53001.00000  3.450561415220e-06
53001.00000  54001.00000  3.469892291496e-06
54001.00000  55001.00000  3.556881234736e-06
55001.00000  56001.00000  3.721193683080e-06
56001.00000  57001.00000  3.750189997494e-06
57001.00000  58001.00000  3.208925461773e-06
58001.00000  59001.00000  2.938293193913e-06
59001.00000  60001.00000  3.034947575291e-06
60001.00000  61001.00000  3.083274765981e-06
61001.00000  62001.00000  2.677326364190e-06
62001.00000  63001.00000  2.725653554880e-06
63001.00000  64001.00000  2.657995487914e-06
64001.00000  65001.00000  2.339036029365e-06
65001.00000  66001.00000  2.319705153089e-06
66001.00000  67001.00000  2.455021287019e-06
67001.00000  68001.00000  2.078069199642e-06
68001.00000  69001.00000  1.962083941988e-06
69001.00000  70001.00000  2.087734637780e-06
70001.00000  71001.00000  1.739778864817e-06
71001.00000  72001.00000  1.894425875023e-06
72001.00000  73001.00000  1.884760436885e-06
73001.00000  74001.00000  1.498142911370e-06
74001.00000  75001.00000  1.759109741092e-06
75001.00000  76001.00000  1.594797292749e-06
76001.00000  77001.00000  1.536804663921e-06
77001.00000  78001.00000  1.314499586750e-06
78001.00000  79001.00000  1.382157653715e-06
79001.00000  80001.00000  1.449815720681e-06
80001.00000  81001.00000  1.333830463026e-06
81001.00000  82001.00000  1.362826777440e-06
82001.00000  83001.00000  1.459481158818e-06
83001.00000  84001.00000  1.072863633304e-06
84001.00000  85001.00000  1.198514329096e-06
85001.00000  86001.00000  1.362826777440e-06
86001.00000  87001.00000  1.333830463026e-06
87001.00000  88001.00000  9.955401282007e-07
88001.00000  89001.00000  1.072863633304e-06
89001.00000  90001.00000  9.568783756492e-07
90001.00000  91001.00000  9.568783756492e-07
91001.00000  92001.00000  1.092194509579e-06
92001.00000  93001.00000  1.169518014682e-06
93001.00000  94001.00000  9.278820612356e-07
94001.00000  95001.00000  8.892203086841e-07
95001.00000  96001.00000  7.345732984782e-07
96001.00000  97001.00000  8.118968035811e-07
97001.00000  98001.00000  6.475843552373e-07
98001.00000  99001.00000  6.862461077888e-07
99001.00000  100001.00000  8.698894324084e-07
100001.00000  101001.00000  7.635696128918e-07
101001.00000  102001.00000  6.669152315131e-07
102001.00000  103001.00000  6.959115459267e-07
103001.00000  104001.00000  6.475843552373e-07
104001.00000  105001.00000  5.799262882722e-07
105001.00000  106001.00000  5.799262882722e-07
106001.00000  107001.00000  6.959115459267e-07
107001.00000  108001.00000  6.959115459267e-07
108001.00000  109001.00000  6.669152315131e-07
109001.00000  110001.00000  5.219336594450e-07
110001.00000  111001.00000  5.412645357208e-07
111001.00000  112001.00000  5.219336594450e-07
112001.00000  113001.00000  4.929373450314e-07
113001.00000  114001.00000  5.026027831693e-07
114001.00000  115001.00000  4.446101543420e-07
115001.00000  116001.00000  5.605954119965e-07
116001.00000  117001.00000  4.252792780663e-07
117001.00000  118001.00000  3.769520873770e-07
118001.00000  119001.00000  4.059484017906e-07
119001.00000  120001.00000  3.672866492391e-07
120001.00000  121001.00000  4.542755924799e-07
121001.00000  122001.00000  3.189594585497e-07
122001.00000  123001.00000  4.542755924799e-07
123001.00000  124001.00000  3.092940204119e-07
124001.00000  125001.00000  3.092940204119e-07
125001.00000  126001.00000  3.479557729633e-07
126001.00000  127001.00000  2.899631441361e-07
127001.00000  128001.00000  2.126396390332e-07
128001.00000  129001.00000  2.416359534468e-07
129001.00000  130001.00000  2.802977059982e-07
130001.00000  131001.00000  2.802977059982e-07
131001.00000  132001.00000  2.706322678604e-07
132001.00000  133001.00000  2.029742008953e-07
133001.00000  134001.00000  3.286248966876e-07
134001.00000  135001.00000  2.223050771710e-07
135001.00000  136001.00000  1.933087627574e-07
136001.00000  137001.00000  2.899631441361e-07
137001.00000  138001.00000  1.836433246195e-07
138001.00000  139001.00000  1.836433246195e-07
139001.00000  140001.00000  2.319705153089e-07
140001.00000  141001.00000  2.223050771710e-07
141001.00000  142001.00000  1.159852576544e-07
142001.00000  143001.00000  1.739778864817e-07
143001.00000  144001.00000  1.643124483438e-07
144001.00000  145001.00000  1.449815720681e-07
145001.00000  146001.00000  1.159852576544e-07
146001.00000  147001.00000  1.739778864817e-07
147001.00000  148001.00000  1.739778864817e-07
148001.00000  149001.00000  1.836433246195e-07
149001.00000  150001.00000  1.353161339302e-07
150001.00000  151001.00000  1.159852576544e-07
151001.00000  152001.00000  1.353161339302e-07
152001.00000  153001.00000  1.353161339302e-07
153001.00000  154001.00000  1.739778864817e-07
154001.00000  155001.00000  1.159852576544e-07
155001.00000  156001.00000  2.319705153089e-07
156001.00000  157001.00000  1.063198195166e-07
157001.00000  158001.00000  1.063198195166e-07
158001.00000  159001.00000  1.256506957923e-07
159001.00000  160001.00000  1.353161339302e-07
160001.00000  161001.00000  1.739778864817e-07
161001.00000  162001.00000  1.546470102059e-07
162001.00000  163001.00000  9.665438137871e-08
163001.00000  164001.00000  9.665438137871e-08
164001.00000  165001.00000  1.159852576544e-07
165001.00000  166001.00000  1.836433246195e-07
166001.00000  167001.00000  1.546470102059e-07
167001.00000  168001.00000  7.732350510296e-08
168001.00000  169001.00000  1.256506957923e-07
169001.00000  170001.00000  6.765806696509e-08
170001.00000  171001.00000  1.159852576544e-07
171001.00000  172001.00000  1.449815720681e-07
172001.00000  173001.00000  4.832719068935e-08
173001.00000  174001.00000  3.866175255148e-08
174001.00000  175001.00000  5.799262882722e-08
175001.00000  176001.00000  6.765806696509e-08
176001.00000  177001.00000  3.866175255148e-08
177001.00000  178001.00000  1.353161339302e-07
178001.00000  179001.00000  8.698894324084e-08
179001.00000  180001.00000  2.899631441361e-08
180001.00000  181001.00000  5.799262882722e-08
181001.00000  182001.00000  4.832719068935e-08
182001.00000  183001.00000  1.933087627574e-08
183001.00000  184001.00000  6.765806696509e-08
184001.00000  185001.00000  2.899631441361e-08
185001.00000  186001.00000  3.866175255148e-08
186001.00000  187001.00000  4.832719068935e-08
187001.00000  188001.00000  1.933087627574e-08
188001.00000  189001.00000  3.866175255148e-08
189001.00000  190001.00000  1.933087627574e-08
190001.00000  191001.00000  2.899631441361e-08
191001.00000  192001.00000  5.799262882722e-08
192001.00000  193001.00000  9.665438137871e-09
193001.00000  194001.00000  1.933087627574e-08
194001.00000  195001.00000  1.933087627574e-08
195001.00000  196001.00000  0.000000000000e+00
196001.00000  197001.00000  1.933087627574e-08
197001.00000  198001.00000  0.000000000000e+00
198001.00000  199001.00000  0.000000000000e+00
