300.00000  350.00000  3.412889836002e-01
350.00000  400.00000  2.551898942562e-01
400.00000  450.00000  1.993457616632e-01
450.00000  500.00000  1.590809801571e-01
500.00000  550.00000  1.306011987263e-01
550.00000  600.00000  1.083800994379e-01
600.00000  650.00000  9.187449098917e-02
650.00000  700.00000  7.875874484142e-02
700.00000  750.00000  6.827798484599e-02
750.00000  800.00000  5.963303716780e-02
800.00000  850.00000  5.284677684164e-02
850.00000  900.00000  4.672752348281e-02
900.00000  950.00000  4.182718269298e-02
950.00000  1000.00000  3.758586076308e-02
1000.00000  1050.00000  3.391641470336e-02
1050.00000  1100.00000  3.098369000276e-02
1100.00000  1150.00000  2.833272763565e-02
1150.00000  1200.00000  2.570609268651e-02
1200.00000  1250.00000  2.358815493999e-02
1250.00000  1300.00000  2.204100377628e-02
1300.00000  1350.00000  2.024259032548e-02
1350.00000  1400.00000  1.891039186980e-02
1400.00000  1450.00000  1.759743749102e-02
1450.00000  1500.00000  1.636363799459e-02
1500.00000  1550.00000  1.535858884623e-02
1550.00000  1600.00000  1.436552185896e-02
1600.00000  1650.00000  1.336446676430e-02
1650.00000  1700.00000  1.264263233261e-02
1700.00000  1750.00000  1.196691106632e-02
1750.00000  1800.00000  1.124943378411e-02
1800.00000  1850.00000  1.072984370777e-02
1850.00000  1900.00000  1.007627128471e-02
1900.00000  1950.00000  9.602794373774e-03
1950.00000  2000.00000  9.096638841690e-03
2000.00000  2050.00000  8.648578636100e-03
2050.00000  2100.00000  8.322881711939e-03
2100.00000  2150.00000  7.824351191457e-03
2150.00000  2200.00000  7.468154220887e-03
2200.00000  2250.00000  7.118492974547e-03
2250.00000  2300.00000  6.921331960256e-03
2300.00000  2350.00000  6.660992278402e-03
2350.00000  2400.00000  6.289182188836e-03
2400.00000  2450.00000  6.009598430080e-03
2450.00000  2500.00000  5.823693385298e-03
2500.00000  2550.00000  5.594943037225e-03
2550.00000  2600.00000  5.228579384518e-03
2600.00000  2650.00000  5.133085191592e-03
2650.00000  2700.00000  4.945727763647e-03
2700.00000  2750.00000  4.778340604185e-03
2750.00000  2800.00000  4.680667836515e-03
2800.00000  2850.00000  4.466078224276e-03
2850.00000  2900.00000  4.223167140370e-03
2900.00000  2950.00000  4.036535904006e-03
2950.00000  3000.00000  4.058321651442e-03
3000.00000  3050.00000  3.829934399159e-03
3050.00000  3100.00000  3.761672390528e-03
3100.00000  3150.00000  3.631321001706e-03
3150.00000  3200.00000  3.510773199230e-03
3200.00000  3250.00000  3.400755174680e-03
3250.00000  3300.00000  3.330314591306e-03
3300.00000  3350.00000  3.118992841181e-03
3350.00000  3400.00000  3.167647677121e-03
3400.00000  3450.00000  3.038385575670e-03
3450.00000  3500.00000  2.944706861697e-03
3500.00000  3550.00000  2.836141220310e-03
3550.00000  3600.00000  2.814718568666e-03
3600.00000  3650.00000  2.691629095655e-03
3650.00000  3700.00000  2.629539715464e-03
3700.00000  3750.00000  2.578343208990e-03
3750.00000  3800.00000  2.519884786705e-03
3800.00000  3850.00000  2.449444203330e-03
3850.00000  3900.00000  2.383360769443e-03
3900.00000  3950.00000  2.255551051155e-03
3950.00000  4000.00000  2.204354544681e-03
4000.00000  4050.00000  2.167681869831e-03
4050.00000  4100.00000  2.177848551968e-03
4100.00000  4150.00000  2.090705562226e-03
4150.00000  4200.00000  2.066378144256e-03
4200.00000  4250.00000  1.965437514472e-03
4250.00000  4300.00000  1.922229115392e-03
4300.00000  4350.00000  1.941473192293e-03
4350.00000  4400.00000  1.841258754090e-03
4400.00000  4450.00000  1.805675366612e-03
4450.00000  4500.00000  1.778080086527e-03
4500.00000  4550.00000  1.736687166399e-03
4550.00000  4600.00000  1.718169281079e-03
4600.00000  4650.00000  1.665883487234e-03
4650.00000  4700.00000  1.613960789179e-03
4700.00000  4750.00000  1.592538137534e-03
4750.00000  4800.00000  1.596895287022e-03
4800.00000  4850.00000  1.541341631061e-03
4850.00000  4900.00000  1.479615346660e-03
4900.00000  4950.00000  1.477799867708e-03
4950.00000  5000.00000  1.460371269759e-03
5000.00000  5050.00000  1.459281982387e-03
5050.00000  5100.00000  1.386662824269e-03
5100.00000  5150.00000  1.390656877966e-03
5150.00000  5200.00000  1.332924647262e-03
5200.00000  5250.00000  1.310775804035e-03
5250.00000  5300.00000  1.321305581963e-03
5300.00000  5350.00000  1.313317474570e-03
5350.00000  5400.00000  1.217097090063e-03
5400.00000  5450.00000  1.214918515319e-03
5450.00000  5500.00000  1.200757779486e-03
5500.00000  5550.00000  1.165900583589e-03
5550.00000  5600.00000  1.176793457307e-03
5600.00000  5650.00000  1.175341074145e-03
5650.00000  5700.00000  1.134674345599e-03
5700.00000  5750.00000  1.071132582245e-03
5750.00000  5800.00000  1.095460000215e-03
5800.00000  5850.00000  1.031555141071e-03
5850.00000  5900.00000  1.054430175878e-03
5900.00000  5950.00000  1.059513516946e-03
5950.00000  6000.00000  1.011584872588e-03
6000.00000  6050.00000  1.018483692609e-03
6050.00000  6100.00000  9.716443356229e-04
6100.00000  6150.00000  9.618407492770e-04
6150.00000  6200.00000  9.738229103665e-04
6200.00000  6250.00000  9.494954923969e-04
6250.00000  6300.00000  9.698288566700e-04
6300.00000  6350.00000  9.560312166275e-04
6350.00000  6400.00000  1.613597693389e-03
6400.00000  6450.00000  8.652572689796e-04
6450.00000  6500.00000  8.645310773984e-04
6500.00000  6550.00000  8.500072457748e-04
6550.00000  6600.00000  8.235012530616e-04
6600.00000  6650.00000  8.540012994713e-04
6650.00000  6700.00000  8.369357973135e-04
6700.00000  6750.00000  7.966321645578e-04
6750.00000  6800.00000  8.176917204121e-04
6800.00000  6850.00000  7.875547697930e-04
6850.00000  6900.00000  7.759357044941e-04
6900.00000  6950.00000  7.813821413530e-04
6950.00000  7000.00000  7.625011602422e-04
7000.00000  7050.00000  7.628642560328e-04
7050.00000  7100.00000  8.340310309888e-04
7100.00000  7150.00000  7.312749222513e-04
7150.00000  7200.00000  6.920605768675e-04
7200.00000  7250.00000  6.659176799449e-04
7250.00000  7300.00000  6.539355188553e-04
7300.00000  7350.00000  6.873403315898e-04
7350.00000  7400.00000  6.782629368250e-04
7400.00000  7450.00000  6.368700166975e-04
7450.00000  7500.00000  6.597450515048e-04
7500.00000  7550.00000  6.129056945185e-04
7550.00000  7600.00000  6.248878556080e-04
7600.00000  7650.00000  6.212568977021e-04
7650.00000  7700.00000  6.009235334290e-04
7700.00000  7750.00000  5.947509049889e-04
7750.00000  7800.00000  5.914830428736e-04
7800.00000  7850.00000  5.755068280876e-04
7850.00000  7900.00000  5.711496786005e-04
7900.00000  7950.00000  5.776854028311e-04
7950.00000  8000.00000  5.602568048827e-04
8000.00000  8050.00000  5.479115480026e-04
8050.00000  8100.00000  5.580782301392e-04
8100.00000  8150.00000  5.508163143274e-04
8150.00000  8200.00000  5.410127279814e-04
8200.00000  8250.00000  5.391972490284e-04
8250.00000  8300.00000  5.108757773623e-04
8300.00000  8350.00000  5.264888963577e-04
8350.00000  8400.00000  5.192269805459e-04
8400.00000  8450.00000  4.948995625763e-04
8450.00000  8500.00000  4.894531257174e-04
8500.00000  8550.00000  4.985305204822e-04
8550.00000  8600.00000  4.745661983031e-04
8600.00000  8650.00000  5.047031489222e-04
8650.00000  8700.00000  4.898162215080e-04
8700.00000  8750.00000  4.901793172986e-04
8750.00000  8800.00000  4.702090488160e-04
8800.00000  8850.00000  4.582268877265e-04
8850.00000  8900.00000  4.433399603123e-04
8900.00000  8950.00000  4.560483129830e-04
8950.00000  9000.00000  4.248220749921e-04
9000.00000  9050.00000  4.476971097994e-04
9050.00000  9100.00000  4.415244813593e-04
9100.00000  9150.00000  4.248220749921e-04
9150.00000  9200.00000  4.092089559967e-04
9200.00000  9250.00000  4.273637455262e-04
9250.00000  9300.00000  4.266375539451e-04
9300.00000  9350.00000  4.164708718085e-04
9350.00000  9400.00000  4.030363275566e-04
9400.00000  9450.00000  4.284530328980e-04
9450.00000  9500.00000  3.990422738601e-04
9500.00000  9550.00000  3.994053696507e-04
9550.00000  9600.00000  3.979529864883e-04
9600.00000  9650.00000  3.899648790953e-04
9650.00000  9700.00000  3.827029632835e-04
9700.00000  9750.00000  3.888755917235e-04
9750.00000  9800.00000  3.718100895657e-04
9800.00000  9850.00000  3.747148558905e-04
9850.00000  9900.00000  3.467564800149e-04
9900.00000  9950.00000  3.696315148222e-04
9950.00000  10000.00000  3.532922042456e-04
