300.00000  350.00000  4.010138632211e-07
350.00000  400.00000  1.604055452884e-06
400.00000  450.00000  8.020277264421e-07
450.00000  500.00000  8.020277264421e-07
500.00000  550.00000  2.526387338293e-05
550.00000  600.00000  1.604055452884e-06
600.00000  650.00000  9.223318854085e-06
650.00000  700.00000  2.205576247716e-06
700.00000  750.00000  6.616728743148e-06
750.00000  800.00000  2.005069316105e-06
800.00000  850.00000  2.386032486165e-05
850.00000  900.00000  3.809631700600e-06
900.00000  950.00000  3.609124768990e-06
950.00000  1000.00000  5.012673290263e-06
1000.00000  1050.00000  2.807097042548e-06
1050.00000  1100.00000  5.814701016706e-06
1100.00000  1150.00000  4.812166358653e-06
1150.00000  1200.00000  5.614194085095e-06
1200.00000  1250.00000  5.413687153484e-06
1250.00000  1300.00000  2.285779020360e-05
1300.00000  1350.00000  6.817235674758e-06
1350.00000  1400.00000  7.418756469590e-06
1400.00000  1450.00000  7.619263401200e-06
1450.00000  1500.00000  7.819770332811e-06
1500.00000  1550.00000  6.215714879927e-06
1550.00000  1600.00000  7.819770332811e-06
1600.00000  1650.00000  1.002534658053e-05
1650.00000  1700.00000  8.421291127643e-06
1700.00000  1750.00000  3.188060212608e-05
1750.00000  1800.00000  9.022811922474e-06
1800.00000  1850.00000  9.824839648916e-06
1850.00000  1900.00000  7.819770332811e-06
1900.00000  1950.00000  7.218249537979e-06
1950.00000  2000.00000  7.819770332811e-06
2000.00000  2050.00000  8.020277264421e-06
2050.00000  2100.00000  1.102788123858e-05
2100.00000  2150.00000  1.022585351214e-05
2150.00000  2200.00000  9.423825785695e-06
2200.00000  2250.00000  1.323345748630e-05
2250.00000  2300.00000  1.022585351214e-05
2300.00000  2350.00000  3.528921996345e-05
2350.00000  2400.00000  8.621798059253e-06
2400.00000  2450.00000  1.223092282824e-05
2450.00000  2500.00000  1.323345748630e-05
2500.00000  2550.00000  1.042636044375e-05
2550.00000  2600.00000  8.220784196032e-06
2600.00000  2650.00000  1.022585351214e-05
2650.00000  2700.00000  1.062686737536e-05
2700.00000  2750.00000  1.082737430697e-05
2750.00000  2800.00000  9.223318854085e-06
2800.00000  2850.00000  1.263193669146e-05
2850.00000  2900.00000  1.162940203341e-05
2900.00000  2950.00000  1.082737430697e-05
2950.00000  3000.00000  1.744410305012e-05
3000.00000  3050.00000  8.220784196032e-06
3050.00000  3100.00000  1.243142975985e-05
3100.00000  3150.00000  1.102788123858e-05
3150.00000  3200.00000  7.619263401200e-06
3200.00000  3250.00000  1.263193669146e-05
3250.00000  3300.00000  8.822304990864e-06
3300.00000  3350.00000  7.017742606369e-06
3350.00000  3400.00000  1.102788123858e-05
3400.00000  3450.00000  9.624332717306e-06
3450.00000  3500.00000  8.421291127643e-06
3500.00000  3550.00000  8.822304990864e-06
3550.00000  3600.00000  1.002534658053e-05
3600.00000  3650.00000  8.020277264421e-06
3650.00000  3700.00000  1.503801987079e-05
3700.00000  3750.00000  9.423825785695e-06
3750.00000  3800.00000  8.621798059253e-06
3800.00000  3850.00000  8.020277264421e-06
3850.00000  3900.00000  7.619263401200e-06
3900.00000  3950.00000  9.223318854085e-06
3950.00000  4000.00000  8.220784196032e-06
4000.00000  4050.00000  1.062686737536e-05
4050.00000  4100.00000  9.022811922474e-06
4100.00000  4150.00000  6.416221811537e-06
4150.00000  4200.00000  8.621798059253e-06
4200.00000  4250.00000  8.020277264421e-06
4250.00000  4300.00000  8.421291127643e-06
4300.00000  4350.00000  6.215714879927e-06
4350.00000  4400.00000  7.619263401200e-06
4400.00000  4450.00000  6.616728743148e-06
4450.00000  4500.00000  6.616728743148e-06
4500.00000  4550.00000  8.421291127643e-06
4550.00000  4600.00000  7.619263401200e-06
4600.00000  4650.00000  5.614194085095e-06
4650.00000  4700.00000  3.609124768990e-06
4700.00000  4750.00000  6.015207948316e-06
4750.00000  4800.00000  8.020277264421e-06
4800.00000  4850.00000  4.812166358653e-06
4850.00000  4900.00000  7.218249537979e-06
4900.00000  4950.00000  6.416221811537e-06
4950.00000  5000.00000  4.210645563821e-06
5000.00000  5050.00000  5.413687153484e-06
5050.00000  5100.00000  6.616728743148e-06
5100.00000  5150.00000  4.812166358653e-06
5150.00000  5200.00000  4.812166358653e-06
5200.00000  5250.00000  4.812166358653e-06
5250.00000  5300.00000  6.015207948316e-06
5300.00000  5350.00000  5.614194085095e-06
5350.00000  5400.00000  5.012673290263e-06
5400.00000  5450.00000  5.814701016706e-06
5450.00000  5500.00000  4.812166358653e-06
5500.00000  5550.00000  5.213180221874e-06
5550.00000  5600.00000  4.210645563821e-06
5600.00000  5650.00000  5.814701016706e-06
5650.00000  5700.00000  4.812166358653e-06
5700.00000  5750.00000  5.614194085095e-06
5750.00000  5800.00000  4.611659427042e-06
5800.00000  5850.00000  4.210645563821e-06
5850.00000  5900.00000  6.817235674758e-06
5900.00000  5950.00000  4.411152495432e-06
5950.00000  6000.00000  4.411152495432e-06
6000.00000  6050.00000  5.213180221874e-06
6050.00000  6100.00000  5.413687153484e-06
6100.00000  6150.00000  5.012673290263e-06
6150.00000  6200.00000  7.418756469590e-06
6200.00000  6250.00000  8.220784196032e-06
6250.00000  6300.00000  1.523852680240e-05
6300.00000  6350.00000  1.122838817019e-05
6350.00000  6400.00000  1.108803331806e-04
6400.00000  6450.00000  4.411152495432e-06
6450.00000  6500.00000  5.413687153484e-06
6500.00000  6550.00000  4.010138632211e-06
6550.00000  6600.00000  3.408617837379e-06
6600.00000  6650.00000  4.210645563821e-06
6650.00000  6700.00000  4.411152495432e-06
6700.00000  6750.00000  4.611659427042e-06
6750.00000  6800.00000  2.606590110937e-06
6800.00000  6850.00000  3.208110905769e-06
6850.00000  6900.00000  4.411152495432e-06
6900.00000  6950.00000  4.611659427042e-06
6950.00000  7000.00000  4.010138632211e-06
7000.00000  7050.00000  3.007603974158e-06
7050.00000  7100.00000  1.884765157139e-05
7100.00000  7150.00000  3.609124768990e-06
7150.00000  7200.00000  2.005069316105e-06
7200.00000  7250.00000  2.807097042548e-06
7250.00000  7300.00000  4.010138632211e-06
7300.00000  7350.00000  2.205576247716e-06
7350.00000  7400.00000  4.210645563821e-06
7400.00000  7450.00000  2.807097042548e-06
7450.00000  7500.00000  9.223318854085e-06
7500.00000  7550.00000  2.807097042548e-06
7550.00000  7600.00000  1.804562384495e-06
7600.00000  7650.00000  2.205576247716e-06
7650.00000  7700.00000  2.606590110937e-06
7700.00000  7750.00000  2.205576247716e-06
7750.00000  7800.00000  3.208110905769e-06
7800.00000  7850.00000  3.007603974158e-06
7850.00000  7900.00000  2.406083179326e-06
7900.00000  7950.00000  2.005069316105e-06
7950.00000  8000.00000  5.012673290263e-06
8000.00000  8050.00000  2.807097042548e-06
8050.00000  8100.00000  3.208110905769e-06
8100.00000  8150.00000  2.205576247716e-06
8150.00000  8200.00000  3.809631700600e-06
8200.00000  8250.00000  1.804562384495e-06
8250.00000  8300.00000  2.807097042548e-06
8300.00000  8350.00000  3.609124768990e-06
8350.00000  8400.00000  2.406083179326e-06
8400.00000  8450.00000  2.606590110937e-06
8450.00000  8500.00000  2.406083179326e-06
8500.00000  8550.00000  2.606590110937e-06
8550.00000  8600.00000  2.205576247716e-06
8600.00000  8650.00000  2.606590110937e-06
8650.00000  8700.00000  5.012673290263e-06
8700.00000  8750.00000  2.606590110937e-06
8750.00000  8800.00000  2.205576247716e-06
8800.00000  8850.00000  2.807097042548e-06
8850.00000  8900.00000  2.606590110937e-06
8900.00000  8950.00000  2.005069316105e-06
8950.00000  9000.00000  2.807097042548e-06
9000.00000  9050.00000  2.005069316105e-06
9050.00000  9100.00000  3.408617837379e-06
9100.00000  9150.00000  3.809631700600e-06
9150.00000  9200.00000  2.807097042548e-06
9200.00000  9250.00000  1.804562384495e-06
9250.00000  9300.00000  2.606590110937e-06
9300.00000  9350.00000  3.809631700600e-06
9350.00000  9400.00000  1.403548521274e-06
9400.00000  9450.00000  1.604055452884e-06
9450.00000  9500.00000  2.406083179326e-06
9500.00000  9550.00000  2.205576247716e-06
9550.00000  9600.00000  3.007603974158e-06
9600.00000  9650.00000  2.205576247716e-06
9650.00000  9700.00000  2.005069316105e-06
9700.00000  9750.00000  2.005069316105e-06
9750.00000  9800.00000  2.205576247716e-06
9800.00000  9850.00000  1.804562384495e-06
9850.00000  9900.00000  2.205576247716e-06
9900.00000  9950.00000  2.807097042548e-06
9950.00000  10000.00000  2.807097042548e-06
