10001.00000  11001.00000  5.000374385338e-04
11001.00000  12001.00000  4.179989972968e-04
12001.00000  13001.00000  3.505191665107e-04
13001.00000  14001.00000  2.967539687582e-04
14001.00000  15001.00000  2.522533412927e-04
15001.00000  16001.00000  2.178037176168e-04
16001.00000  17001.00000  1.907964402584e-04
17001.00000  18001.00000  1.647482281471e-04
18001.00000  19001.00000  1.435145235763e-04
19001.00000  20001.00000  1.268651508866e-04
20001.00000  21001.00000  1.116927386775e-04
21001.00000  22001.00000  9.594488732004e-05
22001.00000  23001.00000  8.794628315922e-05
23001.00000  24001.00000  8.050393684171e-05
24001.00000  25001.00000  6.962813693958e-05
25001.00000  26001.00000  6.387374545697e-05
26001.00000  27001.00000  5.593268521097e-05
27001.00000  28001.00000  5.524215823305e-05
28001.00000  29001.00000  4.906577804172e-05
29001.00000  30001.00000  4.425127050127e-05
30001.00000  31001.00000  4.018483385356e-05
31001.00000  32001.00000  3.646366069480e-05
32001.00000  33001.00000  3.258903709651e-05
33001.00000  34001.00000  3.161079054447e-05
34001.00000  35001.00000  2.702645866332e-05
35001.00000  36001.00000  2.564540470750e-05
36001.00000  37001.00000  2.319019767492e-05
37001.00000  38001.00000  2.169405588944e-05
38001.00000  39001.00000  2.073499064234e-05
39001.00000  40001.00000  1.858668448883e-05
40001.00000  41001.00000  1.663019138474e-05
41001.00000  42001.00000  1.714808661818e-05
42001.00000  43001.00000  1.463533567077e-05
43001.00000  44001.00000  1.404071521757e-05
44001.00000  45001.00000  1.248702951726e-05
45001.00000  46001.00000  1.227603516290e-05
46001.00000  47001.00000  1.104843164661e-05
47001.00000  48001.00000  1.077989337742e-05
48001.00000  49001.00000  9.360476811712e-06
49001.00000  50001.00000  9.360476811712e-06
50001.00000  51001.00000  8.420592869552e-06
51001.00000  52001.00000  8.305505039900e-06
52001.00000  53001.00000  7.691703281755e-06
53001.00000  54001.00000  6.962813693958e-06
54001.00000  55001.00000  6.847725864305e-06
55001.00000  56001.00000  5.907841922146e-06
56001.00000  57001.00000  5.965385836972e-06
57001.00000  58001.00000  4.929595370102e-06
58001.00000  59001.00000  5.370765383769e-06
59001.00000  60001.00000  5.255677554117e-06
60001.00000  61001.00000  4.661057100914e-06
61001.00000  62001.00000  5.102227114581e-06
62001.00000  63001.00000  4.411700136667e-06
63001.00000  64001.00000  4.123980562537e-06
64001.00000  65001.00000  3.625266634044e-06
65001.00000  66001.00000  3.663629243928e-06
66001.00000  67001.00000  3.222459230261e-06
67001.00000  68001.00000  3.490997499450e-06
68001.00000  69001.00000  3.280003145087e-06
69001.00000  70001.00000  2.704563996827e-06
70001.00000  71001.00000  2.570294862232e-06
71001.00000  72001.00000  2.109943543624e-06
72001.00000  73001.00000  2.531932252348e-06
73001.00000  74001.00000  2.512750947406e-06
74001.00000  75001.00000  2.282575288102e-06
75001.00000  76001.00000  2.225031373276e-06
76001.00000  77001.00000  2.263393983160e-06
77001.00000  78001.00000  1.707136139841e-06
78001.00000  79001.00000  1.611229615131e-06
79001.00000  80001.00000  1.496141785479e-06
80001.00000  81001.00000  1.534504395363e-06
81001.00000  82001.00000  1.361872650884e-06
82001.00000  83001.00000  1.361872650884e-06
83001.00000  84001.00000  1.246784821232e-06
84001.00000  85001.00000  1.150878296522e-06
85001.00000  86001.00000  1.285147431116e-06
86001.00000  87001.00000  1.093334381696e-06
87001.00000  88001.00000  1.112515686638e-06
88001.00000  89001.00000  9.015213322755e-07
89001.00000  90001.00000  1.054971771812e-06
90001.00000  91001.00000  1.016609161928e-06
91001.00000  92001.00000  7.480708927393e-07
92001.00000  93001.00000  9.782465520436e-07
93001.00000  94001.00000  9.015213322755e-07
94001.00000  95001.00000  9.974278569857e-07
95001.00000  96001.00000  8.056148075654e-07
96001.00000  97001.00000  9.015213322755e-07
97001.00000  98001.00000  8.247961125074e-07
98001.00000  99001.00000  5.754391482610e-07
99001.00000  100001.00000  7.097082828552e-07
100001.00000  101001.00000  5.370765383769e-07
101001.00000  102001.00000  4.987139284928e-07
102001.00000  103001.00000  6.905269779132e-07
103001.00000  104001.00000  4.411700136667e-07
104001.00000  105001.00000  5.562578433189e-07
105001.00000  106001.00000  6.521643680291e-07
106001.00000  107001.00000  4.028074037827e-07
107001.00000  108001.00000  4.028074037827e-07
108001.00000  109001.00000  4.603513186088e-07
109001.00000  110001.00000  3.452634889566e-07
110001.00000  111001.00000  4.028074037827e-07
111001.00000  112001.00000  3.644447938986e-07
112001.00000  113001.00000  3.644447938986e-07
113001.00000  114001.00000  3.260821840145e-07
114001.00000  115001.00000  3.836260988406e-07
115001.00000  116001.00000  4.219887087247e-07
116001.00000  117001.00000  2.301756593044e-07
117001.00000  118001.00000  3.069008790725e-07
118001.00000  119001.00000  3.644447938986e-07
119001.00000  120001.00000  3.260821840145e-07
120001.00000  121001.00000  1.534504395363e-07
121001.00000  122001.00000  2.493569642464e-07
122001.00000  123001.00000  1.918130494203e-07
123001.00000  124001.00000  5.754391482610e-08
124001.00000  125001.00000  2.301756593044e-07
125001.00000  126001.00000  1.918130494203e-07
126001.00000  127001.00000  2.685382691885e-07
127001.00000  128001.00000  2.109943543624e-07
128001.00000  129001.00000  1.726317444783e-07
129001.00000  130001.00000  1.342691345942e-07
130001.00000  131001.00000  9.590652471016e-08
131001.00000  132001.00000  1.534504395363e-07
132001.00000  133001.00000  1.918130494203e-07
133001.00000  134001.00000  1.150878296522e-07
134001.00000  135001.00000  1.918130494203e-07
135001.00000  136001.00000  1.918130494203e-08
136001.00000  137001.00000  5.754391482610e-08
137001.00000  138001.00000  1.726317444783e-07
138001.00000  139001.00000  1.342691345942e-07
139001.00000  140001.00000  7.672521976813e-08
140001.00000  141001.00000  9.590652471016e-08
141001.00000  142001.00000  1.150878296522e-07
142001.00000  143001.00000  1.342691345942e-07
143001.00000  144001.00000  7.672521976813e-08
144001.00000  145001.00000  9.590652471016e-08
145001.00000  146001.00000  1.342691345942e-07
146001.00000  147001.00000  9.590652471016e-08
147001.00000  148001.00000  1.918130494203e-08
148001.00000  149001.00000  5.754391482610e-08
149001.00000  150001.00000  7.672521976813e-08
150001.00000  151001.00000  3.836260988406e-08
151001.00000  152001.00000  1.918130494203e-08
152001.00000  153001.00000  3.836260988406e-08
153001.00000  154001.00000  1.918130494203e-08
154001.00000  155001.00000  5.754391482610e-08
155001.00000  156001.00000  3.836260988406e-08
156001.00000  157001.00000  3.836260988406e-08
157001.00000  158001.00000  1.918130494203e-08
158001.00000  159001.00000  1.918130494203e-08
159001.00000  160001.00000  7.672521976813e-08
160001.00000  161001.00000  5.754391482610e-08
161001.00000  162001.00000  1.918130494203e-08
162001.00000  163001.00000  9.590652471016e-08
163001.00000  164001.00000  3.836260988406e-08
164001.00000  165001.00000  5.754391482610e-08
165001.00000  166001.00000  1.918130494203e-08
166001.00000  167001.00000  5.754391482610e-08
167001.00000  168001.00000  7.672521976813e-08
168001.00000  169001.00000  3.836260988406e-08
169001.00000  170001.00000  1.918130494203e-08
170001.00000  171001.00000  1.918130494203e-08
171001.00000  172001.00000  7.672521976813e-08
172001.00000  173001.00000  1.918130494203e-08
173001.00000  174001.00000  3.836260988406e-08
174001.00000  175001.00000  7.672521976813e-08
175001.00000  176001.00000  1.918130494203e-08
176001.00000  177001.00000  7.672521976813e-08
177001.00000  178001.00000  1.918130494203e-08
178001.00000  179001.00000  1.918130494203e-08
179001.00000  180001.00000  1.918130494203e-08
180001.00000  181001.00000  0.000000000000e+00
181001.00000  182001.00000  0.000000000000e+00
182001.00000  183001.00000  3.836260988406e-08
183001.00000  184001.00000  7.672521976813e-08
184001.00000  185001.00000  0.000000000000e+00
185001.00000  186001.00000  1.918130494203e-08
186001.00000  187001.00000  0.000000000000e+00
187001.00000  188001.00000  7.672521976813e-08
188001.00000  189001.00000  1.918130494203e-08
189001.00000  190001.00000  0.000000000000e+00
190001.00000  191001.00000  0.000000000000e+00
191001.00000  192001.00000  3.836260988406e-08
192001.00000  193001.00000  0.000000000000e+00
193001.00000  194001.00000  1.918130494203e-08
194001.00000  195001.00000  0.000000000000e+00
195001.00000  196001.00000  1.918130494203e-08
196001.00000  197001.00000  0.000000000000e+00
197001.00000  198001.00000  1.918130494203e-08
198001.00000  199001.00000  0.000000000000e+00
