300.00000  350.00000  6.935565553745e-02
350.00000  400.00000  5.224952589924e-02
400.00000  450.00000  4.074369059285e-02
450.00000  500.00000  3.237846986157e-02
500.00000  550.00000  2.662074062826e-02
550.00000  600.00000  2.205628326440e-02
600.00000  650.00000  1.865853784773e-02
650.00000  700.00000  1.592286585541e-02
700.00000  750.00000  1.389353382452e-02
750.00000  800.00000  1.207745102450e-02
800.00000  850.00000  1.063859610578e-02
850.00000  900.00000  9.460721292712e-03
900.00000  950.00000  8.566537243441e-03
950.00000  1000.00000  7.616153938384e-03
1000.00000  1050.00000  6.897881258255e-03
1050.00000  1100.00000  6.245815920561e-03
1100.00000  1150.00000  5.731169311058e-03
1150.00000  1200.00000  5.229610199479e-03
1200.00000  1250.00000  4.829286733598e-03
1250.00000  1300.00000  4.391240479586e-03
1300.00000  1350.00000  4.109474347831e-03
1350.00000  1400.00000  3.856192770380e-03
1400.00000  1450.00000  3.537858629722e-03
1450.00000  1500.00000  3.266100584615e-03
1500.00000  1550.00000  3.008199890249e-03
1550.00000  1600.00000  2.882328954342e-03
1600.00000  1650.00000  2.689480823182e-03
1650.00000  1700.00000  2.554756579857e-03
1700.00000  1750.00000  2.363063227926e-03
1750.00000  1800.00000  2.256053686084e-03
1800.00000  1850.00000  2.131337529406e-03
1850.00000  1900.00000  1.994303727624e-03
1900.00000  1950.00000  1.893068081925e-03
1950.00000  2000.00000  1.844952280738e-03
2000.00000  2050.00000  1.678279145424e-03
2050.00000  2100.00000  1.599369231476e-03
2100.00000  2150.00000  1.554717767974e-03
2150.00000  2200.00000  1.515455274205e-03
2200.00000  2250.00000  1.391124043936e-03
2250.00000  2300.00000  1.334154935330e-03
2300.00000  2350.00000  1.304130675389e-03
2350.00000  2400.00000  1.212903116337e-03
2400.00000  2450.00000  1.173640622568e-03
2450.00000  2500.00000  1.148620405951e-03
2500.00000  2550.00000  1.103968942448e-03
2550.00000  2600.00000  1.061627037403e-03
2600.00000  2650.00000  9.688597727136e-04
2650.00000  2700.00000  9.703994783516e-04
2700.00000  2750.00000  9.750185952657e-04
2750.00000  2800.00000  8.937991228610e-04
2800.00000  2850.00000  9.180494866595e-04
2850.00000  2900.00000  8.044961958568e-04
2900.00000  2950.00000  8.237425163318e-04
2950.00000  3000.00000  7.944881092098e-04
3000.00000  3050.00000  7.598447323547e-04
3050.00000  3100.00000  7.248164290901e-04
3100.00000  3150.00000  6.909429050540e-04
3150.00000  3200.00000  6.709267317600e-04
3200.00000  3250.00000  6.847840825020e-04
3250.00000  3300.00000  6.435969566854e-04
3300.00000  3350.00000  6.255054154389e-04
3350.00000  3400.00000  5.858579952603e-04
3400.00000  3450.00000  6.112631382874e-04
3450.00000  3500.00000  5.442859430342e-04
3500.00000  3550.00000  5.385120468917e-04
3550.00000  3600.00000  5.369723412537e-04
3600.00000  3650.00000  5.069480813126e-04
3650.00000  3700.00000  5.254245489687e-04
3700.00000  3750.00000  4.938605833896e-04
3750.00000  3800.00000  4.592172065345e-04
3800.00000  3850.00000  4.776936741906e-04
3850.00000  3900.00000  4.399708860595e-04
3900.00000  3950.00000  4.403558124690e-04
3950.00000  4000.00000  4.218793448129e-04
4000.00000  4050.00000  4.199547127654e-04
4050.00000  4100.00000  4.203396391749e-04
4100.00000  4150.00000  4.007083922904e-04
4150.00000  4200.00000  3.918550848719e-04
4200.00000  4250.00000  3.853113359104e-04
4250.00000  4300.00000  3.664499418448e-04
4300.00000  4350.00000  3.649102362068e-04
4350.00000  4400.00000  3.506679590553e-04
4400.00000  4450.00000  3.418146516368e-04
4450.00000  4500.00000  3.433543572748e-04
4500.00000  4550.00000  3.395050931798e-04
4550.00000  4600.00000  3.037069370962e-04
4600.00000  4650.00000  3.356558290847e-04
4650.00000  4700.00000  3.137150237432e-04
4700.00000  4750.00000  3.090959068292e-04
4750.00000  4800.00000  3.183341406572e-04
4800.00000  4850.00000  3.029370842772e-04
4850.00000  4900.00000  2.721429715171e-04
4900.00000  4950.00000  2.798414997071e-04
4950.00000  5000.00000  2.605951792321e-04
5000.00000  5050.00000  2.721429715171e-04
5050.00000  5100.00000  2.659841489651e-04
5100.00000  5150.00000  2.640595169176e-04
5150.00000  5200.00000  2.417337851665e-04
5200.00000  5250.00000  2.478926077185e-04
5250.00000  5300.00000  2.398091531190e-04
5300.00000  5350.00000  2.301859928815e-04
5350.00000  5400.00000  2.317256985195e-04
5400.00000  5450.00000  2.259518023770e-04
5450.00000  5500.00000  2.328804777480e-04
5500.00000  5550.00000  2.163286421395e-04
5550.00000  5600.00000  2.163286421395e-04
5600.00000  5650.00000  2.086301139495e-04
5650.00000  5700.00000  1.966973952549e-04
5700.00000  5750.00000  1.959275424359e-04
5750.00000  5800.00000  1.928481311599e-04
5800.00000  5850.00000  2.028562178069e-04
5850.00000  5900.00000  2.155587893205e-04
5900.00000  5950.00000  1.986220273024e-04
5950.00000  6000.00000  1.943878367979e-04
6000.00000  6050.00000  1.859194557889e-04
6050.00000  6100.00000  1.924632047504e-04
6100.00000  6150.00000  1.701374729994e-04
6150.00000  6200.00000  1.651334296759e-04
6200.00000  6250.00000  1.739867370944e-04
6250.00000  6300.00000  1.870742350174e-04
6300.00000  6350.00000  1.743716635039e-04
6350.00000  6400.00000  2.698334130601e-04
6400.00000  6450.00000  1.578198278953e-04
6450.00000  6500.00000  1.555102694383e-04
6500.00000  6550.00000  1.562801222573e-04
6550.00000  6600.00000  1.547404166193e-04
6600.00000  6650.00000  1.497363732958e-04
6650.00000  6700.00000  1.435775507438e-04
6700.00000  6750.00000  1.327996112778e-04
6750.00000  6800.00000  1.470418884293e-04
6800.00000  6850.00000  1.381885810108e-04
6850.00000  6900.00000  1.308749792303e-04
6900.00000  6950.00000  1.408830658773e-04
6950.00000  7000.00000  1.420378451058e-04
7000.00000  7050.00000  1.312599056398e-04
7050.00000  7100.00000  1.378036546013e-04
7100.00000  7150.00000  1.266407887258e-04
7150.00000  7200.00000  1.308749792303e-04
7200.00000  7250.00000  1.158628492598e-04
7250.00000  7300.00000  1.185573341263e-04
7300.00000  7350.00000  1.135532908028e-04
7350.00000  7400.00000  1.093191002982e-04
7400.00000  7450.00000  1.143231436218e-04
7450.00000  7500.00000  1.000808664702e-04
7500.00000  7550.00000  1.197121133548e-04
7550.00000  7600.00000  1.016205721082e-04
7600.00000  7650.00000  1.139382172123e-04
7650.00000  7700.00000  1.177874813073e-04
7700.00000  7750.00000  1.008507192892e-04
7750.00000  7800.00000  1.020054985177e-04
7800.00000  7850.00000  1.093191002982e-04
7850.00000  7900.00000  1.073944682507e-04
7900.00000  7950.00000  1.027753513367e-04
7950.00000  8000.00000  9.315219109921e-05
8000.00000  8050.00000  8.737829495669e-05
8050.00000  8100.00000  9.969594006072e-05
8100.00000  8150.00000  9.045770623270e-05
8150.00000  8200.00000  9.854116083222e-05
8200.00000  8250.00000  9.084263264220e-05
8250.00000  8300.00000  9.738638160372e-05
8300.00000  8350.00000  9.315219109921e-05
8350.00000  8400.00000  7.967976676668e-05
8400.00000  8450.00000  8.891800059470e-05
8450.00000  8500.00000  8.583858931869e-05
8500.00000  8550.00000  9.007277982320e-05
8550.00000  8600.00000  9.238233828020e-05
8600.00000  8650.00000  7.429079703366e-05
8650.00000  8700.00000  7.390587062416e-05
8700.00000  8750.00000  8.198932522368e-05
8750.00000  8800.00000  7.775513471917e-05
8800.00000  8850.00000  7.429079703366e-05
8850.00000  8900.00000  7.814006112867e-05
8900.00000  8950.00000  8.429888368069e-05
8950.00000  9000.00000  9.392204391821e-05
9000.00000  9050.00000  8.391395727119e-05
9050.00000  9100.00000  7.583050267167e-05
9100.00000  9150.00000  7.698528190017e-05
9150.00000  9200.00000  6.967168011965e-05
9200.00000  9250.00000  6.620734243415e-05
9250.00000  9300.00000  7.236616498616e-05
9300.00000  9350.00000  7.467572344317e-05
9350.00000  9400.00000  7.082645934816e-05
9400.00000  9450.00000  7.698528190017e-05
9450.00000  9500.00000  5.696910860613e-05
9500.00000  9550.00000  6.659226884365e-05
9550.00000  9600.00000  6.274300474864e-05
9600.00000  9650.00000  6.543748961514e-05
9650.00000  9700.00000  5.735403501563e-05
9700.00000  9750.00000  6.890182730065e-05
9750.00000  9800.00000  7.544557626217e-05
9800.00000  9850.00000  6.466763679614e-05
9850.00000  9900.00000  6.274300474864e-05
9900.00000  9950.00000  6.389778397714e-05
9950.00000  10000.00000  6.043344629163e-05
