10001.00000  11001.00000  4.357838547943e-04
11001.00000  12001.00000  3.739086970999e-04
12001.00000  13001.00000  3.263504750941e-04
13001.00000  14001.00000  2.861932164557e-04
14001.00000  15001.00000  2.539122124101e-04
15001.00000  16001.00000  2.266266161420e-04
16001.00000  17001.00000  2.001170055481e-04
17001.00000  18001.00000  1.832199174930e-04
18001.00000  19001.00000  1.664974262146e-04
19001.00000  20001.00000  1.539943570395e-04
20001.00000  21001.00000  1.384358442723e-04
21001.00000  22001.00000  1.281346344477e-04
22001.00000  23001.00000  1.183863144159e-04
23001.00000  24001.00000  1.104906601812e-04
24001.00000  25001.00000  1.017802209886e-04
25001.00000  26001.00000  9.472845117459e-05
26001.00000  27001.00000  8.982034178545e-05
27001.00000  28001.00000  8.356395728743e-05
28001.00000  29001.00000  7.547430663419e-05
29001.00000  30001.00000  7.374773850915e-05
30001.00000  31001.00000  6.844193646200e-05
31001.00000  32001.00000  6.388302062624e-05
32001.00000  33001.00000  6.074027864584e-05
33001.00000  34001.00000  5.772363433750e-05
34001.00000  35001.00000  5.622016209379e-05
35001.00000  36001.00000  5.167094607895e-05
36001.00000  37001.00000  4.910049353326e-05
37001.00000  38001.00000  4.668523812239e-05
38001.00000  39001.00000  4.516236623683e-05
39001.00000  40001.00000  4.296050688637e-05
40001.00000  41001.00000  4.123393876133e-05
41001.00000  42001.00000  3.838219140875e-05
42001.00000  43001.00000  3.704361612080e-05
43001.00000  44001.00000  3.543344584689e-05
44001.00000  45001.00000  3.447316357511e-05
45001.00000  46001.00000  3.217430601537e-05
46001.00000  47001.00000  3.060293502517e-05
47001.00000  48001.00000  3.069993323444e-05
48001.00000  49001.00000  2.873086958623e-05
49001.00000  50001.00000  2.812948068875e-05
50001.00000  51001.00000  2.794518409113e-05
51001.00000  52001.00000  2.545233011285e-05
52001.00000  53001.00000  2.403615625749e-05
53001.00000  54001.00000  2.338626825537e-05
54001.00000  55001.00000  2.261028258120e-05
55001.00000  56001.00000  2.267818132769e-05
56001.00000  57001.00000  2.091281391894e-05
57001.00000  58001.00000  2.080611588875e-05
58001.00000  59001.00000  1.955483898914e-05
59001.00000  60001.00000  1.999133093087e-05
60001.00000  61001.00000  1.858485689643e-05
61001.00000  62001.00000  1.786707014782e-05
62001.00000  63001.00000  1.783797068504e-05
63001.00000  64001.00000  1.654789450173e-05
64001.00000  65001.00000  1.619870094835e-05
65001.00000  66001.00000  1.535481652769e-05
66001.00000  67001.00000  1.575250918570e-05
67001.00000  68001.00000  1.484072601855e-05
68001.00000  69001.00000  1.443333353961e-05
69001.00000  70001.00000  1.392894285139e-05
70001.00000  71001.00000  1.298806022146e-05
71001.00000  72001.00000  1.294926093775e-05
72001.00000  73001.00000  1.272616505643e-05
73001.00000  74001.00000  1.233817221934e-05
74001.00000  75001.00000  1.220237472636e-05
75001.00000  76001.00000  1.155248672424e-05
76001.00000  77001.00000  1.101899657325e-05
77001.00000  78001.00000  1.068920266172e-05
78001.00000  79001.00000  1.083469997563e-05
79001.00000  80001.00000  1.073770176636e-05
80001.00000  81001.00000  1.014601268980e-05
81001.00000  82001.00000  1.004901448053e-05
82001.00000  83001.00000  9.952016271260e-06
83001.00000  84001.00000  9.224529701724e-06
84001.00000  85001.00000  9.069332566889e-06
85001.00000  86001.00000  8.380645281061e-06
86001.00000  87001.00000  8.855936506492e-06
87001.00000  88001.00000  8.322446355498e-06
88001.00000  89001.00000  8.138149757882e-06
89001.00000  90001.00000  8.167249220664e-06
90001.00000  91001.00000  8.225448146227e-06
91001.00000  92001.00000  7.614359427816e-06
92001.00000  93001.00000  7.245766232584e-06
93001.00000  94001.00000  7.090569097750e-06
94001.00000  95001.00000  7.672558353379e-06
95001.00000  96001.00000  6.886872858280e-06
96001.00000  97001.00000  6.935371962915e-06
97001.00000  98001.00000  6.527979483975e-06
98001.00000  99001.00000  6.809274290862e-06
99001.00000  100001.00000  6.353382707286e-06
100001.00000  101001.00000  6.295183781723e-06
101001.00000  102001.00000  5.916890765564e-06
102001.00000  103001.00000  6.139986646889e-06
103001.00000  104001.00000  5.654995600531e-06
104001.00000  105001.00000  5.383400614571e-06
105001.00000  106001.00000  5.480398823842e-06
106001.00000  107001.00000  5.616196316822e-06
107001.00000  108001.00000  5.441599540134e-06
108001.00000  109001.00000  5.170004554173e-06
109001.00000  110001.00000  5.228203479736e-06
110001.00000  111001.00000  5.383400614571e-06
111001.00000  112001.00000  4.461917626491e-06
112001.00000  113001.00000  4.384319059074e-06
113001.00000  114001.00000  4.597715119471e-06
114001.00000  115001.00000  4.403718700928e-06
115001.00000  116001.00000  4.267921207948e-06
116001.00000  117001.00000  4.306720491657e-06
117001.00000  118001.00000  4.432818163710e-06
118001.00000  119001.00000  4.568615656690e-06
119001.00000  120001.00000  4.025425684769e-06
120001.00000  121001.00000  3.947827117352e-06
121001.00000  122001.00000  3.802329803444e-06
122001.00000  123001.00000  3.482235712848e-06
123001.00000  124001.00000  3.501635354703e-06
124001.00000  125001.00000  3.501635354703e-06
125001.00000  126001.00000  3.297939115232e-06
126001.00000  127001.00000  3.579233922120e-06
127001.00000  128001.00000  3.550134459338e-06
128001.00000  129001.00000  3.608333384901e-06
129001.00000  130001.00000  3.462836070994e-06
130001.00000  131001.00000  3.074843233908e-06
131001.00000  132001.00000  3.453136250067e-06
132001.00000  133001.00000  2.997244666491e-06
133001.00000  134001.00000  3.055443592054e-06
134001.00000  135001.00000  3.181541264107e-06
135001.00000  136001.00000  3.055443592054e-06
136001.00000  137001.00000  3.026344129272e-06
137001.00000  138001.00000  2.774148785166e-06
138001.00000  139001.00000  2.686850396822e-06
139001.00000  140001.00000  2.454054694570e-06
140001.00000  141001.00000  2.871146994438e-06
141001.00000  142001.00000  2.512253620133e-06
142001.00000  143001.00000  2.657750934040e-06
143001.00000  144001.00000  2.279457917881e-06
144001.00000  145001.00000  2.609251829405e-06
145001.00000  146001.00000  2.454054694570e-06
146001.00000  147001.00000  2.521953441060e-06
147001.00000  148001.00000  2.541353082914e-06
148001.00000  149001.00000  2.066061857484e-06
149001.00000  150001.00000  2.327957022517e-06
150001.00000  151001.00000  2.405555589934e-06
151001.00000  152001.00000  2.163060066755e-06
152001.00000  153001.00000  2.260058276027e-06
153001.00000  154001.00000  2.007862931921e-06
154001.00000  155001.00000  2.269758096954e-06
155001.00000  156001.00000  2.095161320265e-06
156001.00000  157001.00000  2.095161320265e-06
157001.00000  158001.00000  2.056362036557e-06
158001.00000  159001.00000  1.765367408742e-06
159001.00000  160001.00000  2.017562752848e-06
160001.00000  161001.00000  1.678069020398e-06
161001.00000  162001.00000  1.881765259868e-06
162001.00000  163001.00000  1.726568125033e-06
163001.00000  164001.00000  1.745967766888e-06
164001.00000  165001.00000  1.755667587815e-06
165001.00000  166001.00000  1.707168483179e-06
166001.00000  167001.00000  1.716868304106e-06
167001.00000  168001.00000  1.852665797086e-06
168001.00000  169001.00000  1.425873676292e-06
169001.00000  170001.00000  1.464672960000e-06
170001.00000  171001.00000  1.726568125033e-06
171001.00000  172001.00000  1.493772422782e-06
172001.00000  173001.00000  1.581070811126e-06
173001.00000  174001.00000  1.328875467020e-06
174001.00000  175001.00000  1.581070811126e-06
175001.00000  176001.00000  1.532571706490e-06
176001.00000  177001.00000  1.532571706490e-06
177001.00000  178001.00000  1.309475825166e-06
178001.00000  179001.00000  1.532571706490e-06
179001.00000  180001.00000  1.299776004239e-06
180001.00000  181001.00000  1.377374571656e-06
181001.00000  182001.00000  1.416173855365e-06
182001.00000  183001.00000  1.202777794967e-06
183001.00000  184001.00000  1.037880839206e-06
184001.00000  185001.00000  1.270676541457e-06
185001.00000  186001.00000  1.222177436821e-06
186001.00000  187001.00000  1.183378153113e-06
187001.00000  188001.00000  1.241577078676e-06
188001.00000  189001.00000  1.290076183312e-06
189001.00000  190001.00000  1.134879048477e-06
190001.00000  191001.00000  1.154278690331e-06
191001.00000  192001.00000  1.154278690331e-06
192001.00000  193001.00000  1.173678332186e-06
193001.00000  194001.00000  1.028181018278e-06
194001.00000  195001.00000  1.241577078676e-06
195001.00000  196001.00000  9.214829880797e-07
196001.00000  197001.00000  9.990815554969e-07
197001.00000  198001.00000  1.076680122914e-06
198001.00000  199001.00000  9.990815554969e-07
