10001.00000  11001.00000  5.255815092080e-04
11001.00000  12001.00000  4.429004537362e-04
12001.00000  13001.00000  3.803187715255e-04
13001.00000  14001.00000  3.278471344235e-04
14001.00000  15001.00000  2.866323535173e-04
15001.00000  16001.00000  2.473691634082e-04
16001.00000  17001.00000  2.206102380456e-04
17001.00000  18001.00000  1.953300954005e-04
18001.00000  19001.00000  1.749289297481e-04
19001.00000  20001.00000  1.557550531537e-04
20001.00000  21001.00000  1.413293768492e-04
21001.00000  22001.00000  1.268031030810e-04
22001.00000  23001.00000  1.143893760518e-04
23001.00000  24001.00000  1.061605035155e-04
24001.00000  25001.00000  9.620135460239e-05
25001.00000  26001.00000  8.864648507333e-05
26001.00000  27001.00000  8.123245199355e-05
27001.00000  28001.00000  7.401961384130e-05
28001.00000  29001.00000  6.858735079777e-05
29001.00000  30001.00000  6.111295923973e-05
30001.00000  31001.00000  5.690798525418e-05
31001.00000  32001.00000  5.352791047154e-05
32001.00000  33001.00000  5.002711873237e-05
33001.00000  34001.00000  4.668728293524e-05
34001.00000  35001.00000  4.403150989174e-05
35001.00000  36001.00000  3.927324985546e-05
36001.00000  37001.00000  3.804596079747e-05
37001.00000  38001.00000  3.465582626846e-05
38001.00000  39001.00000  3.313680456554e-05
39001.00000  40001.00000  3.052127050755e-05
40001.00000  41001.00000  2.859985894956e-05
41001.00000  42001.00000  2.656779018142e-05
42001.00000  43001.00000  2.509906721039e-05
43001.00000  44001.00000  2.508900746401e-05
44001.00000  45001.00000  2.318771539878e-05
45001.00000  46001.00000  2.134678181180e-05
46001.00000  47001.00000  1.993841731904e-05
47001.00000  48001.00000  1.865076978279e-05
48001.00000  49001.00000  1.739330148568e-05
49001.00000  50001.00000  1.659858152190e-05
50001.00000  51001.00000  1.554230815233e-05
51001.00000  52001.00000  1.498902210160e-05
52001.00000  53001.00000  1.397298771753e-05
53001.00000  54001.00000  1.328892496390e-05
54001.00000  55001.00000  1.301731181172e-05
55001.00000  56001.00000  1.140775239142e-05
56001.00000  57001.00000  1.148823036243e-05
57001.00000  58001.00000  1.097518329721e-05
58001.00000  59001.00000  1.029112054358e-05
59001.00000  60001.00000  9.747894239226e-06
60001.00000  61001.00000  9.144309456611e-06
61001.00000  62001.00000  9.124189963857e-06
62001.00000  63001.00000  8.470306449358e-06
63001.00000  64001.00000  8.047797101528e-06
64001.00000  65001.00000  7.645407246452e-06
65001.00000  66001.00000  7.172599166737e-06
66001.00000  67001.00000  7.041822463837e-06
67001.00000  68001.00000  6.428177934846e-06
68001.00000  69001.00000  6.307460978323e-06
69001.00000  70001.00000  5.844712644985e-06
70001.00000  71001.00000  5.482561775416e-06
71001.00000  72001.00000  5.090231666716e-06
72001.00000  73001.00000  5.080171920340e-06
73001.00000  74001.00000  4.808558768163e-06
74001.00000  75001.00000  4.426288405840e-06
75001.00000  76001.00000  4.396109166710e-06
76001.00000  77001.00000  3.862942608733e-06
77001.00000  78001.00000  3.933360833372e-06
78001.00000  79001.00000  3.752285398587e-06
79001.00000  80001.00000  3.460552753657e-06
80001.00000  81001.00000  3.058162898581e-06
81001.00000  82001.00000  3.279477318873e-06
82001.00000  83001.00000  3.239238333365e-06
83001.00000  84001.00000  2.867027717419e-06
84001.00000  85001.00000  2.887147210173e-06
85001.00000  86001.00000  3.017923913073e-06
86001.00000  87001.00000  2.716131521766e-06
87001.00000  88001.00000  2.645713297127e-06
88001.00000  89001.00000  2.414339130458e-06
89001.00000  90001.00000  2.253383188428e-06
90001.00000  91001.00000  2.193024710166e-06
91001.00000  92001.00000  2.203084456543e-06
92001.00000  93001.00000  1.901292065236e-06
93001.00000  94001.00000  1.961650543497e-06
94001.00000  95001.00000  1.720216630452e-06
95001.00000  96001.00000  1.710156884075e-06
96001.00000  97001.00000  1.881172572482e-06
97001.00000  98001.00000  1.649798405813e-06
98001.00000  99001.00000  1.599499673929e-06
99001.00000  100001.00000  1.579380181175e-06
100001.00000  101001.00000  1.669917898567e-06
101001.00000  102001.00000  1.559260688421e-06
102001.00000  103001.00000  1.227289057983e-06
103001.00000  104001.00000  1.337946268129e-06
104001.00000  105001.00000  1.297707282621e-06
105001.00000  106001.00000  1.207169565229e-06
106001.00000  107001.00000  1.076392862329e-06
107001.00000  108001.00000  1.207169565229e-06
108001.00000  109001.00000  1.056273369576e-06
109001.00000  110001.00000  1.086452608706e-06
110001.00000  111001.00000  9.456161594295e-07
111001.00000  112001.00000  8.248992029066e-07
112001.00000  113001.00000  7.444212318913e-07
113001.00000  114001.00000  7.645407246452e-07
114001.00000  115001.00000  8.349589492835e-07
115001.00000  116001.00000  7.142419927606e-07
116001.00000  117001.00000  7.444212318913e-07
117001.00000  118001.00000  5.834652898608e-07
118001.00000  119001.00000  6.740030072530e-07
119001.00000  120001.00000  7.544809782683e-07
120001.00000  121001.00000  5.834652898608e-07
121001.00000  122001.00000  7.444212318913e-07
122001.00000  123001.00000  7.746004710221e-07
123001.00000  124001.00000  4.325690942071e-07
124001.00000  125001.00000  6.337640217453e-07
125001.00000  126001.00000  5.130470652224e-07
126001.00000  127001.00000  5.633457971070e-07
127001.00000  128001.00000  4.728080797148e-07
128001.00000  129001.00000  4.627483333379e-07
129001.00000  130001.00000  4.526885869610e-07
130001.00000  131001.00000  4.828678260917e-07
131001.00000  132001.00000  5.231068115993e-07
132001.00000  133001.00000  4.526885869610e-07
133001.00000  134001.00000  4.426288405840e-07
134001.00000  135001.00000  3.017923913073e-07
135001.00000  136001.00000  2.816728985535e-07
136001.00000  137001.00000  3.219118840611e-07
137001.00000  138001.00000  2.112546739151e-07
138001.00000  139001.00000  3.722106159457e-07
139001.00000  140001.00000  3.520911231919e-07
140001.00000  141001.00000  3.420313768149e-07
141001.00000  142001.00000  3.118521376842e-07
142001.00000  143001.00000  3.017923913073e-07
143001.00000  144001.00000  1.810754347844e-07
144001.00000  145001.00000  3.420313768149e-07
145001.00000  146001.00000  2.514936594228e-07
146001.00000  147001.00000  2.414339130458e-07
147001.00000  148001.00000  2.816728985535e-07
148001.00000  149001.00000  3.118521376842e-07
149001.00000  150001.00000  3.520911231919e-07
150001.00000  151001.00000  2.112546739151e-07
151001.00000  152001.00000  1.810754347844e-07
152001.00000  153001.00000  2.514936594228e-07
153001.00000  154001.00000  1.609559420306e-07
154001.00000  155001.00000  2.112546739151e-07
155001.00000  156001.00000  1.408364492767e-07
156001.00000  157001.00000  1.810754347844e-07
157001.00000  158001.00000  2.112546739151e-07
158001.00000  159001.00000  2.112546739151e-07
159001.00000  160001.00000  1.810754347844e-07
160001.00000  161001.00000  2.011949275382e-07
161001.00000  162001.00000  1.207169565229e-07
162001.00000  163001.00000  1.609559420306e-07
163001.00000  164001.00000  1.508961956537e-07
164001.00000  165001.00000  2.414339130458e-07
165001.00000  166001.00000  9.053771739219e-08
166001.00000  167001.00000  1.307767028998e-07
167001.00000  168001.00000  1.307767028998e-07
168001.00000  169001.00000  1.408364492767e-07
169001.00000  170001.00000  5.029873188455e-08
170001.00000  171001.00000  1.911351811613e-07
171001.00000  172001.00000  7.041822463837e-08
172001.00000  173001.00000  8.047797101528e-08
173001.00000  174001.00000  1.508961956537e-07
174001.00000  175001.00000  1.106572101460e-07
175001.00000  176001.00000  7.041822463837e-08
176001.00000  177001.00000  1.207169565229e-07
177001.00000  178001.00000  1.005974637691e-07
178001.00000  179001.00000  8.047797101528e-08
179001.00000  180001.00000  1.106572101460e-07
180001.00000  181001.00000  6.035847826146e-08
181001.00000  182001.00000  5.029873188455e-08
182001.00000  183001.00000  7.041822463837e-08
183001.00000  184001.00000  1.106572101460e-07
184001.00000  185001.00000  7.041822463837e-08
185001.00000  186001.00000  4.023898550764e-08
186001.00000  187001.00000  5.029873188455e-08
187001.00000  188001.00000  5.029873188455e-08
188001.00000  189001.00000  3.017923913073e-08
189001.00000  190001.00000  6.035847826146e-08
190001.00000  191001.00000  7.041822463837e-08
191001.00000  192001.00000  2.011949275382e-08
192001.00000  193001.00000  3.017923913073e-08
193001.00000  194001.00000  2.011949275382e-08
194001.00000  195001.00000  6.035847826146e-08
195001.00000  196001.00000  4.023898550764e-08
196001.00000  197001.00000  2.011949275382e-08
197001.00000  198001.00000  4.023898550764e-08
198001.00000  199001.00000  8.047797101528e-08
