10001.00000  11001.00000  2.058451999121e-04
11001.00000  12001.00000  1.831335389961e-04
12001.00000  13001.00000  1.675492773594e-04
13001.00000  14001.00000  1.407384386195e-04
14001.00000  15001.00000  1.243786568540e-04
15001.00000  16001.00000  1.089790428670e-04
16001.00000  17001.00000  9.778939529373e-05
17001.00000  18001.00000  8.519642558257e-05
18001.00000  19001.00000  7.895533502190e-05
19001.00000  20001.00000  6.506983176267e-05
20001.00000  21001.00000  5.964119086079e-05
21001.00000  22001.00000  5.495114055781e-05
22001.00000  23001.00000  5.015030166499e-05
23001.00000  24001.00000  4.357684533482e-05
24001.00000  25001.00000  3.836978161261e-05
25001.00000  26001.00000  3.685567088487e-05
26001.00000  27001.00000  3.305192930056e-05
27001.00000  28001.00000  3.102080515360e-05
28001.00000  29001.00000  2.928511724620e-05
29001.00000  30001.00000  2.370875822454e-05
30001.00000  31001.00000  2.297016762564e-05
31001.00000  32001.00000  2.197307031713e-05
32001.00000  33001.00000  2.020045287979e-05
33001.00000  34001.00000  1.743073813393e-05
34001.00000  35001.00000  1.595355693614e-05
35001.00000  36001.00000  1.473488244796e-05
36001.00000  37001.00000  1.399629184907e-05
37001.00000  38001.00000  1.455023479824e-05
38001.00000  39001.00000  1.166973146255e-05
39001.00000  40001.00000  1.170666099249e-05
40001.00000  41001.00000  1.126350663315e-05
41001.00000  42001.00000  1.111578851337e-05
42001.00000  43001.00000  1.041412744442e-05
43001.00000  44001.00000  1.011869120487e-05
44001.00000  45001.00000  9.195452956246e-06
45001.00000  46001.00000  8.383003297461e-06
46001.00000  47001.00000  7.422835518898e-06
47001.00000  48001.00000  6.942751629616e-06
48001.00000  49001.00000  6.647315390057e-06
49001.00000  50001.00000  6.388808680444e-06
50001.00000  51001.00000  5.576359021659e-06
51001.00000  52001.00000  6.610385860113e-06
52001.00000  53001.00000  5.797936201328e-06
53001.00000  54001.00000  5.797936201328e-06
54001.00000  55001.00000  5.613288551604e-06
55001.00000  56001.00000  5.428640901880e-06
56001.00000  57001.00000  3.988389234034e-06
57001.00000  58001.00000  4.062248293924e-06
58001.00000  59001.00000  4.025318763979e-06
59001.00000  60001.00000  4.283825473593e-06
60001.00000  61001.00000  4.209966413703e-06
61001.00000  62001.00000  4.690050302985e-06
62001.00000  63001.00000  3.877600644200e-06
63001.00000  64001.00000  3.766812054366e-06
64001.00000  65001.00000  3.323657695029e-06
65001.00000  66001.00000  2.400419446410e-06
66001.00000  67001.00000  3.065150985415e-06
67001.00000  68001.00000  3.028221455471e-06
68001.00000  69001.00000  2.621996626078e-06
69001.00000  70001.00000  3.508305344753e-06
70001.00000  71001.00000  2.917432865636e-06
71001.00000  72001.00000  2.695855685968e-06
72001.00000  73001.00000  2.732785215913e-06
73001.00000  74001.00000  2.474278506299e-06
74001.00000  75001.00000  2.178842266741e-06
75001.00000  76001.00000  1.883406027183e-06
76001.00000  77001.00000  1.957265087072e-06
77001.00000  78001.00000  3.102080515360e-06
78001.00000  79001.00000  1.957265087072e-06
79001.00000  80001.00000  1.920335557128e-06
80001.00000  81001.00000  2.400419446410e-06
81001.00000  82001.00000  2.215771796686e-06
82001.00000  83001.00000  1.698758377459e-06
83001.00000  84001.00000  1.957265087072e-06
84001.00000  85001.00000  1.698758377459e-06
85001.00000  86001.00000  1.218674488177e-06
86001.00000  87001.00000  1.329463078011e-06
87001.00000  88001.00000  1.403322137901e-06
88001.00000  89001.00000  1.440251667846e-06
89001.00000  90001.00000  1.218674488177e-06
90001.00000  91001.00000  1.070956368398e-06
91001.00000  92001.00000  1.514110727735e-06
92001.00000  93001.00000  1.366392607956e-06
93001.00000  94001.00000  9.232382486191e-07
94001.00000  95001.00000  8.863087186743e-07
95001.00000  96001.00000  1.440251667846e-06
96001.00000  97001.00000  1.034026838453e-06
97001.00000  98001.00000  1.255604018122e-06
98001.00000  99001.00000  1.218674488177e-06
99001.00000  100001.00000  9.970973085086e-07
100001.00000  101001.00000  8.493791887296e-07
101001.00000  102001.00000  1.144815428288e-06
102001.00000  103001.00000  8.863087186743e-07
103001.00000  104001.00000  1.034026838453e-06
104001.00000  105001.00000  9.970973085086e-07
105001.00000  106001.00000  9.970973085086e-07
106001.00000  107001.00000  9.970973085086e-07
107001.00000  108001.00000  8.493791887296e-07
108001.00000  109001.00000  9.970973085086e-07
109001.00000  110001.00000  7.755201288400e-07
110001.00000  111001.00000  7.385905988953e-07
111001.00000  112001.00000  8.863087186743e-07
112001.00000  113001.00000  8.863087186743e-07
113001.00000  114001.00000  8.124496587848e-07
114001.00000  115001.00000  4.431543593372e-07
115001.00000  116001.00000  8.124496587848e-07
116001.00000  117001.00000  7.385905988953e-07
117001.00000  118001.00000  5.908724791162e-07
118001.00000  119001.00000  7.755201288400e-07
119001.00000  120001.00000  5.170134192267e-07
120001.00000  121001.00000  7.016610689505e-07
121001.00000  122001.00000  7.385905988953e-07
122001.00000  123001.00000  5.170134192267e-07
123001.00000  124001.00000  5.908724791162e-07
124001.00000  125001.00000  4.800838892819e-07
125001.00000  126001.00000  4.431543593372e-07
126001.00000  127001.00000  5.170134192267e-07
127001.00000  128001.00000  5.539429491715e-07
128001.00000  129001.00000  4.062248293924e-07
129001.00000  130001.00000  3.692952994476e-07
130001.00000  131001.00000  3.323657695029e-07
131001.00000  132001.00000  4.062248293924e-07
132001.00000  133001.00000  5.539429491715e-07
133001.00000  134001.00000  4.431543593372e-07
134001.00000  135001.00000  3.692952994476e-07
135001.00000  136001.00000  2.954362395581e-07
136001.00000  137001.00000  2.215771796686e-07
137001.00000  138001.00000  3.323657695029e-07
138001.00000  139001.00000  4.431543593372e-07
139001.00000  140001.00000  4.800838892819e-07
140001.00000  141001.00000  5.539429491715e-07
141001.00000  142001.00000  3.692952994476e-07
142001.00000  143001.00000  3.323657695029e-07
143001.00000  144001.00000  2.585067096133e-07
144001.00000  145001.00000  2.954362395581e-07
145001.00000  146001.00000  2.215771796686e-07
146001.00000  147001.00000  4.431543593372e-07
147001.00000  148001.00000  4.431543593372e-07
148001.00000  149001.00000  3.323657695029e-07
149001.00000  150001.00000  2.954362395581e-07
150001.00000  151001.00000  3.323657695029e-07
151001.00000  152001.00000  2.954362395581e-07
152001.00000  153001.00000  3.692952994476e-07
153001.00000  154001.00000  1.846476497238e-07
154001.00000  155001.00000  3.323657695029e-07
155001.00000  156001.00000  1.477181197791e-07
156001.00000  157001.00000  2.215771796686e-07
157001.00000  158001.00000  1.477181197791e-07
158001.00000  159001.00000  2.215771796686e-07
159001.00000  160001.00000  2.215771796686e-07
160001.00000  161001.00000  1.846476497238e-07
161001.00000  162001.00000  7.385905988953e-08
162001.00000  163001.00000  1.846476497238e-07
163001.00000  164001.00000  3.323657695029e-07
164001.00000  165001.00000  2.585067096133e-07
165001.00000  166001.00000  2.585067096133e-07
166001.00000  167001.00000  1.107885898343e-07
167001.00000  168001.00000  2.954362395581e-07
168001.00000  169001.00000  2.585067096133e-07
169001.00000  170001.00000  1.477181197791e-07
170001.00000  171001.00000  1.477181197791e-07
171001.00000  172001.00000  1.846476497238e-07
172001.00000  173001.00000  7.385905988953e-08
173001.00000  174001.00000  1.846476497238e-07
174001.00000  175001.00000  2.215771796686e-07
175001.00000  176001.00000  1.846476497238e-07
176001.00000  177001.00000  2.954362395581e-07
177001.00000  178001.00000  2.215771796686e-07
178001.00000  179001.00000  3.692952994476e-07
179001.00000  180001.00000  1.477181197791e-07
180001.00000  181001.00000  2.954362395581e-07
181001.00000  182001.00000  2.954362395581e-07
182001.00000  183001.00000  1.107885898343e-07
183001.00000  184001.00000  7.385905988953e-08
184001.00000  185001.00000  7.385905988953e-08
185001.00000  186001.00000  3.692952994476e-08
186001.00000  187001.00000  2.215771796686e-07
187001.00000  188001.00000  3.692952994476e-08
188001.00000  189001.00000  1.107885898343e-07
189001.00000  190001.00000  2.215771796686e-07
190001.00000  191001.00000  7.385905988953e-08
191001.00000  192001.00000  1.477181197791e-07
192001.00000  193001.00000  1.477181197791e-07
193001.00000  194001.00000  7.385905988953e-08
194001.00000  195001.00000  7.385905988953e-08
195001.00000  196001.00000  1.477181197791e-07
196001.00000  197001.00000  7.385905988953e-08
197001.00000  198001.00000  1.107885898343e-07
198001.00000  199001.00000  2.215771796686e-07
