300.00000  350.00000  1.602237760353e-01
350.00000  400.00000  1.275813566620e-01
400.00000  450.00000  1.041178778321e-01
450.00000  500.00000  8.698838206756e-02
500.00000  550.00000  7.438365876914e-02
550.00000  600.00000  6.417847717168e-02
600.00000  650.00000  5.591403574533e-02
650.00000  700.00000  4.962001594211e-02
700.00000  750.00000  4.418714624081e-02
750.00000  800.00000  3.953647009908e-02
800.00000  850.00000  3.598711162542e-02
850.00000  900.00000  3.267248881819e-02
900.00000  950.00000  2.988165634103e-02
950.00000  1000.00000  2.750209627118e-02
1000.00000  1050.00000  2.528568718932e-02
1050.00000  1100.00000  2.345455499470e-02
1100.00000  1150.00000  2.175592235393e-02
1150.00000  1200.00000  2.040687125938e-02
1200.00000  1250.00000  1.908614364194e-02
1250.00000  1300.00000  1.779800742282e-02
1300.00000  1350.00000  1.684820095763e-02
1350.00000  1400.00000  1.583670363135e-02
1400.00000  1450.00000  1.494936401293e-02
1450.00000  1500.00000  1.416697645695e-02
1500.00000  1550.00000  1.332638997540e-02
1550.00000  1600.00000  1.267960591598e-02
1600.00000  1650.00000  1.211022642755e-02
1650.00000  1700.00000  1.153134111462e-02
1700.00000  1750.00000  1.099144908181e-02
1750.00000  1800.00000  1.049229629690e-02
1800.00000  1850.00000  1.005949028713e-02
1850.00000  1900.00000  9.560531498640e-03
1900.00000  1950.00000  9.182432478900e-03
1950.00000  2000.00000  8.841774767938e-03
2000.00000  2050.00000  8.471823597777e-03
2050.00000  2100.00000  8.136985779371e-03
2100.00000  2150.00000  7.834157370025e-03
2150.00000  2200.00000  7.555190520160e-03
2200.00000  2250.00000  7.209488902317e-03
2250.00000  2300.00000  7.046725907159e-03
2300.00000  2350.00000  6.835657803784e-03
2350.00000  2400.00000  6.556884950338e-03
2400.00000  2450.00000  6.332819086921e-03
2450.00000  2500.00000  6.131838797310e-03
2500.00000  2550.00000  5.887209313527e-03
2550.00000  2600.00000  5.798940943090e-03
2600.00000  2650.00000  5.603392553199e-03
2650.00000  2700.00000  5.395428392520e-03
2700.00000  2750.00000  5.252647028473e-03
2750.00000  2800.00000  5.066410466671e-03
2800.00000  2850.00000  4.977560106979e-03
2850.00000  2900.00000  4.860192273760e-03
2900.00000  2950.00000  4.667359833728e-03
2950.00000  3000.00000  4.616144779233e-03
3000.00000  3050.00000  4.402554722417e-03
3050.00000  3100.00000  4.330970043974e-03
3100.00000  3150.00000  4.208364307455e-03
3150.00000  3200.00000  4.107292173394e-03
3200.00000  3250.00000  4.058599072340e-03
3250.00000  3300.00000  3.884584284907e-03
3300.00000  3350.00000  3.835115198178e-03
3350.00000  3400.00000  3.716583386448e-03
3400.00000  3450.00000  3.691945841293e-03
3450.00000  3500.00000  3.550716448594e-03
3500.00000  3550.00000  3.459150139042e-03
3550.00000  3600.00000  3.447704350348e-03
3600.00000  3650.00000  3.295805154628e-03
3650.00000  3700.00000  3.256423881664e-03
3700.00000  3750.00000  3.178825314247e-03
3750.00000  3800.00000  3.124506317055e-03
3800.00000  3850.00000  3.063785438051e-03
3850.00000  3900.00000  3.022076208064e-03
3900.00000  3950.00000  2.939821726602e-03
3950.00000  4000.00000  2.871922980112e-03
4000.00000  4050.00000  2.830601742962e-03
4050.00000  4100.00000  2.793354430602e-03
4100.00000  4150.00000  2.665898783619e-03
4150.00000  4200.00000  2.666092780038e-03
4200.00000  4250.00000  2.598000037129e-03
4250.00000  4300.00000  2.553768853701e-03
4300.00000  4350.00000  2.502553799206e-03
4350.00000  4400.00000  2.431551110019e-03
4400.00000  4450.00000  2.408077543375e-03
4450.00000  4500.00000  2.383633994639e-03
4500.00000  4550.00000  2.344640714512e-03
4550.00000  4600.00000  2.288187756716e-03
4600.00000  4650.00000  2.288381753134e-03
4650.00000  4700.00000  2.185369654888e-03
4700.00000  4750.00000  2.203993311068e-03
4750.00000  4800.00000  2.142690442808e-03
4800.00000  4850.00000  2.120186858257e-03
4850.00000  4900.00000  2.082163560223e-03
4900.00000  4950.00000  2.022412663312e-03
4950.00000  5000.00000  2.018532734941e-03
5000.00000  5050.00000  1.949082017102e-03
5050.00000  5100.00000  1.919982554321e-03
5100.00000  5150.00000  1.931816335852e-03
5150.00000  5200.00000  1.907372787116e-03
5200.00000  5250.00000  1.820462391608e-03
5250.00000  5300.00000  1.841995994067e-03
5300.00000  5350.00000  1.777395186692e-03
5350.00000  5400.00000  1.790004953897e-03
5400.00000  5450.00000  1.722882193081e-03
5450.00000  5500.00000  1.750041691677e-03
5500.00000  5550.00000  1.746355759725e-03
5550.00000  5600.00000  1.682724934443e-03
5600.00000  5650.00000  1.639657729526e-03
5650.00000  5700.00000  1.647223589849e-03
5700.00000  5750.00000  1.607842316885e-03
5750.00000  5800.00000  1.570013015269e-03
5800.00000  5850.00000  1.542853516673e-03
5850.00000  5900.00000  1.553911312530e-03
5900.00000  5950.00000  1.509292136265e-03
5950.00000  6000.00000  1.486400558877e-03
6000.00000  6050.00000  1.456331114003e-03
6050.00000  6100.00000  1.461181024467e-03
6100.00000  6150.00000  1.445467314565e-03
6150.00000  6200.00000  1.408995987878e-03
6200.00000  6250.00000  1.395222242162e-03
6250.00000  6300.00000  1.379702528678e-03
6300.00000  6350.00000  1.362436847428e-03
6350.00000  6400.00000  1.884675206146e-03
6400.00000  6450.00000  1.339739266459e-03
6450.00000  6500.00000  1.306371882469e-03
6500.00000  6550.00000  1.278824391036e-03
6550.00000  6600.00000  1.282704319407e-03
6600.00000  6650.00000  1.259812742019e-03
6650.00000  6700.00000  1.236145178957e-03
6700.00000  6750.00000  1.271452527131e-03
6750.00000  6800.00000  1.229355304308e-03
6800.00000  6850.00000  1.219461486962e-03
6850.00000  6900.00000  1.190750017017e-03
6900.00000  6950.00000  1.223147418914e-03
6950.00000  7000.00000  1.154666683168e-03
7000.00000  7050.00000  1.144578869404e-03
7050.00000  7100.00000  1.202971791386e-03
7100.00000  7150.00000  1.126925195317e-03
7150.00000  7200.00000  1.116643385134e-03
7200.00000  7250.00000  1.095109782676e-03
7250.00000  7300.00000  1.107913546300e-03
7300.00000  7350.00000  1.084051986819e-03
7350.00000  7400.00000  1.053788545526e-03
7400.00000  7450.00000  1.046610678040e-03
7450.00000  7500.00000  1.059802434501e-03
7500.00000  7550.00000  1.037104853531e-03
7550.00000  7600.00000  1.030896968138e-03
7600.00000  7650.00000  1.010527344191e-03
7650.00000  7700.00000  9.806518957353e-04
7700.00000  7750.00000  9.814278814095e-04
7750.00000  7800.00000  9.595062861141e-04
7800.00000  7850.00000  9.461205332346e-04
7850.00000  7900.00000  9.668781500187e-04
7900.00000  7950.00000  9.449565547234e-04
7950.00000  8000.00000  9.309888125883e-04
8000.00000  8050.00000  9.133351385009e-04
8050.00000  8100.00000  9.129471456638e-04
8100.00000  8150.00000  8.927715181353e-04
8150.00000  8200.00000  9.042173068293e-04
8200.00000  8250.00000  8.993673963657e-04
8250.00000  8300.00000  8.784157831631e-04
8300.00000  8350.00000  8.543602272638e-04
8350.00000  8400.00000  8.497043132187e-04
8400.00000  8450.00000  8.660000123763e-04
8450.00000  8500.00000  8.448544027551e-04
8500.00000  8550.00000  8.225448146227e-04
8550.00000  8600.00000  8.062491154651e-04
8600.00000  8650.00000  8.314686498757e-04
8650.00000  8700.00000  8.163369292293e-04
8700.00000  8750.00000  7.948033267710e-04
8750.00000  8800.00000  7.833575380770e-04
8800.00000  8850.00000  7.707477708717e-04
8850.00000  8900.00000  7.946093303525e-04
8900.00000  8950.00000  7.691957995233e-04
8950.00000  9000.00000  7.788956204505e-04
9000.00000  9050.00000  7.507661397617e-04
9050.00000  9100.00000  7.790896168690e-04
9100.00000  9150.00000  7.428122866015e-04
9150.00000  9200.00000  7.305905122333e-04
9200.00000  9250.00000  7.239946340028e-04
9250.00000  9300.00000  7.055649742412e-04
9300.00000  9350.00000  7.239946340028e-04
9350.00000  9400.00000  7.224426626545e-04
9400.00000  9450.00000  6.745255472743e-04
9450.00000  9500.00000  7.094449026121e-04
9500.00000  9550.00000  6.890752786650e-04
9550.00000  9600.00000  6.834493825273e-04
9600.00000  9650.00000  6.826733968531e-04
9650.00000  9700.00000  6.737495616001e-04
9700.00000  9750.00000  6.696756368107e-04
9750.00000  9800.00000  6.526039519789e-04
9800.00000  9850.00000  6.566778767683e-04
9850.00000  9900.00000  6.617217836505e-04
9900.00000  9950.00000  6.510519806306e-04
9950.00000  10000.00000  6.330103137061e-04
