10001.00000  11001.00000  4.345844883411e-04
11001.00000  12001.00000  3.627346385143e-04
12001.00000  13001.00000  3.020126204065e-04
13001.00000  14001.00000  2.641453170364e-04
14001.00000  15001.00000  2.258423399938e-04
15001.00000  16001.00000  1.954722544050e-04
16001.00000  17001.00000  1.737430299880e-04
17001.00000  18001.00000  1.577320225228e-04
18001.00000  19001.00000  1.379633296321e-04
19001.00000  20001.00000  1.193382801318e-04
20001.00000  21001.00000  1.096626939878e-04
21001.00000  22001.00000  1.015482718371e-04
22001.00000  23001.00000  8.777009194357e-05
23001.00000  24001.00000  8.174327280701e-05
24001.00000  25001.00000  7.548046376450e-05
25001.00000  26001.00000  7.047021653049e-05
26001.00000  27001.00000  6.222872289195e-05
27001.00000  28001.00000  5.937869095086e-05
28001.00000  29001.00000  5.574807701318e-05
29001.00000  30001.00000  5.077413591855e-05
30001.00000  31001.00000  4.576388868454e-05
31001.00000  32001.00000  4.264156069813e-05
32001.00000  33001.00000  4.106224363523e-05
33001.00000  34001.00000  3.946477350265e-05
34001.00000  35001.00000  3.427299557176e-05
35001.00000  36001.00000  3.256660702105e-05
36001.00000  37001.00000  3.164080046694e-05
37001.00000  38001.00000  2.980734042841e-05
38001.00000  39001.00000  2.850031941084e-05
39001.00000  40001.00000  2.554136905162e-05
40001.00000  41001.00000  2.385313357060e-05
41001.00000  42001.00000  2.494231775191e-05
42001.00000  43001.00000  2.160215292923e-05
43001.00000  44001.00000  2.024067270260e-05
44001.00000  45001.00000  2.013175428447e-05
45001.00000  46001.00000  1.909702931223e-05
46001.00000  47001.00000  1.764478373716e-05
47001.00000  48001.00000  1.646483420741e-05
48001.00000  49001.00000  1.697312015868e-05
49001.00000  50001.00000  1.501258863233e-05
50001.00000  51001.00000  1.513966012015e-05
51001.00000  52001.00000  1.452245575075e-05
52001.00000  53001.00000  1.376002682383e-05
53001.00000  54001.00000  1.187210757623e-05
54001.00000  55001.00000  1.252561808502e-05
55001.00000  56001.00000  1.218070976094e-05
56001.00000  57001.00000  1.134566855527e-05
57001.00000  58001.00000  1.031094358303e-05
58001.00000  59001.00000  9.457749307673e-06
59001.00000  60001.00000  9.584820795492e-06
60001.00000  61001.00000  1.003864753770e-05
61001.00000  62001.00000  8.604555032317e-06
62001.00000  63001.00000  8.368565126367e-06
63001.00000  64001.00000  8.858698007955e-06
64001.00000  65001.00000  8.659014241382e-06
65001.00000  66001.00000  8.604555032317e-06
66001.00000  67001.00000  7.061544108800e-06
67001.00000  68001.00000  6.371727460640e-06
68001.00000  69001.00000  6.317268251574e-06
69001.00000  70001.00000  7.134156387554e-06
70001.00000  71001.00000  7.261227875373e-06
71001.00000  72001.00000  6.535105087836e-06
72001.00000  73001.00000  6.716635784720e-06
73001.00000  74001.00000  6.153890624379e-06
74001.00000  75001.00000  5.482227045907e-06
75001.00000  76001.00000  5.300696349022e-06
76001.00000  77001.00000  5.300696349022e-06
77001.00000  78001.00000  5.119165652138e-06
78001.00000  79001.00000  4.792410397746e-06
79001.00000  80001.00000  4.465655143354e-06
80001.00000  81001.00000  4.883175746188e-06
81001.00000  82001.00000  4.284124446470e-06
82001.00000  83001.00000  4.247818307093e-06
83001.00000  84001.00000  3.975522261767e-06
84001.00000  85001.00000  4.084440679897e-06
85001.00000  86001.00000  3.666920077063e-06
86001.00000  87001.00000  4.084440679897e-06
87001.00000  88001.00000  3.013409568280e-06
88001.00000  89001.00000  4.011828401144e-06
89001.00000  90001.00000  3.467236310491e-06
90001.00000  91001.00000  3.467236310491e-06
91001.00000  92001.00000  3.176787195476e-06
92001.00000  93001.00000  3.303858683295e-06
93001.00000  94001.00000  3.303858683295e-06
94001.00000  95001.00000  3.249399474229e-06
95001.00000  96001.00000  3.067868777345e-06
96001.00000  97001.00000  2.686654313888e-06
97001.00000  98001.00000  2.741113522953e-06
98001.00000  99001.00000  2.432511338250e-06
99001.00000  100001.00000  2.595888965446e-06
100001.00000  101001.00000  1.906072317285e-06
101001.00000  102001.00000  2.704807383576e-06
102001.00000  103001.00000  2.160215292923e-06
103001.00000  104001.00000  2.541429756381e-06
104001.00000  105001.00000  2.341745989808e-06
105001.00000  106001.00000  2.432511338250e-06
106001.00000  107001.00000  2.378052129185e-06
107001.00000  108001.00000  2.232827571677e-06
108001.00000  109001.00000  1.960531526351e-06
109001.00000  110001.00000  1.978684596039e-06
110001.00000  111001.00000  2.105756083858e-06
111001.00000  112001.00000  1.815306968843e-06
112001.00000  113001.00000  2.014990735416e-06
113001.00000  114001.00000  1.706388550713e-06
114001.00000  115001.00000  1.779000829466e-06
115001.00000  116001.00000  1.397786366009e-06
116001.00000  117001.00000  1.706388550713e-06
117001.00000  118001.00000  1.724541620401e-06
118001.00000  119001.00000  1.724541620401e-06
119001.00000  120001.00000  1.597470132582e-06
120001.00000  121001.00000  1.107337250994e-06
121001.00000  122001.00000  1.397786366009e-06
122001.00000  123001.00000  1.270714878190e-06
123001.00000  124001.00000  1.361480226632e-06
124001.00000  125001.00000  1.161796460060e-06
125001.00000  126001.00000  1.579317062894e-06
126001.00000  127001.00000  1.252561808502e-06
127001.00000  128001.00000  1.034724972241e-06
128001.00000  129001.00000  1.270714878190e-06
129001.00000  130001.00000  1.270714878190e-06
130001.00000  131001.00000  1.052878041929e-06
131001.00000  132001.00000  1.325174087256e-06
132001.00000  133001.00000  1.198102599437e-06
133001.00000  134001.00000  1.143643390371e-06
134001.00000  135001.00000  1.071031111618e-06
135001.00000  136001.00000  9.802657631754e-07
136001.00000  137001.00000  9.258065541101e-07
137001.00000  138001.00000  1.125490320683e-06
138001.00000  139001.00000  1.071031111618e-06
139001.00000  140001.00000  9.621126934869e-07
140001.00000  141001.00000  7.987350662910e-07
141001.00000  142001.00000  1.125490320683e-06
142001.00000  143001.00000  1.052878041929e-06
143001.00000  144001.00000  8.895004147332e-07
144001.00000  145001.00000  9.802657631754e-07
145001.00000  146001.00000  7.987350662910e-07
146001.00000  147001.00000  8.713473450448e-07
147001.00000  148001.00000  8.168881359795e-07
148001.00000  149001.00000  7.624289269142e-07
149001.00000  150001.00000  8.895004147332e-07
150001.00000  151001.00000  6.716635784720e-07
151001.00000  152001.00000  7.987350662910e-07
152001.00000  153001.00000  7.079697178489e-07
153001.00000  154001.00000  7.442758572257e-07
154001.00000  155001.00000  5.627451603414e-07
155001.00000  156001.00000  7.805819966026e-07
156001.00000  157001.00000  6.716635784720e-07
157001.00000  158001.00000  5.445920906530e-07
158001.00000  159001.00000  5.082859512761e-07
159001.00000  160001.00000  4.901328815877e-07
160001.00000  161001.00000  8.895004147332e-07
161001.00000  162001.00000  8.168881359795e-07
162001.00000  163001.00000  5.627451603414e-07
163001.00000  164001.00000  4.175206028339e-07
164001.00000  165001.00000  6.716635784720e-07
165001.00000  166001.00000  5.082859512761e-07
166001.00000  167001.00000  4.719798118992e-07
167001.00000  168001.00000  6.535105087836e-07
168001.00000  169001.00000  3.812144634571e-07
169001.00000  170001.00000  4.175206028339e-07
170001.00000  171001.00000  3.993675331455e-07
171001.00000  172001.00000  5.082859512761e-07
172001.00000  173001.00000  3.993675331455e-07
173001.00000  174001.00000  5.082859512761e-07
174001.00000  175001.00000  3.993675331455e-07
175001.00000  176001.00000  3.993675331455e-07
176001.00000  177001.00000  5.082859512761e-07
177001.00000  178001.00000  4.356736725224e-07
178001.00000  179001.00000  4.356736725224e-07
179001.00000  180001.00000  5.808982300298e-07
180001.00000  181001.00000  4.719798118992e-07
181001.00000  182001.00000  3.086021847034e-07
182001.00000  183001.00000  3.449083240802e-07
183001.00000  184001.00000  4.538267422108e-07
184001.00000  185001.00000  4.175206028339e-07
185001.00000  186001.00000  3.086021847034e-07
186001.00000  187001.00000  4.901328815877e-07
187001.00000  188001.00000  5.627451603414e-07
188001.00000  189001.00000  3.449083240802e-07
189001.00000  190001.00000  4.538267422108e-07
190001.00000  191001.00000  3.812144634571e-07
191001.00000  192001.00000  3.630613937686e-07
192001.00000  193001.00000  3.086021847034e-07
193001.00000  194001.00000  3.449083240802e-07
194001.00000  195001.00000  2.904491150149e-07
195001.00000  196001.00000  3.630613937686e-07
196001.00000  197001.00000  3.993675331455e-07
197001.00000  198001.00000  4.175206028339e-07
198001.00000  199001.00000  3.267552543918e-07
