10001.00000  11001.00000  5.664206354899e-04
11001.00000  12001.00000  4.808743103658e-04
12001.00000  13001.00000  4.127802215428e-04
13001.00000  14001.00000  3.588694240434e-04
14001.00000  15001.00000  3.178915017559e-04
15001.00000  16001.00000  2.783069002785e-04
16001.00000  17001.00000  2.485648599086e-04
17001.00000  18001.00000  2.283081188999e-04
18001.00000  19001.00000  2.058720812394e-04
19001.00000  20001.00000  1.847757751272e-04
20001.00000  21001.00000  1.675021696991e-04
21001.00000  22001.00000  1.551409132811e-04
22001.00000  23001.00000  1.393856702743e-04
23001.00000  24001.00000  1.283820084918e-04
24001.00000  25001.00000  1.186823520828e-04
25001.00000  26001.00000  1.092149158089e-04
26001.00000  27001.00000  1.021411332344e-04
27001.00000  28001.00000  9.370975602447e-05
28001.00000  29001.00000  8.949406741948e-05
29001.00000  30001.00000  8.131277343183e-05
30001.00000  31001.00000  7.450693716700e-05
31001.00000  32001.00000  7.061278413357e-05
32001.00000  33001.00000  6.534317337734e-05
33001.00000  34001.00000  6.205636531243e-05
34001.00000  35001.00000  5.664384985772e-05
35001.00000  36001.00000  5.321413709434e-05
36001.00000  37001.00000  5.092766191875e-05
37001.00000  38001.00000  5.082048339490e-05
38001.00000  39001.00000  4.551514646404e-05
39001.00000  40001.00000  4.190680282757e-05
40001.00000  41001.00000  3.999545248547e-05
41001.00000  42001.00000  3.811982831800e-05
42001.00000  43001.00000  3.738744173832e-05
43001.00000  44001.00000  3.401131823686e-05
44001.00000  45001.00000  3.322534239526e-05
45001.00000  46001.00000  3.104604574352e-05
46001.00000  47001.00000  2.967058802071e-05
47001.00000  48001.00000  2.711616653548e-05
48001.00000  49001.00000  2.611583364616e-05
49001.00000  50001.00000  2.570498263805e-05
50001.00000  51001.00000  2.336491820054e-05
51001.00000  52001.00000  2.391867390712e-05
52001.00000  53001.00000  2.332919202592e-05
53001.00000  54001.00000  2.034605644527e-05
54001.00000  55001.00000  2.109630611226e-05
55001.00000  56001.00000  1.902418798438e-05
56001.00000  57001.00000  1.850615845241e-05
57001.00000  58001.00000  1.770231952349e-05
58001.00000  59001.00000  1.764873026157e-05
59001.00000  60001.00000  1.641617723723e-05
60001.00000  61001.00000  1.593387387988e-05
61001.00000  62001.00000  1.464773159361e-05
62001.00000  63001.00000  1.552302287176e-05
63001.00000  64001.00000  1.482636246670e-05
64001.00000  65001.00000  1.316509534694e-05
65001.00000  66001.00000  1.307577991039e-05
66001.00000  67001.00000  1.327227387079e-05
67001.00000  68001.00000  1.289714903730e-05
68001.00000  69001.00000  1.211117319569e-05
69001.00000  70001.00000  1.087862017135e-05
70001.00000  71001.00000  1.111084030637e-05
71001.00000  72001.00000  1.064640003633e-05
72001.00000  73001.00000  1.016409667898e-05
73001.00000  74001.00000  9.753245670866e-06
74001.00000  75001.00000  1.034272755207e-05
75001.00000  76001.00000  9.217353051587e-06
76001.00000  77001.00000  9.253079226206e-06
77001.00000  78001.00000  8.627871170381e-06
78001.00000  79001.00000  8.127704725721e-06
79001.00000  80001.00000  8.342061773433e-06
80001.00000  81001.00000  8.056252376484e-06
81001.00000  82001.00000  7.091645661783e-06
82001.00000  83001.00000  7.609675193752e-06
83001.00000  84001.00000  6.913014788690e-06
84001.00000  85001.00000  6.823699352144e-06
85001.00000  86001.00000  6.448574518649e-06
86001.00000  87001.00000  6.984467137928e-06
87001.00000  88001.00000  5.876955724752e-06
88001.00000  89001.00000  6.484300693268e-06
89001.00000  90001.00000  6.091312772464e-06
90001.00000  91001.00000  6.073449685154e-06
91001.00000  92001.00000  5.537557065876e-06
92001.00000  93001.00000  5.591146327804e-06
93001.00000  94001.00000  5.769777200897e-06
94001.00000  95001.00000  4.697991962340e-06
95001.00000  96001.00000  5.537557065876e-06
96001.00000  97001.00000  4.858759748124e-06
97001.00000  98001.00000  4.948075184670e-06
98001.00000  99001.00000  4.805170486196e-06
99001.00000  100001.00000  4.662265787721e-06
100001.00000  101001.00000  4.572950351175e-06
101001.00000  102001.00000  4.340730216154e-06
102001.00000  103001.00000  4.233551692299e-06
103001.00000  104001.00000  4.501498001938e-06
104001.00000  105001.00000  3.912016120732e-06
105001.00000  106001.00000  4.358593303464e-06
106001.00000  107001.00000  4.126373168443e-06
107001.00000  108001.00000  3.804837596876e-06
108001.00000  109001.00000  3.322534239526e-06
109001.00000  110001.00000  3.536891287237e-06
110001.00000  111001.00000  3.965605382660e-06
111001.00000  112001.00000  3.554754374546e-06
112001.00000  113001.00000  3.036724842577e-06
113001.00000  114001.00000  3.393986588763e-06
114001.00000  115001.00000  3.376123501453e-06
115001.00000  116001.00000  2.893820144103e-06
116001.00000  117001.00000  3.286808064907e-06
117001.00000  118001.00000  3.233218802979e-06
118001.00000  119001.00000  3.000998667959e-06
119001.00000  120001.00000  2.804504707557e-06
120001.00000  121001.00000  2.554421485227e-06
121001.00000  122001.00000  2.625873834464e-06
122001.00000  123001.00000  2.697326183701e-06
123001.00000  124001.00000  2.608010747155e-06
124001.00000  125001.00000  2.625873834464e-06
125001.00000  126001.00000  2.447242961371e-06
126001.00000  127001.00000  2.125707389804e-06
127001.00000  128001.00000  2.340064437515e-06
128001.00000  129001.00000  2.625873834464e-06
129001.00000  130001.00000  2.572284572536e-06
130001.00000  131001.00000  2.215022826350e-06
131001.00000  132001.00000  2.232885913660e-06
132001.00000  133001.00000  2.304338262897e-06
133001.00000  134001.00000  1.947076516711e-06
134001.00000  135001.00000  2.482969135990e-06
135001.00000  136001.00000  2.197159739041e-06
136001.00000  137001.00000  2.000665778639e-06
137001.00000  138001.00000  1.893487254783e-06
138001.00000  139001.00000  2.036391953258e-06
139001.00000  140001.00000  1.822034905546e-06
140001.00000  141001.00000  1.893487254783e-06
141001.00000  142001.00000  1.804171818237e-06
142001.00000  143001.00000  1.571951683216e-06
143001.00000  144001.00000  1.964939604021e-06
144001.00000  145001.00000  2.000665778639e-06
145001.00000  146001.00000  1.875624167474e-06
146001.00000  147001.00000  1.804171818237e-06
147001.00000  148001.00000  1.554088595907e-06
148001.00000  149001.00000  1.536225508598e-06
149001.00000  150001.00000  1.839897992856e-06
150001.00000  151001.00000  1.125374500484e-06
151001.00000  152001.00000  1.393320810124e-06
152001.00000  153001.00000  1.286142286268e-06
153001.00000  154001.00000  1.500499333979e-06
154001.00000  155001.00000  1.518362421289e-06
155001.00000  156001.00000  9.467436273917e-07
156001.00000  157001.00000  1.286142286268e-06
157001.00000  158001.00000  1.518362421289e-06
158001.00000  159001.00000  1.554088595907e-06
159001.00000  160001.00000  1.268279198959e-06
160001.00000  161001.00000  1.607677857835e-06
161001.00000  162001.00000  1.518362421289e-06
162001.00000  163001.00000  1.446910072051e-06
163001.00000  164001.00000  1.178963762412e-06
164001.00000  165001.00000  1.143237587794e-06
165001.00000  166001.00000  1.161100675103e-06
166001.00000  167001.00000  1.250416111649e-06
167001.00000  168001.00000  1.196826849722e-06
168001.00000  169001.00000  1.178963762412e-06
169001.00000  170001.00000  1.143237587794e-06
170001.00000  171001.00000  1.178963762412e-06
171001.00000  172001.00000  1.107511413175e-06
172001.00000  173001.00000  1.143237587794e-06
173001.00000  174001.00000  8.217020162268e-07
174001.00000  175001.00000  1.161100675103e-06
175001.00000  176001.00000  1.071785238557e-06
176001.00000  177001.00000  1.071785238557e-06
177001.00000  178001.00000  8.574281908453e-07
178001.00000  179001.00000  9.646067147010e-07
179001.00000  180001.00000  1.053922151247e-06
180001.00000  181001.00000  7.681127542989e-07
181001.00000  182001.00000  1.036059063938e-06
182001.00000  183001.00000  6.609342304433e-07
183001.00000  184001.00000  7.681127542989e-07
184001.00000  185001.00000  8.574281908453e-07
185001.00000  186001.00000  8.217020162268e-07
186001.00000  187001.00000  8.395651035361e-07
187001.00000  188001.00000  6.609342304433e-07
188001.00000  189001.00000  7.502496669897e-07
189001.00000  190001.00000  6.966604050618e-07
190001.00000  191001.00000  9.110174527732e-07
191001.00000  192001.00000  7.681127542989e-07
192001.00000  193001.00000  6.966604050618e-07
193001.00000  194001.00000  9.288805400824e-07
194001.00000  195001.00000  7.859758416082e-07
195001.00000  196001.00000  7.323865796804e-07
196001.00000  197001.00000  5.358926192783e-07
197001.00000  198001.00000  6.609342304433e-07
198001.00000  199001.00000  5.180295319691e-07
