300.00000  350.00000  0.000000000000e+00
350.00000  400.00000  3.628936612273e-07
400.00000  450.00000  7.257873224546e-07
450.00000  500.00000  1.814468306137e-06
500.00000  550.00000  8.709447869455e-06
550.00000  600.00000  7.257873224546e-07
600.00000  650.00000  2.540255628591e-06
650.00000  700.00000  7.257873224546e-07
700.00000  750.00000  1.814468306137e-06
750.00000  800.00000  7.257873224546e-07
800.00000  850.00000  1.088680983682e-05
850.00000  900.00000  2.540255628591e-06
900.00000  950.00000  3.991830273500e-06
950.00000  1000.00000  3.628936612273e-06
1000.00000  1050.00000  6.894979563319e-06
1050.00000  1100.00000  3.628936612273e-06
1100.00000  1150.00000  6.532085902091e-06
1150.00000  1200.00000  9.072341530683e-06
1200.00000  1250.00000  6.532085902091e-06
1250.00000  1300.00000  2.467676896346e-05
1300.00000  1350.00000  1.233838448173e-05
1350.00000  1400.00000  1.016102251436e-05
1400.00000  1450.00000  1.270127814296e-05
1450.00000  1500.00000  1.669310841646e-05
1500.00000  1550.00000  1.233838448173e-05
1550.00000  1600.00000  1.669310841646e-05
1600.00000  1650.00000  1.088680983682e-05
1650.00000  1700.00000  1.778178940014e-05
1700.00000  1750.00000  4.826485694323e-05
1750.00000  1800.00000  2.612834360837e-05
1800.00000  1850.00000  2.141072601241e-05
1850.00000  1900.00000  2.068493868996e-05
1900.00000  1950.00000  2.068493868996e-05
1950.00000  2000.00000  2.104783235118e-05
2000.00000  2050.00000  2.431387530223e-05
2050.00000  2100.00000  2.068493868996e-05
2100.00000  2150.00000  2.649123726959e-05
2150.00000  2200.00000  3.411200415537e-05
2200.00000  2250.00000  3.338621683291e-05
2250.00000  2300.00000  2.576544994714e-05
2300.00000  2350.00000  9.471524558033e-05
2350.00000  2400.00000  4.064409005746e-05
2400.00000  2450.00000  3.919251541255e-05
2450.00000  2500.00000  4.753906962078e-05
2500.00000  2550.00000  5.261958087796e-05
2550.00000  2600.00000  5.951456044128e-05
2600.00000  2650.00000  6.314349705355e-05
2650.00000  2700.00000  6.713532732705e-05
2700.00000  2750.00000  8.056239279246e-05
2750.00000  2800.00000  7.838503082510e-05
2800.00000  2850.00000  8.273975475982e-05
2850.00000  2900.00000  1.034246934498e-04
2900.00000  2950.00000  1.074165237233e-04
2950.00000  3000.00000  1.433429961848e-04
3000.00000  3050.00000  1.429801025236e-04
3050.00000  3100.00000  1.680197651482e-04
3100.00000  3150.00000  1.716487017605e-04
3150.00000  3200.00000  1.850757672259e-04
3200.00000  3250.00000  2.014059819812e-04
3250.00000  3300.00000  2.068493868996e-04
3300.00000  3350.00000  2.206393460262e-04
3350.00000  3400.00000  2.438645403447e-04
3400.00000  3450.00000  2.681784156470e-04
3450.00000  3500.00000  2.848715240634e-04
3500.00000  3550.00000  2.812425874512e-04
3550.00000  3600.00000  3.197093155413e-04
3600.00000  3650.00000  3.360395302965e-04
3650.00000  3700.00000  3.995459210113e-04
3700.00000  3750.00000  3.534584260354e-04
3750.00000  3800.00000  3.846672809009e-04
3800.00000  3850.00000  4.314805631993e-04
3850.00000  3900.00000  4.024490703011e-04
3900.00000  3950.00000  4.401900110687e-04
3950.00000  4000.00000  4.630523117260e-04
4000.00000  4050.00000  4.605120560974e-04
4050.00000  4100.00000  4.735762279016e-04
4100.00000  4150.00000  5.069624447345e-04
4150.00000  4200.00000  5.174863609101e-04
4200.00000  4250.00000  5.298247453919e-04
4250.00000  4300.00000  5.450662791634e-04
4300.00000  4350.00000  5.283731707470e-04
4350.00000  4400.00000  5.454291728246e-04
4400.00000  4450.00000  5.831701135923e-04
4450.00000  4500.00000  5.686543671432e-04
4500.00000  4550.00000  5.860732628821e-04
4550.00000  4600.00000  5.915166678005e-04
4600.00000  4650.00000  6.005890093312e-04
4650.00000  4700.00000  6.125645001517e-04
4700.00000  4750.00000  6.205481606987e-04
4750.00000  4800.00000  6.216368416824e-04
4800.00000  4850.00000  6.488538662744e-04
4850.00000  4900.00000  6.328865451804e-04
4900.00000  4950.00000  6.582891014663e-04
4950.00000  5000.00000  6.793369338175e-04
5000.00000  5050.00000  6.542972711928e-04
5050.00000  5100.00000  6.499425472581e-04
5100.00000  5150.00000  6.564746331602e-04
5150.00000  5200.00000  6.575633141439e-04
5200.00000  5250.00000  6.804256148012e-04
5250.00000  5300.00000  6.760708908665e-04
5300.00000  5350.00000  6.978445105401e-04
5350.00000  5400.00000  6.840545514135e-04
5400.00000  5450.00000  7.185294492301e-04
5450.00000  5500.00000  6.684501239807e-04
5500.00000  5550.00000  7.105457886831e-04
5550.00000  5600.00000  6.876834880257e-04
5600.00000  5650.00000  6.902237436543e-04
5650.00000  5700.00000  7.051023837646e-04
5700.00000  5750.00000  7.047394901034e-04
5750.00000  5800.00000  6.902237436543e-04
5800.00000  5850.00000  6.760708908665e-04
5850.00000  5900.00000  6.891350626706e-04
5900.00000  5950.00000  6.691759113031e-04
5950.00000  6000.00000  6.760708908665e-04
6000.00000  6050.00000  6.575633141439e-04
6050.00000  6100.00000  6.865948070421e-04
6100.00000  6150.00000  6.938526802666e-04
6150.00000  6200.00000  7.032879154585e-04
6200.00000  6250.00000  7.493754104344e-04
6250.00000  6300.00000  7.740521793978e-04
6300.00000  6350.00000  7.551817090140e-04
6350.00000  6400.00000  2.354454074043e-03
6400.00000  6450.00000  6.397815247437e-04
6450.00000  6500.00000  6.637325063847e-04
6500.00000  6550.00000  6.880463816870e-04
6550.00000  6600.00000  6.894979563319e-04
6600.00000  6650.00000  6.858690197196e-04
6650.00000  6700.00000  6.267173529396e-04
6700.00000  6750.00000  6.470393979683e-04
6750.00000  6800.00000  6.444991423397e-04
6800.00000  6850.00000  6.546601648541e-04
6850.00000  6900.00000  6.481280789520e-04
6900.00000  6950.00000  6.372412691151e-04
6950.00000  7000.00000  6.256286719559e-04
7000.00000  7050.00000  6.328865451804e-04
7050.00000  7100.00000  7.918339687980e-04
7100.00000  7150.00000  4.354723934728e-04
7150.00000  7200.00000  4.332950315054e-04
7200.00000  7250.00000  4.234969026523e-04
7250.00000  7300.00000  4.115214118318e-04
7300.00000  7350.00000  4.245855836359e-04
7350.00000  7400.00000  4.191421787175e-04
7400.00000  7450.00000  4.009974956562e-04
7450.00000  7500.00000  4.641409927097e-04
7500.00000  7550.00000  4.078924752195e-04
7550.00000  7600.00000  4.274887329258e-04
7600.00000  7650.00000  4.122471991542e-04
7650.00000  7700.00000  4.068037942358e-04
7700.00000  7750.00000  4.195050723788e-04
7750.00000  7800.00000  3.886591111744e-04
7800.00000  7850.00000  4.147874547828e-04
7850.00000  7900.00000  4.078924752195e-04
7900.00000  7950.00000  3.973685590439e-04
7950.00000  8000.00000  4.039006449460e-04
8000.00000  8050.00000  3.817641316111e-04
8050.00000  8100.00000  3.810383442887e-04
8100.00000  8150.00000  4.020861766399e-04
8150.00000  8200.00000  4.111585181705e-04
8200.00000  8250.00000  4.107956245093e-04
8250.00000  8300.00000  4.213195406849e-04
8300.00000  8350.00000  3.864817492071e-04
8350.00000  8400.00000  3.846672809009e-04
8400.00000  8450.00000  3.970056653827e-04
8450.00000  8500.00000  3.734175774029e-04
8500.00000  8550.00000  3.803125569662e-04
8550.00000  8600.00000  3.843043872397e-04
8600.00000  8650.00000  3.759578330315e-04
8650.00000  8700.00000  3.857559618846e-04
8700.00000  8750.00000  3.766836203539e-04
8750.00000  8800.00000  3.795867696438e-04
8800.00000  8850.00000  3.745062583866e-04
8850.00000  8900.00000  3.843043872397e-04
8900.00000  8950.00000  3.512810640680e-04
8950.00000  9000.00000  3.686999598069e-04
9000.00000  9050.00000  3.661597041783e-04
9050.00000  9100.00000  3.643452358722e-04
9100.00000  9150.00000  3.788609823213e-04
9150.00000  9200.00000  3.494665957619e-04
9200.00000  9250.00000  3.570873626477e-04
9250.00000  9300.00000  3.549100006803e-04
9300.00000  9350.00000  3.349508493128e-04
9350.00000  9400.00000  3.599905119375e-04
9400.00000  9450.00000  3.476521274558e-04
9450.00000  9500.00000  3.429345098598e-04
9500.00000  9550.00000  3.465634464721e-04
9550.00000  9600.00000  3.447489781659e-04
9600.00000  9650.00000  3.403942542312e-04
9650.00000  9700.00000  3.389426795863e-04
9700.00000  9750.00000  3.498294894231e-04
9750.00000  9800.00000  3.447489781659e-04
9800.00000  9850.00000  3.178948472351e-04
9850.00000  9900.00000  3.262414014433e-04
9900.00000  9950.00000  3.131772296392e-04
9950.00000  10000.00000  3.244269331372e-04
