10001.00000  11001.00000  4.929802442032e-04
11001.00000  12001.00000  4.064339065290e-04
12001.00000  13001.00000  3.353811264878e-04
13001.00000  14001.00000  2.767832160210e-04
14001.00000  15001.00000  2.289895297631e-04
15001.00000  16001.00000  1.972146064817e-04
16001.00000  17001.00000  1.746307767115e-04
17001.00000  18001.00000  1.472075548477e-04
18001.00000  19001.00000  1.264619437797e-04
19001.00000  20001.00000  1.127315755141e-04
20001.00000  21001.00000  9.671281253755e-05
21001.00000  22001.00000  8.677142567857e-05
22001.00000  23001.00000  7.878080152399e-05
23001.00000  24001.00000  7.311608674774e-05
24001.00000  25001.00000  6.415008124096e-05
25001.00000  26001.00000  5.507153173201e-05
26001.00000  27001.00000  5.056977164492e-05
27001.00000  28001.00000  4.441736619257e-05
28001.00000  29001.00000  4.250411815556e-05
29001.00000  30001.00000  3.999063544027e-05
30001.00000  31001.00000  3.616413936625e-05
31001.00000  32001.00000  3.218758462266e-05
32001.00000  33001.00000  3.068699792696e-05
33001.00000  34001.00000  2.809848587689e-05
34001.00000  35001.00000  2.532240048985e-05
35001.00000  36001.00000  2.453459247461e-05
36001.00000  37001.00000  2.153341908322e-05
37001.00000  38001.00000  2.142087508105e-05
38001.00000  39001.00000  1.909496570272e-05
39001.00000  40001.00000  1.913248037011e-05
40001.00000  41001.00000  1.714420299832e-05
41001.00000  42001.00000  1.575616030480e-05
42001.00000  43001.00000  1.470574961781e-05
43001.00000  44001.00000  1.403048560475e-05
44001.00000  45001.00000  1.346776559386e-05
45001.00000  46001.00000  1.358030959604e-05
46001.00000  47001.00000  1.102931221336e-05
47001.00000  48001.00000  1.177960556121e-05
48001.00000  49001.00000  1.106682688075e-05
49001.00000  50001.00000  9.941386858980e-06
50001.00000  51001.00000  9.341152180702e-06
51001.00000  52001.00000  8.778432169816e-06
52001.00000  53001.00000  8.590858832854e-06
53001.00000  54001.00000  7.465418811083e-06
54001.00000  55001.00000  6.790154798020e-06
55001.00000  56001.00000  8.215712158931e-06
56001.00000  57001.00000  6.302464121919e-06
57001.00000  58001.00000  7.465418811083e-06
58001.00000  59001.00000  5.739744111034e-06
59001.00000  60001.00000  5.664714776249e-06
60001.00000  61001.00000  6.415008124096e-06
61001.00000  62001.00000  5.101994765363e-06
62001.00000  63001.00000  5.402112104502e-06
63001.00000  64001.00000  5.327082769717e-06
64001.00000  65001.00000  5.026965430578e-06
65001.00000  66001.00000  4.351701417516e-06
66001.00000  67001.00000  4.051584078377e-06
67001.00000  68001.00000  4.314186750123e-06
68001.00000  69001.00000  4.201642747946e-06
69001.00000  70001.00000  3.638922737061e-06
70001.00000  71001.00000  3.301290730529e-06
71001.00000  72001.00000  3.901525408807e-06
72001.00000  73001.00000  3.601408069668e-06
73001.00000  74001.00000  2.738570719644e-06
74001.00000  75001.00000  3.038688058783e-06
75001.00000  76001.00000  3.451349400099e-06
76001.00000  77001.00000  2.626026717466e-06
77001.00000  78001.00000  2.776085387036e-06
78001.00000  79001.00000  2.513482715289e-06
79001.00000  80001.00000  2.513482715289e-06
80001.00000  81001.00000  2.363424045720e-06
81001.00000  82001.00000  2.513482715289e-06
82001.00000  83001.00000  2.288394710935e-06
83001.00000  84001.00000  2.138336041365e-06
84001.00000  85001.00000  2.288394710935e-06
85001.00000  86001.00000  2.138336041365e-06
86001.00000  87001.00000  2.363424045720e-06
87001.00000  88001.00000  1.688160032657e-06
88001.00000  89001.00000  2.213365376150e-06
89001.00000  90001.00000  1.763189367442e-06
90001.00000  91001.00000  1.763189367442e-06
91001.00000  92001.00000  1.500586695695e-06
92001.00000  93001.00000  2.063306706581e-06
93001.00000  94001.00000  1.463072028303e-06
94001.00000  95001.00000  1.275498691341e-06
95001.00000  96001.00000  1.200469356556e-06
96001.00000  97001.00000  1.275498691341e-06
97001.00000  98001.00000  1.463072028303e-06
98001.00000  99001.00000  1.125440021771e-06
99001.00000  100001.00000  1.275498691341e-06
100001.00000  101001.00000  1.350528026126e-06
101001.00000  102001.00000  1.050410686987e-06
102001.00000  103001.00000  9.753813522018e-07
103001.00000  104001.00000  1.237984023948e-06
104001.00000  105001.00000  1.200469356556e-06
105001.00000  106001.00000  7.502933478475e-07
106001.00000  107001.00000  1.162954689164e-06
107001.00000  108001.00000  1.012896019594e-06
108001.00000  109001.00000  8.628373500247e-07
109001.00000  110001.00000  9.378666848094e-07
110001.00000  111001.00000  7.502933478475e-07
111001.00000  112001.00000  4.876906761009e-07
112001.00000  113001.00000  1.012896019594e-06
113001.00000  114001.00000  9.003520174170e-07
114001.00000  115001.00000  6.002346782780e-07
115001.00000  116001.00000  8.628373500247e-07
116001.00000  117001.00000  8.253226826323e-07
117001.00000  118001.00000  6.752640130628e-07
118001.00000  119001.00000  9.003520174170e-07
119001.00000  120001.00000  8.253226826323e-07
120001.00000  121001.00000  5.252053434933e-07
121001.00000  122001.00000  4.876906761009e-07
122001.00000  123001.00000  6.752640130628e-07
123001.00000  124001.00000  6.752640130628e-07
124001.00000  125001.00000  4.876906761009e-07
125001.00000  126001.00000  5.252053434933e-07
126001.00000  127001.00000  4.876906761009e-07
127001.00000  128001.00000  8.628373500247e-07
128001.00000  129001.00000  5.627200108857e-07
129001.00000  130001.00000  4.876906761009e-07
130001.00000  131001.00000  5.627200108857e-07
131001.00000  132001.00000  6.002346782780e-07
132001.00000  133001.00000  5.627200108857e-07
133001.00000  134001.00000  4.501760087085e-07
134001.00000  135001.00000  2.250880043543e-07
135001.00000  136001.00000  2.626026717466e-07
136001.00000  137001.00000  2.626026717466e-07
137001.00000  138001.00000  4.876906761009e-07
138001.00000  139001.00000  4.501760087085e-07
139001.00000  140001.00000  6.377493456704e-07
140001.00000  141001.00000  3.751466739238e-07
141001.00000  142001.00000  3.376320065314e-07
142001.00000  143001.00000  3.751466739238e-07
143001.00000  144001.00000  6.377493456704e-07
144001.00000  145001.00000  3.751466739238e-07
145001.00000  146001.00000  1.875733369619e-07
146001.00000  147001.00000  4.876906761009e-07
147001.00000  148001.00000  4.126613413161e-07
148001.00000  149001.00000  2.626026717466e-07
149001.00000  150001.00000  3.001173391390e-07
150001.00000  151001.00000  3.001173391390e-07
151001.00000  152001.00000  1.875733369619e-07
152001.00000  153001.00000  6.377493456704e-07
153001.00000  154001.00000  1.875733369619e-07
154001.00000  155001.00000  2.250880043543e-07
155001.00000  156001.00000  3.376320065314e-07
156001.00000  157001.00000  1.500586695695e-07
157001.00000  158001.00000  1.500586695695e-07
158001.00000  159001.00000  1.125440021771e-07
159001.00000  160001.00000  2.250880043543e-07
160001.00000  161001.00000  1.875733369619e-07
161001.00000  162001.00000  3.376320065314e-07
162001.00000  163001.00000  3.001173391390e-07
163001.00000  164001.00000  3.751466739238e-07
164001.00000  165001.00000  3.376320065314e-07
165001.00000  166001.00000  1.125440021771e-07
166001.00000  167001.00000  1.125440021771e-07
167001.00000  168001.00000  0.000000000000e+00
168001.00000  169001.00000  2.626026717466e-07
169001.00000  170001.00000  2.250880043543e-07
170001.00000  171001.00000  1.875733369619e-07
171001.00000  172001.00000  2.626026717466e-07
172001.00000  173001.00000  7.502933478475e-08
173001.00000  174001.00000  3.751466739238e-07
174001.00000  175001.00000  3.751466739238e-08
175001.00000  176001.00000  7.502933478475e-08
176001.00000  177001.00000  1.875733369619e-07
177001.00000  178001.00000  2.250880043543e-07
178001.00000  179001.00000  1.500586695695e-07
179001.00000  180001.00000  1.125440021771e-07
180001.00000  181001.00000  2.626026717466e-07
181001.00000  182001.00000  1.500586695695e-07
182001.00000  183001.00000  2.250880043543e-07
183001.00000  184001.00000  3.751466739238e-08
184001.00000  185001.00000  1.500586695695e-07
185001.00000  186001.00000  1.875733369619e-07
186001.00000  187001.00000  1.500586695695e-07
187001.00000  188001.00000  7.502933478475e-08
188001.00000  189001.00000  1.500586695695e-07
189001.00000  190001.00000  1.500586695695e-07
190001.00000  191001.00000  1.125440021771e-07
191001.00000  192001.00000  3.751466739238e-08
192001.00000  193001.00000  2.250880043543e-07
193001.00000  194001.00000  0.000000000000e+00
194001.00000  195001.00000  3.751466739238e-08
195001.00000  196001.00000  1.875733369619e-07
196001.00000  197001.00000  1.125440021771e-07
197001.00000  198001.00000  1.875733369619e-07
198001.00000  199001.00000  7.502933478475e-08
