300.00000  350.00000  2.507816559442e-06
350.00000  400.00000  1.929089661109e-06
400.00000  450.00000  2.893634491664e-06
450.00000  500.00000  1.350362762777e-06
500.00000  550.00000  9.452539339436e-06
550.00000  600.00000  1.543271728887e-06
600.00000  650.00000  3.279452423886e-06
650.00000  700.00000  2.121998627220e-06
700.00000  750.00000  3.086543457775e-06
750.00000  800.00000  2.893634491664e-06
800.00000  850.00000  6.751813813883e-06
850.00000  900.00000  2.893634491664e-06
900.00000  950.00000  1.543271728887e-06
950.00000  1000.00000  1.543271728887e-06
1000.00000  1050.00000  2.893634491664e-06
1050.00000  1100.00000  1.929089661109e-06
1100.00000  1150.00000  2.121998627220e-06
1150.00000  1200.00000  3.279452423886e-06
1200.00000  1250.00000  1.929089661109e-06
1250.00000  1300.00000  7.330540712215e-06
1300.00000  1350.00000  2.700725525553e-06
1350.00000  1400.00000  2.700725525553e-06
1400.00000  1450.00000  4.051088288330e-06
1450.00000  1500.00000  3.279452423886e-06
1500.00000  1550.00000  2.314907593331e-06
1550.00000  1600.00000  3.279452423886e-06
1600.00000  1650.00000  2.314907593331e-06
1650.00000  1700.00000  2.314907593331e-06
1700.00000  1750.00000  8.487994508881e-06
1750.00000  1800.00000  3.858179322219e-06
1800.00000  1850.00000  2.700725525553e-06
1850.00000  1900.00000  4.436906220551e-06
1900.00000  1950.00000  4.243997254441e-06
1950.00000  2000.00000  3.665270356108e-06
2000.00000  2050.00000  4.822724152773e-06
2050.00000  2100.00000  4.051088288330e-06
2100.00000  2150.00000  5.594360017217e-06
2150.00000  2200.00000  3.279452423886e-06
2200.00000  2250.00000  6.944722779994e-06
2250.00000  2300.00000  3.858179322219e-06
2300.00000  2350.00000  1.716889798387e-05
2350.00000  2400.00000  4.243997254441e-06
2400.00000  2450.00000  5.980177949439e-06
2450.00000  2500.00000  6.751813813883e-06
2500.00000  2550.00000  4.822724152773e-06
2550.00000  2600.00000  6.173086915550e-06
2600.00000  2650.00000  7.909267610548e-06
2650.00000  2700.00000  7.330540712215e-06
2700.00000  2750.00000  8.295085542770e-06
2750.00000  2800.00000  6.365995881661e-06
2800.00000  2850.00000  7.716358644437e-06
2850.00000  2900.00000  8.295085542770e-06
2900.00000  2950.00000  9.066721407214e-06
2950.00000  3000.00000  1.504689935665e-05
3000.00000  3050.00000  8.102176576659e-06
3050.00000  3100.00000  8.295085542770e-06
3100.00000  3150.00000  9.452539339436e-06
3150.00000  3200.00000  9.452539339436e-06
3200.00000  3250.00000  9.838357271658e-06
3250.00000  3300.00000  9.838357271658e-06
3300.00000  3350.00000  1.138162900054e-05
3350.00000  3400.00000  1.099581106832e-05
3400.00000  3450.00000  1.041708416999e-05
3450.00000  3500.00000  1.157453796666e-05
3500.00000  3550.00000  1.446817245832e-05
3550.00000  3600.00000  1.562562625499e-05
3600.00000  3650.00000  1.350362762777e-05
3650.00000  3700.00000  2.334198489942e-05
3700.00000  3750.00000  1.485399039054e-05
3750.00000  3800.00000  1.427526349221e-05
3800.00000  3850.00000  1.388944555999e-05
3850.00000  3900.00000  1.523980832276e-05
3900.00000  3950.00000  1.890507867887e-05
3950.00000  4000.00000  1.620435315332e-05
4000.00000  4050.00000  1.986962350943e-05
4050.00000  4100.00000  1.601144418721e-05
4100.00000  4150.00000  1.986962350943e-05
4150.00000  4200.00000  1.948380557720e-05
4200.00000  4250.00000  1.697598901776e-05
4250.00000  4300.00000  1.851926074665e-05
4300.00000  4350.00000  1.832635178054e-05
4350.00000  4400.00000  1.929089661109e-05
4400.00000  4450.00000  1.813344281443e-05
4450.00000  4500.00000  1.851926074665e-05
4500.00000  4550.00000  1.890507867887e-05
4550.00000  4600.00000  1.716889798387e-05
4600.00000  4650.00000  1.890507867887e-05
4650.00000  4700.00000  1.697598901776e-05
4700.00000  4750.00000  1.929089661109e-05
4750.00000  4800.00000  2.025544144165e-05
4800.00000  4850.00000  1.794053384832e-05
4850.00000  4900.00000  1.774762488221e-05
4900.00000  4950.00000  2.102707730609e-05
4950.00000  5000.00000  2.083416833998e-05
5000.00000  5050.00000  2.141289523831e-05
5050.00000  5100.00000  2.334198489942e-05
5100.00000  5150.00000  2.295616696720e-05
5150.00000  5200.00000  2.276325800109e-05
5200.00000  5250.00000  2.064125937387e-05
5250.00000  5300.00000  1.851926074665e-05
5300.00000  5350.00000  2.372780283164e-05
5350.00000  5400.00000  2.179871317054e-05
5400.00000  5450.00000  2.527107456053e-05
5450.00000  5500.00000  2.295616696720e-05
5500.00000  5550.00000  2.469234766220e-05
5550.00000  5600.00000  2.257034903498e-05
5600.00000  5650.00000  2.527107456053e-05
5650.00000  5700.00000  2.353489386553e-05
5700.00000  5750.00000  2.507816559442e-05
5750.00000  5800.00000  2.353489386553e-05
5800.00000  5850.00000  2.199162213665e-05
5850.00000  5900.00000  2.835761801831e-05
5900.00000  5950.00000  2.141289523831e-05
5950.00000  6000.00000  2.199162213665e-05
6000.00000  6050.00000  1.890507867887e-05
6050.00000  6100.00000  2.141289523831e-05
6100.00000  6150.00000  2.662143732331e-05
6150.00000  6200.00000  2.720016422164e-05
6200.00000  6250.00000  3.125125250997e-05
6250.00000  6300.00000  4.340451737496e-05
6300.00000  6350.00000  4.475488013774e-05
6350.00000  6400.00000  3.507085003897e-04
6400.00000  6450.00000  2.527107456053e-05
6450.00000  6500.00000  2.777889111997e-05
6500.00000  6550.00000  2.141289523831e-05
6550.00000  6600.00000  2.584980145886e-05
6600.00000  6650.00000  2.314907593331e-05
6650.00000  6700.00000  1.813344281443e-05
6700.00000  6750.00000  2.584980145886e-05
6750.00000  6800.00000  2.488525662831e-05
6800.00000  6850.00000  2.006253247554e-05
6850.00000  6900.00000  2.546398352664e-05
6900.00000  6950.00000  2.720016422164e-05
6950.00000  7000.00000  2.527107456053e-05
7000.00000  7050.00000  2.334198489942e-05
7050.00000  7100.00000  5.748687190106e-05
7100.00000  7150.00000  1.292490072943e-05
7150.00000  7200.00000  1.427526349221e-05
7200.00000  7250.00000  1.755471591609e-05
7250.00000  7300.00000  1.678308005165e-05
7300.00000  7350.00000  1.311780969554e-05
7350.00000  7400.00000  1.659017108554e-05
7400.00000  7450.00000  1.543271728887e-05
7450.00000  7500.00000  3.067252561164e-05
7500.00000  7550.00000  1.601144418721e-05
7550.00000  7600.00000  1.504689935665e-05
7600.00000  7650.00000  1.408235452610e-05
7650.00000  7700.00000  1.253908279721e-05
7700.00000  7750.00000  1.504689935665e-05
7750.00000  7800.00000  1.659017108554e-05
7800.00000  7850.00000  1.253908279721e-05
7850.00000  7900.00000  1.446817245832e-05
7900.00000  7950.00000  1.446817245832e-05
7950.00000  8000.00000  1.736180694998e-05
8000.00000  8050.00000  1.659017108554e-05
8050.00000  8100.00000  1.581853522110e-05
8100.00000  8150.00000  1.543271728887e-05
8150.00000  8200.00000  1.581853522110e-05
8200.00000  8250.00000  1.311780969554e-05
8250.00000  8300.00000  1.639726211943e-05
8300.00000  8350.00000  1.234617383110e-05
8350.00000  8400.00000  1.311780969554e-05
8400.00000  8450.00000  1.331071866165e-05
8450.00000  8500.00000  1.446817245832e-05
8500.00000  8550.00000  1.794053384832e-05
8550.00000  8600.00000  1.523980832276e-05
8600.00000  8650.00000  1.388944555999e-05
8650.00000  8700.00000  1.504689935665e-05
8700.00000  8750.00000  1.485399039054e-05
8750.00000  8800.00000  1.639726211943e-05
8800.00000  8850.00000  1.466108142443e-05
8850.00000  8900.00000  1.485399039054e-05
8900.00000  8950.00000  1.311780969554e-05
8950.00000  9000.00000  1.408235452610e-05
9000.00000  9050.00000  1.794053384832e-05
9050.00000  9100.00000  1.273199176332e-05
9100.00000  9150.00000  1.408235452610e-05
9150.00000  9200.00000  1.196035589888e-05
9200.00000  9250.00000  1.485399039054e-05
9250.00000  9300.00000  1.697598901776e-05
9300.00000  9350.00000  1.504689935665e-05
9350.00000  9400.00000  1.620435315332e-05
9400.00000  9450.00000  1.369653659388e-05
9450.00000  9500.00000  1.466108142443e-05
9500.00000  9550.00000  1.427526349221e-05
9550.00000  9600.00000  1.350362762777e-05
9600.00000  9650.00000  1.504689935665e-05
9650.00000  9700.00000  1.485399039054e-05
9700.00000  9750.00000  1.504689935665e-05
9750.00000  9800.00000  1.388944555999e-05
9800.00000  9850.00000  1.253908279721e-05
9850.00000  9900.00000  1.466108142443e-05
9900.00000  9950.00000  1.485399039054e-05
9950.00000  10000.00000  1.253908279721e-05
