10001.00000  11001.00000  4.890420916696e-04
11001.00000  12001.00000  4.105707968583e-04
12001.00000  13001.00000  3.474622674632e-04
13001.00000  14001.00000  2.957777898450e-04
14001.00000  15001.00000  2.581550545858e-04
15001.00000  16001.00000  2.268413900426e-04
16001.00000  17001.00000  1.975059934359e-04
17001.00000  18001.00000  1.748539344523e-04
18001.00000  19001.00000  1.567287228186e-04
19001.00000  20001.00000  1.386213334186e-04
20001.00000  21001.00000  1.253437693408e-04
21001.00000  22001.00000  1.158088743320e-04
22001.00000  23001.00000  1.055789122103e-04
23001.00000  24001.00000  9.565192806088e-05
24001.00000  25001.00000  8.634872208962e-05
25001.00000  26001.00000  8.069907401894e-05
26001.00000  27001.00000  7.515635935024e-05
27001.00000  28001.00000  6.822351045594e-05
28001.00000  29001.00000  6.141541719728e-05
29001.00000  30001.00000  5.706679218389e-05
30001.00000  31001.00000  5.635390283743e-05
31001.00000  32001.00000  5.191616665574e-05
32001.00000  33001.00000  4.911807597089e-05
33001.00000  34001.00000  4.689029676322e-05
34001.00000  35001.00000  4.286247195573e-05
35001.00000  36001.00000  3.922673628880e-05
36001.00000  37001.00000  3.780095759589e-05
37001.00000  38001.00000  3.475335563978e-05
38001.00000  39001.00000  3.352362151714e-05
39001.00000  40001.00000  3.234735409549e-05
40001.00000  41001.00000  3.022650828978e-05
41001.00000  42001.00000  2.878290736321e-05
42001.00000  43001.00000  2.757099547423e-05
43001.00000  44001.00000  2.473726032206e-05
44001.00000  45001.00000  2.290157025493e-05
45001.00000  46001.00000  2.325801492816e-05
46001.00000  47001.00000  2.208174750651e-05
47001.00000  48001.00000  2.108370242147e-05
48001.00000  49001.00000  2.131539145907e-05
49001.00000  50001.00000  1.910543448505e-05
50001.00000  51001.00000  1.844601183958e-05
51001.00000  52001.00000  1.828561173662e-05
52001.00000  53001.00000  1.718063324962e-05
53001.00000  54001.00000  1.598654359430e-05
54001.00000  55001.00000  1.557663222009e-05
55001.00000  56001.00000  1.488156510729e-05
56001.00000  57001.00000  1.479245393898e-05
57001.00000  58001.00000  1.338449747973e-05
58001.00000  59001.00000  1.327756407776e-05
59001.00000  60001.00000  1.256467473131e-05
60001.00000  61001.00000  1.190525208583e-05
61001.00000  62001.00000  1.156662964627e-05
62001.00000  63001.00000  1.210129665611e-05
63001.00000  64001.00000  1.099631816910e-05
64001.00000  65001.00000  1.047947339292e-05
65001.00000  66001.00000  1.101414040276e-05
66001.00000  67001.00000  9.784406280124e-06
67001.00000  68001.00000  9.588361709848e-06
68001.00000  69001.00000  9.231917036619e-06
69001.00000  70001.00000  8.750716727761e-06
70001.00000  71001.00000  8.519027690162e-06
71001.00000  72001.00000  8.251694185241e-06
72001.00000  73001.00000  8.269516418902e-06
73001.00000  74001.00000  7.770493876382e-06
74001.00000  75001.00000  7.699204941737e-06
75001.00000  76001.00000  7.378404735831e-06
76001.00000  77001.00000  7.307115801185e-06
77001.00000  78001.00000  7.592271539768e-06
78001.00000  79001.00000  6.344715183468e-06
79001.00000  80001.00000  7.218004632878e-06
80001.00000  81001.00000  6.291248482484e-06
81001.00000  82001.00000  6.059559444885e-06
82001.00000  83001.00000  6.398181884452e-06
83001.00000  84001.00000  6.006092743901e-06
84001.00000  85001.00000  5.720937005318e-06
85001.00000  86001.00000  4.936758724215e-06
86001.00000  87001.00000  5.453603500397e-06
87001.00000  88001.00000  5.453603500397e-06
88001.00000  89001.00000  5.311025631105e-06
89001.00000  90001.00000  4.918936490554e-06
90001.00000  91001.00000  4.794180854924e-06
91001.00000  92001.00000  4.669425219294e-06
92001.00000  93001.00000  4.384269480711e-06
93001.00000  94001.00000  4.865469789570e-06
94001.00000  95001.00000  5.079336593507e-06
95001.00000  96001.00000  4.277336078743e-06
96001.00000  97001.00000  3.849602470868e-06
97001.00000  98001.00000  3.742669068900e-06
98001.00000  99001.00000  3.903069171853e-06
99001.00000  100001.00000  4.402091714373e-06
100001.00000  101001.00000  3.831780237207e-06
101001.00000  102001.00000  3.582268965947e-06
102001.00000  103001.00000  3.261468760041e-06
103001.00000  104001.00000  3.564446732285e-06
104001.00000  105001.00000  3.439691096655e-06
105001.00000  106001.00000  3.101068657088e-06
106001.00000  107001.00000  3.546624498624e-06
107001.00000  108001.00000  3.421868862994e-06
108001.00000  109001.00000  3.528802264963e-06
109001.00000  110001.00000  2.976313021458e-06
110001.00000  111001.00000  3.118890890750e-06
111001.00000  112001.00000  2.299068142324e-06
112001.00000  113001.00000  2.869379619490e-06
113001.00000  114001.00000  3.047601956104e-06
114001.00000  115001.00000  2.869379619490e-06
115001.00000  116001.00000  2.637690581891e-06
116001.00000  117001.00000  2.477290478938e-06
117001.00000  118001.00000  2.798090684844e-06
118001.00000  119001.00000  2.637690581891e-06
119001.00000  120001.00000  2.762446217521e-06
120001.00000  121001.00000  2.441646011616e-06
121001.00000  122001.00000  2.548579413584e-06
122001.00000  123001.00000  2.388179310631e-06
123001.00000  124001.00000  2.103023572048e-06
124001.00000  125001.00000  2.156490273033e-06
125001.00000  126001.00000  1.889156768111e-06
126001.00000  127001.00000  1.924801235434e-06
127001.00000  128001.00000  1.728756665158e-06
128001.00000  129001.00000  2.031734637403e-06
129001.00000  130001.00000  1.978267936418e-06
130001.00000  131001.00000  1.782223366143e-06
131001.00000  132001.00000  1.853512300788e-06
132001.00000  133001.00000  1.835690067127e-06
133001.00000  134001.00000  2.013912403741e-06
134001.00000  135001.00000  2.067379104726e-06
135001.00000  136001.00000  1.693112197836e-06
136001.00000  137001.00000  2.120845805710e-06
137001.00000  138001.00000  1.675289964174e-06
138001.00000  139001.00000  1.996090170080e-06
139001.00000  140001.00000  1.604001029528e-06
140001.00000  141001.00000  1.782223366143e-06
141001.00000  142001.00000  1.532712094883e-06
142001.00000  143001.00000  1.639645496851e-06
143001.00000  144001.00000  1.372311991930e-06
144001.00000  145001.00000  1.586178795867e-06
145001.00000  146001.00000  1.336667524607e-06
146001.00000  147001.00000  1.550534328544e-06
147001.00000  148001.00000  1.443600926576e-06
148001.00000  149001.00000  1.497067627560e-06
149001.00000  150001.00000  1.283200823623e-06
150001.00000  151001.00000  1.265378589961e-06
151001.00000  152001.00000  1.728756665158e-06
152001.00000  153001.00000  1.301023057284e-06
153001.00000  154001.00000  1.301023057284e-06
154001.00000  155001.00000  1.336667524607e-06
155001.00000  156001.00000  1.550534328544e-06
156001.00000  157001.00000  1.122800720670e-06
157001.00000  158001.00000  1.283200823623e-06
158001.00000  159001.00000  1.015867318701e-06
159001.00000  160001.00000  1.158445187993e-06
160001.00000  161001.00000  1.247556356300e-06
161001.00000  162001.00000  1.301023057284e-06
162001.00000  163001.00000  1.015867318701e-06
163001.00000  164001.00000  1.354489758268e-06
164001.00000  165001.00000  8.911116830714e-07
165001.00000  166001.00000  8.732894494099e-07
166001.00000  167001.00000  9.267561503942e-07
167001.00000  168001.00000  8.376449820871e-07
168001.00000  169001.00000  8.554672157485e-07
169001.00000  170001.00000  9.802228513785e-07
170001.00000  171001.00000  9.445783840556e-07
171001.00000  172001.00000  9.624006177171e-07
172001.00000  173001.00000  9.445783840556e-07
173001.00000  174001.00000  6.772448791342e-07
174001.00000  175001.00000  6.772448791342e-07
175001.00000  176001.00000  8.911116830714e-07
176001.00000  177001.00000  8.020005147642e-07
177001.00000  178001.00000  9.445783840556e-07
178001.00000  179001.00000  9.624006177171e-07
179001.00000  180001.00000  9.624006177171e-07
180001.00000  181001.00000  8.911116830714e-07
181001.00000  182001.00000  8.554672157485e-07
182001.00000  183001.00000  7.485338137799e-07
183001.00000  184001.00000  7.307115801185e-07
184001.00000  185001.00000  8.732894494099e-07
185001.00000  186001.00000  8.376449820871e-07
186001.00000  187001.00000  8.198227484257e-07
187001.00000  188001.00000  8.554672157485e-07
188001.00000  189001.00000  8.376449820871e-07
189001.00000  190001.00000  8.376449820871e-07
190001.00000  191001.00000  7.663560474414e-07
191001.00000  192001.00000  7.841782811028e-07
192001.00000  193001.00000  7.307115801185e-07
193001.00000  194001.00000  5.524892435042e-07
194001.00000  195001.00000  6.594226454728e-07
195001.00000  196001.00000  8.376449820871e-07
196001.00000  197001.00000  7.307115801185e-07
197001.00000  198001.00000  7.128893464571e-07
198001.00000  199001.00000  4.455558415357e-07
