300.00000  350.00000  7.760773626940e-02
350.00000  400.00000  6.159837805788e-02
400.00000  450.00000  5.053364360177e-02
450.00000  500.00000  4.199060276233e-02
500.00000  550.00000  3.583542094907e-02
550.00000  600.00000  3.095751293078e-02
600.00000  650.00000  2.694771572752e-02
650.00000  700.00000  2.389713360873e-02
700.00000  750.00000  2.122749633332e-02
750.00000  800.00000  1.900713210335e-02
800.00000  850.00000  1.730457067900e-02
850.00000  900.00000  1.563526634416e-02
900.00000  950.00000  1.433017752889e-02
950.00000  1000.00000  1.308192810294e-02
1000.00000  1050.00000  1.205438481641e-02
1050.00000  1100.00000  1.126508322559e-02
1100.00000  1150.00000  1.036351376293e-02
1150.00000  1200.00000  9.733039969231e-03
1200.00000  1250.00000  8.990096745587e-03
1250.00000  1300.00000  8.488620147532e-03
1300.00000  1350.00000  7.921637161066e-03
1350.00000  1400.00000  7.538475178389e-03
1400.00000  1450.00000  7.039417277753e-03
1450.00000  1500.00000  6.744739308960e-03
1500.00000  1550.00000  6.301109890826e-03
1550.00000  1600.00000  6.020540990307e-03
1600.00000  1650.00000  5.733119113770e-03
1650.00000  1700.00000  5.420300914340e-03
1700.00000  1750.00000  5.178834288750e-03
1750.00000  1800.00000  4.909351084731e-03
1800.00000  1850.00000  4.655790972049e-03
1850.00000  1900.00000  4.515103405553e-03
1900.00000  1950.00000  4.339143168374e-03
1950.00000  2000.00000  4.142624003140e-03
2000.00000  2050.00000  4.017859527981e-03
2050.00000  2100.00000  3.823960618283e-03
2100.00000  2150.00000  3.658884519486e-03
2150.00000  2200.00000  3.582292434574e-03
2200.00000  2250.00000  3.419635033196e-03
2250.00000  2300.00000  3.223317426079e-03
2300.00000  2350.00000  3.189455662224e-03
2350.00000  2400.00000  3.078598697220e-03
2400.00000  2450.00000  2.927026992341e-03
2450.00000  2500.00000  2.894173019077e-03
2500.00000  2550.00000  2.769005427681e-03
2550.00000  2600.00000  2.660970276332e-03
2600.00000  2650.00000  2.587804679429e-03
2650.00000  2700.00000  2.498715991190e-03
2700.00000  2750.00000  2.451954507770e-03
2750.00000  2800.00000  2.358834657167e-03
2800.00000  2850.00000  2.274986480000e-03
2850.00000  2900.00000  2.241124716144e-03
2900.00000  2950.00000  2.112933752976e-03
2950.00000  3000.00000  2.098421568466e-03
3000.00000  3050.00000  2.054481898701e-03
3050.00000  3100.00000  1.995425370072e-03
3100.00000  3150.00000  1.886583986250e-03
3150.00000  3200.00000  1.914197448441e-03
3200.00000  3250.00000  1.813015273111e-03
3250.00000  3300.00000  1.793262577528e-03
3300.00000  3350.00000  1.754361860718e-03
3350.00000  3400.00000  1.679785356988e-03
3400.00000  3450.00000  1.657412405869e-03
3450.00000  3500.00000  1.617503898467e-03
3500.00000  3550.00000  1.581626553430e-03
3550.00000  3600.00000  1.522771582918e-03
3600.00000  3650.00000  1.510476537709e-03
3650.00000  3700.00000  1.467947774771e-03
3700.00000  3750.00000  1.444567033061e-03
3750.00000  3800.00000  1.411309943560e-03
3800.00000  3850.00000  1.383091807013e-03
3850.00000  3900.00000  1.362935995194e-03
3900.00000  3950.00000  1.311941791293e-03
3950.00000  4000.00000  1.297026490547e-03
4000.00000  4050.00000  1.268606795882e-03
4050.00000  4100.00000  1.256714866909e-03
4100.00000  4150.00000  1.199270803225e-03
4150.00000  4200.00000  1.172060457269e-03
4200.00000  4250.00000  1.135779995995e-03
4250.00000  4300.00000  1.160571644533e-03
4300.00000  4350.00000  1.104135371440e-03
4350.00000  4400.00000  1.093452791176e-03
4400.00000  4450.00000  1.072087630648e-03
4450.00000  4500.00000  1.057172329902e-03
4500.00000  4550.00000  1.030768216419e-03
4550.00000  4600.00000  1.021698101100e-03
4600.00000  4650.00000  9.819911518171e-04
4650.00000  4700.00000  9.823942680535e-04
4700.00000  4750.00000  9.676805254257e-04
4750.00000  4800.00000  9.592150844617e-04
4800.00000  4850.00000  9.074146480871e-04
4850.00000  4900.00000  9.193065770603e-04
4900.00000  4950.00000  8.967320678231e-04
4950.00000  5000.00000  8.947164866412e-04
5000.00000  5050.00000  8.614593971400e-04
5050.00000  5100.00000  8.596453740763e-04
5100.00000  5150.00000  8.415051434393e-04
5150.00000  5200.00000  8.239695871569e-04
5200.00000  5250.00000  8.144963556020e-04
5250.00000  5300.00000  8.046200078107e-04
5300.00000  5350.00000  7.838595216372e-04
5350.00000  5400.00000  7.790221268007e-04
5400.00000  5450.00000  7.504008740179e-04
5450.00000  5500.00000  7.604787799273e-04
5500.00000  5550.00000  7.387105031629e-04
5550.00000  5600.00000  7.372995963356e-04
5600.00000  5650.00000  7.064612042526e-04
5650.00000  5700.00000  7.193609238167e-04
5700.00000  5750.00000  7.117017153256e-04
5750.00000  5800.00000  6.721963241605e-04
5800.00000  5850.00000  6.701807429786e-04
5850.00000  5900.00000  6.578856977691e-04
5900.00000  5950.00000  6.592966045964e-04
5950.00000  6000.00000  6.510327217507e-04
6000.00000  6050.00000  6.387376765411e-04
6050.00000  6100.00000  6.399470252503e-04
6100.00000  6150.00000  6.151553767130e-04
6150.00000  6200.00000  6.115273305856e-04
6200.00000  6250.00000  6.000385178488e-04
6250.00000  6300.00000  6.048759126854e-04
6300.00000  6350.00000  5.772624504935e-04
6350.00000  6400.00000  7.195624819349e-04
6400.00000  6450.00000  5.671845445840e-04
6450.00000  6500.00000  5.641611728112e-04
6500.00000  6550.00000  5.607346848020e-04
6550.00000  6600.00000  5.661767539931e-04
6600.00000  6650.00000  5.341290132010e-04
6650.00000  6700.00000  5.379586174466e-04
6700.00000  6750.00000  5.282838277735e-04
6750.00000  6800.00000  5.071202253637e-04
6800.00000  6850.00000  5.176012475095e-04
6850.00000  6900.00000  5.129654107912e-04
6900.00000  6950.00000  5.065155510091e-04
6950.00000  7000.00000  4.903909015540e-04
7000.00000  7050.00000  4.920033664995e-04
7050.00000  7100.00000  4.899877853176e-04
7100.00000  7150.00000  4.938173895632e-04
7150.00000  7200.00000  4.379857908248e-04
7200.00000  7250.00000  4.426216275432e-04
7250.00000  7300.00000  4.655992530167e-04
7300.00000  7350.00000  4.468543480251e-04
7350.00000  7400.00000  4.567306958164e-04
7400.00000  7450.00000  4.313343729246e-04
7450.00000  7500.00000  4.395982557703e-04
7500.00000  7550.00000  4.194424439514e-04
7550.00000  7600.00000  4.242798387880e-04
7600.00000  7650.00000  4.166206302968e-04
7650.00000  7700.00000  4.212564670151e-04
7700.00000  7750.00000  4.008990970780e-04
7750.00000  7800.00000  3.867900288048e-04
7800.00000  7850.00000  4.029146782599e-04
7850.00000  7900.00000  4.031162363781e-04
7900.00000  7950.00000  4.041240269691e-04
7950.00000  8000.00000  3.744949835953e-04
8000.00000  8050.00000  3.783245878409e-04
8050.00000  8100.00000  3.775183553681e-04
8100.00000  8150.00000  3.740918673589e-04
8150.00000  8200.00000  3.573625435492e-04
8200.00000  8250.00000  3.722778442952e-04
8250.00000  8300.00000  3.698591468769e-04
8300.00000  8350.00000  3.493002188216e-04
8350.00000  8400.00000  3.624014965039e-04
8400.00000  8450.00000  3.486955444671e-04
8450.00000  8500.00000  3.345864761938e-04
8500.00000  8550.00000  3.555485204855e-04
8550.00000  8600.00000  3.255163608753e-04
8600.00000  8650.00000  3.426488009214e-04
8650.00000  8700.00000  3.303537557119e-04
8700.00000  8750.00000  3.190665010933e-04
8750.00000  8800.00000  3.208805241570e-04
8800.00000  8850.00000  3.241054540480e-04
8850.00000  8900.00000  3.049574328200e-04
8900.00000  8950.00000  3.130197575476e-04
8950.00000  9000.00000  3.140275481386e-04
9000.00000  9050.00000  3.164462455568e-04
9050.00000  9100.00000  2.964919918561e-04
9100.00000  9150.00000  3.087870370656e-04
9150.00000  9200.00000  3.033449678745e-04
9200.00000  9250.00000  2.932670619651e-04
9250.00000  9300.00000  2.848016210011e-04
9300.00000  9350.00000  2.918561551378e-04
9350.00000  9400.00000  2.799642261646e-04
9400.00000  9450.00000  2.835922722920e-04
9450.00000  9500.00000  2.805689005192e-04
9500.00000  9550.00000  2.936701782015e-04
9550.00000  9600.00000  2.791579936918e-04
9600.00000  9650.00000  2.751268313281e-04
9650.00000  9700.00000  2.700878783733e-04
9700.00000  9750.00000  2.588006237548e-04
9750.00000  9800.00000  2.712972270825e-04
9800.00000  9850.00000  2.606146468185e-04
9850.00000  9900.00000  2.680722971914e-04
9900.00000  9950.00000  2.585990656366e-04
9950.00000  10000.00000  2.450946717179e-04
