300.00000  350.00000  2.521699977490e-04
350.00000  400.00000  2.791080390515e-04
400.00000  450.00000  1.563902953399e-04
450.00000  500.00000  1.556420164148e-04
500.00000  550.00000  6.929062846159e-04
550.00000  600.00000  9.129002885868e-05
600.00000  650.00000  2.080215411698e-04
650.00000  700.00000  9.129002885868e-05
700.00000  750.00000  1.287039751122e-04
750.00000  800.00000  7.707272928233e-05
800.00000  850.00000  3.008081278786e-04
850.00000  900.00000  7.782100820740e-05
900.00000  950.00000  7.183477680683e-05
950.00000  1000.00000  8.006584498261e-05
1000.00000  1050.00000  8.605207638318e-05
1050.00000  1100.00000  7.482789250711e-05
1100.00000  1150.00000  7.033821895669e-05
1150.00000  1200.00000  6.809338218147e-05
1200.00000  1250.00000  9.054174993361e-05
1250.00000  1300.00000  2.327147456971e-04
1300.00000  1350.00000  7.632445035726e-05
1350.00000  1400.00000  8.305896068290e-05
1400.00000  1450.00000  9.577970240910e-05
1450.00000  1500.00000  9.278658670882e-05
1500.00000  1550.00000  1.002693759595e-04
1550.00000  1600.00000  8.904519208346e-05
1600.00000  1650.00000  1.017659338097e-04
1650.00000  1700.00000  9.054174993361e-05
1700.00000  1750.00000  2.843459915270e-04
1750.00000  1800.00000  1.099970019855e-04
1800.00000  1850.00000  9.577970240910e-05
1850.00000  1900.00000  9.802453918432e-05
1900.00000  1950.00000  9.727626025925e-05
1950.00000  2000.00000  1.062556073601e-04
2000.00000  2050.00000  1.234660226367e-04
2050.00000  2100.00000  1.092487230604e-04
2100.00000  2150.00000  1.197246280114e-04
2150.00000  2200.00000  1.129901176857e-04
2200.00000  2250.00000  1.272074172621e-04
2250.00000  2300.00000  1.197246280114e-04
2300.00000  2350.00000  2.940736175530e-04
2350.00000  2400.00000  1.212211858615e-04
2400.00000  2450.00000  1.055073284350e-04
2450.00000  2500.00000  1.204729069365e-04
2500.00000  2550.00000  9.952109703446e-05
2550.00000  2600.00000  9.652798133418e-05
2600.00000  2650.00000  9.129002885868e-05
2650.00000  2700.00000  1.114935598356e-04
2700.00000  2750.00000  1.017659338097e-04
2750.00000  2800.00000  9.877281810939e-05
2800.00000  2850.00000  1.219694647866e-04
2850.00000  2900.00000  9.278658670882e-05
2900.00000  2950.00000  1.002693759595e-04
2950.00000  3000.00000  1.466626693139e-04
3000.00000  3050.00000  1.092487230604e-04
3050.00000  3100.00000  1.085004441353e-04
3100.00000  3150.00000  1.025142127347e-04
3150.00000  3200.00000  8.455551853304e-05
3200.00000  3250.00000  1.017659338097e-04
3250.00000  3300.00000  1.032624916598e-04
3300.00000  3350.00000  8.006584498261e-05
3350.00000  3400.00000  8.904519208346e-05
3400.00000  3450.00000  7.632445035726e-05
3450.00000  3500.00000  9.652798133418e-05
3500.00000  3550.00000  8.380723960797e-05
3550.00000  3600.00000  7.707272928233e-05
3600.00000  3650.00000  7.632445035726e-05
3650.00000  3700.00000  1.025142127347e-04
3700.00000  3750.00000  7.333133465697e-05
3750.00000  3800.00000  8.081412390768e-05
3800.00000  3850.00000  8.081412390768e-05
3850.00000  3900.00000  7.557617143218e-05
3900.00000  3950.00000  6.584854540626e-05
3950.00000  4000.00000  7.407961358204e-05
4000.00000  4050.00000  7.108649788176e-05
4050.00000  4100.00000  7.931756605754e-05
4100.00000  4150.00000  6.360370863105e-05
4150.00000  4200.00000  7.482789250711e-05
4200.00000  4250.00000  5.911403508062e-05
4250.00000  4300.00000  5.686919830541e-05
4300.00000  4350.00000  5.387608260512e-05
4350.00000  4400.00000  5.686919830541e-05
4400.00000  4450.00000  4.489673550427e-05
4450.00000  4500.00000  4.863813012962e-05
4500.00000  4550.00000  5.163124582991e-05
4550.00000  4600.00000  5.537264045526e-05
4600.00000  4650.00000  3.891050410370e-05
4650.00000  4700.00000  4.863813012962e-05
4700.00000  4750.00000  5.013468797977e-05
4750.00000  4800.00000  5.387608260512e-05
4800.00000  4850.00000  5.986231400569e-05
4850.00000  4900.00000  5.986231400569e-05
4900.00000  4950.00000  5.088296690484e-05
4950.00000  5000.00000  4.115534087891e-05
5000.00000  5050.00000  4.564501442934e-05
5050.00000  5100.00000  3.741394625356e-05
5100.00000  5150.00000  3.591738840341e-05
5150.00000  5200.00000  4.340017765413e-05
5200.00000  5250.00000  3.741394625356e-05
5250.00000  5300.00000  3.292427270313e-05
5300.00000  5350.00000  3.741394625356e-05
5350.00000  5400.00000  3.516910947834e-05
5400.00000  5450.00000  3.591738840341e-05
5450.00000  5500.00000  3.891050410370e-05
5500.00000  5550.00000  3.217599377806e-05
5550.00000  5600.00000  3.217599377806e-05
5600.00000  5650.00000  3.516910947834e-05
5650.00000  5700.00000  2.319664667721e-05
5700.00000  5750.00000  3.217599377806e-05
5750.00000  5800.00000  2.993115700285e-05
5800.00000  5850.00000  4.265189872905e-05
5850.00000  5900.00000  2.993115700285e-05
5900.00000  5950.00000  2.020353097692e-05
5950.00000  6000.00000  3.442083055327e-05
6000.00000  6050.00000  3.367255162820e-05
6050.00000  6100.00000  2.319664667721e-05
6100.00000  6150.00000  2.693804130256e-05
6150.00000  6200.00000  3.067943592792e-05
6200.00000  6250.00000  3.142771485299e-05
6250.00000  6300.00000  2.693804130256e-05
6300.00000  6350.00000  2.918287807777e-05
6350.00000  6400.00000  2.618976237749e-04
6400.00000  6450.00000  2.618976237749e-05
6450.00000  6500.00000  2.843459915270e-05
6500.00000  6550.00000  2.095180990199e-05
6550.00000  6600.00000  2.768632022763e-05
6600.00000  6650.00000  2.544148345242e-05
6650.00000  6700.00000  1.870697312678e-05
6700.00000  6750.00000  1.870697312678e-05
6750.00000  6800.00000  2.768632022763e-05
6800.00000  6850.00000  2.544148345242e-05
6850.00000  6900.00000  2.170008882706e-05
6900.00000  6950.00000  1.945525205185e-05
6950.00000  7000.00000  2.319664667721e-05
7000.00000  7050.00000  2.095180990199e-05
7050.00000  7100.00000  5.088296690484e-05
7100.00000  7150.00000  2.244836775213e-05
7150.00000  7200.00000  1.047590495100e-05
7200.00000  7250.00000  1.795869420171e-05
7250.00000  7300.00000  1.272074172621e-05
7300.00000  7350.00000  1.646213635156e-05
7350.00000  7400.00000  1.646213635156e-05
7400.00000  7450.00000  2.244836775213e-05
7450.00000  7500.00000  1.945525205185e-05
7500.00000  7550.00000  1.571385742649e-05
7550.00000  7600.00000  1.795869420171e-05
7600.00000  7650.00000  1.272074172621e-05
7650.00000  7700.00000  1.272074172621e-05
7700.00000  7750.00000  1.346902065128e-05
7750.00000  7800.00000  1.496557850142e-05
7800.00000  7850.00000  1.272074172621e-05
7850.00000  7900.00000  8.231068175782e-06
7900.00000  7950.00000  2.020353097692e-05
7950.00000  8000.00000  1.571385742649e-05
8000.00000  8050.00000  1.646213635156e-05
8050.00000  8100.00000  8.231068175782e-06
8100.00000  8150.00000  1.646213635156e-05
8150.00000  8200.00000  1.721041527664e-05
8200.00000  8250.00000  2.170008882706e-05
8250.00000  8300.00000  1.646213635156e-05
8300.00000  8350.00000  9.727626025925e-06
8350.00000  8400.00000  1.421729957635e-05
8400.00000  8450.00000  8.231068175782e-06
8450.00000  8500.00000  9.727626025925e-06
8500.00000  8550.00000  1.272074172621e-05
8550.00000  8600.00000  1.272074172621e-05
8600.00000  8650.00000  1.421729957635e-05
8650.00000  8700.00000  9.727626025925e-06
8700.00000  8750.00000  1.047590495100e-05
8750.00000  8800.00000  1.721041527664e-05
8800.00000  8850.00000  8.979347100854e-06
8850.00000  8900.00000  1.346902065128e-05
8900.00000  8950.00000  8.979347100854e-06
8950.00000  9000.00000  1.047590495100e-05
9000.00000  9050.00000  8.979347100854e-06
9050.00000  9100.00000  5.986231400569e-06
9100.00000  9150.00000  6.734510325640e-06
9150.00000  9200.00000  1.047590495100e-05
9200.00000  9250.00000  9.727626025925e-06
9250.00000  9300.00000  7.482789250711e-06
9300.00000  9350.00000  9.727626025925e-06
9350.00000  9400.00000  1.122418387607e-05
9400.00000  9450.00000  1.122418387607e-05
9450.00000  9500.00000  1.272074172621e-05
9500.00000  9550.00000  7.482789250711e-06
9550.00000  9600.00000  9.727626025925e-06
9600.00000  9650.00000  1.047590495100e-05
9650.00000  9700.00000  4.489673550427e-06
9700.00000  9750.00000  5.237952475498e-06
9750.00000  9800.00000  5.986231400569e-06
9800.00000  9850.00000  1.272074172621e-05
9850.00000  9900.00000  6.734510325640e-06
9900.00000  9950.00000  7.482789250711e-06
9950.00000  10000.00000  6.734510325640e-06
