10001.00000  11001.00000  1.013020020292e-03
11001.00000  12001.00000  8.690898234590e-04
12001.00000  13001.00000  7.621351811204e-04
13001.00000  14001.00000  6.741515302801e-04
14001.00000  15001.00000  5.956968644714e-04
15001.00000  16001.00000  5.337487974804e-04
16001.00000  17001.00000  4.817162869219e-04
17001.00000  18001.00000  4.379853971973e-04
18001.00000  19001.00000  4.000144213459e-04
19001.00000  20001.00000  3.642662310495e-04
20001.00000  21001.00000  3.342876189112e-04
21001.00000  22001.00000  3.073532565549e-04
22001.00000  23001.00000  2.842942724924e-04
23001.00000  24001.00000  2.618731312413e-04
24001.00000  25001.00000  2.454245181338e-04
25001.00000  26001.00000  2.267627837564e-04
26001.00000  27001.00000  2.127688990445e-04
27001.00000  28001.00000  1.989779643181e-04
28001.00000  29001.00000  1.893040150111e-04
29001.00000  30001.00000  1.743050446569e-04
30001.00000  31001.00000  1.650080024657e-04
31001.00000  32001.00000  1.580980386750e-04
32001.00000  33001.00000  1.475156465759e-04
33001.00000  34001.00000  1.365080259358e-04
34001.00000  35001.00000  1.309413977632e-04
35001.00000  36001.00000  1.249881981896e-04
36001.00000  37001.00000  1.181748772491e-04
37001.00000  38001.00000  1.112552491733e-04
38001.00000  39001.00000  1.072735637443e-04
39001.00000  40001.00000  1.010014427650e-04
40001.00000  41001.00000  9.648822165971e-05
41001.00000  42001.00000  9.199432912448e-05
42001.00000  43001.00000  8.873746507206e-05
43001.00000  44001.00000  8.471712250291e-05
44001.00000  45001.00000  8.164387986591e-05
45001.00000  46001.00000  7.820339439807e-05
46001.00000  47001.00000  7.504317319588e-05
47001.00000  48001.00000  7.120645204214e-05
48001.00000  49001.00000  6.887735935184e-05
49001.00000  50001.00000  6.696383091748e-05
50001.00000  51001.00000  6.308845262366e-05
51001.00000  52001.00000  6.125223846948e-05
52001.00000  53001.00000  5.980259571617e-05
53001.00000  54001.00000  5.570493886684e-05
54001.00000  55001.00000  5.584023885715e-05
55001.00000  56001.00000  5.218713911883e-05
56001.00000  57001.00000  5.048622495496e-05
57001.00000  58001.00000  4.722936090254e-05
58001.00000  59001.00000  4.711338948228e-05
59001.00000  60001.00000  4.719070376246e-05
60001.00000  61001.00000  4.415611826555e-05
61001.00000  62001.00000  4.210728984088e-05
62001.00000  63001.00000  4.186568271533e-05
63001.00000  64001.00000  3.913069005410e-05
64001.00000  65001.00000  3.865714008802e-05
65001.00000  66001.00000  3.816426155190e-05
66001.00000  67001.00000  3.566121173120e-05
67001.00000  68001.00000  3.569020458627e-05
68001.00000  69001.00000  3.392164042724e-05
69001.00000  70001.00000  3.306151906028e-05
70001.00000  71001.00000  3.174717629729e-05
71001.00000  72001.00000  3.011391212857e-05
72001.00000  73001.00000  2.972734072769e-05
73001.00000  74001.00000  2.889621221580e-05
74001.00000  75001.00000  2.799743370875e-05
75001.00000  76001.00000  2.825836940435e-05
76001.00000  77001.00000  2.728227661712e-05
77001.00000  78001.00000  2.638349811008e-05
78001.00000  79001.00000  2.525277676250e-05
79001.00000  80001.00000  2.378380543916e-05
80001.00000  81001.00000  2.418004112506e-05
81001.00000  82001.00000  2.353253402859e-05
82001.00000  83001.00000  2.260476266647e-05
83001.00000  84001.00000  2.270140551669e-05
84001.00000  85001.00000  2.170598415943e-05
85001.00000  86001.00000  2.159967702418e-05
86001.00000  87001.00000  2.032399140128e-05
87001.00000  88001.00000  1.972480572991e-05
88001.00000  89001.00000  1.979245572507e-05
89001.00000  90001.00000  1.898065578322e-05
90001.00000  91001.00000  1.759866302507e-05
91001.00000  92001.00000  1.856509152727e-05
92001.00000  93001.00000  1.750202017485e-05
93001.00000  94001.00000  1.724108447926e-05
94001.00000  95001.00000  1.732806304446e-05
95001.00000  96001.00000  1.680619165327e-05
96001.00000  97001.00000  1.587842029116e-05
97001.00000  98001.00000  1.580110601098e-05
98001.00000  99001.00000  1.509561320437e-05
99001.00000  100001.00000  1.477669179865e-05
100001.00000  101001.00000  1.450609181803e-05
101001.00000  102001.00000  1.399388471187e-05
102001.00000  103001.00000  1.387791329160e-05
103001.00000  104001.00000  1.275685622905e-05
104001.00000  105001.00000  1.329805619028e-05
105001.00000  106001.00000  1.295980621451e-05
106001.00000  107001.00000  1.245726339337e-05
107001.00000  108001.00000  1.199337771231e-05
108001.00000  109001.00000  1.190639914711e-05
109001.00000  110001.00000  1.168412059161e-05
110001.00000  111001.00000  1.213834198764e-05
111001.00000  112001.00000  1.118157777046e-05
112001.00000  113001.00000  1.109459920526e-05
113001.00000  114001.00000  1.101728492509e-05
114001.00000  115001.00000  1.066937066429e-05
115001.00000  116001.00000  1.036011354359e-05
116001.00000  117001.00000  9.702942162094e-06
117001.00000  118001.00000  9.470999321566e-06
118001.00000  119001.00000  1.013783498808e-05
119001.00000  120001.00000  9.828577867380e-06
120001.00000  121001.00000  9.190735055928e-06
121001.00000  122001.00000  9.673949307028e-06
122001.00000  123001.00000  8.968456500422e-06
123001.00000  124001.00000  8.659199379718e-06
124001.00000  125001.00000  8.668863664740e-06
125001.00000  126001.00000  8.243635123771e-06
126001.00000  127001.00000  8.620542239630e-06
127001.00000  128001.00000  7.712099447561e-06
128001.00000  129001.00000  7.934378003067e-06
129001.00000  130001.00000  7.615456597341e-06
130001.00000  131001.00000  7.828070867825e-06
131001.00000  132001.00000  7.383513756813e-06
132001.00000  133001.00000  7.441499466945e-06
133001.00000  134001.00000  7.199892341395e-06
134001.00000  135001.00000  6.610370955052e-06
135001.00000  136001.00000  6.967949500867e-06
136001.00000  137001.00000  6.494399534788e-06
137001.00000  138001.00000  7.122578061219e-06
138001.00000  139001.00000  6.436413824656e-06
139001.00000  140001.00000  6.088499563864e-06
140001.00000  141001.00000  6.378428114524e-06
141001.00000  142001.00000  6.465406679722e-06
142001.00000  143001.00000  6.223799554172e-06
143001.00000  144001.00000  5.614949597786e-06
144001.00000  145001.00000  5.296028192059e-06
145001.00000  146001.00000  5.982192428622e-06
146001.00000  147001.00000  5.605285312764e-06
147001.00000  148001.00000  5.808235298226e-06
148001.00000  149001.00000  5.537635317610e-06
149001.00000  150001.00000  4.977106786333e-06
150001.00000  151001.00000  5.025428211443e-06
151001.00000  152001.00000  5.180056771795e-06
152001.00000  153001.00000  4.667849665629e-06
153001.00000  154001.00000  5.035092496465e-06
154001.00000  155001.00000  4.919121076201e-06
155001.00000  156001.00000  4.986771071355e-06
156001.00000  157001.00000  4.629192525541e-06
157001.00000  158001.00000  4.754828230827e-06
158001.00000  159001.00000  4.455235395145e-06
159001.00000  160001.00000  4.580871100431e-06
160001.00000  161001.00000  4.107321134353e-06
161001.00000  162001.00000  3.923699718935e-06
162001.00000  163001.00000  4.194299699551e-06
163001.00000  164001.00000  4.155642559463e-06
164001.00000  165001.00000  4.126649704397e-06
165001.00000  166001.00000  3.885042578847e-06
166001.00000  167001.00000  4.319935404837e-06
167001.00000  168001.00000  3.962356859023e-06
168001.00000  169001.00000  4.078328279287e-06
169001.00000  170001.00000  3.508135462988e-06
170001.00000  171001.00000  3.759406873560e-06
171001.00000  172001.00000  3.633771168274e-06
172001.00000  173001.00000  3.382499757702e-06
173001.00000  174001.00000  3.585449743164e-06
174001.00000  175001.00000  3.672428308362e-06
175001.00000  176001.00000  3.392164042724e-06
176001.00000  177001.00000  3.247199767394e-06
177001.00000  178001.00000  3.276192622460e-06
178001.00000  179001.00000  3.169885487218e-06
179001.00000  180001.00000  3.237535482372e-06
180001.00000  181001.00000  2.831635511448e-06
181001.00000  182001.00000  3.324514047570e-06
182001.00000  183001.00000  2.908949791624e-06
183001.00000  184001.00000  3.169885487218e-06
184001.00000  185001.00000  2.928278361668e-06
185001.00000  186001.00000  2.918614076646e-06
186001.00000  187001.00000  2.638349811008e-06
187001.00000  188001.00000  2.590028385898e-06
188001.00000  189001.00000  2.677006951096e-06
189001.00000  190001.00000  2.580364100876e-06
190001.00000  191001.00000  2.503049820700e-06
191001.00000  192001.00000  2.251778410127e-06
192001.00000  193001.00000  2.435399825546e-06
193001.00000  194001.00000  2.619021240964e-06
194001.00000  195001.00000  2.580364100876e-06
195001.00000  196001.00000  2.464392680612e-06
196001.00000  197001.00000  2.609356955942e-06
197001.00000  198001.00000  2.570699815854e-06
198001.00000  199001.00000  2.039164139643e-06
