300.00000  350.00000  1.116297928658e-05
350.00000  400.00000  2.304615078519e-05
400.00000  450.00000  1.476394034676e-05
450.00000  500.00000  2.052547804306e-05
500.00000  550.00000  1.292745020607e-04
550.00000  600.00000  1.476394034676e-05
600.00000  650.00000  3.348893785973e-05
650.00000  700.00000  1.080288318056e-05
700.00000  750.00000  2.124567025510e-05
750.00000  800.00000  1.512403645278e-05
800.00000  850.00000  6.049614581113e-05
850.00000  900.00000  1.980528583103e-05
900.00000  950.00000  1.260336371065e-05
950.00000  1000.00000  1.620432477084e-05
1000.00000  1050.00000  1.476394034676e-05
1050.00000  1100.00000  1.944518972501e-05
1100.00000  1150.00000  1.512403645278e-05
1150.00000  1200.00000  1.224326760463e-05
1200.00000  1250.00000  1.620432477084e-05
1250.00000  1300.00000  4.141105219214e-05
1300.00000  1350.00000  1.512403645278e-05
1350.00000  1400.00000  1.368365202871e-05
1400.00000  1450.00000  1.728461308890e-05
1450.00000  1500.00000  1.728461308890e-05
1500.00000  1550.00000  1.476394034676e-05
1550.00000  1600.00000  2.160576636112e-05
1600.00000  1650.00000  1.476394034676e-05
1650.00000  1700.00000  1.620432477084e-05
1700.00000  1750.00000  4.321153272224e-05
1750.00000  1800.00000  1.620432477084e-05
1800.00000  1850.00000  1.512403645278e-05
1850.00000  1900.00000  1.692451698288e-05
1900.00000  1950.00000  1.440384424075e-05
1950.00000  2000.00000  1.404374813473e-05
2000.00000  2050.00000  1.332355592269e-05
2050.00000  2100.00000  1.584422866482e-05
2100.00000  2150.00000  1.368365202871e-05
2150.00000  2200.00000  1.656442087686e-05
2200.00000  2250.00000  9.002402650466e-06
2250.00000  2300.00000  1.440384424075e-05
2300.00000  2350.00000  4.213124440418e-05
2350.00000  2400.00000  1.080288318056e-05
2400.00000  2450.00000  1.368365202871e-05
2450.00000  2500.00000  1.620432477084e-05
2500.00000  2550.00000  1.656442087686e-05
2550.00000  2600.00000  1.260336371065e-05
2600.00000  2650.00000  1.440384424075e-05
2650.00000  2700.00000  7.922114332410e-06
2700.00000  2750.00000  1.152307539260e-05
2750.00000  2800.00000  1.728461308890e-05
2800.00000  2850.00000  1.692451698288e-05
2850.00000  2900.00000  1.260336371065e-05
2900.00000  2950.00000  1.476394034676e-05
2950.00000  3000.00000  1.836490140695e-05
3000.00000  3050.00000  1.440384424075e-05
3050.00000  3100.00000  1.656442087686e-05
3100.00000  3150.00000  1.656442087686e-05
3150.00000  3200.00000  1.872499751297e-05
3200.00000  3250.00000  1.620432477084e-05
3250.00000  3300.00000  1.764470919491e-05
3300.00000  3350.00000  1.836490140695e-05
3350.00000  3400.00000  2.016538193704e-05
3400.00000  3450.00000  1.368365202871e-05
3450.00000  3500.00000  1.260336371065e-05
3500.00000  3550.00000  1.908509361899e-05
3550.00000  3600.00000  1.620432477084e-05
3600.00000  3650.00000  1.620432477084e-05
3650.00000  3700.00000  2.232595857316e-05
3700.00000  3750.00000  1.296345981667e-05
3750.00000  3800.00000  1.368365202871e-05
3800.00000  3850.00000  1.980528583103e-05
3850.00000  3900.00000  1.260336371065e-05
3900.00000  3950.00000  1.800480530093e-05
3950.00000  4000.00000  1.548413255880e-05
4000.00000  4050.00000  1.548413255880e-05
4050.00000  4100.00000  2.088557414908e-05
4100.00000  4150.00000  1.476394034676e-05
4150.00000  4200.00000  1.656442087686e-05
4200.00000  4250.00000  1.692451698288e-05
4250.00000  4300.00000  1.620432477084e-05
4300.00000  4350.00000  1.944518972501e-05
4350.00000  4400.00000  1.728461308890e-05
4400.00000  4450.00000  1.548413255880e-05
4450.00000  4500.00000  1.404374813473e-05
4500.00000  4550.00000  1.836490140695e-05
4550.00000  4600.00000  1.908509361899e-05
4600.00000  4650.00000  1.656442087686e-05
4650.00000  4700.00000  2.340624689121e-05
4700.00000  4750.00000  1.656442087686e-05
4750.00000  4800.00000  2.160576636112e-05
4800.00000  4850.00000  1.872499751297e-05
4850.00000  4900.00000  1.728461308890e-05
4900.00000  4950.00000  2.340624689121e-05
4950.00000  5000.00000  2.124567025510e-05
5000.00000  5050.00000  1.944518972501e-05
5050.00000  5100.00000  1.944518972501e-05
5100.00000  5150.00000  1.692451698288e-05
5150.00000  5200.00000  2.016538193704e-05
5200.00000  5250.00000  2.376634299723e-05
5250.00000  5300.00000  2.088557414908e-05
5300.00000  5350.00000  1.800480530093e-05
5350.00000  5400.00000  1.980528583103e-05
5400.00000  5450.00000  2.484663131529e-05
5450.00000  5500.00000  1.548413255880e-05
5500.00000  5550.00000  2.448653520927e-05
5550.00000  5600.00000  2.268605467918e-05
5600.00000  5650.00000  1.944518972501e-05
5650.00000  5700.00000  1.728461308890e-05
5700.00000  5750.00000  1.908509361899e-05
5750.00000  5800.00000  1.764470919491e-05
5800.00000  5850.00000  1.908509361899e-05
5850.00000  5900.00000  2.484663131529e-05
5900.00000  5950.00000  1.764470919491e-05
5950.00000  6000.00000  1.692451698288e-05
6000.00000  6050.00000  2.016538193704e-05
6050.00000  6100.00000  2.088557414908e-05
6100.00000  6150.00000  2.628701573936e-05
6150.00000  6200.00000  2.484663131529e-05
6200.00000  6250.00000  3.456922617779e-05
6250.00000  6300.00000  4.969326263057e-05
6300.00000  6350.00000  4.681249378242e-05
6350.00000  6400.00000  3.593759138066e-04
6400.00000  6450.00000  1.836490140695e-05
6450.00000  6500.00000  1.908509361899e-05
6500.00000  6550.00000  2.268605467918e-05
6550.00000  6600.00000  1.908509361899e-05
6600.00000  6650.00000  2.340624689121e-05
6650.00000  6700.00000  1.980528583103e-05
6700.00000  6750.00000  2.592691963334e-05
6750.00000  6800.00000  2.484663131529e-05
6800.00000  6850.00000  2.556682352732e-05
6850.00000  6900.00000  1.944518972501e-05
6900.00000  6950.00000  2.340624689121e-05
6950.00000  7000.00000  2.232595857316e-05
7000.00000  7050.00000  1.872499751297e-05
7050.00000  7100.00000  5.905576138706e-05
7100.00000  7150.00000  1.440384424075e-05
7150.00000  7200.00000  9.002402650466e-06
7200.00000  7250.00000  1.332355592269e-05
7250.00000  7300.00000  9.722594862504e-06
7300.00000  7350.00000  1.044278707454e-05
7350.00000  7400.00000  9.362498756485e-06
7400.00000  7450.00000  1.548413255880e-05
7450.00000  7500.00000  2.700720795140e-05
7500.00000  7550.00000  1.224326760463e-05
7550.00000  7600.00000  1.152307539260e-05
7600.00000  7650.00000  1.224326760463e-05
7650.00000  7700.00000  1.368365202871e-05
7700.00000  7750.00000  9.722594862504e-06
7750.00000  7800.00000  1.260336371065e-05
7800.00000  7850.00000  1.188317149862e-05
7850.00000  7900.00000  9.722594862504e-06
7900.00000  7950.00000  9.002402650466e-06
7950.00000  8000.00000  1.152307539260e-05
8000.00000  8050.00000  1.080288318056e-05
8050.00000  8100.00000  8.642306544448e-06
8100.00000  8150.00000  8.642306544448e-06
8150.00000  8200.00000  1.188317149862e-05
8200.00000  8250.00000  1.116297928658e-05
8250.00000  8300.00000  1.836490140695e-05
8300.00000  8350.00000  1.188317149862e-05
8350.00000  8400.00000  1.872499751297e-05
8400.00000  8450.00000  1.080288318056e-05
8450.00000  8500.00000  1.152307539260e-05
8500.00000  8550.00000  1.080288318056e-05
8550.00000  8600.00000  7.201922120373e-06
8600.00000  8650.00000  9.002402650466e-06
8650.00000  8700.00000  1.368365202871e-05
8700.00000  8750.00000  1.476394034676e-05
8750.00000  8800.00000  1.296345981667e-05
8800.00000  8850.00000  1.260336371065e-05
8850.00000  8900.00000  1.476394034676e-05
8900.00000  8950.00000  1.404374813473e-05
8950.00000  9000.00000  1.296345981667e-05
9000.00000  9050.00000  1.080288318056e-05
9050.00000  9100.00000  1.296345981667e-05
9100.00000  9150.00000  1.260336371065e-05
9150.00000  9200.00000  1.404374813473e-05
9200.00000  9250.00000  9.722594862504e-06
9250.00000  9300.00000  1.296345981667e-05
9300.00000  9350.00000  1.332355592269e-05
9350.00000  9400.00000  1.512403645278e-05
9400.00000  9450.00000  1.440384424075e-05
9450.00000  9500.00000  1.692451698288e-05
9500.00000  9550.00000  1.224326760463e-05
9550.00000  9600.00000  1.080288318056e-05
9600.00000  9650.00000  1.332355592269e-05
9650.00000  9700.00000  1.404374813473e-05
9700.00000  9750.00000  1.260336371065e-05
9750.00000  9800.00000  1.116297928658e-05
9800.00000  9850.00000  1.116297928658e-05
9850.00000  9900.00000  1.296345981667e-05
9900.00000  9950.00000  1.332355592269e-05
9950.00000  10000.00000  1.728461308890e-05
