300.00000  350.00000  1.506738167311e-06
350.00000  400.00000  3.766845418279e-06
400.00000  450.00000  2.260107250967e-06
450.00000  500.00000  4.520214501934e-06
500.00000  550.00000  4.896899043762e-05
550.00000  600.00000  1.506738167311e-06
600.00000  650.00000  1.883422709139e-05
650.00000  700.00000  4.520214501934e-06
700.00000  750.00000  6.780321752901e-06
750.00000  800.00000  3.013476334623e-06
800.00000  850.00000  3.992856143375e-05
850.00000  900.00000  3.766845418279e-06
900.00000  950.00000  3.013476334623e-06
950.00000  1000.00000  5.273583585590e-06
1000.00000  1050.00000  6.026952669246e-06
1050.00000  1100.00000  8.287059920213e-06
1100.00000  1150.00000  9.793798087524e-06
1150.00000  1200.00000  6.780321752901e-06
1200.00000  1250.00000  8.287059920213e-06
1250.00000  1300.00000  5.876278852514e-05
1300.00000  1350.00000  1.205390533849e-05
1350.00000  1400.00000  2.184770342602e-05
1400.00000  1450.00000  4.972235952128e-05
1450.00000  1500.00000  5.198246677224e-05
1500.00000  1550.00000  8.437733736944e-05
1550.00000  1600.00000  1.348530659744e-04
1600.00000  1650.00000  1.740282583245e-04
1650.00000  1700.00000  2.395713686025e-04
1700.00000  1750.00000  3.510699929836e-04
1750.00000  1800.00000  3.744244345769e-04
1800.00000  1850.00000  4.339405921857e-04
1850.00000  1900.00000  4.090794124250e-04
1900.00000  1950.00000  5.612599673235e-04
1950.00000  2000.00000  6.576912100314e-04
2000.00000  2050.00000  7.435752855682e-04
2050.00000  2100.00000  8.392531591925e-04
2100.00000  2150.00000  9.221237583946e-04
2150.00000  2200.00000  1.014034786601e-03
2200.00000  2250.00000  1.035129120943e-03
2250.00000  2300.00000  1.096905385803e-03
2300.00000  2350.00000  1.218197808271e-03
2350.00000  2400.00000  1.231005082693e-03
2400.00000  2450.00000  1.317642527314e-03
2450.00000  2500.00000  1.269426905960e-03
2500.00000  2550.00000  1.185049568590e-03
2550.00000  2600.00000  1.205390533849e-03
2600.00000  2650.00000  1.210664117435e-03
2650.00000  2700.00000  1.310862205561e-03
2700.00000  2750.00000  1.292027978470e-03
2750.00000  2800.00000  1.292781347553e-03
2800.00000  2850.00000  1.249085940701e-03
2850.00000  2900.00000  1.277713965880e-03
2900.00000  2950.00000  1.168475448750e-03
2950.00000  3000.00000  1.252099417036e-03
3000.00000  3050.00000  1.243812357116e-03
3050.00000  3100.00000  1.243058988032e-03
3100.00000  3150.00000  1.226484868191e-03
3150.00000  3200.00000  1.213677593769e-03
3200.00000  3250.00000  1.147381114408e-03
3250.00000  3300.00000  1.098412123970e-03
3300.00000  3350.00000  1.091631802217e-03
3350.00000  3400.00000  1.048689764449e-03
3400.00000  3450.00000  1.032115644608e-03
3450.00000  3500.00000  1.037389228194e-03
3500.00000  3550.00000  9.869134995890e-04
3550.00000  3600.00000  9.597922125774e-04
3600.00000  3650.00000  9.402046164023e-04
3650.00000  3700.00000  9.115765912234e-04
3700.00000  3750.00000  8.611008626185e-04
3750.00000  3800.00000  8.475402191127e-04
3800.00000  3850.00000  8.158987175991e-04
3850.00000  3900.00000  8.121318721808e-04
3900.00000  3950.00000  7.865173233366e-04
3950.00000  4000.00000  7.925442760058e-04
4000.00000  4050.00000  7.179607367239e-04
4050.00000  4100.00000  7.315213802297e-04
4100.00000  4150.00000  6.840591279594e-04
4150.00000  4200.00000  6.802922825411e-04
4200.00000  4250.00000  6.637181627007e-04
4250.00000  4300.00000  6.215294940160e-04
4300.00000  4350.00000  5.966683142553e-04
4350.00000  4400.00000  6.177626485977e-04
4400.00000  4450.00000  5.469459547340e-04
4450.00000  4500.00000  5.740672417456e-04
4500.00000  4550.00000  5.394122638975e-04
4550.00000  4600.00000  5.258516203917e-04
4600.00000  4650.00000  5.024971787984e-04
4650.00000  4700.00000  5.296184658100e-04
4700.00000  4750.00000  4.618152482809e-04
4750.00000  4800.00000  4.542815574444e-04
4800.00000  4850.00000  4.512680811098e-04
4850.00000  4900.00000  4.392141757713e-04
4900.00000  4950.00000  4.354473303530e-04
4950.00000  5000.00000  4.090794124250e-04
5000.00000  5050.00000  4.045591979231e-04
5050.00000  5100.00000  3.834648635808e-04
5100.00000  5150.00000  3.691508509913e-04
5150.00000  5200.00000  3.623705292384e-04
5200.00000  5250.00000  3.699042200750e-04
5250.00000  5300.00000  3.992856143375e-04
5300.00000  5350.00000  3.397694567287e-04
5350.00000  5400.00000  3.156616460517e-04
5400.00000  5450.00000  3.578503147365e-04
5450.00000  5500.00000  3.390160876451e-04
5500.00000  5550.00000  3.216885987210e-04
5550.00000  5600.00000  3.164150151354e-04
5600.00000  5650.00000  2.953206807930e-04
5650.00000  5700.00000  2.779931918690e-04
5700.00000  5750.00000  2.900470972074e-04
5750.00000  5800.00000  2.734729773670e-04
5800.00000  5850.00000  2.915538353748e-04
5850.00000  5900.00000  2.847735136219e-04
5900.00000  5950.00000  2.538853811920e-04
5950.00000  6000.00000  2.538853811920e-04
6000.00000  6050.00000  2.448449521881e-04
6050.00000  6100.00000  2.388179995189e-04
6100.00000  6150.00000  2.425848449371e-04
6150.00000  6200.00000  2.184770342602e-04
6200.00000  6250.00000  2.553921193593e-04
6250.00000  6300.00000  2.727196082834e-04
6300.00000  6350.00000  2.312843086823e-04
6350.00000  6400.00000  9.605455816610e-04
6400.00000  6450.00000  2.327910468496e-04
6450.00000  6500.00000  1.875889018303e-04
6500.00000  6550.00000  2.019029144197e-04
6550.00000  6600.00000  1.868355327466e-04
6600.00000  6650.00000  1.883422709139e-04
6650.00000  6700.00000  1.830686873283e-04
6700.00000  6750.00000  1.913557472485e-04
6750.00000  6800.00000  1.860821636630e-04
6800.00000  6850.00000  1.702614129062e-04
6850.00000  6900.00000  1.747816274081e-04
6900.00000  6950.00000  1.770417346591e-04
6950.00000  7000.00000  1.747816274081e-04
7000.00000  7050.00000  1.868355327466e-04
7050.00000  7100.00000  2.478584285227e-04
7100.00000  7150.00000  1.054716717118e-04
7150.00000  7200.00000  1.137587316320e-04
7200.00000  7250.00000  1.039649335445e-04
7250.00000  7300.00000  1.062250407955e-04
7300.00000  7350.00000  1.039649335445e-04
7350.00000  7400.00000  1.348530659744e-04
7400.00000  7450.00000  1.069784098791e-04
7450.00000  7500.00000  1.280727442215e-04
7500.00000  7550.00000  9.191102820600e-05
7550.00000  7600.00000  9.567787362427e-05
7600.00000  7650.00000  1.122519934647e-04
7650.00000  7700.00000  1.017048262935e-04
7700.00000  7750.00000  9.567787362427e-05
7750.00000  7800.00000  9.040429003868e-05
7800.00000  7850.00000  9.869134995890e-05
7850.00000  7900.00000  8.814418278772e-05
7900.00000  7950.00000  9.417113545696e-05
7950.00000  8000.00000  8.287059920213e-05
8000.00000  8050.00000  9.115765912234e-05
8050.00000  8100.00000  9.191102820600e-05
8100.00000  8150.00000  8.965092095503e-05
8150.00000  8200.00000  8.965092095503e-05
8200.00000  8250.00000  7.910375378385e-05
8250.00000  8300.00000  8.211723011847e-05
8300.00000  8350.00000  9.115765912234e-05
8350.00000  8400.00000  7.307680111460e-05
8400.00000  8450.00000  8.663744462041e-05
8450.00000  8500.00000  9.115765912234e-05
8500.00000  8550.00000  6.780321752901e-05
8550.00000  8600.00000  9.643124270793e-05
8600.00000  8650.00000  7.533690836557e-05
8650.00000  8700.00000  8.136386103482e-05
8700.00000  8750.00000  7.533690836557e-05
8750.00000  8800.00000  8.136386103482e-05
8800.00000  8850.00000  7.383017019826e-05
8850.00000  8900.00000  7.157006294729e-05
8900.00000  8950.00000  7.533690836557e-05
8950.00000  9000.00000  7.006332477998e-05
9000.00000  9050.00000  6.252963394342e-05
9050.00000  9100.00000  6.704984844536e-05
9100.00000  9150.00000  6.704984844536e-05
9150.00000  9200.00000  7.985712286750e-05
9200.00000  9250.00000  6.478974119439e-05
9250.00000  9300.00000  6.855658661267e-05
9300.00000  9350.00000  6.177626485977e-05
9350.00000  9400.00000  7.006332477998e-05
9400.00000  9450.00000  4.821562135397e-05
9450.00000  9500.00000  6.704984844536e-05
9500.00000  9550.00000  5.499594310687e-05
9550.00000  9600.00000  5.951615760880e-05
9600.00000  9650.00000  6.478974119439e-05
9650.00000  9700.00000  5.876278852514e-05
9700.00000  9750.00000  6.478974119439e-05
9750.00000  9800.00000  5.424257402321e-05
9800.00000  9850.00000  6.328300302708e-05
9850.00000  9900.00000  4.896899043762e-05
9900.00000  9950.00000  5.876278852514e-05
9950.00000  10000.00000  5.273583585590e-05
