300.00000  350.00000  0.000000000000e+00
350.00000  400.00000  0.000000000000e+00
400.00000  450.00000  0.000000000000e+00
450.00000  500.00000  0.000000000000e+00
500.00000  550.00000  1.935842085542e-06
550.00000  600.00000  0.000000000000e+00
600.00000  650.00000  3.871684171084e-07
650.00000  700.00000  0.000000000000e+00
700.00000  750.00000  7.743368342169e-07
750.00000  800.00000  0.000000000000e+00
800.00000  850.00000  5.033189422410e-06
850.00000  900.00000  1.935842085542e-07
900.00000  950.00000  1.935842085542e-07
950.00000  1000.00000  0.000000000000e+00
1000.00000  1050.00000  5.807526256627e-07
1050.00000  1100.00000  1.935842085542e-07
1100.00000  1150.00000  3.871684171084e-07
1150.00000  1200.00000  7.743368342169e-07
1200.00000  1250.00000  3.871684171084e-06
1250.00000  1300.00000  1.955200506398e-05
1300.00000  1350.00000  8.130536759277e-06
1350.00000  1400.00000  2.206859977518e-05
1400.00000  1450.00000  3.813608908518e-05
1450.00000  1500.00000  6.562504669988e-05
1500.00000  1550.00000  1.010509568653e-04
1550.00000  1600.00000  1.415100564531e-04
1600.00000  1650.00000  2.021019137306e-04
1650.00000  1700.00000  2.808906866122e-04
1700.00000  1750.00000  4.421463323378e-04
1750.00000  1800.00000  4.907359686849e-04
1800.00000  1850.00000  5.714605836521e-04
1850.00000  1900.00000  5.999174623095e-04
1900.00000  1950.00000  7.422018555969e-04
1950.00000  2000.00000  8.895194383066e-04
2000.00000  2050.00000  1.049226410364e-03
2050.00000  2100.00000  1.185509693186e-03
2100.00000  2150.00000  1.368640354478e-03
2150.00000  2200.00000  1.479564105980e-03
2200.00000  2250.00000  1.626494520273e-03
2250.00000  2300.00000  1.814271202570e-03
2300.00000  2350.00000  2.118198410000e-03
2350.00000  2400.00000  2.119166331043e-03
2400.00000  2450.00000  2.271904271592e-03
2450.00000  2500.00000  2.312750539597e-03
2500.00000  2550.00000  2.254094524405e-03
2550.00000  2600.00000  2.393668738773e-03
2600.00000  2650.00000  2.497623458767e-03
2650.00000  2700.00000  2.586672194701e-03
2700.00000  2750.00000  2.697015193577e-03
2750.00000  2800.00000  2.810068371373e-03
2800.00000  2850.00000  2.892148075800e-03
2850.00000  2900.00000  3.020300821863e-03
2900.00000  2950.00000  3.040820747970e-03
2950.00000  3000.00000  3.139935862749e-03
3000.00000  3050.00000  3.142646041669e-03
3050.00000  3100.00000  3.200334135818e-03
3100.00000  3150.00000  3.286091940208e-03
3150.00000  3200.00000  3.315903908325e-03
3200.00000  3250.00000  3.297126240095e-03
3250.00000  3300.00000  3.275638392946e-03
3300.00000  3350.00000  3.369333149886e-03
3350.00000  3400.00000  3.328486881881e-03
3400.00000  3450.00000  3.360041107876e-03
3450.00000  3500.00000  3.408049991597e-03
3500.00000  3550.00000  3.427021244035e-03
3550.00000  3600.00000  3.429925007164e-03
3600.00000  3650.00000  3.437474791297e-03
3650.00000  3700.00000  3.474062206714e-03
3700.00000  3750.00000  3.401468128506e-03
3750.00000  3800.00000  3.387723649699e-03
3800.00000  3850.00000  3.389853075993e-03
3850.00000  3900.00000  3.421213717779e-03
3900.00000  3950.00000  3.384626302362e-03
3950.00000  4000.00000  3.393724760164e-03
4000.00000  4050.00000  3.360621860501e-03
4050.00000  4100.00000  3.349781144822e-03
4100.00000  4150.00000  3.339327597560e-03
4150.00000  4200.00000  3.281833087620e-03
4200.00000  4250.00000  3.207109583118e-03
4250.00000  4300.00000  3.240986819615e-03
4300.00000  4350.00000  3.205367325241e-03
4350.00000  4400.00000  3.176910446583e-03
4400.00000  4450.00000  3.201495641070e-03
4450.00000  4500.00000  3.185040983343e-03
4500.00000  4550.00000  3.098896010536e-03
4550.00000  4600.00000  3.075085152884e-03
4600.00000  4650.00000  3.044498847932e-03
4650.00000  4700.00000  3.051661463649e-03
4700.00000  4750.00000  2.999587311548e-03
4750.00000  4800.00000  3.002491074676e-03
4800.00000  4850.00000  2.940156959521e-03
4850.00000  4900.00000  2.961257638254e-03
4900.00000  4950.00000  2.921572875500e-03
4950.00000  5000.00000  2.883823954832e-03
5000.00000  5050.00000  2.879371518035e-03
5050.00000  5100.00000  2.816456650255e-03
5100.00000  5150.00000  2.798840487277e-03
5150.00000  5200.00000  2.850914639378e-03
5200.00000  5250.00000  2.749670098304e-03
5250.00000  5300.00000  2.737474293165e-03
5300.00000  5350.00000  2.698951035663e-03
5350.00000  5400.00000  2.708243077674e-03
5400.00000  5450.00000  2.653845915070e-03
5450.00000  5500.00000  2.618420004904e-03
5500.00000  5550.00000  2.585510689450e-03
5550.00000  5600.00000  2.553956463456e-03
5600.00000  5650.00000  2.545245174071e-03
5650.00000  5700.00000  2.545438758279e-03
5700.00000  5750.00000  2.529371268969e-03
5750.00000  5800.00000  2.474393353740e-03
5800.00000  5850.00000  2.431611243650e-03
5850.00000  5900.00000  2.399863433447e-03
5900.00000  5950.00000  2.424642212142e-03
5950.00000  6000.00000  2.413607912254e-03
6000.00000  6050.00000  2.352435302351e-03
6050.00000  6100.00000  2.337529318292e-03
6100.00000  6150.00000  2.296295881870e-03
6150.00000  6200.00000  2.289520434571e-03
6200.00000  6250.00000  2.285648750400e-03
6250.00000  6300.00000  2.266677497961e-03
6300.00000  6350.00000  2.231445172004e-03
6350.00000  6400.00000  3.262474666764e-03
6400.00000  6450.00000  2.176080088358e-03
6450.00000  6500.00000  2.146074536032e-03
6500.00000  6550.00000  2.113939557412e-03
6550.00000  6600.00000  2.057219384306e-03
6600.00000  6650.00000  2.080449489332e-03
6650.00000  6700.00000  2.113939557412e-03
6700.00000  6750.00000  2.083159668252e-03
6750.00000  6800.00000  2.011146342670e-03
6800.00000  6850.00000  1.985012474515e-03
6850.00000  6900.00000  1.992368674440e-03
6900.00000  6950.00000  1.980366453510e-03
6950.00000  7000.00000  1.922484775152e-03
7000.00000  7050.00000  1.933131906622e-03
7050.00000  7100.00000  2.052379779092e-03
7100.00000  7150.00000  1.734514508646e-03
7150.00000  7200.00000  1.703153866860e-03
7200.00000  7250.00000  1.691538814347e-03
7250.00000  7300.00000  1.665404946192e-03
7300.00000  7350.00000  1.647595199005e-03
7350.00000  7400.00000  1.657080825224e-03
7400.00000  7450.00000  1.673148314534e-03
7450.00000  7500.00000  1.651079714759e-03
7500.00000  7550.00000  1.632108462321e-03
7550.00000  7600.00000  1.606168178374e-03
7600.00000  7650.00000  1.581389399679e-03
7650.00000  7700.00000  1.604619504706e-03
7700.00000  7750.00000  1.559320799904e-03
7750.00000  7800.00000  1.572097357669e-03
7800.00000  7850.00000  1.512279837226e-03
7850.00000  7900.00000  1.566289831412e-03
7900.00000  7950.00000  1.504923637300e-03
7950.00000  8000.00000  1.530283168621e-03
8000.00000  8050.00000  1.502600626798e-03
8050.00000  8100.00000  1.484016542777e-03
8100.00000  8150.00000  1.492534247953e-03
8150.00000  8200.00000  1.458657011456e-03
8200.00000  8250.00000  1.442395937937e-03
8250.00000  8300.00000  1.461560774584e-03
8300.00000  8350.00000  1.406002106729e-03
8350.00000  8400.00000  1.418197911868e-03
8400.00000  8450.00000  1.388192359542e-03
8450.00000  8500.00000  1.393806301590e-03
8500.00000  8550.00000  1.363413580847e-03
8550.00000  8600.00000  1.375996554403e-03
8600.00000  8650.00000  1.362445659805e-03
8650.00000  8700.00000  1.367091680810e-03
8700.00000  8750.00000  1.334763117981e-03
8750.00000  8800.00000  1.348894765206e-03
8800.00000  8850.00000  1.334375949564e-03
8850.00000  8900.00000  1.302047386736e-03
8900.00000  8950.00000  1.316566202377e-03
8950.00000  9000.00000  1.277268608041e-03
9000.00000  9050.00000  1.281527460629e-03
9050.00000  9100.00000  1.265847139736e-03
9100.00000  9150.00000  1.286560650051e-03
9150.00000  9200.00000  1.243778539961e-03
9200.00000  9250.00000  1.216870334972e-03
9250.00000  9300.00000  1.216095998138e-03
9300.00000  9350.00000  1.217063919180e-03
9350.00000  9400.00000  1.234099329533e-03
9400.00000  9450.00000  1.228098219068e-03
9450.00000  9500.00000  1.147180019892e-03
9500.00000  9550.00000  1.157246398737e-03
9550.00000  9600.00000  1.169248619667e-03
9600.00000  9650.00000  1.179121414304e-03
9650.00000  9700.00000  1.157827151363e-03
9700.00000  9750.00000  1.128015183245e-03
9750.00000  9800.00000  1.130918946374e-03
9800.00000  9850.00000  1.119884646486e-03
9850.00000  9900.00000  1.146599267267e-03
9900.00000  9950.00000  1.127434430620e-03
9950.00000  10000.00000  1.093944362540e-03
