10001.00000  11001.00000  5.519268528912e-04
11001.00000  12001.00000  4.641900530149e-04
12001.00000  13001.00000  3.949665228374e-04
13001.00000  14001.00000  3.422238273154e-04
14001.00000  15001.00000  2.959004068303e-04
15001.00000  16001.00000  2.593568222947e-04
16001.00000  17001.00000  2.306008849041e-04
17001.00000  18001.00000  2.032636274197e-04
18001.00000  19001.00000  1.824160758895e-04
19001.00000  20001.00000  1.627256037154e-04
20001.00000  21001.00000  1.458724913539e-04
21001.00000  22001.00000  1.327019098128e-04
22001.00000  23001.00000  1.204066839586e-04
23001.00000  24001.00000  1.107174020457e-04
24001.00000  25001.00000  1.022858150851e-04
25001.00000  26001.00000  8.995034299238e-05
26001.00000  27001.00000  8.542264116391e-05
27001.00000  28001.00000  7.805757952292e-05
28001.00000  29001.00000  7.035042485489e-05
29001.00000  30001.00000  6.501779825691e-05
30001.00000  31001.00000  6.163711422498e-05
31001.00000  32001.00000  5.472482276684e-05
32001.00000  33001.00000  5.098192258864e-05
33001.00000  34001.00000  4.938213460924e-05
34001.00000  35001.00000  4.504560241352e-05
35001.00000  36001.00000  4.017580755801e-05
36001.00000  37001.00000  3.896842040375e-05
37001.00000  38001.00000  3.602038343543e-05
38001.00000  39001.00000  3.348487041148e-05
39001.00000  40001.00000  3.170397435895e-05
40001.00000  41001.00000  3.008406326032e-05
41001.00000  42001.00000  2.732719592476e-05
42001.00000  43001.00000  2.676374858610e-05
43001.00000  44001.00000  2.430872803911e-05
44001.00000  45001.00000  2.375534226007e-05
45001.00000  46001.00000  2.191407684982e-05
46001.00000  47001.00000  2.082742841099e-05
47001.00000  48001.00000  1.940874850473e-05
48001.00000  49001.00000  1.781902208496e-05
49001.00000  50001.00000  1.689335860002e-05
50001.00000  51001.00000  1.699397419621e-05
51001.00000  52001.00000  1.575640236310e-05
52001.00000  53001.00000  1.434778401646e-05
53001.00000  54001.00000  1.390507539323e-05
54001.00000  55001.00000  1.301965814677e-05
55001.00000  56001.00000  1.211411778108e-05
56001.00000  57001.00000  1.209399466184e-05
57001.00000  58001.00000  1.141987016738e-05
58001.00000  59001.00000  1.038352952664e-05
59001.00000  60001.00000  9.659097234081e-06
60001.00000  61001.00000  9.628912555225e-06
61001.00000  62001.00000  9.357250445516e-06
62001.00000  63001.00000  8.652941272198e-06
63001.00000  64001.00000  8.099555493162e-06
64001.00000  65001.00000  7.495861916032e-06
65001.00000  66001.00000  7.334876962131e-06
66001.00000  67001.00000  7.606539071839e-06
67001.00000  68001.00000  7.284569164036e-06
68001.00000  69001.00000  6.288474761772e-06
69001.00000  70001.00000  5.906135496256e-06
70001.00000  71001.00000  5.986627973207e-06
71001.00000  72001.00000  5.825643019305e-06
72001.00000  73001.00000  5.161580084462e-06
73001.00000  74001.00000  4.658502103521e-06
74001.00000  75001.00000  4.527701828476e-06
75001.00000  76001.00000  4.306347516861e-06
76001.00000  77001.00000  4.195670361054e-06
77001.00000  78001.00000  3.833454214776e-06
78001.00000  79001.00000  3.823392655157e-06
79001.00000  80001.00000  3.934069810964e-06
80001.00000  81001.00000  3.521545866592e-06
81001.00000  82001.00000  3.511484306973e-06
82001.00000  83001.00000  3.330376233834e-06
83001.00000  84001.00000  3.088898802982e-06
84001.00000  85001.00000  2.827298252893e-06
85001.00000  86001.00000  2.746805775942e-06
86001.00000  87001.00000  2.837359812511e-06
87001.00000  88001.00000  2.384589629664e-06
88001.00000  89001.00000  2.374528070045e-06
89001.00000  90001.00000  2.404712748902e-06
90001.00000  91001.00000  2.404712748902e-06
91001.00000  92001.00000  2.344343391189e-06
92001.00000  93001.00000  1.921757887197e-06
93001.00000  94001.00000  2.243727795000e-06
94001.00000  95001.00000  1.861388529484e-06
95001.00000  96001.00000  1.780896052534e-06
96001.00000  97001.00000  1.921757887197e-06
97001.00000  98001.00000  1.629972658251e-06
98001.00000  99001.00000  1.911696327579e-06
99001.00000  100001.00000  1.589726419776e-06
100001.00000  101001.00000  1.499172383206e-06
101001.00000  102001.00000  1.438803025493e-06
102001.00000  103001.00000  1.267756511973e-06
103001.00000  104001.00000  1.207387154260e-06
104001.00000  105001.00000  1.539418621682e-06
105001.00000  106001.00000  1.147017796547e-06
106001.00000  107001.00000  1.136956236928e-06
107001.00000  108001.00000  1.106771558072e-06
108001.00000  109001.00000  1.116833117691e-06
109001.00000  110001.00000  1.056463759978e-06
110001.00000  111001.00000  1.086648438834e-06
111001.00000  112001.00000  9.659097234081e-07
112001.00000  113001.00000  1.036340640740e-06
113001.00000  114001.00000  7.948632098880e-07
114001.00000  115001.00000  8.753556868386e-07
115001.00000  116001.00000  7.747400906503e-07
116001.00000  117001.00000  7.646785310315e-07
117001.00000  118001.00000  8.652941272198e-07
118001.00000  119001.00000  8.250478887445e-07
119001.00000  120001.00000  6.640629348431e-07
120001.00000  121001.00000  7.948632098880e-07
121001.00000  122001.00000  7.043091733184e-07
122001.00000  123001.00000  7.244322925561e-07
123001.00000  124001.00000  6.741244944619e-07
124001.00000  125001.00000  5.030779809417e-07
125001.00000  126001.00000  4.930164213229e-07
126001.00000  127001.00000  5.936320175113e-07
127001.00000  128001.00000  6.640629348431e-07
128001.00000  129001.00000  4.527701828476e-07
129001.00000  130001.00000  4.527701828476e-07
130001.00000  131001.00000  4.125239443722e-07
131001.00000  132001.00000  3.420930270404e-07
132001.00000  133001.00000  5.433242194171e-07
133001.00000  134001.00000  3.823392655157e-07
134001.00000  135001.00000  3.420930270404e-07
135001.00000  136001.00000  4.829548617041e-07
136001.00000  137001.00000  4.225855039911e-07
137001.00000  138001.00000  4.225855039911e-07
138001.00000  139001.00000  3.119083481839e-07
139001.00000  140001.00000  4.024623847534e-07
140001.00000  141001.00000  3.420930270404e-07
141001.00000  142001.00000  3.420930270404e-07
142001.00000  143001.00000  3.521545866592e-07
143001.00000  144001.00000  2.917852289462e-07
144001.00000  145001.00000  2.716621097085e-07
145001.00000  146001.00000  2.817236693274e-07
146001.00000  147001.00000  2.917852289462e-07
147001.00000  148001.00000  2.616005500897e-07
148001.00000  149001.00000  1.911696327579e-07
149001.00000  150001.00000  3.521545866592e-07
150001.00000  151001.00000  2.314158712332e-07
151001.00000  152001.00000  2.414774308520e-07
152001.00000  153001.00000  1.811080731390e-07
153001.00000  154001.00000  1.911696327579e-07
154001.00000  155001.00000  2.817236693274e-07
155001.00000  156001.00000  2.817236693274e-07
156001.00000  157001.00000  1.509233942825e-07
157001.00000  158001.00000  1.911696327579e-07
158001.00000  159001.00000  2.012311923767e-07
159001.00000  160001.00000  2.112927519955e-07
160001.00000  161001.00000  1.609849539014e-07
161001.00000  162001.00000  8.049247695068e-08
162001.00000  163001.00000  2.213543116144e-07
163001.00000  164001.00000  1.207387154260e-07
164001.00000  165001.00000  1.207387154260e-07
165001.00000  166001.00000  1.911696327579e-07
166001.00000  167001.00000  1.408618346637e-07
167001.00000  168001.00000  1.710465135202e-07
168001.00000  169001.00000  8.049247695068e-08
169001.00000  170001.00000  1.308002750449e-07
170001.00000  171001.00000  1.509233942825e-07
171001.00000  172001.00000  8.049247695068e-08
172001.00000  173001.00000  1.408618346637e-07
173001.00000  174001.00000  9.055403656951e-08
174001.00000  175001.00000  1.106771558072e-07
175001.00000  176001.00000  1.308002750449e-07
176001.00000  177001.00000  1.308002750449e-07
177001.00000  178001.00000  1.106771558072e-07
178001.00000  179001.00000  5.030779809417e-08
179001.00000  180001.00000  4.024623847534e-08
180001.00000  181001.00000  7.043091733184e-08
181001.00000  182001.00000  5.030779809417e-08
182001.00000  183001.00000  1.207387154260e-07
183001.00000  184001.00000  6.036935771301e-08
184001.00000  185001.00000  7.043091733184e-08
185001.00000  186001.00000  2.012311923767e-08
186001.00000  187001.00000  4.024623847534e-08
187001.00000  188001.00000  8.049247695068e-08
188001.00000  189001.00000  7.043091733184e-08
189001.00000  190001.00000  3.018467885650e-08
190001.00000  191001.00000  7.043091733184e-08
191001.00000  192001.00000  4.024623847534e-08
192001.00000  193001.00000  4.024623847534e-08
193001.00000  194001.00000  1.006155961883e-08
194001.00000  195001.00000  7.043091733184e-08
195001.00000  196001.00000  4.024623847534e-08
196001.00000  197001.00000  3.018467885650e-08
197001.00000  198001.00000  2.012311923767e-08
198001.00000  199001.00000  5.030779809417e-08
