300.00000  350.00000  1.562951215212e-05
350.00000  400.00000  2.456066195333e-05
400.00000  450.00000  1.860656208586e-05
450.00000  500.00000  1.711803711899e-05
500.00000  550.00000  1.488524966868e-04
550.00000  600.00000  2.083934953616e-05
600.00000  650.00000  3.200328678767e-05
650.00000  700.00000  2.083934953616e-05
700.00000  750.00000  2.828197437050e-05
750.00000  800.00000  2.307213698646e-05
800.00000  850.00000  6.251804860847e-05
850.00000  900.00000  1.935082456929e-05
900.00000  950.00000  1.562951215212e-05
950.00000  1000.00000  1.190819973495e-05
1000.00000  1050.00000  7.442624834342e-06
1050.00000  1100.00000  1.339672470182e-05
1100.00000  1150.00000  1.265246221838e-05
1150.00000  1200.00000  1.339672470182e-05
1200.00000  1250.00000  1.116393725151e-05
1250.00000  1300.00000  2.009508705272e-05
1300.00000  1350.00000  8.931149801211e-06
1350.00000  1400.00000  1.190819973495e-05
1400.00000  1450.00000  1.637377463555e-05
1450.00000  1500.00000  1.488524966868e-05
1500.00000  1550.00000  1.637377463555e-05
1550.00000  1600.00000  1.116393725151e-05
1600.00000  1650.00000  8.186887317776e-06
1650.00000  1700.00000  6.698362350908e-06
1700.00000  1750.00000  1.339672470182e-05
1750.00000  1800.00000  8.186887317776e-06
1800.00000  1850.00000  5.209837384040e-06
1850.00000  1900.00000  5.954099867474e-06
1900.00000  1950.00000  1.116393725151e-05
1950.00000  2000.00000  8.186887317776e-06
2000.00000  2050.00000  8.186887317776e-06
2050.00000  2100.00000  5.209837384040e-06
2100.00000  2150.00000  8.931149801211e-06
2150.00000  2200.00000  6.698362350908e-06
2200.00000  2250.00000  4.465574900605e-06
2250.00000  2300.00000  2.977049933737e-06
2300.00000  2350.00000  2.604918692020e-05
2350.00000  2400.00000  6.698362350908e-06
2400.00000  2450.00000  3.721312417171e-06
2450.00000  2500.00000  2.977049933737e-06
2500.00000  2550.00000  2.977049933737e-06
2550.00000  2600.00000  2.977049933737e-06
2600.00000  2650.00000  5.954099867474e-06
2650.00000  2700.00000  2.977049933737e-06
2700.00000  2750.00000  2.977049933737e-06
2750.00000  2800.00000  4.465574900605e-06
2800.00000  2850.00000  4.465574900605e-06
2850.00000  2900.00000  3.721312417171e-06
2900.00000  2950.00000  5.954099867474e-06
2950.00000  3000.00000  2.753771188707e-05
3000.00000  3050.00000  7.442624834342e-06
3050.00000  3100.00000  8.186887317776e-06
3100.00000  3150.00000  8.186887317776e-06
3150.00000  3200.00000  1.116393725151e-05
3200.00000  3250.00000  1.041967476808e-05
3250.00000  3300.00000  1.265246221838e-05
3300.00000  3350.00000  8.931149801211e-06
3350.00000  3400.00000  2.604918692020e-05
3400.00000  3450.00000  2.381639946990e-05
3450.00000  3500.00000  1.860656208586e-05
3500.00000  3550.00000  2.530492443676e-05
3550.00000  3600.00000  2.902623685393e-05
3600.00000  3650.00000  3.721312417171e-05
3650.00000  3700.00000  5.284263632383e-05
3700.00000  3750.00000  3.870164913858e-05
3750.00000  3800.00000  6.028526115817e-05
3800.00000  3850.00000  5.209837384040e-05
3850.00000  3900.00000  3.944591162201e-05
3900.00000  3950.00000  6.623936102565e-05
3950.00000  4000.00000  6.996067344282e-05
4000.00000  4050.00000  8.782297304524e-05
4050.00000  4100.00000  9.080002297898e-05
4100.00000  4150.00000  1.049410101642e-04
4150.00000  4200.00000  1.027082227139e-04
4200.00000  4250.00000  1.131278974820e-04
4250.00000  4300.00000  1.280131471507e-04
4300.00000  4350.00000  1.280131471507e-04
4350.00000  4400.00000  1.317344595679e-04
4400.00000  4450.00000  1.347115095016e-04
4450.00000  4500.00000  1.562951215212e-04
4500.00000  4550.00000  1.897869332757e-04
4550.00000  4600.00000  1.868098833420e-04
4600.00000  4650.00000  1.510852841371e-04
4650.00000  4700.00000  1.882984083089e-04
4700.00000  4750.00000  2.173246451628e-04
4750.00000  4800.00000  1.868098833420e-04
4800.00000  4850.00000  2.128590702622e-04
4850.00000  4900.00000  2.143475952291e-04
4900.00000  4950.00000  2.426295695996e-04
4950.00000  5000.00000  2.307213698646e-04
5000.00000  5050.00000  2.590033442351e-04
5050.00000  5100.00000  2.984492558571e-04
5100.00000  5150.00000  2.470951445002e-04
5150.00000  5200.00000  2.738885939038e-04
5200.00000  5250.00000  2.575148192682e-04
5250.00000  5300.00000  2.880295810890e-04
5300.00000  5350.00000  3.215213928436e-04
5350.00000  5400.00000  3.021705682743e-04
5400.00000  5450.00000  3.542689421147e-04
5450.00000  5500.00000  3.297082801614e-04
5500.00000  5550.00000  3.140787680092e-04
5550.00000  5600.00000  3.237541802939e-04
5600.00000  5650.00000  3.319410676117e-04
5650.00000  5700.00000  3.654328793662e-04
5700.00000  5750.00000  3.490591047307e-04
5750.00000  5800.00000  3.952033787036e-04
5800.00000  5850.00000  3.810623915183e-04
5850.00000  5900.00000  3.907378038030e-04
5900.00000  5950.00000  3.803181290349e-04
5950.00000  6000.00000  3.594787794987e-04
6000.00000  6050.00000  3.773410791012e-04
6050.00000  6100.00000  3.885050163527e-04
6100.00000  6150.00000  3.989246911207e-04
6150.00000  6200.00000  4.033902660213e-04
6200.00000  6250.00000  4.190197781735e-04
6250.00000  6300.00000  4.860034016825e-04
6300.00000  6350.00000  4.696296270470e-04
6350.00000  6400.00000  1.562951215212e-03
6400.00000  6450.00000  3.892492788361e-04
6450.00000  6500.00000  3.974361661539e-04
6500.00000  6550.00000  4.048787909882e-04
6550.00000  6600.00000  4.108328908557e-04
6600.00000  6650.00000  3.810623915183e-04
6650.00000  6700.00000  3.832951789686e-04
6700.00000  6750.00000  4.368820777759e-04
6750.00000  6800.00000  4.078558409220e-04
6800.00000  6850.00000  4.219968281072e-04
6850.00000  6900.00000  4.234853530741e-04
6900.00000  6950.00000  4.219968281072e-04
6950.00000  7000.00000  4.086001034054e-04
7000.00000  7050.00000  3.922263287698e-04
7050.00000  7100.00000  5.217280008874e-04
7100.00000  7150.00000  1.942525081763e-04
7150.00000  7200.00000  1.741574211236e-04
7200.00000  7250.00000  1.808557834745e-04
7250.00000  7300.00000  1.897869332757e-04
7300.00000  7350.00000  1.726688961567e-04
7350.00000  7400.00000  1.964852956266e-04
7400.00000  7450.00000  2.128590702622e-04
7450.00000  7500.00000  2.359312072486e-04
7500.00000  7550.00000  1.979738205935e-04
7550.00000  7600.00000  1.987180830769e-04
7600.00000  7650.00000  2.039279204610e-04
7650.00000  7700.00000  1.897869332757e-04
7700.00000  7750.00000  2.002066080438e-04
7750.00000  7800.00000  1.860656208586e-04
7800.00000  7850.00000  1.808557834745e-04
7850.00000  7900.00000  1.994623455604e-04
7900.00000  7950.00000  2.225344825468e-04
7950.00000  8000.00000  2.143475952291e-04
8000.00000  8050.00000  2.195574326131e-04
8050.00000  8100.00000  2.091377578450e-04
8100.00000  8150.00000  2.150918577125e-04
8150.00000  8200.00000  2.061607079113e-04
8200.00000  8250.00000  2.225344825468e-04
8250.00000  8300.00000  2.322098948315e-04
8300.00000  8350.00000  2.173246451628e-04
8350.00000  8400.00000  2.329541573149e-04
8400.00000  8450.00000  2.128590702622e-04
8450.00000  8500.00000  2.076492328781e-04
8500.00000  8550.00000  2.165803826794e-04
8550.00000  8600.00000  2.046721829444e-04
8600.00000  8650.00000  2.083934953616e-04
8650.00000  8700.00000  2.150918577125e-04
8700.00000  8750.00000  1.890426707923e-04
8750.00000  8800.00000  2.083934953616e-04
8800.00000  8850.00000  2.083934953616e-04
8850.00000  8900.00000  2.195574326131e-04
8900.00000  8950.00000  2.061607079113e-04
8950.00000  9000.00000  2.143475952291e-04
9000.00000  9050.00000  2.188131701297e-04
9050.00000  9100.00000  2.039279204610e-04
9100.00000  9150.00000  1.868098833420e-04
9150.00000  9200.00000  1.964852956266e-04
9200.00000  9250.00000  1.927639832095e-04
9250.00000  9300.00000  1.949967706598e-04
9300.00000  9350.00000  2.083934953616e-04
9350.00000  9400.00000  2.061607079113e-04
9400.00000  9450.00000  1.838328334083e-04
9450.00000  9500.00000  2.270000574474e-04
9500.00000  9550.00000  2.203016950965e-04
9550.00000  9600.00000  2.009508705272e-04
9600.00000  9650.00000  1.920197207260e-04
9650.00000  9700.00000  1.957410331432e-04
9700.00000  9750.00000  1.763902085739e-04
9750.00000  9800.00000  2.076492328781e-04
9800.00000  9850.00000  2.061607079113e-04
9850.00000  9900.00000  1.957410331432e-04
9900.00000  9950.00000  1.972295581101e-04
9950.00000  10000.00000  1.756459460905e-04
