300.00000  350.00000  1.282965114706e-01
350.00000  400.00000  1.018562109260e-01
400.00000  450.00000  8.332404564093e-02
450.00000  500.00000  6.942396629683e-02
500.00000  550.00000  5.916599777422e-02
550.00000  600.00000  5.103641541868e-02
600.00000  650.00000  4.460378960174e-02
650.00000  700.00000  3.937454069252e-02
700.00000  750.00000  3.499326722086e-02
750.00000  800.00000  3.165466563449e-02
800.00000  850.00000  2.841642926238e-02
850.00000  900.00000  2.588678337095e-02
900.00000  950.00000  2.355464978495e-02
950.00000  1000.00000  2.167184663716e-02
1000.00000  1050.00000  2.002758686437e-02
1050.00000  1100.00000  1.849234101168e-02
1100.00000  1150.00000  1.716426183373e-02
1150.00000  1200.00000  1.596832683568e-02
1200.00000  1250.00000  1.502581903197e-02
1250.00000  1300.00000  1.407345572626e-02
1300.00000  1350.00000  1.318565601530e-02
1350.00000  1400.00000  1.235980517407e-02
1400.00000  1450.00000  1.172865078055e-02
1450.00000  1500.00000  1.121938279954e-02
1500.00000  1550.00000  1.051541837082e-02
1550.00000  1600.00000  9.916244075634e-03
1600.00000  1650.00000  9.394505867606e-03
1650.00000  1700.00000  9.123580128896e-03
1700.00000  1750.00000  8.612703086340e-03
1750.00000  1800.00000  8.184089315597e-03
1800.00000  1850.00000  7.853628299486e-03
1850.00000  1900.00000  7.509087994802e-03
1900.00000  1950.00000  7.133573255253e-03
1950.00000  2000.00000  6.872100753158e-03
2000.00000  2050.00000  6.556322423704e-03
2050.00000  2100.00000  6.349558014354e-03
2100.00000  2150.00000  6.169343120602e-03
2150.00000  2200.00000  5.837474175634e-03
2200.00000  2250.00000  5.704123199565e-03
2250.00000  2300.00000  5.451500536002e-03
2300.00000  2350.00000  5.248155382449e-03
2350.00000  2400.00000  5.021277703708e-03
2400.00000  2450.00000  4.861578344735e-03
2450.00000  2500.00000  4.784343390270e-03
2500.00000  2550.00000  4.625046296686e-03
2550.00000  2600.00000  4.412449039213e-03
2600.00000  2650.00000  4.309469099926e-03
2650.00000  2700.00000  4.178732848878e-03
2700.00000  2750.00000  4.009580253291e-03
2750.00000  2800.00000  3.908008242862e-03
2800.00000  2850.00000  3.815688336352e-03
2850.00000  2900.00000  3.696416648858e-03
2900.00000  2950.00000  3.582575544099e-03
2950.00000  3000.00000  3.519822143596e-03
3000.00000  3050.00000  3.395522138754e-03
3050.00000  3100.00000  3.293748995631e-03
3100.00000  3150.00000  3.223553685453e-03
3150.00000  3200.00000  3.103276334489e-03
3200.00000  3250.00000  3.068480378440e-03
3250.00000  3300.00000  2.991848822057e-03
3300.00000  3350.00000  2.885047361586e-03
3350.00000  3400.00000  2.786492341565e-03
3400.00000  3450.00000  2.789509331974e-03
3450.00000  3500.00000  2.698999619710e-03
3500.00000  3550.00000  2.631016769165e-03
3550.00000  3600.00000  2.583549453400e-03
3600.00000  3650.00000  2.507119029710e-03
3650.00000  3700.00000  2.503900906608e-03
3700.00000  3750.00000  2.427068217530e-03
3750.00000  3800.00000  2.377589574826e-03
3800.00000  3850.00000  2.295728568401e-03
3850.00000  3900.00000  2.250272579575e-03
3900.00000  3950.00000  2.233980831367e-03
3950.00000  4000.00000  2.162980990414e-03
4000.00000  4050.00000  2.105658172646e-03
4050.00000  4100.00000  2.054570468391e-03
4100.00000  4150.00000  2.028020952793e-03
4150.00000  4200.00000  1.994834058297e-03
4200.00000  4250.00000  1.951389396410e-03
4250.00000  4300.00000  1.940930496326e-03
4300.00000  4350.00000  1.906939071054e-03
4350.00000  4400.00000  1.875562370802e-03
4400.00000  4450.00000  1.811803306830e-03
4450.00000  4500.00000  1.799534212500e-03
4500.00000  4550.00000  1.724109452281e-03
4550.00000  4600.00000  1.740803465876e-03
4600.00000  4650.00000  1.677446667291e-03
4650.00000  4700.00000  1.642851843937e-03
4700.00000  4750.00000  1.623543105321e-03
4750.00000  4800.00000  1.598401518581e-03
4800.00000  4850.00000  1.576880320331e-03
4850.00000  4900.00000  1.538866241180e-03
4900.00000  4950.00000  1.552543264367e-03
4950.00000  5000.00000  1.526194881463e-03
5000.00000  5050.00000  1.472090186799e-03
5050.00000  5100.00000  1.443730476956e-03
5100.00000  5150.00000  1.407526592051e-03
5150.00000  5200.00000  1.411951511317e-03
5200.00000  5250.00000  1.409135653602e-03
5250.00000  5300.00000  1.379770280290e-03
5300.00000  5350.00000  1.320637268277e-03
5350.00000  5400.00000  1.339744874200e-03
5400.00000  5450.00000  1.305753448927e-03
5450.00000  5500.00000  1.299116070028e-03
5500.00000  5550.00000  1.267135971695e-03
5550.00000  5600.00000  1.223490177114e-03
5600.00000  5650.00000  1.243804579200e-03
5650.00000  5700.00000  1.195130467271e-03
5700.00000  5750.00000  1.171597942083e-03
5750.00000  5800.00000  1.194728201884e-03
5800.00000  5850.00000  1.182056842167e-03
5850.00000  5900.00000  1.151484672691e-03
5900.00000  5950.00000  1.135394057177e-03
5950.00000  6000.00000  1.122119299379e-03
6000.00000  6050.00000  1.099793570353e-03
6050.00000  6100.00000  1.082496158676e-03
6100.00000  6150.00000  1.081892760595e-03
6150.00000  6200.00000  1.069824798959e-03
6200.00000  6250.00000  1.080283699043e-03
6250.00000  6300.00000  1.091144864515e-03
6300.00000  6350.00000  1.044683212219e-03
6350.00000  6400.00000  1.840766414754e-03
6400.00000  6450.00000  9.841422713496e-04
6450.00000  6500.00000  9.620176750184e-04
6500.00000  6550.00000  9.493463153014e-04
6550.00000  6600.00000  9.525644384042e-04
6600.00000  6650.00000  9.266183208885e-04
6650.00000  6700.00000  9.213888708466e-04
6700.00000  6750.00000  9.101254399871e-04
6750.00000  6800.00000  9.073095822722e-04
6800.00000  6850.00000  9.010744687607e-04
6850.00000  6900.00000  8.799555358991e-04
6900.00000  6950.00000  8.843804551654e-04
6950.00000  7000.00000  8.491822337294e-04
7000.00000  7050.00000  8.455618452388e-04
7050.00000  7100.00000  9.328534344000e-04
7100.00000  7150.00000  7.858254351447e-04
7150.00000  7200.00000  8.035251122096e-04
7200.00000  7250.00000  7.749642696730e-04
7250.00000  7300.00000  7.697348196311e-04
7300.00000  7350.00000  7.966866006163e-04
7350.00000  7400.00000  7.691314215493e-04
7400.00000  7450.00000  7.622929099560e-04
7450.00000  7500.00000  7.801937197149e-04
7500.00000  7550.00000  7.226697692538e-04
7550.00000  7600.00000  7.218652384782e-04
7600.00000  7650.00000  7.230720346417e-04
7650.00000  7700.00000  7.110040730065e-04
7700.00000  7750.00000  6.957179882686e-04
7750.00000  7800.00000  7.017519690862e-04
7800.00000  7850.00000  6.615254303022e-04
7850.00000  7900.00000  6.820409650820e-04
7900.00000  7950.00000  6.778171785097e-04
7950.00000  8000.00000  6.731911265496e-04
8000.00000  8050.00000  6.635367572414e-04
8050.00000  8100.00000  6.745990554070e-04
8100.00000  8150.00000  6.295453319690e-04
8150.00000  8200.00000  6.325623223778e-04
8200.00000  8250.00000  6.323611896838e-04
8250.00000  8300.00000  6.323611896838e-04
8300.00000  8350.00000  6.196898299669e-04
8350.00000  8400.00000  6.106388587405e-04
8400.00000  8450.00000  5.887153951032e-04
8450.00000  8500.00000  6.035992144533e-04
8500.00000  8550.00000  6.190864318851e-04
8550.00000  8600.00000  5.828825469796e-04
8600.00000  8650.00000  6.040014798412e-04
8650.00000  8700.00000  5.659874006903e-04
8700.00000  8750.00000  5.718202488140e-04
8750.00000  8800.00000  5.551262352186e-04
8800.00000  8850.00000  5.621658795058e-04
8850.00000  8900.00000  5.500979178706e-04
8900.00000  8950.00000  5.412480793382e-04
8950.00000  9000.00000  5.482877236254e-04
9000.00000  9050.00000  5.390356197051e-04
9050.00000  9100.00000  5.511035813402e-04
9100.00000  9150.00000  5.205314118644e-04
9150.00000  9200.00000  5.221404734158e-04
9200.00000  9250.00000  5.233472695793e-04
9250.00000  9300.00000  5.018260713299e-04
9300.00000  9350.00000  5.175144214556e-04
9350.00000  9400.00000  4.887524462251e-04
9400.00000  9450.00000  4.955909578184e-04
9450.00000  9500.00000  4.827184654075e-04
9500.00000  9550.00000  4.897581096947e-04
9550.00000  9600.00000  4.865399865920e-04
9600.00000  9650.00000  4.780924134474e-04
9650.00000  9700.00000  4.728629634054e-04
9700.00000  9750.00000  4.799026076926e-04
9750.00000  9800.00000  4.706505037723e-04
9800.00000  9850.00000  4.579791440554e-04
9850.00000  9900.00000  4.624040633216e-04
9900.00000  9950.00000  4.571746132797e-04
9950.00000  10000.00000  4.461123151141e-04
