10001.00000  11001.00000  2.094714198710e-05
11001.00000  12001.00000  1.997308059635e-05
12001.00000  13001.00000  1.843001304666e-05
13001.00000  14001.00000  1.690623384134e-05
14001.00000  15001.00000  1.611541172212e-05
15001.00000  16001.00000  1.419622145718e-05
16001.00000  17001.00000  1.324144841081e-05
17001.00000  18001.00000  1.120652807965e-05
18001.00000  19001.00000  1.058930105978e-05
19001.00000  20001.00000  9.846699801485e-06
20001.00000  21001.00000  9.644172185588e-06
21001.00000  22001.00000  8.882282582926e-06
22001.00000  23001.00000  8.052883774966e-06
23001.00000  24001.00000  7.377791721974e-06
24001.00000  25001.00000  6.847362251767e-06
25001.00000  26001.00000  6.133693510034e-06
26001.00000  27001.00000  5.950454238508e-06
27001.00000  28001.00000  5.178920463661e-06
28001.00000  29001.00000  5.217497152403e-06
29001.00000  30001.00000  4.802797748423e-06
30001.00000  31001.00000  4.580981788154e-06
31001.00000  32001.00000  4.243435761659e-06
32001.00000  33001.00000  4.282012450401e-06
33001.00000  34001.00000  3.809448013307e-06
34001.00000  35001.00000  3.221153509986e-06
35001.00000  36001.00000  3.925178079534e-06
36001.00000  37001.00000  3.751582980194e-06
37001.00000  38001.00000  3.134355960316e-06
38001.00000  39001.00000  3.375460264956e-06
39001.00000  40001.00000  2.796809933820e-06
40001.00000  41001.00000  2.951116688790e-06
41001.00000  42001.00000  2.700368211965e-06
42001.00000  43001.00000  2.777521589449e-06
43001.00000  44001.00000  2.449619735139e-06
44001.00000  45001.00000  2.150650397386e-06
45001.00000  46001.00000  2.044564503345e-06
46001.00000  47001.00000  2.169938741757e-06
47001.00000  48001.00000  1.986699470231e-06
48001.00000  49001.00000  1.880613576190e-06
49001.00000  50001.00000  1.649153443735e-06
50001.00000  51001.00000  1.764883509963e-06
51001.00000  52001.00000  1.610576754993e-06
52001.00000  53001.00000  1.861325231818e-06
53001.00000  54001.00000  1.774527682148e-06
54001.00000  55001.00000  1.600932582808e-06
55001.00000  56001.00000  1.388760794725e-06
56001.00000  57001.00000  1.523779205323e-06
57001.00000  58001.00000  1.485202516580e-06
58001.00000  59001.00000  1.128368145714e-06
59001.00000  60001.00000  1.398404966910e-06
60001.00000  61001.00000  1.263386556312e-06
61001.00000  62001.00000  1.234454039755e-06
62001.00000  63001.00000  1.301963245054e-06
63001.00000  64001.00000  1.109079801343e-06
64001.00000  65001.00000  1.060858940415e-06
65001.00000  66001.00000  1.109079801343e-06
66001.00000  67001.00000  9.354847020020e-07
67001.00000  68001.00000  9.740613907443e-07
68001.00000  69001.00000  9.740613907443e-07
69001.00000  70001.00000  9.547730463732e-07
70001.00000  71001.00000  9.644172185588e-07
71001.00000  72001.00000  7.522454304758e-07
72001.00000  73001.00000  8.004662914038e-07
73001.00000  74001.00000  8.583313245173e-07
74001.00000  75001.00000  9.740613907443e-07
75001.00000  76001.00000  8.004662914038e-07
76001.00000  77001.00000  7.040245695479e-07
77001.00000  78001.00000  6.461595364344e-07
78001.00000  79001.00000  7.522454304758e-07
79001.00000  80001.00000  7.522454304758e-07
80001.00000  81001.00000  7.329570861047e-07
81001.00000  82001.00000  6.268711920632e-07
82001.00000  83001.00000  7.233129139191e-07
83001.00000  84001.00000  6.558037086200e-07
84001.00000  85001.00000  5.979386755064e-07
85001.00000  86001.00000  3.954110596091e-07
86001.00000  87001.00000  4.918527814650e-07
87001.00000  88001.00000  4.339877483514e-07
88001.00000  89001.00000  4.339877483514e-07
89001.00000  90001.00000  4.436319205370e-07
90001.00000  91001.00000  5.593619867641e-07
91001.00000  92001.00000  4.050552317947e-07
92001.00000  93001.00000  3.954110596091e-07
93001.00000  94001.00000  4.050552317947e-07
94001.00000  95001.00000  3.954110596091e-07
95001.00000  96001.00000  4.725644370938e-07
96001.00000  97001.00000  4.050552317947e-07
97001.00000  98001.00000  3.375460264956e-07
98001.00000  99001.00000  5.593619867641e-07
99001.00000  100001.00000  3.568343708667e-07
100001.00000  101001.00000  4.822086092794e-07
101001.00000  102001.00000  5.497178145785e-07
102001.00000  103001.00000  3.182576821244e-07
103001.00000  104001.00000  3.761227152379e-07
104001.00000  105001.00000  3.279018543100e-07
105001.00000  106001.00000  3.182576821244e-07
106001.00000  107001.00000  3.954110596091e-07
107001.00000  108001.00000  2.507484768253e-07
108001.00000  109001.00000  2.989693377532e-07
109001.00000  110001.00000  3.375460264956e-07
110001.00000  111001.00000  3.375460264956e-07
111001.00000  112001.00000  3.182576821244e-07
112001.00000  113001.00000  1.832392715262e-07
113001.00000  114001.00000  2.989693377532e-07
114001.00000  115001.00000  2.796809933820e-07
115001.00000  116001.00000  1.928834437118e-07
116001.00000  117001.00000  2.603926490109e-07
117001.00000  118001.00000  2.121717880829e-07
118001.00000  119001.00000  3.086135099388e-07
119001.00000  120001.00000  1.928834437118e-07
120001.00000  121001.00000  1.832392715262e-07
121001.00000  122001.00000  2.314601324541e-07
122001.00000  123001.00000  1.543067549694e-07
123001.00000  124001.00000  1.157300662271e-07
124001.00000  125001.00000  2.025276158973e-07
125001.00000  126001.00000  2.025276158973e-07
126001.00000  127001.00000  1.060858940415e-07
127001.00000  128001.00000  2.507484768253e-07
128001.00000  129001.00000  1.928834437118e-07
129001.00000  130001.00000  1.446625827838e-07
130001.00000  131001.00000  1.350184105982e-07
131001.00000  132001.00000  1.157300662271e-07
132001.00000  133001.00000  9.644172185588e-08
133001.00000  134001.00000  1.060858940415e-07
134001.00000  135001.00000  1.928834437118e-07
135001.00000  136001.00000  6.750920529911e-08
136001.00000  137001.00000  1.060858940415e-07
137001.00000  138001.00000  1.060858940415e-07
138001.00000  139001.00000  1.350184105982e-07
139001.00000  140001.00000  1.350184105982e-07
140001.00000  141001.00000  1.639509271550e-07
141001.00000  142001.00000  9.644172185588e-08
142001.00000  143001.00000  9.644172185588e-08
143001.00000  144001.00000  9.644172185588e-08
144001.00000  145001.00000  1.350184105982e-07
145001.00000  146001.00000  1.157300662271e-07
146001.00000  147001.00000  1.253742384126e-07
147001.00000  148001.00000  5.786503311353e-08
148001.00000  149001.00000  8.679754967029e-08
149001.00000  150001.00000  3.857668874235e-08
150001.00000  151001.00000  8.679754967029e-08
151001.00000  152001.00000  1.060858940415e-07
152001.00000  153001.00000  6.750920529911e-08
153001.00000  154001.00000  1.543067549694e-07
154001.00000  155001.00000  5.786503311353e-08
155001.00000  156001.00000  1.157300662271e-07
156001.00000  157001.00000  4.822086092794e-08
157001.00000  158001.00000  5.786503311353e-08
158001.00000  159001.00000  9.644172185588e-08
159001.00000  160001.00000  3.857668874235e-08
160001.00000  161001.00000  3.857668874235e-08
161001.00000  162001.00000  7.715337748470e-08
162001.00000  163001.00000  3.857668874235e-08
163001.00000  164001.00000  6.750920529911e-08
164001.00000  165001.00000  5.786503311353e-08
165001.00000  166001.00000  7.715337748470e-08
166001.00000  167001.00000  1.253742384126e-07
167001.00000  168001.00000  8.679754967029e-08
168001.00000  169001.00000  9.644172185588e-08
169001.00000  170001.00000  3.857668874235e-08
170001.00000  171001.00000  7.715337748470e-08
171001.00000  172001.00000  5.786503311353e-08
172001.00000  173001.00000  4.822086092794e-08
173001.00000  174001.00000  9.644172185588e-09
174001.00000  175001.00000  2.893251655676e-08
175001.00000  176001.00000  4.822086092794e-08
176001.00000  177001.00000  4.822086092794e-08
177001.00000  178001.00000  5.786503311353e-08
178001.00000  179001.00000  3.857668874235e-08
179001.00000  180001.00000  1.928834437118e-08
180001.00000  181001.00000  8.679754967029e-08
181001.00000  182001.00000  2.893251655676e-08
182001.00000  183001.00000  2.893251655676e-08
183001.00000  184001.00000  2.893251655676e-08
184001.00000  185001.00000  2.893251655676e-08
185001.00000  186001.00000  2.893251655676e-08
186001.00000  187001.00000  3.857668874235e-08
187001.00000  188001.00000  9.644172185588e-09
188001.00000  189001.00000  0.000000000000e+00
189001.00000  190001.00000  1.928834437118e-08
190001.00000  191001.00000  9.644172185588e-09
191001.00000  192001.00000  2.893251655676e-08
192001.00000  193001.00000  1.928834437118e-08
193001.00000  194001.00000  0.000000000000e+00
194001.00000  195001.00000  9.644172185588e-09
195001.00000  196001.00000  0.000000000000e+00
196001.00000  197001.00000  0.000000000000e+00
197001.00000  198001.00000  9.644172185588e-09
198001.00000  199001.00000  0.000000000000e+00
