300.00000  350.00000  4.630811855353e-05
350.00000  400.00000  6.403544518730e-05
400.00000  450.00000  4.377564332013e-05
450.00000  500.00000  4.775524725833e-05
500.00000  550.00000  2.912346518405e-04
550.00000  600.00000  3.002792062455e-05
600.00000  650.00000  8.501881140687e-05
650.00000  700.00000  3.617821761994e-05
700.00000  750.00000  5.969405907291e-05
750.00000  800.00000  3.943425720574e-05
800.00000  850.00000  1.570134644706e-04
850.00000  900.00000  4.051960373434e-05
900.00000  950.00000  3.617821761994e-05
950.00000  1000.00000  4.232851461533e-05
1000.00000  1050.00000  4.196673243913e-05
1050.00000  1100.00000  4.088138591054e-05
1100.00000  1150.00000  3.726356414854e-05
1150.00000  1200.00000  4.124316808674e-05
1200.00000  1250.00000  4.594633637733e-05
1250.00000  1300.00000  1.183027716172e-04
1300.00000  1350.00000  3.979603938194e-05
1350.00000  1400.00000  4.884059378692e-05
1400.00000  1450.00000  3.690178197234e-05
1450.00000  1500.00000  5.245841554892e-05
1500.00000  1550.00000  4.377564332013e-05
1550.00000  1600.00000  4.088138591054e-05
1600.00000  1650.00000  5.064950466792e-05
1650.00000  1700.00000  5.282019772512e-05
1700.00000  1750.00000  1.805293059235e-04
1750.00000  1800.00000  5.390554425372e-05
1800.00000  1850.00000  5.824693036811e-05
1850.00000  1900.00000  6.114118777770e-05
1900.00000  1950.00000  5.137306902032e-05
1950.00000  2000.00000  4.884059378692e-05
2000.00000  2050.00000  6.222653430630e-05
2050.00000  2100.00000  5.643801948711e-05
2100.00000  2150.00000  6.512079171590e-05
2150.00000  2200.00000  6.439722736350e-05
2200.00000  2250.00000  6.982396000649e-05
2250.00000  2300.00000  6.729148477309e-05
2300.00000  2350.00000  2.051304939051e-04
2350.00000  2400.00000  5.969405907291e-05
2400.00000  2450.00000  5.824693036811e-05
2450.00000  2500.00000  6.584435606830e-05
2500.00000  2550.00000  6.439722736350e-05
2550.00000  2600.00000  7.018574218269e-05
2600.00000  2650.00000  7.127108871129e-05
2650.00000  2700.00000  7.923029658768e-05
2700.00000  2750.00000  6.656792042070e-05
2750.00000  2800.00000  6.910039565409e-05
2800.00000  2850.00000  6.729148477309e-05
2850.00000  2900.00000  6.946217783029e-05
2900.00000  2950.00000  7.669782135428e-05
2950.00000  3000.00000  1.287944547270e-04
3000.00000  3050.00000  7.163287088749e-05
3050.00000  3100.00000  7.597425700188e-05
3100.00000  3150.00000  7.995386094008e-05
3150.00000  3200.00000  9.116910840226e-05
3200.00000  3250.00000  7.886851441148e-05
3250.00000  3300.00000  8.103920746867e-05
3300.00000  3350.00000  8.538059358307e-05
3350.00000  3400.00000  8.610415793547e-05
3400.00000  3450.00000  7.778316788288e-05
3450.00000  3500.00000  8.248633617347e-05
3500.00000  3550.00000  9.478693016425e-05
3550.00000  3600.00000  9.587227669285e-05
3600.00000  3650.00000  9.442514798805e-05
3650.00000  3700.00000  1.349447517224e-04
3700.00000  3750.00000  8.682772228786e-05
3750.00000  3800.00000  9.370158363565e-05
3800.00000  3850.00000  8.863663316886e-05
3850.00000  3900.00000  9.406336581185e-05
3900.00000  3950.00000  1.016607915120e-04
3950.00000  4000.00000  9.442514798805e-05
4000.00000  4050.00000  1.023843558644e-04
4050.00000  4100.00000  9.587227669285e-05
4100.00000  4150.00000  1.027461380406e-04
4150.00000  4200.00000  9.840475192625e-05
4200.00000  4250.00000  1.031079202168e-04
4250.00000  4300.00000  1.031079202168e-04
4300.00000  4350.00000  9.731940539765e-05
4350.00000  4400.00000  1.016607915120e-04
4400.00000  4450.00000  1.230059399078e-04
4450.00000  4500.00000  1.157702963838e-04
4500.00000  4550.00000  1.157702963838e-04
4550.00000  4600.00000  1.240912864364e-04
4600.00000  4650.00000  1.211970290268e-04
4650.00000  4700.00000  1.063639598026e-04
4700.00000  4750.00000  1.186645537934e-04
4750.00000  4800.00000  1.324122764890e-04
4800.00000  4850.00000  1.172174250886e-04
4850.00000  4900.00000  1.248148507888e-04
4900.00000  4950.00000  1.154085142076e-04
4950.00000  5000.00000  1.092582172122e-04
5000.00000  5050.00000  1.219205933792e-04
5050.00000  5100.00000  1.403714843654e-04
5100.00000  5150.00000  1.262619794936e-04
5150.00000  5200.00000  1.280708903746e-04
5200.00000  5250.00000  1.407332665416e-04
5250.00000  5300.00000  1.356683160748e-04
5300.00000  5350.00000  1.219205933792e-04
5350.00000  5400.00000  1.277091081984e-04
5400.00000  5450.00000  1.544809892372e-04
5450.00000  5500.00000  1.320504943128e-04
5500.00000  5550.00000  1.378390091320e-04
5550.00000  5600.00000  1.353065338986e-04
5600.00000  5650.00000  1.331358408414e-04
5650.00000  5700.00000  1.396479200130e-04
5700.00000  5750.00000  1.309651477842e-04
5750.00000  5800.00000  1.342211873700e-04
5800.00000  5850.00000  1.324122764890e-04
5850.00000  5900.00000  1.432657417750e-04
5900.00000  5950.00000  1.280708903746e-04
5950.00000  6000.00000  1.306033656080e-04
6000.00000  6050.00000  1.302415834318e-04
6050.00000  6100.00000  1.302415834318e-04
6100.00000  6150.00000  1.389243556606e-04
6150.00000  6200.00000  1.436275239512e-04
6200.00000  6250.00000  1.624401971135e-04
6250.00000  6300.00000  1.928298999143e-04
6300.00000  6350.00000  1.982566325573e-04
6350.00000  6400.00000  1.656600584817e-03
6400.00000  6450.00000  1.324122764890e-04
6450.00000  6500.00000  1.284326725508e-04
6500.00000  6550.00000  1.259001973174e-04
6550.00000  6600.00000  1.287944547270e-04
6600.00000  6650.00000  1.490542565942e-04
6650.00000  6700.00000  1.306033656080e-04
6700.00000  6750.00000  1.193881181458e-04
6750.00000  6800.00000  1.356683160748e-04
6800.00000  6850.00000  1.465217813608e-04
6850.00000  6900.00000  1.374772269558e-04
6900.00000  6950.00000  1.447128704798e-04
6950.00000  7000.00000  1.259001973174e-04
7000.00000  7050.00000  1.222823755554e-04
7050.00000  7100.00000  3.006409884217e-04
7100.00000  7150.00000  7.923029658768e-05
7150.00000  7200.00000  7.416534612088e-05
7200.00000  7250.00000  7.814495005908e-05
7250.00000  7300.00000  6.765326694929e-05
7300.00000  7350.00000  8.357168270207e-05
7350.00000  7400.00000  7.705960353048e-05
7400.00000  7450.00000  7.669782135428e-05
7450.00000  7500.00000  1.389243556606e-04
7500.00000  7550.00000  6.982396000649e-05
7550.00000  7600.00000  8.501881140687e-05
7600.00000  7650.00000  7.561247482568e-05
7650.00000  7700.00000  8.284811834967e-05
7700.00000  7750.00000  7.127108871129e-05
7750.00000  7800.00000  8.031564311627e-05
7800.00000  7850.00000  6.946217783029e-05
7850.00000  7900.00000  7.886851441148e-05
7900.00000  7950.00000  7.597425700188e-05
7950.00000  8000.00000  7.380356394468e-05
8000.00000  8050.00000  7.380356394468e-05
8050.00000  8100.00000  7.307999959229e-05
8100.00000  8150.00000  7.307999959229e-05
8150.00000  8200.00000  7.705960353048e-05
8200.00000  8250.00000  6.982396000649e-05
8250.00000  8300.00000  8.718950446406e-05
8300.00000  8350.00000  6.765326694929e-05
8350.00000  8400.00000  6.910039565409e-05
8400.00000  8450.00000  7.488891047328e-05
8450.00000  8500.00000  7.633603917808e-05
8500.00000  8550.00000  7.235643523989e-05
8550.00000  8600.00000  6.656792042070e-05
8600.00000  8650.00000  7.090930653509e-05
8650.00000  8700.00000  7.850673223528e-05
8700.00000  8750.00000  6.403544518730e-05
8750.00000  8800.00000  7.452712829708e-05
8800.00000  8850.00000  6.222653430630e-05
8850.00000  8900.00000  7.452712829708e-05
8900.00000  8950.00000  7.959207876388e-05
8950.00000  9000.00000  7.633603917808e-05
9000.00000  9050.00000  7.995386094008e-05
9050.00000  9100.00000  7.742138570668e-05
9100.00000  9150.00000  6.692970259690e-05
9150.00000  9200.00000  6.765326694929e-05
9200.00000  9250.00000  6.801504912549e-05
9250.00000  9300.00000  7.018574218269e-05
9300.00000  9350.00000  7.163287088749e-05
9350.00000  9400.00000  6.910039565409e-05
9400.00000  9450.00000  7.018574218269e-05
9450.00000  9500.00000  6.005584124911e-05
9500.00000  9550.00000  6.656792042070e-05
9550.00000  9600.00000  6.801504912549e-05
9600.00000  9650.00000  6.910039565409e-05
9650.00000  9700.00000  6.584435606830e-05
9700.00000  9750.00000  6.439722736350e-05
9750.00000  9800.00000  6.656792042070e-05
9800.00000  9850.00000  6.656792042070e-05
9850.00000  9900.00000  6.910039565409e-05
9900.00000  9950.00000  8.140098964487e-05
9950.00000  10000.00000  6.005584124911e-05
