10001.00000  11001.00000  2.714122303691e-04
11001.00000  12001.00000  2.379639834129e-04
12001.00000  13001.00000  2.129916171653e-04
13001.00000  14001.00000  1.886488877704e-04
14001.00000  15001.00000  1.678708716334e-04
15001.00000  16001.00000  1.504541476174e-04
16001.00000  17001.00000  1.352072490628e-04
17001.00000  18001.00000  1.222851635026e-04
18001.00000  19001.00000  1.114457229165e-04
19001.00000  20001.00000  1.028051679541e-04
20001.00000  21001.00000  9.477487640284e-05
21001.00000  22001.00000  8.926313226207e-05
22001.00000  23001.00000  8.178498379693e-05
23001.00000  24001.00000  7.464587056012e-05
24001.00000  25001.00000  6.957971557661e-05
25001.00000  26001.00000  6.574377413594e-05
26001.00000  27001.00000  6.082291996458e-05
27001.00000  28001.00000  5.771348258464e-05
28001.00000  29001.00000  5.248265334736e-05
29001.00000  30001.00000  4.938290268823e-05
30001.00000  31001.00000  4.648657316611e-05
31001.00000  32001.00000  4.527573306489e-05
32001.00000  33001.00000  4.170133308608e-05
33001.00000  34001.00000  3.882437700558e-05
34001.00000  35001.00000  3.733262200087e-05
35001.00000  36001.00000  3.586024043779e-05
36001.00000  37001.00000  3.460096673252e-05
37001.00000  38001.00000  3.298328435728e-05
38001.00000  39001.00000  3.074565185022e-05
39001.00000  40001.00000  2.919577652066e-05
40001.00000  41001.00000  2.832397164778e-05
41001.00000  42001.00000  2.672566271417e-05
42001.00000  43001.00000  2.495299280598e-05
43001.00000  44001.00000  2.456552397359e-05
44001.00000  45001.00000  2.271536029892e-05
45001.00000  46001.00000  2.136890610636e-05
46001.00000  47001.00000  2.080707629940e-05
47001.00000  48001.00000  1.995464486814e-05
48001.00000  49001.00000  1.915064704092e-05
49001.00000  50001.00000  1.806573431023e-05
50001.00000  51001.00000  1.791074677727e-05
51001.00000  52001.00000  1.761045843217e-05
52001.00000  53001.00000  1.646742537662e-05
53001.00000  54001.00000  1.630275112285e-05
54001.00000  55001.00000  1.555687362050e-05
55001.00000  56001.00000  1.540188608754e-05
56001.00000  57001.00000  1.386169747879e-05
57001.00000  58001.00000  1.364858962097e-05
58001.00000  59001.00000  1.328049423020e-05
59001.00000  60001.00000  1.272835114404e-05
60001.00000  61001.00000  1.255399016947e-05
61001.00000  62001.00000  1.207934084979e-05
62001.00000  63001.00000  1.220526822032e-05
63001.00000  64001.00000  1.133346334744e-05
64001.00000  65001.00000  1.113004221043e-05
65001.00000  66001.00000  1.001606931731e-05
66001.00000  67001.00000  9.948262271639e-06
67001.00000  68001.00000  9.347685581433e-06
68001.00000  69001.00000  9.231444931715e-06
69001.00000  70001.00000  9.396119185481e-06
70001.00000  71001.00000  9.212071490096e-06
71001.00000  72001.00000  8.843976099324e-06
72001.00000  73001.00000  8.863349540944e-06
73001.00000  74001.00000  8.514627591792e-06
74001.00000  75001.00000  7.710629764581e-06
75001.00000  76001.00000  7.265040607331e-06
76001.00000  77001.00000  7.061619470326e-06
77001.00000  78001.00000  7.206920282472e-06
78001.00000  79001.00000  6.732270962793e-06
79001.00000  80001.00000  6.838824891701e-06
80001.00000  81001.00000  6.538536546598e-06
81001.00000  82001.00000  6.916318658179e-06
82001.00000  83001.00000  6.645090475505e-06
83001.00000  84001.00000  6.441669338500e-06
84001.00000  85001.00000  5.879839531533e-06
85001.00000  86001.00000  6.005766902060e-06
86001.00000  87001.00000  5.443937095093e-06
87001.00000  88001.00000  5.502057419952e-06
88001.00000  89001.00000  5.540804303191e-06
89001.00000  90001.00000  5.472997257523e-06
90001.00000  91001.00000  5.182395633229e-06
91001.00000  92001.00000  4.853047125697e-06
92001.00000  93001.00000  4.649625988692e-06
93001.00000  94001.00000  4.930540892175e-06
94001.00000  95001.00000  4.823986963268e-06
95001.00000  96001.00000  4.436518130877e-06
96001.00000  97001.00000  4.572132222214e-06
97001.00000  98001.00000  4.049049298486e-06
98001.00000  99001.00000  4.019989136057e-06
99001.00000  100001.00000  4.136229785774e-06
100001.00000  101001.00000  4.097482902535e-06
101001.00000  102001.00000  3.642207024475e-06
102001.00000  103001.00000  3.797194557432e-06
103001.00000  104001.00000  3.894061765529e-06
104001.00000  105001.00000  4.000615694437e-06
105001.00000  106001.00000  3.487219491519e-06
106001.00000  107001.00000  3.303171796133e-06
107001.00000  108001.00000  3.622833582856e-06
108001.00000  109001.00000  3.768134395002e-06
109001.00000  110001.00000  3.235364750465e-06
110001.00000  111001.00000  3.148184263177e-06
111001.00000  112001.00000  3.409725725041e-06
112001.00000  113001.00000  2.954449846981e-06
113001.00000  114001.00000  2.973823288601e-06
114001.00000  115001.00000  2.789775593215e-06
115001.00000  116001.00000  3.099750659128e-06
116001.00000  117001.00000  3.245051471275e-06
117001.00000  118001.00000  2.857582638884e-06
118001.00000  119001.00000  2.518547410541e-06
119001.00000  120001.00000  2.663848222688e-06
120001.00000  121001.00000  2.431366923253e-06
121001.00000  122001.00000  2.683221664308e-06
122001.00000  123001.00000  2.334499715156e-06
123001.00000  124001.00000  2.441053644063e-06
124001.00000  125001.00000  2.344186435965e-06
125001.00000  126001.00000  2.576667735400e-06
126001.00000  127001.00000  2.227945786248e-06
127001.00000  128001.00000  2.324812994346e-06
128001.00000  129001.00000  2.392620040014e-06
129001.00000  130001.00000  1.888910557906e-06
130001.00000  131001.00000  1.985777766004e-06
131001.00000  132001.00000  2.053584811672e-06
132001.00000  133001.00000  1.927657441145e-06
133001.00000  134001.00000  2.102018415721e-06
134001.00000  135001.00000  2.150452019770e-06
135001.00000  136001.00000  1.927657441145e-06
136001.00000  137001.00000  1.792043349808e-06
137001.00000  138001.00000  1.666115979281e-06
138001.00000  139001.00000  1.792043349808e-06
139001.00000  140001.00000  1.598308933613e-06
140001.00000  141001.00000  1.830790233047e-06
141001.00000  142001.00000  1.675802700091e-06
142001.00000  143001.00000  1.695176141711e-06
143001.00000  144001.00000  1.607995654423e-06
144001.00000  145001.00000  1.578935491993e-06
145001.00000  146001.00000  1.491755004705e-06
146001.00000  147001.00000  1.472381563086e-06
147001.00000  148001.00000  1.666115979281e-06
148001.00000  149001.00000  1.414261238227e-06
149001.00000  150001.00000  1.453008121466e-06
150001.00000  151001.00000  1.511128446325e-06
151001.00000  152001.00000  1.414261238227e-06
152001.00000  153001.00000  1.414261238227e-06
153001.00000  154001.00000  1.298020588510e-06
154001.00000  155001.00000  1.394887796608e-06
155001.00000  156001.00000  1.375514354988e-06
156001.00000  157001.00000  1.181779938793e-06
157001.00000  158001.00000  1.259273705271e-06
158001.00000  159001.00000  1.046165847456e-06
159001.00000  160001.00000  9.880455225970e-07
160001.00000  161001.00000  1.239900263651e-06
161001.00000  162001.00000  1.327080750939e-06
162001.00000  163001.00000  1.026792405836e-06
163001.00000  164001.00000  9.589853601677e-07
164001.00000  165001.00000  1.026792405836e-06
165001.00000  166001.00000  1.133346334744e-06
166001.00000  167001.00000  9.105517561188e-07
167001.00000  168001.00000  9.783588017872e-07
168001.00000  169001.00000  9.880455225970e-07
169001.00000  170001.00000  9.783588017872e-07
170001.00000  171001.00000  8.039978272113e-07
171001.00000  172001.00000  1.075226009885e-06
172001.00000  173001.00000  9.202384769286e-07
173001.00000  174001.00000  9.880455225970e-07
174001.00000  175001.00000  8.621181520699e-07
175001.00000  176001.00000  8.136845480211e-07
176001.00000  177001.00000  1.007418964217e-06
177001.00000  178001.00000  7.458775023527e-07
178001.00000  179001.00000  8.911783144993e-07
179001.00000  180001.00000  8.233712688309e-07
180001.00000  181001.00000  6.974438983038e-07
181001.00000  182001.00000  8.039978272113e-07
182001.00000  183001.00000  7.168173399233e-07
183001.00000  184001.00000  7.555642231624e-07
184001.00000  185001.00000  6.877571774940e-07
185001.00000  186001.00000  5.908899693963e-07
186001.00000  187001.00000  6.199501318256e-07
187001.00000  188001.00000  7.652509439722e-07
188001.00000  189001.00000  6.393235734451e-07
189001.00000  190001.00000  6.490102942549e-07
190001.00000  191001.00000  6.586970150647e-07
191001.00000  192001.00000  6.296368526354e-07
192001.00000  193001.00000  7.555642231624e-07
193001.00000  194001.00000  5.230829237278e-07
194001.00000  195001.00000  6.586970150647e-07
195001.00000  196001.00000  6.877571774940e-07
196001.00000  197001.00000  6.102634110158e-07
197001.00000  198001.00000  6.490102942549e-07
198001.00000  199001.00000  6.005766902060e-07
