300.00000  350.00000  8.606774094310e-01
350.00000  400.00000  6.441966513623e-01
400.00000  450.00000  5.003833681092e-01
450.00000  500.00000  3.996371767059e-01
500.00000  550.00000  3.270136628551e-01
550.00000  600.00000  2.720859798266e-01
600.00000  650.00000  2.302521087263e-01
650.00000  700.00000  1.971186524315e-01
700.00000  750.00000  1.705623734668e-01
750.00000  800.00000  1.494298749401e-01
800.00000  850.00000  1.312331204926e-01
850.00000  900.00000  1.161090061112e-01
900.00000  950.00000  1.041184601505e-01
950.00000  1000.00000  9.357476980332e-02
1000.00000  1050.00000  8.464259587631e-02
1050.00000  1100.00000  7.655686333296e-02
1100.00000  1150.00000  6.999588214771e-02
1150.00000  1200.00000  6.420074724398e-02
1200.00000  1250.00000  5.881321532090e-02
1250.00000  1300.00000  5.436043233358e-02
1300.00000  1350.00000  5.024931087972e-02
1350.00000  1400.00000  4.658319778884e-02
1400.00000  1450.00000  4.321825586909e-02
1450.00000  1500.00000  4.038585861943e-02
1500.00000  1550.00000  3.773239020896e-02
1550.00000  1600.00000  3.524666758523e-02
1600.00000  1650.00000  3.312535822234e-02
1650.00000  1700.00000  3.112783368140e-02
1700.00000  1750.00000  2.944112087404e-02
1750.00000  1800.00000  2.754385818264e-02
1800.00000  1850.00000  2.612553863407e-02
1850.00000  1900.00000  2.456106815866e-02
1900.00000  1950.00000  2.333980170670e-02
1950.00000  2000.00000  2.214244384963e-02
2000.00000  2050.00000  2.102028237971e-02
2050.00000  2100.00000  1.992627135217e-02
2100.00000  2150.00000  1.912301968831e-02
2150.00000  2200.00000  1.823030360486e-02
2200.00000  2250.00000  1.751690198310e-02
2250.00000  2300.00000  1.670208164429e-02
2300.00000  2350.00000  1.602955600734e-02
2350.00000  2400.00000  1.533736362298e-02
2400.00000  2450.00000  1.468527597843e-02
2450.00000  2500.00000  1.396956062168e-02
2500.00000  2550.00000  1.343971530908e-02
2550.00000  2600.00000  1.277991521457e-02
2600.00000  2650.00000  1.241318821873e-02
2650.00000  2700.00000  1.181663021393e-02
2700.00000  2750.00000  1.139668731334e-02
2750.00000  2800.00000  1.107584939479e-02
2800.00000  2850.00000  1.063932472677e-02
2850.00000  2900.00000  1.030730375578e-02
2900.00000  2950.00000  9.971812182297e-03
2950.00000  3000.00000  9.616268238909e-03
3000.00000  3050.00000  9.307770240308e-03
3050.00000  3100.00000  8.912892802098e-03
3100.00000  3150.00000  8.646042033307e-03
3150.00000  3200.00000  8.316334797302e-03
3200.00000  3250.00000  8.103856800765e-03
3250.00000  3300.00000  7.799986272142e-03
3300.00000  3350.00000  7.598305705557e-03
3350.00000  3400.00000  7.434416143800e-03
3400.00000  3450.00000  7.114349470250e-03
3450.00000  3500.00000  6.958557980957e-03
3500.00000  3550.00000  6.695563437149e-03
3550.00000  3600.00000  6.533987610381e-03
3600.00000  3650.00000  6.355444393691e-03
3650.00000  3700.00000  6.179986156986e-03
3700.00000  3750.00000  6.055815712549e-03
3750.00000  3800.00000  5.896167998272e-03
3800.00000  3850.00000  5.581885662197e-03
3850.00000  3900.00000  5.529826624933e-03
3900.00000  3950.00000  5.393316260552e-03
3950.00000  4000.00000  5.215158666359e-03
4000.00000  4050.00000  5.109112479340e-03
4050.00000  4100.00000  4.954863480039e-03
4100.00000  4150.00000  4.876196490396e-03
4150.00000  4200.00000  4.702666366183e-03
4200.00000  4250.00000  4.620528774055e-03
4250.00000  4300.00000  4.461266682277e-03
4300.00000  4350.00000  4.359076720240e-03
4350.00000  4400.00000  4.302004590499e-03
4400.00000  4450.00000  4.261128605684e-03
4450.00000  4500.00000  4.062147396586e-03
4500.00000  4550.00000  3.961499924542e-03
4550.00000  4600.00000  3.929878879686e-03
4600.00000  4650.00000  3.842342572583e-03
4650.00000  4700.00000  3.677681765829e-03
4700.00000  4750.00000  3.624465861070e-03
4750.00000  4800.00000  3.592459193715e-03
4800.00000  4850.00000  3.540400156451e-03
4850.00000  4900.00000  3.417772202007e-03
4900.00000  4950.00000  3.364170674750e-03
4950.00000  5000.00000  3.260823845219e-03
5000.00000  5050.00000  3.159790750677e-03
5050.00000  5100.00000  3.168274445638e-03
5100.00000  5150.00000  2.982404401481e-03
5150.00000  5200.00000  2.964665766561e-03
5200.00000  5250.00000  2.912221106799e-03
5250.00000  5300.00000  2.807717409773e-03
5300.00000  5350.00000  2.827384157183e-03
5350.00000  5400.00000  2.806174919780e-03
5400.00000  5450.00000  2.681233230346e-03
5450.00000  5500.00000  2.681618852844e-03
5500.00000  5550.00000  2.575958288323e-03
5550.00000  5600.00000  2.545108488463e-03
5600.00000  5650.00000  2.569788328351e-03
5650.00000  5700.00000  2.462585273837e-03
5700.00000  5750.00000  2.482252021248e-03
5750.00000  5800.00000  2.356539086818e-03
5800.00000  5850.00000  2.333016114424e-03
5850.00000  5900.00000  2.285584547139e-03
5900.00000  5950.00000  2.218100609945e-03
5950.00000  6000.00000  2.202675710015e-03
6000.00000  6050.00000  2.181852095110e-03
6050.00000  6100.00000  2.154472897734e-03
6100.00000  6150.00000  2.094701410505e-03
6150.00000  6200.00000  2.056524783178e-03
6200.00000  6250.00000  2.011406950882e-03
6250.00000  6300.00000  1.966674741085e-03
6300.00000  6350.00000  1.931583093744e-03
6350.00000  6400.00000  1.970916588566e-03
6400.00000  6450.00000  1.843661164143e-03
6450.00000  6500.00000  1.833634979188e-03
6500.00000  6550.00000  1.844818031637e-03
6550.00000  6600.00000  1.798157709349e-03
6600.00000  6650.00000  1.719105097207e-03
6650.00000  6700.00000  1.699823972295e-03
6700.00000  6750.00000  1.682856582372e-03
6750.00000  6800.00000  1.643908710048e-03
6800.00000  6850.00000  1.653163650006e-03
6850.00000  6900.00000  1.609588307704e-03
6900.00000  6950.00000  1.587222202805e-03
6950.00000  7000.00000  1.599947745247e-03
7000.00000  7050.00000  1.520895133106e-03
7050.00000  7100.00000  1.536705655534e-03
7100.00000  7150.00000  1.503542120684e-03
7150.00000  7200.00000  1.464594248361e-03
7200.00000  7250.00000  1.433744448501e-03
7250.00000  7300.00000  1.440300030971e-03
7300.00000  7350.00000  1.378600431251e-03
7350.00000  7400.00000  1.383999146226e-03
7400.00000  7450.00000  1.398652801160e-03
7450.00000  7500.00000  1.372816093777e-03
7500.00000  7550.00000  1.355463081356e-03
7550.00000  7600.00000  1.314587096541e-03
7600.00000  7650.00000  1.290678501649e-03
7650.00000  7700.00000  1.272554244231e-03
7700.00000  7750.00000  1.265998661761e-03
7750.00000  7800.00000  1.292606614141e-03
7800.00000  7850.00000  1.223580186953e-03
7850.00000  7900.00000  1.201985327051e-03
7900.00000  7950.00000  1.229364524427e-03
7950.00000  8000.00000  1.149926289787e-03
8000.00000  8050.00000  1.161494964735e-03
8050.00000  8100.00000  1.158024362251e-03
8100.00000  8150.00000  1.144527574812e-03
8150.00000  8200.00000  1.089383557562e-03
8200.00000  8250.00000  1.146841309801e-03
8250.00000  8300.00000  1.067788697660e-03
8300.00000  8350.00000  1.060847492691e-03
8350.00000  8400.00000  1.057762512705e-03
8400.00000  8450.00000  1.039252632789e-03
8450.00000  8500.00000  1.040409500284e-03
8500.00000  8550.00000  1.012259057911e-03
8550.00000  8600.00000  9.879648405215e-04
8600.00000  8650.00000  1.019971507876e-03
8650.00000  8700.00000  9.548013056719e-04
8700.00000  8750.00000  9.617425106404e-04
8750.00000  8800.00000  9.536444381771e-04
8800.00000  8850.00000  9.119972083659e-04
8850.00000  8900.00000  9.297358432855e-04
8900.00000  8950.00000  9.251083733064e-04
8950.00000  9000.00000  9.247227508082e-04
9000.00000  9050.00000  9.085266058816e-04
9050.00000  9100.00000  8.853892559865e-04
9100.00000  9150.00000  8.595525486036e-04
9150.00000  9200.00000  8.433564036770e-04
9200.00000  9250.00000  8.175196962942e-04
9250.00000  9300.00000  8.691931110599e-04
9300.00000  9350.00000  8.136634713116e-04
9350.00000  9400.00000  8.368008212068e-04
9400.00000  9450.00000  8.279315037470e-04
9450.00000  9500.00000  8.044085313536e-04
9500.00000  9550.00000  7.589050765599e-04
9550.00000  9600.00000  7.735587314934e-04
9600.00000  9650.00000  7.612188115494e-04
9650.00000  9700.00000  7.781862014725e-04
9700.00000  9750.00000  7.774149564759e-04
9750.00000  9800.00000  7.550488515773e-04
9800.00000  9850.00000  7.346108591700e-04
9850.00000  9900.00000  7.353821041665e-04
9900.00000  9950.00000  7.157153567556e-04
9950.00000  10000.00000  7.319115016822e-04
