300.00000  350.00000  8.048556479197e-07
350.00000  400.00000  7.243700831277e-06
400.00000  450.00000  1.609711295839e-06
450.00000  500.00000  5.633989535438e-06
500.00000  550.00000  8.853412127117e-05
550.00000  600.00000  6.438845183358e-06
600.00000  650.00000  2.736509202927e-05
650.00000  700.00000  5.633989535438e-06
700.00000  750.00000  2.173110249383e-05
750.00000  800.00000  1.046312342296e-05
800.00000  850.00000  6.519330748150e-05
850.00000  900.00000  1.368254601463e-05
900.00000  950.00000  1.287769036672e-05
950.00000  1000.00000  1.046312342296e-05
1000.00000  1050.00000  1.609711295839e-05
1050.00000  1100.00000  1.529225731047e-05
1100.00000  1150.00000  1.931653555007e-05
1150.00000  1200.00000  1.931653555007e-05
1200.00000  1250.00000  2.012139119799e-05
1250.00000  1300.00000  4.668162757934e-05
1300.00000  1350.00000  1.368254601463e-05
1350.00000  1400.00000  1.207283471880e-05
1400.00000  1450.00000  1.931653555007e-05
1450.00000  1500.00000  2.495052508551e-05
1500.00000  1550.00000  1.529225731047e-05
1550.00000  1600.00000  1.529225731047e-05
1600.00000  1650.00000  1.770682425423e-05
1650.00000  1700.00000  2.092624684591e-05
1700.00000  1750.00000  7.565643090445e-05
1750.00000  1800.00000  2.495052508551e-05
1800.00000  1850.00000  2.092624684591e-05
1850.00000  1900.00000  1.529225731047e-05
1900.00000  1950.00000  1.046312342296e-05
1950.00000  2000.00000  1.770682425423e-05
2000.00000  2050.00000  2.173110249383e-05
2050.00000  2100.00000  1.931653555007e-05
2100.00000  2150.00000  1.690196860631e-05
2150.00000  2200.00000  1.770682425423e-05
2200.00000  2250.00000  1.690196860631e-05
2250.00000  2300.00000  1.770682425423e-05
2300.00000  2350.00000  5.151076146686e-05
2350.00000  2400.00000  1.448740166255e-05
2400.00000  2450.00000  1.770682425423e-05
2450.00000  2500.00000  1.770682425423e-05
2500.00000  2550.00000  1.448740166255e-05
2550.00000  2600.00000  1.609711295839e-05
2600.00000  2650.00000  1.770682425423e-05
2650.00000  2700.00000  1.931653555007e-05
2700.00000  2750.00000  1.368254601463e-05
2750.00000  2800.00000  1.529225731047e-05
2800.00000  2850.00000  1.126797907088e-05
2850.00000  2900.00000  1.529225731047e-05
2900.00000  2950.00000  1.690196860631e-05
2950.00000  3000.00000  2.334081378967e-05
3000.00000  3050.00000  1.046312342296e-05
3050.00000  3100.00000  1.287769036672e-05
3100.00000  3150.00000  1.046312342296e-05
3150.00000  3200.00000  1.046312342296e-05
3200.00000  3250.00000  1.046312342296e-05
3250.00000  3300.00000  1.770682425423e-05
3300.00000  3350.00000  1.690196860631e-05
3350.00000  3400.00000  1.287769036672e-05
3400.00000  3450.00000  2.173110249383e-05
3450.00000  3500.00000  2.253595814175e-05
3500.00000  3550.00000  2.495052508551e-05
3550.00000  3600.00000  2.173110249383e-05
3600.00000  3650.00000  2.414566943759e-05
3650.00000  3700.00000  3.782821545223e-05
3700.00000  3750.00000  3.219422591679e-05
3750.00000  3800.00000  3.380393721263e-05
3800.00000  3850.00000  3.943792674807e-05
3850.00000  3900.00000  4.265734933974e-05
3900.00000  3950.00000  4.426706063558e-05
3950.00000  4000.00000  6.358359618566e-05
4000.00000  4050.00000  4.990105017102e-05
4050.00000  4100.00000  5.875446229814e-05
4100.00000  4150.00000  5.633989535438e-05
4150.00000  4200.00000  7.002244136901e-05
4200.00000  4250.00000  7.243700831277e-05
4250.00000  4300.00000  9.175354386285e-05
4300.00000  4350.00000  7.646128655237e-05
4350.00000  4400.00000  9.416811080660e-05
4400.00000  4450.00000  9.658267775036e-05
4450.00000  4500.00000  9.577782210244e-05
4500.00000  4550.00000  1.239477697796e-04
4550.00000  4600.00000  1.102652237650e-04
4600.00000  4650.00000  1.319963262588e-04
4650.00000  4700.00000  1.424594496818e-04
4700.00000  4750.00000  1.505080061610e-04
4750.00000  4800.00000  1.569468513443e-04
4800.00000  4850.00000  1.368254601463e-04
4850.00000  4900.00000  1.577517069923e-04
4900.00000  4950.00000  1.577517069923e-04
4950.00000  5000.00000  1.746536755986e-04
5000.00000  5050.00000  1.746536755986e-04
5050.00000  5100.00000  1.810925207819e-04
5100.00000  5150.00000  1.907507885570e-04
5150.00000  5200.00000  1.907507885570e-04
5200.00000  5250.00000  1.923604998528e-04
5250.00000  5300.00000  2.084576128112e-04
5300.00000  5350.00000  2.060430458674e-04
5350.00000  5400.00000  2.020187676278e-04
5400.00000  5450.00000  2.004090563320e-04
5450.00000  5500.00000  2.390421274321e-04
5500.00000  5550.00000  2.406518387280e-04
5550.00000  5600.00000  2.599683742781e-04
5600.00000  5650.00000  2.277741483613e-04
5650.00000  5700.00000  2.414566943759e-04
5700.00000  5750.00000  2.559440960385e-04
5750.00000  5800.00000  2.285790040092e-04
5800.00000  5850.00000  2.390421274321e-04
5850.00000  5900.00000  2.647975081656e-04
5900.00000  5950.00000  2.487003952072e-04
5950.00000  6000.00000  2.696266420531e-04
6000.00000  6050.00000  2.664072194614e-04
6050.00000  6100.00000  3.227471148158e-04
6100.00000  6150.00000  2.631877968697e-04
6150.00000  6200.00000  2.776751985323e-04
6200.00000  6250.00000  3.066500018574e-04
6250.00000  6300.00000  3.356248051825e-04
6300.00000  6350.00000  3.332102382388e-04
6350.00000  6400.00000  1.170260112075e-03
6400.00000  6450.00000  2.712363533489e-04
6450.00000  6500.00000  2.672120751093e-04
6500.00000  6550.00000  2.760654872365e-04
6550.00000  6600.00000  2.639926525177e-04
6600.00000  6650.00000  2.543343847426e-04
6650.00000  6700.00000  2.768703428844e-04
6700.00000  6750.00000  2.688217864052e-04
6750.00000  6800.00000  2.503101065030e-04
6800.00000  6850.00000  2.825043324198e-04
6850.00000  6900.00000  2.728460646448e-04
6900.00000  6950.00000  2.438712613197e-04
6950.00000  7000.00000  2.511149621509e-04
7000.00000  7050.00000  2.744557759406e-04
7050.00000  7100.00000  3.533316294367e-04
7100.00000  7150.00000  1.142895020046e-04
7150.00000  7200.00000  1.030215229337e-04
7200.00000  7250.00000  8.692440997533e-05
7250.00000  7300.00000  1.231429141317e-04
7300.00000  7350.00000  1.215332028359e-04
7350.00000  7400.00000  1.046312342296e-04
7400.00000  7450.00000  1.207283471880e-04
7450.00000  7500.00000  1.150943576525e-04
7500.00000  7550.00000  1.239477697796e-04
7550.00000  7600.00000  1.030215229337e-04
7600.00000  7650.00000  1.175089245963e-04
7650.00000  7700.00000  1.126797907088e-04
7700.00000  7750.00000  1.303866149630e-04
7750.00000  7800.00000  1.336060375547e-04
7800.00000  7850.00000  1.126797907088e-04
7850.00000  7900.00000  1.239477697796e-04
7900.00000  7950.00000  1.175089245963e-04
7950.00000  8000.00000  1.158992133004e-04
8000.00000  8050.00000  1.086555124692e-04
8050.00000  8100.00000  1.126797907088e-04
8100.00000  8150.00000  1.215332028359e-04
8150.00000  8200.00000  1.247526254276e-04
8200.00000  8250.00000  1.199234915400e-04
8250.00000  8300.00000  1.199234915400e-04
8300.00000  8350.00000  1.134846463567e-04
8350.00000  8400.00000  1.006069559900e-04
8400.00000  8450.00000  1.110700794129e-04
8450.00000  8500.00000  1.070458011733e-04
8500.00000  8550.00000  1.191186358921e-04
8550.00000  8600.00000  1.142895020046e-04
8600.00000  8650.00000  1.311914706109e-04
8650.00000  8700.00000  1.054360898775e-04
8700.00000  8750.00000  9.255839951076e-05
8750.00000  8800.00000  1.046312342296e-04
8800.00000  8850.00000  9.980210034204e-05
8850.00000  8900.00000  1.006069559900e-04
8900.00000  8950.00000  1.070458011733e-04
8950.00000  9000.00000  1.175089245963e-04
9000.00000  9050.00000  1.062409455254e-04
9050.00000  9100.00000  1.207283471880e-04
9100.00000  9150.00000  1.142895020046e-04
9150.00000  9200.00000  9.819238904620e-05
9200.00000  9250.00000  1.118749350608e-04
9250.00000  9300.00000  1.070458011733e-04
9300.00000  9350.00000  9.577782210244e-05
9350.00000  9400.00000  1.062409455254e-04
9400.00000  9450.00000  1.231429141317e-04
9450.00000  9500.00000  1.054360898775e-04
9500.00000  9550.00000  9.738753339828e-05
9550.00000  9600.00000  1.038263785816e-04
9600.00000  9650.00000  9.658267775036e-05
9650.00000  9700.00000  9.416811080660e-05
9700.00000  9750.00000  1.094603681171e-04
9750.00000  9800.00000  9.497296645452e-05
9800.00000  9850.00000  1.006069559900e-04
9850.00000  9900.00000  8.048556479197e-05
9900.00000  9950.00000  9.336325515868e-05
9950.00000  10000.00000  8.853412127117e-05
