10001.00000  11001.00000  1.982139920839e-04
11001.00000  12001.00000  1.656987640364e-04
12001.00000  13001.00000  1.374317567389e-04
13001.00000  14001.00000  1.203117902125e-04
14001.00000  15001.00000  9.939747267443e-05
15001.00000  16001.00000  8.941233843316e-05
16001.00000  17001.00000  7.833791682012e-05
17001.00000  18001.00000  6.800784157779e-05
18001.00000  19001.00000  6.156289129479e-05
19001.00000  20001.00000  5.568073948721e-05
20001.00000  21001.00000  4.938102752045e-05
21001.00000  22001.00000  4.487863971711e-05
22001.00000  23001.00000  4.121137223214e-05
23001.00000  24001.00000  3.543814916173e-05
24001.00000  25001.00000  3.404023036796e-05
25001.00000  26001.00000  3.118992841181e-05
26001.00000  27001.00000  2.866641266720e-05
27001.00000  28001.00000  2.556194365764e-05
28001.00000  29001.00000  2.441819191728e-05
29001.00000  30001.00000  2.302027312350e-05
30001.00000  31001.00000  2.053306695795e-05
31001.00000  32001.00000  1.953455353382e-05
32001.00000  33001.00000  1.804586079240e-05
33001.00000  34001.00000  1.708365694733e-05
34001.00000  35001.00000  1.481430825613e-05
35001.00000  36001.00000  1.517740404673e-05
36001.00000  37001.00000  1.417889062260e-05
37001.00000  38001.00000  1.345269904142e-05
38001.00000  39001.00000  1.285359098694e-05
39001.00000  40001.00000  1.192769672093e-05
40001.00000  41001.00000  1.076579019104e-05
41001.00000  42001.00000  1.022114650515e-05
42001.00000  43001.00000  9.349716607732e-06
43001.00000  44001.00000  9.277097449614e-06
44001.00000  45001.00000  9.258942660084e-06
45001.00000  46001.00000  8.006262182543e-06
46001.00000  47001.00000  8.060726551132e-06
47001.00000  48001.00000  7.334534969949e-06
48001.00000  49001.00000  7.171141864183e-06
49001.00000  50001.00000  6.808046073591e-06
50001.00000  51001.00000  6.426795493470e-06
51001.00000  52001.00000  6.063699702879e-06
52001.00000  53001.00000  5.065186278752e-06
53001.00000  54001.00000  6.081854492408e-06
54001.00000  55001.00000  5.627984754169e-06
55001.00000  56001.00000  4.829174014867e-06
56001.00000  57001.00000  5.101495857811e-06
57001.00000  58001.00000  4.175601591803e-06
58001.00000  59001.00000  5.283043753107e-06
59001.00000  60001.00000  4.593161750983e-06
60001.00000  61001.00000  4.357149487098e-06
61001.00000  62001.00000  4.284530328980e-06
62001.00000  63001.00000  3.903279748859e-06
63001.00000  64001.00000  4.030363275566e-06
64001.00000  65001.00000  3.376790852501e-06
65001.00000  66001.00000  3.267862115324e-06
66001.00000  67001.00000  3.449410010620e-06
67001.00000  68001.00000  3.013695061910e-06
68001.00000  69001.00000  3.086314220028e-06
69001.00000  70001.00000  3.140778588617e-06
70001.00000  71001.00000  2.850301956144e-06
71001.00000  72001.00000  2.723218429436e-06
72001.00000  73001.00000  2.414587007434e-06
73001.00000  74001.00000  2.886611535203e-06
74001.00000  75001.00000  2.414587007434e-06
75001.00000  76001.00000  2.741373218966e-06
76001.00000  77001.00000  2.450896586493e-06
77001.00000  78001.00000  2.051491216842e-06
78001.00000  79001.00000  2.559825323670e-06
79001.00000  80001.00000  2.178574743549e-06
80001.00000  81001.00000  2.015181637783e-06
81001.00000  82001.00000  2.015181637783e-06
82001.00000  83001.00000  1.779169373899e-06
83001.00000  84001.00000  2.015181637783e-06
84001.00000  85001.00000  1.579466689073e-06
85001.00000  86001.00000  1.579466689073e-06
86001.00000  87001.00000  1.561311899544e-06
87001.00000  88001.00000  1.779169373899e-06
88001.00000  89001.00000  1.325299635659e-06
89001.00000  90001.00000  1.561311899544e-06
90001.00000  91001.00000  1.761014584369e-06
91001.00000  92001.00000  1.706550215780e-06
92001.00000  93001.00000  1.452383162366e-06
93001.00000  94001.00000  1.343454425189e-06
94001.00000  95001.00000  1.325299635659e-06
95001.00000  96001.00000  1.198216108952e-06
96001.00000  97001.00000  1.161906529893e-06
97001.00000  98001.00000  1.089287371775e-06
98001.00000  99001.00000  1.198216108952e-06
99001.00000  100001.00000  1.016668213656e-06
100001.00000  101001.00000  9.985134241267e-07
101001.00000  102001.00000  1.125596950834e-06
102001.00000  103001.00000  9.622038450676e-07
103001.00000  104001.00000  1.125596950834e-06
104001.00000  105001.00000  1.016668213656e-06
105001.00000  106001.00000  9.258942660084e-07
106001.00000  107001.00000  1.180061319422e-06
107001.00000  108001.00000  8.351203183605e-07
108001.00000  109001.00000  1.034823003186e-06
109001.00000  110001.00000  8.351203183605e-07
110001.00000  111001.00000  7.625011602422e-07
111001.00000  112001.00000  7.261915811831e-07
112001.00000  113001.00000  7.080367916535e-07
113001.00000  114001.00000  1.016668213656e-06
114001.00000  115001.00000  7.988107393014e-07
115001.00000  116001.00000  3.812505801211e-07
116001.00000  117001.00000  6.535724230648e-07
117001.00000  118001.00000  9.077394764788e-07
118001.00000  119001.00000  7.443463707126e-07
119001.00000  120001.00000  7.080367916535e-07
120001.00000  121001.00000  7.080367916535e-07
121001.00000  122001.00000  6.172628440056e-07
122001.00000  123001.00000  8.714298974197e-07
123001.00000  124001.00000  4.357149487098e-07
124001.00000  125001.00000  5.809532649465e-07
125001.00000  126001.00000  5.264888963577e-07
126001.00000  127001.00000  6.172628440056e-07
127001.00000  128001.00000  5.809532649465e-07
128001.00000  129001.00000  5.809532649465e-07
129001.00000  130001.00000  5.446436858873e-07
130001.00000  131001.00000  4.357149487098e-07
131001.00000  132001.00000  6.717272125943e-07
132001.00000  133001.00000  3.630957905915e-07
133001.00000  134001.00000  5.991080544760e-07
134001.00000  135001.00000  5.446436858873e-07
135001.00000  136001.00000  5.083341068281e-07
136001.00000  137001.00000  4.720245277690e-07
137001.00000  138001.00000  4.538697382394e-07
138001.00000  139001.00000  5.991080544760e-07
139001.00000  140001.00000  4.357149487098e-07
140001.00000  141001.00000  5.809532649465e-07
141001.00000  142001.00000  5.264888963577e-07
142001.00000  143001.00000  3.086314220028e-07
143001.00000  144001.00000  3.449410010620e-07
144001.00000  145001.00000  4.901793172986e-07
145001.00000  146001.00000  2.904766324732e-07
146001.00000  147001.00000  3.086314220028e-07
147001.00000  148001.00000  3.449410010620e-07
148001.00000  149001.00000  3.449410010620e-07
149001.00000  150001.00000  4.357149487098e-07
150001.00000  151001.00000  3.449410010620e-07
151001.00000  152001.00000  4.357149487098e-07
152001.00000  153001.00000  4.175601591803e-07
153001.00000  154001.00000  3.630957905915e-07
154001.00000  155001.00000  3.086314220028e-07
155001.00000  156001.00000  2.904766324732e-07
156001.00000  157001.00000  2.904766324732e-07
157001.00000  158001.00000  2.723218429436e-07
158001.00000  159001.00000  3.812505801211e-07
159001.00000  160001.00000  1.633931057662e-07
160001.00000  161001.00000  2.541670534141e-07
161001.00000  162001.00000  3.630957905915e-07
162001.00000  163001.00000  3.812505801211e-07
163001.00000  164001.00000  2.541670534141e-07
164001.00000  165001.00000  2.178574743549e-07
165001.00000  166001.00000  3.630957905915e-07
166001.00000  167001.00000  3.630957905915e-07
167001.00000  168001.00000  1.815478952958e-07
168001.00000  169001.00000  2.904766324732e-07
169001.00000  170001.00000  2.360122638845e-07
170001.00000  171001.00000  2.723218429436e-07
171001.00000  172001.00000  2.723218429436e-07
172001.00000  173001.00000  2.360122638845e-07
173001.00000  174001.00000  1.633931057662e-07
174001.00000  175001.00000  1.452383162366e-07
175001.00000  176001.00000  2.723218429436e-07
176001.00000  177001.00000  2.723218429436e-07
177001.00000  178001.00000  2.541670534141e-07
178001.00000  179001.00000  3.086314220028e-07
179001.00000  180001.00000  3.449410010620e-07
180001.00000  181001.00000  1.452383162366e-07
181001.00000  182001.00000  2.723218429436e-07
182001.00000  183001.00000  2.178574743549e-07
183001.00000  184001.00000  1.633931057662e-07
184001.00000  185001.00000  2.723218429436e-07
185001.00000  186001.00000  1.815478952958e-07
186001.00000  187001.00000  1.452383162366e-07
187001.00000  188001.00000  1.452383162366e-07
188001.00000  189001.00000  1.452383162366e-07
189001.00000  190001.00000  1.633931057662e-07
190001.00000  191001.00000  9.077394764788e-08
191001.00000  192001.00000  1.089287371775e-07
192001.00000  193001.00000  1.633931057662e-07
193001.00000  194001.00000  1.633931057662e-07
194001.00000  195001.00000  1.815478952958e-07
195001.00000  196001.00000  7.261915811831e-08
196001.00000  197001.00000  2.178574743549e-07
197001.00000  198001.00000  1.997026848253e-07
198001.00000  199001.00000  1.452383162366e-07
