300.00000  350.00000  1.501622180876e-06
350.00000  400.00000  3.754055452190e-06
400.00000  450.00000  2.252433271314e-06
450.00000  500.00000  9.760544175695e-06
500.00000  550.00000  7.808435340556e-05
550.00000  600.00000  3.754055452190e-06
600.00000  650.00000  2.702919925577e-05
650.00000  700.00000  7.508110904381e-06
700.00000  750.00000  1.952108835139e-05
750.00000  800.00000  9.760544175695e-06
800.00000  850.00000  5.856326505417e-05
850.00000  900.00000  9.760544175695e-06
900.00000  950.00000  6.006488723505e-06
950.00000  1000.00000  9.760544175695e-06
1000.00000  1050.00000  1.276378853745e-05
1050.00000  1100.00000  1.801946617051e-05
1100.00000  1150.00000  1.276378853745e-05
1150.00000  1200.00000  9.760544175695e-06
1200.00000  1250.00000  1.426541071832e-05
1250.00000  1300.00000  4.730109869760e-05
1300.00000  1350.00000  1.576703289920e-05
1350.00000  1400.00000  1.351459962789e-05
1400.00000  1450.00000  1.576703289920e-05
1450.00000  1500.00000  2.702919925577e-05
1500.00000  1550.00000  1.801946617051e-05
1550.00000  1600.00000  1.426541071832e-05
1600.00000  1650.00000  1.877027726095e-05
1650.00000  1700.00000  1.201297744701e-05
1700.00000  1750.00000  6.532056486811e-05
1750.00000  1800.00000  1.276378853745e-05
1800.00000  1850.00000  2.177352162270e-05
1850.00000  1900.00000  1.801946617051e-05
1900.00000  1950.00000  2.027189944183e-05
1950.00000  2000.00000  1.651784398964e-05
2000.00000  2050.00000  2.252433271314e-05
2050.00000  2100.00000  1.426541071832e-05
2100.00000  2150.00000  1.426541071832e-05
2150.00000  2200.00000  1.952108835139e-05
2200.00000  2250.00000  1.952108835139e-05
2250.00000  2300.00000  1.501622180876e-05
2300.00000  2350.00000  4.579947651672e-05
2350.00000  2400.00000  1.351459962789e-05
2400.00000  2450.00000  1.501622180876e-05
2450.00000  2500.00000  1.351459962789e-05
2500.00000  2550.00000  1.351459962789e-05
2550.00000  2600.00000  1.051135526613e-05
2600.00000  2650.00000  1.726865508008e-05
2650.00000  2700.00000  1.651784398964e-05
2700.00000  2750.00000  9.760544175695e-06
2750.00000  2800.00000  9.009733085257e-06
2800.00000  2850.00000  1.576703289920e-05
2850.00000  2900.00000  9.009733085257e-06
2900.00000  2950.00000  1.501622180876e-05
2950.00000  3000.00000  1.801946617051e-05
3000.00000  3050.00000  1.426541071832e-05
3050.00000  3100.00000  1.651784398964e-05
3100.00000  3150.00000  1.351459962789e-05
3150.00000  3200.00000  1.351459962789e-05
3200.00000  3250.00000  1.877027726095e-05
3250.00000  3300.00000  1.126216635657e-05
3300.00000  3350.00000  1.576703289920e-05
3350.00000  3400.00000  1.726865508008e-05
3400.00000  3450.00000  1.576703289920e-05
3450.00000  3500.00000  1.801946617051e-05
3500.00000  3550.00000  2.027189944183e-05
3550.00000  3600.00000  1.576703289920e-05
3600.00000  3650.00000  1.877027726095e-05
3650.00000  3700.00000  3.979298779322e-05
3700.00000  3750.00000  2.627838816533e-05
3750.00000  3800.00000  3.528812125059e-05
3800.00000  3850.00000  3.528812125059e-05
3850.00000  3900.00000  4.279623215497e-05
3900.00000  3950.00000  4.054379888366e-05
3950.00000  4000.00000  5.405839851154e-05
4000.00000  4050.00000  4.955353196891e-05
4050.00000  4100.00000  5.781245396373e-05
4100.00000  4150.00000  6.306813159680e-05
4150.00000  4200.00000  7.282867577249e-05
4200.00000  4250.00000  6.231732050636e-05
4250.00000  4300.00000  8.484165321950e-05
4300.00000  4350.00000  8.934651976213e-05
4350.00000  4400.00000  9.159895303344e-05
4400.00000  4450.00000  9.009733085257e-05
4450.00000  4500.00000  1.073659859326e-04
4500.00000  4550.00000  1.238838299223e-04
4550.00000  4600.00000  1.118708524753e-04
4600.00000  4650.00000  1.313919408267e-04
4650.00000  4700.00000  1.389000517310e-04
4700.00000  4750.00000  1.434049182737e-04
4750.00000  4800.00000  1.696833064390e-04
4800.00000  4850.00000  1.786930395243e-04
4850.00000  4900.00000  1.629260066251e-04
4900.00000  4950.00000  2.109779164131e-04
4950.00000  5000.00000  1.854503393382e-04
5000.00000  5050.00000  1.884535837000e-04
5050.00000  5100.00000  2.139811607748e-04
5100.00000  5150.00000  2.304990047645e-04
5150.00000  5200.00000  2.214892716792e-04
5200.00000  5250.00000  2.252433271314e-04
5250.00000  5300.00000  2.410103600306e-04
5300.00000  5350.00000  2.365054934880e-04
5350.00000  5400.00000  2.778001034621e-04
5400.00000  5450.00000  2.635346927438e-04
5450.00000  5500.00000  2.838065921856e-04
5500.00000  5550.00000  3.213471467075e-04
5550.00000  5600.00000  3.160914690744e-04
5600.00000  5650.00000  3.033276805370e-04
5650.00000  5700.00000  2.710428036481e-04
5700.00000  5750.00000  3.281044465214e-04
5750.00000  5800.00000  3.168422801649e-04
5800.00000  5850.00000  3.168422801649e-04
5850.00000  5900.00000  3.138390358031e-04
5900.00000  5950.00000  3.641433788625e-04
5950.00000  6000.00000  2.860590254569e-04
6000.00000  6050.00000  3.438714794206e-04
6050.00000  6100.00000  3.611401345007e-04
6100.00000  6150.00000  3.408682350589e-04
6150.00000  6200.00000  3.468747237824e-04
6200.00000  6250.00000  4.114444775601e-04
6250.00000  6300.00000  4.452309766298e-04
6300.00000  6350.00000  4.617488206194e-04
6350.00000  6400.00000  1.293647508825e-03
6400.00000  6450.00000  3.731531119477e-04
6450.00000  6500.00000  3.739039230382e-04
6500.00000  6550.00000  3.626417566816e-04
6550.00000  6600.00000  3.889201448469e-04
6600.00000  6650.00000  3.220979577979e-04
6650.00000  6700.00000  3.874185226660e-04
6700.00000  6750.00000  3.326093130641e-04
6750.00000  6800.00000  4.144477219218e-04
6800.00000  6850.00000  3.656450010433e-04
6850.00000  6900.00000  3.821628450330e-04
6900.00000  6950.00000  3.656450010433e-04
6950.00000  7000.00000  3.829136561234e-04
7000.00000  7050.00000  3.784087895808e-04
7050.00000  7100.00000  5.098007304074e-04
7100.00000  7150.00000  1.576703289920e-04
7150.00000  7200.00000  1.764406062529e-04
7200.00000  7250.00000  1.576703289920e-04
7250.00000  7300.00000  1.441557293641e-04
7300.00000  7350.00000  1.576703289920e-04
7350.00000  7400.00000  1.636768177155e-04
7400.00000  7450.00000  1.561687068111e-04
7450.00000  7500.00000  2.087254831418e-04
7500.00000  7550.00000  1.779422284338e-04
7550.00000  7600.00000  1.524146513589e-04
7600.00000  7650.00000  1.704341175294e-04
7650.00000  7700.00000  1.771914173434e-04
7700.00000  7750.00000  1.862011504286e-04
7750.00000  7800.00000  1.989649389661e-04
7800.00000  7850.00000  1.786930395243e-04
7850.00000  7900.00000  2.019681833278e-04
7900.00000  7950.00000  1.786930395243e-04
7950.00000  8000.00000  1.734373618912e-04
8000.00000  8050.00000  1.929584502426e-04
8050.00000  8100.00000  2.102271053227e-04
8100.00000  8150.00000  2.004665611470e-04
8150.00000  8200.00000  1.952108835139e-04
8200.00000  8250.00000  2.064730498705e-04
8250.00000  8300.00000  2.004665611470e-04
8300.00000  8350.00000  1.967125056948e-04
8350.00000  8400.00000  1.696833064390e-04
8400.00000  8450.00000  1.846995282478e-04
8450.00000  8500.00000  1.899552058808e-04
8500.00000  8550.00000  1.959616946043e-04
8550.00000  8600.00000  2.012173722374e-04
8600.00000  8650.00000  1.831979060669e-04
8650.00000  8700.00000  1.892043947904e-04
8700.00000  8750.00000  2.282465714932e-04
8750.00000  8800.00000  2.057222387800e-04
8800.00000  8850.00000  1.974633167852e-04
8850.00000  8900.00000  2.079746720513e-04
8900.00000  8950.00000  1.929584502426e-04
8950.00000  9000.00000  2.049714276896e-04
9000.00000  9050.00000  1.794438506147e-04
9050.00000  9100.00000  1.929584502426e-04
9100.00000  9150.00000  1.884535837000e-04
9150.00000  9200.00000  1.839487171573e-04
9200.00000  9250.00000  1.771914173434e-04
9250.00000  9300.00000  1.674308731677e-04
9300.00000  9350.00000  2.117287275035e-04
9350.00000  9400.00000  1.824470949764e-04
9400.00000  9450.00000  2.229908938601e-04
9450.00000  9500.00000  2.117287275035e-04
9500.00000  9550.00000  2.072238609609e-04
9550.00000  9600.00000  2.004665611470e-04
9600.00000  9650.00000  2.139811607748e-04
9650.00000  9700.00000  1.982141278756e-04
9700.00000  9750.00000  2.072238609609e-04
9750.00000  9800.00000  1.877027726095e-04
9800.00000  9850.00000  1.899552058808e-04
9850.00000  9900.00000  1.764406062529e-04
9900.00000  9950.00000  2.199876494984e-04
9950.00000  10000.00000  2.214892716792e-04
