10001.00000  11001.00000  5.344655255970e-04
11001.00000  12001.00000  4.527472654390e-04
12001.00000  13001.00000  3.795143008132e-04
13001.00000  14001.00000  3.303139991176e-04
14001.00000  15001.00000  2.869327005152e-04
15001.00000  16001.00000  2.527573170231e-04
16001.00000  17001.00000  2.250314787552e-04
17001.00000  18001.00000  1.959364632889e-04
18001.00000  19001.00000  1.775066175787e-04
19001.00000  20001.00000  1.544287755896e-04
20001.00000  21001.00000  1.426286299980e-04
21001.00000  22001.00000  1.308645153853e-04
22001.00000  23001.00000  1.188481839203e-04
23001.00000  24001.00000  1.064895581557e-04
24001.00000  25001.00000  9.786013870775e-05
25001.00000  26001.00000  9.297794106603e-05
26001.00000  27001.00000  8.371797948728e-05
27001.00000  28001.00000  7.921410712407e-05
28001.00000  29001.00000  7.074682708125e-05
29001.00000  30001.00000  6.901734009378e-05
30001.00000  31001.00000  6.217145410170e-05
31001.00000  32001.00000  5.856835621114e-05
32001.00000  33001.00000  5.496525832057e-05
33001.00000  34001.00000  5.229896588155e-05
34001.00000  35001.00000  4.757890764491e-05
35001.00000  36001.00000  4.730867530312e-05
36001.00000  37001.00000  4.262464804539e-05
37001.00000  38001.00000  4.031866539542e-05
38001.00000  39001.00000  3.833696155561e-05
39001.00000  40001.00000  3.561662264824e-05
40001.00000  41001.00000  3.442760034435e-05
41001.00000  42001.00000  3.176130790533e-05
42001.00000  43001.00000  3.069839402761e-05
43001.00000  44001.00000  2.904096899795e-05
44001.00000  45001.00000  2.772583826790e-05
45001.00000  46001.00000  2.617650617496e-05
46001.00000  47001.00000  2.480732897654e-05
47001.00000  48001.00000  2.406869390898e-05
48001.00000  49001.00000  2.307784198907e-05
49001.00000  50001.00000  2.127629304379e-05
50001.00000  51001.00000  2.093399874418e-05
51001.00000  52001.00000  1.983505388756e-05
52001.00000  53001.00000  1.889824843601e-05
53001.00000  54001.00000  1.859198511532e-05
54001.00000  55001.00000  1.772724162158e-05
55001.00000  56001.00000  1.675440519113e-05
56001.00000  57001.00000  1.688051361730e-05
57001.00000  58001.00000  1.608783208137e-05
58001.00000  59001.00000  1.520507309818e-05
59001.00000  60001.00000  1.407009726266e-05
60001.00000  61001.00000  1.448445352007e-05
61001.00000  62001.00000  1.414215922047e-05
62001.00000  63001.00000  1.306122985330e-05
63001.00000  64001.00000  1.295313691658e-05
64001.00000  65001.00000  1.262885810643e-05
65001.00000  66001.00000  1.221450184902e-05
66001.00000  67001.00000  1.205236244394e-05
67001.00000  68001.00000  9.926534688507e-06
68001.00000  69001.00000  1.050303035100e-05
69001.00000  70001.00000  1.053906132990e-05
70001.00000  71001.00000  1.008867409358e-05
71001.00000  72001.00000  8.989729236960e-06
72001.00000  73001.00000  9.746379793979e-06
73001.00000  74001.00000  9.133853152583e-06
74001.00000  75001.00000  8.683465916262e-06
75001.00000  76001.00000  8.359187106111e-06
76001.00000  77001.00000  8.215063190488e-06
77001.00000  78001.00000  8.052923785413e-06
78001.00000  79001.00000  7.620552038545e-06
79001.00000  80001.00000  7.476428122923e-06
80001.00000  81001.00000  7.692613996357e-06
81001.00000  82001.00000  6.809855013168e-06
82001.00000  83001.00000  6.503591692470e-06
83001.00000  84001.00000  6.755808544810e-06
84001.00000  85001.00000  6.179312882319e-06
85001.00000  86001.00000  7.008025397149e-06
86001.00000  87001.00000  6.107250924508e-06
87001.00000  88001.00000  5.602817219829e-06
88001.00000  89001.00000  6.143281903414e-06
89001.00000  90001.00000  5.530755262017e-06
90001.00000  91001.00000  5.494724283112e-06
91001.00000  92001.00000  5.458693304206e-06
92001.00000  93001.00000  4.936244110074e-06
93001.00000  94001.00000  5.296553899131e-06
94001.00000  95001.00000  5.278538409678e-06
95001.00000  96001.00000  4.918228620621e-06
96001.00000  97001.00000  4.828151173357e-06
97001.00000  98001.00000  4.810135683904e-06
98001.00000  99001.00000  4.179593553056e-06
99001.00000  100001.00000  4.287686489773e-06
100001.00000  101001.00000  4.395779426489e-06
101001.00000  102001.00000  4.161578063603e-06
102001.00000  103001.00000  3.837299253452e-06
103001.00000  104001.00000  3.927376700716e-06
104001.00000  105001.00000  4.143562574150e-06
105001.00000  106001.00000  3.999438658527e-06
106001.00000  107001.00000  3.513020443301e-06
107001.00000  108001.00000  3.693175337829e-06
108001.00000  109001.00000  3.458973974943e-06
109001.00000  110001.00000  3.729206316735e-06
110001.00000  111001.00000  3.585082401112e-06
111001.00000  112001.00000  2.918509291358e-06
112001.00000  113001.00000  3.008586738622e-06
113001.00000  114001.00000  3.531035932754e-06
114001.00000  115001.00000  3.368896527678e-06
115001.00000  116001.00000  2.810416354641e-06
116001.00000  117001.00000  2.792400865188e-06
117001.00000  118001.00000  2.576214991754e-06
118001.00000  119001.00000  2.828431844094e-06
119001.00000  120001.00000  3.116679675339e-06
120001.00000  121001.00000  3.062633206980e-06
121001.00000  122001.00000  2.666292439018e-06
122001.00000  123001.00000  2.396060097226e-06
123001.00000  124001.00000  2.684307928471e-06
124001.00000  125001.00000  2.305982649962e-06
125001.00000  126001.00000  2.342013628867e-06
126001.00000  127001.00000  2.378044607773e-06
127001.00000  128001.00000  2.558199502301e-06
128001.00000  129001.00000  2.233920692150e-06
129001.00000  130001.00000  2.017734818716e-06
130001.00000  131001.00000  2.197889713245e-06
131001.00000  132001.00000  2.089796776528e-06
132001.00000  133001.00000  2.053765797622e-06
133001.00000  134001.00000  2.468122055037e-06
134001.00000  135001.00000  1.981703839811e-06
135001.00000  136001.00000  2.143843244886e-06
136001.00000  137001.00000  2.161858734339e-06
137001.00000  138001.00000  2.017734818716e-06
138001.00000  139001.00000  1.765517966377e-06
139001.00000  140001.00000  2.071781287075e-06
140001.00000  141001.00000  1.873610903094e-06
141001.00000  142001.00000  1.603378561301e-06
142001.00000  143001.00000  1.621394050754e-06
143001.00000  144001.00000  1.945672860905e-06
144001.00000  145001.00000  1.711471498018e-06
145001.00000  146001.00000  1.549332092943e-06
146001.00000  147001.00000  1.585363071849e-06
147001.00000  148001.00000  1.495285624585e-06
148001.00000  149001.00000  1.441239156226e-06
149001.00000  150001.00000  1.531316603490e-06
150001.00000  151001.00000  1.765517966377e-06
151001.00000  152001.00000  1.711471498018e-06
152001.00000  153001.00000  1.657425029660e-06
153001.00000  154001.00000  1.171006814434e-06
154001.00000  155001.00000  1.459254645679e-06
155001.00000  156001.00000  1.459254645679e-06
156001.00000  157001.00000  1.495285624585e-06
157001.00000  158001.00000  1.567347582396e-06
158001.00000  159001.00000  1.387192687868e-06
159001.00000  160001.00000  1.459254645679e-06
160001.00000  161001.00000  1.369177198415e-06
161001.00000  162001.00000  1.441239156226e-06
162001.00000  163001.00000  1.459254645679e-06
163001.00000  164001.00000  1.261084261698e-06
164001.00000  165001.00000  1.134975835528e-06
165001.00000  166001.00000  1.567347582396e-06
166001.00000  167001.00000  1.297115240603e-06
167001.00000  168001.00000  1.369177198415e-06
168001.00000  169001.00000  1.008867409358e-06
169001.00000  170001.00000  1.225053282792e-06
170001.00000  171001.00000  1.333146219509e-06
171001.00000  172001.00000  1.098944856622e-06
172001.00000  173001.00000  1.080929367170e-06
173001.00000  174001.00000  8.827589831885e-07
174001.00000  175001.00000  1.098944856622e-06
175001.00000  176001.00000  1.261084261698e-06
176001.00000  177001.00000  1.134975835528e-06
177001.00000  178001.00000  1.080929367170e-06
178001.00000  179001.00000  9.728364304526e-07
179001.00000  180001.00000  1.116960346075e-06
180001.00000  181001.00000  1.152991324981e-06
181001.00000  182001.00000  7.926815359243e-07
182001.00000  183001.00000  1.044898388264e-06
183001.00000  184001.00000  9.548209409998e-07
184001.00000  185001.00000  7.206195781130e-07
185001.00000  186001.00000  9.007744726413e-07
186001.00000  187001.00000  8.467280042828e-07
187001.00000  188001.00000  6.845885992074e-07
188001.00000  189001.00000  8.467280042828e-07
189001.00000  190001.00000  8.647434937356e-07
190001.00000  191001.00000  6.305421308489e-07
191001.00000  192001.00000  8.827589831885e-07
192001.00000  193001.00000  9.187899620941e-07
193001.00000  194001.00000  7.206195781130e-07
194001.00000  195001.00000  8.287125148300e-07
195001.00000  196001.00000  7.026040886602e-07
196001.00000  197001.00000  9.548209409998e-07
197001.00000  198001.00000  5.945111519432e-07
198001.00000  199001.00000  6.845885992074e-07
