300.00000  350.00000  6.007290202928e-06
350.00000  400.00000  3.754556376830e-06
400.00000  450.00000  3.003645101464e-06
450.00000  500.00000  3.754556376830e-06
500.00000  550.00000  1.351640295659e-05
550.00000  600.00000  2.252733826098e-06
600.00000  650.00000  3.754556376830e-06
650.00000  700.00000  3.754556376830e-06
700.00000  750.00000  3.754556376830e-06
750.00000  800.00000  2.252733826098e-06
800.00000  850.00000  1.051275785512e-05
850.00000  900.00000  2.252733826098e-06
900.00000  950.00000  1.501822550732e-06
950.00000  1000.00000  1.501822550732e-06
1000.00000  1050.00000  7.509112753660e-07
1050.00000  1100.00000  0.000000000000e+00
1100.00000  1150.00000  3.003645101464e-06
1150.00000  1200.00000  7.509112753660e-07
1200.00000  1250.00000  3.003645101464e-06
1250.00000  1300.00000  8.260024029026e-06
1300.00000  1350.00000  7.509112753660e-07
1350.00000  1400.00000  2.252733826098e-06
1400.00000  1450.00000  3.754556376830e-06
1450.00000  1500.00000  2.252733826098e-06
1500.00000  1550.00000  3.003645101464e-06
1550.00000  1600.00000  3.003645101464e-06
1600.00000  1650.00000  4.505467652196e-06
1650.00000  1700.00000  2.252733826098e-06
1700.00000  1750.00000  2.327824953634e-05
1750.00000  1800.00000  5.256378927562e-06
1800.00000  1850.00000  4.505467652196e-06
1850.00000  1900.00000  7.509112753660e-07
1900.00000  1950.00000  4.505467652196e-06
1950.00000  2000.00000  3.754556376830e-06
2000.00000  2050.00000  4.505467652196e-06
2050.00000  2100.00000  3.754556376830e-06
2100.00000  2150.00000  2.252733826098e-06
2150.00000  2200.00000  3.754556376830e-06
2200.00000  2250.00000  3.754556376830e-06
2250.00000  2300.00000  8.260024029026e-06
2300.00000  2350.00000  3.379100739147e-05
2350.00000  2400.00000  6.007290202928e-06
2400.00000  2450.00000  6.007290202928e-06
2450.00000  2500.00000  9.010935304392e-06
2500.00000  2550.00000  1.051275785512e-05
2550.00000  2600.00000  7.509112753660e-06
2600.00000  2650.00000  6.007290202928e-06
2650.00000  2700.00000  8.260024029026e-06
2700.00000  2750.00000  3.754556376830e-06
2750.00000  2800.00000  7.509112753660e-06
2800.00000  2850.00000  6.758201478294e-06
2850.00000  2900.00000  6.758201478294e-06
2900.00000  2950.00000  8.260024029026e-06
2950.00000  3000.00000  2.478007208708e-05
3000.00000  3050.00000  7.509112753660e-06
3050.00000  3100.00000  9.761846579757e-06
3100.00000  3150.00000  9.761846579757e-06
3150.00000  3200.00000  1.051275785512e-05
3200.00000  3250.00000  1.802187060878e-05
3250.00000  3300.00000  1.051275785512e-05
3300.00000  3350.00000  1.201458040586e-05
3350.00000  3400.00000  1.051275785512e-05
3400.00000  3450.00000  1.426731423195e-05
3450.00000  3500.00000  9.010935304392e-06
3500.00000  3550.00000  1.652004805805e-05
3550.00000  3600.00000  1.051275785512e-05
3600.00000  3650.00000  2.102551571025e-05
3650.00000  3700.00000  2.628189463781e-05
3700.00000  3750.00000  1.501822550732e-05
3750.00000  3800.00000  2.177642698561e-05
3800.00000  3850.00000  2.177642698561e-05
3850.00000  3900.00000  2.553098336244e-05
3900.00000  3950.00000  2.177642698561e-05
3950.00000  4000.00000  2.928553973927e-05
4000.00000  4050.00000  3.003645101464e-05
4050.00000  4100.00000  4.205103142049e-05
4100.00000  4150.00000  3.304009611610e-05
4150.00000  4200.00000  4.505467652196e-05
4200.00000  4250.00000  5.331470055098e-05
4250.00000  4300.00000  3.304009611610e-05
4300.00000  4350.00000  4.880923289879e-05
4350.00000  4400.00000  4.730741034806e-05
4400.00000  4450.00000  5.782016820318e-05
4450.00000  4500.00000  5.782016820318e-05
4500.00000  4550.00000  6.157472458001e-05
4550.00000  4600.00000  4.880923289879e-05
4600.00000  4650.00000  7.208748243513e-05
4650.00000  4700.00000  6.608019223220e-05
4700.00000  4750.00000  7.509112753660e-05
4750.00000  4800.00000  8.184932901489e-05
4800.00000  4850.00000  7.434021626123e-05
4850.00000  4900.00000  9.536573197148e-05
4900.00000  4950.00000  9.987119962367e-05
4950.00000  5000.00000  9.836937707294e-05
5000.00000  5050.00000  1.036257560005e-04
5050.00000  5100.00000  1.073803123773e-04
5100.00000  5150.00000  1.096330462034e-04
5150.00000  5200.00000  1.156403364064e-04
5200.00000  5250.00000  1.231494491600e-04
5250.00000  5300.00000  1.201458040586e-04
5300.00000  5350.00000  1.216476266093e-04
5350.00000  5400.00000  1.269040055368e-04
5400.00000  5450.00000  1.366658521166e-04
5450.00000  5500.00000  1.118857800295e-04
5500.00000  5550.00000  1.359149408412e-04
5550.00000  5600.00000  1.449258761456e-04
5600.00000  5650.00000  1.644495693051e-04
5650.00000  5700.00000  1.569404565515e-04
5700.00000  5750.00000  1.576913678269e-04
5750.00000  5800.00000  1.441749648703e-04
5800.00000  5850.00000  1.629477467544e-04
5850.00000  5900.00000  1.576913678269e-04
5900.00000  5950.00000  1.591931903776e-04
5950.00000  6000.00000  1.877278188415e-04
6000.00000  6050.00000  1.652004805805e-04
6050.00000  6100.00000  1.426731423195e-04
6100.00000  6150.00000  1.757132384356e-04
6150.00000  6200.00000  1.944860203198e-04
6200.00000  6250.00000  2.049987781749e-04
6250.00000  6300.00000  1.787168835371e-04
6300.00000  6350.00000  1.937351090444e-04
6350.00000  6400.00000  5.346488280606e-04
6400.00000  6450.00000  1.516840776239e-04
6450.00000  6500.00000  1.719586820588e-04
6500.00000  6550.00000  1.712077707834e-04
6550.00000  6600.00000  1.929841977691e-04
6600.00000  6650.00000  1.839732624647e-04
6650.00000  6700.00000  2.072515120010e-04
6700.00000  6750.00000  1.982405766966e-04
6750.00000  6800.00000  2.132588022039e-04
6800.00000  6850.00000  2.177642698561e-04
6850.00000  6900.00000  2.200170036822e-04
6900.00000  6950.00000  1.862259962908e-04
6950.00000  7000.00000  1.877278188415e-04
7000.00000  7050.00000  1.997423992473e-04
7050.00000  7100.00000  2.380388742910e-04
7100.00000  7150.00000  8.184932901489e-05
7150.00000  7200.00000  6.532928095684e-05
7200.00000  7250.00000  7.959659518879e-05
7250.00000  7300.00000  9.311299814538e-05
7300.00000  7350.00000  8.335115156562e-05
7350.00000  7400.00000  8.710570794245e-05
7400.00000  7450.00000  9.987119962367e-05
7450.00000  7500.00000  9.311299814538e-05
7500.00000  7550.00000  1.028748447251e-04
7550.00000  7600.00000  9.912028834831e-05
7600.00000  7650.00000  9.536573197148e-05
7650.00000  7700.00000  9.161117559465e-05
7700.00000  7750.00000  8.710570794245e-05
7750.00000  7800.00000  8.335115156562e-05
7800.00000  7850.00000  9.536573197148e-05
7850.00000  7900.00000  1.021239334498e-04
7900.00000  7950.00000  9.987119962367e-05
7950.00000  8000.00000  9.311299814538e-05
8000.00000  8050.00000  8.635479666709e-05
8050.00000  8100.00000  9.987119962367e-05
8100.00000  8150.00000  9.686755452221e-05
8150.00000  8200.00000  7.659295008733e-05
8200.00000  8250.00000  1.058784898266e-04
8250.00000  8300.00000  1.051275785512e-04
8300.00000  8350.00000  1.118857800295e-04
8350.00000  8400.00000  1.036257560005e-04
8400.00000  8450.00000  9.611664324684e-05
8450.00000  8500.00000  8.935844176855e-05
8500.00000  8550.00000  1.028748447251e-04
8550.00000  8600.00000  9.836937707294e-05
8600.00000  8650.00000  9.536573197148e-05
8650.00000  8700.00000  9.987119962367e-05
8700.00000  8750.00000  1.148894251310e-04
8750.00000  8800.00000  1.103839574788e-04
8800.00000  8850.00000  1.066294011020e-04
8850.00000  8900.00000  1.171421589571e-04
8900.00000  8950.00000  9.311299814538e-05
8950.00000  9000.00000  1.103839574788e-04
9000.00000  9050.00000  1.043766672759e-04
9050.00000  9100.00000  9.836937707294e-05
9100.00000  9150.00000  1.118857800295e-04
9150.00000  9200.00000  1.081312236527e-04
9200.00000  9250.00000  1.163912476817e-04
9250.00000  9300.00000  1.141385138556e-04
9300.00000  9350.00000  9.761846579757e-05
9350.00000  9400.00000  9.686755452221e-05
9400.00000  9450.00000  1.006221108990e-04
9450.00000  9500.00000  1.058784898266e-04
9500.00000  9550.00000  1.216476266093e-04
9550.00000  9600.00000  1.186439815078e-04
9600.00000  9650.00000  1.036257560005e-04
9650.00000  9700.00000  1.269040055368e-04
9700.00000  9750.00000  9.386390942075e-05
9750.00000  9800.00000  1.088821349281e-04
9800.00000  9850.00000  1.103839574788e-04
9850.00000  9900.00000  9.536573197148e-05
9900.00000  9950.00000  1.088821349281e-04
9950.00000  10000.00000  1.246512717107e-04
