300.00000  350.00000  0.000000000000e+00
350.00000  400.00000  0.000000000000e+00
400.00000  450.00000  0.000000000000e+00
450.00000  500.00000  0.000000000000e+00
500.00000  550.00000  2.718604362543e-06
550.00000  600.00000  0.000000000000e+00
600.00000  650.00000  5.825580776877e-07
650.00000  700.00000  0.000000000000e+00
700.00000  750.00000  5.825580776877e-07
750.00000  800.00000  0.000000000000e+00
800.00000  850.00000  5.631394750981e-06
850.00000  900.00000  0.000000000000e+00
900.00000  950.00000  1.941860258959e-07
950.00000  1000.00000  1.941860258959e-07
1000.00000  1050.00000  1.359302181271e-06
1050.00000  1100.00000  1.941860258959e-07
1100.00000  1150.00000  9.709301294795e-07
1150.00000  1200.00000  1.941860258959e-06
1200.00000  1250.00000  6.019766802773e-06
1250.00000  1300.00000  2.835115978080e-05
1300.00000  1350.00000  1.068023142427e-05
1350.00000  1400.00000  2.291395105572e-05
1400.00000  1450.00000  4.272092569710e-05
1450.00000  1500.00000  7.612092215120e-05
1500.00000  1550.00000  1.062197561651e-04
1550.00000  1600.00000  1.664174241928e-04
1600.00000  1650.00000  2.237023018321e-04
1650.00000  1700.00000  3.000174100092e-04
1700.00000  1750.00000  4.510941381562e-04
1750.00000  1800.00000  5.046894813035e-04
1800.00000  1850.00000  6.095499352872e-04
1850.00000  1900.00000  6.124627256757e-04
1900.00000  1950.00000  7.516941062431e-04
1950.00000  2000.00000  8.889836265515e-04
2000.00000  2050.00000  1.011515008892e-03
2050.00000  2100.00000  1.179680107318e-03
2100.00000  2150.00000  1.322601022377e-03
2150.00000  2200.00000  1.464162635255e-03
2200.00000  2250.00000  1.581645180922e-03
2250.00000  2300.00000  1.762043998979e-03
2300.00000  2350.00000  2.027496296379e-03
2350.00000  2400.00000  2.011573042256e-03
2400.00000  2450.00000  2.141677679606e-03
2450.00000  2500.00000  2.142842795761e-03
2500.00000  2550.00000  2.124200937275e-03
2550.00000  2600.00000  2.225760228819e-03
2600.00000  2650.00000  2.310036964058e-03
2650.00000  2700.00000  2.453346251169e-03
2700.00000  2750.00000  2.524418336647e-03
2750.00000  2800.00000  2.630638092812e-03
2800.00000  2850.00000  2.687340412373e-03
2850.00000  2900.00000  2.769092729276e-03
2900.00000  2950.00000  2.785404355451e-03
2950.00000  3000.00000  2.889876437383e-03
3000.00000  3050.00000  2.928519456536e-03
3050.00000  3100.00000  2.941335734245e-03
3100.00000  3150.00000  2.996290379574e-03
3150.00000  3200.00000  3.009106657283e-03
3200.00000  3250.00000  3.015708982163e-03
3250.00000  3300.00000  3.028719445898e-03
3300.00000  3350.00000  3.003863634584e-03
3350.00000  3400.00000  3.060177582094e-03
3400.00000  3450.00000  3.029302003976e-03
3450.00000  3500.00000  3.079013626605e-03
3500.00000  3550.00000  3.071634557621e-03
3550.00000  3600.00000  3.086392695590e-03
3600.00000  3650.00000  3.055517117472e-03
3650.00000  3700.00000  3.126783388976e-03
3700.00000  3750.00000  3.122705482432e-03
3750.00000  3800.00000  3.121928738328e-03
3800.00000  3850.00000  3.051633396954e-03
3850.00000  3900.00000  3.052021769006e-03
3900.00000  3950.00000  3.077460138398e-03
3950.00000  4000.00000  3.019398516655e-03
4000.00000  4050.00000  3.041729909633e-03
4050.00000  4100.00000  2.955705500162e-03
4100.00000  4150.00000  2.954540384006e-03
4150.00000  4200.00000  2.971240382233e-03
4200.00000  4250.00000  2.938617129883e-03
4250.00000  4300.00000  2.844631093349e-03
4300.00000  4350.00000  2.851039232204e-03
4350.00000  4400.00000  2.863272951835e-03
4400.00000  4450.00000  2.834727606028e-03
4450.00000  4500.00000  2.804046213937e-03
4500.00000  4550.00000  2.781132262881e-03
4550.00000  4600.00000  2.802298539704e-03
4600.00000  4650.00000  2.723264827164e-03
4650.00000  4700.00000  2.728507849863e-03
4700.00000  4750.00000  2.667145065680e-03
4750.00000  4800.00000  2.656464834256e-03
4800.00000  4850.00000  2.629084604605e-03
4850.00000  4900.00000  2.616850884973e-03
4900.00000  4950.00000  2.575489261457e-03
4950.00000  5000.00000  2.544807869366e-03
5000.00000  5050.00000  2.545584613469e-03
5050.00000  5100.00000  2.522088104336e-03
5100.00000  5150.00000  2.464997412723e-03
5150.00000  5200.00000  2.443248577822e-03
5200.00000  5250.00000  2.480920666846e-03
5250.00000  5300.00000  2.466745086956e-03
5300.00000  5350.00000  2.374312538629e-03
5350.00000  5400.00000  2.361302074894e-03
5400.00000  5450.00000  2.354699750014e-03
5450.00000  5500.00000  2.337611379735e-03
5500.00000  5550.00000  2.325183474078e-03
5550.00000  5600.00000  2.265374178102e-03
5600.00000  5650.00000  2.256247434885e-03
5650.00000  5700.00000  2.218381159835e-03
5700.00000  5750.00000  2.209060230592e-03
5750.00000  5800.00000  2.211973020980e-03
5800.00000  5850.00000  2.164591630662e-03
5850.00000  5900.00000  2.161873026299e-03
5900.00000  5950.00000  2.168669537205e-03
5950.00000  6000.00000  2.113714891877e-03
6000.00000  6050.00000  2.082450941708e-03
6050.00000  6100.00000  2.062838153092e-03
6100.00000  6150.00000  2.001863740961e-03
6150.00000  6200.00000  1.999145136598e-03
6200.00000  6250.00000  1.982250952345e-03
6250.00000  6300.00000  2.026525366250e-03
6300.00000  6350.00000  1.949433513969e-03
6350.00000  6400.00000  2.798997377264e-03
6400.00000  6450.00000  1.923995144577e-03
6450.00000  6500.00000  1.889430031967e-03
6500.00000  6550.00000  1.895061426718e-03
6550.00000  6600.00000  1.833504456509e-03
6600.00000  6650.00000  1.818163760463e-03
6650.00000  6700.00000  1.805347482754e-03
6700.00000  6750.00000  1.797774227744e-03
6750.00000  6800.00000  1.783792833880e-03
6800.00000  6850.00000  1.777773067077e-03
6850.00000  6900.00000  1.734469583302e-03
6900.00000  6950.00000  1.720876561490e-03
6950.00000  7000.00000  1.665921916161e-03
7000.00000  7050.00000  1.675437031430e-03
7050.00000  7100.00000  1.755635860125e-03
7100.00000  7150.00000  1.509213793263e-03
7150.00000  7200.00000  1.512709141729e-03
7200.00000  7250.00000  1.501057980175e-03
7250.00000  7300.00000  1.502805654408e-03
7300.00000  7350.00000  1.466298681540e-03
7350.00000  7400.00000  1.419111477247e-03
7400.00000  7450.00000  1.432316127008e-03
7450.00000  7500.00000  1.450569613442e-03
7500.00000  7550.00000  1.431345196879e-03
7550.00000  7600.00000  1.416198686859e-03
7600.00000  7650.00000  1.412314966341e-03
7650.00000  7700.00000  1.356583576909e-03
7700.00000  7750.00000  1.362409157686e-03
7750.00000  7800.00000  1.348816135873e-03
7800.00000  7850.00000  1.339301020604e-03
7850.00000  7900.00000  1.362797529737e-03
7900.00000  7950.00000  1.322795208403e-03
7950.00000  8000.00000  1.319882418014e-03
8000.00000  8050.00000  1.302405675684e-03
8050.00000  8100.00000  1.304735907995e-03
8100.00000  8150.00000  1.289006839897e-03
8150.00000  8200.00000  1.273083585774e-03
8200.00000  8250.00000  1.261626610246e-03
8250.00000  8300.00000  1.264733586660e-03
8300.00000  8350.00000  1.244149867915e-03
8350.00000  8400.00000  1.224537079300e-03
8400.00000  8450.00000  1.242596379708e-03
8450.00000  8500.00000  1.213662661849e-03
8500.00000  8550.00000  1.198516151830e-03
8550.00000  8600.00000  1.175408014748e-03
8600.00000  8650.00000  1.207642895047e-03
8650.00000  8700.00000  1.183758013861e-03
8700.00000  8750.00000  1.152688249718e-03
8750.00000  8800.00000  1.147251040993e-03
8800.00000  8850.00000  1.149581273304e-03
8850.00000  8900.00000  1.137347553672e-03
8900.00000  8950.00000  1.115792904798e-03
8950.00000  9000.00000  1.097345232338e-03
9000.00000  9050.00000  1.117346393005e-03
9050.00000  9100.00000  1.108996393892e-03
9100.00000  9150.00000  1.080256862059e-03
9150.00000  9200.00000  1.088606861172e-03
9200.00000  9250.00000  1.048992911890e-03
9250.00000  9300.00000  1.090548721431e-03
9300.00000  9350.00000  1.062391747677e-03
9350.00000  9400.00000  1.020059194031e-03
9400.00000  9450.00000  1.005495242089e-03
9450.00000  9500.00000  1.034040587896e-03
9500.00000  9550.00000  1.016175473513e-03
9550.00000  9600.00000  1.022777798394e-03
9600.00000  9650.00000  1.016563845565e-03
9650.00000  9700.00000  1.008408032477e-03
9700.00000  9750.00000  9.963684988719e-04
9750.00000  9800.00000  1.002970823752e-03
9800.00000  9850.00000  9.786975705154e-04
9850.00000  9900.00000  9.619975722883e-04
9900.00000  9950.00000  9.573371076668e-04
9950.00000  10000.00000  9.732603617903e-04
