300.00000  350.00000  7.361284286913e-01
350.00000  400.00000  5.521520416060e-01
400.00000  450.00000  4.298022513999e-01
450.00000  500.00000  3.437207472043e-01
500.00000  550.00000  2.813570968890e-01
550.00000  600.00000  2.339912417746e-01
600.00000  650.00000  1.978572600785e-01
650.00000  700.00000  1.698949577833e-01
700.00000  750.00000  1.471809656421e-01
750.00000  800.00000  1.283819622705e-01
800.00000  850.00000  1.132559838634e-01
850.00000  900.00000  1.007084322547e-01
900.00000  950.00000  8.991439810270e-02
950.00000  1000.00000  8.083319404151e-02
1000.00000  1050.00000  7.323869913415e-02
1050.00000  1100.00000  6.666246857336e-02
1100.00000  1150.00000  6.076172030189e-02
1150.00000  1200.00000  5.567723980754e-02
1200.00000  1250.00000  5.126752147213e-02
1250.00000  1300.00000  4.745083049839e-02
1300.00000  1350.00000  4.392651245585e-02
1350.00000  1400.00000  4.055882276930e-02
1400.00000  1450.00000  3.778163998813e-02
1450.00000  1500.00000  3.532851587454e-02
1500.00000  1550.00000  3.327290372652e-02
1550.00000  1600.00000  3.094580242809e-02
1600.00000  1650.00000  2.896256338250e-02
1650.00000  1700.00000  2.751330100804e-02
1700.00000  1750.00000  2.587068362858e-02
1750.00000  1800.00000  2.435516925986e-02
1800.00000  1850.00000  2.297719979227e-02
1850.00000  1900.00000  2.179546585115e-02
1900.00000  1950.00000  2.084165317291e-02
1950.00000  2000.00000  1.958970652048e-02
2000.00000  2050.00000  1.875327509294e-02
2050.00000  2100.00000  1.773285035524e-02
2100.00000  2150.00000  1.699831737539e-02
2150.00000  2200.00000  1.624002009325e-02
2200.00000  2250.00000  1.543563446728e-02
2250.00000  2300.00000  1.474178885347e-02
2300.00000  2350.00000  1.404938350040e-02
2350.00000  2400.00000  1.354529223972e-02
2400.00000  2450.00000  1.309989160439e-02
2450.00000  2500.00000  1.248382007080e-02
2500.00000  2550.00000  1.194804307373e-02
2550.00000  2600.00000  1.150228237321e-02
2600.00000  2650.00000  1.102735639261e-02
2650.00000  2700.00000  1.062480351444e-02
2700.00000  2750.00000  1.025753702451e-02
2750.00000  2800.00000  9.934198487302e-03
2800.00000  2850.00000  9.499599807556e-03
2850.00000  2900.00000  9.210107397850e-03
2900.00000  2950.00000  8.879207491731e-03
2950.00000  3000.00000  8.717538223126e-03
3000.00000  3050.00000  8.314985344953e-03
3050.00000  3100.00000  8.082023169481e-03
3100.00000  3150.00000  7.788209977540e-03
3150.00000  3200.00000  7.525362391613e-03
3200.00000  3250.00000  7.315084322871e-03
3250.00000  3300.00000  7.128930621605e-03
3300.00000  3350.00000  6.933775290684e-03
3350.00000  3400.00000  6.758783610190e-03
3400.00000  3450.00000  6.540224042166e-03
3450.00000  3500.00000  6.318783952652e-03
3500.00000  3550.00000  6.005167175470e-03
3550.00000  3600.00000  5.933874268602e-03
3600.00000  3650.00000  5.762483239970e-03
3650.00000  3700.00000  5.582810712056e-03
3700.00000  3750.00000  5.440224898320e-03
3750.00000  3800.00000  5.373972904059e-03
3800.00000  3850.00000  5.177017247206e-03
3850.00000  3900.00000  5.070077886904e-03
3900.00000  3950.00000  4.979701525168e-03
3950.00000  4000.00000  4.788506911295e-03
4000.00000  4050.00000  4.718294199986e-03
4050.00000  4100.00000  4.586870407022e-03
4100.00000  4150.00000  4.427361529535e-03
4150.00000  4200.00000  4.374792012349e-03
4200.00000  4250.00000  4.201960722972e-03
4250.00000  4300.00000  4.179996746614e-03
4300.00000  4350.00000  4.084219407085e-03
4350.00000  4400.00000  3.924710529597e-03
4400.00000  4450.00000  3.852337427171e-03
4450.00000  4500.00000  3.814530582620e-03
4500.00000  4550.00000  3.696789266732e-03
4550.00000  4600.00000  3.608213230926e-03
4600.00000  4650.00000  3.587329450126e-03
4650.00000  4700.00000  3.462386830514e-03
4700.00000  4750.00000  3.420979334101e-03
4750.00000  4800.00000  3.347526036116e-03
4800.00000  4850.00000  3.281634107041e-03
4850.00000  4900.00000  3.175054811926e-03
4900.00000  4950.00000  3.055513170107e-03
4950.00000  5000.00000  3.041830693031e-03
5000.00000  5050.00000  2.998622870687e-03
5050.00000  5100.00000  2.947133549060e-03
5100.00000  5150.00000  2.906446183019e-03
5150.00000  5200.00000  2.839834123572e-03
5200.00000  5250.00000  2.787624671573e-03
5250.00000  5300.00000  2.724613263987e-03
5300.00000  5350.00000  2.669883355685e-03
5350.00000  5400.00000  2.607952143658e-03
5400.00000  5450.00000  2.510734543384e-03
5450.00000  5500.00000  2.549261518307e-03
5500.00000  5550.00000  2.459605286943e-03
5550.00000  5600.00000  2.418557855716e-03
5600.00000  5650.00000  2.375350033372e-03
5650.00000  5700.00000  2.321340255442e-03
5700.00000  5750.00000  2.307657778366e-03
5750.00000  5800.00000  2.214040829954e-03
5800.00000  5850.00000  2.186315810616e-03
5850.00000  5900.00000  2.192076853595e-03
5900.00000  5950.00000  2.153549878672e-03
5950.00000  6000.00000  2.096659579252e-03
6000.00000  6050.00000  2.070374820659e-03
6050.00000  6100.00000  2.022126085708e-03
6100.00000  6150.00000  2.000522174536e-03
6150.00000  6200.00000  1.982158850040e-03
6200.00000  6250.00000  1.951193244026e-03
6250.00000  6300.00000  1.925268550620e-03
6300.00000  6350.00000  1.934630245461e-03
6350.00000  6400.00000  2.186675875802e-03
6400.00000  6450.00000  1.864417534152e-03
6450.00000  6500.00000  1.813648342897e-03
6500.00000  6550.00000  1.798165539891e-03
6550.00000  6600.00000  1.790244105794e-03
6600.00000  6650.00000  1.686545332168e-03
6650.00000  6700.00000  1.694106701078e-03
6700.00000  6750.00000  1.685825201796e-03
6750.00000  6800.00000  1.653419335038e-03
6800.00000  6850.00000  1.644777770569e-03
6850.00000  6900.00000  1.621733598652e-03
6900.00000  6950.00000  1.592928383756e-03
6950.00000  7000.00000  1.531717302102e-03
7000.00000  7050.00000  1.499671500530e-03
7050.00000  7100.00000  1.563042973301e-03
7100.00000  7150.00000  1.447462048530e-03
7150.00000  7200.00000  1.477347458985e-03
7200.00000  7250.00000  1.455743547813e-03
7250.00000  7300.00000  1.417936703262e-03
7300.00000  7350.00000  1.403534095814e-03
7350.00000  7400.00000  1.369327903125e-03
7400.00000  7450.00000  1.352044774187e-03
7450.00000  7500.00000  1.321439233360e-03
7500.00000  7550.00000  1.339802557856e-03
7550.00000  7600.00000  1.277151215457e-03
7600.00000  7650.00000  1.255907369471e-03
7650.00000  7700.00000  1.325399950408e-03
7700.00000  7750.00000  1.273910628781e-03
7750.00000  7800.00000  1.222781372341e-03
7800.00000  7850.00000  1.218100524920e-03
7850.00000  7900.00000  1.195056353003e-03
7900.00000  7950.00000  1.194336222631e-03
7950.00000  8000.00000  1.187494984093e-03
8000.00000  8050.00000  1.152208595845e-03
8050.00000  8100.00000  1.155809247707e-03
8100.00000  8150.00000  1.147527748424e-03
8150.00000  8200.00000  1.146447552866e-03
8200.00000  8250.00000  1.074074450439e-03
8250.00000  8300.00000  1.054630930384e-03
8300.00000  8350.00000  1.082355949722e-03
8350.00000  8400.00000  1.058591647433e-03
8400.00000  8450.00000  1.084876406025e-03
8450.00000  8500.00000  1.016464020647e-03
8500.00000  8550.00000  1.004941934689e-03
8550.00000  8600.00000  1.004581869502e-03
8600.00000  8650.00000  1.012863368785e-03
8650.00000  8700.00000  9.991808917094e-04
8700.00000  8750.00000  9.700156116271e-04
8750.00000  8800.00000  1.000261087268e-03
8800.00000  8850.00000  9.516522871308e-04
8850.00000  8900.00000  9.412103967309e-04
8900.00000  8950.00000  9.368896144965e-04
8950.00000  9000.00000  9.044837477384e-04
9000.00000  9050.00000  9.185262900002e-04
9050.00000  9100.00000  8.915214010351e-04
9100.00000  9150.00000  9.170860292554e-04
9150.00000  9200.00000  8.785590543319e-04
9200.00000  9250.00000  8.454330572013e-04
9250.00000  9300.00000  8.727980113526e-04
9300.00000  9350.00000  8.249093415878e-04
9350.00000  9400.00000  8.479535135047e-04
9400.00000  9450.00000  8.357112971739e-04
9450.00000  9500.00000  8.198684289810e-04
9500.00000  9550.00000  7.899830185263e-04
9550.00000  9600.00000  7.817015192436e-04
9600.00000  9650.00000  8.123070600708e-04
9650.00000  9700.00000  8.022252348571e-04
9700.00000  9750.00000  7.784609325678e-04
9750.00000  9800.00000  7.564969562095e-04
9800.00000  9850.00000  7.629781295612e-04
9850.00000  9900.00000  7.345329798512e-04
9900.00000  9950.00000  7.266115457548e-04
9950.00000  10000.00000  7.269716109410e-04
