10001.00000  11001.00000  6.204854609039e-05
11001.00000  12001.00000  5.339771980938e-05
12001.00000  13001.00000  4.710293977123e-05
13001.00000  14001.00000  4.221099642729e-05
14001.00000  15001.00000  3.834420297528e-05
15001.00000  16001.00000  3.424360340757e-05
16001.00000  17001.00000  3.104225813102e-05
17001.00000  18001.00000  2.789486811194e-05
18001.00000  19001.00000  2.728337519395e-05
19001.00000  20001.00000  2.372232820093e-05
20001.00000  21001.00000  2.109650567073e-05
21001.00000  22001.00000  1.956777337575e-05
22001.00000  23001.00000  1.830881736812e-05
23001.00000  24001.00000  1.755344376354e-05
24001.00000  25001.00000  1.499956157663e-05
25001.00000  26001.00000  1.462187477434e-05
26001.00000  27001.00000  1.388448625559e-05
27001.00000  28001.00000  1.190612681503e-05
28001.00000  29001.00000  1.111478303880e-05
29001.00000  30001.00000  1.077306640816e-05
30001.00000  31001.00000  8.740751710124e-06
31001.00000  32001.00000  8.578885937715e-06
32001.00000  33001.00000  8.363064907835e-06
33001.00000  34001.00000  7.517765874140e-06
34001.00000  35001.00000  7.697616732373e-06
35001.00000  36001.00000  6.906272956148e-06
36001.00000  37001.00000  6.762392269561e-06
37001.00000  38001.00000  6.060973922453e-06
38001.00000  39001.00000  5.683287120163e-06
39001.00000  40001.00000  5.827167806750e-06
40001.00000  41001.00000  4.658137228235e-06
41001.00000  42001.00000  4.855973172291e-06
42001.00000  43001.00000  3.992689052773e-06
43001.00000  44001.00000  4.010674138596e-06
44001.00000  45001.00000  3.579032078837e-06
45001.00000  46001.00000  3.830823280363e-06
46001.00000  47001.00000  3.363211048957e-06
47001.00000  48001.00000  3.435151392251e-06
48001.00000  49001.00000  3.039479504138e-06
49001.00000  50001.00000  2.571867272732e-06
50001.00000  51001.00000  2.967539160845e-06
51001.00000  52001.00000  2.427986586146e-06
52001.00000  53001.00000  2.571867272732e-06
53001.00000  54001.00000  2.553882186909e-06
54001.00000  55001.00000  2.320076071206e-06
55001.00000  56001.00000  1.960374354740e-06
56001.00000  57001.00000  2.248135727913e-06
57001.00000  58001.00000  2.122240127150e-06
58001.00000  59001.00000  1.708583153214e-06
59001.00000  60001.00000  1.636642809920e-06
60001.00000  61001.00000  1.672612981567e-06
61001.00000  62001.00000  1.762538410684e-06
62001.00000  63001.00000  1.978359440563e-06
63001.00000  64001.00000  1.258956007631e-06
64001.00000  65001.00000  1.600672638274e-06
65001.00000  66001.00000  1.546717380804e-06
66001.00000  67001.00000  1.079105149398e-06
67001.00000  68001.00000  1.133060406868e-06
68001.00000  69001.00000  1.115075321045e-06
69001.00000  70001.00000  1.169030578515e-06
70001.00000  71001.00000  1.205000750161e-06
71001.00000  72001.00000  9.532095486350e-07
72001.00000  73001.00000  9.352244628117e-07
73001.00000  74001.00000  9.711946344583e-07
74001.00000  75001.00000  1.007164806105e-06
75001.00000  76001.00000  9.532095486350e-07
76001.00000  77001.00000  7.733586904020e-07
77001.00000  78001.00000  7.373885187554e-07
78001.00000  79001.00000  8.273139478719e-07
79001.00000  80001.00000  9.711946344583e-07
80001.00000  81001.00000  8.632841195185e-07
81001.00000  82001.00000  6.654481754622e-07
82001.00000  83001.00000  6.834332612855e-07
83001.00000  84001.00000  6.294780038156e-07
84001.00000  85001.00000  5.035824030524e-07
85001.00000  86001.00000  7.194034329321e-07
86001.00000  87001.00000  6.114929179922e-07
87001.00000  88001.00000  8.273139478719e-07
88001.00000  89001.00000  6.834332612855e-07
89001.00000  90001.00000  5.755227463456e-07
90001.00000  91001.00000  8.273139478719e-07
91001.00000  92001.00000  5.755227463456e-07
92001.00000  93001.00000  7.553736045787e-07
93001.00000  94001.00000  6.114929179922e-07
94001.00000  95001.00000  5.035824030524e-07
95001.00000  96001.00000  5.035824030524e-07
96001.00000  97001.00000  5.935078321689e-07
97001.00000  98001.00000  4.676122314058e-07
98001.00000  99001.00000  5.215674888757e-07
99001.00000  100001.00000  4.136569739359e-07
100001.00000  101001.00000  3.597017164660e-07
101001.00000  102001.00000  6.114929179922e-07
102001.00000  103001.00000  5.035824030524e-07
103001.00000  104001.00000  3.237315448194e-07
104001.00000  105001.00000  3.057464589961e-07
105001.00000  106001.00000  4.316420597592e-07
106001.00000  107001.00000  3.237315448194e-07
107001.00000  108001.00000  4.136569739359e-07
108001.00000  109001.00000  2.517912015262e-07
109001.00000  110001.00000  4.136569739359e-07
110001.00000  111001.00000  4.316420597592e-07
111001.00000  112001.00000  2.877613731728e-07
112001.00000  113001.00000  1.978359440563e-07
113001.00000  114001.00000  2.697762873495e-07
114001.00000  115001.00000  1.978359440563e-07
115001.00000  116001.00000  3.597017164660e-07
116001.00000  117001.00000  3.237315448194e-07
117001.00000  118001.00000  3.417166306427e-07
118001.00000  119001.00000  1.978359440563e-07
119001.00000  120001.00000  4.136569739359e-07
120001.00000  121001.00000  3.057464589961e-07
121001.00000  122001.00000  2.697762873495e-07
122001.00000  123001.00000  2.338061157029e-07
123001.00000  124001.00000  2.877613731728e-07
124001.00000  125001.00000  2.517912015262e-07
125001.00000  126001.00000  1.978359440563e-07
126001.00000  127001.00000  1.798508582330e-07
127001.00000  128001.00000  2.517912015262e-07
128001.00000  129001.00000  2.158210298796e-07
129001.00000  130001.00000  1.978359440563e-07
130001.00000  131001.00000  1.258956007631e-07
131001.00000  132001.00000  2.158210298796e-07
132001.00000  133001.00000  2.517912015262e-07
133001.00000  134001.00000  1.978359440563e-07
134001.00000  135001.00000  1.798508582330e-07
135001.00000  136001.00000  1.258956007631e-07
136001.00000  137001.00000  1.618657724097e-07
137001.00000  138001.00000  1.798508582330e-07
138001.00000  139001.00000  1.079105149398e-07
139001.00000  140001.00000  1.438806865864e-07
140001.00000  141001.00000  1.438806865864e-07
141001.00000  142001.00000  1.618657724097e-07
142001.00000  143001.00000  2.158210298796e-07
143001.00000  144001.00000  1.798508582330e-07
144001.00000  145001.00000  1.438806865864e-07
145001.00000  146001.00000  1.258956007631e-07
146001.00000  147001.00000  1.618657724097e-07
147001.00000  148001.00000  1.079105149398e-07
148001.00000  149001.00000  8.992542911651e-08
149001.00000  150001.00000  1.618657724097e-07
150001.00000  151001.00000  7.194034329321e-08
151001.00000  152001.00000  2.338061157029e-07
152001.00000  153001.00000  1.258956007631e-07
153001.00000  154001.00000  8.992542911651e-08
154001.00000  155001.00000  7.194034329321e-08
155001.00000  156001.00000  1.798508582330e-07
156001.00000  157001.00000  7.194034329321e-08
157001.00000  158001.00000  1.079105149398e-07
158001.00000  159001.00000  1.258956007631e-07
159001.00000  160001.00000  1.978359440563e-07
160001.00000  161001.00000  7.194034329321e-08
161001.00000  162001.00000  1.798508582330e-07
162001.00000  163001.00000  8.992542911651e-08
163001.00000  164001.00000  8.992542911651e-08
164001.00000  165001.00000  1.258956007631e-07
165001.00000  166001.00000  1.258956007631e-07
166001.00000  167001.00000  1.798508582330e-08
167001.00000  168001.00000  1.079105149398e-07
168001.00000  169001.00000  1.079105149398e-07
169001.00000  170001.00000  1.079105149398e-07
170001.00000  171001.00000  8.992542911651e-08
171001.00000  172001.00000  3.597017164660e-08
172001.00000  173001.00000  3.597017164660e-08
173001.00000  174001.00000  8.992542911651e-08
174001.00000  175001.00000  7.194034329321e-08
175001.00000  176001.00000  7.194034329321e-08
176001.00000  177001.00000  1.258956007631e-07
177001.00000  178001.00000  5.395525746990e-08
178001.00000  179001.00000  5.395525746990e-08
179001.00000  180001.00000  7.194034329321e-08
180001.00000  181001.00000  7.194034329321e-08
181001.00000  182001.00000  5.395525746990e-08
182001.00000  183001.00000  5.395525746990e-08
183001.00000  184001.00000  8.992542911651e-08
184001.00000  185001.00000  3.597017164660e-08
185001.00000  186001.00000  5.395525746990e-08
186001.00000  187001.00000  1.258956007631e-07
187001.00000  188001.00000  1.258956007631e-07
188001.00000  189001.00000  1.798508582330e-08
189001.00000  190001.00000  3.597017164660e-08
190001.00000  191001.00000  3.597017164660e-08
191001.00000  192001.00000  8.992542911651e-08
192001.00000  193001.00000  1.798508582330e-08
193001.00000  194001.00000  3.597017164660e-08
194001.00000  195001.00000  7.194034329321e-08
195001.00000  196001.00000  3.597017164660e-08
196001.00000  197001.00000  3.597017164660e-08
197001.00000  198001.00000  8.992542911651e-08
198001.00000  199001.00000  1.798508582330e-08
