300.00000  350.00000  8.040989787722e-07
350.00000  400.00000  6.432791830178e-06
400.00000  450.00000  8.040989787722e-07
450.00000  500.00000  4.020494893861e-06
500.00000  550.00000  4.905003770511e-05
550.00000  600.00000  1.608197957544e-06
600.00000  650.00000  1.286558366036e-05
650.00000  700.00000  4.824593872633e-06
700.00000  750.00000  1.045328672404e-05
750.00000  800.00000  4.020494893861e-06
800.00000  850.00000  4.181314689616e-05
850.00000  900.00000  4.824593872633e-06
900.00000  950.00000  4.824593872633e-06
950.00000  1000.00000  4.824593872633e-06
1000.00000  1050.00000  4.824593872633e-06
1050.00000  1100.00000  7.236890808950e-06
1100.00000  1150.00000  7.236890808950e-06
1150.00000  1200.00000  4.020494893861e-06
1200.00000  1250.00000  1.608197957544e-05
1250.00000  1300.00000  4.502954281124e-05
1300.00000  1350.00000  1.929837549053e-05
1350.00000  1400.00000  3.055576119334e-05
1400.00000  1450.00000  3.940084995984e-05
1450.00000  1500.00000  6.674021523809e-05
1500.00000  1550.00000  8.764678868617e-05
1550.00000  1600.00000  1.214189457946e-04
1600.00000  1650.00000  2.098698334595e-04
1650.00000  1700.00000  2.621362670797e-04
1700.00000  1750.00000  3.538035506598e-04
1750.00000  1800.00000  4.108945781526e-04
1800.00000  1850.00000  4.366257454733e-04
1850.00000  1900.00000  4.615528138153e-04
1900.00000  1950.00000  5.491996025014e-04
1950.00000  2000.00000  6.834841319564e-04
2000.00000  2050.00000  7.896251971543e-04
2050.00000  2100.00000  8.732514909466e-04
2100.00000  2150.00000  9.432081020998e-04
2150.00000  2200.00000  1.052565563213e-03
2200.00000  2250.00000  1.070255740746e-03
2250.00000  2300.00000  1.190870587562e-03
2300.00000  2350.00000  1.258414901779e-03
2350.00000  2400.00000  1.321938721102e-03
2400.00000  2450.00000  1.305052642547e-03
2450.00000  2500.00000  1.265651792587e-03
2500.00000  2550.00000  1.229467338543e-03
2550.00000  2600.00000  1.219014051819e-03
2600.00000  2650.00000  1.297815751738e-03
2650.00000  2700.00000  1.277713277269e-03
2700.00000  2750.00000  1.321938721102e-03
2750.00000  2800.00000  1.284950168078e-03
2800.00000  2850.00000  1.284146069099e-03
2850.00000  2900.00000  1.344453492507e-03
2900.00000  2950.00000  1.248765714033e-03
2950.00000  3000.00000  1.288970662972e-03
3000.00000  3050.00000  1.234291932415e-03
3050.00000  3100.00000  1.247157516076e-03
3100.00000  3150.00000  1.194891082456e-03
3150.00000  3200.00000  1.219014051819e-03
3200.00000  3250.00000  1.087945918279e-03
3250.00000  3300.00000  1.140212351899e-03
3300.00000  3350.00000  1.106440194791e-03
3350.00000  3400.00000  1.128954966196e-03
3400.00000  3450.00000  1.023617999977e-03
3450.00000  3500.00000  1.015577010189e-03
3500.00000  3550.00000  9.633105765691e-04
3550.00000  3600.00000  9.818048530809e-04
3600.00000  3650.00000  9.214974296730e-04
3650.00000  3700.00000  9.608982796328e-04
3700.00000  3750.00000  8.829006786919e-04
3750.00000  3800.00000  8.764678868617e-04
3800.00000  3850.00000  8.547572144349e-04
3850.00000  3900.00000  7.542448420883e-04
3900.00000  3950.00000  7.502243471945e-04
3950.00000  4000.00000  7.397710604704e-04
4000.00000  4050.00000  7.293177737464e-04
4050.00000  4100.00000  6.746390431899e-04
4100.00000  4150.00000  6.481037768904e-04
4150.00000  4200.00000  6.440832819965e-04
4200.00000  4250.00000  6.352381932300e-04
4250.00000  4300.00000  6.127234218244e-04
4300.00000  4350.00000  6.022701351004e-04
4350.00000  4400.00000  5.789512647160e-04
4400.00000  4450.00000  5.347258208835e-04
4450.00000  4500.00000  5.435709096500e-04
4500.00000  4550.00000  5.001495647963e-04
4550.00000  4600.00000  4.663774076879e-04
4600.00000  4650.00000  4.687897046242e-04
4650.00000  4700.00000  4.639651107516e-04
4700.00000  4750.00000  4.261724587493e-04
4750.00000  4800.00000  4.309970526219e-04
4800.00000  4850.00000  3.747101241079e-04
4850.00000  4900.00000  3.562158475961e-04
4900.00000  4950.00000  3.682773322777e-04
4950.00000  5000.00000  3.795347179805e-04
5000.00000  5050.00000  3.489789567871e-04
5050.00000  5100.00000  3.449584618933e-04
5100.00000  5150.00000  3.538035506598e-04
5150.00000  5200.00000  3.071658098910e-04
5200.00000  5250.00000  2.999289190820e-04
5250.00000  5300.00000  3.168149976363e-04
5300.00000  5350.00000  2.926920282731e-04
5350.00000  5400.00000  3.007330180608e-04
5400.00000  5450.00000  2.669608609524e-04
5450.00000  5500.00000  2.766100486976e-04
5500.00000  5550.00000  2.693731578887e-04
5550.00000  5600.00000  2.323846048652e-04
5600.00000  5650.00000  2.452501885255e-04
5650.00000  5700.00000  2.428378915892e-04
5700.00000  5750.00000  2.235395160987e-04
5750.00000  5800.00000  1.929837549053e-04
5800.00000  5850.00000  2.098698334595e-04
5850.00000  5900.00000  1.978083487780e-04
5900.00000  5950.00000  2.307764069076e-04
5950.00000  6000.00000  2.163026252897e-04
6000.00000  6050.00000  1.801181712450e-04
6050.00000  6100.00000  1.865509630752e-04
6100.00000  6150.00000  1.744894783936e-04
6150.00000  6200.00000  1.825304681813e-04
6200.00000  6250.00000  1.728812804360e-04
6250.00000  6300.00000  1.672525875846e-04
6300.00000  6350.00000  1.455419151578e-04
6350.00000  6400.00000  3.369174721056e-04
6400.00000  6450.00000  1.511706080092e-04
6450.00000  6500.00000  1.656443896271e-04
6500.00000  6550.00000  1.559952018818e-04
6550.00000  6600.00000  1.511706080092e-04
6600.00000  6650.00000  1.286558366036e-04
6650.00000  6700.00000  1.326763314974e-04
6700.00000  6750.00000  1.294599355823e-04
6750.00000  6800.00000  1.262435396672e-04
6800.00000  6850.00000  1.190066488583e-04
6850.00000  6900.00000  1.133779560069e-04
6900.00000  6950.00000  1.061410651979e-04
6950.00000  7000.00000  9.649187745267e-05
7000.00000  7050.00000  1.045328672404e-04
7050.00000  7100.00000  1.270476386460e-04
7100.00000  7150.00000  6.995661115318e-05
7150.00000  7200.00000  8.845088766494e-05
7200.00000  7250.00000  8.282219481354e-05
7250.00000  7300.00000  7.638940298336e-05
7300.00000  7350.00000  6.834841319564e-05
7350.00000  7400.00000  7.880169991968e-05
7400.00000  7450.00000  8.040989787722e-05
7450.00000  7500.00000  8.121399685599e-05
7500.00000  7550.00000  6.915251217441e-05
7550.00000  7600.00000  8.201809583477e-05
7600.00000  7650.00000  6.754431421687e-05
7650.00000  7700.00000  5.950332442914e-05
7700.00000  7750.00000  7.960579889845e-05
7750.00000  7800.00000  7.156480911073e-05
7800.00000  7850.00000  7.960579889845e-05
7850.00000  7900.00000  5.548282953528e-05
7900.00000  7950.00000  6.111152238669e-05
7950.00000  8000.00000  6.111152238669e-05
8000.00000  8050.00000  6.995661115318e-05
8050.00000  8100.00000  5.387463157774e-05
8100.00000  8150.00000  6.674021523809e-05
8150.00000  8200.00000  5.307053259897e-05
8200.00000  8250.00000  6.271972034423e-05
8250.00000  8300.00000  4.985413668388e-05
8300.00000  8350.00000  5.226643362019e-05
8350.00000  8400.00000  4.985413668388e-05
8400.00000  8450.00000  4.181314689616e-05
8450.00000  8500.00000  5.226643362019e-05
8500.00000  8550.00000  4.422544383247e-05
8550.00000  8600.00000  3.538035506598e-05
8600.00000  8650.00000  5.226643362019e-05
8650.00000  8700.00000  4.422544383247e-05
8700.00000  8750.00000  4.181314689616e-05
8750.00000  8800.00000  4.583364179002e-05
8800.00000  8850.00000  4.502954281124e-05
8850.00000  8900.00000  5.146233464142e-05
8900.00000  8950.00000  3.216395915089e-05
8950.00000  9000.00000  3.779265200229e-05
9000.00000  9050.00000  3.859675098107e-05
9050.00000  9100.00000  3.779265200229e-05
9100.00000  9150.00000  2.894756323580e-05
9150.00000  9200.00000  4.100904791738e-05
9200.00000  9250.00000  4.100904791738e-05
9250.00000  9300.00000  3.698855302352e-05
9300.00000  9350.00000  3.377215710843e-05
9350.00000  9400.00000  2.412296936317e-05
9400.00000  9450.00000  3.859675098107e-05
9450.00000  9500.00000  2.733936527826e-05
9500.00000  9550.00000  2.733936527826e-05
9550.00000  9600.00000  2.653526629948e-05
9600.00000  9650.00000  2.251477140562e-05
9650.00000  9700.00000  3.618445404475e-05
9700.00000  9750.00000  3.457625608721e-05
9750.00000  9800.00000  2.733936527826e-05
9800.00000  9850.00000  3.135986017212e-05
9850.00000  9900.00000  3.216395915089e-05
9900.00000  9950.00000  2.975166221457e-05
9950.00000  10000.00000  2.412296936317e-05
