300.00000  350.00000  6.323008871733e-05
350.00000  400.00000  1.136636118609e-04
400.00000  450.00000  9.860882883299e-05
450.00000  500.00000  7.677939344248e-05
500.00000  550.00000  4.937968833163e-04
550.00000  600.00000  7.903761089667e-05
600.00000  650.00000  1.400094821598e-04
650.00000  700.00000  8.355404580505e-05
700.00000  750.00000  1.121581335581e-04
750.00000  800.00000  7.602665429108e-05
800.00000  850.00000  1.927012227576e-04
850.00000  900.00000  7.151021938270e-05
900.00000  950.00000  6.323008871733e-05
950.00000  1000.00000  6.925200192851e-05
1000.00000  1050.00000  5.118626229499e-05
1050.00000  1100.00000  5.720817550616e-05
1100.00000  1150.00000  7.226295853410e-05
1150.00000  1200.00000  5.419721890057e-05
1200.00000  1250.00000  5.946639296035e-05
1250.00000  1300.00000  1.452786562196e-04
1300.00000  1350.00000  5.871365380895e-05
1350.00000  1400.00000  5.118626229499e-05
1400.00000  1450.00000  6.097187126314e-05
1450.00000  1500.00000  5.344447974918e-05
1500.00000  1550.00000  5.043352314359e-05
1550.00000  1600.00000  4.666982738660e-05
1600.00000  1650.00000  4.441160993241e-05
1650.00000  1700.00000  5.043352314359e-05
1700.00000  1750.00000  9.484513307600e-05
1750.00000  1800.00000  4.516434908381e-05
1800.00000  1850.00000  4.892804484079e-05
1850.00000  1900.00000  3.914243587264e-05
1900.00000  1950.00000  4.290613162962e-05
1950.00000  2000.00000  3.838969672124e-05
2000.00000  2050.00000  4.968078399219e-05
2050.00000  2100.00000  3.763695756984e-05
2100.00000  2150.00000  4.064791417543e-05
2150.00000  2200.00000  3.688421841845e-05
2200.00000  2250.00000  3.838969672124e-05
2250.00000  2300.00000  4.817530568940e-05
2300.00000  2350.00000  8.280130665365e-05
2350.00000  2400.00000  3.688421841845e-05
2400.00000  2450.00000  3.010956605587e-05
2450.00000  2500.00000  4.591708823521e-05
2500.00000  2550.00000  3.613147926705e-05
2550.00000  2600.00000  3.161504435867e-05
2600.00000  2650.00000  2.860408775308e-05
2650.00000  2700.00000  3.838969672124e-05
2700.00000  2750.00000  4.140065332683e-05
2750.00000  2800.00000  3.387326181286e-05
2800.00000  2850.00000  3.462600096425e-05
2850.00000  2900.00000  4.064791417543e-05
2900.00000  2950.00000  3.462600096425e-05
2950.00000  3000.00000  4.817530568940e-05
3000.00000  3050.00000  2.935682690448e-05
3050.00000  3100.00000  3.312052266146e-05
3100.00000  3150.00000  3.613147926705e-05
3150.00000  3200.00000  3.537874011565e-05
3200.00000  3250.00000  3.010956605587e-05
3250.00000  3300.00000  3.312052266146e-05
3300.00000  3350.00000  2.333491369330e-05
3350.00000  3400.00000  2.785134860168e-05
3400.00000  3450.00000  2.785134860168e-05
3450.00000  3500.00000  4.215339247822e-05
3500.00000  3550.00000  2.935682690448e-05
3550.00000  3600.00000  2.634587029889e-05
3600.00000  3650.00000  2.408765284470e-05
3650.00000  3700.00000  4.140065332683e-05
3700.00000  3750.00000  2.709860945029e-05
3750.00000  3800.00000  3.387326181286e-05
3800.00000  3850.00000  2.935682690448e-05
3850.00000  3900.00000  2.634587029889e-05
3900.00000  3950.00000  2.634587029889e-05
3950.00000  4000.00000  3.914243587264e-05
4000.00000  4050.00000  2.860408775308e-05
4050.00000  4100.00000  2.709860945029e-05
4100.00000  4150.00000  2.860408775308e-05
4150.00000  4200.00000  2.182943539051e-05
4200.00000  4250.00000  2.107669623911e-05
4250.00000  4300.00000  3.236778351006e-05
4300.00000  4350.00000  3.537874011565e-05
4350.00000  4400.00000  2.634587029889e-05
4400.00000  4450.00000  2.860408775308e-05
4450.00000  4500.00000  2.484039199610e-05
4500.00000  4550.00000  2.709860945029e-05
4550.00000  4600.00000  2.785134860168e-05
4600.00000  4650.00000  2.333491369330e-05
4650.00000  4700.00000  2.333491369330e-05
4700.00000  4750.00000  3.161504435867e-05
4750.00000  4800.00000  1.957121793632e-05
4800.00000  4850.00000  2.709860945029e-05
4850.00000  4900.00000  2.484039199610e-05
4900.00000  4950.00000  3.161504435867e-05
4950.00000  5000.00000  3.010956605587e-05
5000.00000  5050.00000  3.613147926705e-05
5050.00000  5100.00000  2.709860945029e-05
5100.00000  5150.00000  2.107669623911e-05
5150.00000  5200.00000  2.634587029889e-05
5200.00000  5250.00000  1.881847878492e-05
5250.00000  5300.00000  2.559313114749e-05
5300.00000  5350.00000  2.860408775308e-05
5350.00000  5400.00000  3.161504435867e-05
5400.00000  5450.00000  3.688421841845e-05
5450.00000  5500.00000  2.484039199610e-05
5500.00000  5550.00000  2.484039199610e-05
5550.00000  5600.00000  2.785134860168e-05
5600.00000  5650.00000  2.408765284470e-05
5650.00000  5700.00000  2.935682690448e-05
5700.00000  5750.00000  2.634587029889e-05
5750.00000  5800.00000  3.838969672124e-05
5800.00000  5850.00000  2.559313114749e-05
5850.00000  5900.00000  2.785134860168e-05
5900.00000  5950.00000  2.935682690448e-05
5950.00000  6000.00000  2.709860945029e-05
6000.00000  6050.00000  3.236778351006e-05
6050.00000  6100.00000  2.935682690448e-05
6100.00000  6150.00000  3.537874011565e-05
6150.00000  6200.00000  2.935682690448e-05
6200.00000  6250.00000  5.871365380895e-05
6250.00000  6300.00000  7.226295853410e-05
6300.00000  6350.00000  5.043352314359e-05
6350.00000  6400.00000  3.966935327861e-04
6400.00000  6450.00000  3.086230520727e-05
6450.00000  6500.00000  3.161504435867e-05
6500.00000  6550.00000  2.258217454191e-05
6550.00000  6600.00000  2.182943539051e-05
6600.00000  6650.00000  2.408765284470e-05
6650.00000  6700.00000  3.086230520727e-05
6700.00000  6750.00000  2.408765284470e-05
6750.00000  6800.00000  3.161504435867e-05
6800.00000  6850.00000  2.860408775308e-05
6850.00000  6900.00000  2.935682690448e-05
6900.00000  6950.00000  3.236778351006e-05
6950.00000  7000.00000  2.258217454191e-05
7000.00000  7050.00000  1.957121793632e-05
7050.00000  7100.00000  7.301569768549e-05
7100.00000  7150.00000  1.204382642235e-05
7150.00000  7200.00000  1.881847878492e-05
7200.00000  7250.00000  1.580752217933e-05
7250.00000  7300.00000  2.333491369330e-05
7300.00000  7350.00000  1.204382642235e-05
7350.00000  7400.00000  1.656026133073e-05
7400.00000  7450.00000  1.656026133073e-05
7450.00000  7500.00000  2.935682690448e-05
7500.00000  7550.00000  9.032869816762e-06
7550.00000  7600.00000  1.354930472514e-05
7600.00000  7650.00000  8.280130665365e-06
7650.00000  7700.00000  1.656026133073e-05
7700.00000  7750.00000  2.182943539051e-05
7750.00000  7800.00000  1.053834811956e-05
7800.00000  7850.00000  1.656026133073e-05
7850.00000  7900.00000  1.354930472514e-05
7900.00000  7950.00000  1.204382642235e-05
7950.00000  8000.00000  1.430204387654e-05
8000.00000  8050.00000  1.430204387654e-05
8050.00000  8100.00000  2.032395708771e-05
8100.00000  8150.00000  1.430204387654e-05
8150.00000  8200.00000  1.505478302794e-05
8200.00000  8250.00000  2.408765284470e-05
8250.00000  8300.00000  2.258217454191e-05
8300.00000  8350.00000  1.806573963352e-05
8350.00000  8400.00000  1.656026133073e-05
8400.00000  8450.00000  1.053834811956e-05
8450.00000  8500.00000  1.204382642235e-05
8500.00000  8550.00000  1.354930472514e-05
8550.00000  8600.00000  1.279656557375e-05
8600.00000  8650.00000  1.505478302794e-05
8650.00000  8700.00000  1.204382642235e-05
8700.00000  8750.00000  1.580752217933e-05
8750.00000  8800.00000  1.505478302794e-05
8800.00000  8850.00000  1.580752217933e-05
8850.00000  8900.00000  1.354930472514e-05
8900.00000  8950.00000  2.258217454191e-05
8950.00000  9000.00000  1.354930472514e-05
9000.00000  9050.00000  1.354930472514e-05
9050.00000  9100.00000  1.505478302794e-05
9100.00000  9150.00000  1.957121793632e-05
9150.00000  9200.00000  2.107669623911e-05
9200.00000  9250.00000  1.279656557375e-05
9250.00000  9300.00000  1.279656557375e-05
9300.00000  9350.00000  1.430204387654e-05
9350.00000  9400.00000  1.957121793632e-05
9400.00000  9450.00000  1.430204387654e-05
9450.00000  9500.00000  1.279656557375e-05
9500.00000  9550.00000  1.505478302794e-05
9550.00000  9600.00000  1.957121793632e-05
9600.00000  9650.00000  9.785608968159e-06
9650.00000  9700.00000  2.182943539051e-05
9700.00000  9750.00000  1.957121793632e-05
9750.00000  9800.00000  1.505478302794e-05
9800.00000  9850.00000  1.957121793632e-05
9850.00000  9900.00000  1.505478302794e-05
9900.00000  9950.00000  1.580752217933e-05
9950.00000  10000.00000  1.430204387654e-05
