10001.00000  11001.00000  1.511931709857e-04
11001.00000  12001.00000  1.464594528488e-04
12001.00000  13001.00000  1.443694716336e-04
13001.00000  14001.00000  1.360631360348e-04
14001.00000  15001.00000  1.244164031091e-04
15001.00000  16001.00000  1.181464594636e-04
16001.00000  17001.00000  1.059459708313e-04
17001.00000  18001.00000  9.910440839187e-05
18001.00000  19001.00000  9.288805400824e-05
19001.00000  20001.00000  8.570709290991e-05
20001.00000  21001.00000  8.115200564605e-05
21001.00000  22001.00000  7.218473581679e-05
22001.00000  23001.00000  6.861211835494e-05
23001.00000  24001.00000  6.473582840882e-05
24001.00000  25001.00000  5.991279483532e-05
25001.00000  26001.00000  5.425019615828e-05
26001.00000  27001.00000  5.155286997458e-05
27001.00000  28001.00000  4.624753304372e-05
28001.00000  29001.00000  4.412182565392e-05
29001.00000  30001.00000  4.103151154941e-05
30001.00000  31001.00000  3.903084577077e-05
31001.00000  32001.00000  3.602984710281e-05
32001.00000  33001.00000  3.340397326835e-05
33001.00000  34001.00000  3.301098534755e-05
34001.00000  35001.00000  3.026006990192e-05
35001.00000  36001.00000  2.874170748063e-05
36001.00000  37001.00000  2.779496385324e-05
37001.00000  38001.00000  2.584788733652e-05
38001.00000  39001.00000  2.384722155789e-05
39001.00000  40001.00000  2.300765645435e-05
40001.00000  41001.00000  2.190014504117e-05
41001.00000  42001.00000  2.070331819145e-05
42001.00000  43001.00000  2.025674100872e-05
43001.00000  44001.00000  1.916709268285e-05
44001.00000  45001.00000  1.805958126968e-05
45001.00000  46001.00000  1.602318931642e-05
46001.00000  47001.00000  1.623754636413e-05
47001.00000  48001.00000  1.523721347481e-05
48001.00000  49001.00000  1.429046984742e-05
49001.00000  50001.00000  1.391534501393e-05
50001.00000  51001.00000  1.323654769617e-05
51001.00000  52001.00000  1.320082152156e-05
52001.00000  53001.00000  1.111084030637e-05
53001.00000  54001.00000  1.128947117946e-05
54001.00000  55001.00000  1.011050741705e-05
55001.00000  56001.00000  1.048563225055e-05
56001.00000  57001.00000  1.016409667898e-05
57001.00000  58001.00000  1.055708459978e-05
58001.00000  59001.00000  9.253079226206e-06
59001.00000  60001.00000  9.610340972391e-06
60001.00000  61001.00000  8.985132916567e-06
61001.00000  62001.00000  8.449240297288e-06
62001.00000  63001.00000  8.574281908453e-06
63001.00000  64001.00000  8.002663114556e-06
64001.00000  65001.00000  8.127704725721e-06
65001.00000  66001.00000  7.020193312546e-06
66001.00000  67001.00000  7.145234923711e-06
67001.00000  68001.00000  6.555753042505e-06
68001.00000  69001.00000  6.627205391742e-06
69001.00000  70001.00000  6.323532907484e-06
70001.00000  71001.00000  6.359259082103e-06
71001.00000  72001.00000  6.144902034392e-06
72001.00000  73001.00000  6.001997335917e-06
73001.00000  74001.00000  5.912681899371e-06
74001.00000  75001.00000  5.305336930855e-06
75001.00000  76001.00000  5.769777200897e-06
76001.00000  77001.00000  5.198158407000e-06
77001.00000  78001.00000  5.483967803948e-06
78001.00000  79001.00000  4.983801359288e-06
79001.00000  80001.00000  4.501498001938e-06
80001.00000  81001.00000  4.590813438484e-06
81001.00000  82001.00000  4.555087263866e-06
82001.00000  83001.00000  4.322867128845e-06
83001.00000  84001.00000  3.822700684185e-06
84001.00000  85001.00000  4.019194644587e-06
85001.00000  86001.00000  4.590813438484e-06
86001.00000  87001.00000  3.786974509567e-06
87001.00000  88001.00000  3.697659073020e-06
88001.00000  89001.00000  3.929879208041e-06
89001.00000  90001.00000  3.554754374546e-06
90001.00000  91001.00000  3.072451017196e-06
91001.00000  92001.00000  3.661932898402e-06
92001.00000  93001.00000  3.179629541051e-06
93001.00000  94001.00000  3.286808064907e-06
94001.00000  95001.00000  2.625873834464e-06
95001.00000  96001.00000  3.268944977598e-06
96001.00000  97001.00000  3.161766453742e-06
97001.00000  98001.00000  2.608010747155e-06
98001.00000  99001.00000  2.804504707557e-06
99001.00000  100001.00000  2.965272493340e-06
100001.00000  101001.00000  2.625873834464e-06
101001.00000  102001.00000  2.590147659845e-06
102001.00000  103001.00000  2.840230882175e-06
103001.00000  104001.00000  2.429379874062e-06
104001.00000  105001.00000  2.411516786752e-06
105001.00000  106001.00000  2.072118127876e-06
106001.00000  107001.00000  2.215022826350e-06
107001.00000  108001.00000  2.179296651732e-06
108001.00000  109001.00000  2.429379874062e-06
109001.00000  110001.00000  2.179296651732e-06
110001.00000  111001.00000  2.161433564423e-06
111001.00000  112001.00000  2.322201350206e-06
112001.00000  113001.00000  2.357927524825e-06
113001.00000  114001.00000  1.804171818237e-06
114001.00000  115001.00000  1.875624167474e-06
115001.00000  116001.00000  2.143570477113e-06
116001.00000  117001.00000  2.000665778639e-06
117001.00000  118001.00000  1.893487254783e-06
118001.00000  119001.00000  1.875624167474e-06
119001.00000  120001.00000  1.714856381691e-06
120001.00000  121001.00000  1.429046984742e-06
121001.00000  122001.00000  1.696993294381e-06
122001.00000  123001.00000  1.911350342093e-06
123001.00000  124001.00000  1.589814770526e-06
124001.00000  125001.00000  1.607677857835e-06
125001.00000  126001.00000  1.554088595907e-06
126001.00000  127001.00000  1.643404032454e-06
127001.00000  128001.00000  1.625540945144e-06
128001.00000  129001.00000  1.750582556309e-06
129001.00000  130001.00000  1.232553024340e-06
130001.00000  131001.00000  1.536225508598e-06
131001.00000  132001.00000  1.536225508598e-06
132001.00000  133001.00000  1.411183897433e-06
133001.00000  134001.00000  1.321868460887e-06
134001.00000  135001.00000  1.143237587794e-06
135001.00000  136001.00000  1.089648325866e-06
136001.00000  137001.00000  8.931543654639e-07
137001.00000  138001.00000  1.232553024340e-06
138001.00000  139001.00000  1.036059063938e-06
139001.00000  140001.00000  1.321868460887e-06
140001.00000  141001.00000  1.286142286268e-06
141001.00000  142001.00000  1.125374500484e-06
142001.00000  143001.00000  1.339731548196e-06
143001.00000  144001.00000  9.467436273917e-07
144001.00000  145001.00000  1.000332889320e-06
145001.00000  146001.00000  1.357594635505e-06
146001.00000  147001.00000  1.107511413175e-06
147001.00000  148001.00000  8.217020162268e-07
148001.00000  149001.00000  1.196826849722e-06
149001.00000  150001.00000  9.824698020103e-07
150001.00000  151001.00000  1.036059063938e-06
151001.00000  152001.00000  9.646067147010e-07
152001.00000  153001.00000  1.089648325866e-06
153001.00000  154001.00000  1.018195976629e-06
154001.00000  155001.00000  8.931543654639e-07
155001.00000  156001.00000  6.430711431340e-07
156001.00000  157001.00000  1.018195976629e-06
157001.00000  158001.00000  8.395651035361e-07
158001.00000  159001.00000  8.752912781546e-07
159001.00000  160001.00000  6.966604050618e-07
160001.00000  161001.00000  7.145234923711e-07
161001.00000  162001.00000  7.502496669897e-07
162001.00000  163001.00000  6.787973177526e-07
163001.00000  164001.00000  7.502496669897e-07
164001.00000  165001.00000  7.323865796804e-07
165001.00000  166001.00000  7.323865796804e-07
166001.00000  167001.00000  7.681127542989e-07
167001.00000  168001.00000  5.001664446598e-07
168001.00000  169001.00000  9.288805400824e-07
169001.00000  170001.00000  5.001664446598e-07
170001.00000  171001.00000  6.609342304433e-07
171001.00000  172001.00000  6.966604050618e-07
172001.00000  173001.00000  5.180295319691e-07
173001.00000  174001.00000  6.073449685154e-07
174001.00000  175001.00000  4.465771827319e-07
175001.00000  176001.00000  7.502496669897e-07
176001.00000  177001.00000  5.716187938969e-07
177001.00000  178001.00000  7.145234923711e-07
178001.00000  179001.00000  7.323865796804e-07
179001.00000  180001.00000  4.465771827319e-07
180001.00000  181001.00000  5.894818812062e-07
181001.00000  182001.00000  5.894818812062e-07
182001.00000  183001.00000  4.823033573505e-07
183001.00000  184001.00000  5.716187938969e-07
184001.00000  185001.00000  6.787973177526e-07
185001.00000  186001.00000  5.180295319691e-07
186001.00000  187001.00000  6.430711431340e-07
187001.00000  188001.00000  5.894818812062e-07
188001.00000  189001.00000  5.180295319691e-07
189001.00000  190001.00000  5.537557065876e-07
190001.00000  191001.00000  5.001664446598e-07
191001.00000  192001.00000  3.929879208041e-07
192001.00000  193001.00000  6.609342304433e-07
193001.00000  194001.00000  5.001664446598e-07
194001.00000  195001.00000  5.180295319691e-07
195001.00000  196001.00000  5.001664446598e-07
196001.00000  197001.00000  5.716187938969e-07
197001.00000  198001.00000  6.073449685154e-07
198001.00000  199001.00000  6.252080558247e-07
