10001.00000  11001.00000  7.028949280364e-04
11001.00000  12001.00000  5.769767383605e-04
12001.00000  13001.00000  4.862185742387e-04
13001.00000  14001.00000  4.136695644554e-04
14001.00000  15001.00000  3.621698337743e-04
15001.00000  16001.00000  3.105622502541e-04
16001.00000  17001.00000  2.727778056147e-04
17001.00000  18001.00000  2.422374766698e-04
18001.00000  19001.00000  2.165685009585e-04
19001.00000  20001.00000  1.879155966983e-04
20001.00000  21001.00000  1.725106161769e-04
21001.00000  22001.00000  1.547148977216e-04
22001.00000  23001.00000  1.409277097871e-04
23001.00000  24001.00000  1.264035274519e-04
24001.00000  25001.00000  1.159418020570e-04
25001.00000  26001.00000  1.063968257946e-04
26001.00000  27001.00000  9.766074582568e-05
27001.00000  28001.00000  9.102779621963e-05
28001.00000  29001.00000  8.243552003618e-05
29001.00000  30001.00000  7.596434968881e-05
30001.00000  31001.00000  7.073348699136e-05
31001.00000  32001.00000  6.769563202273e-05
32001.00000  33001.00000  6.352532224332e-05
33001.00000  34001.00000  5.978642382040e-05
34001.00000  35001.00000  5.426795355195e-05
35001.00000  36001.00000  5.318942516072e-05
36001.00000  37001.00000  4.930672295230e-05
37001.00000  38001.00000  4.364444889835e-05
38001.00000  39001.00000  4.339279227373e-05
39001.00000  40001.00000  3.986959952906e-05
40001.00000  41001.00000  3.778444463935e-05
41001.00000  42001.00000  3.629248036482e-05
42001.00000  43001.00000  3.390174243093e-05
43001.00000  44001.00000  3.073805914999e-05
44001.00000  45001.00000  3.120542145286e-05
45001.00000  46001.00000  2.906634014359e-05
46001.00000  47001.00000  2.739462113719e-05
47001.00000  48001.00000  2.606443612134e-05
48001.00000  49001.00000  2.539934361342e-05
49001.00000  50001.00000  2.311645851865e-05
50001.00000  51001.00000  2.282885094766e-05
51001.00000  52001.00000  2.212780749336e-05
52001.00000  53001.00000  2.033026017464e-05
53001.00000  54001.00000  1.989884881815e-05
54001.00000  55001.00000  1.873044306099e-05
55001.00000  56001.00000  1.829903170450e-05
56001.00000  57001.00000  1.932363367617e-05
57001.00000  58001.00000  1.635768060029e-05
58001.00000  59001.00000  1.581841640467e-05
59001.00000  60001.00000  1.562068619962e-05
60001.00000  61001.00000  1.538700504818e-05
61001.00000  62001.00000  1.432645213014e-05
62001.00000  63001.00000  1.461405970114e-05
63001.00000  64001.00000  1.218737082087e-05
64001.00000  65001.00000  1.254688028462e-05
65001.00000  66001.00000  1.238510102593e-05
66001.00000  67001.00000  1.121669526877e-05
67001.00000  68001.00000  1.110884242965e-05
68001.00000  69001.00000  1.049767634128e-05
69001.00000  70001.00000  1.053362728766e-05
70001.00000  71001.00000  1.026399518985e-05
71001.00000  72001.00000  9.832583833360e-06
72001.00000  73001.00000  9.868534779735e-06
73001.00000  74001.00000  8.736079968945e-06
74001.00000  75001.00000  8.736079968945e-06
75001.00000  76001.00000  8.592276183448e-06
76001.00000  77001.00000  8.430496924764e-06
77001.00000  78001.00000  8.160864826957e-06
78001.00000  79001.00000  8.106938407396e-06
79001.00000  80001.00000  7.675527050905e-06
80001.00000  81001.00000  7.621600631343e-06
81001.00000  82001.00000  7.046385489355e-06
82001.00000  83001.00000  7.136262855291e-06
83001.00000  84001.00000  6.093685410437e-06
84001.00000  85001.00000  6.075709937250e-06
85001.00000  86001.00000  6.093685410437e-06
86001.00000  87001.00000  5.842028785817e-06
87001.00000  88001.00000  6.093685410437e-06
88001.00000  89001.00000  5.985832571314e-06
89001.00000  90001.00000  5.482519322075e-06
90001.00000  91001.00000  5.266813643829e-06
91001.00000  92001.00000  5.105034385145e-06
92001.00000  93001.00000  5.428592902513e-06
93001.00000  94001.00000  4.691598501841e-06
94001.00000  95001.00000  4.565770189531e-06
95001.00000  96001.00000  4.961230599648e-06
96001.00000  97001.00000  4.116383359853e-06
97001.00000  98001.00000  4.134358833040e-06
98001.00000  99001.00000  4.529819243157e-06
99001.00000  100001.00000  4.386015457660e-06
100001.00000  101001.00000  4.386015457660e-06
101001.00000  102001.00000  3.972579574356e-06
102001.00000  103001.00000  4.368039984473e-06
103001.00000  104001.00000  3.918653154794e-06
104001.00000  105001.00000  3.595094637426e-06
105001.00000  106001.00000  3.649021056987e-06
106001.00000  107001.00000  3.774849369297e-06
107001.00000  108001.00000  3.595094637426e-06
108001.00000  109001.00000  3.666996530175e-06
109001.00000  110001.00000  3.235585173683e-06
110001.00000  111001.00000  3.037854968625e-06
111001.00000  112001.00000  3.055830441812e-06
112001.00000  113001.00000  3.037854968625e-06
113001.00000  114001.00000  3.109756861374e-06
114001.00000  115001.00000  2.588468138947e-06
115001.00000  116001.00000  2.732271924444e-06
116001.00000  117001.00000  2.678345504882e-06
117001.00000  118001.00000  2.732271924444e-06
118001.00000  119001.00000  2.462639826637e-06
119001.00000  120001.00000  2.606443612134e-06
120001.00000  121001.00000  2.498590773011e-06
121001.00000  122001.00000  2.552517192573e-06
122001.00000  123001.00000  2.228958675204e-06
123001.00000  124001.00000  2.282885094766e-06
124001.00000  125001.00000  2.067179416520e-06
125001.00000  126001.00000  2.210983202017e-06
126001.00000  127001.00000  2.103130362894e-06
127001.00000  128001.00000  2.013252996959e-06
128001.00000  129001.00000  2.175032255643e-06
129001.00000  130001.00000  1.941351104210e-06
130001.00000  131001.00000  1.851473738274e-06
131001.00000  132001.00000  2.013252996959e-06
132001.00000  133001.00000  1.707669952777e-06
133001.00000  134001.00000  1.653743533216e-06
134001.00000  135001.00000  1.923375631023e-06
135001.00000  136001.00000  1.707669952777e-06
136001.00000  137001.00000  1.707669952777e-06
137001.00000  138001.00000  1.887424684649e-06
138001.00000  139001.00000  1.402086908596e-06
139001.00000  140001.00000  1.725645425965e-06
140001.00000  141001.00000  1.563866167280e-06
141001.00000  142001.00000  1.761596372339e-06
142001.00000  143001.00000  1.330185015848e-06
143001.00000  144001.00000  1.366135962222e-06
144001.00000  145001.00000  1.527915220906e-06
145001.00000  146001.00000  1.276258596286e-06
146001.00000  147001.00000  1.258283123099e-06
147001.00000  148001.00000  1.366135962222e-06
148001.00000  149001.00000  1.366135962222e-06
149001.00000  150001.00000  1.078528391228e-06
150001.00000  151001.00000  1.330185015848e-06
151001.00000  152001.00000  1.168405757163e-06
152001.00000  153001.00000  1.258283123099e-06
153001.00000  154001.00000  1.186381230351e-06
154001.00000  155001.00000  9.347246057308e-07
155001.00000  156001.00000  8.088962934209e-07
156001.00000  157001.00000  1.294234069473e-06
157001.00000  158001.00000  1.096503864415e-06
158001.00000  159001.00000  1.186381230351e-06
159001.00000  160001.00000  1.150430283976e-06
160001.00000  161001.00000  9.886510252922e-07
161001.00000  162001.00000  1.096503864415e-06
162001.00000  163001.00000  1.132454810789e-06
163001.00000  164001.00000  8.807981861694e-07
164001.00000  165001.00000  9.527000789179e-07
165001.00000  166001.00000  9.527000789179e-07
166001.00000  167001.00000  8.268717666080e-07
167001.00000  168001.00000  1.060552918041e-06
168001.00000  169001.00000  9.167491325436e-07
169001.00000  170001.00000  7.549698738595e-07
170001.00000  171001.00000  8.628227129823e-07
171001.00000  172001.00000  7.729453470466e-07
172001.00000  173001.00000  8.448472397951e-07
173001.00000  174001.00000  9.347246057308e-07
174001.00000  175001.00000  8.268717666080e-07
175001.00000  176001.00000  8.448472397951e-07
176001.00000  177001.00000  7.549698738595e-07
177001.00000  178001.00000  7.010434542981e-07
178001.00000  179001.00000  6.291415615496e-07
179001.00000  180001.00000  7.549698738595e-07
180001.00000  181001.00000  9.706755521050e-07
181001.00000  182001.00000  6.471170347367e-07
182001.00000  183001.00000  5.572396688010e-07
183001.00000  184001.00000  8.088962934209e-07
184001.00000  185001.00000  5.752151419882e-07
185001.00000  186001.00000  6.291415615496e-07
186001.00000  187001.00000  8.268717666080e-07
187001.00000  188001.00000  5.931906151753e-07
188001.00000  189001.00000  6.471170347367e-07
189001.00000  190001.00000  6.291415615496e-07
190001.00000  191001.00000  4.314113564911e-07
191001.00000  192001.00000  5.572396688010e-07
192001.00000  193001.00000  6.650925079238e-07
193001.00000  194001.00000  4.853377760525e-07
194001.00000  195001.00000  4.853377760525e-07
195001.00000  196001.00000  5.752151419882e-07
196001.00000  197001.00000  5.033132492396e-07
197001.00000  198001.00000  5.931906151753e-07
198001.00000  199001.00000  6.111660883624e-07
