10001.00000  11001.00000  2.323932710521e-04
11001.00000  12001.00000  1.973520782715e-04
12001.00000  13001.00000  1.665387800522e-04
13001.00000  14001.00000  1.443222007742e-04
14001.00000  15001.00000  1.252664760016e-04
15001.00000  16001.00000  1.091501445906e-04
16001.00000  17001.00000  9.710064509089e-05
17001.00000  18001.00000  8.577592751601e-05
18001.00000  19001.00000  7.664568854676e-05
19001.00000  20001.00000  6.806910243672e-05
20001.00000  21001.00000  6.238157761023e-05
21001.00000  22001.00000  5.712690865548e-05
22001.00000  23001.00000  5.160044647895e-05
23001.00000  24001.00000  4.634577752420e-05
24001.00000  25001.00000  4.178569124739e-05
25001.00000  26001.00000  3.853423900144e-05
26001.00000  27001.00000  3.529285317112e-05
27001.00000  28001.00000  3.184007261274e-05
28001.00000  29001.00000  2.894094491357e-05
29001.00000  30001.00000  2.715918934846e-05
30001.00000  31001.00000  2.536736736772e-05
31001.00000  32001.00000  2.336415065892e-05
32001.00000  33001.00000  2.199511813431e-05
33001.00000  34001.00000  2.075694901279e-05
34001.00000  35001.00000  1.880406438210e-05
35001.00000  36001.00000  1.765649300118e-05
36001.00000  37001.00000  1.725383637630e-05
37001.00000  38001.00000  1.545194797994e-05
38001.00000  39001.00000  1.386145431165e-05
39001.00000  40001.00000  1.387152072727e-05
40001.00000  41001.00000  1.246222254017e-05
41001.00000  42001.00000  1.195890175907e-05
42001.00000  43001.00000  1.120392058741e-05
43001.00000  44001.00000  1.007648203773e-05
44001.00000  45001.00000  1.020734544082e-05
45001.00000  46001.00000  9.633559750361e-06
46001.00000  47001.00000  8.999375566168e-06
47001.00000  48001.00000  8.254460810132e-06
48001.00000  49001.00000  7.338416988520e-06
49001.00000  50001.00000  7.499479638473e-06
50001.00000  51001.00000  7.076690182345e-06
51001.00000  52001.00000  6.603568648105e-06
52001.00000  53001.00000  6.291509763820e-06
53001.00000  54001.00000  6.080115035756e-06
54001.00000  55001.00000  5.627126332761e-06
55001.00000  56001.00000  5.305001032853e-06
56001.00000  57001.00000  4.872145161102e-06
57001.00000  58001.00000  5.003008564190e-06
58001.00000  59001.00000  4.127230405066e-06
59001.00000  60001.00000  4.368824379997e-06
60001.00000  61001.00000  3.915835677001e-06
61001.00000  62001.00000  3.895702845757e-06
62001.00000  63001.00000  3.472913389629e-06
63001.00000  64001.00000  3.321917155297e-06
64001.00000  65001.00000  3.281651492808e-06
65001.00000  66001.00000  3.090389595988e-06
66001.00000  67001.00000  2.959526192901e-06
67001.00000  68001.00000  2.838729205436e-06
68001.00000  69001.00000  2.878994867924e-06
69001.00000  70001.00000  2.355541255574e-06
70001.00000  71001.00000  2.154212943132e-06
71001.00000  72001.00000  2.224677852487e-06
72001.00000  73001.00000  2.023349540044e-06
73001.00000  74001.00000  2.124013696266e-06
74001.00000  75001.00000  2.164279358754e-06
75001.00000  76001.00000  1.872353305713e-06
76001.00000  77001.00000  1.691157824515e-06
77001.00000  78001.00000  1.892486136957e-06
78001.00000  79001.00000  1.741489902625e-06
79001.00000  80001.00000  1.389165355851e-06
80001.00000  81001.00000  1.681091408893e-06
81001.00000  82001.00000  1.509962343317e-06
82001.00000  83001.00000  1.399231771474e-06
83001.00000  84001.00000  1.228102705898e-06
84001.00000  85001.00000  1.348899693363e-06
85001.00000  86001.00000  1.238169121520e-06
86001.00000  87001.00000  1.117372134054e-06
87001.00000  88001.00000  1.187837043409e-06
88001.00000  89001.00000  8.556453278795e-07
89001.00000  90001.00000  9.059774059901e-07
90001.00000  91001.00000  9.865087309670e-07
91001.00000  92001.00000  1.016707977833e-06
92001.00000  93001.00000  6.945826779257e-07
93001.00000  94001.00000  7.549811716584e-07
94001.00000  95001.00000  9.563094841006e-07
95001.00000  96001.00000  7.751140029026e-07
96001.00000  97001.00000  6.341841841930e-07
97001.00000  98001.00000  7.348483404142e-07
98001.00000  99001.00000  8.053132497689e-07
99001.00000  100001.00000  7.650475872805e-07
100001.00000  101001.00000  5.435864435940e-07
101001.00000  102001.00000  6.744498466815e-07
102001.00000  103001.00000  6.643834310594e-07
103001.00000  104001.00000  4.831879498614e-07
104001.00000  105001.00000  5.435864435940e-07
105001.00000  106001.00000  4.529887029950e-07
106001.00000  107001.00000  5.033207811056e-07
107001.00000  108001.00000  6.341841841930e-07
108001.00000  109001.00000  5.133871967277e-07
109001.00000  110001.00000  5.133871967277e-07
110001.00000  111001.00000  4.127230405066e-07
111001.00000  112001.00000  3.825237936402e-07
112001.00000  113001.00000  3.523245467739e-07
113001.00000  114001.00000  2.919260530412e-07
114001.00000  115001.00000  2.617268061749e-07
115001.00000  116001.00000  3.925902092624e-07
116001.00000  117001.00000  3.019924686634e-07
117001.00000  118001.00000  2.717932217970e-07
118001.00000  119001.00000  3.523245467739e-07
119001.00000  120001.00000  2.818596374191e-07
120001.00000  121001.00000  3.724573780181e-07
121001.00000  122001.00000  2.717932217970e-07
122001.00000  123001.00000  2.415939749307e-07
123001.00000  124001.00000  2.415939749307e-07
124001.00000  125001.00000  3.925902092624e-07
125001.00000  126001.00000  2.818596374191e-07
126001.00000  127001.00000  3.221252999076e-07
127001.00000  128001.00000  2.013283124422e-07
128001.00000  129001.00000  2.415939749307e-07
129001.00000  130001.00000  2.415939749307e-07
130001.00000  131001.00000  2.315275593086e-07
131001.00000  132001.00000  1.811954811980e-07
132001.00000  133001.00000  2.516603905528e-07
133001.00000  134001.00000  2.818596374191e-07
134001.00000  135001.00000  1.409298187096e-07
135001.00000  136001.00000  1.207969874653e-07
136001.00000  137001.00000  1.107305718432e-07
137001.00000  138001.00000  1.509962343317e-07
138001.00000  139001.00000  1.509962343317e-07
139001.00000  140001.00000  1.207969874653e-07
140001.00000  141001.00000  1.610626499538e-07
141001.00000  142001.00000  1.409298187096e-07
142001.00000  143001.00000  1.509962343317e-07
143001.00000  144001.00000  1.308634030875e-07
144001.00000  145001.00000  1.006641562211e-07
145001.00000  146001.00000  1.509962343317e-07
146001.00000  147001.00000  9.059774059901e-08
147001.00000  148001.00000  1.207969874653e-07
148001.00000  149001.00000  7.046490935478e-08
149001.00000  150001.00000  1.711290655759e-07
150001.00000  151001.00000  2.214611436865e-07
151001.00000  152001.00000  5.033207811056e-08
152001.00000  153001.00000  8.053132497689e-08
153001.00000  154001.00000  8.053132497689e-08
154001.00000  155001.00000  8.053132497689e-08
155001.00000  156001.00000  6.039849373267e-08
156001.00000  157001.00000  1.006641562211e-07
157001.00000  158001.00000  7.046490935478e-08
158001.00000  159001.00000  6.039849373267e-08
159001.00000  160001.00000  5.033207811056e-08
160001.00000  161001.00000  5.033207811056e-08
161001.00000  162001.00000  6.039849373267e-08
162001.00000  163001.00000  7.046490935478e-08
163001.00000  164001.00000  7.046490935478e-08
164001.00000  165001.00000  5.033207811056e-08
165001.00000  166001.00000  6.039849373267e-08
166001.00000  167001.00000  6.039849373267e-08
167001.00000  168001.00000  3.019924686634e-08
168001.00000  169001.00000  5.033207811056e-08
169001.00000  170001.00000  6.039849373267e-08
170001.00000  171001.00000  5.033207811056e-08
171001.00000  172001.00000  1.006641562211e-08
172001.00000  173001.00000  2.013283124422e-08
173001.00000  174001.00000  8.053132497689e-08
174001.00000  175001.00000  5.033207811056e-08
175001.00000  176001.00000  4.026566248845e-08
176001.00000  177001.00000  5.033207811056e-08
177001.00000  178001.00000  4.026566248845e-08
178001.00000  179001.00000  7.046490935478e-08
179001.00000  180001.00000  3.019924686634e-08
180001.00000  181001.00000  2.013283124422e-08
181001.00000  182001.00000  1.006641562211e-08
182001.00000  183001.00000  3.019924686634e-08
183001.00000  184001.00000  2.013283124422e-08
184001.00000  185001.00000  3.019924686634e-08
185001.00000  186001.00000  3.019924686634e-08
186001.00000  187001.00000  4.026566248845e-08
187001.00000  188001.00000  2.013283124422e-08
188001.00000  189001.00000  3.019924686634e-08
189001.00000  190001.00000  2.013283124422e-08
190001.00000  191001.00000  4.026566248845e-08
191001.00000  192001.00000  1.006641562211e-08
192001.00000  193001.00000  5.033207811056e-08
193001.00000  194001.00000  4.026566248845e-08
194001.00000  195001.00000  3.019924686634e-08
195001.00000  196001.00000  2.013283124422e-08
196001.00000  197001.00000  2.013283124422e-08
197001.00000  198001.00000  2.013283124422e-08
198001.00000  199001.00000  2.013283124422e-08
