10001.00000  11001.00000  2.293632175190e-04
11001.00000  12001.00000  1.808462485316e-04
12001.00000  13001.00000  1.509751643646e-04
13001.00000  14001.00000  1.219327861897e-04
14001.00000  15001.00000  1.062250407955e-04
15001.00000  16001.00000  8.648677080367e-05
16001.00000  17001.00000  7.590193517831e-05
17001.00000  18001.00000  6.810456516248e-05
18001.00000  19001.00000  5.548563301124e-05
19001.00000  20001.00000  4.829095826233e-05
20001.00000  21001.00000  4.636986709901e-05
21001.00000  22001.00000  4.158597341779e-05
22001.00000  23001.00000  3.386394031032e-05
23001.00000  24001.00000  3.171683842191e-05
24001.00000  25001.00000  2.700828164906e-05
25001.00000  26001.00000  2.651859174468e-05
26001.00000  27001.00000  2.346744695588e-05
27001.00000  28001.00000  2.120733970491e-05
28001.00000  29001.00000  1.883422709139e-05
29001.00000  30001.00000  1.604676148187e-05
30001.00000  31001.00000  1.604676148187e-05
31001.00000  32001.00000  1.446468640619e-05
32001.00000  33001.00000  1.333463278071e-05
33001.00000  34001.00000  1.235525297195e-05
34001.00000  35001.00000  1.130053625484e-05
35001.00000  36001.00000  1.017048262935e-05
36001.00000  37001.00000  8.965092095503e-06
37001.00000  38001.00000  9.228771274782e-06
38001.00000  39001.00000  8.550739099492e-06
39001.00000  40001.00000  7.609027744923e-06
40001.00000  41001.00000  8.626076007858e-06
41001.00000  42001.00000  6.591979481987e-06
42001.00000  43001.00000  6.403637211073e-06
43001.00000  44001.00000  6.930995569632e-06
44001.00000  45001.00000  5.574931219052e-06
45001.00000  46001.00000  5.348920493956e-06
46001.00000  47001.00000  5.047572860493e-06
47001.00000  48001.00000  5.085241314676e-06
48001.00000  49001.00000  4.444877593569e-06
49001.00000  50001.00000  4.934567497945e-06
50001.00000  51001.00000  4.633219864483e-06
51001.00000  52001.00000  3.653840055730e-06
52001.00000  53001.00000  3.314823968085e-06
53001.00000  54001.00000  2.938139426257e-06
54001.00000  55001.00000  3.088813242988e-06
55001.00000  56001.00000  3.277155513902e-06
56001.00000  57001.00000  3.390160876451e-06
57001.00000  58001.00000  3.088813242988e-06
58001.00000  59001.00000  2.749797155343e-06
59001.00000  60001.00000  2.523786430247e-06
60001.00000  61001.00000  2.335444159333e-06
61001.00000  62001.00000  2.335444159333e-06
62001.00000  63001.00000  1.582075075677e-06
63001.00000  64001.00000  1.883422709139e-06
64001.00000  65001.00000  1.808085800774e-06
65001.00000  66001.00000  1.732748892408e-06
66001.00000  67001.00000  2.335444159333e-06
67001.00000  68001.00000  1.732748892408e-06
68001.00000  69001.00000  1.958759617505e-06
69001.00000  70001.00000  1.469069713129e-06
70001.00000  71001.00000  1.506738167311e-06
71001.00000  72001.00000  1.544406621494e-06
72001.00000  73001.00000  1.544406621494e-06
73001.00000  74001.00000  1.318395896397e-06
74001.00000  75001.00000  1.356064350580e-06
75001.00000  76001.00000  8.287059920213e-07
76001.00000  77001.00000  1.356064350580e-06
77001.00000  78001.00000  1.280727442215e-06
78001.00000  79001.00000  1.167722079666e-06
79001.00000  80001.00000  1.544406621494e-06
80001.00000  81001.00000  1.356064350580e-06
81001.00000  82001.00000  9.040429003868e-07
82001.00000  83001.00000  1.054716717118e-06
83001.00000  84001.00000  7.157006294729e-07
84001.00000  85001.00000  9.417113545696e-07
85001.00000  86001.00000  1.167722079666e-06
86001.00000  87001.00000  9.417113545696e-07
87001.00000  88001.00000  1.130053625484e-06
88001.00000  89001.00000  7.157006294729e-07
89001.00000  90001.00000  7.533690836557e-07
90001.00000  91001.00000  6.026952669246e-07
91001.00000  92001.00000  5.650268127418e-07
92001.00000  93001.00000  6.780321752901e-07
93001.00000  94001.00000  5.650268127418e-07
94001.00000  95001.00000  4.520214501934e-07
95001.00000  96001.00000  4.143529960106e-07
96001.00000  97001.00000  6.403637211073e-07
97001.00000  98001.00000  6.026952669246e-07
98001.00000  99001.00000  6.780321752901e-07
99001.00000  100001.00000  5.650268127418e-07
100001.00000  101001.00000  6.026952669246e-07
101001.00000  102001.00000  6.403637211073e-07
102001.00000  103001.00000  2.636791792795e-07
103001.00000  104001.00000  3.766845418279e-07
104001.00000  105001.00000  6.026952669246e-07
105001.00000  106001.00000  5.273583585590e-07
106001.00000  107001.00000  4.143529960106e-07
107001.00000  108001.00000  4.896899043762e-07
108001.00000  109001.00000  5.273583585590e-07
109001.00000  110001.00000  6.026952669246e-07
110001.00000  111001.00000  3.766845418279e-07
111001.00000  112001.00000  4.520214501934e-07
112001.00000  113001.00000  3.013476334623e-07
113001.00000  114001.00000  4.896899043762e-07
114001.00000  115001.00000  3.013476334623e-07
115001.00000  116001.00000  2.636791792795e-07
116001.00000  117001.00000  4.520214501934e-07
117001.00000  118001.00000  4.143529960106e-07
118001.00000  119001.00000  1.506738167311e-07
119001.00000  120001.00000  4.520214501934e-07
120001.00000  121001.00000  4.520214501934e-07
121001.00000  122001.00000  4.896899043762e-07
122001.00000  123001.00000  3.013476334623e-07
123001.00000  124001.00000  6.026952669246e-07
124001.00000  125001.00000  2.260107250967e-07
125001.00000  126001.00000  4.143529960106e-07
126001.00000  127001.00000  2.260107250967e-07
127001.00000  128001.00000  1.883422709139e-07
128001.00000  129001.00000  1.883422709139e-07
129001.00000  130001.00000  3.766845418279e-08
130001.00000  131001.00000  7.533690836557e-08
131001.00000  132001.00000  4.520214501934e-07
132001.00000  133001.00000  2.260107250967e-07
133001.00000  134001.00000  3.013476334623e-07
134001.00000  135001.00000  2.636791792795e-07
135001.00000  136001.00000  1.130053625484e-07
136001.00000  137001.00000  2.260107250967e-07
137001.00000  138001.00000  1.506738167311e-07
138001.00000  139001.00000  3.013476334623e-07
139001.00000  140001.00000  2.260107250967e-07
140001.00000  141001.00000  1.883422709139e-07
141001.00000  142001.00000  2.636791792795e-07
142001.00000  143001.00000  1.506738167311e-07
143001.00000  144001.00000  1.130053625484e-07
144001.00000  145001.00000  2.260107250967e-07
145001.00000  146001.00000  3.013476334623e-07
146001.00000  147001.00000  2.636791792795e-07
147001.00000  148001.00000  1.506738167311e-07
148001.00000  149001.00000  7.533690836557e-08
149001.00000  150001.00000  1.883422709139e-07
150001.00000  151001.00000  1.130053625484e-07
151001.00000  152001.00000  1.130053625484e-07
152001.00000  153001.00000  1.130053625484e-07
153001.00000  154001.00000  7.533690836557e-08
154001.00000  155001.00000  2.260107250967e-07
155001.00000  156001.00000  7.533690836557e-08
156001.00000  157001.00000  2.260107250967e-07
157001.00000  158001.00000  1.130053625484e-07
158001.00000  159001.00000  1.506738167311e-07
159001.00000  160001.00000  7.533690836557e-08
160001.00000  161001.00000  0.000000000000e+00
161001.00000  162001.00000  1.130053625484e-07
162001.00000  163001.00000  1.883422709139e-07
163001.00000  164001.00000  3.766845418279e-08
164001.00000  165001.00000  1.506738167311e-07
165001.00000  166001.00000  7.533690836557e-08
166001.00000  167001.00000  3.766845418279e-08
167001.00000  168001.00000  7.533690836557e-08
168001.00000  169001.00000  1.130053625484e-07
169001.00000  170001.00000  1.130053625484e-07
170001.00000  171001.00000  3.766845418279e-08
171001.00000  172001.00000  1.130053625484e-07
172001.00000  173001.00000  1.506738167311e-07
173001.00000  174001.00000  3.766845418279e-08
174001.00000  175001.00000  2.260107250967e-07
175001.00000  176001.00000  0.000000000000e+00
176001.00000  177001.00000  3.766845418279e-08
177001.00000  178001.00000  1.130053625484e-07
178001.00000  179001.00000  7.533690836557e-08
179001.00000  180001.00000  7.533690836557e-08
180001.00000  181001.00000  0.000000000000e+00
181001.00000  182001.00000  1.130053625484e-07
182001.00000  183001.00000  3.766845418279e-08
183001.00000  184001.00000  1.130053625484e-07
184001.00000  185001.00000  7.533690836557e-08
185001.00000  186001.00000  0.000000000000e+00
186001.00000  187001.00000  0.000000000000e+00
187001.00000  188001.00000  0.000000000000e+00
188001.00000  189001.00000  0.000000000000e+00
189001.00000  190001.00000  7.533690836557e-08
190001.00000  191001.00000  1.130053625484e-07
191001.00000  192001.00000  3.766845418279e-08
192001.00000  193001.00000  1.130053625484e-07
193001.00000  194001.00000  7.533690836557e-08
194001.00000  195001.00000  7.533690836557e-08
195001.00000  196001.00000  0.000000000000e+00
196001.00000  197001.00000  0.000000000000e+00
197001.00000  198001.00000  3.766845418279e-08
198001.00000  199001.00000  7.533690836557e-08
