300.00000  350.00000  2.119746095038e-01
350.00000  400.00000  1.498549867275e-01
400.00000  450.00000  1.119269045679e-01
450.00000  500.00000  8.570794451838e-02
500.00000  550.00000  6.769085375382e-02
550.00000  600.00000  5.467197577348e-02
600.00000  650.00000  4.487105987985e-02
650.00000  700.00000  3.772144591788e-02
700.00000  750.00000  3.268905867830e-02
750.00000  800.00000  2.778780597671e-02
800.00000  850.00000  2.465965117965e-02
850.00000  900.00000  2.162766171045e-02
900.00000  950.00000  1.925849772417e-02
950.00000  1000.00000  1.766501439894e-02
1000.00000  1050.00000  1.606278877117e-02
1050.00000  1100.00000  1.500973869340e-02
1100.00000  1150.00000  1.403457458365e-02
1150.00000  1200.00000  1.333995890971e-02
1200.00000  1250.00000  1.247447095900e-02
1250.00000  1300.00000  1.187443110337e-02
1300.00000  1350.00000  1.101371168131e-02
1350.00000  1400.00000  1.052811651337e-02
1400.00000  1450.00000  1.004093183588e-02
1450.00000  1500.00000  9.476655945153e-03
1500.00000  1550.00000  9.082457576418e-03
1550.00000  1600.00000  8.675543131272e-03
1600.00000  1650.00000  8.177231886924e-03
1650.00000  1700.00000  7.900657224989e-03
1700.00000  1750.00000  7.449236512405e-03
1750.00000  1800.00000  7.074907013062e-03
1800.00000  1850.00000  6.668787322692e-03
1850.00000  1900.00000  6.538447539481e-03
1900.00000  1950.00000  6.037752030806e-03
1950.00000  2000.00000  5.835884317784e-03
2000.00000  2050.00000  5.549772598541e-03
2050.00000  2100.00000  5.190543439936e-03
2100.00000  2150.00000  5.169085060992e-03
2150.00000  2200.00000  4.888536625179e-03
2200.00000  2250.00000  4.630241323085e-03
2250.00000  2300.00000  4.428373610063e-03
2300.00000  2350.00000  4.351282396823e-03
2350.00000  2400.00000  4.122393021428e-03
2400.00000  2450.00000  4.000795540750e-03
2450.00000  2500.00000  3.782237977439e-03
2500.00000  2550.00000  3.667793289742e-03
2550.00000  2600.00000  3.480231162682e-03
2600.00000  2650.00000  3.274389675782e-03
2650.00000  2700.00000  3.154381704655e-03
2700.00000  2750.00000  3.055832112472e-03
2750.00000  2800.00000  2.976356634904e-03
2800.00000  2850.00000  2.839658813488e-03
2850.00000  2900.00000  2.772104657556e-03
2900.00000  2950.00000  2.621896004953e-03
2950.00000  3000.00000  2.522551657994e-03
3000.00000  3050.00000  2.563084151553e-03
3050.00000  3100.00000  2.338963304813e-03
3100.00000  3150.00000  2.239618957853e-03
3150.00000  3200.00000  2.238824203077e-03
3200.00000  3250.00000  2.110868684194e-03
3250.00000  3300.00000  2.144248384772e-03
3300.00000  3350.00000  1.982118410534e-03
3350.00000  3400.00000  1.943175426526e-03
3400.00000  3450.00000  1.897079649537e-03
3450.00000  3500.00000  1.745281487383e-03
3500.00000  3550.00000  1.761971337672e-03
3550.00000  3600.00000  1.663421745489e-03
3600.00000  3650.00000  1.670574538470e-03
3650.00000  3700.00000  1.672958802797e-03
3700.00000  3750.00000  1.525134414521e-03
3750.00000  3800.00000  1.484601920962e-03
3800.00000  3850.00000  1.412279236375e-03
3850.00000  3900.00000  1.393205121759e-03
3900.00000  3950.00000  1.371746742816e-03
3950.00000  4000.00000  1.345519835218e-03
4000.00000  4050.00000  1.253328281240e-03
4050.00000  4100.00000  1.234254166624e-03
4100.00000  4150.00000  1.259686319445e-03
4150.00000  4200.00000  1.187363634859e-03
4200.00000  4250.00000  1.124578007581e-03
4250.00000  4300.00000  1.073713701937e-03
4300.00000  4350.00000  1.136499329216e-03
4350.00000  4400.00000  1.056229096873e-03
4400.00000  4450.00000  1.022849396294e-03
4450.00000  4500.00000  1.026028415397e-03
4500.00000  4550.00000  1.009338565108e-03
4550.00000  4600.00000  9.195312754564e-04
4600.00000  4650.00000  9.187365206807e-04
4650.00000  4700.00000  9.258893136618e-04
4700.00000  4750.00000  9.028414251672e-04
4750.00000  4800.00000  8.901253487564e-04
4800.00000  4850.00000  8.241607023753e-04
4850.00000  4900.00000  8.329030049078e-04
4900.00000  4950.00000  7.828334540402e-04
4950.00000  5000.00000  7.653488489754e-04
5000.00000  5050.00000  7.899862470213e-04
5050.00000  5100.00000  7.335586579483e-04
5100.00000  5150.00000  7.272006197429e-04
5150.00000  5200.00000  7.732963967321e-04
5200.00000  5250.00000  7.208425815375e-04
5250.00000  5300.00000  6.731572949970e-04
5300.00000  5350.00000  6.532884256051e-04
5350.00000  5400.00000  6.818995975295e-04
5400.00000  5450.00000  6.214982345781e-04
5450.00000  5500.00000  6.429566135214e-04
5500.00000  5550.00000  6.127559320457e-04
5550.00000  5600.00000  5.920923078781e-04
5600.00000  5650.00000  5.865290244484e-04
5650.00000  5700.00000  5.905027983268e-04
5700.00000  5750.00000  6.040136295133e-04
5750.00000  5800.00000  5.730181932619e-04
5800.00000  5850.00000  5.587126072998e-04
5850.00000  5900.00000  5.483807952160e-04
5900.00000  5950.00000  5.475860404403e-04
5950.00000  6000.00000  5.229486423944e-04
6000.00000  6050.00000  4.887741870403e-04
6050.00000  6100.00000  5.197696232917e-04
6100.00000  6150.00000  4.784423749566e-04
6150.00000  6200.00000  4.935427156944e-04
6200.00000  6250.00000  4.975164895728e-04
6250.00000  6300.00000  4.951322252457e-04
6300.00000  6350.00000  4.697000724241e-04
6350.00000  6400.00000  5.579178525241e-04
6400.00000  6450.00000  4.617525246674e-04
6450.00000  6500.00000  4.212200311079e-04
6500.00000  6550.00000  4.315518431917e-04
6550.00000  6600.00000  4.251938049863e-04
6600.00000  6650.00000  4.077091999215e-04
6650.00000  6700.00000  3.941983687350e-04
6700.00000  6750.00000  4.005564069404e-04
6750.00000  6800.00000  3.894298400809e-04
6800.00000  6850.00000  4.204252763323e-04
6850.00000  6900.00000  3.306179866809e-04
6900.00000  6950.00000  3.814822923242e-04
6950.00000  7000.00000  3.711504802404e-04
7000.00000  7050.00000  3.822770470998e-04
7050.00000  7100.00000  3.687662159134e-04
7100.00000  7150.00000  3.274389675782e-04
7150.00000  7200.00000  3.067753434107e-04
7200.00000  7250.00000  3.171071554945e-04
7250.00000  7300.00000  2.996225504296e-04
7300.00000  7350.00000  3.091596077377e-04
7350.00000  7400.00000  2.972382861026e-04
7400.00000  7450.00000  3.218756841485e-04
7450.00000  7500.00000  3.202861745972e-04
7500.00000  7550.00000  2.980330408783e-04
7550.00000  7600.00000  2.940592669999e-04
7600.00000  7650.00000  2.797536810377e-04
7650.00000  7700.00000  2.416054518053e-04
7700.00000  7750.00000  2.884959835702e-04
7750.00000  7800.00000  2.575005473188e-04
7800.00000  7850.00000  2.535267734404e-04
7850.00000  7900.00000  3.020068147566e-04
7900.00000  7950.00000  2.495529995621e-04
7950.00000  8000.00000  2.312736397215e-04
8000.00000  8050.00000  2.519372638891e-04
8050.00000  8100.00000  2.439897161323e-04
8100.00000  8150.00000  2.749851523837e-04
8150.00000  8200.00000  2.598848116458e-04
8200.00000  8250.00000  2.328631492729e-04
8250.00000  8300.00000  2.392211874783e-04
8300.00000  8350.00000  2.590900568702e-04
8350.00000  8400.00000  2.185575633107e-04
8400.00000  8450.00000  2.225313371891e-04
8450.00000  8500.00000  2.312736397215e-04
8500.00000  8550.00000  2.368369231513e-04
8550.00000  8600.00000  2.137890346567e-04
8600.00000  8650.00000  2.018677130215e-04
8650.00000  8700.00000  1.931254104891e-04
8700.00000  8750.00000  2.280946206188e-04
8750.00000  8800.00000  2.050467321242e-04
8800.00000  8850.00000  1.827935984053e-04
8850.00000  8900.00000  1.899463913864e-04
8900.00000  8950.00000  2.066362416756e-04
8950.00000  9000.00000  1.804093340783e-04
9000.00000  9050.00000  1.955096748161e-04
9050.00000  9100.00000  1.843831079567e-04
9100.00000  9150.00000  1.796145793026e-04
9150.00000  9200.00000  1.978939391432e-04
9200.00000  9250.00000  1.430558596216e-04
9250.00000  9300.00000  1.875621270594e-04
9300.00000  9350.00000  1.796145793026e-04
9350.00000  9400.00000  1.875621270594e-04
9400.00000  9450.00000  1.772303149756e-04
9450.00000  9500.00000  1.525929169297e-04
9500.00000  9550.00000  1.684880124432e-04
9550.00000  9600.00000  1.764355601999e-04
9600.00000  9650.00000  1.597457099107e-04
9650.00000  9700.00000  1.406715952945e-04
9700.00000  9750.00000  1.573614455837e-04
9750.00000  9800.00000  1.732565410972e-04
9800.00000  9850.00000  1.676932576675e-04
9850.00000  9900.00000  1.502086526026e-04
9900.00000  9950.00000  1.557719360324e-04
9950.00000  10000.00000  1.684880124432e-04
