300.00000  350.00000  6.098753348444e-06
350.00000  400.00000  1.219750669689e-05
400.00000  450.00000  6.457503545411e-06
450.00000  500.00000  7.892504333280e-06
500.00000  550.00000  9.040504963575e-05
550.00000  600.00000  5.740003151476e-06
600.00000  650.00000  2.547126398468e-05
650.00000  700.00000  7.533754136313e-06
700.00000  750.00000  1.614375886353e-05
750.00000  800.00000  1.004500551508e-05
800.00000  850.00000  4.089752245427e-05
850.00000  900.00000  8.610004727215e-06
900.00000  950.00000  9.686255318116e-06
950.00000  1000.00000  6.098753348444e-06
1000.00000  1050.00000  1.076250590902e-05
1050.00000  1100.00000  8.251254530247e-06
1100.00000  1150.00000  9.327505121149e-06
1150.00000  1200.00000  8.968754924182e-06
1200.00000  1250.00000  8.610004727215e-06
1250.00000  1300.00000  4.018002206033e-05
1300.00000  1350.00000  1.722000945443e-05
1350.00000  1400.00000  3.802752087853e-05
1400.00000  1450.00000  5.847628210567e-05
1450.00000  1500.00000  1.043963073175e-04
1500.00000  1550.00000  1.661013411958e-04
1550.00000  1600.00000  2.249363734985e-04
1600.00000  1650.00000  3.142651725433e-04
1650.00000  1700.00000  4.204552308456e-04
1700.00000  1750.00000  6.181265893746e-04
1750.00000  1800.00000  7.357966539799e-04
1800.00000  1850.00000  8.412692118883e-04
1850.00000  1900.00000  8.778617319789e-04
1900.00000  1950.00000  1.047191824947e-03
1950.00000  2000.00000  1.191050653931e-03
2000.00000  2050.00000  1.400919519157e-03
2050.00000  2100.00000  1.652044657034e-03
2100.00000  2150.00000  1.823527251185e-03
2150.00000  2200.00000  2.010794854002e-03
2200.00000  2250.00000  2.176178694803e-03
2250.00000  2300.00000  2.392863813772e-03
2300.00000  2350.00000  2.725066496163e-03
2350.00000  2400.00000  2.776726524527e-03
2400.00000  2450.00000  2.848476563920e-03
2450.00000  2500.00000  2.891526587556e-03
2500.00000  2550.00000  2.901212842874e-03
2550.00000  2600.00000  3.034309165949e-03
2600.00000  2650.00000  3.094937949237e-03
2650.00000  2700.00000  3.203639258918e-03
2700.00000  2750.00000  3.326331826281e-03
2750.00000  2800.00000  3.430728133598e-03
2800.00000  2850.00000  3.454405646598e-03
2850.00000  2900.00000  3.587143219476e-03
2900.00000  2950.00000  3.614408234445e-03
2950.00000  3000.00000  3.687952024824e-03
3000.00000  3050.00000  3.823918349474e-03
3050.00000  3100.00000  3.707324535460e-03
3100.00000  3150.00000  3.768312068944e-03
3150.00000  3200.00000  3.808850841202e-03
3200.00000  3250.00000  3.789119580368e-03
3250.00000  3300.00000  3.776922073671e-03
3300.00000  3350.00000  3.749657058702e-03
3350.00000  3400.00000  3.818178346323e-03
3400.00000  3450.00000  3.780509575641e-03
3450.00000  3500.00000  3.767235818353e-03
3500.00000  3550.00000  3.769388319535e-03
3550.00000  3600.00000  3.761137065005e-03
3600.00000  3650.00000  3.726338295899e-03
3650.00000  3700.00000  3.762213315596e-03
3700.00000  3750.00000  3.650283254142e-03
3750.00000  3800.00000  3.713423288808e-03
3800.00000  3850.00000  3.595753224203e-03
3850.00000  3900.00000  3.559519454309e-03
3900.00000  3950.00000  3.622300738779e-03
3950.00000  4000.00000  3.540505693870e-03
4000.00000  4050.00000  3.507141925552e-03
4050.00000  4100.00000  3.419965627689e-03
4100.00000  4150.00000  3.343910585932e-03
4150.00000  4200.00000  3.309829317220e-03
4200.00000  4250.00000  3.301219312493e-03
4250.00000  4300.00000  3.313058068993e-03
4300.00000  4350.00000  3.304448064266e-03
4350.00000  4400.00000  3.212249263645e-03
4400.00000  4450.00000  3.153772981539e-03
4450.00000  4500.00000  3.165611738039e-03
4500.00000  4550.00000  3.041484169889e-03
4550.00000  4600.00000  3.032515414964e-03
4600.00000  4650.00000  3.051529175404e-03
4650.00000  4700.00000  2.983007887783e-03
4700.00000  4750.00000  3.004532899601e-03
4750.00000  4800.00000  2.933141610404e-03
4800.00000  4850.00000  2.901571593071e-03
4850.00000  4900.00000  2.843812811360e-03
4900.00000  4950.00000  2.809014042254e-03
4950.00000  5000.00000  2.762017766451e-03
5000.00000  5050.00000  2.699595232179e-03
5050.00000  5100.00000  2.678428970558e-03
5100.00000  5150.00000  2.622105189634e-03
5150.00000  5200.00000  2.650087704997e-03
5200.00000  5250.00000  2.626051441800e-03
5250.00000  5300.00000  2.511251378771e-03
5300.00000  5350.00000  2.570086411074e-03
5350.00000  5400.00000  2.473223857892e-03
5400.00000  5450.00000  2.478605110847e-03
5450.00000  5500.00000  2.415465076181e-03
5500.00000  5550.00000  2.354836292893e-03
5550.00000  5600.00000  2.363446297620e-03
5600.00000  5650.00000  2.313221270045e-03
5650.00000  5700.00000  2.290620007636e-03
5700.00000  5750.00000  2.238959979273e-03
5750.00000  5800.00000  2.174026193622e-03
5800.00000  5850.00000  2.184429949334e-03
5850.00000  5900.00000  2.147478679046e-03
5900.00000  5950.00000  2.170797441849e-03
5950.00000  6000.00000  2.125953667228e-03
6000.00000  6050.00000  2.076446140047e-03
6050.00000  6100.00000  2.010436103805e-03
6100.00000  6150.00000  1.989269842184e-03
6150.00000  6200.00000  2.023709861092e-03
6200.00000  6250.00000  1.964874828790e-03
6250.00000  6300.00000  1.948013569532e-03
6300.00000  6350.00000  1.892048538805e-03
6350.00000  6400.00000  2.384612559241e-03
6400.00000  6450.00000  1.829267254336e-03
6450.00000  6500.00000  1.825679752366e-03
6500.00000  6550.00000  1.798055987200e-03
6550.00000  6600.00000  1.787652231488e-03
6600.00000  6650.00000  1.775095974594e-03
6650.00000  6700.00000  1.750342211003e-03
6700.00000  6750.00000  1.754288463170e-03
6750.00000  6800.00000  1.708009687761e-03
6800.00000  6850.00000  1.641640901322e-03
6850.00000  6900.00000  1.687202176337e-03
6900.00000  6950.00000  1.639488400140e-03
6950.00000  7000.00000  1.595003375716e-03
7000.00000  7050.00000  1.603972130641e-03
7050.00000  7100.00000  1.607559632610e-03
7100.00000  7150.00000  1.379753257536e-03
7150.00000  7200.00000  1.377959506551e-03
7200.00000  7250.00000  1.404507021127e-03
7250.00000  7300.00000  1.355716994339e-03
7300.00000  7350.00000  1.343878237839e-03
7350.00000  7400.00000  1.350335741385e-03
7400.00000  7450.00000  1.301904464794e-03
7450.00000  7500.00000  1.329528229961e-03
7500.00000  7550.00000  1.319483224446e-03
7550.00000  7600.00000  1.269975697264e-03
7600.00000  7650.00000  1.272128198446e-03
7650.00000  7700.00000  1.240916931310e-03
7700.00000  7750.00000  1.280020702779e-03
7750.00000  7800.00000  1.232306926583e-03
7800.00000  7850.00000  1.206476912401e-03
7850.00000  7900.00000  1.226208173234e-03
7900.00000  7950.00000  1.182799399401e-03
7950.00000  8000.00000  1.176341895856e-03
8000.00000  8050.00000  1.159121886401e-03
8050.00000  8100.00000  1.138673125174e-03
8100.00000  8150.00000  1.124681867492e-03
8150.00000  8200.00000  1.137238124386e-03
8200.00000  8250.00000  1.104233106265e-03
8250.00000  8300.00000  1.111408110205e-03
8300.00000  8350.00000  1.097775602720e-03
8350.00000  8400.00000  1.069434337159e-03
8400.00000  8450.00000  1.052931828099e-03
8450.00000  8500.00000  1.051855577508e-03
8500.00000  8550.00000  1.038581820220e-03
8550.00000  8600.00000  1.052931828099e-03
8600.00000  8650.00000  1.034994318251e-03
8650.00000  8700.00000  1.018850559387e-03
8700.00000  8750.00000  9.858455412661e-04
8750.00000  8800.00000  9.912267942206e-04
8800.00000  8850.00000  9.392080156603e-04
8850.00000  8900.00000  9.940967957963e-04
8900.00000  8950.00000  9.628855286602e-04
8950.00000  9000.00000  9.765180361449e-04
9000.00000  9050.00000  9.707780329934e-04
9050.00000  9100.00000  9.230642567968e-04
9100.00000  9150.00000  9.363380140846e-04
9150.00000  9200.00000  9.022567453727e-04
9200.00000  9250.00000  8.879067374940e-04
9250.00000  9300.00000  8.979517430091e-04
9300.00000  9350.00000  8.767854813880e-04
9350.00000  9400.00000  8.897004884788e-04
9400.00000  9450.00000  8.810904837516e-04
9450.00000  9500.00000  8.760679809941e-04
9500.00000  9550.00000  8.308654561762e-04
9550.00000  9600.00000  8.717629786305e-04
9600.00000  9650.00000  8.627942237063e-04
9650.00000  9700.00000  8.272779542065e-04
9700.00000  9750.00000  8.082641937673e-04
9750.00000  9800.00000  7.892504333280e-04
9800.00000  9850.00000  8.161566981005e-04
9850.00000  9900.00000  7.992954388431e-04
9900.00000  9950.00000  7.856629313583e-04
9950.00000  10000.00000  8.032416910097e-04
