300.00000  350.00000  9.003520174170e-06
350.00000  400.00000  2.550997382682e-05
400.00000  450.00000  2.025792039188e-05
450.00000  500.00000  1.350528026126e-05
500.00000  550.00000  1.545604296566e-04
550.00000  600.00000  1.200469356556e-05
600.00000  650.00000  3.676437404453e-05
650.00000  700.00000  2.025792039188e-05
700.00000  750.00000  2.776085387036e-05
750.00000  800.00000  2.100821373973e-05
800.00000  850.00000  6.752640130628e-05
850.00000  900.00000  1.650645365265e-05
900.00000  950.00000  1.800704034834e-05
950.00000  1000.00000  1.500586695695e-05
1000.00000  1050.00000  1.650645365265e-05
1050.00000  1100.00000  1.500586695695e-05
1100.00000  1150.00000  9.753813522018e-06
1150.00000  1200.00000  1.875733369619e-05
1200.00000  1250.00000  2.776085387036e-05
1250.00000  1300.00000  6.152405452350e-05
1300.00000  1350.00000  3.526378734883e-05
1350.00000  1400.00000  6.977728134982e-05
1400.00000  1450.00000  1.192966423078e-04
1450.00000  1500.00000  1.905745103533e-04
1500.00000  1550.00000  2.716061919208e-04
1550.00000  1600.00000  3.578899269233e-04
1600.00000  1650.00000  4.861900894052e-04
1650.00000  1700.00000  6.422511057575e-04
1700.00000  1750.00000  9.071046575477e-04
1750.00000  1800.00000  1.015146899638e-03
1800.00000  1850.00000  1.207972290035e-03
1850.00000  1900.00000  1.175709676077e-03
1900.00000  1950.00000  1.415803547388e-03
1950.00000  2000.00000  1.707667659701e-03
2000.00000  2050.00000  1.935006544099e-03
2050.00000  2100.00000  2.132333694583e-03
2100.00000  2150.00000  2.325159084980e-03
2150.00000  2200.00000  2.562251782899e-03
2200.00000  2250.00000  2.776835680384e-03
2250.00000  2300.00000  3.062697445914e-03
2300.00000  2350.00000  3.258524009702e-03
2350.00000  2400.00000  3.275780756702e-03
2400.00000  2450.00000  3.394327105662e-03
2450.00000  2500.00000  3.314796010790e-03
2500.00000  2550.00000  3.343307158009e-03
2550.00000  2600.00000  3.357562731618e-03
2600.00000  2650.00000  3.575898095841e-03
2650.00000  2700.00000  3.655429190713e-03
2700.00000  2750.00000  3.617914523321e-03
2750.00000  2800.00000  3.837750474240e-03
2800.00000  2850.00000  3.794983753413e-03
2850.00000  2900.00000  3.785980233239e-03
2900.00000  2950.00000  3.958547703244e-03
2950.00000  3000.00000  3.950294476417e-03
3000.00000  3050.00000  3.920282742503e-03
3050.00000  3100.00000  3.930786849373e-03
3100.00000  3150.00000  3.871513674893e-03
3150.00000  3200.00000  3.882017781763e-03
3200.00000  3250.00000  3.766472606195e-03
3250.00000  3300.00000  3.788981406630e-03
3300.00000  3350.00000  3.749215859194e-03
3350.00000  3400.00000  3.757469086020e-03
3400.00000  3450.00000  3.658430364105e-03
3450.00000  3500.00000  3.698195911540e-03
3500.00000  3550.00000  3.702697671628e-03
3550.00000  3600.00000  3.677937991149e-03
3600.00000  3650.00000  3.542885188536e-03
3650.00000  3700.00000  3.539884015145e-03
3700.00000  3750.00000  3.501619054404e-03
3750.00000  3800.00000  3.471607320491e-03
3800.00000  3850.00000  3.402580332489e-03
3850.00000  3900.00000  3.284033983529e-03
3900.00000  3950.00000  3.391325932271e-03
3950.00000  4000.00000  3.211255528787e-03
4000.00000  4050.00000  3.147480594220e-03
4050.00000  4100.00000  3.080704486262e-03
4100.00000  4150.00000  2.999672804694e-03
4150.00000  4200.00000  3.123471207089e-03
4200.00000  4250.00000  3.043940112217e-03
4250.00000  4300.00000  2.933646990084e-03
4300.00000  4350.00000  2.863119415386e-03
4350.00000  4400.00000  2.941149923562e-03
4400.00000  4450.00000  2.898383202735e-03
4450.00000  4500.00000  2.782838027167e-03
4500.00000  4550.00000  2.707058399034e-03
4550.00000  4600.00000  2.702556638947e-03
4600.00000  4650.00000  2.562251782899e-03
4650.00000  4700.00000  2.607269383770e-03
4700.00000  4750.00000  2.586261170030e-03
4750.00000  4800.00000  2.478969221288e-03
4800.00000  4850.00000  2.392685486286e-03
4850.00000  4900.00000  2.398687833069e-03
4900.00000  4950.00000  2.298898817805e-03
4950.00000  5000.00000  2.278640897413e-03
5000.00000  5050.00000  2.237374763281e-03
5050.00000  5100.00000  2.210364202759e-03
5100.00000  5150.00000  2.200610389237e-03
5150.00000  5200.00000  2.196858922498e-03
5200.00000  5250.00000  2.069309053364e-03
5250.00000  5300.00000  2.151091028279e-03
5300.00000  5350.00000  2.025792039188e-03
5350.00000  5400.00000  1.993529425231e-03
5400.00000  5450.00000  1.969520038100e-03
5450.00000  5500.00000  1.893740409967e-03
5500.00000  5550.00000  1.824713421965e-03
5550.00000  5600.00000  1.886987769837e-03
5600.00000  5650.00000  1.874983076271e-03
5650.00000  5700.00000  1.757937314007e-03
5700.00000  5750.00000  1.720422646614e-03
5750.00000  5800.00000  1.678406219135e-03
5800.00000  5850.00000  1.708417953049e-03
5850.00000  5900.00000  1.710668833092e-03
5900.00000  5950.00000  1.648394485221e-03
5950.00000  6000.00000  1.625135391438e-03
6000.00000  6050.00000  1.625135391438e-03
6050.00000  6100.00000  1.530598429609e-03
6100.00000  6150.00000  1.542603123175e-03
6150.00000  6200.00000  1.479578481955e-03
6200.00000  6250.00000  1.502837575739e-03
6250.00000  6300.00000  1.481079068651e-03
6300.00000  6350.00000  1.397046213692e-03
6350.00000  6400.00000  1.786448461225e-03
6400.00000  6450.00000  1.387292400170e-03
6450.00000  6500.00000  1.342274799299e-03
6500.00000  6550.00000  1.324267758951e-03
6550.00000  6600.00000  1.319015705516e-03
6600.00000  6650.00000  1.325018052299e-03
6650.00000  6700.00000  1.280000451428e-03
6700.00000  6750.00000  1.217726103557e-03
6750.00000  6800.00000  1.224478743687e-03
6800.00000  6850.00000  1.151700288946e-03
6850.00000  6900.00000  1.204220823295e-03
6900.00000  6950.00000  1.199719063208e-03
6950.00000  7000.00000  1.135193835293e-03
7000.00000  7050.00000  1.174209089381e-03
7050.00000  7100.00000  1.141946475424e-03
7100.00000  7150.00000  1.081172714248e-03
7150.00000  7200.00000  1.008394259507e-03
7200.00000  7250.00000  1.009144552855e-03
7250.00000  7300.00000  9.746310588539e-04
7300.00000  7350.00000  9.768819388975e-04
7350.00000  7400.00000  9.341152180702e-04
7400.00000  7450.00000  9.618760719405e-04
7450.00000  7500.00000  9.288631646352e-04
7500.00000  7550.00000  9.371163914616e-04
7550.00000  7600.00000  8.793438036773e-04
7600.00000  7650.00000  8.740917502424e-04
7650.00000  7700.00000  9.371163914616e-04
7700.00000  7750.00000  8.335759094586e-04
7750.00000  7800.00000  8.313250294151e-04
7800.00000  7850.00000  8.275735626758e-04
7850.00000  7900.00000  8.523332431548e-04
7900.00000  7950.00000  8.500823631113e-04
7950.00000  8000.00000  8.253226826323e-04
8000.00000  8050.00000  7.810553751093e-04
8050.00000  8100.00000  8.185700425017e-04
8100.00000  8150.00000  8.013132955012e-04
8150.00000  8200.00000  7.690506815437e-04
8200.00000  8250.00000  7.622980414131e-04
8250.00000  8300.00000  7.292851341078e-04
8300.00000  8350.00000  7.532945212389e-04
8350.00000  8400.00000  7.517939345432e-04
8400.00000  8450.00000  7.450412944126e-04
8450.00000  8500.00000  6.992734001939e-04
8500.00000  8550.00000  7.270342540643e-04
8550.00000  8600.00000  6.835172398891e-04
8600.00000  8650.00000  6.790154798020e-04
8650.00000  8700.00000  6.820166531934e-04
8700.00000  8750.00000  6.595078527580e-04
8750.00000  8800.00000  6.640096128451e-04
8800.00000  8850.00000  6.264949454527e-04
8850.00000  8900.00000  6.445019858010e-04
8900.00000  8950.00000  6.107387851479e-04
8950.00000  9000.00000  6.497540392360e-04
9000.00000  9050.00000  6.430013991053e-04
9050.00000  9100.00000  5.814773445818e-04
9100.00000  9150.00000  5.807270512340e-04
9150.00000  9200.00000  6.182417186264e-04
9200.00000  9250.00000  6.159908385828e-04
9250.00000  9300.00000  5.957329181909e-04
9300.00000  9350.00000  5.949826248431e-04
9350.00000  9400.00000  5.522159040158e-04
9400.00000  9450.00000  5.567176641029e-04
9450.00000  9500.00000  5.642205975813e-04
9500.00000  9550.00000  5.477141439287e-04
9550.00000  9600.00000  5.199532900583e-04
9600.00000  9650.00000  5.304573969282e-04
9650.00000  9700.00000  5.229544634497e-04
9700.00000  9750.00000  5.402112104502e-04
9750.00000  9800.00000  5.319579836239e-04
9800.00000  9850.00000  5.132006499277e-04
9850.00000  9900.00000  5.056977164492e-04
9900.00000  9950.00000  4.764362758832e-04
9950.00000  10000.00000  4.779368625789e-04
