300.00000  350.00000  2.050340810073e+00
350.00000  400.00000  1.452200835470e+00
400.00000  450.00000  1.072708591610e+00
450.00000  500.00000  8.201032578719e-01
500.00000  550.00000  6.452279699139e-01
550.00000  600.00000  5.179292222935e-01
600.00000  650.00000  4.241211299073e-01
650.00000  700.00000  3.526453541435e-01
700.00000  750.00000  2.952428030174e-01
750.00000  800.00000  2.519194343953e-01
800.00000  850.00000  2.168060053618e-01
850.00000  900.00000  1.880890904000e-01
900.00000  950.00000  1.647379786618e-01
950.00000  1000.00000  1.455484364466e-01
1000.00000  1050.00000  1.290004631465e-01
1050.00000  1100.00000  1.154023783362e-01
1100.00000  1150.00000  1.034821775873e-01
1150.00000  1200.00000  9.273567647477e-02
1200.00000  1250.00000  8.373706435125e-02
1250.00000  1300.00000  7.623983450374e-02
1300.00000  1350.00000  6.966235024694e-02
1350.00000  1400.00000  6.358011361591e-02
1400.00000  1450.00000  5.843028304121e-02
1450.00000  1500.00000  5.384049188692e-02
1500.00000  1550.00000  4.969083809629e-02
1550.00000  1600.00000  4.617346285344e-02
1600.00000  1650.00000  4.248554369134e-02
1650.00000  1700.00000  3.931223522007e-02
1700.00000  1750.00000  3.670864770175e-02
1750.00000  1800.00000  3.440965609162e-02
1800.00000  1850.00000  3.246888118523e-02
1850.00000  1900.00000  3.021233937158e-02
1900.00000  1950.00000  2.835050619201e-02
1950.00000  2000.00000  2.630174496121e-02
2000.00000  2050.00000  2.528220511207e-02
2050.00000  2100.00000  2.375922557118e-02
2100.00000  2150.00000  2.225337489554e-02
2150.00000  2200.00000  2.116829851849e-02
2200.00000  2250.00000  2.001396194715e-02
2250.00000  2300.00000  1.872706285343e-02
2300.00000  2350.00000  1.803743984371e-02
2350.00000  2400.00000  1.700151586260e-02
2400.00000  2450.00000  1.616890406469e-02
2450.00000  2500.00000  1.562226984317e-02
2500.00000  2550.00000  1.482689470886e-02
2550.00000  2600.00000  1.424600275683e-02
2600.00000  2650.00000  1.357499807891e-02
2650.00000  2700.00000  1.273493894829e-02
2700.00000  2750.00000  1.230373838390e-02
2750.00000  2800.00000  1.179731975905e-02
2800.00000  2850.00000  1.118961740924e-02
2850.00000  2900.00000  1.074948004559e-02
2900.00000  2950.00000  1.025721135291e-02
2950.00000  3000.00000  9.843139653772e-03
3000.00000  3050.00000  9.615251272592e-03
3050.00000  3100.00000  9.338955228743e-03
3100.00000  3150.00000  8.801257806482e-03
3150.00000  3200.00000  8.457935768169e-03
3200.00000  3250.00000  8.269518250396e-03
3250.00000  3300.00000  7.817465154396e-03
3300.00000  3350.00000  7.632026569710e-03
3350.00000  3400.00000  7.241041601999e-03
3400.00000  3450.00000  7.045921484780e-03
3450.00000  3500.00000  6.838885635211e-03
3500.00000  3550.00000  6.588655255877e-03
3550.00000  3600.00000  6.452369067132e-03
3600.00000  3650.00000  6.077023498130e-03
3650.00000  3700.00000  6.044255234169e-03
3700.00000  3750.00000  5.802961654096e-03
3750.00000  3800.00000  5.683059597332e-03
3800.00000  3850.00000  5.511026211539e-03
3850.00000  3900.00000  5.212388169536e-03
3900.00000  3950.00000  5.003862853423e-03
3950.00000  4000.00000  4.877258197212e-03
4000.00000  4050.00000  4.837042600533e-03
4050.00000  4100.00000  4.686606479624e-03
4100.00000  4150.00000  4.420736701581e-03
4150.00000  4200.00000  4.429673500843e-03
4200.00000  4250.00000  4.329879242417e-03
4250.00000  4300.00000  4.156356390081e-03
4300.00000  4350.00000  4.138482791557e-03
4350.00000  4400.00000  3.978365138114e-03
4400.00000  4450.00000  3.777287154720e-03
4450.00000  4500.00000  3.613445834917e-03
4500.00000  4550.00000  3.552377706627e-03
4550.00000  4600.00000  3.589614370219e-03
4600.00000  4650.00000  3.449604515115e-03
4650.00000  4700.00000  3.346086590330e-03
4700.00000  4750.00000  3.256718597711e-03
4750.00000  4800.00000  3.103303543714e-03
4800.00000  4850.00000  3.085429945190e-03
4850.00000  4900.00000  3.127879741684e-03
4900.00000  4950.00000  2.920099158844e-03
4950.00000  5000.00000  2.891054561243e-03
5000.00000  5050.00000  2.803176035167e-03
5050.00000  5100.00000  2.727957974712e-03
5100.00000  5150.00000  2.605821718132e-03
5150.00000  5200.00000  2.556669322191e-03
5200.00000  5250.00000  2.511985325881e-03
5250.00000  5300.00000  2.565606121453e-03
5300.00000  5350.00000  2.412191067456e-03
5350.00000  5400.00000  2.345165072991e-03
5400.00000  5450.00000  2.323567808108e-03
5450.00000  5500.00000  2.327291474468e-03
5500.00000  5550.00000  2.236434015304e-03
5550.00000  5600.00000  2.173131687199e-03
5600.00000  5650.00000  2.118021425083e-03
5650.00000  5700.00000  2.110574092365e-03
5700.00000  5750.00000  2.086742627667e-03
5750.00000  5800.00000  1.963861637815e-03
5800.00000  5850.00000  1.922156574592e-03
5850.00000  5900.00000  1.870025245564e-03
5900.00000  5950.00000  1.835022781788e-03
5950.00000  6000.00000  1.788104585663e-03
6000.00000  6050.00000  1.825341249254e-03
6050.00000  6100.00000  1.797041384925e-03
6100.00000  6150.00000  1.772465186955e-03
6150.00000  6200.00000  1.679373527976e-03
6200.00000  6250.00000  1.724802257557e-03
6250.00000  6300.00000  1.680118261248e-03
6300.00000  6350.00000  1.604900200793e-03
6350.00000  6400.00000  1.681607727791e-03
6400.00000  6450.00000  1.607134400608e-03
6450.00000  6500.00000  1.535640006513e-03
6500.00000  6550.00000  1.549789938677e-03
6550.00000  6600.00000  1.495424409834e-03
6600.00000  6650.00000  1.431377348457e-03
6650.00000  6700.00000  1.441803614262e-03
6700.00000  6750.00000  1.365840820536e-03
6750.00000  6800.00000  1.311475291692e-03
6800.00000  6850.00000  1.367330287079e-03
6850.00000  6900.00000  1.289878026809e-03
6900.00000  6950.00000  1.339030422750e-03
6950.00000  7000.00000  1.269770228470e-03
7000.00000  7050.00000  1.225830965432e-03
7050.00000  7100.00000  1.243704563955e-03
7100.00000  7150.00000  1.193807434743e-03
7150.00000  7200.00000  1.213170499810e-03
7200.00000  7250.00000  1.133484039725e-03
7250.00000  7300.00000  1.131249839909e-03
7300.00000  7350.00000  1.106673641939e-03
7350.00000  7400.00000  1.131994573181e-03
7400.00000  7450.00000  1.075394844522e-03
7450.00000  7500.00000  1.064223845445e-03
7500.00000  7550.00000  1.060500179085e-03
7550.00000  7600.00000  1.094757909590e-03
7600.00000  7650.00000  1.024008248766e-03
7650.00000  7700.00000  1.041137114018e-03
7700.00000  7750.00000  9.718769197377e-04
7750.00000  7800.00000  9.763453193686e-04
7800.00000  7850.00000  9.830479188151e-04
7850.00000  7900.00000  9.584717208447e-04
7900.00000  7950.00000  9.405981223208e-04
7950.00000  8000.00000  9.592164541166e-04
8000.00000  8050.00000  9.033614587293e-04
8050.00000  8100.00000  8.936799261955e-04
8100.00000  8150.00000  8.743168611280e-04
8150.00000  8200.00000  8.847431269336e-04
8200.00000  8250.00000  8.810194605744e-04
8250.00000  8300.00000  8.564432626041e-04
8300.00000  8350.00000  8.892115265646e-04
8350.00000  8400.00000  8.035672003042e-04
8400.00000  8450.00000  7.998435339450e-04
8450.00000  8500.00000  7.469674716451e-04
8500.00000  8550.00000  7.715436696155e-04
8550.00000  8600.00000  7.499464047324e-04
8600.00000  8650.00000  7.909067346831e-04
8650.00000  8700.00000  7.417543387423e-04
8700.00000  8750.00000  7.648410701690e-04
8750.00000  8800.00000  7.209018071311e-04
8800.00000  8850.00000  6.784520106368e-04
8850.00000  8900.00000  6.754730775495e-04
8900.00000  8950.00000  7.097308080536e-04
8950.00000  9000.00000  7.119650078691e-04
9000.00000  9050.00000  6.985598089762e-04
9050.00000  9100.00000  6.777072773650e-04
9100.00000  9150.00000  5.965313507355e-04
9150.00000  9200.00000  6.464284799481e-04
9200.00000  9250.00000  6.374916806862e-04
9250.00000  9300.00000  6.523863461227e-04
9300.00000  9350.00000  6.337680143270e-04
9350.00000  9400.00000  6.248312150651e-04
9400.00000  9450.00000  6.054681499975e-04
9450.00000  9500.00000  6.255759483369e-04
9500.00000  9550.00000  6.054681499975e-04
9550.00000  9600.00000  6.099365496285e-04
9600.00000  9650.00000  5.801472187553e-04
9650.00000  9700.00000  5.578052206004e-04
9700.00000  9750.00000  5.578052206004e-04
9750.00000  9800.00000  5.317395560864e-04
9800.00000  9850.00000  5.570604873286e-04
9850.00000  9900.00000  5.406763553483e-04
9900.00000  9950.00000  5.444000217075e-04
9950.00000  10000.00000  5.257816899117e-04
