300.00000  350.00000  7.243700831277e-06
350.00000  400.00000  1.207283471880e-05
400.00000  450.00000  1.046312342296e-05
450.00000  500.00000  1.207283471880e-05
500.00000  550.00000  1.070458011733e-04
550.00000  600.00000  8.853412127117e-06
600.00000  650.00000  3.219422591679e-05
650.00000  700.00000  1.287769036672e-05
700.00000  750.00000  2.897480332511e-05
750.00000  800.00000  1.690196860631e-05
800.00000  850.00000  5.955931794606e-05
850.00000  900.00000  1.448740166255e-05
900.00000  950.00000  1.287769036672e-05
950.00000  1000.00000  9.658267775036e-06
1000.00000  1050.00000  1.931653555007e-05
1050.00000  1100.00000  1.851167990215e-05
1100.00000  1150.00000  2.092624684591e-05
1150.00000  1200.00000  2.897480332511e-05
1200.00000  1250.00000  1.931653555007e-05
1250.00000  1300.00000  4.829133887518e-05
1300.00000  1350.00000  1.529225731047e-05
1350.00000  1400.00000  2.012139119799e-05
1400.00000  1450.00000  2.253595814175e-05
1450.00000  1500.00000  2.736509202927e-05
1500.00000  1550.00000  3.138937026887e-05
1550.00000  1600.00000  2.012139119799e-05
1600.00000  1650.00000  2.495052508551e-05
1650.00000  1700.00000  2.414566943759e-05
1700.00000  1750.00000  7.324186396069e-05
1750.00000  1800.00000  2.656023638135e-05
1800.00000  1850.00000  3.702335980431e-05
1850.00000  1900.00000  2.334081378967e-05
1900.00000  1950.00000  2.414566943759e-05
1950.00000  2000.00000  2.334081378967e-05
2000.00000  2050.00000  2.656023638135e-05
2050.00000  2100.00000  2.092624684591e-05
2100.00000  2150.00000  2.736509202927e-05
2150.00000  2200.00000  3.219422591679e-05
2200.00000  2250.00000  3.219422591679e-05
2250.00000  2300.00000  2.977965897303e-05
2300.00000  2350.00000  8.531469867949e-05
2350.00000  2400.00000  4.265734933974e-05
2400.00000  2450.00000  3.299908156471e-05
2450.00000  2500.00000  4.668162757934e-05
2500.00000  2550.00000  3.702335980431e-05
2550.00000  2600.00000  3.138937026887e-05
2600.00000  2650.00000  3.299908156471e-05
2650.00000  2700.00000  3.702335980431e-05
2700.00000  2750.00000  4.024278239598e-05
2750.00000  2800.00000  3.702335980431e-05
2800.00000  2850.00000  4.346220498766e-05
2850.00000  2900.00000  3.621850415639e-05
2900.00000  2950.00000  4.990105017102e-05
2950.00000  3000.00000  8.531469867949e-05
3000.00000  3050.00000  5.231561711478e-05
3050.00000  3100.00000  4.990105017102e-05
3100.00000  3150.00000  6.599816312942e-05
3150.00000  3200.00000  7.565643090445e-05
3200.00000  3250.00000  6.841273007317e-05
3250.00000  3300.00000  7.163215266485e-05
3300.00000  3350.00000  8.209527608781e-05
3350.00000  3400.00000  8.048556479197e-05
3400.00000  3450.00000  1.046312342296e-04
3450.00000  3500.00000  9.819238904620e-05
3500.00000  3550.00000  1.102652237650e-04
3550.00000  3600.00000  1.263623367234e-04
3600.00000  3650.00000  1.360206044984e-04
3650.00000  3700.00000  1.835070877257e-04
3700.00000  3750.00000  1.440691609776e-04
3750.00000  3800.00000  1.714342530069e-04
3800.00000  3850.00000  1.843119433736e-04
3850.00000  3900.00000  1.770682425423e-04
3900.00000  3950.00000  1.979944893882e-04
3950.00000  4000.00000  1.891410772611e-04
4000.00000  4050.00000  2.116770354029e-04
4050.00000  4100.00000  1.827022320778e-04
4100.00000  4150.00000  2.366275604884e-04
4150.00000  4200.00000  2.245547257696e-04
4200.00000  4250.00000  2.334081378967e-04
4250.00000  4300.00000  2.535295290947e-04
4300.00000  4350.00000  2.438712613197e-04
4350.00000  4400.00000  2.511149621509e-04
4400.00000  4450.00000  2.784800541802e-04
4450.00000  4500.00000  2.905528888990e-04
4500.00000  4550.00000  2.776751985323e-04
4550.00000  4600.00000  2.833091880677e-04
4600.00000  4650.00000  2.800897654761e-04
4650.00000  4700.00000  2.720412089969e-04
4700.00000  4750.00000  3.155034139845e-04
4750.00000  4800.00000  3.042354349136e-04
4800.00000  4850.00000  3.283811043512e-04
4850.00000  4900.00000  3.283811043512e-04
4900.00000  4950.00000  3.275762487033e-04
4950.00000  5000.00000  3.259665374075e-04
5000.00000  5050.00000  3.211374035200e-04
5050.00000  5100.00000  3.420636503659e-04
5100.00000  5150.00000  3.243568261116e-04
5150.00000  5200.00000  3.138937026887e-04
5200.00000  5250.00000  3.436733616617e-04
5250.00000  5300.00000  3.299908156471e-04
5300.00000  5350.00000  3.307956712950e-04
5350.00000  5400.00000  3.227471148158e-04
5400.00000  5450.00000  3.468927842534e-04
5450.00000  5500.00000  3.227471148158e-04
5500.00000  5550.00000  3.259665374075e-04
5550.00000  5600.00000  3.138937026887e-04
5600.00000  5650.00000  3.428685060138e-04
5650.00000  5700.00000  3.179179809283e-04
5700.00000  5750.00000  3.356248051825e-04
5750.00000  5800.00000  3.259665374075e-04
5800.00000  5850.00000  3.138937026887e-04
5850.00000  5900.00000  3.509170624930e-04
5900.00000  5950.00000  3.251616817596e-04
5950.00000  6000.00000  3.074548575053e-04
6000.00000  6050.00000  3.082597131532e-04
6050.00000  6100.00000  3.324053825908e-04
6100.00000  6150.00000  3.340150938867e-04
6150.00000  6200.00000  3.163082696324e-04
6200.00000  6250.00000  3.372345164784e-04
6250.00000  6300.00000  3.855258553535e-04
6300.00000  6350.00000  3.694287423951e-04
6350.00000  6400.00000  1.440691609776e-03
6400.00000  6450.00000  2.873334663073e-04
6450.00000  6500.00000  3.066500018574e-04
6500.00000  6550.00000  3.146985583366e-04
6550.00000  6600.00000  2.953820227865e-04
6600.00000  6650.00000  2.881383219553e-04
6650.00000  6700.00000  2.945771671386e-04
6700.00000  6750.00000  2.688217864052e-04
6750.00000  6800.00000  2.583586629822e-04
6800.00000  6850.00000  2.567489516864e-04
6850.00000  6900.00000  2.631877968697e-04
6900.00000  6950.00000  2.873334663073e-04
6950.00000  7000.00000  2.503101065030e-04
7000.00000  7050.00000  2.495052508551e-04
7050.00000  7100.00000  3.605753302680e-04
7100.00000  7150.00000  1.505080061610e-04
7150.00000  7200.00000  1.497031505131e-04
7200.00000  7250.00000  1.352157488505e-04
7250.00000  7300.00000  1.553371400485e-04
7300.00000  7350.00000  1.682148304152e-04
7350.00000  7400.00000  1.488982948651e-04
7400.00000  7450.00000  1.392400270901e-04
7450.00000  7500.00000  1.649954078235e-04
7500.00000  7550.00000  1.352157488505e-04
7550.00000  7600.00000  1.239477697796e-04
7600.00000  7650.00000  1.400448827380e-04
7650.00000  7700.00000  1.263623367234e-04
7700.00000  7750.00000  1.505080061610e-04
7750.00000  7800.00000  1.424594496818e-04
7800.00000  7850.00000  1.070458011733e-04
7850.00000  7900.00000  1.480934392172e-04
7900.00000  7950.00000  1.352157488505e-04
7950.00000  8000.00000  1.199234915400e-04
8000.00000  8050.00000  1.416545940339e-04
8050.00000  8100.00000  1.368254601463e-04
8100.00000  8150.00000  1.118749350608e-04
8150.00000  8200.00000  1.376303157943e-04
8200.00000  8250.00000  1.432643053297e-04
8250.00000  8300.00000  1.158992133004e-04
8300.00000  8350.00000  1.319963262588e-04
8350.00000  8400.00000  1.191186358921e-04
8400.00000  8450.00000  1.142895020046e-04
8450.00000  8500.00000  1.150943576525e-04
8500.00000  8550.00000  1.118749350608e-04
8550.00000  8600.00000  1.142895020046e-04
8600.00000  8650.00000  1.175089245963e-04
8650.00000  8700.00000  1.022166672858e-04
8700.00000  8750.00000  1.215332028359e-04
8750.00000  8800.00000  8.692440997533e-05
8800.00000  8850.00000  1.078506568212e-04
8850.00000  8900.00000  1.199234915400e-04
8900.00000  8950.00000  1.158992133004e-04
8950.00000  9000.00000  9.980210034204e-05
9000.00000  9050.00000  1.006069559900e-04
9050.00000  9100.00000  1.014118116379e-04
9100.00000  9150.00000  1.134846463567e-04
9150.00000  9200.00000  1.118749350608e-04
9200.00000  9250.00000  1.078506568212e-04
9250.00000  9300.00000  1.070458011733e-04
9300.00000  9350.00000  9.577782210244e-05
9350.00000  9400.00000  1.134846463567e-04
9400.00000  9450.00000  1.006069559900e-04
9450.00000  9500.00000  8.611955432741e-05
9500.00000  9550.00000  8.772926562325e-05
9550.00000  9600.00000  9.658267775036e-05
9600.00000  9650.00000  8.611955432741e-05
9650.00000  9700.00000  8.772926562325e-05
9700.00000  9750.00000  9.738753339828e-05
9750.00000  9800.00000  8.531469867949e-05
9800.00000  9850.00000  7.968070914405e-05
9850.00000  9900.00000  9.094868821493e-05
9900.00000  9950.00000  9.336325515868e-05
9950.00000  10000.00000  9.014383256701e-05
