300.00000  350.00000  0.000000000000e+00
350.00000  400.00000  0.000000000000e+00
400.00000  450.00000  0.000000000000e+00
450.00000  500.00000  0.000000000000e+00
500.00000  550.00000  3.617099114976e-06
550.00000  600.00000  0.000000000000e+00
600.00000  650.00000  1.808549557488e-06
650.00000  700.00000  0.000000000000e+00
700.00000  750.00000  0.000000000000e+00
750.00000  800.00000  0.000000000000e+00
800.00000  850.00000  5.425648672465e-06
850.00000  900.00000  0.000000000000e+00
900.00000  950.00000  0.000000000000e+00
950.00000  1000.00000  0.000000000000e+00
1000.00000  1050.00000  7.234198229953e-07
1050.00000  1100.00000  3.617099114976e-07
1100.00000  1150.00000  1.085129734493e-06
1150.00000  1200.00000  7.234198229953e-07
1200.00000  1250.00000  2.170259468986e-06
1250.00000  1300.00000  1.193642707942e-05
1300.00000  1350.00000  1.446839645991e-06
1350.00000  1400.00000  2.170259468986e-06
1400.00000  1450.00000  3.617099114976e-06
1450.00000  1500.00000  3.978809026474e-06
1500.00000  1550.00000  2.893679291981e-06
1550.00000  1600.00000  4.702228849469e-06
1600.00000  1650.00000  2.170259468986e-06
1650.00000  1700.00000  5.425648672465e-06
1700.00000  1750.00000  3.002192265430e-05
1750.00000  1800.00000  5.063938760967e-06
1800.00000  1850.00000  7.595908141450e-06
1850.00000  1900.00000  1.121300725643e-05
1900.00000  1950.00000  6.149068495460e-06
1950.00000  2000.00000  9.042747787441e-06
2000.00000  2050.00000  7.234198229953e-06
2050.00000  2100.00000  7.595908141450e-06
2100.00000  2150.00000  6.510778406958e-06
2150.00000  2200.00000  7.957618052948e-06
2200.00000  2250.00000  1.048958743343e-05
2250.00000  2300.00000  1.048958743343e-05
2300.00000  2350.00000  4.557544884870e-05
2350.00000  2400.00000  1.374497663691e-05
2400.00000  2450.00000  7.957618052948e-06
2450.00000  2500.00000  1.627694601739e-05
2500.00000  2550.00000  1.121300725643e-05
2550.00000  2600.00000  1.157471716792e-05
2600.00000  2650.00000  1.338326672541e-05
2650.00000  2700.00000  9.404457698939e-06
2700.00000  2750.00000  1.483010637140e-05
2750.00000  2800.00000  1.012787752193e-05
2800.00000  2850.00000  1.338326672541e-05
2850.00000  2900.00000  1.302155681392e-05
2900.00000  2950.00000  1.591523610590e-05
2950.00000  3000.00000  2.423456407034e-05
3000.00000  3050.00000  1.229813699092e-05
3050.00000  3100.00000  1.410668654841e-05
3100.00000  3150.00000  1.265984690242e-05
3150.00000  3200.00000  1.736207575189e-05
3200.00000  3250.00000  1.483010637140e-05
3250.00000  3300.00000  8.681037875943e-06
3300.00000  3350.00000  1.338326672541e-05
3350.00000  3400.00000  1.410668654841e-05
3400.00000  3450.00000  1.555352619440e-05
3450.00000  3500.00000  1.374497663691e-05
3500.00000  3550.00000  1.265984690242e-05
3550.00000  3600.00000  1.808549557488e-05
3600.00000  3650.00000  1.265984690242e-05
3650.00000  3700.00000  2.640482353933e-05
3700.00000  3750.00000  1.736207575189e-05
3750.00000  3800.00000  1.555352619440e-05
3800.00000  3850.00000  1.772378566338e-05
3850.00000  3900.00000  1.338326672541e-05
3900.00000  3950.00000  1.085129734493e-05
3950.00000  4000.00000  1.736207575189e-05
4000.00000  4050.00000  1.410668654841e-05
4050.00000  4100.00000  1.229813699092e-05
4100.00000  4150.00000  1.627694601739e-05
4150.00000  4200.00000  1.555352619440e-05
4200.00000  4250.00000  1.410668654841e-05
4250.00000  4300.00000  1.374497663691e-05
4300.00000  4350.00000  1.555352619440e-05
4350.00000  4400.00000  1.772378566338e-05
4400.00000  4450.00000  1.627694601739e-05
4450.00000  4500.00000  1.555352619440e-05
4500.00000  4550.00000  2.025575504387e-05
4550.00000  4600.00000  1.989404513237e-05
4600.00000  4650.00000  1.591523610590e-05
4650.00000  4700.00000  1.121300725643e-05
4700.00000  4750.00000  2.097917486686e-05
4750.00000  4800.00000  1.953233522087e-05
4800.00000  4850.00000  1.736207575189e-05
4850.00000  4900.00000  1.483010637140e-05
4900.00000  4950.00000  1.555352619440e-05
4950.00000  5000.00000  1.844720548638e-05
5000.00000  5050.00000  1.265984690242e-05
5050.00000  5100.00000  1.265984690242e-05
5100.00000  5150.00000  2.061746495537e-05
5150.00000  5200.00000  1.555352619440e-05
5200.00000  5250.00000  2.242601451285e-05
5250.00000  5300.00000  1.483010637140e-05
5300.00000  5350.00000  1.880891539788e-05
5350.00000  5400.00000  1.989404513237e-05
5400.00000  5450.00000  1.627694601739e-05
5450.00000  5500.00000  1.880891539788e-05
5500.00000  5550.00000  1.410668654841e-05
5550.00000  5600.00000  1.844720548638e-05
5600.00000  5650.00000  1.880891539788e-05
5650.00000  5700.00000  1.917062530937e-05
5700.00000  5750.00000  1.953233522087e-05
5750.00000  5800.00000  1.121300725643e-05
5800.00000  5850.00000  1.700036584039e-05
5850.00000  5900.00000  2.387285415884e-05
5900.00000  5950.00000  1.953233522087e-05
5950.00000  6000.00000  1.627694601739e-05
6000.00000  6050.00000  1.338326672541e-05
6050.00000  6100.00000  1.700036584039e-05
6100.00000  6150.00000  1.953233522087e-05
6150.00000  6200.00000  1.736207575189e-05
6200.00000  6250.00000  2.134088477836e-05
6250.00000  6300.00000  3.074534247730e-05
6300.00000  6350.00000  3.544757132677e-05
6350.00000  6400.00000  3.034746157465e-04
6400.00000  6450.00000  1.446839645991e-05
6450.00000  6500.00000  1.229813699092e-05
6500.00000  6550.00000  1.591523610590e-05
6550.00000  6600.00000  2.314943433585e-05
6600.00000  6650.00000  1.483010637140e-05
6650.00000  6700.00000  1.302155681392e-05
6700.00000  6750.00000  1.374497663691e-05
6750.00000  6800.00000  2.025575504387e-05
6800.00000  6850.00000  1.591523610590e-05
6850.00000  6900.00000  1.519181628290e-05
6900.00000  6950.00000  1.989404513237e-05
6950.00000  7000.00000  1.591523610590e-05
7000.00000  7050.00000  1.302155681392e-05
7050.00000  7100.00000  4.268176955672e-05
7100.00000  7150.00000  6.510778406958e-06
7150.00000  7200.00000  8.319327964446e-06
7200.00000  7250.00000  1.012787752193e-05
7250.00000  7300.00000  1.048958743343e-05
7300.00000  7350.00000  7.234198229953e-06
7350.00000  7400.00000  1.121300725643e-05
7400.00000  7450.00000  1.229813699092e-05
7450.00000  7500.00000  2.423456407034e-05
7500.00000  7550.00000  1.012787752193e-05
7550.00000  7600.00000  1.048958743343e-05
7600.00000  7650.00000  1.193642707942e-05
7650.00000  7700.00000  1.012787752193e-05
7700.00000  7750.00000  7.957618052948e-06
7750.00000  7800.00000  1.229813699092e-05
7800.00000  7850.00000  1.193642707942e-05
7850.00000  7900.00000  1.012787752193e-05
7900.00000  7950.00000  1.085129734493e-05
7950.00000  8000.00000  1.157471716792e-05
8000.00000  8050.00000  6.872488318455e-06
8050.00000  8100.00000  7.595908141450e-06
8100.00000  8150.00000  1.121300725643e-05
8150.00000  8200.00000  7.234198229953e-06
8200.00000  8250.00000  1.048958743343e-05
8250.00000  8300.00000  9.042747787441e-06
8300.00000  8350.00000  8.319327964446e-06
8350.00000  8400.00000  9.404457698939e-06
8400.00000  8450.00000  8.681037875943e-06
8450.00000  8500.00000  1.302155681392e-05
8500.00000  8550.00000  6.872488318455e-06
8550.00000  8600.00000  9.042747787441e-06
8600.00000  8650.00000  1.012787752193e-05
8650.00000  8700.00000  9.766167610436e-06
8700.00000  8750.00000  1.229813699092e-05
8750.00000  8800.00000  1.157471716792e-05
8800.00000  8850.00000  7.595908141450e-06
8850.00000  8900.00000  9.042747787441e-06
8900.00000  8950.00000  9.766167610436e-06
8950.00000  9000.00000  6.872488318455e-06
9000.00000  9050.00000  9.404457698939e-06
9050.00000  9100.00000  7.957618052948e-06
9100.00000  9150.00000  7.234198229953e-06
9150.00000  9200.00000  8.681037875943e-06
9200.00000  9250.00000  7.234198229953e-06
9250.00000  9300.00000  1.157471716792e-05
9300.00000  9350.00000  8.319327964446e-06
9350.00000  9400.00000  7.957618052948e-06
9400.00000  9450.00000  7.957618052948e-06
9450.00000  9500.00000  1.048958743343e-05
9500.00000  9550.00000  1.012787752193e-05
9550.00000  9600.00000  1.012787752193e-05
9600.00000  9650.00000  1.012787752193e-05
9650.00000  9700.00000  7.234198229953e-06
9700.00000  9750.00000  9.042747787441e-06
9750.00000  9800.00000  6.510778406958e-06
9800.00000  9850.00000  8.319327964446e-06
9850.00000  9900.00000  1.012787752193e-05
9900.00000  9950.00000  8.319327964446e-06
9950.00000  10000.00000  8.319327964446e-06
