10001.00000  11001.00000  4.218608766169e-04
11001.00000  12001.00000  3.305847935126e-04
12001.00000  13001.00000  2.603014067422e-04
13001.00000  14001.00000  2.142619752028e-04
14001.00000  15001.00000  1.748454784532e-04
15001.00000  16001.00000  1.456242873802e-04
16001.00000  17001.00000  1.238689500704e-04
17001.00000  18001.00000  1.027156977415e-04
18001.00000  19001.00000  8.718190523425e-05
19001.00000  20001.00000  7.558173460225e-05
20001.00000  21001.00000  6.406184196771e-05
21001.00000  22001.00000  5.780015816635e-05
22001.00000  23001.00000  4.800624247706e-05
23001.00000  24001.00000  4.262761664769e-05
24001.00000  25001.00000  3.949677474701e-05
25001.00000  26001.00000  3.283370095839e-05
26001.00000  27001.00000  3.271328396221e-05
27001.00000  28001.00000  2.693326814557e-05
28001.00000  29001.00000  2.432423322834e-05
29001.00000  30001.00000  2.448478922325e-05
30001.00000  31001.00000  1.878505140407e-05
31001.00000  32001.00000  1.713935245627e-05
32001.00000  33001.00000  1.517254151867e-05
33001.00000  34001.00000  1.428948354668e-05
34001.00000  35001.00000  1.400851055560e-05
35001.00000  36001.00000  1.272406259634e-05
36001.00000  37001.00000  1.019530567657e-05
37001.00000  38001.00000  9.553081696939e-06
38001.00000  39001.00000  8.790440721133e-06
39001.00000  40001.00000  7.706687755514e-06
40001.00000  41001.00000  9.071413712220e-06
41001.00000  42001.00000  7.345436766974e-06
42001.00000  43001.00000  6.422239796262e-06
43001.00000  44001.00000  5.619459821729e-06
44001.00000  45001.00000  6.060988807722e-06
45001.00000  46001.00000  4.977235842103e-06
46001.00000  47001.00000  5.017374840829e-06
47001.00000  48001.00000  4.375150861203e-06
48001.00000  49001.00000  3.732926881577e-06
49001.00000  50001.00000  4.335011862477e-06
50001.00000  51001.00000  4.174455867570e-06
51001.00000  52001.00000  2.890007908318e-06
52001.00000  53001.00000  2.970285905771e-06
53001.00000  54001.00000  2.809729910864e-06
54001.00000  55001.00000  2.568895918505e-06
55001.00000  56001.00000  2.328061926145e-06
56001.00000  57001.00000  2.528756919778e-06
57001.00000  58001.00000  1.966810937605e-06
58001.00000  59001.00000  1.766115943972e-06
59001.00000  60001.00000  2.528756919778e-06
60001.00000  61001.00000  2.328061926145e-06
61001.00000  62001.00000  1.525281951612e-06
62001.00000  63001.00000  2.207644929965e-06
63001.00000  64001.00000  1.685837946519e-06
64001.00000  65001.00000  1.204169961799e-06
65001.00000  66001.00000  1.445003954159e-06
66001.00000  67001.00000  1.364725956706e-06
67001.00000  68001.00000  8.027799745327e-07
68001.00000  69001.00000  8.830579719860e-07
69001.00000  70001.00000  1.244308960526e-06
70001.00000  71001.00000  8.830579719860e-07
71001.00000  72001.00000  1.043613966893e-06
72001.00000  73001.00000  1.083752965619e-06
73001.00000  74001.00000  6.422239796262e-07
74001.00000  75001.00000  8.830579719860e-07
75001.00000  76001.00000  8.429189732593e-07
76001.00000  77001.00000  6.422239796262e-07
77001.00000  78001.00000  6.823629783528e-07
78001.00000  79001.00000  4.013899872664e-07
79001.00000  80001.00000  6.020849808995e-07
80001.00000  81001.00000  6.020849808995e-07
81001.00000  82001.00000  5.619459821729e-07
82001.00000  83001.00000  2.809729910864e-07
83001.00000  84001.00000  5.218069834463e-07
84001.00000  85001.00000  5.619459821729e-07
85001.00000  86001.00000  4.013899872664e-07
86001.00000  87001.00000  3.211119898131e-07
87001.00000  88001.00000  2.006949936332e-07
88001.00000  89001.00000  2.408339923598e-07
89001.00000  90001.00000  1.605559949065e-07
90001.00000  91001.00000  2.408339923598e-07
91001.00000  92001.00000  4.816679847196e-07
92001.00000  93001.00000  2.408339923598e-07
93001.00000  94001.00000  1.204169961799e-07
94001.00000  95001.00000  2.809729910864e-07
95001.00000  96001.00000  1.605559949065e-07
96001.00000  97001.00000  2.809729910864e-07
97001.00000  98001.00000  2.809729910864e-07
98001.00000  99001.00000  8.027799745327e-08
99001.00000  100001.00000  1.204169961799e-07
100001.00000  101001.00000  2.408339923598e-07
101001.00000  102001.00000  8.027799745327e-08
102001.00000  103001.00000  1.605559949065e-07
103001.00000  104001.00000  1.605559949065e-07
104001.00000  105001.00000  4.013899872664e-08
105001.00000  106001.00000  2.408339923598e-07
106001.00000  107001.00000  1.204169961799e-07
107001.00000  108001.00000  0.000000000000e+00
108001.00000  109001.00000  1.605559949065e-07
109001.00000  110001.00000  4.013899872664e-08
110001.00000  111001.00000  1.605559949065e-07
111001.00000  112001.00000  0.000000000000e+00
112001.00000  113001.00000  8.027799745327e-08
113001.00000  114001.00000  1.605559949065e-07
114001.00000  115001.00000  8.027799745327e-08
115001.00000  116001.00000  0.000000000000e+00
116001.00000  117001.00000  1.204169961799e-07
117001.00000  118001.00000  1.605559949065e-07
118001.00000  119001.00000  8.027799745327e-08
119001.00000  120001.00000  4.013899872664e-08
120001.00000  121001.00000  1.605559949065e-07
121001.00000  122001.00000  4.013899872664e-08
122001.00000  123001.00000  4.013899872664e-08
123001.00000  124001.00000  0.000000000000e+00
124001.00000  125001.00000  0.000000000000e+00
125001.00000  126001.00000  2.006949936332e-07
126001.00000  127001.00000  1.204169961799e-07
127001.00000  128001.00000  1.204169961799e-07
128001.00000  129001.00000  1.204169961799e-07
129001.00000  130001.00000  0.000000000000e+00
130001.00000  131001.00000  0.000000000000e+00
131001.00000  132001.00000  4.013899872664e-08
132001.00000  133001.00000  8.027799745327e-08
133001.00000  134001.00000  0.000000000000e+00
134001.00000  135001.00000  8.027799745327e-08
135001.00000  136001.00000  1.605559949065e-07
136001.00000  137001.00000  4.013899872664e-08
137001.00000  138001.00000  8.027799745327e-08
138001.00000  139001.00000  0.000000000000e+00
139001.00000  140001.00000  0.000000000000e+00
140001.00000  141001.00000  4.013899872664e-08
141001.00000  142001.00000  0.000000000000e+00
142001.00000  143001.00000  0.000000000000e+00
143001.00000  144001.00000  0.000000000000e+00
144001.00000  145001.00000  4.013899872664e-08
145001.00000  146001.00000  0.000000000000e+00
146001.00000  147001.00000  0.000000000000e+00
147001.00000  148001.00000  0.000000000000e+00
148001.00000  149001.00000  0.000000000000e+00
149001.00000  150001.00000  4.013899872664e-08
150001.00000  151001.00000  0.000000000000e+00
151001.00000  152001.00000  0.000000000000e+00
152001.00000  153001.00000  0.000000000000e+00
153001.00000  154001.00000  0.000000000000e+00
154001.00000  155001.00000  4.013899872664e-08
155001.00000  156001.00000  4.013899872664e-08
156001.00000  157001.00000  4.013899872664e-08
157001.00000  158001.00000  0.000000000000e+00
158001.00000  159001.00000  0.000000000000e+00
159001.00000  160001.00000  4.013899872664e-08
160001.00000  161001.00000  4.013899872664e-08
161001.00000  162001.00000  0.000000000000e+00
162001.00000  163001.00000  4.013899872664e-08
163001.00000  164001.00000  4.013899872664e-08
164001.00000  165001.00000  0.000000000000e+00
165001.00000  166001.00000  0.000000000000e+00
166001.00000  167001.00000  0.000000000000e+00
167001.00000  168001.00000  1.605559949065e-07
168001.00000  169001.00000  4.013899872664e-08
169001.00000  170001.00000  4.013899872664e-08
170001.00000  171001.00000  0.000000000000e+00
171001.00000  172001.00000  0.000000000000e+00
172001.00000  173001.00000  0.000000000000e+00
173001.00000  174001.00000  0.000000000000e+00
174001.00000  175001.00000  0.000000000000e+00
175001.00000  176001.00000  4.013899872664e-08
176001.00000  177001.00000  0.000000000000e+00
177001.00000  178001.00000  4.013899872664e-08
178001.00000  179001.00000  0.000000000000e+00
179001.00000  180001.00000  4.013899872664e-08
180001.00000  181001.00000  0.000000000000e+00
181001.00000  182001.00000  0.000000000000e+00
182001.00000  183001.00000  0.000000000000e+00
183001.00000  184001.00000  0.000000000000e+00
184001.00000  185001.00000  0.000000000000e+00
185001.00000  186001.00000  0.000000000000e+00
186001.00000  187001.00000  0.000000000000e+00
187001.00000  188001.00000  0.000000000000e+00
188001.00000  189001.00000  0.000000000000e+00
189001.00000  190001.00000  0.000000000000e+00
190001.00000  191001.00000  0.000000000000e+00
191001.00000  192001.00000  0.000000000000e+00
192001.00000  193001.00000  0.000000000000e+00
193001.00000  194001.00000  0.000000000000e+00
194001.00000  195001.00000  0.000000000000e+00
195001.00000  196001.00000  0.000000000000e+00
196001.00000  197001.00000  0.000000000000e+00
197001.00000  198001.00000  0.000000000000e+00
198001.00000  199001.00000  0.000000000000e+00
