10001.00000  11001.00000  4.081291508467e-05
11001.00000  12001.00000  3.295331003998e-05
12001.00000  13001.00000  2.639472805257e-05
13001.00000  14001.00000  2.035299084135e-05
14001.00000  15001.00000  1.623605486556e-05
15001.00000  16001.00000  1.366965321831e-05
16001.00000  17001.00000  1.108542933741e-05
17001.00000  18001.00000  9.980450850399e-06
18001.00000  19001.00000  8.287338652564e-06
19001.00000  20001.00000  7.414049203154e-06
20001.00000  21001.00000  5.916981575594e-06
21001.00000  22001.00000  5.738759238980e-06
22001.00000  23001.00000  5.168447761814e-06
23001.00000  24001.00000  4.491202882680e-06
24001.00000  25001.00000  3.992180340160e-06
25001.00000  26001.00000  3.421868862994e-06
26001.00000  27001.00000  3.172357591734e-06
27001.00000  28001.00000  2.744623983860e-06
28001.00000  29001.00000  3.261468760041e-06
29001.00000  30001.00000  2.281245908663e-06
30001.00000  31001.00000  1.817867833466e-06
31001.00000  32001.00000  2.316890375986e-06
32001.00000  33001.00000  2.013912403741e-06
33001.00000  34001.00000  2.031734637403e-06
34001.00000  35001.00000  1.924801235434e-06
35001.00000  36001.00000  1.532712094883e-06
36001.00000  37001.00000  1.639645496851e-06
37001.00000  38001.00000  1.301023057284e-06
38001.00000  39001.00000  1.479245393898e-06
39001.00000  40001.00000  1.176267421654e-06
40001.00000  41001.00000  1.301023057284e-06
41001.00000  42001.00000  1.033689552363e-06
42001.00000  43001.00000  1.122800720670e-06
43001.00000  44001.00000  9.267561503942e-07
44001.00000  45001.00000  7.841782811028e-07
45001.00000  46001.00000  9.445783840556e-07
46001.00000  47001.00000  7.663560474414e-07
47001.00000  48001.00000  7.128893464571e-07
48001.00000  49001.00000  7.128893464571e-07
49001.00000  50001.00000  6.772448791342e-07
50001.00000  51001.00000  5.346670098428e-07
51001.00000  52001.00000  5.881337108271e-07
52001.00000  53001.00000  6.059559444885e-07
53001.00000  54001.00000  5.524892435042e-07
54001.00000  55001.00000  4.812003088585e-07
55001.00000  56001.00000  5.168447761814e-07
56001.00000  57001.00000  4.633780751971e-07
57001.00000  58001.00000  4.990225425200e-07
58001.00000  59001.00000  4.455558415357e-07
59001.00000  60001.00000  4.812003088585e-07
60001.00000  61001.00000  5.346670098428e-07
61001.00000  62001.00000  4.455558415357e-07
62001.00000  63001.00000  2.495112712600e-07
63001.00000  64001.00000  3.029779722443e-07
64001.00000  65001.00000  3.029779722443e-07
65001.00000  66001.00000  3.386224395671e-07
66001.00000  67001.00000  2.138668039371e-07
67001.00000  68001.00000  2.673335049214e-07
68001.00000  69001.00000  4.277336078743e-07
69001.00000  70001.00000  3.029779722443e-07
70001.00000  71001.00000  3.029779722443e-07
71001.00000  72001.00000  1.604001029528e-07
72001.00000  73001.00000  2.495112712600e-07
73001.00000  74001.00000  2.495112712600e-07
74001.00000  75001.00000  1.604001029528e-07
75001.00000  76001.00000  1.425778692914e-07
76001.00000  77001.00000  2.495112712600e-07
77001.00000  78001.00000  1.604001029528e-07
78001.00000  79001.00000  1.782223366143e-07
79001.00000  80001.00000  2.673335049214e-07
80001.00000  81001.00000  1.604001029528e-07
81001.00000  82001.00000  1.247556356300e-07
82001.00000  83001.00000  1.960445702757e-07
83001.00000  84001.00000  1.604001029528e-07
84001.00000  85001.00000  1.782223366143e-07
85001.00000  86001.00000  1.604001029528e-07
86001.00000  87001.00000  1.425778692914e-07
87001.00000  88001.00000  1.960445702757e-07
88001.00000  89001.00000  1.425778692914e-07
89001.00000  90001.00000  1.782223366143e-07
90001.00000  91001.00000  1.425778692914e-07
91001.00000  92001.00000  8.911116830714e-08
92001.00000  93001.00000  1.604001029528e-07
93001.00000  94001.00000  1.425778692914e-07
94001.00000  95001.00000  1.069334019686e-07
95001.00000  96001.00000  1.247556356300e-07
96001.00000  97001.00000  1.782223366143e-07
97001.00000  98001.00000  1.247556356300e-07
98001.00000  99001.00000  1.069334019686e-07
99001.00000  100001.00000  8.911116830714e-08
100001.00000  101001.00000  5.346670098428e-08
101001.00000  102001.00000  8.911116830714e-08
102001.00000  103001.00000  5.346670098428e-08
103001.00000  104001.00000  8.911116830714e-08
104001.00000  105001.00000  3.564446732285e-08
105001.00000  106001.00000  8.911116830714e-08
106001.00000  107001.00000  0.000000000000e+00
107001.00000  108001.00000  1.782223366143e-07
108001.00000  109001.00000  3.564446732285e-08
109001.00000  110001.00000  3.564446732285e-08
110001.00000  111001.00000  5.346670098428e-08
111001.00000  112001.00000  8.911116830714e-08
112001.00000  113001.00000  3.564446732285e-08
113001.00000  114001.00000  3.564446732285e-08
114001.00000  115001.00000  8.911116830714e-08
115001.00000  116001.00000  5.346670098428e-08
116001.00000  117001.00000  1.782223366143e-08
117001.00000  118001.00000  8.911116830714e-08
118001.00000  119001.00000  7.128893464571e-08
119001.00000  120001.00000  3.564446732285e-08
120001.00000  121001.00000  1.782223366143e-08
121001.00000  122001.00000  5.346670098428e-08
122001.00000  123001.00000  1.782223366143e-08
123001.00000  124001.00000  3.564446732285e-08
124001.00000  125001.00000  5.346670098428e-08
125001.00000  126001.00000  5.346670098428e-08
126001.00000  127001.00000  3.564446732285e-08
127001.00000  128001.00000  1.782223366143e-08
128001.00000  129001.00000  8.911116830714e-08
129001.00000  130001.00000  5.346670098428e-08
130001.00000  131001.00000  8.911116830714e-08
131001.00000  132001.00000  1.782223366143e-08
132001.00000  133001.00000  1.782223366143e-08
133001.00000  134001.00000  3.564446732285e-08
134001.00000  135001.00000  1.782223366143e-08
135001.00000  136001.00000  5.346670098428e-08
136001.00000  137001.00000  3.564446732285e-08
137001.00000  138001.00000  0.000000000000e+00
138001.00000  139001.00000  1.782223366143e-08
139001.00000  140001.00000  7.128893464571e-08
140001.00000  141001.00000  3.564446732285e-08
141001.00000  142001.00000  1.782223366143e-08
142001.00000  143001.00000  3.564446732285e-08
143001.00000  144001.00000  3.564446732285e-08
144001.00000  145001.00000  1.782223366143e-08
145001.00000  146001.00000  3.564446732285e-08
146001.00000  147001.00000  3.564446732285e-08
147001.00000  148001.00000  5.346670098428e-08
148001.00000  149001.00000  3.564446732285e-08
149001.00000  150001.00000  1.782223366143e-08
150001.00000  151001.00000  0.000000000000e+00
151001.00000  152001.00000  0.000000000000e+00
152001.00000  153001.00000  1.782223366143e-08
153001.00000  154001.00000  3.564446732285e-08
154001.00000  155001.00000  0.000000000000e+00
155001.00000  156001.00000  5.346670098428e-08
156001.00000  157001.00000  1.782223366143e-08
157001.00000  158001.00000  0.000000000000e+00
158001.00000  159001.00000  3.564446732285e-08
159001.00000  160001.00000  0.000000000000e+00
160001.00000  161001.00000  1.782223366143e-08
161001.00000  162001.00000  3.564446732285e-08
162001.00000  163001.00000  1.782223366143e-08
163001.00000  164001.00000  5.346670098428e-08
164001.00000  165001.00000  0.000000000000e+00
165001.00000  166001.00000  3.564446732285e-08
166001.00000  167001.00000  0.000000000000e+00
167001.00000  168001.00000  0.000000000000e+00
168001.00000  169001.00000  0.000000000000e+00
169001.00000  170001.00000  0.000000000000e+00
170001.00000  171001.00000  3.564446732285e-08
171001.00000  172001.00000  0.000000000000e+00
172001.00000  173001.00000  0.000000000000e+00
173001.00000  174001.00000  1.782223366143e-08
174001.00000  175001.00000  1.782223366143e-08
175001.00000  176001.00000  0.000000000000e+00
176001.00000  177001.00000  1.782223366143e-08
177001.00000  178001.00000  1.782223366143e-08
178001.00000  179001.00000  0.000000000000e+00
179001.00000  180001.00000  0.000000000000e+00
180001.00000  181001.00000  0.000000000000e+00
181001.00000  182001.00000  0.000000000000e+00
182001.00000  183001.00000  0.000000000000e+00
183001.00000  184001.00000  1.782223366143e-08
184001.00000  185001.00000  0.000000000000e+00
185001.00000  186001.00000  0.000000000000e+00
186001.00000  187001.00000  0.000000000000e+00
187001.00000  188001.00000  0.000000000000e+00
188001.00000  189001.00000  0.000000000000e+00
189001.00000  190001.00000  0.000000000000e+00
190001.00000  191001.00000  0.000000000000e+00
191001.00000  192001.00000  0.000000000000e+00
192001.00000  193001.00000  0.000000000000e+00
193001.00000  194001.00000  0.000000000000e+00
194001.00000  195001.00000  1.782223366143e-08
195001.00000  196001.00000  0.000000000000e+00
196001.00000  197001.00000  0.000000000000e+00
197001.00000  198001.00000  1.782223366143e-08
198001.00000  199001.00000  0.000000000000e+00
